##TITLE=1H_Pr T-142-Et
 CDCl3
 8 sc, 
 6.12.2021
##JCAMPDX= 6.0         $$ Bruker NMR JCAMP-DX V2.0
##DATA TYPE= NMR FID
##DATA CLASS= NTUPLES
##ORIGIN= UXNMR, Bruker Analytische Messtechnik GmbH
##OWNER= root
$$ XWIN-NMR		Version 3.5
$$ Mon Dec  6 11:12:09 2021 Russian Standard Time (UT+4h)  she@DPX200
##.OBSERVE FREQUENCY= 200.131346
##.OBSERVE NUCLEUS= ^1H
##.DELAY= (6, 6)
##.ACQUISITION MODE= SIMULTANEOUS
##.ACQUISITION SCHEME= undefined
##.AVERAGES= 8
##.DIGITISER RES= 18
##SPECTROMETER/DATA SYSTEM= spect
##.PULSE SEQUENCE= zg30
##.SOLVENT NAME= D2O
##.SHIFT REFERENCE= (INTERNAL, D2O, 0, 15.7039)
##AUDIT TRAIL= $$ (NUMBER, WHEN, WHO, WHERE, WHAT)
$$ ##TITLE= Audit trail, XWIN-NMR		Version 3.5
$$ ##JCAMPDX= 5.01
$$ ##ORIGIN= Bruker BioSpin GmbH
$$ ##OWNER= she
$$ F:/spectra/data/she/nmr/H-F/1/audita.txt
$$ ##AUDIT TRAIL=  $$ (NUMBER, WHEN, WHO, WHERE, WHAT)
(   1,<2021-12-06 11:11:11.50 +0400>,<she>,<DPX200>,
      <created by zg, POWCHK disabled, PULCHK disabled
       configuration hash MD5:
       00 E9 B6 7A A2 85 ED C7 34 08 36 98 17 FE 4E 26
       data hash MD5: 16K
       EF 74 F6 2D 1C 51 78 23 E1 3E 18 26 14 09 DE 0C>)
$$ ##END=
$$ 
$$ hash MD5
$$ A9 2F 87 EC 83 9E D1 83 E5 2E D4 7D 1F 55 03 E6
##$RELAX= 
##$RELAX= 
##$RELAX= 
##$RELAX= 
##$RELAX= 
##$RELAX= 
$$ Bruker specific parameters
$$ --------------------------
##$DU= <F:/spectra>
##$EXPNO= 1
##$NAME= <H-F>
##$PROCNO= 1
##$TYPE= <nmr>
##$USER= <she>
##$AMP= (0..31)
100 100 100 100 100 100 100 100 100 100 100 100 100 100 100 100 100 100 
100 100 100 100 100 100 100 100 100 100 100 100 100 100 
##$AQSEQ= 0
##$AQ_mod= 1
##$AUNM= <au_zg>
##$AUTOPOS= <>
##$BF1= 200.13
##$BF2= 200.13
##$BF3= 200.13
##$BF4= 200.13
##$BF5= 200.13
##$BF6= 200.13
##$BF7= 200.13
##$BF8= 200.13
##$BYTORDA= 1
##$CFDGTYP= 0
##$CFRGTYP= 5
##$CHEMSTR= <none>
##$CNST= (0..31)
1 1 145 1 1 1 1 1 1 1 1 1 1 1 1 1 1 1 1 1 1 1 1 1 1 1 1 1 1 1 1 1 
##$CPDPRG= <>
##$CPDPRG1= <>
##$CPDPRG2= <>
##$CPDPRG3= <>
##$CPDPRG4= <mlev>
##$CPDPRG5= <mlev>
##$CPDPRG6= <mlev>
##$CPDPRG7= <mlev>
##$CPDPRG8= <mlev>
##$CPDPRGB= <>
##$CPDPRGT= <>
##$D= (0..31)
0 1.2 0 0 0 0 0 0 0 0.06 0 0.03 0 0 0 0 0.0002 0 0 0 0 0 0 0 0 0 0 0 0 
0 0 0 
##$DATE= 1638774670
##$DBL= (0..7)
120 120 120 120 120 120 120 120 
##$DBP= (0..7)
150 150 150 150 150 150 150 150 
##$DBP07= 0
##$DBPNAM0= <>
##$DBPNAM1= <>
##$DBPNAM2= <>
##$DBPNAM3= <>
##$DBPNAM4= <>
##$DBPNAM5= <>
##$DBPNAM6= <>
##$DBPNAM7= <>
##$DBPOAL= (0..7)
0.5 0.5 0.5 0.5 0.5 0.5 0.5 0.5 
##$DBPOFFS= (0..7)
0 0 0 0 0 0 0 0 
##$DE= 6
##$DECBNUC= <off>
##$DECIM= 32
##$DECNUC= <off>
##$DECSTAT= 4
##$DIGMOD= 1
##$DIGTYP= 9
##$DL= (0..7)
0 120 120 120 120 120 120 120 
##$DP= (0..7)
150 150 150 150 150 150 150 150 
##$DP07= 0
##$DPNAME0= <>
##$DPNAME1= <>
##$DPNAME2= <>
##$DPNAME3= <>
##$DPNAME4= <>
##$DPNAME5= <>
##$DPNAME6= <>
##$DPNAME7= <>
##$DPOAL= (0..7)
0.5 0.5 0.5 0.5 0.5 0.5 0.5 0.5 
##$DPOFFS= (0..7)
0 0 0 0 0 0 0 0 
##$DQDMODE= 0
##$DR= 18
##$DS= 0
##$DSLIST= <SSSSSSSSSSSSSSS>
$$ [...]
##$SUBNAM2= <"">
##$SUBNAM3= <"">
##$SUBNAM4= <"">
##$SUBNAM5= <"">
##$SUBNAM6= <"">
##$SUBNAM7= <"">
##$SUBNAM8= <"">
##$SUBNAM9= <"">
##$SW= 18.0517287032376
##$SWIBOX= (0..15)
0 0 2 0 0 0 0 0 0 0 0 0 0 0 0 0 
##$SW_h= 3612.71676300578
##$TD= 16384
##$TD0= 1
##$TE= 0
##$TE2= 300
##$TE3= 300
##$TEG= 300
##$TL= (0..7)
0 120 120 120 120 120 120 120 
##$TP= (0..7)
150 150 150 150 150 150 150 150 
##$TP07= 0
##$TPNAME0= <>
##$TPNAME1= <>
##$TPNAME2= <>
##$TPNAME3= <>
##$TPNAME4= <>
##$TPNAME5= <>
##$TPNAME6= <>
##$TPNAME7= <>
##$TPOAL= (0..7)
0.5 0.5 0.5 0.5 0.5 0.5 0.5 0.5 
##$TPOFFS= (0..7)
0 0 0 0 0 0 0 0 
##$TUNHIN= 0
##$TUNHOUT= 0
##$TUNXOUT= 0
##$USERA1= <user>
##$USERA2= <user>
##$USERA3= <user>
##$USERA4= <user>
##$USERA5= <user>
##$V9= 5
##$VALIST= <valist>
##$VCLIST= <CCCCCCCCCCCCCCC>
##$VD= 0
##$VDLIST= <DDDDDDDDDDDDDDD>
##$VPLIST= <PPPPPPPPPPPPPPP>
##$VTLIST= <TTTTTTTTTTTTTTT>
##$WBST= 1024
##$WBSW= 4
##$XGAIN= (0..3)
0 0 0 0 
##$XL= 0
##$YL= 0
##$YMAX_a= 126778
##$YMIN_a= -171520
##$ZGOPTNS= <>
##$ZL1= 120
##$ZL2= 120
##$ZL3= 120
##$ZL4= 120
##$ABSF1= 10
##$ABSF2= 0
##$ABSG= 5
##$ABSL= 3
##$ALPHA= 0
##$AQORDER= 0
##$ASSFAC= 0
##$ASSFACI= 0
##$ASSFACX= 0
##$ASSWID= 0
##$AUNMP= <proc_1d>
##$AZFE= 0.1
##$AZFW= 0.1
##$BCFW= 1
##$BC_mod= 2
##$BYTORDP= 1
##$COROFFS= 0
##$CY= 11.3945322036743
##$DATMOD= 1
##$DC= 2
##$DFILT= <>
##$DTYPP= 0
##$F1P= 2.36226072786647
##$F2P= -0.459571619588291
##$FCOR= 0.5
##$FTSIZE= 0
##$FT_mod= 4
##$GAMMA= 1
##$GB= 0.15
##$INTBC= 1
##$INTSCL= 1
##$ISEN= 128
##$LB= 0.24
##$LEV0= 0
##$LPBIN= 0
##$MAXI= 10000
##$MC2= 0
##$MEAN= 0
##$ME_mod= 0
##$MI= 1.114404
##$NCOEF= 0
##$NC_proc= 0
##$NLEV= 6
##$NOISF1= 3.799351
##$NOISF2= 2.8
##$NSP= 1
##$NTH_PI= 0
##$NZP= 0
##$OFFSET= 15.70392
##$PC= 1
##$PHC0= -15511.01
##$PHC1= 10.60081
##$PH_mod= 1
##$PKNL= yes
##$PPARMOD= 0
##$PSCAL= 0
##$PSIGN= 0
##$REVERSE= no
##$SF= 200.130013532006
##$SI= 16384
##$SIGF1= 3
##$SIGF2= 2
##$SINO= 400
##$SIOLD= 16384
##$SREGLST= <1H.CDCl3>
##$SSB= 0
##$STSI= 0
##$STSR= 0
##$SW_p= 3612.71676300578
##$SYMM= 0
##$S_DEV= 0
##$TDeff= 0
##$TDoff= 0
##$TI= <>
##$TILT= no
##$TM1= 0
##$TM2= 0
##$TOPLEV= 0
##$USERP1= <user>
##$USERP2= <user>
##$USERP3= <user>
##$USERP4= <user>
##$USERP5= <user>
##$WDW= 1
##$XDIM= 8192
##$YMAX_p= 0
##$YMIN_p= 0
$$ End of Bruker specific parameters
$$ ---------------------------------
##NTUPLES= NMR FID
##VAR_NAME=  TIME,          FID/REAL,        FID/IMAG
##SYMBOL=    X,             R,               I
##VAR_TYPE=  INDEPENDENT,   DEPENDENT,       DEPENDENT
##VAR_FORM=  AFFN,          ASDF,            ASDF
##VAR_DIM=   8192,          8192,            8192
##UNITS=     SECONDS,       ARBITRARY UNITS, ARBITRARY UNITS
##FACTOR=    0.0002768,     1,               1
##FIRST=     0,             0,               0
##LAST=      2.2672688,     0,               0
##MIN=       0,             -171520,         0
##MAX=       2.2672688,     126778,          0
$$ Real data points
##PAGE= N=1
##DATA TABLE= (X++(R..R)), XYDATA
$$ [...]
1738h76Q72J034j684K56J336j032j022J851l43j403J410J03r79L25R41q89n05
1755f05J503m46j079J153K74j272M15J090j237l18J363q44j017J403K4j111N30
1772a74P85j312M7J364r51m96J109j32j004O57L27r50N3J356j061j16R63j30r24
1791e89J050M65j387M22R73q95k22J106o64o31P16J29p92M32K41p85O0Q47p00
1810b24l04P74j96l96L40K40o88K15M82l60j74O91k29n03N42R7o21L34J94l29
1830a15k96O12k10m51O16R6p38L95L45n11Q0N52k10n86O62k97K8K69J40l69j34
1851a22N85m42M6O13l80m03J86L7j55j33M30l92L6K3j75k68O23k23l66M56L7l61
1873c48J4N11l89N0K32k2j19J10Q0k89L16M63m40j49J7M05k12n1K05l23P3q8Q0
$$ y = [-876, -4, 1030, -654, -398, 938, -94, -1116, 735, 392, -1011, 399, 502, -477, -152, 789, -100, -605, 898, 452, -627, 526, 800, -472, -57, 1033, -204, -522, 841, -3, -1020, 383, 407, -704, -174, 611, -701, -654, 710, -241, -737, 372, 240, -764, -107, 220, -730, -677, 679, -382, -498, 465, 335, -589, 461, 926, -461, -39, 934, 39, -183, 923, 259, -372, 344, 473, -319, 113, 354, -431, -371, 476, -224, -528, 246, 50, -346, -6, 234, -454, -239, 243, -117, -291, 400, 171, -332, 210, 307, -314, 20, 214, -115, -411, 201, -9, -460, 156, 252, -486, -91, 254, -257, -177, 375, 165, -421, 241, -56, -28, 241, 381, 12, -122, 463, 21, 67, 680, 300, -103, 83, 120, -35, -168, 262, -130, -94, -71, -246, -514, 109, -114, -480, -24, 13, -348, -334, 177, -212, -162, 70, 48, -71, 39, 119, -170, 146, 609, 169, 20, 37, 442, 230, 179, 384, 61, 134, 46, 126]
1896A26j91L6K22j54J9J02k18k62M34j9j21j58k27O7L05p8r3K32j28J0J82j14
1918b8J49j15m22L71K50k50j99J35K21k71J25l0L7k72J27K4j58K33J09j04K1L53
1940C06k67J30K38k84k3L24j25k32L74R5o63M71p9m30K21K02l25k25K91j37l7
1961a75K13J8l15J53L13m29j34L89k61p6L28Kj44J0K17l7p5R6M1j11K32M1l17
1984b1K64J84p19O38J54k41l12K96k82q3M07q2o68J93P59q36KM29j15k29L95L0
2006A63o31M50K22p20L90L97l43m7K95p8m36L88J04j49l82N83k42j49M31k01n62
2027e17O20j1m50R8N33m02j18O00j94n02M41M05m79k73Q20n60K5M45l35m39M39
2048A46K56o94O47m6k65l82O18l66m02O33l63k45L89K16o17J11N88k95k78K52
$$ y = [126, -65, -29, 193, 39, 58, 160, -58, -320, 114, 95, -26, -184, -411, -344, -39, -117, -210, 22, -106, -96, 86, -28, 121, 6, -416, -45, 205, -45, -244, -109, 112, -159, -34, -64, -27, -299, -172, -148, -306, -73, 36, -68, -47, 306, 39, 169, 407, 123, 100, 424, 299, 67, 441, 536, -127, 344, 265, -165, 56, 258, -67, -292, -1, -138, -175, 38, 56, -259, -106, 207, -222, -356, 33, -228, -304, 24, 26, -118, -108, 109, 72, -3, 93, 134, 23, 255, 296, -21, 243, 427, -292, 346, 500, 259, -53, 243, -39, -122, 285, 203, -465, -272, 487, -349, -347, 82, -33, -262, 133, 163, -468, -18, 204, -516, -126, 271, -72, -119, 176, 98, -338, 50, 154, 5, -377, 206, -36, -185, 246, 45, -517, 103, 92, -358, -260, 273, -129, -247, 353, 159, -343, 98, 503, 24, -249, 571, 11, 36, 481, 146, -293, 146, 402, -292, 355, 309, 44, -338, 280, -86, -488, 145, -218, -463, -74, 142, -475, -364, 224, -71, -349, -97]
2068i7k20k27R07j42l37p4M80l87J33L16j91n25O77j9n03K63L99o15j22M50j16
2089E0l12N16k5n66M80%j95j7N89r17Q3O84m01l23N02K80o01K26K53n87J58K64
2111A41j71j40P7K63o38J88N79n57q9N85l40k33N15l0n56O77j67k72Q4L77j06
2132A87l02N90k32j76K31K45o53K33J48m15K5N58n33k51O16k42o26M35L99o74
2152d37K31M38l57oJ73J3n24M87J10l04K1M33k09pM48n26l68K54L30l05J82K46
2174C23m12j2M06l17j27L61rn70M28J47l11R8J75l30Q5l0K24k62K34O9m15L12
2196F7K02k67l80N22J8j19K00p0m33J34M40l13j39L83j84m81O47j86l5nMj69j28
2219b92J76K02k29K87K31o22M18K21m62J69J02j83p5L63j68R2k34L46l41J00J71
$$ y = [-97, -317, -544, 363, 221, -116, -190, 290, -97, 36, 352, 161, -364, 313, 294, -209, 54, 453, -162, -284, 166, 50, -262, 254, 229, -337, 143, 143, -52, -69, 520, -397, -314, 370, -31, -354, 148, 428, -173, 53, 306, -281, -123, 141, -30, -170, -93, 170, -468, -280, 299, -258, -347, 238, -102, -335, 180, 150, -406, 271, 104, -168, -84, 293, 187, -115, 475, 243, 67, 298, 543, -110, 123, 271, -144, -119, 439, -94, -345, 271, 29, -597, -162, 237, -437, -206, 232, -125, -131, 42, 55, -469, 18, 128, -176, -155, 278, 69, 62, 510, -16, -384, -130, 200, -105, 77, 323, -89, -101, 305, -12, -139, 222, 213, -357, 71, 218, -93, 5, 180, -150, -65, -95, 129, -133, 101, 170, -245, 67, 269, 2, -378, 144, 162, 43, 243, 173, -260, -126, 314, 1, -138, 245, 61, -420, 227, 41, 6, 1, 5, -164, -292, -116, 86, -143, 144, 375, -247, 171, 392, -70, 99, 201, 18, -57, 306, 138, 230, -4, 342, 1, 101, 272]
2240B72l33L4J15j10p1K06k80r6j18M47l82J73J28j55K0J64q4K59o6L4l56M1N31
2263C73l77o6Q2J66k72M6K97l04K14l31K58L8j82Jj13L44k93QK15J64l86K9K04
2286A15j41k1J61j29m2K85j75j98L99om69K61j57k4j55L06O1j63J23j21r6J50
2308c6j06k8K5K68l66R1J59K17j3k77J87o9J4q7K62J5k17P7m8OJ40j39om2K4j35
2334h4L34k38j30L65m09J58jJ12J09j47M1l80J45p0J50j62L66j64K4p0j92L01
2356E8r0J05K33l28K83l05M9K7Q8l23J48K0k34M8J78k46J04K26j04o3k97M47k25
2379b01K25J03o7j33oK23N2r8K9n1O3q9J96k62n1M2k2J34k35J8J36J19j16p6l1
2404i8L7j39L67q8l38L75k87K53O4Q6j5J89j69l24Q8K87k06O5J48j70R5m00K00
$$ y = [272, -61, -27, 88, -22, -93, 113, -167, -263, -381, 66, -316, -143, -15, -170, -150, 14, -70, 189, 123, 157, -199, -158, 373, -4, -70, 12, 178, -94, -48, 249, -55, 159, -172, 86, 124, -58, -57, -170, 174, -119, -111, 104, 268, -118, -89, 115, -26, -47, 114, -15, -57, 228, 53, -145, 254, 248, -221, 40, -117, -141, -296, 10, 71, -92, 31, -90, -186, -36, -142, -170, -145, 123, -243, -152, 7, 224, 211, -66, 121, 52, 66, -21, 241, 256, 39, 116, 68, 74, 214, 75, 69, 27, 51, -84, 250, 12, -118, 247, -162, -4, -5, 107, 216, 69, 110, -270, -125, -195, -45, -207, 159, -5, 19, -51, -243, 58, -32, 73, 306, -22, 261, -44, 5, 32, 120, -203, -55, -35, -269, -221, -43, -289, -185, 41, -63, -126, -423, 24, -201, 24, 127, 60, -73, -79, 144, 196, 98, 127, 76, 139, 50, 246, -16, -67, -25, -47, 87, -148, -130, 6, 125, 9, -67, -98, -61, -200, 167, 79, -259, 116, -171, 82, 146, 232, 217, 406, 237, -87, 1, 288, 82, 147, 295, 125, 220, -180, 20]
2427B0j1l3K61m45K76O2l85KJ98P4J6j02J55K7k20K8oK7pJ36j51k5K45j11J38
2452A69j7J7o8n7K6j0j76j40J66j55K61l1%M1m1k8l4K79k37N2J43j22n8J14M9
2477A43j77PJ63j56l1N22k90k86o1J27K50j77M0r0L0k79K67p5l4J20r7N3j28K4
2501a35Q3l0J26p4p0K69k86K76n0k14L89L9k78j79L25j15n3n2L6j43J98j10r0
2524a38J28J40j38Q1p4k10K75k88K69p6N4j09R0k97K84o0J2J06m4kp1o7J16J82
2548A63rj68k29P0J19j12n8N74k26l19K83Q6j11k29m2l5J99P4L2l05M20Or9n6
2572B8Lm0J73L3l91K50K1J1l83L15q1j48J21Q0q0j68K79Mk05J32J73m49L39K59
2596B76k61j12Q5j27j46N74k15m68N38j73K60K31j15l06R1J4M6n7j39J09n9j60
$$ y = [20, 9, -24, 237, -208, 68, 130, -255, -253, -55, 19, 35, -67, 88, 115, -105, -77, -83, -56, -63, 73, -78, -103, 142, 31, 169, 152, 169, 101, 44, 70, 60, -116, -256, -90, -245, 16, -15, -15, 26, -15, -43, -77, 202, -35, 17, 160, 38, -20, 94, 143, -34, -27, 136, -20, -51, 471, 181, -105, -166, -39, 211, 34, 74, -16, 14, -265, 2, -73, -107, 13, -84, -31, -159, -135, -52, -82, 44, -30, -100, 169, -117, 159, 109, -105, 284, 323, 45, -134, 191, 76, 23, -29, 7, -136, 62, -48, -138, -10, 130, -8, 73, -1, -211, 64, -224, 45, -31, 23, -86, 4, -293, -9, -69, -57, 49, 5, 3, -68, -135, -19, 163, 154, -14, -243, -173, -54, -166, -224, 350, 124, -195, 88, 174, 63, -166, -208, -243, -44, 30, 62, -243, 177, 183, 84, 28, 31, -9, 164, 197, -194, 56, 77, 88, -295, 20, -61, -209, -88, -8, -88, -256, 23, 27, -178, -46, 127, -322, 17, 276, 15, -97, -12, -139, -285, 289, 74, -394, 144, -29, 231, 462, 347, 41, 132, 146, 192, 135, -4, 105, 46, -114]
2618a14K90m40O0J74j33qK09j79k93K66J67n4q4K96l99J18Q6J97k97K06j23j51
2640b06K65R8P3j96m5J01l16K91p0l61Q8M32k97J82l16M01k55L24j8l44K80K01
2662C12m14j3Q8K85l78k5L14m06M50Kk63j3K98l05j06L08J5k68j27M32k68j63
2684b45K17L3p3l9L57m01K08J95l47k8M31l67m4K07k42J17Q9J46j42K5J77l22
2706d8JL83k01l61K89K76o16K44r6j14J64J41o1j57J41J52l79J01K55J52l76K30
2728A20q2j06L01k19o0J20J06j95j27M09k17k88L14j21n4j23J99r0J68K5j71j54
2750b45K24p0%J13L99m27Q3K5l2k56L23J5m77L46L1k44M56M1l51n9L72j74k47
2773a54L50r5k14K36q3J29l11O5l8Q4J15l1k98L61j30Q2j01K56l31K74J15k51
$$ y = [-114, 176, -264, -204, -30, -163, -171, 38, -141, -434, -168, -1, -55, -139, 157, -242, -124, -38, 159, -138, 68, -55, -206, 59, 157, 230, 34, -11, 90, -226, 65, -5, -366, -278, 154, -143, 39, -277, 124, -131, 193, 175, -169, 111, 312, -102, -115, -27, 258, -120, -145, 169, -237, 213, 215, -48, -61, 237, -68, -174, 134, 149, -119, -246, 186, -82, -245, -28, 5, -68, -107, 250, -151, 57, 252, -95, -123, 308, -59, -103, 104, -138, -21, 68, 214, 72, 97, 274, -48, -47, 336, 135, -226, 63, 339, -277, -33, -129, -243, -79, 62, 1, -156, -15, 137, -242, -141, 114, 266, -110, 120, 38, -68, 233, 14, -46, 74, 180, -15, -142, 267, 50, -238, 76, -45, -99, -222, -23, -113, 55, 80, -91, -245, -21, -91, -91, 22, 421, -6, 77, 102, 70, -186, 137, 152, -325, 21, 52, -192, 264, 305, -46, -105, 267, 93, -154, 196, 101, -113, 123, 40, 169, -142, -77, -115, -31, 84, 53, -245, 116, -14, 68, -33, 223, -108, 166, 281, 30]
2795C0J60r6R5k3o1l1Ml9J12j85k42K59K87m63K48j01q6J16L14j59j69J63r3l56
2819c16K87J65l71J78J18j87J04K44j91k36J81J16j02m2K17k59J82M5k02m6r4
2840b09K32j19p3J92j43K15n8J78k21Q3k49K39R9j9l02P3M03k95J50j10j51J52
2862F7N9N1k9r2k38K19k88J78J66r2J55j48j0J47k33O7j14kJ54l31N20l49P4l7
2886a06J6J62nK3k72Q1K4N5o2J51j37JK25j53J9r2Q7l2L7K7k41M5oK24r5J35l04
2913a93K70j89K20L3l85K82j56J55j1J06K0J11l67J50n3j09j0J52l5K49k41n7
2935e8n2K5K5M2J2r8O0R0O1j03j89M10k18j10K57q6L4l0J18N3j77J2r7J20K57
2960C58m84K72j07m27J56J31p5J62J96l30K42Pq4L5j62K61k41NR6J59j96K04q3
$$ y = [30, 190, 94, 189, 166, 105, 74, 78, 39, 151, -34, -276, -17, 270, -193, 55, -46, -132, -16, 298, 139, -30, 133, 40, -316, -29, 136, -235, -57, 61, -126, -22, 222, 31, -205, -24, 92, -10, -52, 165, -94, 88, 133, -69, -115, -209, 23, -96, -169, 23, -120, 95, 37, 215, -6, 77, -172, 67, 166, 147, -155, -82, 321, 26, 176, 66, -85, 67, 126, 177, 148, 56, -182, 37, -251, -73, 93, 1, 156, 8, -2, 145, -88, -21, -135, -137, 17, -314, 206, -143, -69, -106, -90, 72, 67, 90, -182, -101, -77, -22, -84, 67, -70, -69, 156, 3, 22, -70, 17, -15, 22, 49, -192, -147, -153, 71, -24, 111, -193, 77, -112, 108, 141, -244, 38, -118, 37, 26, 132, 152, 263, -104, 46, -7, -116, -126, 26, -9, 240, -1, -58, -110, -85, -60, -18, -6, -104, -44, 46, 107, 4, -185, 225, 7, -103, 154, 68, 102, 72, 190, 243, 66, 78, -19, 101, 358, -126, 146, 39, -388, -232, -101, -176, -14, 182, -148, 94, 101, 17, 52, -110, 151, -90, -85, 11, 170, -26, 178, 95]
2983I5K5k7J8OO0j58J6j4K4J04j02j19N9j16O2K38k13j27l9J60P3j35Oo3J74j91
3009a84K11j63N1J13n0k5J29Q4k61J21K13j01j6L4j33k43K33J66l25M4J81j78
3031i9NJ32j18r8J27O8r0N7j98J03K03J19j97l7K16r1n2Pj4j56P5oR1p3N5mk52
3058b27N81m16j02J38nk86K41K64n0l00P0J64k11K63J75k83r0J11J1Mk42J46O4
3081B0J44m2N9j84K66l72N9R6J20k94j00J56K5O4q9r9j54L14J09R9o3J67m03r0
3105a92L47l51J51kK04L8k89L15j37j08M46m72P5j04p2j4L88M9m62J24M4k12L4
3128b00M12l45J75R5q8J31j04J05K6k57K15J0l41L62Nm60J57M05m08j12L46r6
3150C3j72M71m13n8RK60j50k07L13k49lL50O8n64L68j9j38K09J79k99K40k2j82
$$ y = [95, 120, 93, 111, 117, 177, 19, 35, 21, 45, 149, 47, -72, -13, -129, -67, 171, -42, -169, -208, -48, 25, -110, -104, -167, 7, -184, 27, -136, -85, 28, -22, -47, 82, 166, -95, 26, 239, 138, 122, 156, 23, -220, 13, 179, -146, -102, 79, -99, -94, 38, -80, -178, -51, 17, -73, -16, -214, -111, 92, 211, 14, -23, 193, 102, 50, 57, 43, -113, -38, -44, 47, -26, 29, 25, -227, 354, -62, -164, -26, -31, -317, -76, 188, 138, -162, -92, 72, -139, 124, 299, 16, -74, 37, 48, 52, -190, -44, 20, 164, 122, 181, -3, 263, -109, -50, 46, 166, -128, -228, -72, -47, 17, -72, -171, -325, -11, 98, 197, 134, 301, -102, -192, 155, -196, -45, -47, 157, 195, -94, 221, 84, -24, 422, -50, 25, -79, -151, -165, 223, 272, -190, -66, -22, -234, -200, 212, -133, 42, 137, 49, 180, 76, 181, 207, -50, 165, 175, -166, 196, 201, -259, -102, 303, -105, -217, 129, 33, -139, 332, -81, -139, -130, 130, -20, -227, 86, -163, -166, 184, 252, -312, 56, 37, -101, 108, 287, -12, 228, 206, 24]
3173B4LJ10P8k70N9K4J1r5J42P8p0j12j35r8L85j36n8J2L1lj78J44j72kJ96L12
3199B80k73Q6N8j51k38K61j60j56M35l8j31j62K52k01J89N9l59R7M19m8m98K16
3221f3Q0l69K80o1J3k3J39J73l76L34j5l54L82j86N7j03J10r1j23M16m8j73j22
3244a23K25j70P7Q1r3q4K90j26j07Q4l1k02K44K06k59l14M56l40J42J89J1j45
3266A1M1P0l43L05J87k98m9K5k61M94o1Jk19O5kl8j0P0%j09K04q2R4q1l7k66N37
3293B48k31J86o6r4l0k9J45M4j03o0N7m6k47M30m9l32P6J68j73L13l43K3K48J70
3317C05j93l39M02q2k59J41L75k47p7R9J6j78J94j64o7J81J19j17O2L0m10L50
3339A41j11J38o0j50N0m4L5J94j35j97J00K94m16J77l0nJ17K11j35j18o1mR1L
$$ y = [24, 27, 137, 215, -55, 4, 28, 39, -56, 86, 164, 94, -18, -153, -251, 134, -2, -60, -48, -17, -20, -198, -54, -226, -228, -32, 280, 7, 93, 151, 0, -238, 23, -137, -293, 142, 104, -27, -189, 63, -138, 51, 110, -249, -152, 267, 219, -279, -63, 17, -352, -72, -133, -120, -143, -4, 169, -207, 127, 112, -242, 140, -46, 11, -92, 18, -73, -196, 220, 172, -1, -123, 102, -68, 9, 90, -3, -87, 203, 77, -30, 54, 23, -179, 65, 271, 12, -302, 154, -186, -44, 145, 156, 11, 52, 122, -221, 84, 271, -27, -76, -51, -312, 182, 121, 122, -97, -32, -34, -72, -82, -12, -12, -121, 83, 1, 95, 14, -23, -289, 248, 17, 203, 137, 43, 13, -16, 129, 173, 70, 10, 67, 21, -226, 204, 155, -177, -101, 67, -106, 207, -136, -113, 135, 305, 112, -227, 175, 93, -166, -25, 350, 103, 26, 125, 141, -37, 157, -7, -74, 107, 226, 109, 171, 201, -209, 141, 30, 168, 108, -42, 8, -36, -1, 193, 58, -139, -39, 255, -161, 16, -14, -19, 98, 309, 174, 56, -5, -9, 82, 85]
3363H5J9j69J45k4J2N7r2mk80J73m0r0K47M3j91P5M3Q9Q8l63K15k7K0j25J45m1
3389A0J25k65J37J83k32J04j03P3k01Q4K04l34J70K41m31K36q7j65J79J17k80
3410b35K14k39L71j60K05k32J27o3m0L4J43j11J79l2r3Qm4J40p8l41N6M65m64
3433a90j2L63k86nJ1k6J36J9ok2P0RJ93k42j06Q9J7R8R4j91J09O2l35K49k00K05
3459A03o7n1R6k69J62J17r4L4R8p4n6N7J60n21j05M71l8k35L09J0k1J34j37K1
3483A04n3k05K9K3J09P2J8k01l7J63p0J5kM5j15M6lj30m5J59k7K45k65J98Q2l17
3509a62Q0j37K41j86J98J61j42R5n4k42J45P3L7j64p4K44j66N5j27m4J92m95K90
3532a82rL11j1j90R2j67L41m3l28P7J86Q9j31J22o0J95m70O4P7J61k33J29J2m6
$$ y = [85, 104, -65, 80, 56, 68, 125, 33, 29, -251, -78, -118, -208, 39, 82, -109, -34, 9, 98, 186, -177, 38, 11, 31, -94, 51, 10, 135, -130, 7, 190, -42, 62, -41, 32, -169, -85, 119, -215, -45, 196, -235, 1, -86, -251, -72, 45, -235, -21, -260, 111, -49, 156, -76, 51, -12, -52, -18, 125, 14, 193, 161, 68, 76, 32, 172, 94, -247, -191, 274, -190, -202, 161, -125, -130, -119, -145, -9, 10, 4, -18, 52, 61, 254, 12, -94, -5, 12, 110, 204, 13, 122, 184, -151, 98, -102, 103, 36, -15, 81, -188, -26, 91, -3, 31, 129, 55, -1, 56, 216, -305, -410, 61, 23, -212, 97, 107, 86, 220, 83, 104, 51, -154, -125, -102, 7, 79, 97, -104, -141, 22, -48, -33, -35, 10, -105, -59, -62, -192, -237, -78, -105, 140, -125, 73, 155, -162, -82, -219, 22, -164, 34, 195, 53, 148, 94, -148, -3, 70, 107, -57, -131, 113, -53, 2, -125, -169, 23, -472, -182, -191, 120, 109, -81, 11, -156, 185, 142, -186, -109, 77, 166, 35, 157, 97, 292, -178, -114, -37, 124, -109, 20, 32, -14]
3556a4J1O2j61L53k42J75l76K25m28M17j78K9K61l56K77j30K88l65K36j42K07
3577A49j8j5j0n3j74L04j41J13j16p3r6K15qj14Q8Ll82K64J72qk89K46m0J48k60
3602i5K56k0l54J82J80k52j8J44Q2M8j95J66OO1p1j18J14j17k13J44q1k3l9K52
3626C9j47q8K28q9k03J37J55j53K81nk05O4m8Qj37L43p3l67L86M3k15k04K4R8
3650a28k82N43m5k70j77L26N4j8J43k33K13k17N8o6q7J63M6j38J77j87J33M1j1
3673C8J65l65K34k09M3J92j76lK9Q5K0J26j09k59J74Mj26L2j31J77J63k09J99
3696I4j00j11J87k77L13J11j95O2j04J7K6j06K88k08m8K20j59M0K8m4L7k95K49
3719B5k70L7M90p2k49j95J63J43n4K03k23J33j29k7J32j7j32Q8Q6j57j32K08R7
$$ y = [-14, -3, 59, -102, 251, 9, 184, -192, 33, -395, 22, -156, -127, 134, -222, 55, -75, 213, -152, 84, -58, 149, 131, 116, 106, 53, -121, 183, 42, 155, 39, -34, -130, 85, 77, -37, 51, 54, -328, -64, 108, 100, -189, 57, 17, 165, -95, 161, 141, -213, -31, 149, -103, -121, 23, 105, 153, -42, 124, 130, 191, 120, 2, 116, -1, -214, -70, -151, -174, -213, 39, -108, -196, 32, -57, -260, -123, 32, -121, 160, 155, -50, 14, -34, -26, -163, 180, 107, -260, 126, 169, -46, -250, -226, -128, -410, 133, 88, -182, -359, -33, 21, 3, 146, -87, 126, -91, -33, -99, -186, -23, 23, -115, 62, -125, 8, 49, 38, 203, -162, 72, -137, -94, 98, -78, -81, -52, 33, 53, 179, 70, -189, -15, -11, -137, -105, -236, -59, 104, -105, 94, -6, -117, 70, -207, 106, 217, 22, 84, -20, -3, 23, -83, 205, -3, -51, 169, 10, 50, 78, 34, 71, -224, 25, -245, -208, 282, 210, -39, -234, -71, 72, 18, 221, -2, 131, 2, -25, 107, 90, -42, 46, 132, -25, -157, 51, 148]
3742A48m26J91Q7K4l62M00k12P7p6n7rK98j00o7K85p8M4j71J24J02l94K26m0J65
3766A79j59r1M2P2k0k06J38j35J95J20k44J64r4o1Q3K15j49L0j31j82M4J24p1
3789a37K27K6j77k67K93J08j8j85J7J81j81K18J11j97l4O4l6j9J77j86nJ78j77
3812a9J24o4o2j45J43L7j5j12j7K3J73Q6J1n9O6j11q4L51k79k22J53N1j71N7O31
3837E46n56J72j87J79l31J57k8j30K28j72J36J44j27O5o2K4Kl6K4M8J9j42l7J02
3861C8K1j84j02K86k25K81j03O7rq5%l8J13r3J80j71P1k16J12j1k41M83j96J0
3885a2J26j56k6K57j67q0J08l2o6n5j3J4O2N1J61n3k45J42J2o0mjq2J07J30j34
3911a6N9l21K13J89j46J81k53K38k53lM66j97j55K65m11K6LJ78k8j53J6L16r8
$$ y = [148, -278, -87, 0, 24, -338, 62, -150, -73, -149, -206, -215, 83, -17, -84, 201, 123, 167, -4, 120, 222, -172, 54, 14, 179, 20, -71, -29, 43, 23, -183, -45, -180, 15, 135, -109, 55, -39, -100, -17, 198, 49, 79, -52, -234, -190, -66, -137, 90, 116, -61, -328, -35, 73, 55, -130, -113, 68, -113, 105, 216, 19, -15, 49, 13, -6, 171, -15, -20, 158, -19, 105, 41, -21, -166, -23, 14, -1, -113, -130, -107, 66, 152, 163, 104, 170, 59, -25, 326, 47, -175, -22, 29, -142, -85, 546, -10, 162, -25, 154, -177, -20, -48, -178, 50, -122, 14, 158, 31, 96, 34, 58, 60, 24, 48, 96, 115, -27, -64, 38, 59, -125, -227, 59, -166, 115, 12, 79, 70, -15, -15, -53, 60, -33, 147, -24, 47, -169, -57, -68, -309, 174, -22, -12, 114, -42, -68, 189, 22, -58, 50, 18, -48, -103, -116, -102, -40, 11, 172, 119, -126, 16, 28, -32, -36, -37, -119, -12, 118, -16, 43, -278, -65, 124, -22, 159, -94, 144, -109, -112, 354, 157, 2, 267, -144, -118, -115, 63, 35, -118, -102, 214, 116]
3934A16m3j62j43L36j60K32k73n8L02Nj28j47PJ26j42J12J58L8l4j70L2lNo5J3
3959d6n5L7m4J61l4j80j30K88OJ48m2J8k54K24k08J84K36k91j1K95k24j65j68
3982b55K93j5k02L85q7n8Q2p3m6k59L13J47m18L29r7m2L9J67k34O5j17J02n8K30
4006A91l00J08n3O3k4Q1K16j15q3J8J12k34Qk21K91M8mk22Q6j0J92k05m0K33j72
4031c6M9m4m2O6n0K41j69p4M2j33J06j52J45L6p8m9k6O9M20o07K68k9P9J69K7
4056B28l14J42o7o7L83J7k19M5k33J88M8l79L36j17j06J63n3J41l58Q2O3j18L41
4079A46m1j18lr1j4J99j26R4N4j50J15m0k36J77k34K64N5j26qK16j04o3nm5J03
4104A9j76J90N3m4J03r1n9j16J13R1j0j05J45k46L1R3m7j4J1Q5p2n6L08j82Pj11
$$ y = [116, 73, -89, -232, 104, -56, 176, -97, -155, 147, 152, 24, -123, -116, 10, -132, -20, 138, 176, 142, -28, 4, 1, 6, -59, -46, -101, -64, -108, 53, 19, -161, -291, -3, 3, 151, 109, 127, -127, 97, -111, 73, 309, 18, 7, 302, 78, -87, -255, 38, 23, -179, 206, 119, 61, 143, 70, 24, -235, 78, 225, -193, 136, 39, -3, 36, 203, -31, 34, -83, 19, -39, 191, -109, -1, -54, 9, -15, 66, 282, 167, 84, 102, 214, -20, -12, -233, 58, 106, 102, -120, -34, -44, 148, -57, -97, 136, -36, 13, -31, -73, -7, -57, 184, 15, -59, -17, -150, -44, -196, -51, -15, -93, -142, -168, -99, 321, -286, -18, -47, 32, 201, 228, -86, 56, -11, -78, 305, 322, 103, 148, -85, 103, 151, -228, 108, -9, -115, 48, -5, 136, -222, -140, -77, -195, 146, 105, -13, -16, -107, -121, 78, -48, 46, 100, -50, 65, 25, -211, -34, -268, -4, 51, -75, -83, 133, 29, -34, -39, -84, 19, -157, 33, 86, 42, 145, 54, -5, -121, -8, 83, 73, -32, 113, -133, -102, -9, -56, -70, -59, 26, -46, -102, 206, 24, 31, -80]
4130h0lj7k1K5oJ36J13p0K77n46o4K44o6M8k0p1J69n3J80k58R6r5n1M1r0K91j93
4157h4k6K39J0j46L7K3j26l0J52P9j88L5P6j57r9K33j12k4J77J67k29p1J84r8
4181B2q4P9M9N8o1p2K7l5r9J4K14q0J02j60N3j33P5p0J44k5M9p9J89m60L77M3
4207A37l10J15O9L1k10O5k20L13nq5K49l00O0J78j4r4N4J33j63J47k34m7J67p
4231B9j34M4K17o6K65j50l42K23j02n2K02r6j21M04l64K72m64N0L2J88q9n0L14
4254B10q0k62j9L07N3j22k90K93j8j16j50J55l0K18l3k24nK53k20J34J86K9k26
4277D3L9o4j63J35K5K3p4Q2j4J8m5m2Q2j65K35l43p7M93j3l17K0K7J9nj2K66j53
4304B0j69J55o9k12K82j46K89o4j50J80k93K99p1rJ9k35J50N2j89K85k21J6J91
$$ y = [-80, -83, -100, -121, -96, -102, 34, 147, 77, 354, -192, -256, -12, -78, -30, -50, -121, 48, -5, 175, -83, 13, -82, -133, -92, -182, 109, -84, -110, 129, 139, -7, 30, 53, -73, -103, 49, 128, -60, -25, 51, -106, -205, 28, -84, -108, 69, 236, 7, -64, 120, 22, -62, 17, 66, 124, 63, -9, 18, -17, -116, -102, 112, 32, 134, -26, 27, -106, -31, -101, 43, 18, 67, -12, 177, -283, 94, 137, -173, -58, 11, 42, -168, -103, -323, -10, -15, -100, 149, -151, -91, 87, 73, -21, 33, 166, 3, 150, -84, -131, 36, 29, -105, -61, 156, 90, 355, 205, -137, 86, -16, -68, 134, 38, -83, 321, -43, 229, -235, -185, -153, 35, -54, -104, 210, 130, -132, -151, 156, 209, 87, -203, 90, 72, -44, -194, -39, -69, 149, 116, -108, -113, 140, -80, 54, 240, 269, 43, 82, 18, -145, -10, 15, 38, -36, 46, 32, 50, 5, -37, 45, -120, 115, -228, -305, 188, 175, -142, -122, -95, -76, -81, -93, 173, 20, -149, 6, -63, -275, 7, -139, 150, 86, -64, 116, -177, 122, 51, 42, 61, -174, -24, 28, -161, 124, -97, -81, 110]
4327A10o4MR5P4j86J36Q1l32K49k47k4Q4J53L4j32p7j02J28J9j12K71k39K37Q8
4351B48l08l45K57K50k58J65Q6l30K65j14K04k17k07J84K78k2J49j98n0r9j85
4372b47J58J09j52J34j26N8J86j63J00J23j09J02k60JJ80K6P7k87L2R4j48L84
4394B72q6l33K99l97L33j19m8j18J29M3J86j04q4K10k06N5l9O3qj45Jo1K64j11
4418dK4j02M3K30k58Q6P2j93L05k17j08r7R7Q5n1J64n9kLOj89J24Q9j03j27K65
4444H3R2j49q7J60l27L07r8q6J29R5M6m20K62j51J23j81J81k39O0J12J24O5k63
4467a62J16K6j46L52j20k42M4J27j20J96m6n1Q1l14M37q6J05r7l40K46M2J64k35
4490b3M5M3j17O6O6j79J84k8M9Q2j85N8j25L0J67J30k96M3N3q9k44K57m6j71K18
$$ y = [110, 46, 50, 145, 219, 33, 169, 250, -82, 167, -80, -104, -20, 133, 167, 35, -42, -144, -16, 3, -109, 162, -77, 160, 248, -60, -405, -148, 102, -156, 9, 95, -235, 30, -84, 120, -97, -304, -120, 158, 136, 285, 87, 37, -62, -247, -89, 20, -132, 2, -124, -66, 120, -43, 57, 180, 71, 173, -87, -86, 94, 120, 197, -90, -58, 36, -112, 272, 186, -147, 152, -245, 88, -31, -79, -197, -68, -25, 161, 57, -27, 183, -23, 32, -7, 56, 48, -97, -96, -157, 107, -4, 20, -82, -39, 191, -67, 19, 91, -102, 203, -14, -122, -219, -122, -37, -88, 76, 17, 15, 18, 24, -165, -41, 48, -55, -182, 83, 175, 26, -61, 99, -228, 79, -19, -105, 24, 119, 165, -255, 7, -144, -21, -202, -21, -260, -200, -88, 36, 101, -162, -46, -20, -166, 186, 66, -176, -132, -5, -125, 71, 25, -26, 55, -259, 178, 92, 197, 100, -240, 6, 48, 212, -23, 22, 65, -52, 14, 80, -99, 85, 57, 106, 188, 3, 61, -64, -34, 133, 263, -33, 10, 63, -26, -270, -13, -59, -230, -12]
4515a2n9NK17q1j30L03q2l5k74J00K78o7j57LJ61q6M9j96J46J5m4k76K35Q3lo3
4541C0L3J65m9j05j17RK00j14o0K6j68K06r2Q4j64Q5j81J51j55K62J6j92K78J13
4565B61j99J12n0Qk23Q8p6n9j26M44j63j55K64k19J19N6k72K67k88K14nQ5O2n5
4589I0j54P7l50L40N1k45J22J11K7k9K7j16n3pJ7K6P5Q7j12L19q3j20j38R2r9
4614d5J88k36M1J96j2k74J20k1lJ02l55L5J16K32j23N6J48o7N4l22Q3j4J29j65
4638a37K1Q6N8J92j96J33j4j61j38R6K16j8j7l1j20J00q5j77M66m54O4M9q4J49
4662bn5j26J30j30J15j52J14N9J49n6j10k3J41J22j30l1J97j45J7k1p4J2P6k28
4686a51J34r4K20j07r6J11k10K18k63K10K3K2j59J38J05no1j27J32Q0m21J54K36
$$ y = [-12, -71, -66, 151, 70, -60, 243, 161, 126, -148, -48, 230, 163, 6, 9, 170, 84, 133, -63, 83, 98, 54, -222, 13, 96, 93, 30, 63, 228, 179, 74, -43, -34, 166, 52, -8, 18, -150, 56, -36, 48, -116, -31, -212, -61, -216, 46, 62, -130, 148, 261, 62, 174, 124, 132, -91, -3, -79, -138, -264, 180, 17, -138, 126, -93, 26, 82, -190, 77, -211, 3, -2, 83, 145, 90, -64, 13, -337, 3, 54, -191, -69, 42, 69, 40, 67, -49, -102, -109, -92, -66, 9, 96, -16, 303, 220, 100, -38, 54, -45, 143, -93, -52, 144, 132, -142, -22, -43, -46, 56, -299, -264, -148, 84, -39, 17, 165, 98, 152, -170, -87, -101, 28, -137, -116, -30, 28, 220, 24, 157, 143, -18, -156, -60, 156, 138, 121, 90, -30, 70, -15, -192, 274, -180, -116, -67, -151, -2, -57, -183, -53, -183, -68, -220, -106, -47, 102, 46, -64, -87, 54, 176, 46, 15, 212, 67, 84, 63, -11, 1, 77, -151, -17, -111, 109, 2, -94, 17, -193, 25, -238, -28, -5, 17, -142, -4, 101, 96, 35, -92, 40, 120, -301, -147, 89]
4709H9k12J6Q4n7J17j76J89k58L12rj45K04k65J36j84L64q9n5n6l2o7J34P2j94
4733h2K07l4R6j50J30l43J17R6k49N4Lj5P1M6L10l71J28j5P9r2j04o4K25q5J97
4758A55l80N1J67p5O0k15J29P6Q6j61J63o1l8q4j11K54J26j68j18LJ82j6p0o4
4782a09J6J27j33L64l06J5l8pJ13k67M73j09qj91J94r2p6J06J2j71J12J31J6k8
4806A44k33M01m32J02j5l4N1j42J12j22K65K9k14J68K3m7j71J28J01l00J89J9
4828B2P1J15j94J8N2j47q4M45r1r0l6k73J50N8OP1J11l07L27l04J88J37j1l53
4852a19K12p1L2p9J81j23q7P3k39J76K8k76K74m4L1j0j07J82j9k00J98J85l34
4875a36J32j0j8j75L02j72jM4J14j65K27L9m0r6j70J02j69R7J72k47J81K38j18
$$ y = [89, -123, -107, -23, -80, 37, -139, 50, -208, 104, 95, -50, 154, -111, 25, -159, 205, 116, 61, 5, -27, -94, 40, 112, -82, 125, 91, 187, 37, 167, -176, -59, 37, -212, -158, -155, -170, -99, -53, 257, -114, 14, -1, 78, -14, -118, -182, 43, -42, 155, -225, -174, -7, -82, -22, -237, -108, -32, 54, -107, 56, -5, -43, -127, -238, 16, 142, -26, -144, -141, 41, 25, -45, -109, -93, 34, -99, 265, -41, -26, -64, -71, 42, -225, 248, 139, 131, -60, 134, 42, -34, 72, 84, -87, 25, 156, 172, 144, -89, 312, -120, -18, -33, -67, -16, -158, -46, -168, 97, 126, -88, 80, 103, 56, -115, 13, 114, -186, 3, 22, 93, 208, 14, 32, 84, -63, -147, 298, 207, 117, 81, -192, -42, 16, 22, 93, 204, -103, 224, -80, 108, 245, 234, -119, 93, 22, 54, -25, 156, 33, -54, 19, -220, -44, -16, -292, -18, -62, -31, -41, -148, 34, 15, -185, 13, 198, -136, -4, -14, -32, -207, 95, -77, -78, -34, 80, -85, 142, 181, 141, 45, -125, -23, -192, -95, 77, -170, 11, 249, 131]
4898A31q7p9N5n9k71K80N2j73K10k54K70ok0N6p2K20k12O3k64K38N3k56J59NK25
4923B64k44J64l42K75K3k09L59l17j61K04p8J35L4k48K07l46L6J96J37n7j95m0
4945b03L9K79l70L09J4N1Q3k73K36k71K58j77J35R5l49K41j68RR8j47J5P5j20
4968a41J77j92J68M4j01J39J99k29q1O1p7M0K1r9L04j36k46J40K9j56J87j30K7
4991e2L50k21L3q0q0J76j01j9k88K60J4J4J54ok10K98j35p6Q4l19J69J68k35k08
5015c10M93j45r5M2J23q4M8K45p1j49k3j65m8q4N59k75Q1j47K18N9k58j25l5K6
5039a20J42r6jJ88Q1k01j39P0J31p9k0l0p4J80j49K26m5J2kJ3j80K55k26R8k03
5064a69K17N8k36J13O5q4R4Q5k54k3K9L93k32%n9n4K16J5k26k4R0r7J56j47J73
$$ y = [131, 44, -35, 20, -39, -310, -30, 22, -151, 59, -195, 75, 69, 49, 105, 33, 253, 41, 104, -160, 78, 131, -125, 34, 39, 264, 20, 184, -158, 117, 140, -69, 290, -27, -188, 16, -62, 73, 107, -141, 66, -280, -244, -48, 89, 32, -163, -203, -164, 115, -255, 54, 68, 119, 202, -71, 165, -106, 152, -25, 110, 205, -144, 97, -71, -62, 36, -111, -96, -21, -141, 36, -156, 12, 56, -45, 94, 293, 64, -17, 44, -33, 7, 28, -71, 233, 97, -149, -9, 20, -136, 51, -79, -52, 298, 77, 110, 30, -50, 126, 25, 6, -282, -22, -8, 6, 160, 154, -56, 242, 107, 31, 115, -204, -35, 133, -102, -310, 183, 38, -57, -15, 108, 24, 72, 317, 246, 97, 74, -91, -139, -223, 336, 61, 142, -5, 213, 272, 14, -111, -146, -120, 22, -74, -75, 113, 194, -7, -146, -76, 55, -24, -44, -74, -148, 32, -117, 109, 64, 76, 74, 87, -93, 162, -64, 34, -169, 48, 106, -130, -17, 48, -36, 58, 143, -111, -134, -105, 288, 56, 56, -3, -57, 159, 174, -52, -76, 14, -83, 73, -74, 99]
5089I9k99L15r1n8p9J20O7j05K18O5l37r1L49Q3l20K32N8k13j13NJ6J61j55J28
5113E5j8mj4j59K10J02l44K81J10j71Q2j38O9j14N2k90J57K02q0R9l3jj55K8K70
5138A96m18J07J32J17j17r6r3J45N7P8k78J73Pl6Q5r7j48K54n7J52k27J30j51
5161h5O5J55k5j08Rj97L00j16R9k81K01n4O9o2P5J26j26L6k49L29j26j65M7J6
5185f7p0J59j17N0J65P1l52M3J47k5R9J03k07J83l3J62k59O2k86K33P4k24J49
5208F0J34j50j25l3J26j42N2k4J19q5J07J38o8j22j13K34l97J02J85J65m1j25
5230cR5o7j00J15P6p1j15J47l02J27P9l6N7k02K44r9M56p02K14j6k7o3J32J39
5254G8j52q6J60n6m9J67k39K57O7r9R1l28J78K47p6K8o6j50J51k3k05j80K67J18
$$ y = [99, -200, 115, 24, -34, -113, 7, 74, -31, 187, 252, -85, -176, 173, 256, -64, 168, 226, 13, -100, -95, -79, 82, -73, 55, 37, 33, 19, -140, 70, 172, -172, 109, 219, 48, 130, -8, 61, -53, -1, -291, -134, 68, -12, 87, 54, 53, -102, -74, 196, -222, -115, 17, 134, 17, -79, -172, -27, 30, 108, -170, 3, 10, -26, 59, -38, -186, 68, 11, 163, -64, 66, -85, -20, 135, 110, 2, 11, -186, 114, -2, 97, -184, 17, -37, 32, -30, 45, 171, 45, 81, -168, 161, 35, -130, -83, -67, -137, 22, -95, -45, 120, 191, -161, -118, 29, 4, 103, 206, -1, 182, 149, 311, 52, 114, -172, 61, 135, -89, 60, 194, 44, -81, -114, 12, -130, -78, -102, 17, -68, 39, 177, 109, -13, -126, 108, -289, -187, -2, 163, 122, -3, 92, 25, -75, 40, 116, 45, -70, 77, -225, -98, -19, -55, 2, -200, 44, -55, 401, -301, -87, -103, -130, -193, -61, 78, -74, -160, 0, -56, -105, 62, -177, 80, 147, 48, 139, -189, -11, 236, 160, 188, 122, -28, 123, 100, -105, -285, -18, 100]
5278A00m4p5p6O0O1l1j25J4O5J52n2j23mj83J93K14J14k57nj9J89j96r4K19j61
5303f4p9N8p0K5L10l80N00l84J66k9j66J44r1P4k17l5J58J58K9j30J90k98L66
5326B35p1k87J33rj86K91Lk79M5L9KK80l19R1p2J00K41k68P5J00k01j8L37o0j52
5351E0j41J12j90L26l40M75m53J15M9O6k89J27K6J85j51j25R2J6j0j50K77r0J55
5374A32L6k35j2qK07l8j00Q0k88J83n4J7%J98j57Q1J47j11r2O0L3J8oj7N5j20
5400IK00k30J70k27j23n5L30k25P7o9K90l10N3K7P8J23R1j02P6k82K1O2P8k75
5424b13r9M13j88K45r3p9k4J03l64J45J3Q1qK30j84o2j92L54K1m6r0J7k0r9K11
5449G2k29K26n7m6P3k4j01N0j9K09l27N7L62k48N9K28l44N9M2L22m68K74k1j07
$$ y = [100, 56, -19, -95, -35, 26, -5, -130, -116, -51, 101, 49, -74, -78, -261, -68, 146, 260, 3, -2, -21, 168, -28, -122, 97, -64, -143, -85, -155, -130, 180, -200, 300, -84, 82, 53, -113, 31, -60, 14, -203, -238, -80, 78, 107, -23, 167, -131, 235, 164, -123, 10, 1, -185, 106, 109, -170, -125, -86, -84, 196, -123, -32, -104, -4, 237, -31, 44, 144, -57, -75, 262, 202, 50, -91, 21, -169, 157, -183, 292, -161, -46, 3, 69, -220, -93, -67, 118, -33, -158, -66, -50, -60, -210, 67, -23, 132, 168, -67, -79, -87, 120, 82, -18, 62, -226, -43, -97, -80, -80, 118, -39, 42, 189, 78, -14, 46, 79, 97, 91, 74, 129, 9, 209, -21, 149, -78, -201, -256, 74, -151, -74, -143, 147, -163, -110, -83, -5, 118, 209, 107, 183, -99, -78, -16, 62, -213, -312, 101, -87, 158, 65, -14, -38, 65, -299, -154, -141, -60, -68, 162, -22, -84, -276, 78, 99, 53, -37, -20, -40, -139, 72, -157, 69, 12, -34, 39, 15, -86, -36, -55, 154, -173, -116, 246, -2, 57, 285, -59, 0, 42, 364, -104, 170, 149, 42]
5473D2lJ2R2j87k08J79L91m06P5O2J59k05J1l2J15j25J07k32K81j06j00L87k95
5496A4qk86M34j58j12j00J79p0L57q8k97k06L37L4r0O0K23l10M9R2J81l44o6P
5520a68J02Q1Q4L0k70J36J10k83K47k17J74j68J74Q6j93o8L43j25Q1m1j09r0Q8
5543Dk74L77j69J28R2k25L2J01m6O7q6K09J38n01o4R9R1j60J48q4N0P9j3l08J55
5568a60L95j00k06J01r7kK7J28q1J72j87o8J72l3k0J2O4q6r7J86q5o1J73j4n6
5593G7k04n7L93j03J6q0l1j39J14l5J63j39J40m4m3o4K3J55j88J14j37J13O5p5
5617C4j47J53L7j91M1M0O6j18j08M61l30M0J29k64J69m7l4j00J22J50p9K60q7
5640A97R3j32l21O8J94J91k11k73R6O4m5q3K03j92M2j49L44j4R6P3m3k23j04K5
$$ y = [42, 39, 51, 143, -44, -252, -73, 318, -88, -13, 49, 208, 3, 14, -18, 97, -28, 79, -153, 128, 22, -78, 309, 14, 6, -280, 154, -4, -116, -216, -37, -107, 250, 162, -135, -341, -4, 30, -60, 0, 223, -87, -38, 54, 235, -109, -175, -168, -66, 15, 99, 129, -141, -5, 105, -178, 69, -148, 26, -142, 32, 118, -75, -143, 200, 75, 156, 115, 6, -84, 4, -270, 107, -62, 66, 158, -67, -35, 66, 20, 87, 1, 210, 348, -153, -217, -118, -27, -187, -39, -123, -73, 6, -7, -315, -160, 235, 135, -71, 30, -67, -69, -42, 86, 5, 177, -10, -78, 94, 61, 41, 53, 117, 31, -66, 120, 35, -26, 147, 133, 77, -127, -184, 209, 106, 122, 42, 11, -128, -14, -49, 114, -25, 115, 71, 28, -36, -13, 142, -46, 68, -69, 44, 109, 34, -113, 40, 77, -114, -73, -33, 33, -85, -193, 268, -62, -22, 107, -157, 12, -35, -69, -169, -47, 103, 24, 284, 197, 290, 158, -163, -95, 99, 290, 79, -194, -98, -34, -79, -162, 41, -151, -109, -258, 86, 72, 168, 241, 198, -25, -129, -104]
5664a04j16M12k79J77Q0j98j00J76j6J27k12JL25k63J7K13lk76Q1J6q8J99l18
5687a49J4J02J28j18m1J96j22k2j12J7J05R5K8k64K1J03L8l2J26J60k87On5N4
5711im2j58L94k31L1K2J22k33N0J05M6l76J70R4r6m9K87j89J15j20J39J20p0k8
5735I4k12J8j13K05j3P2l4n8L4Q9m5k40J79J54k68L47j60j24L7L30k53j40K67
5758A66j07lq3kJ05j21j3nJ10j41Pj26K80K1l05J32O5R4J58j57k09K19j89J31
5782B7j55j50L71k53K40N6j67n3k07J92L80l29m3l4J34k02K14j72J0K92L9j46
5804D4k7J96j34Q7L3o0l27N0k3J84J26k22J30j27N2P7j78L66k86Nn6J17j2o0j01
5829a46q5L64j37r8J1L54m34L99j46k18P2K56j66j24K50k15K86l76QN6j40N1J60
$$ y = [-104, -220, 192, -87, 90, 170, -28, -128, 48, 32, 159, -53, -52, 273, 10, 27, 240, 237, -39, 42, 58, -30, 169, -149, -135, -33, 95, -23, -64, 132, 10, -12, -124, -107, -2, 93, 121, -143, -122, -19, 19, -13, 113, 273, -14, -8, -63, -9, -51, -209, 185, -46, -15, 7, 129, -104, -54, 51, 97, -279, -109, -15, -111, -160, 127, -62, 53, -67, 72, 192, 122, 94, -118, -100, -213, -8, -21, 51, 17, -41, -7, 82, 37, -203, -24, 130, -138, 209, 49, -75, -38, 292, 39, -101, 166, 59, 56, -27, -29, 76, -45, -58, -63, 47, -94, -87, -213, 67, 88, -217, -85, -20, 74, 232, 75, -134, 85, -104, 27, -128, -278, 93, -160, 80, 136, -31, -84, -291, -99, 281, -48, -91, -125, 9, -193, 21, -151, -141, 151, 190, 44, 17, 213, 79, 166, 199, 139, -188, -138, -161, 23, 149, -73, 57, -70, -18, 59, -119, 247, -39, -34, -90, 27, 15, -45, -146, -231, 133, -4, -102, -91, 263, -171, 228, 82, -136, -64, 192, 26, -98, 152, -63, 223, -153, -145, -89, -229, -178, -18]
5852a8J83j59r3J7J04j17J99k09J16m9J90k01J73l06J67r6P0j40O7n9K39J09k15
5875b8r6O3j31R3J43jR1k53J87nL8j3R5r4l26L41q7n8o5K36q6j2k02K58j69p7
5901a58O5j53K82L0r1j44K21p3J4k95L16n4K78o30M27M8k9j07O8K38l13J60j06
5924fn6j4L30k29J42l29K49oP4O6k97J38l21J14K17n0l2J56k53R8l67K90qj31
5948b25J19L49j06j12J33j81J24L6k11J18l3l3J48j65j33K76l01rK24p4o4K80
5970A60k69K93j37j5M5N9j66j22R5L20j96j3K25k75j49K45J8L7j04j65N7nL70
5993C08l25N0j83M0R7L08k15K11k64r2J64j08j25J21J39k54M1Q3O7J2j20n0K41
6016A46j18K04j20l8k3j94J06L5R4k30J8N1J67j23qJ35j54K10l44K27n1R4L18
$$ y = [-18, 165, 6, -87, -70, 34, -83, 116, -93, 23, -26, 164, -37, 136, -170, -3, -99, -29, -169, -102, -161, 78, 187, -28, -124, -61, -192, -99, 44, 43, 134, -119, 68, 63, 101, 88, 183, 89, -237, 104, 17, -41, -106, 130, 44, 32, -170, 88, -81, -158, -93, -246, 36, 66, -25, -169, 52, -21, -7, -302, 14, -40, 238, -392, 35, 83, 54, -53, 15, 253, -60, 100, -6, -62, -76, 254, 25, 167, -162, 87, 81, 155, 221, -76, 62, -259, -145, 72, 22, -10, 146, -107, -9, -376, -86, -94, -225, -106, 243, 137, 25, 158, -23, 101, 137, -74, 44, 11, -22, 126, -39, -172, 104, -197, -206, 18, -56, -120, 160, -109, 184, 47, 32, 77, 136, -30, -152, -57, 263, 67, 54, 279, 4, -145, 100, 118, 155, 51, -114, -57, -62, 308, -17, 33, -150, -110, -13, 295, 80, 291, 27, -65, 99, -9, -134, -13, 126, -128, -87, -4, 63, 75, -45, -95, 146, 28, 232, 112, 74, 51, -143, -37, -2, 92, -138, -120, -69, 98, -25, -33, 102, -52, 158, -186, 41, -10, 84, 402]
6039D02k06l47J85j48K4K17M7l19J27J93j92r3K43J6J00l21K22o9Q6j19j62N9
6061e5KJ96k18o4j10N1L34p1j40jJ33n9m2J6M4R8j10J6K57l32N9n1K51q0J8N6
6087A98l73J63P7q2K36k69J72n7j50Q8k06K27l3J54l59K06j40j62K10Q5J86k63
6109i2J14p8l9K21l6J1k01K07q8J9Jj67kJ07K79m48K82l83M94r8r2R1k72J15J66
6134A11j75K73q8j02l3J04j91Q9J41n2J12k75L2j01J71J09j01k53L13k94N12k86
6156A6j53K19k99R4K54Rj4l77L49j19J69n7M1j16j38J95J68m68L57r6k6p3K23
6179A58L1j57k51O27l31O8j79K0n7J92J3p4j8j65K9J4K40j40R2pj1j7J53l48Q9
6204b9l8K06n1L5j06m0j84K88j86J38j67R5RK21j95q0j32J65J48k09l5K11J13
$$ y = [402, 196, -151, 34, -114, -90, 127, 174, -145, -18, 175, -17, -110, 133, 149, 249, -72, 150, 81, 167, 48, -114, -55, -53, 143, -75, -139, -249, -198, 136, 65, -75, -76, 57, -2, -44, -28, 16, 114, 4, 20, 277, -55, 4, -47, 204, 124, 142, 198, -175, -12, 65, -17, 219, -50, 122, 65, -85, 3, -203, 24, -9, 145, -214, -8, -148, -310, -100, -15, 171, -92, 22, -56, -95, 126, 90, 101, -100, 107, 19, 38, 39, -128, -130, -23, 256, -192, 90, -293, 201, 103, 11, 102, -170, -55, 111, -64, 209, 121, 19, -14, 90, -101, -12, 129, 77, 189, -86, -54, -155, 16, 125, 24, -229, 84, -210, 302, 16, -137, 82, -217, -123, 131, 140, 126, -251, 98, -21, 148, 91, 132, 16, -122, 73, 241, -227, 130, 34, 8, -65, 158, 189, 32, -219, 408, 77, 145, -34, -14, -71, 121, 134, 60, 42, -123, -94, -80, 160, 20, 112, 105, 94, 77, 230, -118, -29, -67, 139, 88, 123, 17, -23, -207, 81, -105, 33, -134, -39, -30, 191, -4, -84, -216, -51, 97, -112, -147, 64, 177]
6227A77k44K42l86J22J37l9j2%K45n13L30J22p4J83j35j99j2Nq3p6K59j05L4J86
6251A64k02L9K65k58j20J83k21J10M3J1J13m21L2K69R6k73K73k02k7L87m53K82
6273I0ll09J66mL23k93K8Q8k30P4J46M1j91O1j26J59J03q9J51J0k66j5J79k41
6297a48M8j48K82Q0j68J42p1K06k61j80L11n5j25q7O4J85R6j84j78L57j69L23
6319C20l92K01k8j13n3J81j90M04m30J54j39k9J87L6o6R5j61j77L40o8O6Q3k89
6342f8q8K10J8j15k3J69q0r6R1p1J08J3K20k05j9k23M27m0k88K7m9k8q8K84l37
6367b51L54k91K60P1j47pJ17j36o8K5p4o7K73Pl19K00r8L7J06j4L08k75j60J51
6391Bj33j43NK22q5L75j60m4j42J2J3Q5M0j24j47OJ2N6J09O3J61k28K22j65P0
$$ y = [177, -67, 175, -211, -89, 48, 9, -3, -3, 242, -271, 59, 181, 107, 290, 155, -44, -56, -51, -134, -210, 49, -56, -22, 164, -38, 1, 266, 8, -112, 71, -150, -40, 3, 14, 127, -294, -262, 7, 103, -170, 103, -99, -126, 261, -192, 90, 87, -222, -56, -60, 263, -30, -2, 86, -144, -70, 76, 117, -74, -13, -139, 20, 123, 34, 185, 195, -71, -86, 93, -148, -100, -248, 34, 114, -54, 88, 17, 223, -38, -218, 93, 38, -87, -174, -110, 75, 171, -13, -191, 166, -3, 320, -72, 129, 101, -12, -65, 116, -74, 330, -100, 54, -85, -114, 73, 109, 43, 138, -23, -200, 140, 72, 138, 221, -68, -156, 54, 72, -43, -66, 103, 23, -73, 18, -53, 55, 68, 288, 83, 64, -159, 268, 228, -60, -33, -82, -110, -198, 86, -251, 103, -188, 72, 143, -4, -11, 106, -30, -98, -73, -147, -214, 59, 66, -253, -53, -151, -114, -8, -22, 286, 11, -149, 2, -131, -274, -269, -47, -132, 243, 83, 39, -103, -91, -78, 7, 47, -77, -224, -218, -206, -150, -41, 22, 183, -45, 177, 12, 82]
6416H2p9j3l7J25j10N7j10L38l6j41P3o8l96J85J57j15J15K04j88Q7k05OK42k31
6440e8M2L4O9n8J04m7n7j8L05k41J48l01j19K75j99J01N0O2J14j29j8J06o4J26
6464B27l18L03j48k35K19ooJ14j81p6J05K7K53k83j20K64l12L01k1j80J12j06
6486f7K34j61l9K21l19K34n9n0P3k36K3p1K83k29J32j46N7J71o9j66M72k77j04
6509i3J92m3R8j7J43j51j53j77J78R8J98l22j79L04j19Q3j32j38M26r0r6K81k42
6532D9k38K87j90m9J17L6J8J23j65L7P8k05M7J27P2l2M7l24J04R2j24L52r1rJ11
6557B70m78M45r8m8J55k42q5o8J46r1P1oL13k22J17k59K3J26N9j43rJ72k35J20
6581C3J81j26m21M40k23J39J14J43k70J4L2L81o48K51j03%r0K61l7Q6o7j65J99
$$ y = [82, 3, -10, -47, 78, -32, 25, -85, 253, 217, 76, 149, 81, -315, -130, 27, -88, 27, 231, 43, 130, -75, -69, 173, -58, -16, 18, 87, 29, 133, 86, 29, 11, 316, 75, 223, -78, -197, 78, -121, -20, 30, 92, 206, 77, 59, 165, 101, 227, -91, 212, 64, -171, 48, 42, 36, 150, -31, -107, -2, 25, 278, -5, -125, 139, -173, 128, 107, -73, 39, -67, 167, 6, -33, 188, -131, 103, 44, -6, 67, -169, -146, -217, 66, -163, -31, -177, -120, 51, -18, -184, 288, 11, -93, 99, 56, 154, 137, 280, 129, -24, -201, -23, 75, 273, -49, -228, 76, -43, 40, -92, -230, 196, 106, 10, 291, 49, -189, 98, -92, -141, -24, 12, 30, 153, -12, 25, 103, -102, -55, 72, 144, 112, 159, -165, -61, 31, -93, 259, 168, 159, 270, -208, 237, 139, 91, 246, 4, -81, -149, -3, -94, -23, -29, 284, 62, 179, -80, -57, 69, 128, -15, -24, 148, -87, 33, 214, 88, -333, 107, -116, 23, 137, 280, 10, 24, 56, 437, -211, 40, -63, -63, -153, 108, 71, 157, 90, -75, 124]
6604A24j1nk52K2M3J28n6J11J43m45J50J8L7J1j75K93l6j44j3L31k05J05k00J32
6628A06k7n1J37j79K27j83j02J4J06J40o5K7j38k08K77J27l7k94j6L74j05j86
6650e6J87O0m6k35P0Q7J7j68k6qL1n5R8m2L10m72K47k3l2Q4L0k94J90k3j4Q1j78
6677a80O7L25l82L32j26n5P8j61Q8p6K15j03Qm6K0K8K23j17m36M82j73R8o0j33
6701h4P5k03L34j92J08J95J09l34k7q4J68R7k55O3J02q8k0K21r8j26q3J07R9k6
6725E8O9j65j04J11L4r7N7n6J75j38r6o1L85j76j3K58l38K52l2l7Mj99J57n1O3
6750F0P0j19k22K60o9K90n81J70L71m56J71j15O8J30J42j10l9j82Q4J91k11K38
6772A41J06r7k83K59Q0j16j86L07j81n0P9J00k12J61j40j44K71k02L0k75N35k36
$$ y = [124, 113, 108, -144, -122, -79, 49, -7, 104, 247, -198, -48, -30, 7, 18, -157, 136, 100, -44, -57, 274, 69, 174, -26, 106, 79, 28, 165, -14, 213, 30, -72, -58, 48, 188, 123, 150, 12, -196, 81, 208, 171, -123, -139, 235, 130, -56, 131, 191, 145, -90, -20, 67, 84, -84, -110, -118, -87, -142, -44, -86, 224, -248, -1, -24, -56, 28, 58, -236, -46, -69, -83, -2, -180, -113, 212, -170, 162, 36, -19, 59, -102, -14, -90, 125, 22, 30, -16, 4, 32, 255, 138, -298, 184, 11, 109, 49, -84, -9, -212, 122, -70, 38, 233, 342, 8, -19, -103, 65, 162, -93, -30, 72, -16, -36, 185, 87, -39, -122, -15, 84, 58, 127, -38, -142, -31, 3, -94, -37, -93, 82, -56, -152, -213, 172, -4, -17, 241, -97, 155, 123, 86, 90, -109, 48, -3, 60, 130, 11, -211, 49, -20, 270, -311, -141, 230, -226, -55, -170, -102, 28, 170, 60, 21, -161, -77, 114, -97, 141, 247, 150, -133, 126, 206, 90, -96, 211, 30, -20, 59, 159, -53, 108, -32, -176, 95, -107, -77, -352, 183, -53]
6794e3K69j15k78K04J2l4J14j77K84k25m9k7L1l0N2k25J58J0r3j1J69Q6k56j1
6818a95L25k99K59p9q7m5J8m9J42k3J3j74J98j50N9K00j57J37j00J13j88O1L55
6841C34l79J37j79J39qO4k16L64j62M5j31k3K26m4Rl08M47l45k9k8J25K83k83
6864C8j46O6K2p0K39o2l8lj2K38k44j83J16R6K4j69J10m0j5O4j41R9J82j92J17
6889I6j93J32J74k88j02L19k45J64j83L24l74K11j66Q2J32n9J01k00j95J81M2
6910d7j89J75K2R5R0k90K74p0k16K48J9K09k73N4j92K42q2l24L88J41j67R4l24
6933a23J53J76l03j13J33J96l59K88k26Q0J77j0J40l53lJ90J82l24R7J5m7J03
6955F9J54l03K89l95J54L2k00L61k34J17q8R9k56J00K9M6m4M6J08j74J03Q8j16
$$ y = [-53, 216, 101, -177, 27, 39, 5, 119, -58, 226, 1, -48, -75, -44, -74, -22, -247, -89, -79, -172, -183, -14, 72, -184, -195, 130, -169, 90, 11, -76, -121, -103, -152, -10, -33, -20, -194, 4, -146, -87, 113, -44, 93, -7, 106, -82, -21, 334, -45, 92, -87, 52, 44, 108, -108, 256, 94, 139, 8, -15, 211, 167, 176, -132, 315, -30, -59, -87, 38, 321, 38, -108, -42, -20, -90, 149, 87, 49, 46, 34, 272, 28, -155, -39, 57, 81, -88, 22, -18, -33, 31, -110, -11, 171, -21, 96, -97, 35, 209, -79, -181, 138, -107, 57, -126, 198, -176, 35, -131, -49, 83, 24, 125, -75, -270, -89, -47, -236, -61, -39, 56, 146, -144, 130, 60, -156, 92, 111, 320, 47, 101, -91, 151, 69, -255, 133, 274, 107, 201, -123, 30, 206, -97, -210, -77, 119, -240, 48, -178, -98, 79, 69, 209, -144, -147, 43, 225, -99, -2, 13, -34, 69, 223, -80, 209, -186, -32, 0, -200, 161, -73, 44, -44, 55, -201, -101, -72, -26, -70, -24, 84, -90, 13, 101, -15]
6978a5J04k64K77j70L25j42j51L06k66j37o0K67k82K41rj52M7K14r9Mk14N7O7
7001e2J09J8j08lJ53l24M53k54p0Q4j32K03j46q1R0K71l89J22J62j99P1O0J30
7024A68r9j0j43N4J1k5J41P8l34L62%j74N6k27J32N2k02K92k67J20O2j42M50k48
7048A07k19J34m3K28k97k1j02K12o4J80l13R1J36J2L1R9k42L5QO1R5l35j1M5M5
7073a28K99k91o7m1K82j86J26p1M9j49k30N31k25R0Q4k66K77q9r7K46q1j15p7
7096a29J12J39O5k29K45q5j16J65k22M5k38JK36Q8k43L81m41J21J58O8p9N9n60
7119d59K84L4K05k6J05l24K27j81J98j25P0k58J77P1j50J37k9j05P3mj42P5R0
7142e7j06J68j06O4lk20K65j86L78j57j84K21k68J71k67M65j79k32J78N7j59J76
$$ y = [-15, 89, -175, 102, -68, 257, 115, -36, 270, 4, -133, -193, 74, -208, 33, 24, -128, -81, 133, 34, 38, -176, -119, -52, 57, 75, -33, -36, 117, -207, 246, -8, -78, 6, -126, 77, -69, -150, -60, 211, -178, -56, 106, -93, -22, 38, 168, 69, 59, -84, -30, -19, -44, 97, 175, -159, 203, 203, 29, 85, -142, -10, 42, -160, 132, -135, -15, 47, -95, 355, 107, -112, 22, -21, 207, -90, -111, -213, -1, -65, 115, -198, -107, 29, 41, 72, 171, -71, -36, -28, 33, 128, -207, -218, -173, -128, 171, -120, -187, -228, 54, -132, -6, -77, -28, -177, -407, 124, -101, -11, 73, -193, 84, -5, -102, 144, 63, -52, -129, -17, 122, 187, -42, 203, 118, 2, 167, -55, -10, -248, -247, -11, 77, -166, 215, -226, -105, 53, 121, 42, 101, -459, -175, -141, 64, 38, 143, -181, 46, -135, 63, -62, 8, -250, -73, -2, -152, -15, -44, -149, -76, -80, -222, -147, -57, -163, 5, -101, -37, -40, -260, 5, -181, 197, 40, -144, 77, -191, -20, -287, 178, -1, -233, -55, 2, -157, 19]
7164A9o0l1j51L01M6m4L1q7P3J00k59nL11l3L8l82j6L51j56j61R0j78K85j44K80
7189B18r8q2r8K8nK87j19m25K52J6J50n3k7j71J33O3m1j22Kn5L24j77j64J23J14
7214G3j15J75L0j14Q0j31j72J06K10r0k54L70o4k65k42L97l0Po7J15J14l71K47
7237Ij57L19k14J38k62L01J08k12J19j22J04j80j57K57k04J44j05K26k83J93m7
7258b5J30J32k96J54R8j22Nj0k31O3J79Qn6M3k97K01J23j6k48Q3j6J05j7k1K48
7283B17m20K77j48L01J29m33L6P4j2k09K7K80k1J76k64J95l04j9K02j21j2Mj62
7306b07L05mk47J32k19J68J30j88kJ19kj29q9J46J99j53R5J53k59l5J31K1k2k29
7330a86Ql1K22l43L26Q1L8q5o4l24M81k38K1j80M03j60l7R1ON0R9p2j69K47j68
$$ y = [19, -41, -72, -223, 78, 124, 80, 111, 24, 97, 197, -62, -67, 244, 211, 249, -133, -149, 202, 46, -115, -25, -203, 82, -62, 218, 120, 38, -60, -32, -37, 250, 131, -294, -42, -26, 124, 71, 44, -127, 6, 69, 28, -94, -92, -147, 177, 0, -164, -41, 73, -42, 133, 163, 49, 129, -2, -174, -68, 142, 52, -202, 168, 104, -161, -403, -6, -36, -29, -96, 19, 133, -238, 9, -148, 171, -43, 95, -167, 134, 242, 30, 149, 27, 131, -49, -206, 51, -153, -9, -114, 112, -171, 22, -25, 105, 237, -59, 95, 193, 71, 76, 66, -165, -102, 77, 85, 29, 72, -225, -24, 99, 83, -165, -82, -98, 7, -10, -31, 217, -203, 74, -74, 227, 356, -77, -41, 33, 21, -188, -161, 119, 98, 274, 10, 205, -99, -118, 84, -37, -49, -45, -207, 98, 94, -153, -21, -240, -72, 58, -130, -132, -13, -15, -144, -233, -87, 112, -41, 54, 207, -52, -87, 44, 65, 43, -186, -178, -209, 13, -330, -4, 77, 115, 30, -34, -358, 123, -115, -94, -274, 129, -31, -68, 23, 29, 79, 178, 106, -63, 184, 16]
7355A6J65rp4k65L99k94J72J11j13j59n9L46ok70M7j47O6J49j24k1j21J61pN2
7379A5r1J8j72J3J50O4o1J21Q4k38K92k56R6k5j57K66j85K30r4N1j17M3j31NJ81
7404A02r2k0J60k43K34l4k60K42R0l75K36k09J74J97k66j56K85n6J47k20J5R1
7426D2m0K66k30k72K32J10q2J01j61N7Nk15J47K00l37L48j74J5R2j3k37J83j1
7449B6P2j61J12l0J28k61K57J1L5K05n88M38j84P7L0J67m85J52J31J45k00j06
7471b9K07j05P5l63J62J26o4j14J52L3q3j78K50pp9lM3k37K73j11l0j64J58j85
7495b73K52OJ50j50J6l8Qj24K71j34m5k9p7J49O0j32L13n5k33M7J56j34M5M9r
7520H9j12J71j70J10M1J25l45J47mj77R5J5R4o8J22n37L05L50l14o1Q0n9J92j60
$$ y = [16, 181, 172, 98, -167, 232, -62, 110, 221, 108, -51, -110, 236, 230, -40, 7, -140, -74, 75, -49, -70, -191, -30, -37, 15, -76, -58, -230, -217, -67, -3, -64, 57, 141, -97, 195, -61, 35, 10, -147, 119, -66, 164, 70, 121, 4, 47, -84, -79, 102, 10, -10, 150, -93, 141, 107, -153, 89, 179, -196, 40, -169, 5, 202, -64, -220, 65, 9, 156, -64, -49, 42, 2, 268, 38, -234, -2, 108, 26, 127, -34, 23, 28, -187, -40, 160, -177, 171, -3, 12, 104, 91, -146, 37, 26, 98, -63, 49, 19, 147, -114, 143, 154, 189, 394, -194, 244, 60, 137, 167, 334, -151, 1, 132, 277, 77, -29, 178, 73, 148, -215, -53, 73, 9, -105, 47, 80, -3, -181, 69, 62, -17, -20, 23, -214, 59, -52, -82, -246, -88, -273, -21, -15, 135, -15, 1, -37, -29, -153, 118, -16, -61, -90, -167, -18, 42, -90, 223, 168, -65, -18, 138, 4, 49, 98, 89, -23, 148, -22, 88, 129, 254, -91, 56, 52, -125, -30, -15, 79, 11, 133, -404, -99, 251, -63, -124, -44, -103, 89, -71]
7544g1O1R0N7m7L6k30N6K03J9l29J76p7Q1Kj24O5J52j25P1N2j76J99L2k19l6K93
7570B11j60k5J17j10m9qrj2P3j76J8L04j32K3o8J2k57L84j20j95LL62m06L31m4
7595F7k75K6K91J8K17k03n8Q9j56p4J30k98L52j70J06qj38K50k27j34K38k96L26
7618G3j37l6J13k11L51k46J5J71j50J14m27L96j9jp6J6q3K27j56K36k65O3K05
7641A73m3j5j49rQ4J62k23J87L3j71j63K50j98l0J73j29J51j44K76k54m0o0J92
7664E3k47K66j10K75k56OK76k47k5m6K99k47J01k69J29J9J22M9m02L71P5m13m
7687b25L58k27N0j03P5N9J30m7l86K72k9K85k71K67q3j0P9k87M01k19j72K13P2
7710B02k31j32K25J37k81R1j44Mj36L02N2j47J67k00j38L62mj61l25K97%k8O3
$$ y = [-71, -10, 80, 137, 90, 126, -104, -48, 155, 174, -155, 21, -56, 25, 27, -97, -32, 120, -5, 66, 118, -58, 141, 173, -46, -82, 211, 51, 26, 143, 33, -16, -24, -33, -45, 28, -148, -130, 174, 42, 65, -3, 9, -248, 136, 16, -179, -176, 186, -220, 111, 67, -208, -182, 109, 127, 344, 141, 83, 172, 16, -58, 72, -226, 126, -44, 62, 54, -84, 166, -61, -195, 43, -253, 73, -64, -100, 13, -198, 153, -93, -78, 93, -57, 57, -370, 26, 7, 6, -70, -54, -137, 90, -66, 170, -95, -32, 173, 130, 115, -34, -43, 41, 203, -20, 167, 200, 29, -134, 116, -82, -112, 61, -68, 83, -61, 215, -39, -79, -139, 53, -194, 72, -38, 237, -19, -13, 263, 16, -9, -55, 244, -3, 98, -171, -42, -23, 99, 148, -254, 117, 192, -221, -225, 133, -94, -44, -147, -72, -13, 117, 70, -316, -44, -73, 212, -59, 208, 125, 115, 194, -93, 308, 89, -83, 130, 202, -29, -161, 64, 201, -80, 11, -133, -129, -265, 37, 89, -58, 109, -91, -229, 133, 129, -32, -357, -60, -60, -88, -25]
7733b5K65k61J55k60K57j73P1r1J87j93J09o2k38N48j71J6j47rk8J50o8N4j31
7756d5j17K01j24K17q2j29qJ40r6nJ33l12L67l55L54p6j04o1J8K02J00k01n1J54
7780A20j06Q8j61p4K97j80r2J42j23j1o8L67m0l63L85j72%j58N9J69k13Q9J0K31
7804A96q3j39j80N68n45K39n0j13O8k5J27j69Q7L43k58m1q6K85l89K89j95K10
7826A39M2l86J34L33k95k5J8j62K90k02M0K36q6J31m77Q0K38J25m6J6p1j42J53
7849H3l01J13l4L01N7l49L60j48r3j1O1N0mq4o9L19j53k10j05N4K76J29j21j75
7873e4j31L4L02j03j25J42j83K87j37J23q4j11J27K6qj34J6q5J07j24K35k69J11
7896c8k32N31q4R6p1j22J20j51J35o6j57pK1J04k82J51K03K1k19K98k79N8K88
$$ y = [-25, 240, -21, 134, -126, 131, -42, 29, -62, 125, -68, 41, -21, -259, 289, 118, 134, -13, -22, -50, 100, 32, 86, -45, -162, 39, -85, 132, 50, -79, -87, 53, -43, -48, 85, -227, 140, -215, 139, 63, -41, -102, -84, 118, 218, 17, -34, 120, 14, 102, -59, -133, 164, -16, -108, 34, -89, -100, -168, 199, 159, -204, 181, 9, 9, -149, -90, 79, -134, -45, -35, 196, 113, -26, -206, 362, -183, 56, 6, -107, -39, -64, 63, -106, -19, 324, 66, 25, -61, 224, -165, 124, -71, 139, 181, -205, -71, 262, -33, -58, -40, -202, 88, -114, -74, 162, 76, 207, -270, -190, 48, 173, 127, 143, 72, -70, 83, -218, -105, -139, 162, 219, -130, 230, 82, -11, -22, 39, 89, 85, 1, -68, 251, 98, -112, -217, -163, 113, 242, 121, -54, -185, -151, 151, 48, -77, 65, -118, 169, 32, 155, 71, -40, 87, 113, 105, -29, -13, -98, 9, -115, 120, -149, -38, -270, 261, 177, 273, 202, 80, 200, 49, 184, 118, -39, -46, -25, 79, -203, -52, 151, 172, -47, 251, -28, 30, 318]
7919C18j36n8Q1m66K41k7m6J08M3p0j75L46k30J85rj70J20j31q7jQ1J19q9mK65
7944B08k86J04J56j05L6j47R2m1Q5n5J20l3j31R0k11J47o3M4j60J76O3j95J38
7967C2l8K10k22j41p8M36k15J22%j32O8l06K31K34j41j64J39l6O2j83J77j55K06
7990A06m3j38QJ76j93k11M38j56q4n2P2J60r6j74J91O6k6M5l53L36L5j7j27P5
8014C8J13k35L6j20J07j38KL35J71l65K47k95N1K58j39j07j25M1J54q5PJ40j96
8037a05m0R1o1R2L21j61j50K0j78J76J65k29R5j30J26K72ll16M7J8q8p1J13r6
8061i2L25k82J64Mj39r4J33M5k0N4j85rN9P7op4M6O4k28oJ33j67J18l7J47L74
8087D04n93J91j44K08n5q8j73L48rk54r1K61Q5r7j65K48r9L6K2L1k17J94J01J38
$$ y = [318, 182, 124, 205, -261, -20, -47, -93, 15, 58, -12, -187, 159, -71, 114, 105, -65, 55, -76, -163, -164, -83, 36, -53, -57, 208, -78, 26, 182, 77, 113, -34, 58, 17, 102, 47, 167, 134, 3, 93, -118, 29, -34, 10, -150, 26, 89, -106, 32, -6, 204, -18, -159, -237, 199, -16, 106, 106, -26, 42, -264, -33, 201, 60, -104, 35, -1, 61, -122, 55, -100, 106, 63, -75, -67, 109, -84, -295, 143, -13, -97, -149, -77, 83, -13, -187, 4, 70, 44, 89, -264, 72, 107, 90, -37, 38, 151, -84, -48, -168, -61, -199, -197, 138, 309, -56, 191, -104, -53, 205, 66, -41, -166, -125, 29, -56, -49, 91, -105, -145, -54, -115, -23, 298, 137, -13, 7, -171, 5, 170, -59, 36, -94, 32, 304, 301, -15, 32, 50, -38, -109, 4, -92, 233, -49, 115, 119, -20, -114, 19, 64, 44, 98, -87, -96, -37, 40, 34, -40, 6, 70, -158, -164, -31, -198, -80, -117, 30, 404, -189, 2, -142, 66, 11, -77, -250, 98, 89, -165, -256, 5, 90, -7, -172, 76, -23, 13, 35, 66, -151, 43, 144, 282]
8111B82o7p9k04m4P6j46J64j18K05j2R9k89lK27j15p9Qq4L56l25J09J17M6l48
8135b24K50j27K18p7k6K72l73L76l70K0J73l09N2J17P7J48k94J6J51K16l71L13
8157B28k4p8J1j66K05l00J00K04p3r9J85o8n2r4o4J85J23j82o2KK37l51K5K13
8181A05k2l3ml0k24K71J09r0j82P7
$$ y = [282, 215, 136, -68, -112, -36, -182, -18, -136, 69, 57, 156, -133, -136, 91, -24, -103, -95, -179, 177, -148, -39, 78, 124, -224, 26, -101, 117, 40, 14, 286, -87, 289, -81, -61, 112, -197, -145, -28, 49, 197, -97, -81, 70, 286, -85, 228, 204, 126, 137, -29, 176, -124, -24, 180, 107, 8, 193, 125, 73, -21, -85, 100, 223, 41, -21, -19, 218, -133, -108, 105, 83, 50, 46, 16, -208, 63, 172, 82, -100, -23]
8191b3
$$ Imaginary data points
##PAGE= N=2
##DATA TABLE= (X++(I..I)), XYDATA
0@%%%%%%%%%%%%%%%oJ4j6J6j6J6k4L2l2L9m7N4o2P1q1R0j04J19j34J51j70J92
37A02k16K41k68K99l32L67m05M46m93N46o01O60p29Q04q83R75j078J190j320J468
57G73j636J834k072K355k703L149l738M549n747P689j1320K0293p9229j05717
71a71520K45601N478j79672Q1024R7485j26083L8541Q7897j35013j5053J60405
82H9090m6649r8333Q9667K5647r7278N4539M4938j17302L7709J25767j03192o4185
94e9582J14282k6315r3657Q2904K3854j10141O1299R5312j34690l6832J44352
105F0786n5751j06765J17499L7282j22088M5270Q8262j09761k4142J27111n1845
116E858q6074J18416K7256j22520L4649Q3089p1224k2471P2339k9407k5372O7666
$$ y = [0, 0, 0, 0, 0, 0, 0, 0, 0, 0, 0, 0, 0, 0, 0, 0, -6, 8, -8, 8, -8, 8, -16, 16, -16, 23, -24, 30, -32, 39, -42, 48, -56, 63, -71, 80, -90, 102, -114, 127, -141, 158, -174, 193, -212, 234, -259, 287, -314, 346, -383, 421, -462, 513, -565, 625, -695, 773, -863, 971, -1101, 1254, -1449, 1700, -2038, 2511, -3236, 4453, -6867, 13426, -65803, -171520, 74081, 79559, -100113, -19089, 78396, -47687, -9146, 78751, -56262, -71315, 89090, 42441, -55892, 33775, 59422, -37856, 16683, 61621, -55681, -17972, 107795, 4603, -59582, 54700, 28385, -65272, 17632, 41486, -68655, -7356, 87956, -46734, -83566, 60786, 5035, -101730, 15769, 53051, -69037, -23767, 64495, -45266, -69408, 57703, 5858, -80216, 38200, 65456, -57064, -22415, 60674, -10550, -33021, 39318, 9911, -15461, 52205]
128E2205l7920o5848Q4572J7801j00152M3340P6500q5544k3050R4916m6491p8283
140f7954R1059K6329r8961L6340O6337p9224j1921Q1032n0843n4609R2500J0002
152D0087r5355L9860O3006p3461j2270P0470l5440l6308O5641o050o1422M2086
164H44K8163n9033J7787M9317n2978j0518O6971l1698n1480N9027J3753o0030
176b9875L2636L7668o3650N592O9418n1072m8430P7464J1123p4519K7884M7467
188D1706n2638p996N0433l2508k7742N3404p209n0311L5873K2869n1072Q696M1185
201B4690l6788j5961M5899j5591l5998L7784Q363m2416K1935K8733m0519P97M2478
214B3406k8599k3931M8141k178m6309L2195L1573m5568l248M3597k1243k2517
$$ y = [52205, 14285, -51563, 33009, 50810, -49342, -6002, 70498, -15046, -38096, 56820, 10329, -67954, 23105, 49434, -49527, -13187, 53150, -26074, -37995, 43037, -7806, -62415, 30085, 40087, -55268, -15408, 47598, -25863, -38133, 32337, -3103, -39411, 26230, 20180, -41242, 844, 29007, -30026, -12239, 37078, -15900, -26418, 40553, 8855, -42625, 16402, 30155, -29875, 2761, 40429, -23221, -17629, 51789, 717, -47713, 29751, 40874, -33645, -5761, 41706, -10932, -18928, 31505, -1003, -28745, 24659, 17450, -32861, 3012, 25881, -25191, -16495, 24690, -12098, -28059, 17840, 2249, -33749, 4035, 12398, -30018, -8083, 20650, -19869, -19072, 23406, -5193, -29124, 19017, 16839, -29470, 2725, 34298, -11270, -14518, 29079, 7836, -14681]
226a4681L5343m171l2589K9348J5525m2519N786L6901k5311k0563K9522m033k3301
239a4743K0208K814k8029J5490J9097k9970l090K9441j5581j7692K6701j256k6111
252b2721J9853J6334k9097K136K8473j6375j4193K4848k155k0853J9008J0360
264A5618k5607N230K3635j6802j2696K0692r0j6672J0637N526j4577O232J0200
277A1326j4909j557J5759p994j0686J3451R80j3398Q738O304j3414K266J2161
290I027j0267o370J3184k746j1628R403M692j3533K439J0985r215o468J0772l12
304c7q947M719L971n869J843M645m719n58O913j325l828M573K348k560J743J773
320D685j366J491K326k859n0L254j663k759J818N57l106K94N35k579j233N04n68
$$ y = [-14681, 20662, 16491, -16098, 13250, 28775, -13744, -7958, 28943, 3632, -16931, 12591, 8558, -14743, 5465, 8279, -19750, -4260, 14837, -15133, -18223, 11218, -4363, -22055, 4646, 3390, -22721, -2868, 13466, -15631, -13495, 14978, -1397, -15590, 9258, 7103, -13750, 5258, 15618, -9989, -4759, 18876, 2074, -10622, 10070, 9980, -6692, 3945, 9471, -5106, 1126, 11326, -3583, -5140, 10619, 2625, -8061, 5390, 6370, -7028, 1710, 8014, -5400, -3134, 9027, -1240, -7610, 5574, 2828, -8800, 603, 5295, -8238, -5799, 5186, -4029, -10497, 275, -37, -8984, -4265, -294, -6163, -4320, 325, -4394, -4952, 1961, 636, -3192, 1381, 3729, 1169, 2912, 4685, 3319, 4810, 7136, 4277, 4227, 7481, 5818, 3059, 4877, 5434, 2328, 2622, 3157, 578, -655, -151, -719]
337g19k061j231N82K61j842j222J759P3k104J991J348k586J482L900k271j788
353d428N781M99m671L620L712m575M89N376l019l101N568j008n021M281K063o643
369a077J552N635o089k776P025k515n322N797Q85p646M701N194q579k74R297n396
385D12n853Q941j40r540O253N266j0580N77R826p298n710J0343k146r907Q900
400f56M203j2082K729J0307q562l786J1486l941p487J1265K237j2550O647J0449
414A0259j1073j662J2545o409o625J2643j126j3634J0035Q079j4576l60J1816
427I912q979n875J2355n589j1814J2255M389j7111L073J3481j1812n256J3577
440B606m898j0126J3137K345j4720P318J0930j2390j027J4527q175p742J5215
$$ y = [-719, -2780, -4011, -3429, -3168, -5010, -6232, -4473, -4400, -6504, -4513, -3165, -5751, -4269, -369, -2640, -4428, 1353, 1852, -2819, 801, 4513, -62, 427, 5803, 2784, -317, 5251, 4243, -778, 3503, 5566, -1077, 475, 6110, 21, -2755, 4270, 1755, -3567, 2230, 3115, -4531, 170, 5364, -3215, -3489, 5808, 412, -5441, 3500, 3360, -6180, 73, 5339, -5241, -4664, 5162, -2136, -7846, 2497, 351, -9556, -656, 3547, -8535, -5806, 4501, -4061, -7847, 3639, -302, -7789, 3476, 5713, -6837, -190, 10259, -814, -2476, 10069, 3660, -2965, 9678, 8552, -5082, 4953, 13032, -1544, -1904, 9912, 933, -4942, 7413, 1824, -9990, 2265, 6654, -10457, -7384, 6097, -5715, -10971, 2606, -2292, -12418, 719, 3064, -11656, -4338, 6592, -5798, -6825, 7702, -473, -8215, 7000]
453G000o01j4480J0657Q444j5505K599J4111j1971p584J6486k687j4349J0768
466B888N833j4171M743J0780j4298l116J7217o814j3541J4296L789j5053O670
479g77R046j5164J136J7016j0777j1817J6108J985j5615O579P259j2266L352J2046
493H111j3516n559J7234m460j4621J2531O080j4988O104J2595j4712l934J7577
506H442n164j2432J3428M363j3414P030Q659j4106K66J4979r147q530J4985j518
520G841j4515J0435O144j7387K810J6077j1377r292J3692k497j1974J0100K998
533C055j4616P509J2440j3898n179J4362m692q823J2172K87j2152J0937Q714j6713
547f597j523J7162o874r365J2871M51j0504P519M575j4063L499J2918r976n302
$$ y = [7000, 6399, -8081, 2576, 11020, -4485, -1886, 12225, 254, -7330, 9156, 6469, -7880, 2888, 8721, -5450, -707, 10073, -4225, -7341, 9876, 3062, -10479, 3817, 7606, -7447, -777, 8269, -6895, -5759, 11257, 480, -11337, 4771, 6756, -8859, -2280, 4979, -7287, -3935, 8111, -5405, -10964, 6270, 1810, -12811, -280, 5800, -9188, -3084, 9511, -5201, -9135, 8442, 3278, -9154, 4274, 8637, -4777, 2253, 10912, -3194, -2928, 12051, 2904, -5626, 9359, 7841, -6674, 3761, 9905, -7482, -4672, 11405, 28, -9264, 4428, 1931, -10043, 57, 3055, -11561, -4052, 8388, -5510, -10689, 3673, -1019, -9842, 2330, 2617, -9535, 1402, 10116, -6597, -8120, 9042, 2168, -7197, 5674, 6125, -4379, 3140, 7715, -6348, -2849, 10069, 93, -5209]
561e209J3639m056j1333J0620J870j3538P186J1882j3231l754J4015n695j1102
574h706J0559K989j0379O613O144j1827M93J0383r739o074J4171j102j1691Q022
588a44N289j2833K139R930r575k122J3436l893j0883R291L839j1009M084Q718
602F267q252J13J0713o896p637J0562J031j0308O737O992r892K06Q415p993n507
617e449J0212l56q987O626L299r439J266O278q166j685J0090l839o652Q373L41
632A912j0187M876P436q268j043J0206m004o304O883j01p161O525M359q128J699
647a300Q042o606m755P544n56n809O295K052p638K780N516p066j962P646k232
662A951m189N863k63o970M333L873p189K45P357m004m130N393r97n919M717K793
$$ y = [-5209, 8430, 4374, -6959, 3661, 5531, -8007, -821, 11061, -2170, -5924, 8091, 2396, -8706, 1853, 4842, -5537, 1076, 7220, -4607, -4114, 6269, -3470, -9544, 4627, 3525, -8166, -144, 5145, -7688, -5549, 4381, -5194, -7316, 6120, 2227, -8656, 635, 4474, -6535, -2451, 6267, -1985, -1872, 8841, 1945, -5692, 4870, 5901, -4407, 2330, 9322, -570, -364, 8051, 58, -5449, 4763, 4407, -4580, 2046, 5345, -4094, -2828, 3450, -4716, -6401, 3689, -150, -6802, 1571, 1912, -8275, -3399, 4037, -4231, -5274, 4932, 928, -5376, 1507, 1406, -5755, 770, 5129, -2999, -1300, 6742, 136, -4619, 2925, 2369, -3440, 2855, 4907, -2731, 49, 5565, -1501, -3463, 4183, 1951, -2238, 3625, 3362, -3608, 725, 4598, -2591, -2346, 5011, 1007, -3123, 2270, 1273, -4646, 71, 2864]
678B864p249J907N923n123l556N702j063m490M649J532n184K733L399m652o79
693c287N481k392k581N499k86m965L841K797m860P89M436k878j969M510j577m029
709a471L954R62n086J681L804m026j703M010j737l750L669M65l786J931K400l599
725b282m79L223j662j958L490m04k629K202J657l340Q37K867k391p47L457j630
741B11j958L083J97l560K133K436l172m20L236j356j906K486J90k517K069J169
757B321k280K78K089j684j022K167m65k287J777Q85k450K74J345j816j80J201
773A53j080j159J751m34j900J294J041k106K71J995j397p05K167k80j188J642
789F5O32j739J235J565j390k96J855l85p27J224N0j276O43M81j217L13M94p79
$$ y = [2864, -4385, -2478, 3445, -1678, -5234, 468, -595, -5085, -436, 1096, -4088, -1355, 2044, -2608, -3287, 2194, -198, -2779, 2720, 2434, -2531, 1310, 4107, -753, 36, 4472, 1594, -375, 4135, 2558, -1471, 2483, 3445, -1641, 40, 3844, -182, -1885, 2125, 388, -3362, 307, 772, -3014, -1083, 1317, -2282, -2761, 462, -1200, -3158, 332, -72, -2701, -499, 1158, -2182, -1345, 1522, -869, -1616, 1841, 211, -1747, 1336, 1533, -2027, 106, 2542, -630, -1050, 2186, 830, -1076, 1410, 1600, -917, 1152, 2321, 41, 319, 2408, 724, -298, 1869, 1404, -883, 894, 1779, -671, -397, 948, -868, -1048, 153, -927, -2086, -335, -769, -2669, -1375, -334, -2440, -2169, -174, -1571, -2276, -109, -389, -1577, 65, 697, -1042, 193, 1758, 368, 72, 1927, 1542, 815, 2039, 2089, 813, 1456, 1937, 720, 1033, 1527, 748]
807G48o51J046q36r59R94l6j413N38N34j134k03J020l91n85Q61j16q62O90O82
826g3o82k46J068k95o04R05l07k18M54K0n82K53P05m64j88P89m33l39O96K33m51
847B41P7N56n46K31M78J05k82K79r9l23N06j06n85m5M49n13n39M43m95k26j10
868e04m5m04J72oo50j22K78O2l90L17M89l05M89n7K17m5K93L07J09K45M59l33
890E76N69J22l46j15K01K96k71k36K20o0l16K9k06o13M50K03n32j13l1j78k07
911e58K84l00p3L08R7j95j52K35r8k53O00k77j91J57N86r54K93M92k06l49L76
932a78L25q23N75L12o90J93P27m01j24N64j13m59R75M44j351Q74Q04j123J87P61
952A479o06l86P86r8j238N86K57r44j49N29o37o30R23p24r81J313L71j759J60
$$ y = [748, 97, 1143, 307, -652, 342, 306, -1107, -569, -35, -1169, -1372, -352, -743, -1328, -467, -583, -1445, -755, -73, -755, -1001, 67, -228, -832, 73, -234, -452, 2, 22, -560, -307, 398, -66, -254, 535, 102, -237, 459, 692, 241, 318, 874, 328, 559, 1037, 1142, 860, 1139, 1040, 717, 1223, 1117, 532, 487, 936, 423, -116, 327, -168, -394, -504, -549, -953, -781, -787, -1437, -1559, -1281, -1219, -1609, -1292, -803, -1108, -619, -676, -459, -504, -211, 96, 205, 450, 909, 576, 1145, 1267, 921, 806, 1007, 1303, 1032, 796, 1016, 956, 640, 669, 463, -150, 300, 503, -29, -142, -173, -351, -558, -274, -574, -647, -339, -242, -437, -589, -354, -452, -705, -105, -382, -573, -416, 170, -784, -491, 1, -205, -554, -178, 147, -676, -101, 211, -479, -286, 441, 40, -84, 480, 367, -92, 883, 1327, -24, 850, 1654, 531, 718, 1479, 873, 487, 1273, 1175, -63, 523, 780, -164, -313, 216, -421, -1051, -128, -852, -1833, -520, -149, -1908, -1748]
971a748J364q15m37J312l80q21J376L80j127P80J295j354K87J205q19m96J698
988A700n66j085Q58Q36j669K13J580j666p15J860n47j788J313L84j551O45J370
1005A172k066k04K007j251j313J935O3j782J049J331k031Q9J860j148j456K657
1021I12m76j779R60J193k234O79J926k101m57K494p75k394K455P48k302Q41K223
1038A913k253J45K107j225j551K530J89k222J350J222k258p5K162j767j336K474
1054A405m27k795K276P47k942K00K207j830n71K562j454k042K501K69k740J447
1070a187K432k303j52K699j826j294K789j9k760K422J715k980l8K678j991j497
1086a312L297p12k422K287J022l413O81K376k630j86K778j432k042K620L25l135
$$ y = [-1748, -384, -1199, -1636, -324, -704, -1525, -149, 231, -896, -116, 1179, -175, 112, 1317, 498, 2, 1700, 1134, 49, 907, 1743, 74, 287, 1867, 201, -514, 1346, 799, -989, 324, 708, -843, -198, 1172, -894, -1098, 909, -342, -1655, 280, 343, -1439, -390, 941, -1090, -1001, 859, -289, -1745, 912, 436, -1343, -383, 810, -1424, -745, 1181, -920, -1377, 1117, 342, -2052, 403, 1151, -1151, -310, 1913, -340, -195, 1912, 687, -864, 1666, 1855, -367, 983, 2205, -53, -128, 2034, 267, -1069, 1405, 978, -1817, 459, 1206, -1736, -1536, 671, -1159, -1730, 832, -622, -2664, -163, 106, -2634, -1187, 1245, -1058, -1210, 1489, -337, -1631, 1158, 1139, -1621, 801, 2516, -464, -502, 2176, 185, -1312, 1985, 1273, -1149, 1138, 2160, -1253, -572, 1804, -826, -1012, 1766, 334, -1708, 912, 1237, -1898]
1102a898J137K755k756l9K793k552j610L351l19l339K547J513k850M70K419k752
1118a130j143L395j128k391K996J115l631R05K332k526l71L042r89k094K960N98
1134A940l594J744K096k671K37L032k228j500K930m05l127K201J785l282P09K520
1150B387k868j268K959j001k746K867R59l393Q01K340k642p72L176j320j636K879
1166G22K57l122J481K086k692K55L010j926j356L289r18k933K572R97k582O71
1182a89K752k533j426L313j020k824K931Q50l009J056K187k788o49K781j384k048
1198b000L152L37l329J715J751k773q7K722j754j219K693m47k723J783J421k874
1214a632Q22K207k152j052K720r69k208K554Q57k764J008K599k681m48K867j336
$$ y = [-1898, -761, 1994, -762, -801, 1992, -560, -2170, 1181, 862, -2477, 70, 1583, -1267, -797, 1622, -1130, -2273, 1122, -6, -2397, 599, 1714, -1917, -1012, 1320, -1206, -1577, 1465, 476, -1618, 1342, 1940, -1654, 90, 2186, -485, -248, 2784, 556, -944, 1986, 1581, -1546, 655, 2440, -842, -133, 2387, -481, -1749, 1210, 209, -2537, 330, 1289, -2104, -1303, 1037, -1605, -2377, 799, -521, -2157, 722, 979, -2143, -662, 1424, -1268, -1013, 1997, 71, -1285, 2004, 1086, -1847, 725, 1722, -860, -189, 2563, 30, -1396, 1917, 897, -1927, 1004, 1854, -1155, -99, 2088, -700, -1349, 1432, 48, -2000, 1152, 1489, -1840, -125, 1626, -1147, -1234, 1488, -266, -1485, 1208, 761, -1962, -179, 1242, -1632, -810, 1397, -755, -1807, 913, -56, -2264, 290, 1147, -1617, -609, 1990, -691, -1139, 1728, 392]
1230C92j693K494P41k711J356J558k625J06K510j745j502K726m67k427J925O79
1246A317k576K39K296k139p59K450j185j798K120O68k541J222J620k105l02K417
1262I44j105j538K271L28k386J585J399k128J5K124j455j149K236l32j884J714
1278F39N43j855M75J606j405q22K002q49j419J616L43j629M91J694j776n86K168
1295A236q01j341J522Q6j711P54J171j509l20J741j159p44J392l09j254R96P18
1312D68j535M12J362j357k78J457m60j059J166M87j292P33J059j001m27J519m29
1329H25j185J230J55j074O26O79j368O1Q71q34n65Q96j96p30L06L87o30j74Q35
1348A15n91l31P53J56j159Q47K73o64J25P42l54o10J027k13k99K10J17l02J51
$$ y = [392, -1301, 1193, 1934, -777, 579, 2137, -488, -382, 2128, 383, -1119, 1607, 1140, -1287, 638, 1317, -1259, -1020, 1276, -863, -1622, 828, -357, -2155, -35, 633, -1908, -686, 934, -1171, -1473, 944, -161, -1699, 572, 900, -1486, 99, 1498, -630, -615, 1509, 54, -1095, 1141, 809, -1075, 639, 1182, -673, -198, 1408, 3, -819, 1183, 334, -1085, 531, 874, -755, -264, 1430, -346, -932, 1236, 435, -906, 616, 702, -1009, -255, 916, -593, -913, 828, -331, -1075, 317, 8, -1246, -250, 468, -1067, -655, 707, -650, -928, 529, 69, -990, 176, 663, -629, 104, 1163, 162, -265, 1254, 825, -360, 870, 1025, -49, 577, 1256, -112, -51, 820, -14, -579, 317, 121, -609, -303, 84, -546, -720, 115, -476, -807, -54, 102, -1057, -210, 63, -601, -476, 266, -88, -698, 329, 116, -183, 27, 144, -158, -7]
1367gL21k15j65L20k25J3K71j24o17N45J80l33j81L46J48k48J19L4m09M40K87
1388E00j30m47K39k0k32K84j59k74P3j57K29k89P9L35n3o05M82n5l58J00J31l56
1410f83J92M52k68j55M11K57m14M42K77l67r0N55j90l70N33J18n93M45K13p70
1430eR7O94p08m34Q16k95o24O49q2q62M76P29j183L0P78k41p91R33J15j075O75
1451c08J255j419j35J202o82m22Q17J11r37N53M80p45O5Q78q52o59J501m70q61
1470f28Q44O16j378M68J134j160m00J320m04j034J206M26j813R04R21j394MJ437
1488A069p74j102J293J51j638J140P02j749K95J420j155r86J479k47j398J337
1504a63Q00j665N72J302j419l58J745q01j031J657P79k323J209J165j861mJ754
$$ y = [-7, 314, 99, -66, 254, 29, 42, 313, 189, -428, 117, 297, -36, -217, 129, 277, 29, 148, 182, -227, 213, 500, 370, -77, 162, 142, -90, 194, 35, -239, -166, -323, -94, -383, -304, 31, -22, -627, -145, -200, -558, -458, -327, -683, -491, -39, -307, -462, -51, 206, -208, 234, 511, 144, 54, 609, 419, 49, 582, 700, 107, 552, 765, -5, 92, 786, 78, -356, 460, 165, -459, 190, 108, -754, -278, 451, -732, -702, 76, -165, -956, -23, 92, -983, -308, 947, -472, -607, 595, -87, -509, 308, 419, -518, 35, 515, -230, -165, 713, -139, -798, 703, 233, -628, 216, 832, -546, -78, 1056, -104, -504, 816, 412, -622, 584, 1010, -803, 101, 1022, -372, -368, 1069, 295, -807, 486, 637, -1001, 139, 841, -908, -613, 807, -348, -1334, 145, -102, -1500, -163, 637, -1028, -456, 846, -573, -931, 814, 13, -1018, 639, 1418, -905, 304, 1469, -392, -396, 1358]
1521A358r22j202J836j26j901J357Q28k066K72J752j522o81K000n97j807J437
1537A6R29j863J50K069k129j27J941q82j615K003J21j693Q85J226j553l92K209
1554A295j604r50K215j25k090J224J273k514N67K014j500r73K036k80j777J399
1570B10J125k001L67J866j920l78K160r92j585J952M05k085R21J458k263O8J617
1587I25q56j519K015J83k329J665P27k187L28J931j432r03K104l21k065J833J071
1604A170k310M96K176j906l72K170j090j400J911O38k286R44J390j916j13J681
1620A183j156j216K010K56k317J215J189k240L33J880j468q02J891l91j757J501
1636A11P35k033M94J917j684o39K454j280j511J954J26j830P63J673j788n12K433
$$ y = [1358, 436, -766, 1070, 944, -957, 400, 1228, -838, -566, 1186, -336, -1017, 983, 386, -1421, 16, 945, -918, -768, 1301, -828, -955, 986, 104, -1511, 492, 613, -1080, -195, 1031, -522, -914, 1295, -309, -1259, 956, 831, -1259, -35, 1238, -1276, -709, 1305, -195, -1168, 868, 588, -1189, 210, 1335, -666, -299, 1567, -353, -731, 1429, 437, -1148, 804, 1209, -876, 45, 1503, -760, -692, 925, 69, -1450, 565, 748, -1581, 84, 811, -1376, -1048, 883, -549, -1452, 652, 331, -1734, 99, 1170, -1140, -644, 1532, -374, -746, 1424, 334, -1066, 845, 1483, -803, 141, 1531, -385, -498, 1183, 27, -1189, 821, 1077, -1240, -25, 1164, -1076, -743, 1137, -331, -1133, 758, 367, -1390, 111, 846, -1187, -693, 1224, -460, -1099, 1355, 75, -1436, 518, 644, -1186, -423, 1250, -538, -1050, 1383]
1653A383j340j298J766O0j922J312J246j903K72J533j481p09K191n03j549J504
1669E62P12k029M66J909j974l36K031p09j503J512J80k133J300J022j564k56J579
1686G69r27j348K006l73j742J405J051j662p4J531j177n74J855n21j430J389R55
1703A133j893O39J279j197n73J783n14j479J583K77j644M64J036j260l49J792
1719A077j039j256J799k22j396Q67J071j672O8J592j051q16J961o23j329J174
1735B05N14j388L00J236j422j88J552o37j280J477J90j603Q00Q78q78j06R65p05
1753i0p64J376J53j587N88J366j474J17J273j019o74J597k56j131Q49Q20j450
1770c06M47O08p58m23R97m30p27J105M2j579O14R03r97j60J029p83m67R90r2r53
$$ y = [1383, 43, -1255, 511, 571, -1351, -39, 1207, -696, -424, 1109, -372, -1081, 1110, 607, -942, 562, 1274, -755, -289, 1620, -354, -690, 1341, 632, -871, 641, 821, -1312, -12, 1010, -554, -810, 769, -158, -1506, 500, 127, -1615, -210, 841, -821, -895, 636, -541, -1115, 740, 219, -1211, 178, 1133, -760, -121, 1158, -39, -612, 1171, 657, -822, 761, 1038, -606, -142, 894, -366, -715, 1077, 38, -1218, 581, 359, -1037, -170, 901, -771, -703, 889, -162, -978, 983, 360, -969, 205, 719, -669, -369, 867, -555, -743, 809, 172, -1108, 369, 559, -1044, -244, 634, -244, -350, 615, -90, -854, 522, 675, -912, -324, 1042, -432, -315, 958, -61, -735, 862, 606, -525, 324, 1144, -306, 141, 749, -9, -432, 565, 135, -592, 513, 555, -1024, -410, 493, -504, -664, 365, -418, -885, 105, 13, -940]
1790i40O04N88o86J14P43o05j64P82p7q12N26N92r26L55N90o91l23Q55q3p95Q38
1811D85q5r27K63Q17q77r5O80m35k80Q37n6p70M68L97o67k14O75l48j73P57k61
1832A91q51P89J42o16J80M41m36j72P14l80n75N15J94o72K41L76m33J3P52l90
1852B3l67P91on89K48K99k56J37J54j36l18O51j73m20J13J33J5l80K30k15J77
1873A11j74pm84K79K52p06N32L2j33j1K31j01J32m6l8l4J77K21j73M9J74l52J03
1896C4J46k54L27k7k23m7K19j27OL3j94L32r5k63o3R7L6k4k9J36J05j26n2K33
1920A80j67M3k2k09N10l86l2j1K24j37j44K21j34R6k05L12l04R4k44L2nJ22M7
1943a19j33K58LJ56nJ19l25N3J68j04K3J12J81j02r3oo5K48l24k23N8M21j79n04
$$ y = [-940, -336, 252, -434, -320, 423, -182, -346, 436, 359, -453, 73, 665, -261, 94, 684, -7, -330, 525, 442, -353, 485, 400, -527, -264, 553, -324, -419, 261, -174, -454, 383, 327, -443, 25, 422, -245, -459, 216, -132, -305, 452, 191, -660, 129, 271, -345, -165, 276, -160, -332, 382, 2, -573, -58, 136, -536, -295, 81, -352, -339, 413, 23, -344, 447, 441, -148, 100, 399, 143, 280, 434, 298, -20, 631, 458, 38, 151, 284, 299, -81, 149, -66, 111, -63, -70, -554, -275, -23, -729, -197, -165, -298, -309, -78, -179, -47, -93, -131, -165, 12, 233, 60, 109, 283, -69, 34, 180, -74, 253, 226, 3, -44, 175, 48, 54, 87, -107, 225, 130, -133, -196, -99, -63, -87, -116, 20, 125, -1, -53, 180, 13, 56, 34, -175, 335, -51, -83, -94, 130, -7, -151, 70, -64, 32, -173, 139, -165, -71, -315, -283, -288, -166, -119, -252, 6, 9, 165, 160, 279, -46, 7, 175, 71, 94, 206, 387, 285, 192, 186, 121, 369, 45, -178, -120, 301, 122, -382]
1967c82L74k14k22J43M52n22K5J90P7j88L13j64k17K66J99l86L13J60j8j23K49
1988C25k31l16K44N0l73L38J60k88P4K50M5o13M61j13k44K75L80o35l38Q37l33
2009d5n4M44l09m47P58j3o35M75M08r22M3O71l44m68P77k20o26N12L47p80J81
2030b47K49k47l03P43k05n24L36M81l79l69P20j92j92K28K57o48M99K94q27O18
2050B92K03k71j06L02k64l14M11Q1n52O0L61m88j09O19l32k22M12j05l44K10M51
2071B95p47K09M72k27m52L91Q3m22N44K27q70M15O67o81j77P45l42n20O04J67
2091C81o51R6L70n03J39M99m49j50O46M0o56L10J0m07k9O03l24j19N36j96l16
2112a70M38J48n93J43N59n19m01O88p5p34N50J65o69L26M05o94q4O53l33j25L01
$$ y = [-382, -8, -222, -444, -301, 151, -371, -346, -156, -79, -267, 46, -118, -335, -69, 130, -256, 57, 217, 199, 76, 325, 94, -222, 22, 72, -301, 37, 197, -91, -17, 233, 278, -335, 126, 13, -231, 44, 424, -211, -549, 288, -45, -99, 345, 36, -411, 347, 334, -301, 174, 582, -340, -297, 374, 30, -438, 339, 119, -507, 5, 352, -428, -247, 2, -245, -548, 195, -10, -534, -198, 283, -96, -465, 255, 63, -129, 99, 356, -292, 207, 501, -326, 292, 495, 224, 118, 420, 156, -158, 253, 334, -218, -158, 203, -285, -394, 225, -107, -329, 83, -22, -366, -156, 295, -452, -243, 229, 2, -450, -59, 24, -398, 146, 373, -497, -82, 585, -96, -273, 472, 130, -390, 214, 381, -270, -174, 196, -307, -168, 331, -118, -268, 378, 418, -238, 72, 82, -325, -354, 249, -75, -194, 342, 146, -170, 268, 416, -177, -34, 525, 6, -395, 293, 218, -516, 34, 199, -470, -144, 261, -433, -517, 136, -197, -322, -21]
2133b1n1l02L90J78l38K33K11j03j61J76J8k21L43r3l60J99L92o99J13L93l97
2154a00j65L83J71n02j6L74l78j3M83l51q2L50l6r9m3J61o15L96M64k96m42N73
2176B17j28m50N08Kl99J92K93n39l8L65r3l54L67K32m74K87K01k32O7O6j08j97
2198b15M41R8n44L95J00j89m8L36n17J83K78l25k20L18L5l11j55L74j75j07J93
2219e5j03k23N40k26l73K75J1j44J9M58l53o0M27q4k69L28p9l95K01K55J24n3
2241B21J12q7m53N47m30j21O8J78j81J41J74j87r3J24R4l40m8n8N43l17K63r5
2263E5k3O0K3k70K42J29Q2o8M4k74J55J38k36k17K14j05r2p8K54j51o9K10m1R8
2287H0n8n3J3N0K20k83J71q8J02j85P5K11j51q1l5M38n33K15k76p6L82n3Lm3j64
$$ y = [-21, -72, -374, 16, 194, -144, 89, 300, 197, 36, 212, 230, 9, 352, 259, -101, 98, 490, -209, -96, 297, -100, -265, 118, 289, -213, -229, 145, -233, -246, 237, -114, -196, 154, 118, 19, -24, 137, -478, -82, 382, 86, -356, 217, 89, -361, 147, 149, -250, -58, 235, -304, -342, 23, -70, -424, -57, 175, -299, -12, 189, -43, 24, 90, -18, -215, 226, 324, -220, 175, 275, 86, 38, 374, -143, 40, 318, -7, -227, 91, 126, -185, -340, 34, -141, -248, -55, -158, -381, 159, -67, -440, -165, -154, -298, -279, 179, -174, -234, 193, 109, -160, 168, 89, -306, -105, 150, 274, 221, 333, 246, -207, 340, -90, -211, -143, 35, -146, -5, 169, -18, -111, 13, 107, -233, -281, -339, 204, -113, 150, 55, 32, 92, 115, -155, 87, 216, 298, 230, 274, 0, 155, 293, 57, -160, 54, -51, -143, -221, 33, -118, -187, 23, -18, 80, 22, -31, -18, 32, 252, -31, 140, 52, 154, -31, 44, 255, 104, 23, -12, 426, -107, 108, -168, -244, 138, 85, 88, 45, -119]
2312a19j46l0L2J04%o8j07J54J93K05m23K86np7j44L33j57J6r7J79l96L21J30
2335A84pO5K2j00j17R5j98J30J31l26j39K15o3R2k7j45K3M6Q3r8R1J35J85n38
2359b61L75j26N2L8N3j10R9j21J33q1j17J48M5j12Kj09k29K05J44j18K31k07N6
2382a0O8K8K60l75j21K34r2J78O0l15P5L30k73Pn4j19K34J01k32oJ24q9j87J27
2406d7J10k81K26J36k72J77j54N8l24M38O7k75M5R2q2N6o7J26q3L09j08N8j49
2429E6k3J32l17J75J90j11j93J76k05K37q0k76L44k78J43j78n8k2J86J95j66Q5
2451A2Lp6j31Q2J08J04q6m3K0J48l71J35K94l28L38k47p9J36J04l40J53Omr8K1
2476a39J84j07L5P5k35N60m24P8J43o3j48o6J36J22j76K85k75n4J84r5J8P3P7
$$ y = [-119, -265, -295, -263, -159, -159, -227, -334, -180, 13, 218, -205, 81, 76, -1, -145, 188, 31, 47, -50, 129, -267, 54, 184, 177, 242, 264, 164, 47, 142, -56, 74, 205, -121, -260, -45, -108, -16, -43, -188, -165, -119, -36, -134, -43, 92, 277, -261, 114, -12, 40, 78, 131, 21, 120, -1, 132, 51, -66, 82, 127, 15, 17, -92, -321, -116, 28, -90, 141, -66, -10, 58, 86, 346, -29, -150, 84, -8, 170, 230, -85, -10, 320, 47, 54, 0, -119, 115, 216, -16, -22, 102, 13, -174, -47, 63, -218, 8, 144, -128, 49, -105, -47, -371, 67, 134, -141, -96, -4, -86, -30, -97, 29, -54, 255, 147, 205, 56, 33, 165, -152, 23, 213, 102, -91, 85, -120, 117, 37, -239, 105, -173, -30, -208, -266, -288, -102, 93, -73, 12, 15, -61, -192, -110, -2, 102, 16, -27, -7, 141, -230, -95, 199, -129, 209, -38, -117, 19, 123, -217, -64, -58, -62, -160, -139, 45, -62, -27, 48, -187, 373, -51, 27, 170, 107, -41, -107, 29, 151, -25, 260, -15, -69, 115, 20, 38, 111, 188]
2499A88l25J05L45m72q5J11O8j09n%J34j99K37R1k52J85N6j39J79M0Q8l24m8K47
2523A16r0K9p6k2N3P3K12l73K92l98J42J15n7j32O5k22L70j20j50j04P6L06j54
2546d9L16j33o1m7j23K06J20q6J50j64j47j45K79j17Q4k74R1Kq0K06k28K81p0
2569A1Q9m4o7m0o8K31J64m87N74j08k52L69l04J39k80K35m0o5Q5o6k40M76j19
2592A93l77L9J5n3R2J08l35oJ56K51l46L6L36l51K96p9J37l76O1K91j81J17K27
2615B51j52j14k9j79n1M58k91r0K42j24J77k31P2J10j10J81M4l44P6N3L9O4L27
2638C79k65k07L83Pk94Q3J92l89K96J12m2n48L35J0J10O0l0l35J3J72k83JK40
2661@k11K68j11J10m0Rq8o3K22J03k35j55M61m30K11J45K85n53J07K52j88j69
$$ y = [188, -137, -32, 313, -159, -244, -133, -65, -174, -179, -179, -45, -244, -7, 84, -168, 17, 73, -66, 113, 153, 241, -83, -131, 116, 26, 55, -21, -43, 10, 83, 295, -78, 214, -184, -42, 73, 16, -116, -51, -273, 97, -23, -173, -277, -201, 105, -49, 267, 134, 73, 26, -97, 109, 229, 143, 293, 129, -18, -163, 116, -1, 83, -191, -100, -98, -178, 28, -200, 81, 11, 100, 56, -11, -51, -119, 112, 276, -211, 363, 255, 3, 372, 68, 207, -73, 162, 122, 57, 142, 76, -164, 312, 193, -184, -145, -130, -183, -91, 17, -318, -324, -168, 83, -263, -227, 109, -242, 54, -25, 112, -264, -203, 88, -93, 24, 251, 99, -15, -44, -223, -274, 184, -107, -197, 45, -79, 98, -133, -61, 49, -61, 120, 164, -180, -104, -51, -12, 52, 379, 114, -93, 290, 297, 3, 86, 278, -111, 185, 297, 255, -293, 42, 52, 162, 222, 192, -143, -130, 42, -241, -240, 0, -211, 57, -54, 56, 16, 25, -63, -126, 96, 199, -36, -191, 270, -160, 51, 196, 481, -72, 35, 287, 99, -70]
2683g0K64m4m31K62J67l58K91Q6n28L22L5k84K74J66k14N9P1j04q3J24J42J5m01
2706b39K17o9P0lK66k01l84O90j57j42K63l28k3J32j22K24k29J01k35m3K59j10
2728f3p8M18o0j30j16L41l89j59O50m62o4P0J23j79k7L40q8k40J1J71m27M22k10
2751a46l6J26K42k73j33J98j98J15J28L2l13L50P5l2j89K09j24K08R2l34L5J18
2773A50L6j91J52O4K5j42k5k49L8K01J5l08j3L74k97M5J95l29J03J5J41k6q2K21
2797A13j69l2L77j85n9M7k12J5K47q4k45K61J41k40n6j33K15j78L01Qj39Q0J34
2820B07k52j51K59o9j92J83O3k48J67O5j09K49p1jl27K65O4j09K28j76r0q1J41
2843A5l06J14L78j37m29L25N6o3o8M2o0j42L63j79P8K62l56M3K04J60k22j92J35
$$ y = [-70, 194, 150, -281, -19, 148, -210, 81, 167, -361, -39, -4, -288, -14, 152, -62, -3, 68, -36, -119, 5, 147, 162, -239, -22, -91, -21, -24, 242, 41, -343, 347, 190, 48, 311, -17, -40, 92, -30, 194, -35, 66, -169, -212, 47, -63, -141, 277, 217, 87, -29, 312, -77, -236, 414, -48, -112, -42, 81, -98, -125, 215, 127, -113, -102, 69, -358, 64, -146, -182, -56, 186, -87, -220, -22, -220, -105, 23, 55, -258, 92, 167, 135, -54, 155, 31, 239, 331, -3, 32, 150, 186, -5, 147, 211, 236, 94, 69, -180, -142, 59, 74, -234, -247, 127, -170, -125, 70, -259, -156, -141, 0, -26, -108, 113, -56, -88, 289, 104, 45, 92, -120, -105, 142, 58, -187, 74, 215, -25, -81, -214, 1, -177, 124, 132, -7, 73, 207, -45, -196, 63, -6, -198, -15, 48, -200, -33, 32, -77, 172, 101, 100, -227, 38, 102, -7, 221, 45, -45, -126, 15, -291, -177, 201, 64, -365, -40, 16, -47, -115, -73, -133, -275, 88, -91, -13, 249, -107, -64, 140, 300, 78, -114, 21]
2866B1j86K9J73Q9n6J29m6j20J14l81J24J55k67M84m20N7J5j42o4K17J14l15N18
2889B42k02p5m8L09k12P4j17Q5N2n0q5j25J24L59k05k27J89p8J01j73J19j27l54
2912d24N09j05O2k8k39N8J36P5j65J72Q4l41L71j03K4o1J08k02j40N21l61j7J84
2935A18J8j65k43J0M25k01P5N4n13L06K35j07j70j5J11j42L35k19N8k48L4M23
2957A79l04K51j70K49Q1k47j0J18j27J47j89p4L64k52PO7l8n05L60R7lL1J25j44
2981A3l2L4O6k27L07J16k86k0K18k48J04L7l02L16n0J1k03K43j39k8Q8Nkj44K21
3006I8k43q9m3J79o9M12j82j02j91L86j59Q1m1O0Mm5J67k26L31l62j0J76j11L1
3030E2%Q7l72R0j33K21k0r4J4K45Rj97K13m23L36L8J0k22K80k08J24j07o4J57
$$ y = [21, -165, -136, 37, 126, 70, 199, 153, 33, 147, -234, -110, 45, -222, 262, -158, -101, -86, -228, -292, -75, 39, -276, 242, 40, -35, -83, 226, 14, 88, -29, 56, 108, 58, -27, -152, -28, 331, 126, -101, 88, 10, 111, -62, 57, -70, -424, 85, -20, 42, 14, -225, -167, -31, 44, -121, 51, 135, -206, 165, 62, 86, 25, 133, -69, -209, 312, -49, -66, 118, 136, -29, -272, -262, 163, -38, 37, 91, -422, -116, 119, 12, -158, -173, -62, -204, 131, -88, -30, -278, -244, 179, -125, 126, -44, 205, 286, 39, 29, 147, 20, 167, -22, -96, 268, 16, 23, 90, 52, -453, -93, 4, 1, 32, 157, 13, -19, 15, 81, -146, 161, 277, -9, -29, 189, -59, 45, 82, -220, 96, 46, 57, -146, 97, -42, -70, 18, 23, 21, -123, 98, -145, -234, -277, -98, -167, 245, 63, -39, -230, 156, -3, 78, 37, 97, 101, 56, 223, -3, 328, -34, -44, 132, 21, 52, 52, 139, -233, -143, -276, -55, -75, -169, -155, 90, 99, -98, 115, -308, 28, 66, 76, -146, 134, -74, 50, -57, -121, 36]
3054C6O7j9Q4j92o2K4K2K6J57j65J73J90o02J85J67k44j9K61j49j6K01j28j66
3077a69L86J00k30l09M77n17M12q6k8m06N49K8j06q6N5k4k2q7o0J08K7K22m74
3100b40K14j31j39L70k55N8j00L38k16n7K23k1O9J29m6K0l03K56kk77K59k04m1
3123i6K35M6k96RJ63N4k19k1J56m82M12K47k05l49M23m5r6J03K32l41M1M8P2k83
3147a92Q5L55m97J58J02j6O0J52l55J46j33J58R9K34l29mj2K12l39n8J83nk33
3170b29L80p8j9J14l9k44J39L76n17P8K17k97J44j76K13p8O7J80l33Q1N5r3K09
3193A50j68j01j57K39J41k28J7K78j05j16Q9j07J20j99K24k38M21k56Q4k61L61
3214A88j23k23L53k40j26K42k4k12r3J66M9j78J98j92k11M82k60J40J51Q1j43
$$ y = [36, 103, 84, 168, -24, -86, -62, -40, -14, 143, -22, 151, 341, -261, -76, 91, -153, -172, 89, -60, -76, 125, -3, -169, 217, 317, 87, -222, 255, -262, 150, 64, 36, -370, 179, 207, 101, 15, 70, 46, 24, -63, -123, -15, 12, 234, -240, -26, -157, -296, 74, -181, -123, -223, 115, -101, -158, 65, 44, 113, 242, 196, 216, -87, 169, 167, -110, 149, -55, -96, 139, 185, -111, -102, 61, 115, -104, -125, 31, -451, -39, 208, 3, -346, 77, 32, -64, 39, 271, -70, -29, 19, 91, -192, -107, 248, -249, -91, 11, -5, 55, 207, -148, -2, -135, 23, 122, 356, 27, 23, 11, 223, -116, -174, 9, 4, -229, 151, 73, 54, 168, 129, -115, 24, 400, -117, -39, 178, -119, 25, -151, 62, -16, 51, 231, -102, -21, 34, -59, 150, -18, -119, -276, -37, 104, -124, -107, 171, 66, -50, 39, -68, 52, -147, 77, -161, 260, 4, 88, -173, 188, 65, -158, 195, -45, -171, 71, 47, -165, -258, -92, -43, -221, -23, -215, -426, 56, -204, -64, 87, 168, 25]
3235B5k26N36l69j1K43j62J31j6j04j66Q2L01l16k0K25j22O1k45O6j8j12L37k57
3258a37rK67J57m41J56J91l38N1K86l72K86Q7j08o5j01J14k25L85n5j89J56r3
3280Cl6k5j28J25j38L21j22n8j1J75M5m65M11k39KK48O4m15L12Nj39o5m4L20J0
3305A56j57j0L26m15J53j4j8K10j18J67l51J62j63M0P2L0j47K02r8j78J71K37
3327B57m12KK13k85J79n6J13j68K41O2l15kK40Q1p4O1k34k4J12p3J59r6Q8r3N5
3352C1k0j75K20K2k49j12K27J41j51J88O4k13LOK68j50J00l10N8K1n6J72j03N8
3376D0q6PJ51q4k58K89N6k32NJ51j18O5L2l5n0J5P4r4LJ71l28K52o6J52k43J45
3402A4l9J48q9k3Q7j26o7J88O2k28K32k14J18R3j75k9R6p2M0L43m13J10J04j53
$$ y = [25, -201, 335, -34, -45, 198, 36, 167, 151, 47, -119, -37, 264, -52, -72, 153, 31, 92, -153, -87, -105, -217, 120, -137, -146, 121, 278, -163, -7, 184, -154, -103, 183, -189, 97, 184, 76, 11, -90, 24, -201, 184, 129, -60, 96, 3, -33, -58, -186, -61, -199, 122, 0, -58, -69, 106, 151, -314, 97, -142, -140, 108, 172, -243, 69, 74, -65, -130, -174, 146, 156, -1, -11, 315, -100, 53, 39, 21, 231, 113, 280, -71, 91, -72, -32, 40, 70, -77, 125, 27, -151, 20, 257, -155, -153, 60, -225, -46, -102, 11, -157, 84, 146, -169, -171, 69, 150, 76, 137, -97, -121, -9, -82, 77, -19, 69, -24, 31, 11, -164, 56, 78, -171, -283, -56, 85, -66, 122, 186, -27, -24, -18, 250, 100, 200, -110, -52, -31, -87, 85, -18, 40, -46, -39, 112, 28, -230, 59, 115, -117, -112, 39, -79, -14, 18, -17, -67, -52, 22, -72, -69, 102, -226, 26, -40, 112, -131, 14, -25, 123, 34, 11, 98, -28, -95, 93, 155, -73, 159, -55, 63, 156, -19, -48, 48, -24, 16, 359, -54, 56, 160, 7]
3426Gk2k93N56j58j95M1J2l2J90kn3j47J55r7J90q9q2j6j31J12J20l4o0J5o1K59
3452A85j47j26J56j77j05P9L6K11R1k41P4K19k57O6lJ5J64l17o2L64J01l49n1
3475g4L82m06L21k39J44K8j8j51j6l01L77j88R2K82j47R8r1j03j35L23o1l3J5
3498I9k3j40j7RL4M2k36L87j78q8o1K00M1m06L84k5k75L52j28K19q1J9j92J06
3522D2J6K6k22J65J17J46j09O4k49J01L65n43J79j69K11k12k1J10N5q0J2l6J34
3545A02Q9k52J13Q2k53M53m18K24l1k44J73k28J23K55l12P0P2j89J27Rj7j38K68
3568G8J29l78O3p4J29k4j22L70j42J64k53L12l61K43k52J85R6J3j85J24l2P9k36
3591g4k1L18j54p9J33N4k29J08jj08OJ77k23J27j78N6K46j16k17j26M44M3j85
$$ y = [7, -15, -308, 248, 90, -105, -64, -52, -84, 106, 104, 51, -96, 59, -38, 152, 63, -19, -35, -166, -54, 66, 32, -28, -13, -74, 185, 38, -88, 68, -109, -214, -135, -99, 112, 203, -38, 36, 255, -2, 64, 61, 76, 240, -77, -139, 225, 326, -23, -74, 308, -98, 223, -16, 128, 156, 138, -13, -29, -330, 47, -141, -49, 233, 86, 184, 93, -10, -145, 178, 117, 84, 99, 76, -64, -81, -72, -38, 4, -232, 155, -23, -111, -172, 28, 69, -337, 47, 22, -253, 99, -29, 190, 109, 128, -64, 42, 58, 84, -138, 27, 144, 290, 181, 245, -4, 97, 462, -81, 98, -71, 140, -72, -93, 17, 72, -8, 4, -32, 102, 191, -61, 52, 134, -119, 334, -84, 140, 109, -135, 38, -190, -67, 188, -124, -54, 18, -171, -44, -35, -52, -190, 78, 207, -171, -108, -182, -53, -77, -199, 171, 29, 193, -60, 252, -109, 134, -118, 67, 163, 176, -9, 115, 83, 162, -74, -95, 223, 69, -10, 123, 177, -52, 56, 55, -53, -47, 130, -93, 34, -144, -88, 158, 42, -175, -301, 143, 186, 1]
3614AJ68k34M1J44J56n3k43j9p3K48n3n7l77M44j62K8l5L3p4L09k12Lo8J12k03
3639a76J04j8K53j55m4J84j84J54j2K7J2k04J62j04K43k03J09l41K67o6l4K65
3661B39k70R3l03J33j11K31j49J00r1L20p1j12J73k47r8K35J79j78j50N4m0j00
3683a63J79K42Mnk16j45p7P3M1L0l7l4M5p2L09j98j76J96R2j49J53J25m67K58
3707HJ7P0J00j08N9j95m1K07j52O0j26p5L18k38J89o3j85Q2mJ81J32l55J42l9
3731a6j66J06J78j18N8K76l55k7N2J2P4N3P8j26m6P6l31N5L64j56p4J05L6J00
3755B08k39qj58K42j40j7O3j31L68j18p7K9j25K6L7j0q6P3J03k50N7J91J50j54
3779C4J6qk68K63J35k21m6J05k75K95k93J52J59m9n%l26K57J71J48j60J4P7m6
$$ y = [1, 169, -65, -24, 120, 276, 223, -20, -39, -112, 136, 83, 26, -351, 93, -69, -41, -76, -43, -117, 192, -20, -17, -85, 27, -176, -72, -90, 163, 8, -36, 148, -36, 118, 106, 133, 145, -59, 103, -1, 242, 39, 148, -193, 74, 8, -26, 239, -31, 62, -241, -108, -219, 12, -137, -37, -128, 192, 121, 9, 182, -65, -163, 72, 251, 73, -77, -23, -63, -163, 16, 258, 262, 257, 41, -104, -181, -108, -67, -37, -74, -108, -63, -135, 174, -24, -200, -4, 88, -61, 92, 217, -250, 8, 25, 95, 195, 87, 146, -49, -90, 117, -35, 25, -101, -176, 142, -96, 93, 30, -155, -73, -77, 104, 236, -119, 23, -16, -182, -76, 102, -16, 42, 318, -37, -64, -12, 0, 74, 127, 205, 79, 33, 109, -222, -167, 197, 41, -33, 72, 108, 208, -31, -39, -197, 45, -95, -112, -49, -180, 188, 70, -7, 22, -103, -77, -40, -50, -136, -63, 40, -210, -153, 38, 188, 34, 50, 42, -226, 37, 172, -49, -95, 10, -265, 30, -263, -111, 48, -1, -6, -6, -332, -75, 96, 244, 84, 98, 175, 129]
3803A29k59J98J51j65R8j45j06J89j16l9j0o5J42j83M2J45L79m11N5J3J1k25J08
3826f4J5Q9j83O8r5K13j8J75l03J61M0J65j12k45j05L41k76O5J46k52nm1J45J33
3850E7J21m59J07K82r1N9n0k12M06l72J16KR9K45k88pQl1Q6q6l9J40j08j68P3
3875a10J63j7Q2j56O5j84K53j48K32j7j3m00K03Jm4j26J59j53K7L39M4k08J55
3898A47j33r1J60j83J46mlk78j2N7J94n9L17k95K71m12J16J8l5O3K7J19j52J6
3922fq2J95n8J85l29P2K31k48J37J9q4j2M1j39m7K60j52j16j88N55j61P6k29J6
3946f4P3j98J00J42J78j14k64Q0K08k11q1J51k0m9o2L41m89J27L07R0m15NJ72
3969GmN3j96J66j61j50K66r0Q8K9Q1R4k94J18L2k12L12j53j3j54J47N2O4k58J20
$$ y = [129, -130, 68, 219, 54, 152, 7, -99, 90, -26, -65, -75, -140, 2, -181, -139, 6, 385, -26, 29, 42, 53, -172, -64, -49, 40, -143, -75, -170, 43, 25, 200, -103, 58, 98, 263, 151, -94, -199, 142, -134, -69, 77, -175, -180, -221, -76, 57, 178, -281, -174, 108, 17, 76, 26, -186, 220, -152, -36, -34, 65, 310, 22, 15, 23, -8, 78, -8, -47, 93, -15, -183, -110, 53, 36, 118, -38, 27, -157, 96, -52, 180, 163, 150, -250, -47, -46, -90, -216, -57, -210, -183, 156, 200, -8, 147, 14, -77, 83, -100, 46, 42, 39, -239, -251, -194, 0, -59, 258, -37, 234, -178, -62, -44, -79, -16, 11, 130, -22, -6, -88, 107, 49, 234, -95, -23, 208, -40, 97, 116, 32, 20, 61, -78, -125, 135, -17, -133, -321, 234, 73, 149, -80, -64, 9, -189, -89, 53, 231, 117, -147, -67, 141, -70, -151, 0, -20, -69, -131, 210, -279, -152, 155, 245, -170, -165, 7, 3, 56, -140, 26, -135, -285, -19, -109, -21, 8, 89, 183, -111, 7, 39, -173, 139, -14, -27, -181, -34, 18, 82, -176, -56]
3994e6j31L76N4m65J99R3j10J70n2N7j07j24K30j35K45k00j86K64P6l38J45n9
4016e4P9mJ45k13N7k7J27o2j35K39k4K9k59j14K30m53L19N8J59j0r4K57l81l5
4040a66K83P4k69K7M9j0R4m4NJ16k14j96K48oK53k60J70j59K11l73j3J43PJ13
4064H3p9m73N53oMn6j6l11K18K62j04n1o1m0K04J8j45R4J25k82J39Q0r1K53k72
4089D6Kj55J72k62J07K96%J90p10M13J00k61K64k64n5lJ25J54j93j05J09M4j67
4112a53J43J33k52K77q9j26K9q4L23n5q0Ml05J02L36m95L17J65l22k4L55m03K16
4135A2J86l07K30j55P9j5Qq6L7j57L07Jl56Q7J43l91M70j10q3N3O8r4R2L9J44
4160B02k84J71m1J54l01%m5K45o2J23p1o1j2k1J14m0k40Q1J25k4J14k39R6n1R9
$$ y = [-56, -187, 189, 243, -222, -23, 70, -40, 130, 78, 135, 28, -96, 134, -1, 244, 44, -142, 122, 198, -140, 5, -54, 25, 21, 166, -47, 10, -17, 110, 48, -87, 152, 128, 157, -102, -216, 14, -439, -120, -62, 97, 87, -7, 250, -131, -166, 117, 191, -78, -51, -2, -12, 82, 38, 43, 159, -55, -251, -3, -9, 244, -16, 154, -5, 206, -167, -180, -37, -30, 83, 4, -469, 84, 78, 82, 26, 10, -301, -83, 179, 75, 24, -37, -77, 127, 145, 0, 94, 219, -63, 76, 156, 65, 318, 46, 48, -107, 65, -197, -90, 206, 206, 396, -314, 99, 199, -62, 202, -62, -117, -120, 5, 159, -34, -139, -30, 14, -153, -10, 123, -129, 148, 59, -67, -38, -122, 201, 146, 66, 70, -235, -133, 203, -292, 25, 190, -132, -156, 199, -204, 12, 198, -109, 121, -34, 45, 30, 38, -48, -11, -168, 139, 140, -216, -129, 14, -377, 93, -17, -100, -47, 21, -73, 19, 58, 202, -82, 89, 48, 202, -99, -99, -144, 101, 39, 162, 91, 30, 18, -3, 111, 71, -169, -88, 37, 13, 127, -112, -16, -67, 32]
4185C2K67l98J23J08j63J86l06L37l71M72k99p7q0K85k98J65j72K03O9K3qj98
4207a00J02%Mj00K69j36j11M1Q1K1l0j2j1J55K3j38j38K07j59r1K32j56Q6k0o6
4232d7Q8r0J20j80L27m2k07J91j0M4j67j03K3j65O2J30k0OL24l49k17L17R8j61
4256b8k6j5rj26M3J55l8K88k13l9j19J22j86j8K66o4j38j8K45J11j13j84L13j94
4280A5L20m27J20l3k56J09R6m6J94j65L2P6k15K24J54j61M7p5j12K15k45J9J33
4303A9N4o4L0j00K2j44L42q3J03k72P4n0ML2K7o5J33j73J69j26J8r8J1J57n0l8
4329f8j0O7j3j01L3Ok13J85K22k3j20J2P1j18J85l8j78K9K66k77J74r0J40q3O5
4354A23j81j90K49j73L53k89j03K23M5J82k56Q4K17j64p9j86K06l7k4J4K90n51
$$ y = [32, 299, -99, 24, 132, -31, 155, -151, 186, -185, 287, -12, -89, -169, 116, -182, -17, -189, 14, 83, 106, 98, -100, 2, 2, 6, -94, 175, 39, -72, -31, 50, 71, 41, 29, 18, 173, 196, 58, -80, 127, -32, -123, 109, -47, 39, 19, -47, 41, -49, 71, -109, 218, 176, -31, 160, 150, 194, 27, -76, -53, -218, -156, -26, -46, -40, 284, -65, -282, 35, 133, -28, -54, -69, -78, -204, -161, -6, -44, 244, 31, -8, -127, -5, -191, -209, 57, -7, -145, -163, 82, 193, 80, -104, 209, 15, 335, -92, 28, -5, -261, -152, -56, -102, 92, -73, -41, 35, -180, 44, 198, 37, 84, 9, -103, 112, -133, -114, 19, 73, 9, 39, -61, -39, -183, 159, 76, 179, -93, -19, -69, -65, -33, -6, -71, 62, -111, 58, -68, -50, -148, -137, 20, -30, -68, -78, -11, -24, -125, -92, -86, -299, -114, 108, 85, -35, -23, 48, -70, 115, 77, -101, -72, 194, -83, 91, 1, 141, 58, 123, -58, -248, 1, -172, 181, -108, -211, 12, 57, 239, -17, 67, 284, 120, 41, -145, 61, 24, 0, 14, 304, -247]
4376b47K73J0j25j49J69J23j26N4K2J89l06K26p0J06r7J5k8M9j78P3J16j9l77
4399b97M51l8p1N5%k17K36m2r9J66Ql0j60J49k42J89k0O8m6L7j14j4j86l6M67
4424B14m19R8R9j26k1N6J74k01K7j19P0Q2J5oL0K35j90k7q3J86k72J27J62j58
4448d7j78J67j52L43j72M4K8J35j55o3j66K49J05q1j28l8k03J41K0J74j24K11
4470A10j53q9K65j97N9L3k92K48J01j92N63p30M84l06QQ1J17j04J39k26K24Nk24
4493g6P6j2M3k45K04J11j40M0l2L6P9j08OJ5m8N9K9q8n6j11J16K25k41p7K47k0
4519C2M8j58o6K53Q2j01J7r9J88j32J61j79n5q5K48k21j37K76rj41J1lL0K18j65
4544A3o4p7J50J25j26o5j61J21J08j78O9J57O2k57pK77n4K9q8R4k09R8J1j51J93
$$ y = [-247, 26, 36, -89, -238, -69, 54, -72, -18, 4, 193, -113, 113, 43, 149, 52, 67, 39, 88, -90, -17, 99, 80, -297, 154, 116, 45, 100, 100, -117, 119, 77, -22, 144, 152, 122, -38, 111, -131, 58, 38, 106, 60, 97, -17, -31, -217, -253, 214, -205, -107, -8, -134, -155, -99, 75, -126, -99, -218, -148, -66, -51, -57, -27, 208, 18, -9, -92, 94, -178, -51, 111, -47, -225, -58, -210, 133, -39, 5, 33, 168, 13, -50, -216, 33, 138, 57, -71, -109, -312, -171, -151, 23, -101, 110, -43, -132, 133, -64, -5, 28, -264, -16, 85, -107, 456, -274, 210, -96, -88, -7, 110, 6, 145, -81, 143, 148, -76, 0, -12, 31, -214, -10, 101, -39, 1, -31, 5, 84, -24, -18, -3, -51, 8, 37, -51, -107, -218, -102, 123, -118, -195, 52, 32, 80, -78, -144, 109, 191, 90, 107, 8, 196, 64, 225, 46, -9, -94, 154, -67, -204, 72, 63, -78, -67, -70, -40, 178, 13, -51, -128, 22, 147, 21, -44, -205, -84, 24, -154, -85, 72, 134, -123, -130, 147, 93, 122, 34, 128, -81, 17, 28, -123, 70]
4569G0j12J83k75Q0r0K55O4j59m6J17j85j02P7K69j75J23j26j8L57l14J08n9j
4592D1k01K34j93j1J33KK27j47q6J1J04j69o5J99L0k61J77o0q0J78j95J03O9j90
4616a50M9K22j82K22J2m06J51j18R3L4q3j49K24nk0K72q5k48M05m98M32j07j36
4639g1O9J40m8R0l69K53k56J45l5K37k75j9J00j96J14P9K00J37l76M4J65k50L88
4662B66n21M32j26j67j92M6J67L6Lj3P6j46L07k2j2M3nl01J23J71l12L15j02j48
4686h2J18j45L80j90l3k86K17o0j87O9K21j49J2jJ26K6k3k15L3J29M4k2R0j36
4710f4j5j2K7j3JJ54l18M11k63lP8k3J94j4J9j54J55l5o4o5QP7j70J86j84J15
4736B8P7j94Q4J65j37J81Q2n44L58j72k9J37o8M4r1N4J51km38K29K49k84O6p3
$$ y = [70, -42, 141, -134, -54, -144, 111, 175, 16, -30, 87, -98, -200, -123, 146, -29, 94, -32, -50, 307, -7, 101, 42, 41, -160, 74, -119, -130, 3, 5, 232, 85, -1, 10, 114, -55, -120, 79, 109, -152, 25, -35, -115, 63, -132, -29, 40, -150, -101, 121, -61, 161, 173, -233, -82, -200, -107, -73, -156, -305, -81, -86, -106, 166, 81, -167, 238, -260, 172, 65, -71, -2, 138, 90, 180, -189, 64, -192, -47, -82, 155, -120, -139, -39, -235, -121, -42, 158, 295, -81, -37, 128, -122, 266, -255, 177, 51, -116, -308, -262, -95, -59, -56, -69, 7, -139, 168, 146, 134, 177, 172, -129, -6, 165, -147, 168, 66, -82, 36, -109, 271, 81, 48, -238, -21, -81, -268, -199, 22, -127, -115, -116, 10, 36, 13, -202, -169, -40, 4, -18, 72, -64, -79, -91, -64, -77, -76, 78, -240, 171, -92, -95, -17, -40, 154, 140, 159, 5, 160, 125, 61, -4, 4, 81, -89, 97, -87, 28, 105, -89, -5, 160, 23, 204, 286, -258, 100, -72, -101, 36, -32, 12, -79, -25, 126, 124, -314, -85, 164, -120, -54, -127]
4760a27Q1n3J63r4j59K72k43J02p1K33k13L27q8m01J72K5J04k23J63J47j40q4
4782a07k1J48P6K07l34M02l23k52m1J71J30o1L52k04j84J8L1J2J04k10K75k32
4804d3Q3K7Q5j75k7M15k62j31P2J25p9q5n6J41j84q7J01J20Q4j26R5k5k59L67
4828A76j28j57K0M5J04j54L15l63J65P2l83J98J68q6m6j67K48lK0j05M0n2K87
4851B14m7l38L75j19k25K66j63J19l5j16K26l38J88Pr8rJ74J31l44K12l57M41
4873A64k66J66Q9n5qP3k06l6j30J43J12K8k28J03j78RL41o5j95ML84j99j71K63
4897A42k43J64m4p3J81kJ07j98j8M9j53k40M10l2n1J19M5j73J2k14K82p1j49J31
4921a9p8R5j31J12n7J49P7J39l47J39o3j27nJ28r7J62j92L52k16J53k36J12J9
$$ y = [-127, -46, -99, 64, -30, -189, 83, -160, -58, -129, 104, -109, 218, 130, -271, -99, -74, 30, -193, -30, 117, -23, -107, -128, 20, 96, 303, -31, 371, 48, -204, -245, -74, 56, -5, 347, 143, -41, -23, 8, 20, 124, -86, 189, -43, 40, 67, 152, -23, -50, 365, 103, -28, 44, 169, 90, 5, -51, 90, -94, -181, -80, 40, 124, -2, 93, 68, -191, 176, 48, -109, -89, -44, 60, -94, 221, -142, 23, 95, -288, -90, 78, -8, -54, -221, 27, 24, 44, -61, -21, -73, 214, 167, -171, 204, 85, -140, 126, -37, 82, 47, -69, 157, -181, 7, 14, -84, -93, 81, 212, -132, 80, -277, 164, -102, 64, 153, 98, 90, 163, -43, -79, -209, -66, 46, 74, -154, -51, -229, -220, 121, 56, -139, -135, 249, 50, -121, 142, -101, 63, 19, -54, 127, 125, 232, 34, 16, 65, -88, -328, 82, 50, -1, 118, 163, -10, 2, -212, 70, -1, -150, -19, -97, -2, -133, -21, -78, 71, 148, 287, -60, 79, 16, -111, -116, 12, -85, 77, -115, 237, 21, 174, -62, 50, 69]
4944F9j21J2J68j77n1O8N8q3M3j76J76K9j20m8N6K15m9R9m9jj86K60j68m8J7J0
4970CJ98k35N6j4O8J5k52L05j92N4P1k05k9K58J9j55J09j2j33J47j73qO8O5j21
4995i3J42J48j69k1l74M58k17P4J66k4M2k18q6K16q7J79m32K80k59K69m0l2J03
5018B5j8P7j50j4Q7rP5P7j40o8L30p2m25N39n08K13j22J89J30l31R0n8N6J9k40
5043b48M84k44K96j23l73J74J25j46K1J16l29J26K0j27l0J46J39k5J27j27J6j72
5065a54L4R5K9J73j87J90N9k59J63l71K33k9Q2q8k7K29k03J39l43J33m1R0kJ66
5089A11n3j17RL3J61m40J86O1j93L59j38Jp0J67j37q9K43k10L58k03j02QJ98Q
5113A51j30p5m0jK68k94P9K61k38J0j6k5j52L11l18K0k9K68M6k5J23m88L96J19
$$ y = [69, -52, -40, 128, -49, -100, -32, 26, -57, -14, -190, -14, 15, -105, -153, -97, 118, 69, 168, 119, 118, -68, 192, 24, -24, -7, 3, 201, -34, 22, 8, 76, 91, -161, 144, -48, 6, 77, -128, -157, 101, 120, -35, 74, 62, -71, 76, -97, -105, -37, 28, -93, 49, 197, 28, 7, -367, 91, -126, -52, 114, 90, 132, -86, -172, 44, -43, 136, -296, -16, -275, -6, -46, -78, 25, 7, 84, -66, -80, 7, -2, 73, 150, 10, -58, 272, 200, -225, 314, -194, 19, -103, 86, 216, -115, -25, -83, -27, -8, -248, 236, -8, 288, 165, -208, -34, 91, -55, -34, 82, -247, -121, -101, -228, -258, -112, 27, 2, 129, 2, 18, -154, -120, -25, 4, 177, -10, 180, 239, -20, 143, -228, 5, -24, 58, -30, -57, 172, -31, 108, -235, -102, -143, -53, -55, 111, 58, -59, -50, -17, 144, -296, -110, -49, -242, 117, -21, -20, -90, 77, -60, -149, 94, -116, 242, 39, -63, -55, 143, 151, 21, -54, -94, -95, 173, -121, -42, 219, -19, -9, -25, -50, -202, 109, -209, -189, -218, 50, 96, 71, 194, -294, 102, 221]
5137B21j39j07Nr9j15K60j67J18Q4j74K34L0k18R5P7k33M46m33K62N0m34M07j48
5160B2K06k10K2o7m9j48K02j00J09J25j84K28j23q2O0n0R7k68K53Q4m5j89r0J1
5184a86J97j52K75%j66j10K99j69M5K73k37j51K11j05j3ro8J35j36J43k52pJ06
5207g7Q0o5Q6n0J44K0p2j18P2k33J08J65n8k01l8K31Mr8J10j17N2L28j49l8j47
5232f1P4o3J01r6k5K67j45j16N2m2J1K24l9kl3j30p1l01K70L37k21J36N7l15J8
5257a13P1mJ50J5l17K87j12J06k17K4L36P2l54m4l9J11K09j49L03o5k79j54J13
5280e0k4l9J41j27j88K35J84l08R9M8J95m7j82rJ53l2k47K55j4k27J06M7O7j95
5304a59K74j64l9P8l04K17L2J27p9Q8j05J54j43K92n46K27J15q6p8L17k57J90
$$ y = [221, 82, -25, -20, -119, -234, 26, -141, -23, 61, -113, 121, 151, -67, 28, 105, -128, 318, -115, 147, 197, -237, 170, 22, 228, 18, 40, -27, -76, -224, -22, -122, -13, 112, -72, 156, 33, -49, 11, -39, 58, -210, 43, 127, 82, -107, -197, -186, 11, -141, 134, 134, -32, -142, 157, -12, 33, 306, 69, -82, 129, 24, 11, 2, -66, 69, -67, 76, -176, -183, -77, 3, -62, 24, -26, 118, 138, 66, -52, 20, -213, -105, 60, 2, -199, -237, -6, -2, -100, 10, -107, -55, 273, 124, 86, -61, 13, -50, 51, -45, -70, 197, 52, -64, -12, -54, -43, 181, 142, 140, 107, -23, -94, -395, -125, 212, -9, 127, 184, -131, -113, -42, -46, 104, 119, -198, 89, -23, 83, -134, -110, 226, 298, -56, -100, -139, -28, 181, 32, 335, 270, -9, -163, -50, -74, -113, 28, -99, -287, -52, 132, -176, -77, -29, 166, 119, -63, -72, 81, 49, -198, 57, 43, -184, -78, -31, 36, -159, 115, -49, -88, -10, -314, -97, -65, 62, -17, 71, -34, 120, -23, 269, -277, -50, 65, -21, -99, 218, -39, 151]
5326A51j79J29PR4j48o2J63o26L73J54o3m5K43j41p9P6J6q4J59R1k48K31k55q4
5350a27J02r9K19Qj72j6J2K07J03l87L2P9r8Q4J45k20J72p0j81J18J31k24L00
5373A18l0l5L6m6r4j32J05o9J30l1r4K19N3j94r7M69m67J76j5L7l0QJ14o0k2J5
5399F4j24K45J1n3j54j85J40K86k56M5j14J21K1L1N4k27J15J1J47j27J45k23J89
5422A62k15j80R3J89j71K51J2k18O4J15j21q0K92K11n16m2j7N0J06J92m7j80J72
5445A22J15k46J8j99qJ19j27pJ45q6J58l5j46J77K95k33P0l2p4K23j87J42k47
5468d3K6j75K49l58J44J02J3M5j33J36J05j82J98Kl02K80k88MJ16J30J15k28p1
5491a15J12K6j35J41l6J18P2m6o9n4r8K05o3o0j15mJ93n2j75L9J28j61K6J23r5
$$ y = [151, -28, 101, 108, 202, 54, -8, 155, -471, -98, 56, -7, -52, 191, 50, -29, 47, 63, -21, 138, 229, -19, 212, -43, -127, -25, -124, 95, 103, -69, -85, -73, 134, 237, -150, -118, -39, -137, -53, 92, -128, 44, -26, -207, -89, 42, -182, 118, 88, 53, 89, 43, -51, -183, -78, -147, -17, -48, -142, 77, 130, -64, -161, 308, -159, 17, 2, 39, 9, 17, 131, 71, 49, 64, -60, 185, 196, 143, -11, -196, -56, 230, -26, 19, -95, 26, 47, 78, 132, -95, 20, 31, 178, 51, 196, -27, 162, -53, -233, -140, 49, -122, 129, 141, -77, -13, 102, -19, -99, 193, 404, -112, -154, -171, -121, -15, 177, 130, -50, 122, 237, -9, 9, -190, -198, -79, -206, -213, -68, -154, 4, -31, -177, 0, 295, 62, 132, 100, 26, 249, 62, 204, -43, -17, -192, 57, -301, -157, -55, -42, 3, -130, 6, 111, -71, 127, 129, -173, 107, -181, -177, -61, 69, 184, -44, -115, -3, 23, -112, 29, -7, 111, 183, 137, 68, 14, -84, 121, 58, -2, -117, -121, 72, 20, -155, -116, 12, -149, -123, 0, -95]
5516i5l2P5m4K73n86O61m92L56k1pl40K88R6j48J44Q4j70N3j9j27J44j71l7K00
5540H5o7j5o2j73K84j55J21j89K36O9k7j20j99K3L87q7r6j16J90k83J38Q5o5q4
5564a20R2J02q3j3r8L95j80r1j49K96j59j04J68k28L21m3j2R5j38j64k1K76j7
5587A25K34l56j3k04j5K81m3j68N8J33k30J89q3J55n6k30L39j28M0K2J14l45j14
5610b95M10j14K74j94l05M25M0m70K17k7J69k99K1J48P0j09j56L29l45L14l26
5631b23K19o1J67j57m0K19Pj64Rj6K1L08k28o8N7j63L6J35Ok01p0K57O9k9j36
5656d6k3J14l3P6j81j9K06l23L01M9j54o6J91n9j39l0L12Q5j88j92J70Oj19J53
5680I1J9j22l7O4N0j1L21k89p1k7j54J66k34P6J98M8k62J98J41j06J31l08N5J65
$$ y = [-95, -127, -52, -96, 177, -409, 252, -240, 116, 95, 88, -252, 36, 132, -16, 128, 212, 42, 95, 76, -51, 93, -78, -115, 85, 18, 3, -59, -232, 52, -103, 18, -171, 65, 134, 107, -13, -212, -189, 198, 111, 15, -101, 89, -194, -56, 29, -36, -120, -28, 74, -9, -22, -120, 275, 95, 4, -145, 151, -8, -112, 56, -172, 149, 106, 94, 189, 51, -113, -134, 142, 125, 359, 3, -10, -214, -229, 52, 9, -159, -101, 32, -198, -9, -92, 63, 7, -223, 116, -12, 28, 50, 164, -181, -295, 115, 1, 275, 81, -224, 201, 241, -229, -12, -39, 130, -169, -148, 0, 70, -39, -195, 134, -211, 103, -223, -4, -65, 102, -55, -95, 124, 131, -33, -24, -40, -19, 289, 61, -7, 50, -113, -77, 58, 64, -137, -207, 50, 119, 90, -46, -69, 45, 12, 88, -93, -112, 94, -229, 72, 121, -33, -99, 92, 33, -106, -136, 176, 261, 73, -119, 51, 57, -62, 91, 110, -12, -49, 15, 65, 54, 375, 86, 15, -12, -166, 0, -234, -158, 40, 88, -174, 24, 165, 59, 190, -118, -63, 102]
5704A02j75L5kk09QJ82J86J52k57k80K63j0q0L68k48k01K94j53q2O1P3r5j21n3
5728b42L16R0l69J69J78J32l07k33K94j66K00r4J29P6k71K3R3q6J93J01j94j50
5750a18j40J69OJ50n4L8m2j45J14K73l54J5J36p2J60j42R3j43p6K14j1j6o6j14
5774a25J52J54k20m3m4K24k14j4K36j29K00l06N9N7J98k10k60L18k18K97r9j1
5796BN1J01O8l23q8K47M2n1L3r2j1n3K05p2k95J81Q2o2M8J60o9j16Km2k22J05
5822a69J94j52O5R0j72J06l9r7j5K49j55MR3j56K12n0P1k57K61M6p2Q9k70K02
5846G8J4j5j86K00q4p2K76p2n1q0l1k7J89j90o0K54m3r2P1K2j36j5J47j98J51
5871E0N3M8Mj01j21LJ62j75j16J47q6J08k15L28o0loj2M7j61J72j03l6K53r0P2
$$ y = [102, -73, -38, -40, -249, -241, -59, 127, 279, 22, -258, 5, -5, -85, 283, 35, -166, 128, -25, -107, -46, 27, -68, -189, -242, 74, 164, -205, -36, 142, 274, -33, -266, 28, -138, 62, -32, 97, 173, -98, -75, 18, -68, 125, 226, 32, -118, -258, -89, -83, 67, 13, 51, 9, -136, -22, 251, -103, -88, 48, -24, 136, -6, 87, -56, -132, 82, 71, 55, -11, -125, 27, 181, -39, -82, -126, 98, -116, -130, 106, -23, 177, -129, -70, -13, 185, -25, -285, 33, -185, 112, 13, 2, 53, 154, 222, -101, -189, 58, 100, 49, 82, -10, -21, -74, 131, 59, -236, -55, 27, -35, 13, 173, 104, -12, -10, -52, -274, -169, 25, -127, -62, 28, -144, -38, -77, -174, -189, 60, -95, -91, 2, -154, 58, 8, 79, -178, 83, 129, 57, 146, -124, 78, 92, 77, -109, 91, 7, -65, 211, 139, 88, 8, -23, -50, 139, -51, -111, 143, 100, 8, 79, 101, -35, -50, 97, -101, 50, 103, 151, 155, 54, -67, -64, 98, -77, -193, -46, -132, -24, -239, 89, 29, 26, 20, 8, 55, -106, 66, -37, -73, 180, 90, 162]
$$ [...]
8191a28
##END NTUPLES=NMR FID
##END=
