##TITLE=1H_Pr T-140
 CDCl3
 8 sc, 
 6.05.2022
##JCAMPDX= 6.0         $$ Bruker NMR JCAMP-DX V2.0
##DATA TYPE= NMR FID
##DATA CLASS= NTUPLES
##ORIGIN= UXNMR, Bruker Analytische Messtechnik GmbH
##OWNER= root
$$ XWIN-NMR		Version 3.5
$$ Fri May  6 14:22:16 2022 Russian Standard Time (UT+4h)  she@DPX200
##.OBSERVE FREQUENCY= 200.1313499996
##.OBSERVE NUCLEUS= ^1H
##.DELAY= (6, 6)
##.ACQUISITION MODE= SIMULTANEOUS
##.ACQUISITION SCHEME= undefined
##.AVERAGES= 8
##.DIGITISER RES= 18
##SPECTROMETER/DATA SYSTEM= spect
##.PULSE SEQUENCE= zg30
##.SOLVENT NAME= CDCl3
##.SHIFT REFERENCE= (INTERNAL, CDCl3, 0, 15.7039)
##AUDIT TRAIL= $$ (NUMBER, WHEN, WHO, WHERE, WHAT)
$$ ##TITLE= Audit trail, XWIN-NMR		Version 3.5
$$ ##JCAMPDX= 5.01
$$ ##ORIGIN= Bruker BioSpin GmbH
$$ ##OWNER= she
$$ F:/spectra/data/she/nmr/H-F/1/audita.txt
$$ ##AUDIT TRAIL=  $$ (NUMBER, WHEN, WHO, WHERE, WHAT)
(   1,<2022-05-06 14:21:11.20 +0400>,<she>,<DPX200>,
      <created by zg, POWCHK disabled, PULCHK disabled
       configuration hash MD5:
       00 E9 B6 7A A2 85 ED C7 34 08 36 98 17 FE 4E 26
       data hash MD5: 16K
       3F 68 BA F7 41 BD BA AC A0 CB AF 39 9A C6 98 EF>)
$$ ##END=
$$ 
$$ hash MD5
$$ B5 0B 46 B1 10 0C 13 2B 49 BE 83 CA 83 87 18 F5
##$RELAX= 
##$RELAX= 
##$RELAX= 
##$RELAX= 
##$RELAX= 
##$RELAX= 
$$ Bruker specific parameters
$$ --------------------------
##$DU= <F:/spectra>
##$EXPNO= 1
##$NAME= <H-F>
##$PROCNO= 1
##$TYPE= <nmr>
##$USER= <she>
##$AMP= (0..31)
100 100 100 100 100 100 100 100 100 100 100 100 100 100 100 100 100 100 
100 100 100 100 100 100 100 100 100 100 100 100 100 100 
##$AQSEQ= 0
##$AQ_mod= 1
##$AUNM= <au_zg>
##$AUTOPOS= <>
##$BF1= 200.13
##$BF2= 200.13
##$BF3= 200.13
##$BF4= 200.13
##$BF5= 200.13
##$BF6= 200.13
##$BF7= 200.13
##$BF8= 200.13
##$BYTORDA= 1
##$CFDGTYP= 0
##$CFRGTYP= 5
##$CHEMSTR= <none>
##$CNST= (0..31)
1 1 145 1 1 1 1 1 1 1 1 1 1 1 1 1 1 1 1 1 1 1 1 1 1 1 1 1 1 1 1 1 
##$CPDPRG= <>
##$CPDPRG1= <>
##$CPDPRG2= <>
##$CPDPRG3= <>
##$CPDPRG4= <mlev>
##$CPDPRG5= <mlev>
##$CPDPRG6= <mlev>
##$CPDPRG7= <mlev>
##$CPDPRG8= <mlev>
##$CPDPRGB= <>
##$CPDPRGT= <>
##$D= (0..31)
0 1.2 0 0 0 0 0 0 0 0.06 0 0.03 0 0 0 0 0.0002 0 0 0 0 0 0 0 0 0 0 0 0 
0 0 0 
##$DATE= 1651832470
##$DBL= (0..7)
120 120 120 120 120 120 120 120 
##$DBP= (0..7)
150 150 150 150 150 150 150 150 
##$DBP07= 0
##$DBPNAM0= <>
##$DBPNAM1= <>
##$DBPNAM2= <>
##$DBPNAM3= <>
##$DBPNAM4= <>
##$DBPNAM5= <>
##$DBPNAM6= <>
##$DBPNAM7= <>
##$DBPOAL= (0..7)
0.5 0.5 0.5 0.5 0.5 0.5 0.5 0.5 
##$DBPOFFS= (0..7)
0 0 0 0 0 0 0 0 
##$DE= 6
##$DECBNUC= <off>
##$DECIM= 32
##$DECNUC= <off>
##$DECSTAT= 4
##$DIGMOD= 1
##$DIGTYP= 9
##$DL= (0..7)
0 120 120 120 120 120 120 120 
##$DP= (0..7)
150 150 150 150 150 150 150 150 
##$DP07= 0
##$DPNAME0= <>
##$DPNAME1= <>
##$DPNAME2= <>
##$DPNAME3= <>
##$DPNAME4= <>
##$DPNAME5= <>
##$DPNAME6= <>
##$DPNAME7= <>
##$DPOAL= (0..7)
0.5 0.5 0.5 0.5 0.5 0.5 0.5 0.5 
##$DPOFFS= (0..7)
0 0 0 0 0 0 0 0 
##$DQDMODE= 0
##$DR= 18
##$DS= 0
##$DSLIST= <SSSSSSSSSSSSSSS>
$$ [...]
##$SUBNAM2= <"">
##$SUBNAM3= <"">
##$SUBNAM4= <"">
##$SUBNAM5= <"">
##$SUBNAM6= <"">
##$SUBNAM7= <"">
##$SUBNAM8= <"">
##$SUBNAM9= <"">
##$SW= 18.0517283424761
##$SWIBOX= (0..15)
0 0 2 0 0 0 0 0 0 0 0 0 0 0 0 0 
##$SW_h= 3612.71676300578
##$TD= 16384
##$TD0= 1
##$TE= 0
##$TE2= 300
##$TE3= 300
##$TEG= 300
##$TL= (0..7)
0 120 120 120 120 120 120 120 
##$TP= (0..7)
150 150 150 150 150 150 150 150 
##$TP07= 0
##$TPNAME0= <>
##$TPNAME1= <>
##$TPNAME2= <>
##$TPNAME3= <>
##$TPNAME4= <>
##$TPNAME5= <>
##$TPNAME6= <>
##$TPNAME7= <>
##$TPOAL= (0..7)
0.5 0.5 0.5 0.5 0.5 0.5 0.5 0.5 
##$TPOFFS= (0..7)
0 0 0 0 0 0 0 0 
##$TUNHIN= 0
##$TUNHOUT= 0
##$TUNXOUT= 0
##$USERA1= <user>
##$USERA2= <user>
##$USERA3= <user>
##$USERA4= <user>
##$USERA5= <user>
##$V9= 5
##$VALIST= <valist>
##$VCLIST= <CCCCCCCCCCCCCCC>
##$VD= 0
##$VDLIST= <DDDDDDDDDDDDDDD>
##$VPLIST= <PPPPPPPPPPPPPPP>
##$VTLIST= <TTTTTTTTTTTTTTT>
##$WBST= 1024
##$WBSW= 4
##$XGAIN= (0..3)
0 0 0 0 
##$XL= 0
##$YL= 0
##$YMAX_a= 360769
##$YMIN_a= -518842
##$ZGOPTNS= <>
##$ZL1= 120
##$ZL2= 120
##$ZL3= 120
##$ZL4= 120
##$ABSF1= 10
##$ABSF2= 0
##$ABSG= 5
##$ABSL= 3
##$ALPHA= 0
##$AQORDER= 0
##$ASSFAC= 0
##$ASSFACI= 0
##$ASSFACX= 0
##$ASSWID= 0
##$AUNMP= <proc_1d>
##$AZFE= 0.1
##$AZFW= 0.1
##$BCFW= 1
##$BC_mod= 2
##$BYTORDP= 1
##$COROFFS= 0
##$CY= 11.3945322036743
##$DATMOD= 1
##$DC= 2
##$DFILT= <>
##$DTYPP= 0
##$F1P= 2.36226072786647
##$F2P= -0.459571619588291
##$FCOR= 0.5
##$FTSIZE= 0
##$FT_mod= 4
##$GAMMA= 1
##$GB= 0.15
##$INTBC= 1
##$INTSCL= 1
##$ISEN= 128
##$LB= 0.24
##$LEV0= 0
##$LPBIN= 0
##$MAXI= 10000
##$MC2= 0
##$MEAN= 0
##$ME_mod= 0
##$MI= 1.114404
##$NCOEF= 0
##$NC_proc= 0
##$NLEV= 6
##$NOISF1= 3.799351
##$NOISF2= 2.8
##$NSP= 1
##$NTH_PI= 0
##$NZP= 0
##$OFFSET= 15.70392
##$PC= 1
##$PHC0= -18033.76
##$PHC1= 14.80075
##$PH_mod= 1
##$PKNL= yes
##$PPARMOD= 0
##$PSCAL= 0
##$PSIGN= 0
##$REVERSE= no
##$SF= 200.130013532006
##$SI= 16384
##$SIGF1= 3
##$SIGF2= 2
##$SINO= 400
##$SIOLD= 16384
##$SREGLST= <1H.CDCl3>
##$SSB= 0
##$STSI= 0
##$STSR= 0
##$SW_p= 3612.71676300578
##$SYMM= 0
##$S_DEV= 0
##$TDeff= 0
##$TDoff= 0
##$TI= <>
##$TILT= no
##$TM1= 0
##$TM2= 0
##$TOPLEV= 0
##$USERP1= <user>
##$USERP2= <user>
##$USERP3= <user>
##$USERP4= <user>
##$USERP5= <user>
##$WDW= 1
##$XDIM= 8192
##$YMAX_p= 0
##$YMIN_p= 0
$$ End of Bruker specific parameters
$$ ---------------------------------
##NTUPLES= NMR FID
##VAR_NAME=  TIME,          FID/REAL,        FID/IMAG
##SYMBOL=    X,             R,               I
##VAR_TYPE=  INDEPENDENT,   DEPENDENT,       DEPENDENT
##VAR_FORM=  AFFN,          ASDF,            ASDF
##VAR_DIM=   8192,          8192,            8192
##UNITS=     SECONDS,       ARBITRARY UNITS, ARBITRARY UNITS
##FACTOR=    0.0002768,     1,               1
##FIRST=     0,             0,               0
##LAST=      2.2672688,     0,               0
##MIN=       0,             -518842,         0
##MAX=       2.2672688,     360769,          0
$$ Real data points
##PAGE= N=1
##DATA TABLE= (X++(R..R)), XYDATA
0@%%%%%%%JqJ5j6J6k4L2l9M7n6P2q8J09j32J58j90K24k64L09l61M20m84N57o38
$$ 0 0 0 0 0 0 0 0 1 -7 8 -8 8 -16 16 -23 24 -32 40 -48 61 -71 87 -103 121 -143 166 -195 225 -259 298 -340
31c40P27q29R41j062J197j349J517j698J894k111K348k607K892l201L538l908
$$ -340 387 -442 499 -563 634 -715 802 -896 998 -1113 1235 -1372 1520 -1681 1857 -2051
47b051M313m754N237n768O354p004P724q526R427j0448J1614j2957J4526j6389
$$ -2051 2262 -2492 2745 -3023 3331 -3673 4051 -4475 4952 -5496 6118 -6839 7687 -8702
61h702J8643k1434K4999k9733L6360m6363O3379r9837L13750l38225l91475P09468
$$ -8702 9941 -11493 13506 -16227 20133 -26230 37149 -62688 251062 -87163 -478638 230830
73B30830m0224k96862J72370L2331l72155K97113L27972m53147k11775M51565
$$ 230830 190606 -106256 66114 98445 -273710 23403 351375 -101772 -313547 138018
83A38018l830k49145J41751K8887k83033K23785K78239l76289j80357L93732L8487
$$ 138018 134188 -114957 26794 55681 -227352 -3567 274672 -101617 -281974 111758 150245
94A50245k69828Q6808R5399k14937J34620K53169k78912k02069L04840J00594
$$ 150245 -119583 -32775 62624 -152313 -17693 235476 -43436 -245505 59335 159929
104A59929k41845L3014J28117j61302M3675K09716j75881j92254K33846J35140
$$ 159929 -81916 -48902 79215 -82087 -38412 171304 -4577 -196831 37015 172155
114A72155k26196j8191J54760j21796m2013K20737m4762k63947R8583K48018j23861
$$ 172155 -54041 -72232 82528 -39268 -81281 139456 94694 -169253 -70670 177348 53487
125E3487j57439R9851L3758m3898P5383j843j54594M0777J73748p5381j23351
$$ 53487 -103952 -4101 29657 -14241 61142 59299 -95295 -54518 119230 43849 -79502
136g9502P6462L8864n1334M0976J5572j22597K1287J60967n3327j30016M4717
$$ -79502 -3040 35824 -15510 25466 41038 -81559 -60272 100695 47368 -82648 -37931
147c7931N1739k9213M0047J1698j21777J9893J48532n0901j21954O7374O3331
$$ -37931 13808 -15405 24642 36340 -85437 -65544 82988 32087 -89867 -22493 40838
158D0838o7050K3729N2167j03639j4976J46279j8055j30294M4520Q3405o2018
$$ 40838 -26212 -2483 49684 -53955 -68931 77348 59293 -71001 -26481 56924 -5094
169e094p367O2756o8022m2078J07418K1851j02469j0972O1969m141N576O885o5891
$$ -5094 -12461 50295 -17727 -59805 47613 69464 -33005 -43977 17992 13851 19427 26312 -39579
182c9579M798R1155k0658q7940L3299N8622l6559q263K1662m0684J30P0612j6058
$$ -39579 -34781 56374 35716 -52224 -18925 39697 3138 -5125 16537 -24147 -24017 46595 30537
195C0537p3505K5080N1025l0801n314J6678l9762Q85O3510j0584p4179J7645N7609
$$ 30537 -42968 -17888 33137 2336 -2978 13700 -26062 -25177 38333 27749 -46430 -28785 28824
208B8824k3926k3341J9300j0239r610L0960K01m3124J2246M1590j5053k7653J1855
$$ 28824 4898 -18443 857 -9382 -18992 11968 12169 -30955 -18709 22881 7828 -19825 -7970
221g970J0770n773N961J972j1641O613J1043j2480n11J1828m041j1503J5157O446
$$ -7970 2800 -2973 2988 4960 -6681 -68 10975 -1505 -2016 9812 5771 -5732 9425 15871
235A5871k1797R11J9312o735j2596Q535N537j2907K728R286j0808m820J3678k067
$$ 15871 -5926 -5015 14297 7562 -5034 3501 9038 -3869 -1141 8145 -2663 -7483 6195 4128
249D128j3150O547Q036j3987M75J8273o570j5259P806J0916j1349k050J0450l989
$$ 4128 -9022 -2475 5561 -8426 -7951 10322 3752 -11507 -3701 7215 -4134 -6184 4266 277
263B77n265Q301k15r174K056Q852n163k558K429l606J456J907l762j89O431k444
$$ 277 -4988 3313 3098 -6076 -4020 4832 -331 -2889 -460 -4066 -2610 -703 -4465 -4654 1777 -667
279f67o384O487K345r999M332J2856p102j0041R740O028q976J611N159k250N16
$$ -667 -7051 -564 1781 -8218 -3886 8970 1868 -8173 1567 7595 -1381 230 5389 3139 3655
294C655K857n963k681R248Q02r731M331M833p808j387M144l93l665K258N11m202
$$ 3655 6512 549 -2132 7116 7918 -1813 2518 7351 -457 -1844 2300 1907 -1758 500 1011 -3191
310c191J235J17k502L675K411o900J030N851m712m132Q861J700o322J078K990
$$ -3191 -1956 -1839 -4341 -666 1745 -5155 -4125 1726 -2986 -7118 1743 3443 -2879 -1801 1189
325A189m737M95Q029j816p073L993M176n635k790L406L609j839k039r6k0J273
$$ 1189 -3548 -3053 4976 3160 -3913 80 4256 -1379 -4169 -763 2846 1007 -1032 -1128 -1148 125
341A25j263j321K026M16p27j946q73L167J803j971J213K955k754k322L777L280
$$ 125 -1138 -2459 -433 -17 -744 -2690 -3563 -396 1407 -564 649 3604 850 -1472 2305 5585
357E585o153L066L416l782l415L373j442m91N362j808p655K349L950o856J371
$$ 5585 -568 2498 5914 2132 -1283 2090 648 157 5519 3711 -3944 -1595 2355 -4501 -3130
372c130P098p529k563J0379n072j3181J1961J0323j2800k577J2117o400o925J2959
$$ -3130 3968 -3561 -6124 4255 -817 -13998 -2037 8286 -4514 -7091 5026 -1374 -8299 4660
386D660n74j2585J1220P386j6428J519J4281j0791n105J7364m136j8429J2710
$$ 4660 4086 -8499 2721 10107 -6321 -4802 9479 -1312 -6417 10947 6811 -11618 1092
399A092J0987k0033J318J9319j3389j1304J9092k787j8598J4194J3439j9673k304
$$ 1092 12079 -7954 -6636 12683 -706 -12010 7082 4295 -14303 -109 13330 -6343 -8647
412h647K1205j5533j0926K5530k442k4861J6646J8332k6522n567K7765j0057j8806
$$ -8647 12558 -2975 -13901 11629 9187 -15674 972 19304 -7218 -12785 14980 4923 -13883
425a3883K4400M510l2640Q841K7920j9538j4814K6172n679k2493J9699J2005k8796
$$ -13883 10517 15027 -17613 -8772 19148 -390 -15204 10968 5289 -17204 2495 14500 -14296
438a4296K900L0990k0647k1153L0037L919l2080J6034K4567l0011p352L6979j2501
$$ -14296 -11396 19594 -1053 -22206 7831 11750 -20330 -4296 20271 -9740 -17092 19887 7386
451G386l3859K9852K1303l6602J677L1929k2997j9096L6791j544l8180K5032K5605
$$ 7386 -26473 3379 24682 -11920 -10243 21686 -1311 -20407 16384 14840 -23340 1692 27297
464B7297m2584m581M5716j9405l5528M0085J2983n0044J2564M1377l3616j9032
$$ 27297 -15287 -19868 25848 6443 -29085 11000 23983 -26061 -13497 27880 -5736 -24768
476b4768M6157q683m5603L5181K8457m7901n90M4058k5514k7292M5968j217m9203
$$ -24768 21389 12706 -32897 2284 30741 -17160 -17750 26308 794 -26498 19470 18253 -30950
489c0950K8493L5098m5904o608M9428k3250m1609M4432J8797n1117J1811L9774
$$ -30950 -2457 32641 -13263 -19871 29557 6307 -35302 9130 27927 -23190 -11379 28395
501B8395l9819j6987N0945r144m3340L1629K1666m2319N401L8903l0902j7774
$$ 28395 -11424 -28411 22534 13390 -29950 1679 23345 -18974 -13573 25330 -5572 -23346
513b3346M5315o470m5961L1078L1047m4084q744M5016j6542k7676L2400L464l8069
$$ -23346 21969 15499 -30462 616 31663 -12421 -21165 23851 7309 -20367 12033 15497 -22572
526b2572K0272L1367l7053j3068L6356o826k7066K3193N830l0135J8042K9262
$$ -22572 -2300 29067 -7986 -21054 15302 8476 -18590 4603 10433 -19702 -1660 27602
538B7602l7854j9704M3614J892l0324J5153J0039k8881J0734L3754k4946k4736
$$ 27602 -10252 -29956 13658 15550 -14774 379 10418 -18463 -7729 26025 1079 -23657
550b3657L2071O111k7830J4570J5569k8390L249K9094k2077k1359L4675M678l5566
$$ -23657 8414 14525 -13305 1265 16834 -11556 -8307 20787 -1290 -22649 12026 16704 -18862
563a8862J4008K2566k9468J36L5235k2484l1648L4764J7947l4297M030K1549k5359
$$ -18862 -4854 17712 -11756 -11620 23615 1131 -30517 4247 22194 -12103 -8073 13476 -11883
576a1883n99L7939k0852l3019L5880J7847l9346L712K8625k4342q206L9982j6509
$$ -11883 -12482 25457 4605 -28414 7466 25313 -14033 -10321 18304 -6038 -14244 25738 9229
589I229m0435L2645K7878l8281p023L0028j6137j2477L2818q013m0408K5967L1571
$$ 9229 -31206 1439 29317 -8964 -15987 14041 -2096 -14573 18245 10232 -30176 -4209 27362
602B7362l4585j0899L0919j2684j7763L0129n99l6451K1471L2321l5198j8852
$$ 27362 -7223 -18122 12797 113 -17650 12479 11880 -24571 -3100 29221 -5977 -24829
614b4829L9010k749k5615K2527O365l5631J1993L6222k3795k5243K7984L211k2931
$$ -24829 14181 11432 -14183 8344 14709 -20922 -8929 27293 3498 -21745 6239 9450 -13481
627a3481J8977J2325l6270Q94M0649j4571l0582K2280J2713k4911R756J8706k5862
$$ -13481 5496 17821 -18449 -17555 23094 8523 -22059 221 12934 -11977 -2221 16485 -9377
640i377q297L5333n906l0544J6275J6767j8738J295J7550j9708j1506L1567o28
$$ -9377 -17674 17659 11753 -18791 -2516 14251 -4487 -3192 14358 -5350 -16856 14711 14083
653A4083l0358J1577K0292j9106m994J7920j1781j1632K4988J700l1436Q833K6367
$$ 14083 -16275 -4698 15594 -3512 -8506 9414 -2367 -13999 10989 12689 -18747 -9914 16453
666A6453j6820j1657J7458n980j2015K0855M977k8651M089K6229j0594j3169J4431
$$ 16453 -367 -12024 5434 -546 -12561 8294 13271 -15380 -11291 14938 4344 -8825 5606
679E606m098j4126J9168Q891k5021J352K2538j1530j3834J4642J764j4102J1882
$$ 5606 1508 -12618 6550 15441 -9580 -8228 14310 2780 -11054 3588 5352 -8750 3132
692C132O443k0123J581J9421p673j3111J3823P52j3585R830R026j7752k7J7941
$$ 3132 9575 -10548 -8967 10454 2781 -10330 3493 4245 -9340 490 9516 -8236 -8263 9678
706I678n334j3229J1826J732j2370R060R711j4402m454J6535l970j3070R405N330
$$ 9678 4344 -8885 2941 4673 -7697 1363 11074 -3328 -7782 8753 4783 -8287 1118 6448
720F448j0430K923Q040r976n251J3228j588r893O318M347r455J835Q482n555n785
$$ 6448 -3982 -1059 6981 -2995 -8246 4982 3394 -6499 -181 4166 -5289 -3454 5028 -527 -6312
735f312R129J952q757K850N448o725O91P567n537m491P154J029p155J151P016
$$ -6312 2817 4769 -3988 -1138 4310 -2415 -1724 5843 306 -4185 2969 3998 -3157 -2006 5010
750E010n060k526N345j899n561N458K939n351P8K458j247l362L732J289m188J621
$$ 5010 -50 -2576 2769 870 -4691 767 3706 -1645 -1567 891 -356 -3718 14 1303 -2885 -1264
766a264L810l342k269M339L17j815K06J615j703j564K999P06k855J275K365m126
$$ -1264 2546 -796 -3065 1274 1591 -224 -18 1597 -106 -1670 1329 2035 -820 455 2820 -1306
782a306l09K621p01l72J48J561k730j020K045m85j073J413J543l374L40K022r93
$$ -1306 -1615 1006 305 -67 81 1642 -1088 -2108 -63 -548 -1621 -208 1335 -2039 -1699 323 -670
799f70j969L714K20l115J812J447k878P00L465j509k094J709P59k358L03K958
$$ -670 -2639 1075 1295 -1820 -8 1439 -1439 -739 2726 1217 -877 832 1591 -767 -464 2494
815B494k295o36J384j574r36J573J092j677n00K298j550j005P80N69p99J337m26
$$ 2494 199 -437 947 -627 -1563 10 1102 -575 -1075 1223 -327 -1332 -552 17 -782 555 129
832A29j424K048p55n45k36J622j013R87J79j516N3K380j164j314R12J499k751
$$ 129 -1295 753 -2 -547 -783 839 -174 813 992 -524 -471 1909 745 -569 343 1842 -909
849i09M26J325j305m13K364j010l546K734O17k475J498K296k739j642M098l11
$$ -909 -483 842 -463 -876 1488 478 -3068 -334 283 -2192 -694 1602 -1137 -2779 1319 1008
865A008l903K709K980l219o21K767l049K34L712K42m877J819L601m112j930M984
$$ 1008 -2895 -186 2794 -425 -1046 1721 -1328 -1094 2618 2860 -2017 -198 3403 -709 -2639 2345
881B345r51m256M313J135n512J199M268k340k975L501N65l727J767K783m862M78
$$ 2345 1394 -2862 1451 2586 -2926 -1727 2541 201 -2774 727 1292 -2435 -668 2115 -2747 -2269
897b269O154k467m637L198J943l815K354M352o028k894P664J94p373J633O217
$$ -2269 3885 1418 -3219 -21 1922 -1893 461 4813 -1215 -4109 3555 3749 -3624 -1991 4226
912D226n615o13N336m411l851O798J906p282J689M404m241r91M981l045m793O877
$$ 4226 -1389 -2002 3334 -1077 -4928 1870 3776 -3506 -1817 2587 -1654 -2645 2336 -709 -5502 1375
928A375L305p915p95O814j851k679M697k676n547P344M735r188k049P081r28l769
$$ 1375 4680 -3235 -4030 2784 933 -1746 2951 275 -5272 2072 6807 -2381 -4430 2651 1723 -2046
944b046M497j900o240O984N090j0205l208J0586k313n071N226l4p552O654P096
$$ -2046 2451 551 -5689 1295 6385 -3820 -7028 3558 1245 -3826 1400 1366 -6186 468 7564
959G564j1396m036J0818O20q235O298J470r042N659R380j2531l286J3748j995
$$ 7564 -3832 -7868 2950 3570 -4665 1633 3103 -5939 -280 9100 -3431 -6717 7031 5036
973E036j0653O599L618j0296O116J0519j4208q628J7746N99j4686P030O957j3265
$$ 5036 -5617 982 4600 -5696 420 10939 -3269 -11897 5849 6448 -8238 -1208 5749 -7516
987g516M855J3395j2408j1479J7632M198j6787P659Q435j4773K039J7437j3678
$$ -7516 -2661 10734 -1674 -13153 4479 8677 -8110 -451 7984 -6789 -4750 12687 -991
1000i91j2075J9292M873j9196M734J1947j2979j448J8796j1309j6314J8692Q557
$$ -991 -13066 6226 11099 -8097 -3363 8584 -4395 -5843 12953 1644 -14670 4022 12579
1013A2579k1291K245J4776r349p561J7779p656j6660J7304J1928k1304l278J8465
$$ 12579 -8712 -6467 8309 -1040 -8601 9178 1522 -15138 2166 14094 -7210 -10488 7977
1026G977o371j0103J5933l859j6913J4417J4889j9454o528J6388m129r342J3335
$$ 7977 1606 -8497 7436 3577 -13336 1081 15970 -3484 -10012 6376 2247 -7095 6240
1039F240M82j7748P261J5854j3867q712J7046j292j4150R972N891j5718L909J6361
$$ 6240 6722 -11026 -3765 12089 -1778 -10490 6556 5264 -8886 1086 6977 -8741 -4832 11529
1053A1529j1869j1289J4158M895j4501N512R026j2563l80J5843p638j3941J2633
$$ 11529 -340 -11629 2529 7424 -7077 -1565 7461 -5102 -5482 10361 2723 -11218 1415
1066A415Q206j4407J823J1065j1048m682J6013k925j5998J0012J0376j2416l001
$$ 1415 9621 -4786 -2963 8102 -2946 -7628 8385 5460 -10538 -526 9850 -2566 -5567
1079e567J0527o689o317J5193m25j7227O321J3086j0760m824J2683n661q477J1444
$$ -5567 4960 -1729 -8046 7147 6722 -10505 -4184 8902 -1858 -6682 6001 340 -8137 3307
1093C307M163j4333L729J2499j0578o816J3532j161j1258P715O475j2997J325
$$ 3307 7470 -6863 -3134 9365 -1213 -8029 5503 4342 -6916 799 7274 -5723 -4398
1106d398J3273p513j0200J0140K564r722O306P133j2503j901J4141n311j0873
$$ -4398 8875 1362 -8838 1302 3866 -5856 450 7583 -4920 -6821 7320 2009 -8864
1119h864J0874L802j1933L599R733r843m035J3611j932j2526P391O573j0167J425
$$ -8864 2010 5812 -6121 -2522 7211 -2632 -6667 6944 5012 -7514 -123 6450 -3717 -2292
1133b292R469p777o351J1676M43j1352N319O938r352j594J0903m722r243R153
$$ -2292 7177 -600 -6951 4725 5168 -6184 -865 6073 -3279 -4873 6030 1308 -7935 1218
1147A218L914j0480K477R314o988o087R902q16p337O088M397r819o7R664l647
$$ 1218 5132 -5348 -2871 6443 -545 -6632 3270 2454 -4883 1205 5602 -4217 -4284 5380 1733
1162A733o223Q051m11p970M840N927p037k673P681k334o888O276L366q368P25
$$ 1733 -4490 3561 3150 -4820 20 5947 -1090 -3763 3918 1584 -5304 972 4338 -4030 -3305
1177c305O877m579k687N928j072n494L507M265n778J02N906l756m008O125O81
$$ -3305 3572 -1007 -3694 2234 1162 -4332 -825 3440 -2338 -2236 3670 -86 -4094 2031 2712
1192B712n624K247M288m511j401M242m44l198K004K125l107j242K873j068j437
$$ 2712 -2912 -665 3623 -888 -2289 1953 1509 -1689 315 2440 -667 -1909 964 -104 -1541
1207a541K013M00k544R36J585k250L02K222j274j295R37K198k505p66J841O60
$$ -1541 472 872 -1672 -736 849 -1401 -1099 1123 -151 -1446 -509 1689 -816 -1582 259 919
1223I19j699M66J947j990l30J411L53j571L59P60p20n74J976r34j279J399Q7j372
$$ 919 -780 -314 1633 -357 -687 724 1077 -494 -135 625 -95 -669 1307 373 -906 493 580 -792
1241g92J51J236j098q13J460L23j555M74J395j006r46J224J048j396L04R25o04
$$ -792 -641 595 -503 -1316 144 467 -1088 -614 781 -225 -1171 53 1101 -295 9 934 330
1258C30o13R10j80l44J10N31l88m42Q56n44q15N34O07j014k38R23J42j392L41
$$ 330 -283 627 447 103 213 744 356 -86 770 226 -589 -55 552 -462 -700 223 365 -1027 -686
1277f86J365j532m77J771j48j316O50J269j466j96J601k57j173J224L86j393M63
$$ -686 679 -853 -1330 441 293 -1023 -373 896 -570 -766 835 578 -595 629 1015 -378 85
1294H5J101j660J01J600j050j444J905M76k446L82K183j328j720K242l3j930M82
$$ 85 1186 -474 -373 1227 177 -1267 638 1114 -1332 -950 1233 -95 -1815 427 394 -1536 -1054
1311a054K060j746n73K085n82j039J161M97j268K92J111j037j96J181j92j503
$$ -1054 1006 -740 -1313 772 190 -849 312 809 -459 -167 944 -93 -289 892 700 -803
1327h03J257P27j473k43J164j85j201N12J152j093q43O66L75o26N07J45m95R6
$$ -803 454 1181 -292 -535 629 444 -757 -245 907 -186 -1029 -363 12 -614 -107 38 -457 -361
1345c61N92n74K7Q00j04p87P43N39j278m0J584k27j543R26J090j619j22J481p64
$$ -361 231 -343 -316 484 380 -407 336 875 -403 -443 1141 914 -629 297 1387 -232 -354 1127 363
1364C63j462J446P37k010J38J234o67n70J274o11j408K072M48k729J105J914j510
$$ 363 -1099 347 1084 -926 -788 446 -221 -791 483 -128 -1536 536 984 -1745 -640 1274 -236
1381b36j030K098k70k081J905J692k696k22K298q94j188J804l64k193K063O31
$$ -236 -1266 832 562 -1519 386 2078 -618 -840 1458 564 -624 1180 816 -1377 686 1317
1397A317k645K84K666j416j948K707q18k722K765K210l788r76L588p80k287K420
$$ 1317 -1328 -1044 1622 206 -1742 965 147 -2575 190 2400 -1388 -2364 1224 444 -1843 577
1413E77K00k413J902K373l674n64L343p19k699K863K14l297J939L105m196j589
$$ 577 777 -1636 266 2639 -1035 -1599 1744 1025 -1674 1189 1403 -1894 45 3150 -1046 -2635
1429b635M580k69l764K020J326l466J383L631l569k314M276R0l122J756J553k671
$$ -2635 1945 1676 -2088 -68 1258 -2208 -825 2806 -763 -3077 1199 1289 -1833 -77 1476 -1195
1445a195Q57K930l272k465M600J699m607M04L210k737p3L426k275l908M032K510
$$ -1195 -338 2592 -680 -3145 1455 3154 -1453 -1049 2161 -576 -649 2777 502 -3406 626 3136
1461C136l951p74K754j941l41L497j839m145L533K859m227o56L624j749j587L476
$$ 3136 -815 -1589 1165 -776 -1117 2380 541 -3604 -71 2788 -1439 -2095 1529 -220 -1807 1669
1477A669p42m487L187M539m611k507M171j8k628K778j3m364L039M124m592l062
$$ 1669 927 -3560 -373 4166 -445 -2952 1219 1201 -1427 1351 1338 -3026 13 4137 -455 -3517
1493c517M893j86k995K703N24n062K375N684m749l935N112R41l563K368J063n118
$$ -3517 1376 1190 -1805 898 1422 -3640 -1265 4419 -330 -4265 847 1788 -1775 593 1656 -3462
1509c462J891O039l691m510M209J611m040K870J690n239R81O041l588n022M933
$$ -3462 -1571 4468 777 -3733 476 2087 -1953 917 2607 -2632 -1651 4390 802 -4220 713
1524G13K423n022J360K696m592M62O127l582n198M491L360m398J36K586l830K67
$$ 713 3136 -1886 -526 2170 -2422 -1960 4167 585 -4613 -122 3238 -1160 -1024 1562 -2268 -2001
1540b001N856k254n916L846L984l918r76K951k289j087M668n98n813K413M629
$$ -2001 3855 1601 -4315 -469 3515 -403 -1379 1572 -717 -1804 2864 2266 -3547 -1134 3495
1555C495k493k701K578r08j717L644J31m934N53N022j901l337K841N05k772K410
$$ 3495 1002 -1699 879 -29 -1746 1898 2029 -2905 -2352 2670 769 -2568 273 778 -1994 416
1571D16J931m364o25N670j411m699K290K871k416O88K040l993j602O074J15n708
$$ 416 2347 -2017 -2642 3028 1617 -3082 -792 2079 -337 351 2391 -1602 -3204 2870 2985 -2723
1587b723J292L372k579O8L255l724k588N713R83n920R36M443l111j039L867k458
$$ -2723 -1431 1941 -638 -570 2685 -1039 -3627 2086 3069 -2851 -1915 2528 -583 -1622 2245 -213
1603b13l349M874J496n195Q90L754k437j084L333k150k883M751J528n449O83M050
$$ -213 -3562 1312 2808 -2387 -1497 2257 -180 -1264 2069 -81 -2964 1787 3315 -2134 -1451 2599
1619B599k605j509L327j558k848M055Q97m836R32L760k267j404K581j819j470
$$ 2599 -6 -1515 1812 254 -2594 1461 2358 -2478 -1546 2214 -53 -1457 1124 -695 -2165
1634b165L687N15m036M97K924j610o86K604k018j750L098J119l526O78K254j706
$$ -2165 1522 2037 -1999 -1502 1422 -188 -874 1730 -288 -2038 1060 2179 -1347 -669 1585 -121
1650a21o35K249j705j206K566J43l000R81K128j627o26J365n68j373K090N61k521
$$ -121 -756 1493 -212 -1418 1148 1291 -1709 -728 1400 -227 -853 512 -56 -1429 661 1222 -1299
1667a299M36J902q34q53J102m25o17J283J58j368J14J367o81o21N31J55j068Q41
$$ -1299 -863 1039 205 -648 454 29 -588 695 853 -515 -401 966 285 -336 195 350 -718 123
1685A23J008j558o89J581L82j640L36Q23o67k24J236m57j635J228Q95j391m4J334
$$ 123 1131 -427 -1116 465 847 -793 -457 366 -301 -525 711 254 -1381 -153 742 -649 -693 641
1703F41o37p48J417l24j275J084R22j412l23J584j58j767J330P09j802L34J362
$$ 641 4 -744 673 349 -926 158 1080 -332 -655 929 771 -996 334 1043 -759 -425 937
1720I37j035j050J613l6j041O60L95r93m2J379r62j000J604K72j305M91J125j469
$$ 937 -98 -1148 465 429 -612 48 443 -550 -592 787 -175 -1175 429 701 -604 -113 1012 -457
1738d57j0J590n49j441J175P03j285K41N68o75k23P46j12o86K34O47o87m04J179
$$ -457 -467 1123 574 -867 308 1011 -274 -33 535 -140 -363 383 271 -415 -181 466 -221 -625 554
1757E54o17q63Q31L24p89J33Q57l80o99Q70j56k27J04K37k82k91N22J59k82K93
$$ 554 -63 -926 -95 229 -560 -427 430 50 -649 221 65 -162 -58 179 -103 -394 128 287 5 298
1777B98L49p25j15N81j04o85N39J42o25J95M23k69o03P28o8n17K14L85l62k86
$$ 298 647 -78 -193 388 284 -401 138 280 -345 -150 273 4 -599 129 61 -456 -242 143 -219 -505
1797e05O09Pn32M38L39n16J8J62o4j21O43n70l45O36K08p85L06L86o48L55J85
$$ -505 104 111 -421 17 356 -160 -142 20 -44 -165 478 -92 -437 199 407 -378 -72 314 -334 21 206
1818B06k24j61K96j8l84J56N2l07K26M25o27K09L92k37j31P7M20p00K96O26n14
$$ 206 -18 -179 117 99 -285 -129 -77 -384 -158 267 -360 -151 241 4 -127 -50 370 -330 -34 592 78
1839G8j73L75k9j38L38K8n72K83J28n20P6J87j84m94N33J01m11M02K96q17K96
$$ 78 -95 280 251 113 451 479 -93 190 318 -202 -126 61 -123 -617 -84 17 -394 8 304 -513 -217
1860b17L46q4k94L99K85m83J7N42p36L0O96k18m86O46Jo77L00J37k25l95N66K88
$$ -217 129 45 -249 150 435 -48 -31 511 -225 -195 501 283 -203 443 444 -233 67 204 -21 -416 150 438
1882D38j087N54L35o50o8O44k23r27R72L90r19P3R69l45o00Q61Q4r87O94M99p42
$$ 438 -649 -95 240 -410 -478 166 -57 -984 -12 378 -541 -468 501 156 -444 417 501 -486 208 707 -35
1903c5m66J202o13p12J110K49j404O83R25j370l07J006L8j074R14K80j010L5J389
$$ -35 -501 701 88 -624 486 735 -669 14 939 -431 -738 268 306 -768 146 426 -584 -549 840
1922H40r07r88J871k30j813J415P77k105M95J553o51p55J473k82j873J447R84
$$ 840 -67 -1055 816 586 -1227 188 965 -1140 -645 908 257 -498 975 693 -1180 267 1251
1939A251k094L16K045j220j783K176J86j775J109Q89j932k97K084r26j381J692
$$ 1251 -843 -527 1518 298 -1485 691 877 -898 211 1100 -832 -1129 955 29 -1352 340
1955C40N71k121P58J474j373l65J666j79j720J269L81j795P20J631j479LJ368
$$ 340 911 -1210 -452 1022 -351 -716 950 771 -949 320 701 -1094 -374 1257 -222 -219 1149
1972A149m86j742J212L84j133N86P88j118o12J818k43j527J155K81q06o02J894
$$ 1149 663 -1079 133 517 -616 -30 758 -360 -972 846 603 -924 231 512 -294 -896 998
1989I98l84j681P50J549j733l2J186l65r38J533N8k068J079P26p56p36J565j186
$$ 998 614 -1067 -317 1232 -501 -533 653 288 -650 883 941 -1127 -48 678 -78 -814 751 -435
2007d35j16P39Q81j675K45R25j137k96J922j204j427J469M46j407N50J968q78
$$ -435 -551 188 1069 -606 -361 564 -573 -869 1053 -151 -1578 -109 337 -1070 -520 1448 570
2024E70j324J524r59j146J943J1j603j11J956K22l067K663n07n59J247N1j336
$$ 570 -754 770 -189 -1335 608 619 -984 -1095 861 1083 -1984 679 172 -387 860 911 -425
2041d25l95J469m62k330K035N36j935R08J604j644l71J513K28j969J476J358l043
$$ -425 -820 649 187 -2143 -108 428 -1507 -599 1005 -639 -1010 503 731 -1238 238 1596 -1447
2058a447J604O21j691N43J729k19k602J247J243j330J42P46j095r0J022L36j832
$$ -1447 157 778 -913 -370 1359 1140 -1462 -215 1028 -302 -160 586 -509 -599 423 759 -1073
2075a073J623P53k628O68J329j368p98K785j02k211L46J708q35l10P84j236lM68
$$ -1073 550 1303 -1325 -657 672 -696 -1494 1291 1189 -1022 -676 1032 197 -113 671 -565 -568 -100
2093a00J580k195k94J627j94j224J853m52m69k10J059j280J59J043o86j050M85
$$ -100 1480 -715 -1009 618 424 -800 1053 601 132 -78 981 -299 -140 903 217 -833 -348
2110c48R49j777J354O41k633K91J540Q4q13L79P15r75m25K093j904Q6J257K11
$$ -348 601 -1176 178 819 -1814 -1523 17 101 -712 -333 382 -593 -1018 1075 -829 -743 514 725
2128G25j554K4J002K08r93J396j268o44N02K202k321Q8P67k57q78J652o49j878
$$ 725 -829 -805 197 405 -588 808 -460 -1104 -602 1600 -721 -633 134 -123 -1001 651 2 -1876
2146a876J958O42j109l26J523K2j137j0Q73j317R78M76j593L62R79J32k112J283
$$ -1876 82 724 -385 -711 812 834 -303 -313 560 -757 221 697 -896 -534 445 577 -1535 -252
2164b52M28r33l96J669L7r50N88J72k22n45n9J33m80K019j734K36m66M49m13p3
$$ -252 176 -757 -1153 516 553 -397 191 363 141 -404 -463 -330 -810 1209 -525 -289 -755 -306 -719 -792
2184g92J76m36J270K89q77q09N42J115m72Q7o40N78r55J313k97j446J077J248
$$ -792 -616 -1052 218 507 -370 -1179 -637 478 6 93 -547 31 -924 389 92 -1354 -277 971
2202I71k90j503N16M74q40N07n71J272K0m93l39r66J904j255R51p20J272j112
$$ 971 681 -822 -306 168 -672 -165 -736 536 556 63 -276 -1242 662 -593 358 -362 910 -202
2220b02m75Q03p01Q32J029j259j84N96r34L82K46L39k37j038L84J58R16m35k52
$$ -202 -677 126 -575 257 1286 27 -157 439 -495 -113 133 472 235 -803 -419 -261 655 220 -32
2239c2J11L28k92K8K63n07M81o65o37O49O88J74m87k41M74n89m0K38N39M0P44
$$ -32 79 407 115 143 406 -101 380 -285 -922 -273 415 589 102 -139 335 -254 -294 -56 483 523 1267
2260A267j644J94O97n91L02p04k91O35K48L11q56R70k97o20M01m22J069l09j35
$$ 1267 -377 -183 514 -77 225 -479 -770 -135 113 424 -432 538 241 -379 22 -400 669 360 225
2279B25L9j83q2l2M56j049qP9M62Q15p07N39m23o05N85j135J531j901J624K65
$$ 225 264 81 -1 -33 423 -626 -634 -555 -93 722 15 554 131 -474 111 -1024 507 -1394 230 495
2299D95o20j50N6L09O40m57p88n97J627l46p25Q6N87p97j97J069m37l41J81R82
$$ 495 -125 -275 -219 90 730 273 -515 -1112 515 169 -556 -470 117 -680 -877 192 -245 -586 -405 577
2319E77p79N55j148L98M87l05O26L60q55O29l87k92P47o31K08K44o06o6k43J105
$$ 577 -202 353 -795 -397 90 -215 411 771 -84 545 158 -134 613 -18 190 434 -172 -238 -481 624
2339F24J8j018J03O3k03k74Q83p49J7J810j172qJ000R0j438m8L33K57j137Q96
$$ 624 642 -376 -273 -210 -413 -687 196 -553 -536 1274 102 94 1094 1184 -254 -302 31 288 -849 47
2359D7p05M89n87Q11J58o85P92q5M92p91O6o77j220K833n83j472J372r00O79l51
$$ 47 -658 -169 -756 55 213 -472 320 235 727 -64 2 -675 -1895 938 355 -1117 255 -645 34 -317
2379c17P43p79r91J214k23N04j13j70K66k15J28j98k72N09o16l55J369q16N55
$$ -317 426 -353 -1344 -130 -353 151 38 -132 134 -81 47 -151 -423 86 -530 -885 484 -332 223
2398B23j037J235q95k15Q50k24l50P07j73O49j168Q85j062K10m25J132l59o29
$$ 223 -814 421 -474 -689 161 -63 -413 294 121 770 -398 487 -575 -365 -790 342 -17 -646
2416f46k80J603j522J044o41N49r2k12l64l89J372p31r4K83M70k248K067O65k87
$$ -646 -926 677 -845 199 -442 107 15 -197 -561 -950 422 -309 -403 -120 350 -1898 169 834 547
2435E47j051J740j545j21J540j226Q41j797J263m82j7R54n80J92k9Q31j604R58
$$ 547 -504 1236 -309 -430 1110 -116 725 -1072 191 -291 -308 646 66 258 229 1060 -544 414
2453D14K90n03j26m03J640j728M49l12k14N50M34O77k717J693n83K14J65N06r54
$$ 414 704 201 75 -328 1312 -416 33 -279 -493 57 491 1168 -1549 144 -439 -225 -60 446 -508
2472e08J47L03M02J84j76k95n06K16M29J80j390M60R52o90L29P08j509J187j234
$$ -508 -361 -58 344 528 352 57 -449 -233 196 376 -1014 -554 398 -292 37 745 -764 423 -811
2491h11P44m33J251l56r44o0k68O32J61K9k71L12P63r43j97J9N20J062j064k23
$$ -811 -67 -500 751 395 -549 -609 -877 -245 -84 -55 -326 -14 749 -194 -391 -372 148 1210 146 -77
2511g7O48n52L49L91q90M84J27K12j292R06M73j253J107K4P7j372J205j84j031
$$ -77 571 19 368 759 -131 353 480 692 -600 306 779 -474 633 657 734 -638 567 383 -648
2530f48K49j9K74p99Q07j42q6P69J69j257J027K82l20m57O50j189J221J69J8q53
$$ -648 -399 -418 -144 -943 -136 -278 -364 405 574 -683 344 626 306 -151 499 -690 531 700 718 -135
2550a35L9L09M91j356R42p86r63J974m97j37L50L2m27J78L88r18o98J523K65j519
$$ -135 -96 213 704 -652 290 -496 -1459 515 18 -119 231 263 -164 14 402 -516 -1214 309 574 -945
2570i45J76J095Rk87K65J68n40m9K01K23j032J286o4j106m2P94j65J50P14j792
$$ -945 -769 326 335 48 313 481 -59 -108 93 316 -716 570 506 -600 -642 152 -13 137 851 -941
2590i41J98P15j68j65p1K81R6j47M70p20m35O72K7n57L04P25p52o14J768p60r8
$$ -941 -743 -28 -196 -361 -432 -151 -55 -202 268 -452 -887 -215 -188 -745 -441 284 -468 -1082 686 -74 -172
2611a72j3P84j16k90L35P4p5l23l80l97j89N20j36J82r8K75j30M73J6o10j18K75
$$ -172 -185 599 483 193 528 602 527 204 -176 -573 -762 -242 -378 -196 -294 -19 -149 324 340 -270 -388 -113
2633a13N09j464K36J02Q09j66N11p18M73M52q36L51q61N87j253K154j518n67Q23
$$ -113 396 -1068 -832 -730 79 -87 424 -294 179 631 -205 146 -715 -128 -1381 773 -745 -1312 -489
2652d89N14r51K02L10k63j106J406K69P54n63n09M06l63m01J30L9L23L0M64j413
$$ -489 25 -926 -724 -414 -677 -1783 -377 -108 646 83 -426 -20 -383 -784 -654 -615 -292 -262 202 -1211
2672a211J660r55O67J90K96l43p20k74l21N29Q23l75j20j017J846m96j005J075
$$ -1211 449 -506 161 351 647 304 -416 -690 -1011 -482 341 -34 -154 -1171 675 179 -826 249
2690B49n64P9j13O6m14J15M10rQ4l83Q80k26M71j123L45p39R68M8O47p10J269
$$ 249 -315 -236 -349 -283 -697 -582 -172 -181 -97 -480 400 174 645 -478 -133 -872 96 144 791 81 1350
2711A350j381J38N15p52j388K020p16m25J522n50l53p0J32m71m09j28Q96J3j258
$$ 1350 -31 107 622 -130 -1518 502 -214 -639 883 333 -20 -90 42 -429 -838 -966 -70 -57 -1315
2730a315J162L48m5j332R15k58L24O73q66J10M11o35J95Q21p93l0M16j6p23O96
$$ -1315 -153 195 150 -1182 -267 -525 -201 472 -394 -284 127 -508 -313 508 -285 -315 101 85 -638 58
2750E8J9n61N55n89J23J9n79J529j392R55l07m79M78m30J056k39M9j64R48j732
$$ 58 77 -484 71 -518 -395 -376 -955 574 -818 137 -170 -649 -171 -601 455 216 265 101 1049 -683
2770f83K14l66O56N55r73L03P37J63j194J082m52n57Q43n63K40m61J212k9q83
$$ -683 -469 -835 -179 376 -597 -294 443 606 -588 494 42 -515 328 -235 5 -456 756 727 -156
2789a56M47j169R44j39M29m02j93Q16m65m02L24l31J192p29o38N50N42N4N4l12
$$ -156 291 -878 66 -73 356 -46 -239 577 112 -290 34 -297 895 166 -472 78 620 674 728 416
2809D16j031R20o98N10K11n1P7j051J188k42p56O72n28M31q4r6M59n96K71m99
$$ 416 -615 305 -393 117 328 277 354 -697 491 249 -507 165 -363 68 -16 -112 347 -249 22 -477
2829d77J16J08K94o92L57K81N66k09k3N2m03j30M3N54r42M20l78o57R91K58M06
$$ -477 -361 -253 41 -651 -294 -13 553 344 321 373 -30 -160 -117 437 -505 -85 -463 -1120 -129 129 535
2850E35m2l34l79O61J36q09mL97j65M91M5r48N61p24J72m23J108n36Q73p24j217
$$ 535 493 159 -220 441 577 -232 -236 161 -4 487 532 -416 145 -579 -407 -830 278 -258 615 -109 -1326
2871a326K412j150n67J68L57J26K62O9K61j70j298M04l43O96o76N39N0K78M83
$$ -1326 1086 -64 -631 -463 -106 20 282 351 612 442 -856 -452 -795 -99 -775 -236 -186 92 575
2890E75p08N99o33Q10j406M25j94k19N91J6nL38K94r40l21O04N60n0J43o8p48
$$ 575 -133 466 -167 643 -763 -338 -532 -751 -160 -144 -149 189 483 -457 -778 -174 386 336 479 411 -337
2911c37P59l55J68n08L30k60M29q4k08o03P78J031j270N29J71j849J098K41n74
$$ -337 422 67 235 -273 57 -203 226 142 -66 -669 109 1140 -130 399 570 -1279 -181 60 -514
2930e14n1N87Q11o45o46P67P7m28K83J27P62j185M94m07M12k77P42j37q20M36
$$ -514 -565 22 833 188 -458 309 386 -42 241 368 1130 -55 439 32 444 167 909 772 -48 388
2950C88q78J023N23r46K56K72o97p07J564o72n69o8P83j97p68J515o61m27n19
$$ 388 -490 533 1056 110 366 638 -59 -766 798 126 -443 -511 272 75 -693 822 161 -266 -785
2969g85J055m67j83L3q5L25J13J85L04n67K87r19P57L47j73m2m71N35k58J114
$$ -785 270 -197 -380 -347 -432 -107 6 191 495 -72 215 -704 53 400 227 185 -286 249 -9 1105
2989A105m32p19l64L95j07j95K29M44r88O16Q57j235M06K28k50k13J510j338M1
$$ 1105 673 -46 -410 -15 -122 -317 -88 356 -632 -16 841 -394 12 240 -10 -223 1287 -51 -10
3008a0K64j16l84J48m23N63J12o21J131j086P00m38l86R14l26n56l38K48J353
$$ -10 254 138 -246 -98 -521 42 154 -467 664 -422 278 -160 -546 368 42 -514 -852 -604 749
3027G49j371R1M57k83N2L43O94j221J28M5K91l96J37l93P35R08q20m74K96N22
$$ 749 -622 -531 -74 -357 -305 38 732 -489 -361 -316 -25 -421 -284 -677 58 966 146 -328 -32 490
3047D90j474Q30n5K2O3M65o86r9k10Q25l78j01M22M64k0m58m4p14L94o30N43J10
$$ 490 -984 -154 -209 -187 -124 341 -345 -444 -654 171 -207 -308 114 578 558 100 56 -658 -264 -894 -351 -241
3069b41J049r04j10O07o51P6m13O71M49r80L61J59K17m66J54o36M89P18r46K24
$$ -241 808 -96 -206 401 -250 -174 -587 84 533 -447 -86 73 290 -176 -22 -658 -169 549 -397 -173
3089a73Q21m58J28r6o78N05K46p6j27j43m62R27p60l1L99L8p43J37L53L70k93
$$ -173 648 190 318 222 -456 49 295 219 92 -51 -513 414 -346 -377 22 60 -683 -546 -193 177 -116
3110a16J41J01j86j3n13O0L33L36k65O28l31j66K86l28J36q42Q79m9L23m10m12
$$ -116 25 126 -60 -73 -586 -526 -193 143 -122 506 175 9 295 -33 103 -739 140 91 414 4 -408
3131d08J137j004K33P3j68L84K07m57j2K25p23J5M74M50n56J62O63j339O59k90
$$ -408 729 -275 -42 31 -137 247 454 -3 -15 210 -513 -498 -24 426 -130 32 695 -644 15 -275
3151b75Q3J09J10qJ92K08k72O38j649J031n70K97L7K41k8j13M37q38K28n04Q30
$$ -275 -192 -83 27 19 211 419 147 785 -864 167 -403 -106 -69 172 144 31 468 -370 -142 -646 184
3172A84j3j97m39j23j03Q47k85p1J48J92l53j22M52q56O27j61K12k66L02K66q26
$$ 184 171 -26 -465 -588 -691 156 -129 -200 -52 140 -213 -335 117 -739 -112 -273 -61 -327 -25 241 -585
3193e85N40J43j90J04j78L09J93j56k78K51l17K85k2J53N22p23L83K32q11M73
$$ -585 -45 98 -92 12 -166 143 336 180 -98 153 -164 121 99 252 774 51 434 666 -145 328
3213C28k35j25j21L02l22K59K06k2J4j68L00k19k35L17j2n54O2L32j62j39m7R5
$$ 328 93 -32 -153 149 -173 86 292 270 284 116 416 197 -38 279 267 -287 -225 107 -55 -194 -241 -146
3235a46K67r2K16l04K82j35n49J058l28q11m7P96l01j13P27q72L59J31K73o82
$$ -146 121 29 245 -59 223 88 -461 597 269 -542 -589 207 -94 -207 520 -352 7 138 411 -271
3255b71M30j80pj14N9K49K35o41L54l6j34J34j82K28K73m99K28j11%j03J70nj69
$$ -271 159 -21 -28 -142 -83 166 401 -240 114 78 -56 78 -104 124 397 -102 126 15 15 -88 82 77 -92
3278i2R4R5p4n9K18j68L7J59k32K6j65K08j13K70j48j03j70J41K12l77K25l7J09
$$ -92 2 97 23 -36 182 14 51 210 -22 4 -161 47 -66 204 56 -47 -217 -76 136 -241 -16 -53 56
3301E6j22K27k55Q0J31k24K63r4k54K43j17K39j26K40k92R2j03J19j62J8P5K7
$$ 56 -66 161 -94 -14 117 -107 156 62 -192 51 -66 173 47 287 -5 87 -16 103 -59 -41 34 61
3323F1P0k05J70J14k15J20J99l04p0P3Q8k5j16L8j21k05N62j51L4j87M24j53k07
$$ 61 131 -74 96 210 -5 115 314 10 -60 13 101 76 -40 -2 -123 -328 234 83 117 -70 354 201 -6
3346fj03P4J98q0m5n0J27k26L61l99K15k19J1K75j81j13K27J02j5k18L61m38k1
$$ -6 -109 -35 163 83 38 -12 115 -111 250 -149 66 -153 -142 133 -48 -161 66 168 153 -65 296 -142 -163
3369a63R5k88L30J60j18j76L45j47j37J43Q4J7j96R6K86k68N8Q8k23N6J07m39
$$ -163 -68 -356 -26 134 16 -160 185 38 -99 44 128 145 -51 45 331 63 121 209 -14 42 149 -290
3391b90J85N8J75j42j56L47k15m45M35K4n9r9qJ90j38L50j73k71P6J40K33n60
$$ -290 -105 -47 128 -14 -170 177 -38 -483 -48 -24 -83 -182 -190 0 -138 212 39 -232 -156 -16 217 -343
3413c43L15m3O7K02M6l36N7P8j70K13j8R3l43j14J85m5K21jk26J51R5o1l03K22
$$ -343 -28 -71 -4 198 244 -92 -35 43 -127 86 68 161 -182 -296 -111 -156 65 64 -162 -11 84 23 -280 -58
3437e8j99M76j3k16M6p7R6J99l18J26K44k98j48L52n8l67K89j7J86l34K89k32
$$ -58 -257 219 206 -10 36 -41 55 254 -64 62 306 8 -140 212 154 -213 76 59 245 -89 200 -32
3459c2l2j25J60j01q3L60k71J3J75j14K7J00j12j71J20L08L7k67j49K57k6Rk0
$$ -32 -64 -189 -29 -130 -213 147 -124 -111 64 -50 -23 77 -35 -206 -86 222 259 -8 -157 100 74 83 63
3482F3j6j97K02k7m4m9J8j73J87q8J04J00k0l9j70K62l82O2M19j86O1j51lK6j30
$$ 63 47 -150 52 25 -19 -68 -50 -223 -36 -124 -20 80 60 21 -149 113 -269 -207 212 26 87 -64 -67 -41 -171
3507a71K95J45k56r0J50k93P1L06j2K9j94M2p4j80J63o7J19J85Ok14j00Q5m1K44
$$ -171 124 269 13 -77 73 -220 -149 157 145 174 -20 22 -52 -232 -69 -136 -17 168 174 -40 -140 -55 -96 148
3531A48q3p8K15k94J75r6j91R9K33QK38n48J09N22n50R9l0m0J45J25l63J73l07
$$ 148 65 -13 202 -92 83 -13 -204 -105 128 136 374 -174 -65 457 -93 6 -24 -64 81 206 -157 16 -291
3554b91J52J09oK67l3j92J52k81J19p0J83M9l42K72J62k92L9Q5K35n10J58k0J24
$$ -291 -139 -30 -36 231 198 6 158 -123 -4 -74 109 158 -184 88 250 -42 -3 82 317 -193 -35 -55 69
3577F9k50J41P2l45K75K15j30k83K84j05qJ5mj44N83m85J34j42K28k51n8L68n8
$$ 69 -181 -40 32 -313 -38 177 47 -236 48 -57 -65 -50 -54 -198 385 -100 34 -108 120 -131 -189 179 121
3600A21j11j2O6j14j51L71K0n2j13j03j98K24KP7Nl9K84m07K06k54p8J16K06m27
$$ 121 10 -2 64 -50 -201 170 190 138 25 -78 -276 -52 -50 27 32 -7 277 -130 76 -178 -256 -140 66 -361
3624c61K79K19k02p7K97j51k8pJ93m69K26L10j98j87K55j90N3J04P7j81j61K50
$$ -361 -82 137 -65 -142 155 4 -24 -31 162 -307 -81 229 31 -156 99 -91 -38 66 143 -38 -199 51
3646E1j83J70j87J10QK3J51j89P2j21k8L62j13j46o3L1O3l3j06J22K04j25j01
$$ 51 -132 38 -149 -39 -31 -8 143 -46 26 -95 -123 239 126 -20 -83 -52 11 -22 -128 -6 198 73 -28
3669b8l1l4j27K0l0J88J55l10J59J62p6p1J39k99J93R3o4l11K74k68L82k38K64
$$ -28 -59 -93 -220 -200 -230 -42 113 -197 -38 124 48 -23 116 -183 10 103 39 -272 2 -266 116 -122 142
3692A42j43K35m26J6J43j41R4K90l07L32m0j03k0m06N73l25J71OJ18l79K54j37
$$ 142 -1 234 -192 -176 -33 -174 -80 210 -97 235 195 92 72 -334 239 -86 85 91 209 -170 84 -53
3714e3R3j43j03K76nL4j24J09J20r4l20j9L44j90K26k33J9q7L44l11Q5J67l39
$$ -53 40 -103 -206 70 65 99 -25 84 204 110 -210 -229 115 -75 151 -82 -63 -150 194 -117 -32 135 -204
3737b04J03K42j3o9j31K62l58j37N13l33lP0J02m0k01J93n8j03M2k89N57k88K45
$$ -204 -101 141 128 59 -72 190 -168 -305 208 -125 -128 -58 44 4 -197 -4 -62 -165 -123 -412 145 -143 102
3760A02j42J56k18L0NL10j54p2J72n22M01J5n2K81n05n4M32k10L08k75l66j6J154
$$ 102 -40 116 -102 -72 -67 243 89 17 189 -333 68 83 31 312 -193 -247 185 -25 283 8 -358 -374 780
3783G80m64Ll82O84o89l13O89n26J92P75n33o90L72M16m93K58K02k9j381R48R50
$$ 780 316 319 -63 621 -68 -381 308 -218 -26 749 216 -474 -102 314 -179 79 281 252 -1129 -181 769
3804G69n95K61m80p36J463J96j358Q99k52q96L35J88j22O16Q0o7j22k21j19M12
$$ 769 174 435 -45 -781 682 878 -480 419 167 -729 -394 -206 -328 288 368 301 179 -42 -161 251
3824B51K03l77J298r15k87q81J519n99j37K61J87p6j36l38O56r02J235l69p13
$$ 251 454 77 1375 460 173 -708 811 212 75 336 523 447 311 -27 629 -273 962 593 -120
3843a20O60q54N89l05j15L01q2l63J87J57p9L95l99K9j28k7P9O97n98l1m08N59
$$ -120 540 -314 275 -30 -145 156 74 -289 -102 55 -24 371 -28 1 -127 -154 -75 622 24 -7 -415 144
3865A44p68M94M09n68J77N67m21M35o23n63M50K38L67r99R78r5o29N48r43J400
$$ 144 -624 -130 279 -289 -112 455 34 469 -154 -717 -267 -29 338 -661 317 222 -407 141 -802 598
3885E98o69L95p92K76L16K66J7l46M47k15k54k69N68k7P8l86J74L54j19m22Q6
$$ 598 -71 324 -468 -192 124 390 407 61 508 293 39 -230 338 311 389 3 177 531 412 -10 76
3906G6k33K66k89J62k99m0K15o2J84K29k62K34J4P88q39j54k42k07K01R62q73
$$ 76 -157 109 -180 -18 -317 -357 -142 -204 -20 209 -53 181 195 983 144 -10 -252 -459 -258 704 -169
3927a69K11L8p81K76O26n07M32L22q35M57k85N96p4n5j025N39O97k35J45j21j87
$$ -169 42 80 -701 -425 201 -306 126 448 -387 70 -215 381 307 252 -773 -234 463 228 373 252 65
3948F5K58m6N7l4l78Q6n24Q14m73P7m0L60k91m38K45Q1oJ80K18j19Q5p3l75N16
$$ 65 323 277 334 300 -78 8 -516 298 -175 -98 -138 222 -69 -507 -262 -181 -187 -7 211 92 177 104 -271 245
3972B45q2l01K03k88P22q37J38M77l64J0K90J47r91O17M32p09J45K69l49J84P31
$$ 245 163 -138 65 -223 499 -338 -200 277 -87 -77 213 360 -631 -14 418 -291 -146 123 -226 -42 689
3993F89j159P83%R7j28p4l24L52l02M29l19K04j57k13J22m05P81m36Q29n45p88
$$ 689 -470 313 313 410 282 208 -116 236 -66 363 44 248 91 -122 0 -405 376 -60 769 224 -564
4014e64P99o50N90j173O56P07m85K05o0k43k51O67o27P70p30J8L51L45q41O64
$$ -564 235 -415 175 -998 -342 365 -120 85 25 -218 -469 198 -429 341 -389 -371 -20 325 -516 148
4034A48L55q21O55n46P3K97k6k04R7l74K22M36k08J69k89q3P57p56J92K94p6L81
$$ 148 503 -318 337 -209 -136 161 135 -69 28 -346 -124 312 104 273 -16 -99 658 -98 94 388 312 693
4056F93J1j302j42J736j163j39l7O23l66J159j067J413q66r67K01k85J225j183
$$ 693 704 -598 -740 996 -167 -306 -343 280 -86 1073 6 1419 553 -414 -213 -498 727 -456
4074d56Q52k86Q8K45k36J83m13j45J56k11J26L82j3p88L03K82p95O22J5n92P61
$$ -456 396 110 198 443 207 390 -23 -168 -12 -223 -97 285 272 -516 -213 69 -726 -104 -89 -681 80
4095H0Q2l87L68j83o95O09L70K64p41M87n26R11q24N95n75L82k26j81J34K16n40
$$ 80 162 -225 143 -40 -735 -126 244 508 -233 254 -272 639 -185 410 -165 217 -9 -190 -56 160 -380
4116c80O5J00M67k17J43j15J00J01m5K33l94k40L08n90o2J071j54l02m19J29J33
$$ -380 -315 -215 252 35 178 63 163 264 219 452 58 -182 126 -464 -526 545 391 89 -330 -201 -68
4137f8L79m14J5MKK72m99O60O0p07M50j50K67m01J95N8L99q19M14J99m95M31n33
$$ -68 311 -103 -88 -84 -82 190 -309 351 411 -296 154 4 271 -130 65 123 522 -297 117 316 -179 252 -281
4160b81M16R8k92JL19m55K3r0N0K76p2K84m86k7K40J89m30Q7R9K80l79M15j22
$$ -281 135 233 -59 -58 261 -194 -171 -261 -211 65 -7 277 -209 -236 4 193 -237 -150 -51 229 -150 265 143
4183A43J65j72j72k0L15k22k14L54j17J02l62PK36O6k08R0k11L30j21k58K79m0
$$ 143 308 136 -36 -56 259 37 -177 177 60 162 -200 -193 43 109 -99 -9 -220 110 -11 -269 10 -30
4205c0k87L44J43j00l6Q3j17J10J55l88R6Q0J0k15J36p8l2L7JJ51k7j17J25j42
$$ -30 -317 27 170 70 34 117 0 110 265 -123 -27 53 63 -152 -16 -94 -126 -89 -88 63 36 -81 44 -98
4229i8P2K64o88L38PR5j7j87J07K93j15k87K34q6J26L6J1J27Rj97M4m96M19n7
$$ -98 -26 238 -450 -112 -105 -10 -27 -214 -107 186 71 -216 18 -68 58 94 105 232 241 44 88 -408 11 -46
4253d6R0k54J26oJ45l59K50J18j52J21m51N19J48k44J53l20O5O6lJ6O5r9mJ26
$$ -46 44 -210 -84 -90 55 -304 -54 64 -88 33 -418 101 249 5 158 -162 -97 -31 -34 -18 47 -52 -56 70
4277G0N3j40K27r1j73M31o02J95k32L87o3j48M3pQ3J41j14N2k35K93k37o5J66
$$ 70 123 -17 210 119 -54 377 -225 -30 -262 125 62 -86 -43 -50 33 174 60 112 -123 170 -67 -132 34
4300C4k46J96j60N62l24O3j14k9r9j1J54l1M8l11O21n33K76j39J18O9k07Q5R8
$$ 34 -212 -16 -176 386 62 125 11 -18 -117 -128 26 -5 43 -268 353 -180 96 -43 75 144 -63 22 120
4323A20l76L58L6o2qp5k3k51L60nq9L65m03R4m2J00r1k3K69l31J55j98J7J83j7
$$ 120 -256 102 138 76 68 -7 -30 -281 79 74 -15 350 -53 41 -1 99 8 -15 254 -77 78 -120 -103 80 63
4348F3P0k35J42J29l13oQ2l2j36p7R19q26N09k01j70Q2oJ34J21l77R5J10J8J78
$$ 63 133 -102 40 169 -144 -150 -68 -100 -236 -313 606 -220 289 88 -82 0 -6 128 249 -128 -33 77 95 273
4372B73k10k2k78R9J48k07kK93j73R3L7k19K6N81l15k37N3QJ49o6q0j87J34J31
$$ 273 63 41 -237 -138 10 -197 -199 94 -79 14 51 -168 -142 439 124 -113 -60 -52 97 31 -49 -236 -102 29
4396B9L7m75N13N8K7k52M7JL07k67j23K82k61K85k91l15L36M18l20j6O19p04L5
$$ 29 66 -409 104 162 189 -63 -16 -15 292 25 -98 184 -77 208 -83 -398 -62 356 36 20 639 -65 -30
4419c0J15J83l60Q0k22J69k0l13L50j6k59J85J83k38K66K1l80K88K3o1j36J96
$$ -30 85 268 -92 -12 -234 -65 -85 -398 -48 -64 -323 -138 45 -193 73 94 -286 2 25 -36 -172 24
4441B4K37l79K60k5J3j3m62O89l49j70M28k31p2j27J80K09k65q6K12j75J97m0
$$ 24 261 -118 142 117 130 117 -345 344 -5 -175 253 22 -50 -177 3 212 -53 -139 73 -102 95 55
4463E5J40k93J06J30J9m39M85l35j31L22N3K19k61j21K07K19n44KL3K37l02M25
$$ 55 195 -98 8 138 157 -282 203 -132 -263 59 112 331 70 -51 156 375 -169 -167 -134 103 -199 226
4485B26K5l26o2M66l99o4l2n7N29K0k62N5k88L92k01K53k24k55l50O59P7m33J49
$$ 226 251 -75 -137 329 -70 -134 -166 -223 306 326 64 119 -169 223 22 275 51 -204 -554 105 182 -251 -102
4508a02L05j50l7j81J30M47k47m28J99k36L50l19J78K80j28K11n9j28q7j54Q9
$$ -102 203 53 16 -165 -35 412 165 -263 -64 -300 50 -269 -91 189 61 272 213 85 -2 -156 -67
4529f7J03j98K07j9o2K61j62O8O8n67L31o9J43N4m9k7j38K1L57o69M58l09M76
$$ -67 36 -162 45 26 -36 225 63 131 199 -368 -37 -106 37 91 42 15 -123 -102 255 -414 44 -265 211
4552B11j70N4j91J32j75J20q1J87j07K6j13J10J02j36j8J7K80m32L79J5k85%K3
$$ 211 41 95 -96 36 -139 -19 -100 87 -20 6 -107 3 105 -31 -49 -32 248 -184 195 210 -75 -75 -52
4575e2j32J81j91L15m1M4k38L35l18q9L82q7J04m4j69J75j16Nj50M31l50J49k14
$$ -52 -184 -3 -194 121 80 124 -114 221 -97 -186 196 109 213 169 0 175 59 64 -86 345 -5 144 -70
4598g0j95M86m62K86Q1j51O0M39p23K23J72j88j5N9J55j03j54L51j46r0K54l69
$$ -70 -265 221 -241 45 126 -25 35 474 -249 -26 146 -42 -57 2 157 54 -100 251 105 15 269 -100
4620a00J55J6k71J89J23k3l26J76K08j17r1j05J50M6P4k14o1K04j17J07r1m7N1
$$ -100 55 71 -200 -11 112 89 -237 -61 147 30 -61 -166 -16 30 104 -110 -171 33 -84 23 -68 -115 -64
4643f4K31m9m4K46m48j00N78m10J62j54j34K08K03k79n0J81j9q5J02J63k29M7
$$ -64 167 118 74 320 -128 -228 350 -60 102 -52 -186 22 225 -54 -104 77 58 -27 75 238 9 56
4665E6Q2L0l94L26N9p2K6p7Rl30L73j56J43j57J26N9j24J1N6j03N4k20L04l3p5
$$ 56 138 168 -226 100 159 87 113 36 45 -285 88 -68 75 -82 44 103 -21 -10 46 -57 -3 -223 81 48 -27
4690b7p7J68k66J16o2N2K59n03J50L10J7j32l89M40J04M4k00l46M29J8J00m45
$$ -27 -104 64 -202 -86 -148 -96 163 -340 -190 120 137 5 -384 56 160 204 4 -342 87 105 205 -240
4712b40L00J3J7l5j34O6j74K43j22P6j6J16k35p4M43j39k47R0Q4QJ57j78p4M4
$$ -240 60 73 90 55 -79 -13 -187 56 -66 10 -6 110 -125 -199 244 105 -142 -52 32 40 197 19 -55 -11
4736a1j15J51K5n2Q1J4k32R4k9R1K13j25j83K5j16J62j38J98j1K1J4j51J37Q0
$$ -11 -126 25 50 -2 79 93 -139 -45 -74 17 230 105 -78 -53 -169 -7 -145 53 42 63 77 -74 63 143
4760A43p4K47l35j6n7J67Ol3k31J91R8K6p7j68R1K37l17K59l99K76J80o4j36k42
$$ 143 69 316 -19 -35 -92 75 81 48 -183 8 106 132 55 -113 -22 215 -102 157 -242 34 214 150 14 -228
4784b28K18m6R5j75J92q5J29p0k41K61J40j44P4M7l35J15J78l25M79l5l30O7j22
$$ -228 -10 -56 39 -136 56 -29 100 30 -211 50 190 46 120 167 -168 -53 125 -200 279 244 -86 -19 -141
4807a41J41N1j0L6R2j50L25j59L1k68K69k70R3j17O5K36k02J03o6P8o8P2m17K07
$$ -141 0 51 41 77 169 19 344 185 216 -52 217 -53 40 -77 -12 224 22 125 59 137 69 141 -276 -69
4831f9k4K02k4j20j08K22k08K55j98K61k47j22j99N37k63L60j52K11m7k82J42
$$ -69 -93 109 85 -35 -143 79 -129 126 -72 189 -58 -180 -379 158 -105 255 103 314 267 -15 127
4852A27n09N65l83Qj78N32k72j60k14J114o74L33o74j00N54O05p55l87N62r2N29
$$ 127 -382 183 -200 -192 -370 162 -110 -270 -484 630 -44 289 -385 -485 69 674 -81 -468 94 2 531
4873E31J96q57j19J694j547l02O81m31M31j91l60N12j22j78L58j00n9K31r0q23
$$ 531 727 -130 -249 1445 -102 -404 277 -154 277 86 -274 238 116 -62 296 196 137 368 278 -545
4893e45Q23j47K34o10M56j09M87j093O54K4M64n09k39L90L25Q0K3Lr57P67p04
$$ -545 278 131 365 -245 211 102 589 -504 150 174 638 129 -110 280 605 685 708 711 -246 521 -183
4914a83J36M55j039j11J334r30M6K19r96N77K33K16l14J079n94l41M47l53j5P93
$$ -183 -47 408 -631 -742 592 -338 -292 -73 -1069 -492 -259 -43 -357 722 128 -213 234 -119 -134 659
4934F59j159O67J80l08m0k71M95k71J24k73l1J38J10L21l7J19j36o38K53j87m24
$$ 659 -500 167 347 39 -1 -272 223 -48 76 -197 -228 -90 20 341 304 423 287 -351 -98 -285 -709
4955g09J22J095j61l52j41M10N5o59J92O1m17L25J93P9n91L86L63L78k58j89p3
$$ -709 -587 508 347 -5 -146 264 319 -340 -148 -87 -504 -179 14 93 -498 -112 251 629 371 182 109
4976A09K28n08n4L28p66K73j47J59k07J171l52K07m40o2L37o2L4k21M2j12J91
$$ 109 337 -171 -225 103 -663 -390 -537 -378 -585 586 234 441 1 -61 276 214 248 27 69 -43 148
4997A48p18O1K08j27L23q9L93p1l17J61J66J18j39o25q5O01K13j24m84L68o1n3
$$ 148 -570 -509 -301 -428 -105 -194 199 128 -189 -28 138 256 117 -508 -593 8 221 97 -387 -19 -80 -133
5019a33M32J50l19l07J6K1N68p20l36R60L6J2m89M57o31K30R7O1P0k93m13K32
$$ -133 299 449 130 -177 -161 -140 428 -292 -628 332 368 380 -109 348 -283 -53 44 105 175 -118 -531 -299
5041b99K85K89k20m0P5j83j22K46r2j48K85l03M02p26P55l10m5K34J42j25J56
$$ -299 -14 275 55 15 90 -93 -215 31 -61 -209 76 -227 175 -551 204 -106 -151 83 225 100 256
5062B56m67j28N31k55l35L67j8k01J49N6J42o31L36J22L19m18j07K0N73l6J43
$$ 256 -211 -339 192 -63 -398 -31 -49 -250 -101 -45 97 -534 -198 -76 243 -175 -282 -262 311 275 418
5083D18n29k83N80j93K58l26K10k66N54j09l75j02O34l69N57j96o14K30M73n57
$$ 418 -111 -394 186 -7 251 -75 135 -131 423 314 -61 -163 471 102 659 463 -151 79 552 -5
5103ej67K08j42R2lj44J04J7J15l28J12J22j19M05N7l77J19J28m56M1M58k97p74
$$ -5 -172 36 -106 -14 -17 -161 -57 -40 75 -253 -141 -19 -138 267 324 -53 66 194 -262 -221 237 -60 -834
5126h34M68O66j43o06n0R76p67L43m54K79j50l20L22J13L29n15K79JQ1Jk3k64
$$ -834 -366 300 157 -449 -499 477 -290 53 -401 -122 -272 -592 -270 -157 172 -343 -64 -63 18 19 -4 -268
5148b68L36l94K08J8M10m14j0L76l54m03R73j054K43R4K60K20l29J33P9q58M79
$$ -268 68 -326 -118 -100 310 -104 -114 262 -92 -495 478 -576 -333 -239 21 241 -88 45 124 -734 -255
5169b55J09J8L91o66P77R9m41N01p41j93N14o80K99K91l93j037J151j01N71J66
$$ -255 -146 -128 263 -403 374 473 32 533 -208 -401 113 -567 -268 23 -370 -1407 -256 -357 214 380
5189C80r58L00K46J36N5L63k67l46L67o16P46l01N09N54j530L22J2N30O47j151
$$ 380 -578 -278 -32 104 159 522 255 -91 276 -340 406 105 614 1168 -362 -40 -28 502 1149 -2
5209bk34O11m43j32J104o42m40L92O54m87l26L1j23Q44m53J094o28N1r92Q95p53
$$ -2 -236 375 -68 -200 904 262 -178 214 868 381 55 86 -37 807 354 1448 820 871 -121 774 21
5230B1k69J018l98l42k12P39n11k08N50r04N59K76O64r77m46Q15M49q16Q07j272
$$ 21 -248 770 372 30 -182 557 46 -162 388 -516 43 319 983 6 -440 375 824 8 815 -457
5250d57l52R59o6L95q98J258o59n40k99J203n46N10p20l6N25m57J452m57m15m52
$$ -457 -809 150 84 479 -419 839 180 -360 -659 544 -2 508 -212 -248 277 -180 1272 815 400 -52
5270e2J43k72n4L34N45j051P84j109Q75R4O6J46q47N51P09o49o43K80l02M04J68
$$ -52 91 -181 -235 99 644 -407 377 -732 143 237 303 449 -398 153 862 213 -430 -150 -452 -48 120
5291A20j80m65L67M03k03O30o54J62r03R67J51k15m67O5J54m07J055n54m0k14
$$ 120 -60 -525 -158 245 42 672 18 180 -723 244 395 180 -287 -222 -68 -475 580 26 -14 -228
5311b28k47K67P04k54j56J51L10m72p9L8J31k38l34M87o77k54J370r04N39np62
$$ -228 -475 -208 496 242 86 237 547 75 -4 34 165 -73 -407 80 -597 -851 519 -385 154 149 -613
5332f13J143j083P26m01J29l3J91j53K20m5R57j555L39J86l69J78M75n07P44m72
$$ -613 530 -553 173 -228 -99 -132 59 -94 126 81 1038 -517 -178 8 -361 -183 292 -215 529 57
5352E7l66K53L24j6M90r27O9J05N54j237J003p05M58K25l04M8J51M2n47J288r91
$$ 57 -309 -56 268 252 742 -185 -116 -11 543 -694 309 -396 62 287 -17 31 182 224 -323 965 -26
5373b6lj3k33K60L65n47N72m92j03M87k85k24J302p35l99J93l86M45L0P88r46
$$ -26 -29 -42 -275 -15 350 -197 375 -117 -220 267 -18 -242 1060 325 -74 119 -267 178 208 996 50
5394E0k75M26l14k33O78o12L47K61J55j087O85j96P6j66P60k63q60J167K39k93
$$ 50 -225 201 -113 -346 332 -280 67 328 483 -604 81 -115 -39 -205 555 292 -568 599 838 545
5414E45l47Q4J28k05q87J235n09j054R16N4M03P9j074N11L11n05L38K1j041Q14
$$ 545 198 282 410 205 -682 553 44 -1010 -94 -40 363 442 -632 -121 190 -315 23 44 -997 -183
5434a83J78o92J162l29k52M0j790K684o21o43J936j880rj62M81L64l46j03l10
$$ -183 -5 -697 465 136 -116 -76 -1866 818 197 -446 1490 -390 -399 -561 -80 284 -62 -165 -475
5453d75Q17k35L36k48o93L76m06J20K29n85Q47O1n35M28L07N90r13P02l46j507
$$ -475 342 107 443 195 -498 -122 -528 -408 -179 -764 83 144 -391 37 344 934 21 723 377 -1130
5473a130J136p73j83J138L04m76J044n72k23o56P27JK47k170J229K52o76J058
$$ -1130 6 -767 -950 188 492 16 1060 488 265 -391 336 337 584 -1586 -357 -105 -781 277
5491B77j470J543o28Q1O9P20m38j03j038J580m37N63K01r9m44k70K96k03O75j095
$$ 277 -1193 350 -278 -197 -128 592 154 51 -987 593 156 719 920 821 377 107 403 200 875 -220
5511b20j36J10j40L92J23n30J062p50k00O89m9k46L80K33j32o43J00J07j81L19
$$ -220 -356 -246 -386 6 129 -401 661 -89 -289 400 351 105 485 718 586 -57 43 150 -31 288
5531B88j107J207j123J036J39l26M69n10m1M40j089J564j076l8P66m39l9k0P84
$$ 288 -819 388 -735 301 440 114 583 73 32 472 -617 947 -129 -167 599 160 121 101 885
5550H85r30O34l55k45k65R09m01R59j302o18L89P3J114j005K76m9l47M87J47j599
$$ 885 -45 589 234 -11 -276 633 232 1191 -111 -729 -340 -267 847 -158 118 69 -278 209 356 -1243
5570a243J131N15j04j004M65l83J099q8m28N75n72L93k92L53n45Q5M1j59M57k30
$$ -1243 -112 403 299 -705 -240 -623 476 388 -40 535 -37 356 64 417 -128 -43 -2 -161 296 66
5590F6L52j127Q86n37M92J42j61l36N39p57O73o96Q76j22K42o96J060q11k35P75
$$ 66 418 -709 177 -360 132 274 113 -223 316 -441 232 -464 412 290 532 -164 896 85 -150 625
5610F25n48n2N5J01o47k70O22L55j46J10L71n45J68j48M04l60O01m45j82j5l83
$$ 625 77 25 80 181 -466 -736 -114 241 95 205 576 31 199 51 455 95 696 251 69 54 -329
5631c29P60l01N9J36J18l52k20j30j62J96O92k3J98l47k93j51n1L7L28r7M01q61
$$ -329 431 130 189 325 443 91 -129 -259 -421 -225 467 444 642 295 2 -149 -200 -163 165 68 469 -392
5653c92L51q9J30J35k44J78M6N12r33J94M90n82l37P13n04M70k37l32O19J91n67
$$ -392 -41 -130 0 135 -109 69 115 627 -306 -112 378 -204 -541 172 -332 138 -99 -431 188 379 -188
5674a88K82m79J111q56P11n94m73N87m90P28k99j01k77K07K97k23m27K50M12K36
$$ -188 94 -385 726 -130 581 -13 -486 101 -389 339 40 -61 -338 -131 166 -57 -484 -234 178 414
5694D14k60p1K58m47M94m99O55l27j24J50kl10L85k20J47k55Q88l92m41j8k94
$$ 414 154 83 341 -106 388 -111 544 217 93 243 241 -69 316 96 243 -12 876 484 43 25 -269
5715b69j39L95k22N66q8j15K22l86j99J079n52N61n64j9P11k91r74J87q90P34
$$ -269 -408 -13 -235 331 243 128 350 -36 -235 844 292 853 289 270 981 690 -284 -97 -987 -253
5735b53M29Q21q23l93L32l88N32K72n95J0N01n76L53p26J063r09O22m33R30q47
$$ -253 176 997 174 -219 113 -275 257 529 -66 -56 445 -131 222 -504 559 -350 272 -161 769 -78
5755g8p44J469J35j038J098n98M05j94n28M05p37L51O58p66L65j79L46m93O99
$$ -78 -822 647 782 -256 842 244 649 455 -73 332 -405 -54 604 -162 203 24 370 -123 576
5774E76n20r72R36m78M48l04O46j341O09j10J166j075O18j19j84j88N05k28j90
$$ 576 56 -916 20 -458 -10 -314 332 -1009 -400 -510 656 -419 199 80 -104 -292 213 -15 -205
5793b05K19N1K78j18p8j116J011J31j8M69j166O24K30qO8j479O25N66k31k65O49
$$ -205 14 65 343 225 147 -969 42 173 155 624 -542 82 312 304 372 -1107 -482 84 -147 -412 237
5814B37R2l78O9M22n69M28k22j54%k81P24r88K88J99l96O20n47J113p18L41%R89
$$ 237 329 -49 20 442 -127 301 79 -75 -75 -356 368 -620 -332 -133 -529 91 -456 657 -61 280 280 1269
5836A269j273J1K65n22L66J09K30p26R67r08M85n63J18l13J095N82j325J124p81
$$ 1269 -4 7 272 -250 116 225 455 -271 696 -212 273 -290 -172 -485 610 1192 -133 991 210
5855B10k94J8R86p83L70k02r54J191K0q40pL55L82o78N43j28j01o05L78L02j047
$$ 210 -84 -66 920 137 507 305 -649 542 562 -278 -285 70 452 -226 317 189 88 -517 -139 163 -884
5876h84M78L42p72P62P38o97K86m74J085j443R52R03j055K29P8R74k136J279N92
$$ -884 -406 -64 -836 -74 664 -33 253 -221 864 -579 373 1276 221 450 528 1502 -634 645 1237
5895A237k045J335j112P65j26J34k81K74j56J030j833J069j02o8j98L32j409J801
$$ 1237 -808 527 -585 180 54 188 -93 181 25 1055 -778 291 189 121 -77 255 -1154 647
5913F47j156M99J42j38O42j261R78m8q97J645j428k14R1K38J02P19q49n3K98l19
$$ 647 -509 -10 132 -6 636 -625 353 305 -592 1053 -375 -589 -498 -260 -158 561 -288 -341 -43 -362
5933c62K3P63k34J24l25N68l83K3n01R55o21o70k0J068m46K80K71r74L09L34K53
$$ -362 -339 424 190 314 -11 557 174 197 -304 651 30 -640 -660 408 -38 242 513 -461 -152 182 435
5954D35j079J49Q06N32q12n52L49l9N92n2l38K64m81N21m56Q32n77l02J191p26
$$ 435 -644 -495 311 843 31 -521 -172 -211 381 329 -9 255 -226 295 -161 671 94 -208 983 257
5974B57j13j15K27k03N34j93J06k87k04L60L84n22l13J87n6K31k27R9K8m8K95
$$ 257 144 29 256 53 587 394 500 213 9 369 753 231 -82 105 49 280 53 152 180 132 427
5995D27l29k7K5L7K64n6k95N19l25k42K04J95m28M55q26J4Q26n65K23n40K28K37
$$ 427 98 71 96 133 397 341 46 565 240 -2 202 397 -31 424 -402 -388 438 -127 96 -444 -216 21
6017B1n45P68l34o3N15L51q9q38L14K32o47K18J86l41M03m8j23M44n16m39J92
$$ 21 -524 244 -90 -153 362 713 624 -214 100 332 -315 -97 89 -252 151 103 -20 424 -92 -531 -339
6038c39L65K39o90M26k32N08l36N48n75j67L31O78j278K02L16p2K35o94N97K2
$$ -339 26 265 -425 1 -231 277 -59 489 -86 -253 78 756 -522 -320 -4 -76 159 -535 62 84
6058H4j89K70k85K96K3M8k39l45N75k50L17k43m41k69R71nk02q1K41l66M85l17
$$ 84 -105 165 -120 176 199 247 8 -337 238 -12 305 62 -379 -648 323 318 116 35 276 -90 395 78
6080G8m6J6o69O40j39j73L72j87j62J94J71q9K62o01M20m33L01K75k18R9K91o2
$$ 78 32 48 -621 19 -120 -293 79 -108 -270 -76 95 6 268 -333 87 -346 -45 230 12 111 402 340
6102C40k91K5Q3j08N5j58n6K30k04K90n81N92m93J11M07m47R3K77j24M5r7K87
$$ 340 49 74 157 49 104 -54 -110 120 -84 206 -375 217 -276 -165 242 -205 -112 165 41 86 -11 276
6124B76m33N5K25k92J99l14J94Q0J4k11K38l3L61k84k51J86J40j23j11k07P5K76
$$ 276 -157 -102 123 -169 30 -284 -90 -10 4 -207 31 -2 359 75 -176 10 150 27 -84 -291 -216 60
6146F0k0m30K11L7J36n9K01K5m10j4K21k04L26j21J82j04P5j61K34l66L42l74
$$ 60 40 -390 -179 -142 -6 -65 136 161 -249 -263 -42 -246 80 -41 141 37 112 -49 185 -181 161 -213
6168b13O8L71r3k38L78m95M14N6m11k7j29m80Q90O0j79L3Q7k9m77L11j05K48J05
$$ -213 -145 226 133 -105 273 -222 192 248 -163 -190 -319 -799 91 151 -28 5 92 63 -414 -103 -208 40 145
6191A45p6o77K48L58k4K01N9n56M91k56K8K15L24o10L42k45Q4j56q4J24l58m3
$$ 145 69 -608 -360 -2 -26 175 234 -322 169 -87 -59 156 480 -130 212 -33 51 -105 -189 -65 -423 -466
6213d66P93p55N74K0n4p22N35l95K29L47j5K4k16L59j05L64r54J344j322LP22
$$ -466 327 -428 146 166 112 -610 -75 -470 -241 106 91 115 -101 258 153 517 -437 907 -415 -412 310
6234C10M5l30o4No81J026K99N92j153q1o99J41P6M66L00k92m21O19M37m41j098
$$ 310 355 25 -39 -34 -715 311 610 1202 49 -32 -731 -590 -514 -48 252 -40 -461 158 595 154 -944
6255i44J843j564Q92L40N08n55N51r43k78r82J890j388N23N43l4J41j066L39M53
$$ -944 899 -665 227 567 1075 520 1071 128 -150 -1132 758 -630 -107 436 402 543 -523 -184 269
6274B69r81Q32K85m22j153J088K99n07K33K9K91o27N25n19p0j46R05l21J53l61
$$ 269 -712 120 405 -17 -1170 -82 217 -290 -57 -28 263 -364 161 -358 -428 -574 331 10 163 -198
6294a98J029L6p68M13o65K94j92J53J7o5K51M72n85n15K26J05o3k22M87j05M7
$$ -198 831 867 99 512 -153 141 -51 102 119 54 305 777 192 -323 -97 8 -55 -277 210 105 152
6315A52n8j91R6M4K03k83j82L7j88J38K98n5M5r0Q1L8j13J79k86L60k5k25K35
$$ 152 94 -97 -1 43 246 -37 -219 -182 -370 -232 66 11 56 -34 47 85 -28 151 -135 225 200 -25 210
6338B10k66N22l24k74L98j81r6r3j0p4N23k23j84n9M38k57r0J90k12J64r6o8k7
$$ 210 -56 466 142 -132 266 85 -11 -104 -114 -188 335 112 -72 -131 307 50 -40 150 -62 102 6 -62 -89
6361h9L83k89o7K2J72k30K81j82O2J25j73P1j91J69k0L7n5k9J31p3j36L2o4K63
$$ -89 294 5 -62 -40 132 -98 183 1 63 188 15 86 -105 64 44 81 26 -3 128 55 -81 -49 -113 150
6385A50j61R2l23K47l50L03m6p9L02j64p7K36M7k12L6M8j85K39j93K23L30n76
$$ 150 -11 81 -242 5 -345 -42 -88 -167 135 -29 -106 130 177 -35 1 49 -136 103 -90 133 463 -113
6407a13N7K24k79M6M90l28L0ON3m57J67k34K83J94n6k08L37o1l09L13k02M75l26
$$ -113 -56 168 -111 -65 425 97 127 133 186 -271 -104 -338 -55 139 83 -125 212 151 -158 155 -47 428 102
6430A02R6l97L19L3j13Q6j57j32j26J96J19R8K7J45k63j94l50N13L52l17L22j13
$$ 102 198 -199 120 153 40 126 -31 -163 -289 -93 26 124 151 296 33 -161 -511 2 354 37 359 246
6452B46j00k89k87M07J84K79n06k57Q69k74n84n5L29Q7n82J37j6L06Q1K82J90
$$ 246 146 -143 -430 -23 161 440 -66 -323 546 272 -312 -367 -38 49 -533 -396 -412 -106 -25 257 447
6473D47m52m10L73l16K29N0o48O77L88k89k65k03L58q4j52N53r14Q91K44j076
$$ 447 -5 -415 -42 -358 -129 -79 -727 -50 338 49 -216 -419 -61 -145 -297 256 -658 233 477 -599
6493e99O29k64K52L62k37l5l36J55k73K50m28M49k86O72m53k89l2k33R40r34L77
$$ -599 30 -234 18 380 143 108 -228 -73 -346 -96 -524 -75 -361 311 -142 -431 -463 -696 244 -690 -313
6514c13k35L86j17K51n29O09l01J98r5N50m65K06p17L60M8L91l0p1P5k89K16L8
$$ -313 -548 -162 -279 -28 -557 52 -249 -51 -146 404 -61 145 -572 -212 -164 227 197 126 201 -88 128 166
6536A66m31K67l33L52j01j08j90J64o85J203j62K47l22j56P3k2O25j006N05m80
$$ 166 -265 2 -331 21 -80 -188 -378 -214 -899 304 142 389 67 -89 -16 -38 587 -419 86 -394
6556c94O40q30Q56k90N48k84j59j23K89q20Q07l46q0K47k51J46J93k65p4J43N8
$$ -394 246 -584 272 -18 530 246 87 -36 253 -567 240 -106 -186 61 -190 -44 149 -116 -190 -47 11
6577A1j82K32j62j19M85N8k01O6l92n8K07j89m0K87K2p2ro3J05J17l9j23J68k23
$$ 11 -171 61 -101 -220 265 323 122 188 -204 -262 -55 -244 -284 3 25 -47 -56 -119 -14 103 64 -59 109 -114
6601a14K20j12l26L31J6j85J04m9Q0J10o8M8q2L96n98K13j51n1K9Q79p51J47m43
$$ -114 106 -6 -332 -1 15 -170 -66 -115 -35 75 7 55 -27 369 -229 -16 -167 -218 -189 690 -61 86 -357
6624c57P0j29L74L73p26j65K54L39M0K19j000Q46k97O64j237J074J3p02L94l70
$$ -357 -287 -416 -42 331 -395 -560 -306 33 73 292 -708 138 -159 505 -732 342 355 -347 47 -323
6644c23P95p2K76o85K5q1L2l79m3O92j78j30j17n7P93j52o28M64o2J05k57j13
$$ -323 472 400 676 -9 16 -65 -33 -412 -455 237 59 -71 -188 -245 548 396 -232 232 170 275 18 -95
6666i5J7m1R4nP4k13O40j38k87P96j134O00jp10M88q6J11Q9q07N07rl92K14M31
$$ -95 -78 -119 -25 -30 44 -169 471 333 46 842 -292 308 307 -403 85 -1 110 199 -608 -101 -110 -502 -288 143
6690A43M64j035N19o1P2m61Q03k19k91K96L4q8j15K62j50Q7k86p2R1j15L49J79
$$ 143 607 -428 91 30 102 -359 444 225 -66 230 264 176 61 323 173 260 -26 -98 -7 -122 227 406
6712D06k48J22k4k20k58j8N36k50r5j34N40o5K8l01K84K94n27J03r7j4o73Q82
$$ 406 158 280 256 36 -222 -240 296 46 -49 -183 357 292 320 19 303 597 70 173 76 62 -611 271
6734B71O78j053q27N86k90J423J20j641J637j022k61O28j117J229p03K29r9J09
$$ 271 949 -104 -931 -345 -635 788 908 -733 904 -118 -379 249 -868 361 -342 -113 -212 -103
6752a03L45k45P77j248J05L58j76p15P04P44j283M31R04k64p52L24Q37j072N39
$$ -103 242 -3 774 -474 -369 -11 -187 -902 -198 546 -737 -306 598 334 -418 -94 743 -329 210
6771B10J28R6M4l98l8P2l8J77L45n67p5k22K94k8L67k36J20l19k02M44K08n88
$$ 210 338 434 478 80 42 114 76 253 598 31 -44 -266 28 0 367 131 251 -68 -270 174 382 -206
6793b06J73j70L54l95J19K35J46m50L05m34P22m03j60K64k14l13O05k03K32q6
$$ -206 -33 -203 151 -244 -125 110 256 -194 111 -323 399 -4 -164 100 -114 -427 178 -25 207 121
6813A21o54K10K20J06J52p2j19j24j29j88L98r2j28J6l52R22k61K41r30M32J061
$$ 121 -533 -323 -103 3 155 83 -36 -160 -289 -477 -79 -171 -299 -283 -635 287 26 267 -663 -231 830
6834H30p26L2M61m48Ok50K4k61J04o87M80P10K84j71l41j75l13N11L19l6l42n1
$$ 830 104 136 597 149 155 -95 -71 -332 -228 -915 -435 275 559 388 47 -128 -441 70 389 353 11 -40
6856d0k19J88L66n42l3J92K45m78M06k13J88j81l62K97L20P9o05O31jjj26J7m77
$$ -40 -259 -71 295 -247 -280 -88 157 -321 85 -128 60 -121 -483 -186 134 213 -392 239 238 237 111 128 -349
6879c49Q64q76j23k65M39k50R36m14j92j69JJ362o39n18o81J293m14l48P77m33
$$ -349 515 -361 -484 -749 -310 -560 376 -38 -230 -399 -398 964 325 -193 -874 419 5 -343 434 1
6899Ar3N21m89l76N55J22m30L59J25j9Q46j008m2m6L89j93m85L06k48N17K64j206
$$ 1 -92 429 -60 -436 119 241 -189 170 295 276 1122 114 72 26 415 222 -263 43 -205 312 576 -630
6921f30N31l00k64O00Q04p87l71P54k6l5J14K64q90j11Q54q34Q48N7j204J309
$$ -630 -99 -399 -663 -63 741 -46 -417 337 311 276 390 654 -236 -347 507 -327 521 578 -626 683
6941F83j097R95j412R61k85J21k15p37O04j66J99p00J341n18N33r5N06j53j135
$$ 683 -414 581 -831 130 -155 -34 -249 -986 -382 -548 -349 -1049 292 -226 307 212 718 565 -570
6960e70K68K0K31J43j42J70P73j582o21M41J208N43o19j77K0L94n10r09L33J397
$$ -570 -302 -282 -51 92 -50 120 893 -689 -1310 -869 339 882 263 86 106 500 -10 -919 -586 811
6980H11j31j324M73l46L7J292q4q96k95N48j345J126J009j118J746j264N06o06
$$ 811 680 -644 -171 -517 -480 812 728 -168 -463 85 -1260 -134 875 -243 1503 239 745 139
6998A39N83n77m30P2N04p4N31j103k39K96K86j140N71mK21M15M02M33j275R54
$$ 139 722 145 -285 -213 291 217 748 -355 -594 -298 -12 -1152 -581 -585 -364 51 453 886 -389 565
7018E65n29Q99j940K267l84j508N16l2K52l51N02L12j26m66l58R41j417P22l34
$$ 565 36 935 -1005 1262 878 -630 -114 -146 106 -245 257 569 443 -23 -381 560 -857 -135 -469
7037d69Q00j18j32O8O3K06p43J72L59o41M64J044m65o68N89m32N43Q88j647l8
$$ -469 331 213 81 149 212 418 -325 -153 206 -435 29 1073 608 -60 529 97 640 1528 -119 -157
7057a57K10j37P8Q47p88O30l6m84l71k81l56N17Q65r8O5j31K21K08j882R81R8
$$ -157 53 -84 -6 841 53 683 647 163 -208 -489 -845 -328 537 439 504 373 594 802 -1080 -99 -1
7078aJ91k1j70K21k1l05K53p71J001o75M17K76m10J79n20M23l9K41p08J7M01L2
$$ -1 190 169 -1 220 199 -106 147 -624 377 -298 119 395 -15 164 -356 67 28 269 -439 -422 -21 11
7100A1j04k47m63K06N93P4n72L37K46q6n51J028o69j30K47j66m32j68P36N14q3
$$ 11 -93 -340 -803 -597 -4 70 -502 -165 81 -5 -556 472 -197 -327 -80 -246 -678 -846 -110 404 321
7121C21p1j7J09n70q60J129l45J76K76Q1m17L58L5o26L78O19o84L2K37j00K12
$$ 321 250 233 342 -228 -1088 41 -304 -128 148 229 -188 170 205 -421 -43 576 -108 -76 161 61 273
7142B73j5l38M01o15L6K00L66o50O84K47n34J48K87K93o67o6l17K76M61n42k48
$$ 273 258 -80 321 -294 -258 -58 308 -342 342 589 55 203 490 783 116 50 -267 9 470 -72 -320
7163c20L55k69O38k83O27r25N18p18N43r43Q90J01N5l60J73L38l81L11m66q8K36
$$ -320 35 -234 404 121 748 -177 341 -377 166 -777 113 214 269 -91 82 420 39 350 -116 -204 32
7184C2k80n6O39j150O16n1O16M1r50L17P43l00k84Q39p91n83P51o8qJ1M16n25
$$ 32 -248 -304 335 -815 -199 -250 366 407 -543 -226 517 217 -67 772 -19 -602 149 81 73 84 500 -25
7206b5J077j394P49l25L09n39j57J76P0M35p58l0k83M12Q0M61n14J71m7K30m79
$$ -25 1052 -342 407 82 391 -148 -305 -129 -59 376 -382 -412 -695 -283 -203 258 -256 -85 -132 98 -381
7227c81K83j93N98K57j02j000p3Q29K54l29M5R0M32o59M02j276J428q09l7J75
$$ -381 -98 -291 307 564 462 -538 -611 218 472 143 188 278 710 51 453 -823 605 -204 -241 -66
7247f6n5J5j20O35l00k92L95P24j147nq15J763r39K25N11p42J98O24m51j1j53
$$ -66 -121 -106 -226 409 109 -183 212 936 -211 -216 -1031 732 -207 18 529 -213 -15 609 158 147 -6
7268fl4j76O5J369j245l65M82m43r16J817n06l18k82M48J005o12r0k83O6P60p31
$$ -6 -40 -216 -151 1218 -27 -392 90 -353 -1269 548 42 -276 -558 -110 895 283 193 -90 -24 736 5
7289EO5k11M1l43M74K88O06j232J51K81q13N37L33m75Q18m66r31R25K33o9M43
$$ 5 70 -141 -100 -443 31 319 925 -307 -156 125 -688 -151 182 -293 525 59 -872 53 286 217 660
7310F60l95p8p46j33L11R06R8k78q52P42n18J310n66j3L97j602K56J091j020Q67
$$ 660 265 187 -559 -692 -381 525 623 345 -507 235 -283 1027 461 448 845 -757 -501 590 -430 437
7330D37K20o52Q6k04J023j117m30J267%M5m61m44N4N52p4m66K82o96K30J025l10
$$ 437 657 5 91 -113 910 -207 -637 630 630 675 214 -230 -176 376 302 -164 118 -578 -348 677 367
7351C67L11q96J88L48N98K63p81p6P1o08J96O69k31L67r03Q55j70K96p24m26P18
$$ 367 678 -218 -30 318 916 1179 398 322 393 -215 -19 650 419 786 -117 738 568 864 140 -286 432
7372D32K73j638J191J67j09n84k36j87R43o71K89L17J70J8L00k21r02J85J1Q2
$$ 432 705 -933 258 425 316 -268 -504 -691 252 -419 -130 187 357 375 675 454 -448 -263 -252 -170
7392a70J301l83o9j95p27J445j323o23K85P29J07p29J69K16M97r4j236j30N23
$$ -170 1131 748 679 484 -243 1202 -121 -744 -459 270 377 -352 -183 33 530 436 -800 -930 -407
7411d07P34o50P2K44m14J407m75j65m50J02J90r20R31l13R19q58m4R7n01J600
$$ -407 327 -323 -251 -7 -421 986 511 346 -104 -2 188 -732 199 -114 805 -53 -97 0 -501 1099
7431A099r97N27n85p48O96K92k78Q10j378Q20l21O29m1n48J166j313M04r00J98
$$ 1099 102 629 44 -704 -8 284 6 816 -562 258 -63 566 525 -23 1143 -170 234 -666 -468
7450d68O03J76q2j31O83q23K95m41M27o67N20n72J13j59m89Q68k2M54k61N14o97
$$ -468 135 311 229 98 781 -42 253 -188 239 -428 92 -480 -367 -526 -1015 -147 -169 285 24 538 -159
7471a59J53m37R83j449O05Q55O1r32J55m69O77L9p97l70J193n28L06R3o51Q01
$$ -159 -6 -443 540 -909 -304 551 612 -320 -165 -634 43 82 -715 -1085 108 -420 -114 -21 -672 129
7491A29N76m97k80R34j378P26n63J059m20m15k04K52Q27r35j02N33n89M91K31
$$ 129 705 208 -72 862 -516 210 -353 706 286 -129 -333 -81 746 -189 -291 242 -347 144 375
7510C75o24Q73p03L97n97J36k07P44k31q52J183o25L02j69j28Q85n13m68O18L58
$$ 375 -249 624 -79 318 -279 -143 -350 394 163 -689 494 -131 171 2 -126 759 246 -222 396 754
7530G54l12N49r70m9J23n81J82L95K21N78j262M14Q00n20j34L6k94j23j67N69
$$ 754 442 991 21 -28 95 -486 -304 91 312 890 -372 42 842 322 188 224 -70 -193 -360 209
7550B09J66M53q73l87l38J479mj141J64O93l4q83K69kJ33J15N56o87m09P77m57
$$ 209 375 828 -45 -432 -770 709 705 -436 -272 421 387 -496 -227 -229 -96 19 575 -112 -521 256 -201
7571b01P91o38K45j22Q25j573J156r43j00n7R6R36Oj3j423J764m44j11o01P30
$$ -201 590 -48 197 75 900 -673 483 -460 -560 -617 -521 415 421 408 -1015 749 305 194 -407 323
7591C23k00l49K85j317K000j380J228l52n78r70J203J31j3p79oN73O30q63n04
$$ 323 123 -226 59 -1258 742 -638 590 238 -340 -1310 -107 24 11 -768 -774 -201 429 -434 -938
7610i38J058o3J6o29j08J364r90R53j692O62J93L6R6K6O1o61M0J66L02M22O12
$$ -938 120 57 73 -556 -664 700 -290 663 -1029 -367 -174 -138 -42 -16 45 -616 -576 -410 -108 314 926
7631I26j60o77N76n63m64J022J97K47j635J80Q07q07J715k399J139m58J65p12
$$ 926 766 89 665 102 -362 660 857 1104 -531 -351 456 -351 1364 -1035 104 -354 -189 -901
7649i01J278n29O03j121Q22m11O03p91Q11j93m87Q55m41K2M5m84o49J267n36r66
$$ -901 377 -152 451 -670 152 -259 344 -447 364 171 -316 539 98 120 165 -319 -968 299 -237 -1203
7669a203J852j659k9J863P3k247M82P07k47O79k68K84J71o62l23J32n14P81l07
$$ -1203 649 -1010 -1039 824 897 -1350 -868 -161 -408 271 3 287 458 -204 -527 -395 -909 -128 -435
7688d35j01J110J77j148L41J21l29P85n65K92k25M39l59j252J022K98K28n19M
$$ -435 -536 574 751 -397 -56 65 -264 521 -44 248 23 462 103 -1149 -127 171 399 -120 -116
7707a16j6K78r6L42k26l31k33Q03q72L7P38p47L74oL43k77k95M34K3J33j60r21
$$ -116 -132 146 50 392 166 -165 -398 405 -467 -430 308 -439 -65 -71 272 -5 -300 134 157 290 130 -791
7729g91j42J169m29Q38k85r67J090p66L44K12P7K61m65N5O25p10P13r55Q52j25
$$ -791 -933 236 -193 645 360 -607 483 -283 61 273 350 611 146 201 826 116 829 -126 726 601
7749F01q05Q41K83j054l18O86m21J4k89K20L73m5l97j9M35q07N53n81N97J78k79
$$ 601 -204 637 920 -134 -452 234 -187 -173 -462 -242 131 86 -311 -330 105 -702 -149 -730 -133 45 -234
7770b34L59n40P41l74o4J242q48j406J155k19N19n37J29J32R08j595J013n11m61
$$ -234 125 -415 326 -48 -112 1130 282 -1124 31 -188 331 -206 -77 55 963 -632 381 -130 -591
7789e91N56j54K65P41p55l36M68j051K66R87n26K20P29m46L52p3o62O47j277P54
$$ -591 -35 -189 76 817 62 -274 194 -857 -591 396 -130 90 819 373 725 652 -10 637 -640 114
7809A14l4N40j131N68l29N07m68N96J73j414P97r11R70k16l67K50J056n54l69
$$ 114 80 620 -511 57 -272 235 -233 363 536 -878 -81 -992 -22 -238 -605 -355 701 147 -222
7828b22K87J77M24n47M71j524J321m70O68n46N46n75l43M02Lm96L40l77L63j81
$$ -222 65 242 666 119 590 -934 387 -83 585 39 585 10 -333 69 72 -424 -84 -461 -98 -279
7848b79l37M12J81Q5o01N1N99O98o21l70p0M14M51p70p21k60J575J88m53p28R9
$$ -279 -616 -204 -23 62 -539 -488 111 809 188 -182 -252 162 613 -157 -878 -1138 437 625 172 -556 -457
7869d57J74P01l88O65m67N3m11N04n97O32m65l01O64j092j40J198K30j159K36
$$ -457 -283 418 30 695 228 281 -130 374 -223 409 -56 -357 307 -785 -925 273 503 -656 -420
7888d20n58P45L75o45K26K46l32J607m97n13J28m1m34L55j3l69J43l97R09J74
$$ -420 -978 -233 142 -503 -277 -31 -363 1244 747 234 362 321 -113 242 229 -140 3 -394 515 689
7908F89m43l38K61L05L68j035M32m33m1M7Qj81R27j169M19J322k93r58Q79k06
$$ 689 246 -92 169 474 842 -193 239 -194 -235 -188 -180 -361 566 -603 -184 1138 845 -113 766 560
7928E60k036Q22J64O53o94M75Q75p08q16J98P4J224j051O22q4k06O99j481j03
$$ 560 -1476 -654 -490 163 -531 -56 819 111 -705 -507 -433 791 -260 362 278 72 771 -710 -813
7947h13R05M90r44o89R39J068j108R0O83o83N28j013J231j60P20k014Q88j29L53
$$ -813 92 582 -362 -1051 -112 956 -152 -62 621 -62 466 -547 684 524 1244 -770 118 -11 342
7966C42l98J59n1R2M91p05m17k82J044q54Q76J92q99l50J271m53k13K84k95P4
$$ 342 -56 103 52 144 635 -70 -487 -769 275 -579 297 489 -410 -760 511 58 -155 129 -166 -92
7986i2M40Q65j387L47q28j90Q18L12p9M0K10M03q11q8O97q60M57q72Q34l84N2
$$ -92 348 1213 -174 173 -655 -845 -27 285 206 246 456 859 48 -40 657 -203 254 -618 216 -168 -116
8007a16M60M58q2l79p14M64o51N25O73r91PN41o49N70m12N41l27K45j34J10j06
$$ -116 344 802 720 341 -373 91 -560 -35 638 -353 -346 195 -454 116 -296 245 -82 163 29 139 33
8028C3L85L09j130O43r20J000k67l72l70N62O64j60j159n41J148M07j96l71l27
$$ 33 418 727 -403 240 -680 320 53 -319 -689 -127 537 377 -782 -1323 -175 232 36 -335 -662
8047f62J399Jj190k11L3k75Q31j131J692L51p49M0M96n38N43m36j84M13j36l4
$$ -662 737 738 -452 -663 -630 -905 -74 -1205 487 838 89 129 625 87 630 194 10 423 287 253
8067B53n56O03j164N93O15o10P30lo7j15l54o31Q44j57n48J61N41o97P77J73j04
$$ 253 -303 300 -864 -271 344 -266 464 461 394 279 -75 -706 138 -19 -567 -406 135 -562 215 388 284
8088B84N46o09l68m81J141r92J467j089k16J20p62J323j01J16J33j09l31r26J115
$$ 284 830 221 -147 -628 513 -479 988 -101 -317 -197 -959 364 263 379 512 403 72 -854 261
8107B61j456J355m99r9M5R12n31k85K49J15J267k207Q00K83j000J389n49o70R01
$$ 261 -1195 160 -339 -438 -393 519 -12 -297 -48 67 1334 -873 -73 210 -790 599 50 -620 281
8126B81J78K3j366K33J397m44p31P4O27p76R25r79k63J012o07O49J47l98q99P93
$$ 281 459 482 -884 -651 746 302 -429 -355 272 -504 421 -558 -821 191 -416 233 380 -18 -917 -124
8146a24P11l79R30j490l93J817j818Q57q77O51O63p94K74q28M78l77P42M07M24
$$ -124 587 208 1138 -352 -745 1072 -746 111 -766 -115 548 -246 28 -800 -322 -699 43 450 874
8165H74p49q59l81J143p20N07M85j41q2r00M32O35l95J16j08j7j40J96p83J224
$$ 874 125 -734 -1115 28 -692 -185 300 159 77 -823 -391 244 -151 -35 -143 -160 -300 -104 -887 337
8185C37o46M00J24m4n20j81
$$ 337 -309 91 215 171 -349 -530
8191e30
$$ Imaginary data points
##PAGE= N=2
##DATA TABLE= (X++(I..I)), XYDATA
0@%%%%%%%%%%%qJ6j6J6k3L1l2M0m8N6p1Q5r7J12j32J54j78K03k32K66l04L46l90
$$ 0 0 0 0 0 0 0 0 0 0 0 0 -8 8 -8 8 -15 16 -16 24 -24 32 -39 46 -51 61 -71 83 -95 108 -124 142 -162 184 -206
34b06M38m93N55o21O90p67Q55r50J052j167J290j422J569j731J906k100K316k551
$$ -206 232 -261 294 -327 363 -404 451 -499 553 -614 676 -746 823 -908 998 -1102 1214 -1337
52a337K812l103L431l803M226m714N283n960O778p789R074j0769J3115j6575K2181
$$ -1337 1475 -1628 1803 -2000 2226 -2488 2795 -3165 3613 -4176 4898 -5871 7244 -9331 12850
67A2850l2711N8836k34485l23332P31657J04548m93125J18325J55692l40223K25295
$$ 12850 -19861 38975 -195510 -518842 212815 317363 -175762 -57437 98255 -241968 -16673
78a6673L77442m23318l09850M83563J18924m03147J02819J95093k54176P8930
$$ -16673 360769 -62549 -372399 111164 230088 -173059 -70240 124853 -129323 -50393
88e0393K81480k73574k60751L75454J60046l33956N420J63006j43144N3038K10233
$$ -50393 231087 -42487 -303238 72216 232262 -101694 -96274 66732 -76412 -23374 186859
99A86859k03209k14932L04894J39937k96237m199J77165j12661j7684K00215j22905
$$ 186859 -16350 -231282 73612 213549 -82688 -86887 90278 -22383 -40067 160148 37243
110C7243k37919K32572J83116k63504p4526K10573m3985j24040J61435J7080k60468
$$ 37243 -200676 31896 215012 -48492 -123018 87555 43570 -80470 80965 98045 -162423
121a62423P3616K70771j08363k12193Q9006J09004o9126J5241K5355j16294L1904
$$ -162423 -88807 181964 73601 -138592 -49586 59418 -9708 5533 30888 -85406 -53502
132e3502J51279o7729j39379P7338Q4662o6920J5266L1369j04499J2094J52706
$$ -53502 97777 30048 -109331 -31993 52669 -14251 1015 32384 -72115 -60021 92685
143I2685l6156j53174N3124J04387n5926p027K7653q2679N794J38996k7099j48820
$$ 92685 56529 -96645 -43521 60866 4940 -2087 25566 -57113 -51319 87677 60578 -88242
155h8242M8720J02474o6264j2956N6550o5890l0522J20896j815j41259M0450J13163
$$ -88242 -39522 62952 -3312 -16268 40282 -25608 -56130 64766 62951 -78308 -37858 75305
167G5305n8778m0925N8282l6774n1214R6336L8303j17619j4032Q6087m751l0096
$$ 75305 16527 -24398 33884 -2890 -54104 42232 80535 -37084 -51116 34971 30220 124
179A24O802l2262l509P8429j1241r8973K7752P4204l5254l1191K6227j5572j3644
$$ 124 6926 -25336 -28845 49584 38343 -60630 -32878 41326 6072 -25119 1108 -14464 -28108
192b8108N6788r096p6060K9053O3870k9315k7794K2390j7134j0284N9308j517
$$ -28108 28680 19584 -56476 -27423 36447 7132 -20662 1728 -15406 -25690 33618 32101
204C2101p5444J6473O6128k1235m3068K2643J1563j5232K1321L614m0952O170
$$ 32101 -43343 -26870 39258 18023 -25045 -2402 9161 -6071 15250 18864 -22088 -15918
216a5918M2251r705l4122J2733J8682j2267j177J540q105O700J1247r486q734
$$ -15918 26333 16628 -17494 -4761 13921 1654 477 2017 -6088 612 11859 2373 -6361
229f361J2038n89j3705J2596J0466j8387m304J8472j294j8945P986J3129j2287
$$ -6361 5677 5088 -8617 3979 14445 -3942 -8246 10226 8932 -10013 -2027 11102 -1185
242a185j661R008p328r146J3340J591j4042O115P985j2615l665J4611r34j7742
$$ -1185 -2846 6162 -1166 -10312 3028 4619 -9423 -3308 4677 -7938 -11603 3008 2074 -15668
256a5668R007J3474j2543n768J2282j335o106O942N216j0617J939Q705l836l634
$$ -15668 -6661 6813 -5730 -11498 784 -551 -6657 285 5501 -5116 -3177 5528 1692 -1942
270a942N165K045j909K159k836m581O928R21o487L462L589q844j843J1358m292
$$ -1942 3223 5268 3359 5518 2682 -1899 5029 5950 -537 2925 6514 -2330 -4173 7185 2893
285B893j1464R208P513j0852k784O220l54l609N751k580m737O948L51q411L867
$$ 2893 -8571 637 8150 -2702 -5486 734 380 -3229 2522 -58 -4795 2153 2504 -5907 -2040
300b040Q651n608m050M732j388m289L917J778k668o33J907l733P66L165m484J369
$$ -2040 6611 1003 -3047 1685 297 -3992 -75 1703 -965 -1598 309 -3424 -2658 507 -3977 -2608
316b608O109n531n785M899L756n427N48P305m897k396O037o47n174M172P035m750
$$ -2608 3501 -2030 -7815 -2916 840 -4587 -4039 3266 -1631 -4027 2010 1363 -3811 361 7396 2646
332B646l467K676J679j484j312K148J847p53j742k984J574K839p13j708j897R78
$$ 2646 -821 1855 3534 2050 738 2886 4733 3980 2238 -746 828 3667 2954 1246 -651 327
348C27P4l987J186K911j3l223J782J871n980m3P083k035k869L974o71l980M290
$$ 327 401 -3586 -2400 511 498 -2725 -943 928 -5052 -5095 1988 -47 -2916 1058 387 -3593 697
365F97J419n011L410N875p011l460P580l796m366J0152p40j4564O903J1699j3029
$$ 697 2116 -2895 515 6390 -621 -4081 3499 -297 -4663 5489 4749 -9815 -2912 8787 -4242
380d242m877J4426k091r768P610K394j4088P931J2676j3157k633J3992o739j1203
$$ -4242 -9119 5307 3216 -6552 1058 3452 -10636 -2705 9971 -3186 -5819 8173 1434 -9769
394i769J5334L456j7826R613J5025j8981o520K0677o323j4936J7300N111k3352
$$ -9769 5565 9021 -8805 808 15833 -3148 -9668 11009 4686 -10250 7050 12161 -11191
407a1191P184J6557j6645o777K1784q025j7934J9514L892k5724J1073K4519k1636
$$ -11191 -4007 12550 -4095 -10872 10912 2887 -15047 4467 8359 -17365 -6292 18227 -3409
420c409j3411K5768l224k3676K0165J4309k9649K362K9758j5584k1890K3578O839
$$ -3409 -16820 8948 5724 -17952 2213 16522 -13127 -10765 18993 3409 -18481 5097 11936
433A1936k2965J2286J6839k7623n396L2657j1149k5715K5947J0661l2526M225
$$ 11936 -11029 1257 18096 -9527 -14923 17734 6585 -19130 6817 17478 -15048 -10823
445a0823K9287k3058j5213L5660k090l9223K0629K9636l4604q423L7286j1789
$$ -10823 18464 -4594 -19807 15853 13763 -25460 -4831 24805 -9799 -18222 19064 7275
457G275k8523K9781R680l8948J4849L4825l4060j7384M4635r085m1264L1953K5088
$$ 7275 -21248 8533 18213 -20735 -5886 28939 -5121 -22505 22130 13045 -28219 3734 28822
470B8822m5433j621M6316k5601l3365M3480P183m8293K2967L6490m3853j5525
$$ 28822 -16611 -18232 28084 2483 -30882 12598 19781 -28512 -5545 30945 -12908 -28433
482b8433M6973j0869l5369L8138J3025n1149J3796M5118l7354j9251M9999r332
$$ -28433 18540 7671 -27698 10440 23465 -27684 -13888 31230 -6124 -25375 24624 15292
494A5292m8415L5768L0731n0148j795M7561k7118k9867M6897J924m8117K0612
$$ 15292 -33123 2645 33376 -16772 -18567 28994 1876 -27991 18906 20830 -27287 -6675
506f675L3812l7274r470M2177j9302l1361M0297O560m5228K0353L8023m0315k0982
$$ -6675 27137 -10137 -19607 22570 3268 -28093 12204 18764 -26464 -6111 31912 -8403 -29385
519b9385M7412l173l6960K5927J5551l7220O928L8008k8149k3780L9398K748l4160
$$ -29385 18027 14854 -22106 3821 19372 -17848 -10920 27088 -1061 -24841 14557 17305 -16855
532a6855J4416J7777k8261P492L1611l0304k6086M1799J0709l8764P799K0833
$$ -16855 -2439 15338 -12923 -5431 26180 -4124 -30210 11589 22298 -16466 -8667 12166
544A2166k2886n93L2487j8562l0938K9479J7797l0034M364K2371k3097n570L0853
$$ 12166 -10720 -11313 21174 2612 -28326 1153 18950 -11084 -6720 15651 -7446 -13016 17837
557A7837j2334k6258K9822J2904l6970M873K9968k2032j1138L3486j2272l5229
$$ 17837 5503 -20755 9067 21971 -14999 -10126 19842 -2190 -13328 20158 7886 -27343
569b7343K9066K5454l5753p031K8728j5217j2814L2733j1128l6650L0318K7054
$$ -27343 1723 27177 -8576 -15607 13121 -2096 -14910 17823 6695 -29955 363 27417
581B7417l9729n999L5689j5699j9225L3048l224m0916K5717L6146l8440j8218
$$ 27417 -12312 -18311 17378 1679 -17546 15502 12278 -28638 -2921 33225 -5215 -23433
593b3433L6395m183k2183K6911J53l9372J7919L7211l2411k0502L5261k795k6438
$$ -23433 12962 8779 -13404 13507 13660 -25712 -7793 29418 -2993 -23495 11766 8971 -17467
606a7467K2998Q343l4390J1992L4750k8788k5818L8068P925l2943J3168J5864
$$ -17467 5531 13874 -20516 -8524 26226 -2562 -28380 9688 17613 -15330 -2162 13702
618A3702k7753K797L7675j9644l1698K6035J5902k5453Q002J7512k8012o371L8806
$$ 13702 -14051 -11254 26421 6777 -24921 1114 17016 -8437 -435 17077 -10935 -17306 21500
631B1500q049l6021J9714K0891k4569k269K2871j8882j3574L2478O47l4388J0562
$$ 21500 13451 -22570 -2856 18035 -6534 -8803 14068 -4814 -18388 14090 14737 -19651 -9089
644i089K5497j8462p480J8965j0381j4156K5999L030l0803P261K6988j5616j2383
$$ -9089 16408 -2054 -9534 9431 -950 -15106 10893 13923 -16880 -9619 17369 1753 -10630
657a0630J8984m454j6090J9366P440k8955M757K8183j3886j9474J7258K810j5024
$$ -10630 8354 3900 -12190 7176 14616 -14339 -9582 18601 4715 -14759 2499 5309 -9715
670i715J4633P350k6293k61K8491p738j9611J3739N526j6553J1974J2603k3102
$$ -9715 4918 12268 -14025 -14286 14205 6467 -13144 595 6121 -10432 1542 14145 -8957
683h957k667K4664n452j8667J1790P550j4605N442J1769j5646l259J9717n425
$$ -8957 -11624 13040 7588 -11079 711 8261 -6344 -902 10867 -4779 -8038 11679 6254
696F254j7930J2013P699j3907M908J1136j5101p056J9854k345j5814R562P071
$$ 6254 -11676 337 8036 -5871 -963 10173 -4928 -11984 7870 5525 -10289 -727 6344
709F344j2573K368J2412j1511o509J6897M09j6615N907J0887j0200r32J0369o746
$$ 6344 -6229 -3861 8551 -2960 -9469 7428 7837 -8778 -2871 8016 -2184 -3116 7253 507
723E07p080J1029J827j2842M124R364q425k129Q888m608p541Q243L689q716Q33
$$ 507 -6573 4456 6283 -6559 -2435 6929 -1496 -3625 5263 655 -6886 1357 5046 -3670 -2837
738b837O519m572m112Q094k157n815N899M066p736r96O588k397k754M728K19n807
$$ -2837 3682 -890 -5002 3092 935 -4880 1019 5085 -2651 -3647 2941 544 -2210 2518 2737 -3070
754c070K713M686m915j094M599o04m227K063J878m992R73M473k183k734K143J038
$$ -3070 -357 4329 -586 -1680 2919 2315 -1912 151 2029 -2963 -1990 2483 300 -2434 -291 747
770G47k795j12K715n97j312J561M16k882O96L246j193o66J302J165l289M67K720
$$ 747 -2048 -2160 555 -42 -1354 207 623 -2259 -1563 1683 490 -176 1126 2291 -998 -531 2189
787B189j455j019J947L28m260J389K653k357M99J748k235k043K533M06k017N90
$$ 2189 734 -285 1662 1990 -2270 -881 1772 -585 -86 1662 -573 -2616 -83 323 -1694 -1104
803a104J922j851j082K455o18j684K088J603k466M86K046j419j989K834M22k462
$$ -1104 818 -1033 -2115 340 -278 -1962 126 1729 -737 -251 1795 376 -1613 1221 1643 -819
819h19J478J209j994k20J975o76k314K277k31j382l59R52p25Q86J170j752q03
$$ -819 659 1868 -126 -346 1629 953 -1361 916 685 -697 -1056 -104 -829 57 1227 -525 -1328
836a328J416j84k194K686k53q32J268q53r67R37K087j721m59J986j629O3Q20J269
$$ -1328 88 -96 -2290 396 143 -689 579 -274 -1241 -304 1783 62 -397 1589 -40 23 843 2112
854B112k404R38J546k588j284K513j073j746L807l94n297J550M680l263j805M196
$$ 2112 -292 646 2192 -396 -1680 833 -240 -1986 1821 1427 -3870 -2320 2360 -903 -2708 1488
870A488j233k962M037l18l911K065M044k612l434M526j13l902L557K445o132P50
$$ 1488 255 -2707 1330 1012 -2899 -834 3210 598 -2836 1690 1577 -2325 1232 3677 -2455 -1705
886a705N780k778m570L811J238k692P06K997m875k674P099j73o112K540L664l864
$$ -1705 4075 1297 -3273 538 1776 -916 -210 2787 -2088 -4762 2337 2164 -3948 -1408 2256 -1608
902a608R4L790l347k513O504R45o678n1N769k517k417N539k563m840N963J954
$$ -1608 -1514 2276 -1071 -3584 2920 3865 -2813 -2864 2905 388 -2029 3510 947 -3893 2070 4024
918D024o450r59P638j975m123K432m79m211N251K919p953l72O332l31n115L759
$$ 4024 -2426 -3385 4253 2278 -1845 587 108 -4103 1148 4067 -3886 -4258 2074 1743 -3372 387
934C87P56n053M528L991o874l069Q574J139p141L522J649n949M274O227r203l547
$$ 387 1143 -3910 618 4609 -2265 -5334 3240 4379 -2762 760 2409 -3540 734 6961 -2242 -5789
950e789R667Q97q507K846L284o388L615Q115r176o988J2155R79r024J744N795
$$ -5789 3878 4775 -3732 -886 2398 -3990 -375 7740 -1436 -8424 3731 4710 -4314 -2570 3225
965C225p650K244J0172r914p958J4115J982j2912M055Q309p819k44J1799j1194
$$ 3225 -4425 -2181 7991 -1923 -9881 4234 6216 -6696 -2641 5668 -2151 -2395 9404 -1790
979a790q717J6744L916j6657K060J1460j0292n21J2996r155j3130J6036O918j6772
$$ -1790 -10507 6237 10153 -6504 -4444 7016 -3276 -3797 9199 44 -13086 2950 9868 -6904
993f904Q35J3890j1083l068J5248p241j5457J5659J0488j9158n54J6437r550p132
$$ -6904 -6069 7821 -3262 -6330 8918 1677 -13780 1879 12367 -6791 -7345 9092 -458 -7590
1007g590J6397m791j7425J4214J4667k1402m086J8067n255j1865J6035q49j8319
$$ -7590 8807 4016 -13409 805 15472 -5930 -10016 8051 2796 -9069 6966 6117 -12202
1020a2202J1544J5742k0945p117K0916k553j3782J1382L019j8839J0358J8278
$$ -12202 -658 15084 -5861 -12978 7938 5385 -8397 2985 6004 -12835 -2477 15801
1032A5801j7929j1930J9585J027j4040R267O061j6706L887J9369j4022j2702J5711
$$ 15801 -2128 -14058 5527 6554 -7486 1781 7842 -8864 -4977 14392 370 -12332 3379
1045C379M902j5016N336J0066j3000k562J6509o711j5287J3473Q601j4969J72
$$ 3379 8281 -6735 -1399 8667 -4333 -6895 9614 2903 -12384 1089 9690 -5279 -5107
1058e107J1368q894m426J4060l872j4399R602J1517j3314l637J3558o223p624
$$ -5107 6261 -2633 -7059 7001 3129 -11270 -1668 9849 -3465 -7102 6456 233 -7391
1071g391J3244O98j6993P190J4621j1206p233J2235j751j0427J0822M155j7746
$$ -7391 5853 6551 -10442 -3252 11369 163 -7070 5165 3414 -7013 3809 7964 -9782
1084i782L902J6074r367q880J1611n81j0520Q970O525j4334k8J4866q452q933
$$ -9782 -5880 10194 827 -8053 3558 2977 -7543 1427 7952 -6382 -6410 8456 4 -8929
1098h929J1631M482j3612M073R533j0939l027J5116m585j2635R947N463j0955
$$ -8929 2702 7184 -6428 -2355 7178 -3761 -6788 8328 3743 -8892 1055 6518 -4437
1111d437K938R006j0536l579J2601r30j2647O790Q006j1921m45J1793p068p742
$$ -4437 -1499 7507 -3029 -6608 5993 5063 -7584 -794 7212 -4709 -5154 6639 -429 -8171
1125h171J2210J715j3015M784R582r350k608R832l729q292J0167L406j1802K512
$$ -8171 4039 5754 -7261 -2477 7105 -2245 -4853 4979 1250 -7042 3125 6531 -5271 -2759
1139b759R625p767m913J1385j398j0896O688O096j0022qJ0744n595p859Q368K243
$$ -2759 6866 -901 -5814 5571 4173 -6723 -35 6061 -3961 -3969 6775 1180 -6679 1689 3932
1154C932r003L656O670q162k309R864k039q759O225M033q604K794P722o398n326
$$ 3932 -5071 -1415 5255 -2907 -5216 4648 2609 -6150 75 4108 -4496 -1702 6020 -378 -5704
1169e704Q723J77p360M492O016q527j375P634l743m389O340J048o539J456N060
$$ -5704 3019 3196 -4164 328 6344 -2183 -3558 4076 333 -4056 2284 3332 -3207 -1751 3309
1184C309m972j605O308k691m578M873K612o292L46N600k662l550M799O57m647
$$ 3309 -1663 -3268 3040 349 -4229 644 3256 -3036 -2690 2910 248 -3302 1497 2154 -2493
1199b493J987L018l221o36K957m4k668J341J053k061O24K256k336j285J643J00
$$ -2493 -506 2512 -709 -1345 1612 1568 -1100 241 1294 -767 -143 2113 -223 -1508 135 235
1215B35j162O05R91j161j405J586M29j679N01J574p96o37J294M25j561O23J131
$$ 235 -927 -322 669 -492 -1897 -311 118 -1561 -1060 514 -282 -919 375 800 -761 -138 993
1232I93j075k87J185k05j225R48O07j095nQ86l12j455J740K05j707J93J551q93
$$ 993 -82 -369 816 611 -614 334 941 -154 -159 727 415 -1040 700 905 -802 -609 942 49
1250D9j513J253R21j424L2J020m96q73O88M85l61l26L29K65l13N20J07n71O36
$$ 49 -1464 -211 710 -714 -682 338 -158 -1031 -343 142 -219 -545 -216 49 -264 256 363 -208 428
1269D28N24r18k91P84J92j458O61J137j237p36J129K48j599N33J339j144j012
$$ 428 952 34 -257 527 719 -739 -78 1059 -178 -914 215 463 -1136 -603 736 -408 -1420
1286a420J698P6j730J281R17j376j3J450j021o73K156n04j559J249J276k440l74
$$ -1420 278 354 -1376 -95 822 -554 -567 883 -138 -811 1345 841 -718 531 1807 -633 -1007
1303a007K587j169j534J907O42k283J26J762q82j175J401J84j564R06L77j116
$$ -1007 1580 411 -1123 784 1426 -857 -731 1031 149 -1026 375 559 -1005 -99 278 -838
1319h38K5J034l86p24J234Q9j204N17J152j005l72J191K9j371K31J525p45o54
$$ -838 -813 221 -165 -889 345 434 -770 -253 899 -106 -478 713 742 -629 -398 1127 382 -272
1337b72Q79j82p55J45K88j12k71O34n89n67L71N54n83M3O86j054m02J722N4j702
$$ -272 607 425 -330 -185 103 -9 -280 354 -235 -802 -431 123 -460 -417 269 -785 -1187 535 589 -1113
1357a113J051J343j298o31J730n65j152J035Q95j176l02J013m46o69R31l49j279
$$ -1113 -62 1281 -17 -648 1082 517 -635 400 1295 119 -183 830 384 -285 646 297 -982
1374i82J295N28k347L34K131p07j581J641K08k178R63K181j932j140K763p08j707
$$ -982 313 841 -1506 -1172 959 252 -1329 312 520 -1658 -695 1486 -446 -1586 1177 469 -1238
1391a238J551N37j988J467J771l077k00K988r52k514K667N41l353J776K226l336
$$ -1238 313 850 -1138 329 2100 -977 -1177 1811 859 -1655 1012 1553 -1800 -24 2202 -1134
1407a134j101L605Q9l449J684J062k554J150K843l292j210L978o04l269K133J465
$$ -1134 -2235 1370 1459 -1990 -306 756 -1798 -648 2195 -1097 -2307 1671 1067 -2202 -69 1396
1423A396l080J252L199l368k061L960R13m012J552K132k947L21K836j975k902
$$ 1396 -1684 -432 2767 -601 -2662 1298 2211 -1801 -249 1883 -1064 -743 2093 118 -2784
1438b784L953J391m374P68K361k244l17L186k301l003M485J793n021j12M102j706
$$ -2784 1169 2560 -1814 -1046 1315 -929 -1246 1940 -361 -3364 1121 2914 -2107 -2219 1883 177
1454A77j736L709j663l558L443L410l978j916L364p32j606K853n27m408L096L584
$$ 177 -1559 2150 487 -3071 372 3782 -196 -2112 1252 520 -1086 1767 1240 -3168 -72 3512
1470C512m062k329M235l63k990K855L84m096K000M371l792l428M372J303k988
$$ 3512 -550 -2879 1356 993 -1997 858 1242 -2854 -854 3517 -275 -3703 669 1972 -1016
1485a016J150R74l570J342N319m023l888M727J497l762J330J933l976O51N504
$$ -1016 134 1108 -2462 -1120 4199 176 -3712 1015 2512 -1250 80 2013 -1963 -1312 4192
1500D192l641n039M847K903m535O50K013l631L39N723k884n619M503L086m497
$$ 4192 551 -4488 359 3262 -1273 -623 1390 -2241 -1902 3821 937 -4682 -179 2907 -1590
1515a590P15L115m441l48O574k800n655M769L602n144o49M237l028j169N377j955
$$ -1590 -875 2240 -2201 -2549 4025 1225 -4430 339 3941 -1203 -1852 2385 -643 -1812 3565 1610
1531A610o197M200M331m335j836L704k323j256M896j248o248L664M989m209k362
$$ 1610 -4587 -387 3944 -391 -2227 1477 -846 -2102 2794 1546 -4702 -1038 3951 -258 -2620
1546b620L492q37j905L915K75n777J808N408k571l797K900P24k167K564R54m636
$$ -2620 872 35 -1870 2045 2320 -3457 -1649 3759 1188 -2609 291 1015 -1152 1412 2366 -2270
1562b270j96N449j068m471K601J399k750J074K270l460j437N362k88n457J515
$$ -2270 -2466 2983 1915 -2556 45 1444 -1306 -232 2038 -1422 -2859 2503 2215 -3242 -1727
1577a727M245k581j073K624k519j639N153O35n942P74M605k009j738L096k120
$$ -1727 2518 -63 -1136 1488 -1031 -2670 2483 3118 -2824 -2050 2555 546 -1192 1904 -216
1592b16k940N014K013o123j90N346k212k955L371n40l716L792K502n464k34M965
$$ -216 -3156 1858 3871 -2252 -2442 2904 692 -2263 1108 568 -3148 644 3146 -2318 -2552 2413
1608B413j807k728L222o29l079L409K645n399j49M956j850k927K874K46l130K787
$$ 2413 606 -2122 1100 471 -2608 801 3446 -1953 -2102 2854 1004 -1923 951 1197 -1933 854
1624H54J863m290j18M219j512k750K376l88k062K985J152m383r7L993j469j905
$$ 854 2717 -1573 -1691 2528 1016 -1734 642 254 -1808 1177 2329 -2054 -2151 1842 373 -1532
1640a532K276m71k650K945J367l327j32L055j308j349J737K1j491J751P22l063
$$ -1532 744 273 -2377 568 1935 -1392 -1524 1531 223 -1126 611 632 -859 892 1614 -1449
1656a449M59K922j565j493J685k13j331J501N81k469J33K228n46j300Q72L46j120
$$ -1449 -990 1932 367 -1126 559 346 -985 516 1097 -1372 -1239 989 443 -857 15 361 -759
1673g59J053N10j482l25J868k27j712R13Q64j119M55J245j383r83J673O47j444
$$ -759 294 804 -678 -1003 865 638 -1074 -161 703 -416 39 1284 -99 -1082 591 1238 -206
1690b06m09J530q14m91R97K9j787J239R49j680m23J619m20j058R52N56j574O11
$$ -206 -615 915 101 -390 607 636 -1151 88 1037 -643 -1066 553 133 -925 27 583 -991 -380
1708c80J427j523k55J319K64j656O35J194j396k9J628q53j329J603M00j553J81
$$ -380 1047 -476 -731 588 852 -804 -169 1025 -371 -400 1228 375 -954 649 1049 -504 -323
1725c23J203j086k85J362r00j144J222P55j855K22J442r37o25J386L5j800R95
$$ -323 880 -206 -491 871 -29 -1173 49 804 -1051 -829 613 -324 -949 437 472 -1328 -333
1742c33R19o21o47J117o4o96Q11P0n88j24P32o41q3L78P8q55O78L26j028m8J122
$$ -333 586 -35 -682 435 371 -325 486 556 -32 -156 576 -65 -148 230 308 -547 131 457 -571 -619 503
1763E03l49r91O94K96m48j38N50l50k41L00K74m96N35K02k52l47P31k95m37J05
$$ 503 154 -837 -143 153 -295 -433 117 -233 -474 -174 100 -396 139 341 89 -258 473 178 -259 -154
1783a54N20l01j7M39l30o83O29L05p55j47R44j39o63N01j49n55O11L40n26k4N56
$$ -154 366 65 48 487 157 -526 103 408 -347 -494 450 311 -352 149 0 -555 56 396 -130 -154 402
1804D02o03J27J56p9q2K30M3k05j16P47n01k47L65K77o19L59P4n68K04L06k22
$$ 402 -201 -74 82 3 -79 151 194 -11 -127 620 119 -128 237 514 -105 254 328 -240 -36 270 48
1825D8j09L57k42l52M72k48l10R3M86k94j30N11k88k90O38L4o80P45k01k82o4
$$ 48 -61 296 54 -298 174 -74 -384 -291 195 -99 -229 282 -6 -296 342 376 -304 441 240 -42 -106
1846a06P69n62l00P73p46P2L85o5m96J98N37p77p1O93j59p43M01J23p46O54K65
$$ -106 663 101 -199 574 -172 -100 285 220 -276 -78 459 -318 -389 304 145 -598 -197 -74 -820 -166 99
1867I9m46k46P21K76j006O57N37j090M76K41j57n42M36Q21j096R1Q49p22m4M94
$$ 99 -347 -593 128 404 -602 55 592 -498 -22 219 62 -480 -44 777 -319 -228 621 -101 -145 349
1887C49O2o99J79M58q65k0J051k04j173R34J58q54M06L22n45l84R66L4o24L11
$$ 349 411 -288 -109 349 -516 -536 515 311 -862 72 230 -624 -218 104 -441 -825 141 175 -449 -138
1907a38Q72j281M36N89m07o38J318q3j599J209P40j643j44J670r88o39J265K8
$$ -138 734 -547 -111 478 71 -567 751 668 -931 278 1018 -625 -769 901 -87 -726 539 567
1925E67j209M08J155j649Q9J419n63j430J455Q43k022N79J651j612m99J782o59
$$ 567 -642 -234 921 -728 -639 780 217 -1213 242 1085 -937 -358 1293 -319 -818 964 305
1942C05j492J690N05j511N1K033j601j153K118l62j431R73R00j931K28J441q72
$$ 305 -1187 503 1008 -503 -452 1581 -20 -1173 945 583 -848 125 1025 -906 -678 763 -109
1959a09r39J221L70j561R35J031k164N27K316j225j449J485R81k629J650Q15j777
$$ -109 -1048 173 543 -1018 -83 948 -1216 -689 1627 402 -1047 438 1419 -1210 440 1255 -522
1976e22j94J734o08j831J522J036j713O75J318j593j190J749R07k038O31P49j036
$$ -522 -716 1018 410 -1421 101 1137 -576 99 1417 -176 -1366 383 1290 -748 -117 632 -404
1993d04o00K064j240j199J189P77r64P32L71q80r19J641k46j092Q16P01j582Q72
$$ -404 -1004 1060 -180 -1379 -190 587 -377 355 726 -154 -1073 568 322 -770 46 747 -835 37
2011C7J424j108j130J247q4p58M96n1l79j105K487l67j488O22J219k075J112L80
$$ 37 1461 353 -777 470 386 -372 124 73 -306 -1411 1076 709 -779 -157 1062 -1013 99 479
2029D79j308o19L219j369j310O07J820k315M61J650n85j878K580q87j901J437
$$ 479 -829 -1448 1771 402 -908 -301 1519 -796 -335 1315 730 -1148 1432 545 -1356 81
2045H1K110l038o8K215j014j444J715N24k329J367J692k179r58J494m7p59J281
$$ 81 2191 -847 -915 1300 286 -1158 557 1081 -1248 119 1811 -368 -1326 168 121 -638 643
2062F43j25k024N07K193j314o26J580o75j840K144J264l444R61J528j029p02J490
$$ 643 518 -1506 -999 1194 -120 -746 834 159 -1681 463 1727 -1717 -756 772 -257 -959 531
2079E31l87k298K399K3j610N9K445j664k98J319j362n88J144J844k409RJ700k71
$$ 531 144 -2154 245 268 -1342 -1283 1162 -502 -800 519 -843 -1431 -287 1557 -852 -843 857 586
2097E86j872J441K7q18L63J839k193l95J848P68l181J658k25O58Q8l85R22j905
$$ 586 -1286 155 182 -636 -273 1566 -627 -1022 826 1594 -1587 71 -154 504 592 207 1129 -776
2115g76J246M3j390P18P66q52j158J677l31q00N59J031j878J124L74j026q06P23
$$ -776 470 513 -877 -159 607 -245 -1403 274 -57 -857 -298 733 -1145 -21 353 -673 -1479 -756
2133g56J033j370J140J589k792M65Q37N87r28Q93Qj305N07O11j280J21L91N71
$$ -756 277 -1093 47 1636 -1156 -691 146 733 -195 698 706 -599 -92 519 -761 -640 -249 322
2151C22j251L37Q55m8j446J035m43o11P58J544k291K168p98k19j26N0J048j571
$$ 322 -929 -592 263 215 -1231 -196 -639 -1250 -492 1052 -1239 929 131 -88 -214 -164 884 -687
2169f87J640N69k519k9J223o25L38R7M54q32J28M52q42Q04n71J753n25r75N54
$$ -687 953 1522 -997 -1026 197 -428 -90 7 461 -371 -243 209 -633 171 -400 1353 828 -147 407
2188D07q57n45J964j447j26J176q20P84m12R77n69k90N15n59q20Q48p9K7o22J057
$$ 407 -450 -995 969 -478 -604 572 -248 536 124 1101 532 242 757 198 -622 226 147 174 -448 609
2208F09q31l72J430l81q68O62O3k78K10O06j659Q93n4L91m16J88J72l90P24j227
$$ 609 -222 -594 836 455 -413 249 312 34 244 850 -809 84 30 421 5 193 365 -25 699 -528
2228e28Q88O07q5r47L84n22K50k71p91J493p45k0Pj80J237r85M16j019Q98p70
$$ -528 360 967 882 -65 319 -203 47 -224 -1015 478 -267 -287 -280 -460 777 -208 208 -811 87 -683
2248f83P33p30J297m49o06J315j201K0R59j170k19J491J06j45m58k16Q36j147
$$ -683 50 -680 617 168 -438 877 -324 -304 655 -515 -734 757 863 718 260 44 880 -267
2266b67M95j71l82L60N43k70K7j70J09j166J573j245J0K71M76m83L17O06j289
$$ -267 228 57 -325 35 578 308 335 165 274 -892 681 -564 -554 -283 193 -290 27 633 -656
2285f56k93R10k83M78n48Q22j404N63J48l82J11K57Q5K62k33K09P32j137J007
$$ -656 -949 -39 -322 156 -392 430 -974 -411 -263 -645 -534 -277 -192 70 -163 46 778 -359 648
2304F48r00%O91j374N86L78p47J249j206O77r11M80J09Q07j58j545M23k12J000
$$ 648 -252 -252 439 -935 -349 29 -718 531 -675 2 -909 -429 -320 487 329 -1216 -793 -1005 -5
$$ [...]
8191C47
##END NTUPLES=NMR FID
##END=
