##TITLE=1H_Pr T-116
 CDCl3, 8 sc, 
 4.9.2020
##JCAMPDX= 6.0         $$ Bruker NMR JCAMP-DX V2.0
##DATA TYPE= NMR FID
##DATA CLASS= NTUPLES
##ORIGIN= UXNMR, Bruker Analytische Messtechnik GmbH
##OWNER= root
$$ XWIN-NMR		Version 3.5
$$ Fri Sep  4 11:00:23 2020 Russian Standard Time (UT+4h)  she@DPX200
##.OBSERVE FREQUENCY= 200.1315066352
##.OBSERVE NUCLEUS= ^1H
##.DELAY= (6, 6)
##.ACQUISITION MODE= SIMULTANEOUS
##.ACQUISITION SCHEME= undefined
##.AVERAGES= 8
##.DIGITISER RES= 18
##SPECTROMETER/DATA SYSTEM= spect
##.PULSE SEQUENCE= zg30
##.SOLVENT NAME= DMSO
##.SHIFT REFERENCE= (INTERNAL, DMSO, 0, 15.7039)
##AUDIT TRAIL= $$ (NUMBER, WHEN, WHO, WHERE, WHAT)
$$ ##TITLE= Audit trail, XWIN-NMR		Version 3.5
$$ ##JCAMPDX= 5.01
$$ ##ORIGIN= Bruker BioSpin GmbH
$$ ##OWNER= she
$$ F:/spectra/data/she/nmr/H-F/1/audita.txt
$$ ##AUDIT TRAIL=  $$ (NUMBER, WHEN, WHO, WHERE, WHAT)
(   1,<2020-09-04 10:59:13.82 +0400>,<she>,<DPX200>,
      <created by zg, POWCHK disabled, PULCHK disabled
       configuration hash MD5:
       00 E9 B6 7A A2 85 ED C7 34 08 36 98 17 FE 4E 26
       data hash MD5: 16K
       D4 9A 76 2B 9C 15 8F C9 59 48 59 9A CA C5 F0 65>)
$$ ##END=
$$ 
$$ hash MD5
$$ 42 43 51 AD 63 5F 31 BD 12 9F CE 47 0F 49 12 36
##$RELAX= 
##$RELAX= 
##$RELAX= 
##$RELAX= 
##$RELAX= 
##$RELAX= 
$$ Bruker specific parameters
$$ --------------------------
##$DU= <F:/spectra>
##$EXPNO= 1
##$NAME= <H-F>
##$PROCNO= 1
##$TYPE= <nmr>
##$USER= <she>
##$AMP= (0..31)
100 100 100 100 100 100 100 100 100 100 100 100 100 100 100 100 100 100 
100 100 100 100 100 100 100 100 100 100 100 100 100 100 
##$AQSEQ= 0
##$AQ_mod= 1
##$AUNM= <au_zg>
##$AUTOPOS= <>
##$BF1= 200.13
##$BF2= 200.13
##$BF3= 200.13
##$BF4= 200.13
##$BF5= 200.13
##$BF6= 200.13
##$BF7= 200.13
##$BF8= 200.13
##$BYTORDA= 1
##$CFDGTYP= 0
##$CFRGTYP= 5
##$CHEMSTR= <none>
##$CNST= (0..31)
1 1 145 1 1 1 1 1 1 1 1 1 1 1 1 1 1 1 1 1 1 1 1 1 1 1 1 1 1 1 1 1 
##$CPDPRG= <>
##$CPDPRG1= <>
##$CPDPRG2= <>
##$CPDPRG3= <>
##$CPDPRG4= <mlev>
##$CPDPRG5= <mlev>
##$CPDPRG6= <mlev>
##$CPDPRG7= <mlev>
##$CPDPRG8= <mlev>
##$CPDPRGB= <>
##$CPDPRGT= <>
##$D= (0..31)
0 1.2 0 0 0 0 0 0 0 0.06 0 0.03 0 0 0 0 0.0002 0 0 0 0 0 0 0 0 0 0 0 0 
0 0 0 
##$DATE= 1599202753
##$DBL= (0..7)
120 120 120 120 120 120 120 120 
##$DBP= (0..7)
150 150 150 150 150 150 150 150 
##$DBP07= 0
##$DBPNAM0= <>
##$DBPNAM1= <>
##$DBPNAM2= <>
##$DBPNAM3= <>
##$DBPNAM4= <>
##$DBPNAM5= <>
##$DBPNAM6= <>
##$DBPNAM7= <>
##$DBPOAL= (0..7)
0.5 0.5 0.5 0.5 0.5 0.5 0.5 0.5 
##$DBPOFFS= (0..7)
0 0 0 0 0 0 0 0 
##$DE= 6
##$DECBNUC= <off>
##$DECIM= 32
##$DECNUC= <off>
##$DECSTAT= 4
##$DIGMOD= 1
##$DIGTYP= 9
##$DL= (0..7)
0 120 120 120 120 120 120 120 
##$DP= (0..7)
150 150 150 150 150 150 150 150 
##$DP07= 0
##$DPNAME0= <>
##$DPNAME1= <>
##$DPNAME2= <>
##$DPNAME3= <>
##$DPNAME4= <>
##$DPNAME5= <>
##$DPNAME6= <>
##$DPNAME7= <>
##$DPOAL= (0..7)
0.5 0.5 0.5 0.5 0.5 0.5 0.5 0.5 
##$DPOFFS= (0..7)
0 0 0 0 0 0 0 0 
##$DQDMODE= 0
##$DR= 18
##$DS= 0
##$DSLIST= <SSSSSSSSSSSSSSS>
$$ [...]
##$SUBNAM2= <"">
##$SUBNAM3= <"">
##$SUBNAM4= <"">
##$SUBNAM5= <"">
##$SUBNAM6= <"">
##$SUBNAM7= <"">
##$SUBNAM8= <"">
##$SUBNAM9= <"">
##$SW= 16.880792210976
##$SWIBOX= (0..15)
0 0 2 0 0 0 0 0 0 0 0 0 0 0 0 0 
##$SW_h= 3378.37837837838
##$TD= 16384
##$TD0= 1
##$TE= 0
##$TE2= 300
##$TE3= 300
##$TEG= 300
##$TL= (0..7)
0 120 120 120 120 120 120 120 
##$TP= (0..7)
150 150 150 150 150 150 150 150 
##$TP07= 0
##$TPNAME0= <>
##$TPNAME1= <>
##$TPNAME2= <>
##$TPNAME3= <>
##$TPNAME4= <>
##$TPNAME5= <>
##$TPNAME6= <>
##$TPNAME7= <>
##$TPOAL= (0..7)
0.5 0.5 0.5 0.5 0.5 0.5 0.5 0.5 
##$TPOFFS= (0..7)
0 0 0 0 0 0 0 0 
##$TUNHIN= 0
##$TUNHOUT= 0
##$TUNXOUT= 0
##$USERA1= <user>
##$USERA2= <user>
##$USERA3= <user>
##$USERA4= <user>
##$USERA5= <user>
##$V9= 5
##$VALIST= <valist>
##$VCLIST= <CCCCCCCCCCCCCCC>
##$VD= 0
##$VDLIST= <DDDDDDDDDDDDDDD>
##$VPLIST= <PPPPPPPPPPPPPPP>
##$VTLIST= <TTTTTTTTTTTTTTT>
##$WBST= 1024
##$WBSW= 4
##$XGAIN= (0..3)
0 0 0 0 
##$XL= 0
##$YL= 0
##$YMAX_a= 23768
##$YMIN_a= -19296
##$ZGOPTNS= <>
##$ZL1= 120
##$ZL2= 120
##$ZL3= 120
##$ZL4= 120
##$ABSF1= 10
##$ABSF2= 0
##$ABSG= 5
##$ABSL= 3
##$ALPHA= 0
##$AQORDER= 0
##$ASSFAC= 0
##$ASSFACI= 0
##$ASSFACX= 0
##$ASSWID= 0
##$AUNMP= <proc_1d>
##$AZFE= 0.1
##$AZFW= 0.1
##$BCFW= 1
##$BC_mod= 2
##$BYTORDP= 1
##$COROFFS= 0
##$CY= 11.3945322036743
##$DATMOD= 1
##$DC= 2
##$DFILT= <>
##$DTYPP= 0
##$F1P= 16.9975609425685
##$F2P= -3.02152046262296
##$FCOR= 0.5
##$FTSIZE= 0
##$FT_mod= 4
##$GAMMA= 1
##$GB= 0.15
##$INTBC= 1
##$INTSCL= 1
##$ISEN= 128
##$LB= 0.24
##$LEV0= 0
##$LPBIN= 0
##$MAXI= 10000
##$MC2= 0
##$MEAN= 0
##$ME_mod= 0
##$MI= 1.114404
##$NCOEF= 0
##$NC_proc= 0
##$NLEV= 6
##$NOISF1= 3.799351
##$NOISF2= 2.8
##$NSP= 1
##$NTH_PI= 0
##$NZP= 0
##$OFFSET= 15.70392
##$PC= 1
##$PHC0= -9970.954
##$PHC1= 5.600898
##$PH_mod= 1
##$PKNL= yes
##$PPARMOD= 0
##$PSCAL= 0
##$PSIGN= 0
##$REVERSE= no
##$SF= 200.130013532006
##$SI= 16384
##$SIGF1= 3
##$SIGF2= 2
##$SINO= 400
##$SIOLD= 16384
##$SREGLST= <1H.CDCl3>
##$SSB= 0
##$STSI= 0
##$STSR= 0
##$SW_p= 3612.71676300578
##$SYMM= 0
##$S_DEV= 0
##$TDeff= 0
##$TDoff= 0
##$TI= <>
##$TILT= no
##$TM1= 0
##$TM2= 0
##$TOPLEV= 0
##$USERP1= <user>
##$USERP2= <user>
##$USERP3= <user>
##$USERP4= <user>
##$USERP5= <user>
##$WDW= 1
##$XDIM= 8192
##$YMAX_p= 0
##$YMIN_p= 0
$$ End of Bruker specific parameters
$$ ---------------------------------
##NTUPLES= NMR FID
##VAR_NAME=  TIME,          FID/REAL,        FID/IMAG
##SYMBOL=    X,             R,               I
##VAR_TYPE=  INDEPENDENT,   DEPENDENT,       DEPENDENT
##VAR_FORM=  AFFN,          ASDF,            ASDF
##VAR_DIM=   8192,          8192,            8192
##UNITS=     SECONDS,       ARBITRARY UNITS, ARBITRARY UNITS
##FACTOR=    0.000296,      1,               1
##FIRST=     0,             0,               0
##LAST=      2.424536,      0,               0
##MIN=       0,             -19296,          0
##MAX=       2.424536,      23768,           0
$$ Real data points
##PAGE= N=1
##DATA TABLE= (X++(R..R)), XYDATA
0@%%%%%%%%%%%%%%%%%%%%%%%%Mj2J6j6J6j6J6j6K3l1L2l2L8m6M8n4O2o8P6q5R4
45D9j03J14j24J36j52J67j84K03k24K48k74L05l38L73m17M71n33O10p06Q30j001
66e50J249j657K475j0584K5733n257k6123N253J1110O223r446m779M102J094L025
81A868J813r962K801P491l362j479l55n53O199l375n695N431M101l714n209J481
97b519R832m591r266P151L143m786K270j484l493M194K657k387m954J599P188
112D554l735n191N127j91j472K971l612L84M130k530j723K337J039o76k837K470
128A045K909m983J247L017m729K204L479n118r14M190O24l173j906L314J112m022
144a704J969J025l065L255J39m608L571K349l661p55K078K141j826k278K565L22
$$ plain form
0 0 0 0 0 0 0 0 0 0 0 0 0 0 0 0 0 0 0 0 0 0 0 0 0 0 4 -8 8 -8 8 -8 8 -8 15 -16 16 -16 22 -24 24 -30 32 -36 40 -45 49
45 49 -54 60 -64 72 -80 87 -97 106 -118 130 -144 161 -177 196 -221 250 -283 327 -379 451 -550
66 -550 699 -958 1517 -9067 16666 11409 -14714 -9461 1649 7872 -1574 -6353 -2251 -1157 1868
81 1868 3681 -6281 -3480 4011 649 -830 -1185 -1738 4461 1086 -4609 822 4923 1209 -4000 -2519
97 -2519 7313 2722 -6544 607 3750 -1036 1234 -250 -3743 451 3108 721 -4233 -2634 4554
112 4554 819 -4372 755 564 -908 2063 -1549 -1165 2965 435 -1288 1049 2088 1412 -1425 1045
128 1045 3954 -1029 218 3235 -1494 710 4189 -929 -1843 2347 2971 -202 -2108 1206 2318 -1704
144 -1704 265 1290 -1775 1480 1619 -2989 582 2931 -730 -1485 593 2734 908 -1370 1195 1517
160A517p97K167l192j970O680r96n666K008K835Kk147r03J726q15P36J323m476
177a968O59N128l146k334K380j13l06M94r66n5J49J882j51l781K939K473m077
194g93Q71K159k043L82J570j388o98R67J233j813q54K690j052k326K827l84k582
211a234J893J160k310L93J088o83p88J018P08k205J76K865k069j588K835n48j162
228d51J430Pj552R32J290r52j358J591J267k322J60J368j592M96J624j968j040
245a070K551j8j993J76J617p94j315J418L04k088J695P31k145N17J673j223n78
262e42J207j16p26K25J265j303m80J642m36j665K229j07k012J009J016r12o98
279d04J242K36j406L45R92j390J98J617j505r60J418L49j520K43O65m07j23J014
$$ plain form
160 1517 720 2887 -305 -2275 4405 3409 -2257 -249 2586 2588 441 -462 1264 449 1185 2508 -1968
177 -1968 -1309 3819 673 -1661 719 606 300 794 -172 -227 -78 1804 1653 -2128 811 3284 -793
194 -793 78 2237 194 576 2146 758 60 1027 2260 447 -407 2283 1231 -1095 1732 1348 -1234
211 -1234 659 1819 -491 -98 990 307 -481 537 1245 -960 -784 2081 12 -1576 1259 711 -451
228 -451 979 986 -566 366 1656 704 -654 937 2204 -118 42 1410 -182 314 1938 -30 -1070
245 -1070 1481 1463 -530 -354 1263 469 -846 572 876 -1212 483 1214 -931 -414 1259 36 -542
262 -542 665 549 -177 48 1313 10 -470 1172 736 -929 1300 1193 -819 190 1206 294 -404
279 -404 838 1074 -332 13 1005 -385 -187 1430 -75 -1035 383 732 -788 -545 120 -287 -410 604
297F04p00j031J587K80j699N73J383j165j76J095m12j160J228N24j668q8J847
314A022o81q97M96M53r11L61P43j458qJ439m84j098R09K76p93L13Q12j099k96
333i01J313k91j202O70R42q83j32Q16p31N0P65J38j595N61J108q50m25O92k02
352a57n17J023k3j332O23P25p26n85R29K10q87O07L01j066L4J132n90q53J001
371a51J79r52M78K75l96O2R46p29p29R51K01o07J14K72l80o9J016n09q93M51P17
392B47q17L4M91l67l7L44Q0q42M12Q10q70m28J140n63j37N19l21k56K42L20l60
413c59l21O96K16q99L73J84n68K85N81p15j15N39K84l69k71P59k60m28P61o59
433b86l82R78O1j078K91N85m67kL19P2l80J48M65o57l18R67l91m75L84M2k25M11
$$ plain form
297 604 -96 -1127 460 740 -959 -386 997 -168 -344 751 339 -821 407 931 -737 -825 1022
314 1022 341 -556 -60 393 -518 -157 586 -872 -880 559 75 -1023 -114 162 -631 -318 494 -605 -901
333 -901 412 121 -1081 -411 531 -352 -484 332 -399 -349 416 554 -1041 -480 628 -222 -647 45 -157
352 -157 -674 349 326 -1006 -383 342 -384 -969 -40 170 -717 -110 191 -875 -841 291 -299 -1152 -151
371 -151 28 -924 -446 -171 -567 -505 441 -288 -1017 -66 135 -472 -358 -86 -466 -535 481 -28 -921 -470 247
392 247 -570 -536 -45 -412 -449 -105 -25 -867 -455 355 -515 -943 197 -366 -503 16 -305 -561 -319 1 -359
413 -359 -680 16 232 -667 -294 -110 -678 -393 188 -527 -642 -103 181 -188 -459 300 40 -388 373 -286
433 -286 -668 310 371 -707 -416 169 -298 -300 19 91 -289 -141 324 -333 -651 316 -75 -550 -166 -124 -349 62
455F2K6m41j2M27O3k30J34J11k99K39P6m78L4P98n29j05j19M84j44l27M64k32
477Bl26M20J50q41P24P7l90J89n5J50k69L62J89n27J31M62k50l95N23q2k73NJ95
500A71m54L99Q3j76o3K18J7j68j72N86n00Q5J59j37j20Q2K30k1l6j1Ol65K43K6
524H2l21M66o7q7J92J4l11K90J79l07k46L35M57o26O0L47k32k03M6J67l36L4L48
547B81j53r5pK53j38k34Q4q4J45J06j30j56K65j35q5J02j08O5P6k6Q6m86L93M57
571D76m17j52o9M23l68K35J1k47M9M16m35L25m12L03o1l25L45J08R9j96j25k30
593b47K73J0lj71J04J77N2j05k81O6K89J03j78k12J79o9L39j75k70J68J57Q5l32
616d1l2O1J66j84n1J65kJ0j35j42J9J93n9J39j34J47k24J48j50k2J62m0J01j72
$$ plain form
455 62 88 -353 -365 62 125 -105 29 140 -159 80 156 -322 -288 510 -19 -124 -243 241 97 -230 234 2
477 2 -324 96 246 -595 129 206 -184 5 -50 100 -169 193 382 -145 -14 448 198 -197 326 244 -29 -24 171
500 171 -283 116 199 23 -40 178 195 27 -145 441 -59 26 185 48 -72 10 240 219 183 172 178 -187 56 82
524 82 -239 227 160 73 265 279 -32 258 437 130 -116 219 676 50 110 457 225 22 68 235 -101 -67 281
547 281 128 33 26 279 141 -93 -9 -93 52 158 28 -128 137 2 -83 19 -89 -24 52 26 112 -374 19 476
571 476 59 -93 -162 261 -107 128 139 -108 -59 357 -78 247 -165 138 77 -248 97 205 304 108 -17 -247
593 -247 26 36 33 -138 -34 143 195 90 -191 -125 164 267 89 -123 56 -13 326 151 -119 49 206 291 -41
616 -41 -73 -12 154 -30 -81 84 82 92 -43 -185 -166 27 -32 107 -27 120 -104 44 -106 -128 34 -6 95 -77
640g7O4J27k41J22O7j85K82j44M6j78K2O4K54j36k47L17l52L03j83J9k13N5P4
663a40r7K13J33q7K50k63l1J52l09J85j28K43n3j42J39q4n13M78k2J94k51J09
685b4L9rpj68L74k86K01j64J09R0m51M22j63j96K08p1k15K97J2J13k26J16j24
708a23j82K07m4N4j64R3R2%j77Q2O7k93K26M0j32JJ72O5j33m9K94r2r5j06Q8J19
734A0p7P2j9k72J40J11k62K06oo1K00l58n1N32m46J84J0j61L36N7k5k4o7j59K4
759a06kJ41j44M2oK3N3J79j46j21J71j32N2j39LJ37Q9k76j1J58J11l19K77r8Q7
784B3qj82P1M10m55j81K53J0MM9R1Pq6Q1k0j67L6K60j0p0q3N7p6M2O0j86J88j02
812A6m7J61n6J23l06J67q6J37k62K12j76l0o4K45L40n05J29J35Q3k88J74j6Q8
$$ plain form
640 -77 -13 114 -127 -5 62 -123 159 15 61 -117 -95 -31 223 87 -160 157 -195 108 -75 -56 -269 -214 -140
663 -140 -237 -24 109 22 272 9 -22 130 -179 6 -122 121 68 -74 65 -19 -532 -54 -76 118 -133 -24
685 -24 15 6 -1 -169 205 -81 120 -44 65 155 -296 126 -37 -233 -25 -96 -311 -14 -2 111 -115 1 -123
708 -123 -305 -98 -142 -88 -252 -159 -67 -67 -244 -162 -95 -388 -162 -122 -254 -253 -81 -16 -149 -198 96 4 -91 -197 -109 10
734 10 -67 5 -14 -286 -146 -35 -297 -91 -97 -158 42 -316 -367 165 -281 -97 -87 -248 88 145 120 96 29 -130 -106
759 -106 -108 33 -111 -69 -75 -52 1 180 34 -87 84 -48 4 -135 -132 5 94 -182 -193 -35 76 -243 34 -64 23
784 23 15 -167 -96 314 -141 -322 -69 -59 -55 -6 85 92 6 87 67 -100 -64 196 186 116 33 90 14 56 116 -70 118 16
812 16 -31 130 74 197 -109 58 -28 109 -153 59 -117 -147 -211 34 374 -131 -2 133 216 -72 102 86 174
835A74K98j60k15J00q9m4K0K7q0K93J84n15J10k72L70lk37P4n6R6j57Q7J13o0
859E8K5K2j09J9L5K17o9j29L22l14r0k1q2L20j5p4L9k8K2o6O1J20k40J4J45j29
885E3l05J92J80Mp2Q2L14j46k54K15k51Q6q7L33l21K43l30J13K97l60k8J09J31
908A98l28K16p2J26m0R4N5k82J63j27K74j06p3j98j79K74J8p7n5K6K64l05J31
931cl3j14R7j27J97K77j02j83L12k56j09J14k82L12O0K1p9p4j14K38k5j00M0o8
955aL6r5L21m85L3M86k16O1j94r1K74k09P4P7k49J4Q3Q0k36J57J52j50jK2M6J
981a0n6l3N5mO9m82R4L56N5Jr2O1j10r0J08j05j1Q0K34Q6k95l6j72J65M97l49
1007A6j28J97k0n0j06p5k29L84k8K9k40J51K10k31K87J13l73q2K16k16j2M3J2
$$ plain form
835 174 472 312 97 197 108 64 84 111 31 324 508 -7 103 -169 201 198 -39 35 -21 75 -82 5 118 58
859 58 83 105 -4 15 50 267 198 69 391 77 -13 -34 -116 204 189 115 154 126 148 82 143 263 23 37 182 53
885 53 -252 -60 120 124 52 134 448 302 48 263 12 98 11 344 23 266 -64 49 346 -14 -42 67 198
908 198 -130 86 14 140 100 194 249 -33 130 3 277 171 98 -100 -279 -5 13 -64 -119 -93 171 -134 -3
931 -3 -36 -150 -53 -180 17 294 192 9 321 65 -44 70 -212 100 160 181 102 28 -86 152 127 27 67 -1
955 -1 35 -60 261 -224 -191 295 79 140 -54 -145 129 -80 -6 71 -178 -164 -81 -1 -237 -80 72 -78 -79 -57 -11 -10
981 -10 -66 -99 -44 -48 21 -461 -367 -11 44 45 -47 14 -96 -186 -78 -183 -194 -114 120 206 -89 -125 -297 -132 365 16
1007 16 -112 85 65 15 -91 -166 -395 -11 -39 -10 -250 -99 111 -120 167 280 -93 -175 41 -175 -187 -144 -132
1030a32n4L29j67p3j27L85j62k14O1J89K6j23o8k2O4m8J63j60l6K12m0k94K56
1053c5L02n13K90JJ7k54N7j45J05L83k6l95Q3J33j03K40j56L1J1k8p9J46l0j80
1077a45K90j20J9r8l53L76J23k76J64J82k91J54j01P3Q1m4J8m7m8%k8l7K05L2
1101A29k96J00Q7L6q3j14PM7NP2L20l16L36j76k82J97k22J00J44j92l0M8J60j16
1125c9j89L60k07K02k03K42k38o3J0p6N3Q6L0l6M1q5j1m8J10M0Q1k05J81k28K19
1150B7l2Q6j30L25j25n4k45L89l47L52l46J07j25O1J12q2l5K13j81R6O4qj10O
1174A8J35P9k54J99o8k33L80l00K86k56k09K74o1q1j08M4J98K2J77k39j05K56
1196A54N2k21J06q5k58J42L03m08jL15l02J25R6M8j49j0J12R3j89n1L08l54J59
$$ plain form
1030 -132 -186 143 -24 -97 -224 161 -1 -215 -154 35 61 -62 -130 -152 -88 -136 27 -133 -169 43 3 -291 -35
1053 -35 267 -246 44 45 62 -192 -135 -280 -175 208 182 -213 -130 3 -100 140 -16 15 26 -2 -81 65 35 -145
1077 -145 145 25 44 -54 -407 -31 92 -184 -20 162 -129 25 -76 -3 78 34 52 5 -43 -43 -71 -108 97 129
1101 129 -167 -67 20 56 -27 -141 -134 -87 -82 -10 310 -6 330 154 -128 69 -153 -53 91 -101 -131 -83 77 -39
1125 -39 -228 132 -75 127 -76 166 -72 -135 -125 -201 -148 -62 -32 -68 -27 -112 -123 -171 -61 -21 60 -145 36 -192 27
1150 27 -5 81 -49 276 151 97 -148 241 -106 246 -100 7 -118 -57 55 -27 -62 151 -30 66 130 122 12 18
1174 18 153 232 -22 177 109 -124 256 -44 242 -14 -223 51 -10 -91 -199 -155 43 65 242 3 -102 154
1196 154 206 -15 91 6 -252 -110 193 -215 -216 99 -203 -78 18 66 -83 -93 19 112 -77 -128 180 -174 -15
1219a5O1lk13J84P8O1k30J26J95j94j0j16P1Q4j71O8K08k27J00n9K26l70L7K49
1243A40J40j36O9j64n8K19o1r0p8J42p5j18J17j14K19m6p8n3K2J58k33N4J4J42
1267A32k92L88l63K22J01k4l42K87P2j47O7m3q3P2J9j31K1J04j89Q0j56J08R1
1290fK2k79K24q2J63j77P7k14L26P0j44k7k68L88m51L09K9J91k43J70r6L0j37
1313a25q7P8R5J41j48J16j36L5Q5P0R8j50m1L7L1j13j01J83j31Q4K8k2p8q3Jr3
1339b26Q9J52k13J84N3r9j9n8J13M9p1k21K77Q1J0m6j04J18m0q0J38j96J55r1
1363d5K72l60P1K07k99K9L98k13K62k75l2j20N4Q7j70j29L16k98K27o2K21j24
1385A7Q9r9pN9k1kj50J36j5J89j49k76K19jk4J79j37j02K9j75qP1K98j18j0J3
$$ plain form
1219 -15 46 43 -170 14 92 153 -77 49 244 50 40 -76 -5 79 -92 -24 184 -43 57 -2 224 -146 -109 140
1243 140 280 144 213 49 -9 210 149 59 -19 123 48 -70 47 -67 152 106 28 -25 -3 155 -78 -24 -10 132
1267 132 -160 228 -135 87 188 164 -178 109 181 34 101 58 -25 47 66 -65 -44 60 -129 -49 -205 -97 -6
1290 -6 16 -263 -39 -121 42 -135 -58 -272 54 124 -20 -47 -315 73 -378 -69 -40 151 -92 78 -18 12 -125
1313 -125 -212 -134 -39 102 -46 70 -66 -31 54 124 222 72 31 68 99 -14 -115 68 -63 21 49 27 -51 -134 -133 -226
1339 -226 -137 15 -198 -14 39 -60 -79 -137 -24 25 -46 -267 10 91 101 55 -49 69 29 -51 87 -109 46 -45
1363 -45 227 -133 -62 145 -154 -125 273 60 322 47 15 -105 -51 36 -134 -263 53 -245 -18 -80 141 17
1385 17 106 7 0 59 38 36 -114 22 7 196 47 -229 -10 -11 -35 144 7 -95 -66 -241 -249 -178 120 2 -8 5
1411EK11l58J20j68J74J52o5j26K53k79R7K87l92n0J41k78K95k19J47J65n5j58
1433a01M3Lm7j5J9J79q2M5p9J83l61M20j66K8k66N56k68j19J98j66k0J84q5k48
1457a65J85J99l92K34l14N3K63j13J56k64J60j24P6k06J06q6J93k12M73j27J7
1478A12l59L3J98N1rqj3K30k60J9pJ42l17J41J90j32Q6j96n5J53K77k28J66k26
1502a2L0k8m7K28j41Q7K0N0k48L3K64n15M83j51r7J1M1j24L85k05O8m85M10M5
1526A02J7k94K57k58J80M3J6j8k67O06n69K81n5K56n24J60pK22k40J69l7J02o
1549A36k33N1O5J62j6j84MJ66r7p4P4n5j82M71j23k33K11j06j28K04o8n7n1P4
1573A1J54j20J39O4j98j02K81k22P6m2j78K31p2K29l7Jk17Q4l80L47Q9k9l15L58
$$ plain form
1411 5 216 -142 -22 -190 -16 136 71 -55 198 -81 16 303 -89 -139 2 -276 19 -200 -53 112 57 -101
1433 -101 -58 -55 -102 -117 -98 81 -1 44 -35 148 -213 207 41 69 -197 359 91 -28 170 4 -16 168 83 -165
1457 -165 20 219 -173 61 -253 -200 63 -50 106 -158 2 -122 -46 -252 -146 -232 -39 -251 222 95 112
1478 112 -247 -214 -16 35 26 18 5 235 -25 -6 -13 129 -188 -47 143 11 97 -99 -154 -1 276 48 214 -12
1502 -12 18 -10 -57 171 30 117 137 187 -61 -28 236 -279 204 53 -44 -33 8 -116 269 64 132 -353 57 102
1526 102 119 -175 82 -176 4 47 63 45 -222 384 -185 96 41 297 -227 -67 -74 148 -92 77 40 142 136
1549 136 -97 -46 19 181 165 -19 -15 151 54 -20 54 -1 -183 288 165 -68 143 37 -91 113 45 -12 -63 11
1573 11 165 45 184 248 50 -52 229 7 83 41 -137 94 22 251 214 215 -2 82 -298 49 138 109 -206 152
1597A52J65j91j92J68k12K43k10K9J10j6J23j84N6J16k74L24p9l17K07J06j46
1618b2j76R7P8K02k77J43k02J39R4o9p1j78L58m6p4J39j95J85Q0k66J21J93j36
1641A17K6l10L05p2k16Q9J47k56P7J28k13J88K8K3P3j97J43j31K05J7k67m1K28
1664I1l34K52l1K75l3q2j19l3k82L88lj03Ok23J52j96K90j13j53K27Q0k20K24
1687F0J07k45k4L13m4P3j94J19r2m14N21k07j6J30j91J19Q3j35M5O2Q7k70l2L02
1711A57k50O1pK31k71n9L28q1m21L11P4L8j79J39o0%M6j31n9J21K74m91J06J94
1735G1j94j01K59m0K7p3J94j54m2J10J82l68Qk1j54K52J25k26KM66l36J72j57
1758BQ1J26k54J61k48P9J66K26m00J75j62l0l7K91j12l1j07K69k92K37k4k38J66
$$ plain form
1597 152 317 126 -66 102 -110 133 -77 -48 62 46 169 -15 41 157 -117 207 128 -189 18 124 -22
1618 -22 -198 -101 -23 179 -98 45 -157 -18 76 7 -64 -242 116 70 -4 135 -60 125 205 -61 60 253 117
1641 117 143 -167 138 66 -150 -61 86 -170 -93 35 -178 10 38 61 134 -63 80 -51 154 171 -96 -137 91
1664 91 -243 9 -22 253 220 138 19 -14 -296 92 89 -14 -8 -231 -79 -275 15 -98 -251 -24 56 -164 60
1687 60 167 -78 -102 211 167 240 46 165 73 -341 180 -27 -43 87 -104 15 98 -37 8 70 157 -113 -145 157
1711 157 -93 -32 -39 192 -79 -138 190 109 -312 -1 73 111 -68 71 11 11 57 -74 -133 -12 262 -229 -123 71
1735 71 -123 -224 35 -5 22 -51 143 -11 -53 57 239 -129 -121 -142 -296 -44 81 -145 -143 323 -13 159 2
1758 2 83 209 -45 116 -132 -53 113 339 -61 114 -48 -78 -115 176 64 33 -74 195 -97 140 116 -122 44
1781D4N0O2l48M15p1j04j78K43p2pK72l71j98K81L3j63j67J99J56j11L02j20k59
1804a12J24J93k39j13J29R6j80J14J37l45J17K01k34L06j85J78n14L73j1j33J06
1825HP6J36j80p0j12J10l4l5K17j27L3k07j4J18O8Q1j49M2k5J68J0Rk12R3j4j09
1851a19j3J36r5J09j88M15k24M0K9n4q4R7P6k06P5J12k51K31K4J22k60n1L81m63
1875a61J90J71k24k29K63P8l09J44J23j01j61L00k50L52j45J4j79J83M3k10J6
1896i2l5K25l23K06J28J39j79j4nj71L35j31J63k57K44k51K44l2j18Q8k10o2j47
1919b55M37k24j1j8J33R3k66L15k49J28r3J98j42p4L98l22K05j02j09n0j9J18
1941I1m2l41M2K79l01K49P1r0p9J13n9L0K44k83j51J26K54k21K90j62J59k46K98
$$ plain form
1781 44 94 156 -192 223 152 48 -130 113 41 34 306 -65 -263 18 51 -112 -279 -80 76 -35 267 147 -112
1804 -112 12 205 -34 -147 -18 78 -102 12 149 -196 -79 122 -112 194 9 187 -327 46 35 -98 8
1825 8 84 220 40 -30 -142 -32 -66 -101 116 -11 22 -185 -199 -81 -13 68 -81 -39 -64 104 114 123 -89 4 -10 -119
1851 -119 -132 4 -91 18 -170 245 21 61 90 36 -48 49 125 -81 -6 106 -145 86 110 232 -28 -79 302 -161
1875 -161 29 200 -24 -253 10 88 -221 -77 46 -55 -216 84 -166 186 41 55 -124 59 102 -108 -92
1896 -92 -127 98 -225 -19 109 248 69 55 50 -121 214 83 246 -11 233 -18 226 194 76 164 -46 -108 -255
1919 -255 182 -42 -53 -71 62 155 -111 204 -45 83 -10 188 46 -28 370 48 253 151 42 -8 -27 91
1941 91 49 -292 -250 29 -272 -23 48 -42 -121 -8 -67 -37 207 -76 -227 -101 153 -68 222 60 219 -27 271
1964B71k20K5L8j44o3q1K20j20j78j26N05k89K08l2oo1N3J40k79K44l2R1k56L56
1988B64k74j23K98n6o3q3J92l16K21K05l03L3Q4m1o3K1P5j17N2L7J32o1k1O7k77
2013a17P0J5j30pJ56K99l23L9K68l22p6M13j55l60R9K92k65J04j03N7J43O1L7
2036A95j13k32J48mJ14Q5k85Q4j55rL36j44J37l44R4J10R8j09J14J6k95J60n2
2059e1J55k69r7L31Rk8j23L17m13K64k29l1J91l6J4n2K31l83J52R8k0M0j07J16
2083G9k4j78M5J00j30r3O2J38M0k7p9J4J62j83P1N8R5j36l6K35l69j7K77k27N5
2108f8J26K22k23r2n8m5J06N6J5j10L20m07O8j36K47j03N4l8r3k0J76j07j2k7
2132a49J63j19j2J34Q9k17K21J03r6L8k03L39m60P7J28l24L45k06K52k03L2K23
$$ plain form
1964 271 51 76 114 -30 -93 -174 46 -74 -252 -378 127 -162 46 14 8 -53 0 140 -139 105 73 164 -92 264
1988 264 -10 -133 165 109 46 -37 155 -161 60 265 -38 -5 79 38 -25 -4 71 -46 6 43 175 114 93 160 -117
2013 -117 -47 -32 -162 -169 -13 286 -37 2 270 -52 -128 285 130 -230 -131 161 -104 0 -103 -46 97 158 195
2036 195 82 -150 -2 -6 108 193 -92 -8 -163 -172 164 20 157 -187 -93 17 115 6 120 136 -159 1 -51
2059 -51 104 -165 -262 69 78 50 -73 244 -169 95 -134 -165 26 -10 4 -48 183 -200 -48 50 30 70 -37 79
2083 79 55 -123 -78 22 -108 -201 -139 -1 39 12 -67 -53 109 -74 -3 55 150 14 -22 213 -156 -173 104 -123 -68
2108 -68 58 280 57 -35 -93 -138 -32 24 39 -71 249 -158 -90 -226 21 -82 -28 -66 -159 -179 -3 -110 -122 -149
2132 -149 14 -105 -117 17 106 -111 110 213 117 155 -48 291 -169 -92 36 -288 57 -149 103 -100 -68 155
2154A55j87J9j07K19%j41J43n5J49k27k2j08J24N8Q2j07j78N8M6O5m6r3N5K34
2178A36k6k27L42k05Q4l18K61q8J23j68j33L04no3n5j41K15j93K18j61N2N8R0
2201A00LJ03j20o5K2j64K83j69j77J02N1J02j09J31n3o0RO3O9J09j10k22n9J48
2225a3O4j6M7O8j3k53K34j74O4l5p0J21j19p6K81nj74l5K7K16k01o9K09j49K9
2250d2J42k38N5P7k0J5j7N0Rj83K72l07K77k09P5K27l16m9K85j97J88Mr1l0R4
2275G1r8j24M04j35Q7j19j90K04J00j28L2j75K52j43k03M09l17j80K04P9pJ46
2297A69K44m14j67j56K31J94l8Jq3R6l0k4n2N7j61K66l23K29kj9m3J97j35m5R9
2322I1j26L0K7Ro8K35j73k38K58J77J3k31r7j0J01j74M82l84J79J28j89r0RJ88
$$ plain form
2154 155 -32 -13 -120 99 99 -42 101 46 195 -32 -54 -162 -38 20 102 -5 -183 -125 -79 -14 -60 -153 -98 136
2178 136 110 -117 225 20 104 -214 47 -41 82 -86 -219 85 80 17 -38 -179 36 -157 61 -100 -48 10 100
2201 100 103 206 86 21 43 -121 162 -7 -184 -82 -31 71 -38 93 40 -20 -11 52 121 230 120 -102 -161 -13
2225 -13 51 35 82 150 137 -116 118 -56 8 -27 -97 24 -95 -171 110 105 -69 -104 -77 139 -62 -131 78 -71 -42
2250 -42 100 -138 -83 -6 -26 -11 -28 22 31 -152 120 -187 90 -119 -44 183 -133 -182 103 -94 94 98 7 -23 71
2275 71 -27 -151 253 118 205 86 -104 100 200 72 104 -71 181 38 -165 244 -73 -253 -49 30 23 169
2297 169 413 -1 -168 -324 -93 101 63 64 -19 77 47 23 -29 28 -133 133 -190 39 37 18 -25 172 37 -8 91
2322 91 -35 -5 22 31 -37 198 25 -213 45 222 235 4 -93 -103 -2 -176 306 -78 101 229 40 -50 -41 147
2346A47j33r2J48r3J3J43j8j60J49j11N2n9j2q4J26l0p5M7K0P9j7k96M61k19j21
2371a35J89L7k05r6K30L5n1j87L10j86J71k59J75l06L33q4m7K47J1q3j65R3r3
2394f6R4k22M42k92P6k42L9J27K7J57j43J25j62K66n64K59J89r6q2p0L69l04L02
2417B29j72J25mn8j61K14J03j82q6L19j81j09l6J95j47j72oJ91j65O2j3K49k36
2440d1O5j64L50j83J41k97K6K81k54j6k9K20j59J88j11j20K40j23Ll3R6M8l3R7
2464A92j53k7k3M00m78L6j09R6o5M7J47k32N7M3K34p9j09j91K06k14K91k42J82
2487IO0J23k72L28n18K43R7j2k4M7j15j31K24j2N8k5j73J00K08j78p5L8p6L5o2
2512a03J32pMj4J69j20mM5J1l88J95J18J20j59N8k47J62N4j60K16k22K66q9k14
$$ plain form
2346 147 14 -78 70 -23 -10 133 115 -45 104 -7 45 -14 -26 -110 16 -14 -89 -42 -22 57 40 -256 205 -14 -135
2371 -135 54 91 -114 -210 20 55 4 -183 127 -59 112 -147 28 -278 55 -29 -76 171 182 99 -66 27 -66
2394 -66 28 -194 248 -44 32 -210 -171 -44 -17 140 -3 122 -40 226 -338 -79 110 14 -68 -138 231 -73 229
2417 229 57 182 178 120 -41 173 276 94 8 327 146 37 1 196 49 -123 -129 62 -103 -41 -54 195 -41
2440 -41 24 -140 210 27 168 -129 -103 178 -76 -92 -121 99 -60 128 17 -103 137 14 17 -16 80 128 95 192
2464 192 39 12 -11 389 -89 -53 -162 -66 -131 -84 63 -169 -112 -69 165 86 -23 -214 -8 -222 69 -173 9
2487 9 69 192 -80 248 -270 -27 70 58 34 81 -34 -165 59 47 105 80 -93 7 215 37 -38 0 -76 -41 -103
2512 -103 29 22 26 12 181 61 57 102 113 -275 -80 38 158 -1 57 -190 -28 26 -134 82 -140 126 37 -177
2536a77M2M8J36R7k70L17r8j33L3J70j86Q4Rj77K08j87J41p6j50O7K08o2k90J85
2560f1J99j95K18l23K10O3j86q2L10j83N8j89L19Kk62j06J26M9n2Q8M3J09k57
2583a02J25j28K81m10P3K17J61k87o5P8n2L61k88k26K35m6J31J21j66k10jK31
2605C3P8j57J53j50q5J35K05j9j20r2Q4k49J83j32L58j90J6p6K81k92k6Q4k75
2628b53K61J40j07p9R3j9Q4Q7j42KQ7j79k16L30j6O5j08L09k96r5R0q7q4K7j43
2653b49N77k01J07j76j72r4K15Q8j42J48k69N3L3J46Kj32jJ97m6k25n9J79j58
2676a79M2K04RJ72j77j21K4Q4j03M4j25P5J09o1J5j00L30j53j03K57j42k4mj29
2700e6J74j78J65K3qj27J67j28jj86L0r2K10L14k23J39l10n0p9K12r7RJ39j70
$$ plain form
2536 -177 -135 -87 49 146 -124 193 95 -38 -5 165 -21 63 72 -105 103 -84 57 -19 -169 -102 106 44 -246 -61
2560 -61 138 -57 161 -162 48 111 -75 -157 153 -30 28 -161 158 160 -102 -208 -82 -33 -85 3 46 155 -102
2583 -102 23 -105 176 -234 -161 56 217 -70 -135 -57 -109 252 -36 -262 -27 -73 58 179 13 -197 -198 33
2605 33 111 -46 107 -43 -128 7 212 193 73 -19 65 -184 -1 -133 225 35 51 -25 256 -36 -62 22 -253
2628 -253 8 148 41 -38 55 36 120 207 65 67 154 -25 -241 89 73 138 30 339 43 -52 38 -49 -133 -106 -249
2653 -249 328 127 234 58 -114 -208 7 95 -47 101 -168 -115 -82 64 66 -66 -67 130 84 -141 -200 -21 -179
2676 -179 -137 67 76 248 71 -50 -26 58 -45 -1 -126 -51 58 -3 12 -88 242 89 -14 243 101 77 73 -56
2700 -56 118 -60 105 128 120 -7 160 32 31 -155 -125 -217 -7 307 84 223 -87 -137 -216 -4 -101 -92 47 -123
2724a23K10j60j1R8k16K93q6n3q9J80m5K39j72j24J60O9j7k72K05m4N6j02N3q6
2748c7LK70k61J70j04K7l64L50j86Q0J81k76J36J44j2k40J28Q3k3j67L03j29o2
2771A4j7nJ93k11Q5l9K5R9k49J32J9j26m8O4O3N2j2M8j99Q3Q0M5O5l23M58m32
2797a36K82j10J52k88o8K8M7Pj3j88K67n4J78k51R6j3k51J74p4K39K3RN3m1j08
2822d0J16j73K29q8k45L29l53K67N3j88K13j63j43J50k54M53j46m2R5k27K25j7
2844E1j5K5O3k20M5Q0M8k09J81q1N7r3K42j01r5oj07l1J62j44L64k54J28l3L4
2869I1J06mj99k40K60L1j04J24M7M3j79p5LJ2Q0K25k80K67k27k22J74J8R3o9j61
2894a86K03Q5k34L68j60J07k67J85l34K88l17P8K69l06K09k3J05r7K91k20r1j33
$$ plain form
2724 -123 87 -73 -84 14 -202 91 5 -48 -137 43 -2 237 65 -59 101 170 153 -119 86 42 98 -4 49 -37
2748 -37 -34 236 -25 145 41 68 -296 54 -132 -52 129 -147 -11 133 121 -119 9 92 69 -98 205 76 14
2771 14 -3 -8 185 -26 59 20 45 144 -105 27 46 -80 -128 -64 -1 51 39 87 -112 -29 51 96 161 -162 296 -136
2797 -136 146 36 188 -100 -168 -140 -93 -86 -99 -287 -20 -74 104 -147 -51 -64 -315 -141 -215 24 47 56 109 68 -40
2822 -40 76 -97 132 44 -201 128 -225 42 95 -93 120 -43 -186 -36 -290 163 17 -25 70 -157 68 51
2844 51 36 61 124 -96 -51 29 77 -132 49 -32 25 -68 174 73 -22 -28 -135 -166 -4 -148 216 -38 90 57 91
2869 91 197 193 -6 -246 14 45 -59 65 112 155 -24 -99 -96 -84 -4 221 -59 208 -19 -241 -67 -49 44 -25 -186
2894 -186 17 102 -132 236 76 183 -84 101 -233 55 -262 -184 85 -221 -12 -35 70 -27 264 44 -47 -180
2916a80O7K27lj33Q7P8j52n5O1k3j16n9L21K0j62J17j92K1k07K78J74N4k87Q0
2940A6K78l94J79n2J5J61j66O9n3j59J7J62j00K0j65K54k73L35k83J16k1J48o5
2963C9Q1r5q8R0J16l65L90P4j71L0j67K84m22L38k04O3j11J85O8k14L59k50j31
2986a01oR6J96q1j87J61p7J90qk69J09O5k17K41r1j79l7J74p4N0L32j65j11o1
3010e0J44k15k2QjK25p4o9M4J0k05M27k84J18L6k83K58j02m5NJ57k10J01J12K1
3035A06J3k28M3J43r1l00L17q4O5K3j59rJ34J65p2l78J77L23j92J20j23J76m01
3058b32K88J03j56Q0J04j81NJ4M3P2J31m77L63p5j38p0p0k9L42j80J39k88J22
3081i0J43J1qj14O4J66m59K80r7R2J95j49lo0L1k11K50Ol4k4Q9k25K26Rj02J74
$$ plain form
2916 -180 -113 114 111 -22 65 143 -9 -64 -3 -26 -142 -201 120 140 -22 95 -97 -76 -283 -5 169 223 -64 16
2940 16 294 -100 79 27 42 203 37 106 53 -106 -89 73 -27 -7 -172 82 -191 144 -139 -23 -44 104 39
2963 39 120 25 -63 27 143 -222 168 242 71 101 -66 218 -204 134 -70 -7 -118 67 135 -79 280 30 -101
2986 -101 -107 -11 185 104 -83 78 1 191 183 -86 23 88 -129 112 21 -158 -195 -21 -95 -45 287 122 11 -50
3010 -50 94 -121 -143 -135 -136 89 15 -54 -10 0 -205 222 -62 56 92 -191 67 -35 -80 -75 82 -128 -27 85 106
3035 106 119 -109 -66 77 -14 -314 3 -81 -16 7 -152 -161 -27 138 66 -312 -135 188 -4 116 -7 169 -232
3058 -232 56 159 3 83 187 6 11 25 68 140 271 -206 157 82 -56 -126 -196 -225 117 -63 76 -212 -90
3081 -90 53 64 56 -58 6 172 -287 -7 -104 -12 183 34 31 -29 2 -209 41 47 13 -11 78 -147 79 88 -14 160
3107A60k1m6j08J9K9j39K64P8j87Q0M9j03k29R9K0J64q7j10K7n1J07k59Q5J82
3131B3k35L02p2K8m1P3k07J33P8j61J75K29k46J01PLk41J84j58r5O4J00K27l08
3155c7m6OJ91j91P8l14K11J03J31j63N4M6L0r9j99J01K35k48J61m6k26Q8K50J9
3179A35j06l0K15j40p7J00p0L3j25l8Q1k7j10J28L30m10J74M5j37J65n8M3j70
3202d9l0P9O4j16J0j66L99j62r7k0L0K23j99o2L0O8K4j97P8K6K40k89O4K1J47
3227A16o2J97l52K96r3k04LK50q0N2n5J26j14n0Oj01N1MP0j80J2n0J44l0j8J23
3253F1J10j43q7J21l5PJ0j40Q6L3J46j28QM5J29k4l55N1J35N7rM6j05K2J95Lk02
3280C7J3nk43Q8m5J48n1J73l32J99J25k12J61P6j52Q5Q0l3k08J45Q2Q2l74K3J85
$$ plain form
3107 160 139 93 -15 4 33 -106 158 236 49 129 178 75 -154 -55 -35 129 42 -68 -41 -92 15 -244 -159 23
3131 23 -212 90 18 46 5 78 -129 4 82 -79 96 325 79 180 187 190 -51 133 -25 -120 -56 44 271 -37
3155 -37 -83 -77 114 -77 1 -313 -102 1 132 -31 23 69 99 0 -199 -98 137 -111 50 4 -222 -134 116 135
3179 135 29 -1 214 74 -3 97 27 60 -65 -103 -22 -49 -159 -31 299 -111 63 108 -29 136 78 121 -49
3202 -49 -79 0 64 -52 -42 -208 191 29 -68 -88 -58 165 -34 -96 -66 2 26 -171 -93 -67 173 -116 -52 -31 116
3227 116 54 251 -101 195 102 -102 -99 151 71 123 68 194 80 30 36 -65 -14 -10 60 -120 -108 -158 -14 -44 -62 61
3253 61 171 28 -59 62 27 34 44 -96 -10 23 169 41 49 94 223 199 -156 -105 30 87 78 124 19 41 236 239 37
3280 37 50 45 -198 -110 -155 -7 -58 115 -217 -18 107 -105 56 132 -20 65 145 112 -96 49 131 213 -161 -138 47
3305D7j71J50R8L2j48N8J00k22j00J64nr7M2mJ9k6R3o8J75J46l60N3K33j93j83
3330a67%j63M33k13K04j56J76j40J48j89N2r4j6J65O5j95l7O7J04l90K34J02J87
3353A77r9j21J53j15j7Q2p6j79J49N0L1P5ok81J89q6qK03p5J51k16Q1k7K7k37
3378a75K69J24j84j95J50K88l76L30k31q7k00M46Ko1j88J90l42L13k2k8l1K64
3400B56j62L7l6k59K81l31K84j84K32k0l08l7J97N4K42p4j77kJ63l01N8k7J46
3423C2j6j99M13k56R1K37j21M9l79MpR5M7j69M53n47K74L0Q1k22J70R6l31K5J61
3448A1K8k32K63M4p8j72K13l7Q2RP9k62K8K33O2J8k71K31j57j37N6mj91K56j15
3473d3J8L7k7P2qp8N0p9K6q6q4J33m2k9p1J35M1K6mj96L08nk84J86j44M22l91
$$ plain form
3305 47 -124 26 124 156 8 66 166 -56 -156 8 3 -94 -52 -56 -37 -63 30 -38 137 283 -77 -24 209 16 -167
3330 -167 -167 -330 103 -110 94 -62 114 -26 122 -67 -15 -109 -125 40 105 -90 -127 -60 44 -346 -112 -10 177
3353 177 78 -43 110 -5 -22 60 -16 -195 -46 4 35 110 104 -177 12 -74 -82 121 46 197 -19 62 35 62 -175
3378 -175 94 218 34 -161 -11 277 -99 231 0 -87 -287 159 161 100 -88 102 -240 73 51 23 -8 256
3400 256 94 131 95 -164 117 -214 70 -114 118 98 -210 -247 -50 4 246 172 -5 -7 156 -145 -87 -114 32
3423 32 16 -183 230 -26 65 302 181 230 -149 -145 -152 -57 -10 -179 274 -273 1 31 112 -110 60 156 -175 -150 11
3448 11 39 -193 70 114 36 -136 77 40 122 131 210 -52 -24 209 271 289 18 249 92 -45 11 7 -184 72 -43
3473 -43 -25 12 -15 57 49 -29 21 -58 -32 -118 -202 -69 -111 -140 -211 -76 -35 -9 -13 -209 99 94 -190 -4 -148 274 -117
3500a17J25K83l52j0L04k03J33l67n6K23J67l15K55j55J22J49k18J26q9J64j59
3521A0p1J7J12r0K28q3p1l4P1q6J23l04L1K83k25J22J65k53k0K41l44K35j12Q1
3545B6j38K67J7k96j8R5p7J35N6p8J39j41J44l62J08K53O8r7q1jL2l95N34j13
3569G7j69P5k03J65Q8j56k4J89j36N5r8J64J59k27J37j14R2j13M7O2r7j88L21
3592A06P3qo3n3r6J63j17J52p1j77J76o4l8R1j74r3J5J55r2K4Q4J49j19P7j65
3617f5j83Q5L68j52M2l5j54O4O3r4k35L73M1j6k98J91r2K22p3m1k6q7J06j74L66
3642A96k87j44K32L24m12J74k04K19R4m68J18P3L9Q1N4j48n4Q4J72k50j20K17
3664a0m8J49r1j8rJ29J8l3q9o3o5J94J35q9J8m0k71j8K70j15k6L25l22J58k70
$$ plain form
3500 -117 8 291 -61 -71 233 30 163 -204 -260 -37 130 -185 70 -85 37 186 -32 94 5 169 10
3521 10 -61 -44 68 -22 206 123 52 18 89 3 126 -178 -147 136 -89 33 198 -55 -75 166 -178 57 -55 26
3545 26 -112 155 172 -124 -142 -47 -124 11 67 -11 128 -13 131 -231 -123 130 198 101 20 19 51 -344 190 77
3569 77 -92 -17 -220 -55 33 -123 -147 42 -94 -39 -137 27 186 -41 96 -18 74 -39 8 70 -27 -215 106
3592 106 179 171 108 55 -41 122 5 157 86 -91 85 21 -17 74 -100 -193 -178 -23 -115 -91 -7 142 23 100 -65
3617 -65 -248 -163 205 53 95 60 -94 -30 33 -61 -296 77 118 102 -196 -5 -97 125 52 11 -15 -102 4 -170 196
3642 196 -91 -235 -3 321 -91 83 -121 98 192 -276 -158 -85 -46 35 89 -59 -113 -29 143 -107 -227 -10
3664 -10 -58 91 0 -18 -27 102 120 87 -2 -65 -130 64 199 110 128 88 -183 -201 69 -46 -72 253 -69 89 -181
3689a81m7K80on5Q6m5J2R7l52J95J49l01K03n0j5j19j1J09q5J44Q1j33r7N4O1
3714b6M2q1J60j45j32J38J31k50P7J46p2j51m9K43j32K01qJ24k75P4Qj3J11l6
3738H5J3n4n4k5R2pM4j30j9L63j17l05L23k90N6k9j14K59j65k8P3K20Qk11M9L8
3764G5m4q0n6L49k91L2J20k10K72l0J23k02l5k6R6J36l15O1n6J06p0K08k64j4
3788a15J24j46K20q1J85l38O6L02k58K05j93J4m9R2J47j70Q2q4k69K74J59j74
3810gJ9J53o7k4j60MJ86j87Q9Mpj23K15j95J09o7J6J28j40P1n1J46j29M7J44k31
3836e7k42L51jo3k40L73M5l29n2J71J11p9Lk20K29J08J5j07K1QQ3k27M08m26K46
3861A29j73q8K88n5k12Pq6P6j32L36J73L8k83k7l1j44O3Q6j02O5j20J88J50k01
$$ plain form
3689 -181 -228 52 46 -9 77 32 44 141 -211 -16 133 -168 35 -15 -30 -149 -160 -51 -136 8 89 -44 -141 -87 -26
3714 -26 16 -65 95 -50 -182 -44 87 -163 -86 60 -12 -163 -212 31 -101 100 92 216 -59 15 23 10 121 85
3738 85 98 44 -10 -35 57 50 94 -36 -55 308 191 -114 209 -81 -25 -54 -168 91 -74 -102 -29 191 199 -12 37 75
3764 75 31 -49 -105 244 -47 -15 105 -105 167 137 260 58 23 -3 93 229 -86 -25 -81 25 -45 163 -101 -115
3788 -115 9 -137 83 2 187 -151 -85 217 -41 164 -29 -15 -64 28 175 5 87 3 -266 8 167 -7
3810 -7 12 165 98 74 -86 -82 104 -83 6 10 3 -120 95 -100 9 -58 -42 86 -54 17 -34 112 -17 30 174 -57
3836 -57 -299 52 51 -12 -252 121 166 -163 -215 -44 67 -12 -9 -229 0 108 123 16 37 45 128 -99 309 -117 129
3861 129 -44 -132 156 101 -111 -104 -190 -114 -246 90 263 301 18 -9 -40 -184 -121 -35 -137 -72 -192 -4 146 -55
3885e5j56K36J34k49QK18j38Mr2J21J89p8j60j13M47l21L5j10P9K7L0j32J68m2
3909E0Q3k42o6k2J57j4L97m30J64N1k62J10r6P8n9L32k83j08Q4K35m1n8q7R7l4
3934C6j95KK49O5l79J65n0J17k75L37j39J72j48l00J95J0M83l81l9J57k85K57
3956E4o3k15R3n2R3L3K72m08J45NK7j36J51J10o2j15N4k51K08l8K35nl4mJ7j16
3982bm1J29K8n2M5j48J82k22K4o2R8k18K19n6J36k26J73J01j88J54l3O7l7j17
4006d6J47k10K91j80j61O5J40o8j65K68k37n6L58l02P2o3J13k8K44k26m7J99M3
4029A51m75K52Q4j72k8J36q7J51r5J10J14qk68l9K21q9L16m96K42j3j07J53L7
4052I0P7l79K39q2J36j25j17O4RJ10l6l8K62k64O7R1k06J91k4N4j53j36L14j50
$$ plain form
3885 -55 -211 25 159 -90 -82 136 -2 2 -90 31 220 142 -18 -131 316 -5 30 -80 -1 26 56 -76 92 50
3909 50 133 -109 -175 -197 -40 -54 343 -87 77 128 -134 -24 -120 -42 -101 231 -52 -160 -76 159 118 60 -27 70 36
3934 36 -159 -157 92 157 -222 -57 -107 10 -265 72 -67 105 -43 -343 -148 -138 345 -36 -75 82 -203 54
3956 54 -9 -224 -131 -183 -90 -57 215 -193 -48 -43 -16 -152 -1 109 47 -68 -14 -265 -57 -95 140 135 101 97 114 -2
3982 -2 -43 86 114 62 107 -41 141 -81 -57 -119 -21 -239 -20 -76 60 -166 7 108 -80 74 41 108 71 -46
4006 -46 101 -109 182 2 -159 -94 46 -22 -187 81 -156 -212 146 -156 -84 -147 -34 -62 182 -44 -91 108 151
4029 151 -324 -72 12 -160 -188 -52 -139 12 -83 27 141 133 -135 -174 47 -42 274 -222 20 7 -100 53 90
4052 90 167 -212 27 -55 81 -44 -161 -97 -88 22 -14 -52 210 -54 13 104 -102 89 65 119 -34 -170 144 -6
4076fj63K01q7k4K49j03k49K06N3n6M3j93K5J29P1j49K9k43L19j35l7K66j31O6
4100H1j01ooQ6j03P0k01J03m7K54k2k56J32K1q7P2j79J86Q7K1j59J18J0K6p0P5
4126A05l8L1O5j22J9j75K51l4j07K4p7J91l02K16J8n5J58j76Q6J63k45J53q2j41
4150g4R0M7L7k61J44PN0K22l04N0Q2j45l8J43p9J04j42J6K03k50J24J34j10J5
4174F5p5J14Ro7K9K20m05M1jp4O9P9j03k47L06l01K90J35k06J88j62J8L9M8J06
4199A15j99L7L67m33O0O4P5o1J0O1k91n3N50p5j34j5n4J66k68j63Q2P4M1J43j8
4224H1k1q4J61r4n5r5J90k69L25k64N0J23l31J09R9K71p4j58M3O9j43j39L43j7
4248A20r5L4q4KJ40j9j74K0J49n9J60l09J96K43k38N4p5j49N5J55nk15J02q6Q8
$$ plain form
4076 -6 -169 32 -55 -79 170 67 -182 24 77 21 64 -129 -104 25 96 -53 -24 -267 52 -83 -120 146 15 81
4100 81 -20 -26 -32 54 -49 21 -180 -77 -124 130 108 -148 -16 5 -82 -10 -189 -3 84 105 -54 64 74 100 30 105
4126 105 67 98 163 41 60 -115 136 102 -5 19 -58 133 -169 47 65 10 168 -8 78 241 -4 149 67 -74
4150 -74 16 63 100 -161 -17 -10 40 262 -42 8 90 -55 -93 50 -29 75 -67 -51 152 -98 26 160 50 65
4174 65 -10 104 113 46 75 295 -110 -69 -70 -144 -75 4 -99 -346 -40 -341 -51 84 -122 66 -96 -78 -39 9 115
4199 115 -84 -47 320 -113 -53 11 86 25 35 96 -195 -248 302 227 93 78 24 190 -78 -241 -159 -85 -44 99 81
4224 81 60 -24 137 43 -12 -107 83 -186 139 -125 -75 48 -283 -174 -75 196 122 -36 7 76 -67 -206 137 120
4248 120 25 59 -25 -23 117 98 -76 -56 93 34 194 -115 81 324 86 140 65 -84 -29 126 121 -94 8 -78 10
4273A0j3J76J10l88R5j93%J78r7K55J7q2k08M9M99m67K20j18k10J69K55l65K19
4296A11r1R9M6r2L5j84J78j19o3LK60j45J14m0P0l29L45k01Mj26J25p7Q0J1j1
4321CK22j51k72K87j55j23K6K47J05o6J20k50r8K36j66q3J67l8r8p4J0q8K67k10
4345a82K33j33K54k56J12j35j00L01k34R5o5P4j55K53j06R3l1J29o8k41L27o3
4367A02Qj54L35m97J98%J86o1k63L67k88K44p5k48q4K81l02L58l42K79J11q1K
4390G6r8j76J31J57K0l88J32R6J50j68L44k14q3L5j95K26j39M4J60m1NM17l80
4413A11j41r9J75J06j31l10L00j3j52J32p8j8M6j10J76K7k55M8L23j62n6J64j15
4436c2k15J70J06j18J45q3Jk0J28J47l30M5j42K52o1lk3L7p0J33j83L38k59J06
$$ plain form
4273 10 -3 173 283 -105 -10 -203 -203 -25 -122 133 150 68 -140 -91 408 -59 161 43 -167 2 257 -108 111
4296 111 20 119 165 73 108 -76 102 -17 -80 -77 183 38 152 112 182 -147 198 -3 1 -125 0 -77 3 14 3
4321 3 225 74 -198 89 -66 -189 -163 84 189 123 243 -7 -105 131 -35 -118 49 11 -87 -161 -151 -239 28 -182
4345 -182 51 -82 172 -84 28 -107 -207 94 -140 -45 -110 -36 -191 62 -44 49 18 147 79 -162 165 102
4367 102 110 -44 291 -206 -8 -8 178 117 -146 221 -67 177 102 -146 -230 51 -251 107 -235 44 155 74 76
4390 76 -22 -198 -67 90 110 -278 -146 -50 100 -68 276 62 -21 14 -181 45 -94 -50 110 69 74 491 111
4413 111 -30 -129 46 152 21 -289 11 -2 -154 -22 -100 -118 -72 -182 -6 21 -234 -186 137 -25 -81 83 -32
4436 -32 -247 -77 29 -89 56 -27 -26 -46 82 229 -101 -56 -198 54 -7 -10 -33 4 -66 67 -116 222 -37 69
4460F9j27j47L30k52j18L08j2j81O5K73qk28j07j68L02k75M80k68k37R5M8K25
4482F7q3J40KM8j88k19K73J96k87J5J76m7K13k83j13J5L68l23l4R6J19m0l14Q9
4506a14J0J45Q9j83K74k43m9J16j06M3J3M3k5K32l18K37j99o0k2qK05m3j39L58
4530B56j04j04R1l49L69j64j44J32LN7m8n3J08J4p3J77o7j28p2J4J61k58K23n7
4554a6k24L56j96J84m9J73k53J77k04K9J01j10J13k68J07J06o3J79l23L22L1n11
4576c39M18l36K27P1n1k05K39j66J03J19k23K90l1j47O7m5j78L11j02J09J82l32
4598a9J06j65J35j32J67j17K74k13O4j40k57L48k53K02K10k86M8J13k48J65k48
4619b46M51n7M6j19k63J12J61k32J44j61J39J7k11L29k62q0L14j2m9r3J44O3j52
$$ plain form
4460 69 -58 -205 125 -127 -245 63 51 -130 -65 208 200 -28 -135 -303 -1 -276 204 -64 -301 -206 -158 67
4482 67 -16 124 126 174 -14 -233 40 236 -51 -36 140 93 306 23 -90 -75 293 -30 -64 32 151 111 -203 -114
4506 -114 -104 41 130 -53 221 -22 -71 45 -61 -18 -5 38 13 245 -73 164 -35 -95 -117 -125 80 37 -102 256
4530 256 152 48 139 -210 159 -5 -149 -17 -14 43 -5 -58 50 64 -9 168 101 -27 -99 -85 76 -182 41 -16
4554 -16 -240 116 -80 104 55 228 -25 152 -52 -23 78 -32 81 -187 -80 26 -37 142 -181 141 172 -339
4576 -339 79 -257 -30 41 -10 -215 24 -142 -39 80 -143 147 116 -31 36 -9 -187 124 22 131 313 -19
4598 -19 87 -78 57 -75 92 -25 249 36 100 -40 -297 51 -202 0 210 -76 -28 85 -163 2 -246
4619 -246 205 148 194 75 -188 -76 85 -147 -3 -164 -25 -8 -219 110 -152 -232 82 70 21 -72 72 135 -17
4642a7Q6m7J18j48o5o6J16ON4J31m39J77L6J90k11q7m0J00p5l0K70mj46J70Qj70
4668h3J20Ll74L3K13j93L26q7J93k20J57k13l0M25k78Nj00L08m53K49k2k0J91
4691A50k29P3k9k22M11j8k29j4L3J25Ok28K29n0j13n9K38J69l73J15K00k03j8
4714c6K50k49L6m4p2M8J63j40J75r5L6j96M0Q1R0L5q6L3N1j5J1o2j52N4qj84L58
4741A22n9j06P2k95J89L65n13K24nO1j74J11N5r0J25j15M8R7j85j65L81k2j83
4764f2lJ74j05J91j52M8k52K84k64J98j04J71j53N0L3k30J76q8P3N2P4k35K08
4787H4N1J7j33j54m1K75m24L74j97K01k29M8L4j11M22l55l0K54j39K1L2K27j64
4810F3J13k96K03j16o7P1K23k98k4J1L1J49m38L12k68K27J23j47R7M5k2j71J86
$$ plain form
4642 -17 69 22 140 -8 -73 -139 -23 -17 37 168 -271 -94 -58 132 -79 -166 -206 -106 -181 -211 59 55 -91 79 87 -83
4668 -83 37 40 -334 -301 -88 -281 45 -42 151 -69 88 -125 -155 270 -8 -3 -103 205 -248 1 -21 -41 150
4691 150 -79 -6 -35 -257 154 136 -93 -107 -74 51 57 -171 58 8 -105 -164 74 243 -130 -15 185 -18 -36
4714 -36 214 -35 1 -43 -115 -67 96 -44 131 36 72 -124 -84 -3 87 122 36 69 120 105 116 54 -98 -44 -52 -236 122
4741 122 63 -43 29 -266 -77 288 -225 -1 -6 55 -119 -8 47 -43 82 -33 15 112 -73 -238 143 121 -62
4764 -62 -65 109 4 195 43 91 -161 123 -141 57 -47 124 -29 21 54 -176 0 -88 -15 37 111 -124 84
4787 84 135 152 19 -135 -176 99 -325 49 -148 53 -176 -128 -94 -205 217 -138 -168 86 -53 -32 0 227 63
4810 63 176 -120 83 -33 -100 -29 194 -104 -128 -117 -86 63 -375 -63 -331 -104 19 -128 -31 14 -8 -179 7
4833GN1l3K62n94JK99J93l73KO0K44j91K68k32j38K51j17J99j22j9O7k52O8J37
4857C8J20l1k50K59o9O4k20l7N0P4r6L9O6J26k86J52r9N4k6M5J34j55r2OP3Q2
4883B1L0j28Q0j35J34p6J40j17K13n4L7k13R0K3J83k83qk32J65q6K99k8j64J22
4907A3q7O5J50k04J89j66J34r6P4O0j57J55O8m54m8L75J60j74P3o6Oj58L38m24
4931a74J58K11n2j70j11Q6J18j21N3K20o39K51M0J30r4J51j9K03k28J74pk08K8
4954@P7j2j02k9j52K03J4K25k06K7K5j36K95j52J94j81J9j26M9J20o6Lr7J65k33
4979g6L15k25j87L67j29j34J55j37J77q8k5k06J87k02L42o0l5K7j76L9J70k71
5001a72MQ8J35J33l09J93j45K35j0j09Oj41q9k7K60j97K68j12j51K31j18J07k2
$$ plain form
4833 7 58 25 287 -307 -306 -7 186 -187 -185 -125 119 -72 196 -36 -174 77 -40 159 37 18 85 -167 -99 38
4857 38 158 127 -123 136 67 131 -89 -126 -76 -2 -98 -59 7 133 -153 -1 -100 -46 -72 -27 107 -48 -140 -134 -61 21
4883 21 51 -77 3 -132 2 -74 66 -51 162 108 145 -68 22 45 228 -55 -63 -295 -130 -216 83 55 -109 13
4907 13 -74 -9 141 -63 126 -40 94 -2 72 132 -25 130 198 -256 -304 71 231 57 130 64 70 -88 250 -174
4931 -174 -16 195 143 -27 -138 -52 66 -55 -2 218 -421 -170 -130 0 -94 57 38 241 13 187 180 -28 0
4954 0 77 65 -37 -66 -218 -15 -1 224 18 45 70 -66 229 77 271 90 109 -17 32 152 86 89 -8 157 -76
4979 -76 239 14 -173 194 65 -69 86 -51 126 38 13 -193 -6 -208 134 74 39 66 -110 -71 99 -172
5001 -172 -168 -80 55 188 -121 72 -73 162 152 43 49 -92 -181 -208 52 -145 123 11 -140 91 -27 80 58
5024E8j46P6l0j40J65K05j46r1K79j02l84L27P5J03l95K48r1J03K7o4p6O8P1k03
5048f3J97j05J9M9l54L6J58N9lJ9J55l89L71j63j68J42J22k0k11O1j11M48j68
5071H1j85K58j06qr1K7K04k54j06J17p6N5K01o9j12o6J7J82j35P6j44r2P9N24
5095C77k69p9k32K39j44pK97k55p0J20j57K20K56l02knp5K72k71K06p0j5J11k87
5119a42j60L92r7j25L60q7k49oJ30l5j14J47m7K47k61O8K6mk6q7J12k35R5J68
5143G0P0k97Q3P9j02L1m3J79j79K59j72L0j5l14L06J98k77j03M91k71Q0K5j64
5166c6J41j20Q3K14l35K4j29K13p4L4oj37J72J48k23K01k93K60r7l5k63K04J37
5189H3j2K2J3j10n3L21j39j79K08J8l15J5J78j88k7K5LP6J81k64K56R0j63j4j44
$$ plain form
5024 58 -88 -12 -42 -182 -17 188 42 -49 230 128 -256 71 146 249 -146 102 11 114 141 77 1 69 140 -63
5048 -63 134 29 48 97 -257 -221 -63 -4 -7 12 167 -222 149 -14 -182 -40 82 62 -149 -88 -199 249 81
5071 81 -104 154 48 40 -51 -24 180 -74 -180 -63 -139 -84 117 48 -64 -130 -113 69 -66 10 -134 -226 -147 377
5095 377 108 29 -203 36 -108 -115 182 -73 -143 -23 -180 40 296 -6 -8 -13 -88 184 -87 119 49 34 145 -142
5119 -142 -302 90 -7 -132 228 141 -108 -114 16 -19 -133 14 -33 214 -47 21 47 43 17 -70 42 -193 -98 70
5143 70 140 -157 -74 5 -97 -66 -109 70 -109 150 -22 8 -7 -321 -15 183 -94 -197 294 23 103 128 -36
5166 -36 105 -15 68 282 -53 -29 -158 55 -19 15 9 -128 44 192 -31 170 -123 137 40 5 -258 -54 83
5189 83 71 93 106 -4 -57 264 125 -54 154 172 -143 -128 50 -138 -165 -140 -137 -61 120 -144 112 202 39 25 -119
5214a19J84j89Q4j2j84K41J87k3j58R7q5j16Ln6J59Qk6j82L54j33j17n7J96p1
5238a5J26Q1k70Q8J3M1L8j9j27J12j54K30J36j98j88RJ75k42K09p6k91L62N8N9
5262A57Q5k50l2Q0k69K72L7P2J41k40k00q6J63L8J41J30k04O2k01O8J3j35J26
5285c2r2L47m37J57K04j57jM3J54j98j04J7K62o4k39JK85k84J31k48J28pK59r0
5309C5q7Q0r5mJ57oj94M5J43L1p1P9q4m0J45J0N4m33M25l27J53j10K57m20K02
5334e5J57j24l0K68L9m09r9K30M8j31O7J0j4J91k15nN3q5P3j38J30J24j39r8L07
5359A55k16Q7k73K70o9J63o8k98K74j09N4j50K66j37n9L25j30j32J47p6j71J73
5381B6p8k9K64j85L1m8j7r3J57J47j21j90K94o0n5j93M28l99L10n9j34j11Q1J62
$$ plain form
5214 -119 65 -124 -40 -52 -236 5 192 169 11 108 23 -93 -90 -146 13 21 -5 -187 167 34 -83 -140 56 -15
5238 -15 111 192 -78 10 23 64 102 83 -44 68 -86 144 280 82 -106 -97 78 -164 45 -31 -322 40 98 157
5262 157 242 -8 -40 40 -229 43 80 152 293 53 -147 -233 -70 -32 109 239 35 97 -104 -36 -23 -158 -32
5285 -32 -124 223 -214 -57 147 -10 -11 32 186 -12 -116 -99 163 99 -140 -139 146 -138 -7 -255 -127 -134 125 35
5309 35 -52 28 -67 -71 86 80 -114 -69 74 105 34 113 29 -11 134 144 198 -235 190 -137 16 -94 163 -257 -55
5334 -55 102 -22 -52 216 255 -154 -253 -23 25 -106 -39 -29 -43 148 -67 -72 -19 -104 -31 -169 -39 85 -54 -152 155
5359 155 -61 26 -247 23 -46 117 49 -249 25 -84 -30 -180 86 -51 -110 215 85 -47 100 24 -147 26
5381 26 -52 -81 183 -2 29 -19 -36 -129 28 175 54 -136 158 98 43 -150 278 -121 189 130 -4 -115 -34 128
5405A28L4j13Q3j01M1j32J16k8J7J77o2p0o8J37l24K87j66O7N5j97J80K03l90
5428a26K75l08K01N1l66M76l23J79O5N7k72J17nj53L6J72k3j02j97K80P2k52K78
5451A32M2m2j92N3J94j78j62K01K0j4q6j71K04K7j9JK23k14J38j78j07J50L7j93
5475a34J43l9k5J97J94l02j76J95j2k8JJ74j69j61O5L51k85kJ52j45j36K72j78
5498d8l9L0OJ00k2j76K23M9j99J42j30K69n06J19LL67j42KL9k5J4p4K0P2q9J22
5524A27j24j35J07RJ83k84O5k21J05j43J88l4N1L3k06J76K0J78J01k12J3L66n19
5547a56L92j07J9j89P0n0l0K5n2J19J88j43j76J34n7P0r0o1j2L18k24K38k54J33
5571A05N9r6m4r8J37j76J52j78K56lk83K24j60N4k9J37J0J15l06j1R0PoM6J92
$$ plain form
5405 128 162 49 132 31 72 -60 56 28 45 222 160 90 22 159 -165 122 -44 23 78 -119 61 264 -126
5428 -126 149 -159 42 93 -273 203 -120 59 124 181 -91 26 21 -132 -96 76 53 -49 -246 34 106 -146 132
5451 132 174 132 -60 -7 187 9 -153 48 68 54 -32 -203 1 28 9 10 233 19 157 -21 -128 22 59 -134
5475 -134 9 -30 -55 142 336 34 -142 53 41 13 14 188 19 -142 -77 274 -11 -13 139 -6 -142 130 -48
5498 -48 -87 -57 -51 49 27 -149 74 123 -76 66 -64 205 -301 -182 -179 188 46 48 87 62 76 2 22 94 5 127
5524 127 3 -132 -25 -16 167 -117 -52 -273 -168 -311 -123 -157 -106 -73 -279 -103 -83 95 196 -16 -3 363 -156
5547 -156 236 129 148 -41 29 -21 -51 -26 -78 41 229 86 -90 44 -13 57 -33 -94 -106 212 -12 226 -28 105
5571 105 164 68 24 -74 63 -113 39 -139 117 114 -169 55 -105 -51 -80 57 67 182 -124 -135 -45 -38 -44 2 194
5596A94J08l95K36j18rN1J4j22p9L98m42NK37k0Q2O4m4P6p0j58J58K3l41RK64
5621A21L1j16l85M91j06j79J59n6J82k76J29N7k00K78n1n9J53l34K40j06n3lR9
5644A6kJ04j59n6j5J04O4R3k54K48rl12Q2k6kJ26j20l1L5Q1j73K97p6p3N5jJ28
5671A24m69L72P4r6q9K69j85Pj61J86Nn0N0L28j44l6j66J0j17r1K52r3j03P3L3
5696a7N3j2j19o6L1K3K6R3m6J50j92R0j43L22p1M4k61J43j95J43n6m3J5K74j40
5721D6j29j23P8J01L4n1p3L10o8O4k12k2KR5j48J83M8j85J56k02J23O4R5j25O1
5746A22j70J22kJ1o9Q9k74K47j83J00k4j24K51J68p9k00N5r2J52r3L7j39K06j14
5770cj47L96j16j9K9l46K12j54j23L07o3J38M1O5l1l40J22J66j16j46J60j58K84
$$ plain form
5596 194 302 -93 143 25 16 67 81 -41 -120 278 -164 -159 78 58 140 204 160 236 166 8 166 189 -152 -143 121
5621 121 152 36 -349 142 36 -143 16 -40 142 -134 -5 52 -148 130 79 20 173 -161 79 -27 -80 -83 16
5644 16 14 118 -41 -97 -112 -8 56 149 -105 143 134 -178 -96 -122 -124 2 -118 -149 -114 -33 -206 91 15 -58 -3 -4 124
5671 124 -345 27 101 5 -84 185 0 7 -154 32 37 -13 37 365 221 185 19 29 -88 -179 73 -20 -123 -50 -17
5696 -17 36 24 -95 -161 -130 -107 -81 12 -34 116 -76 14 -129 193 122 166 -95 48 -147 -4 -60 -103 -88 186 46
5721 46 -83 -206 -128 -27 7 -44 -117 193 125 189 -23 -45 -43 52 -96 87 135 -50 106 -96 27 91 186 61 122
5746 122 -48 74 72 83 14 103 -171 76 -107 -7 -31 -155 96 264 185 -15 40 -52 100 7 44 -95 111 -3
5770 -3 -150 246 130 111 140 -206 6 -148 -271 36 -27 111 152 217 186 -154 -32 134 18 -128 32 -126 158
5793A58r4L6j4M2k10K4K0K3j4J44L8j92K7L8K6j03p2J99o5j60L69m6Kk93J02R3
5819G8j91L6Q0N3K2m87L79J05J29k48r1J55N2j59J38j43m0p7K80oj13J55P3j56
5843B4r9J78j78L8QK11n3j82K68j90q8K95l22J76N2q4J2m4r6ol5L29k13K90l57
5868f6j50J61J32Q3k54K18j2j07j1O8R7j00j9R5j61k67J80K10j87K47j60n9M0
5891b2j21J46kk6P1k48K69l3k58K07j63M3K73j67M4K28j69q2%J34l59J97N5M0
5915E7j60K9J30l55L97k8p1k58K30j36NR0K20m2j32J7j63J49n2K16J4j81j34L28
5939A70k52o7K9j21L74k65Q2M1P7k08J58k13J59J19j15k80L70L3l7j00j09p4J89
5962d0j97L01K74l54J44j31J0k6K4k0j29J66j69N1P4P8j50K6J01j93M6j72Q4J70
$$ plain form
5793 158 64 100 86 128 -82 -58 -38 -15 -29 115 153 -39 -12 26 52 -51 -123 76 11 -149 220 174 176 -117 -15 78
5819 78 -113 -77 3 56 78 -409 -30 75 204 -44 -135 20 72 -87 51 -92 -132 -209 71 65 -48 107 180 24
5843 24 -75 103 -75 -37 -29 182 129 -53 215 25 -63 232 -90 86 138 54 66 22 -74 -80 -115 214 1 291 -66
5868 -66 -216 -55 77 160 -94 124 112 5 -6 62 159 59 40 135 -26 -293 -113 97 -90 157 -3 -62 -22
5891 -22 -143 3 1 -25 46 -202 67 34 -224 -17 -180 -137 136 -31 13 241 72 -10 -10 124 -235 -38 17 57
5915 57 -103 -74 56 -299 98 70 -1 -259 -29 -165 -160 -70 150 108 -24 -7 -170 -21 -73 143 157 -24 -158 170
5939 170 -82 -149 -120 -241 133 -132 -50 -9 68 -140 18 -195 -36 83 -32 -312 58 91 54 -46 -155 -229 -40
5962 -40 -237 64 338 -16 128 -3 7 -19 5 -15 -144 22 -147 -96 -22 56 -94 -68 33 -160 -114 -286 -202 -32
5986c2o5J15o6J51j13n7J72k33K25j49L16k19n4J5P4j30K59k15J43j55K01j86
6008cJ20m1k05K33o4lj31J46j15k64K94N5l8JJ18n8N7j9k48L58j44j1j81J74J53
6033A84K9k99J37j51r4M35j82N6j85m6J12j23L04k45p3Q4n4Q1J07j16M3j18J72
6056E8l2l06l0O8J83jL4r6J23k51L37Pl36L40k19K17q4q3J44r3j05J53J24k45
6080i3K24j20o4J29k64J50L03l14l1J70l7j27R4k6m4k9N7L7P0k85M78m89M1R9
6104g1J99j62m1J64r8o0OQ5J75p8K06m72K00j96L30k93K7J56k70K89k21l6L70
6127B09P4k61m0k4l17M20o3j23J92r7m6J74J17l0j73J22n8p6P8k08j1J88N0l9
6151E8k28J56K50l08P6j49K29k02K71k00N9K18k21m4q4j07J60k9J73k7j57J88
$$ plain form
5986 -32 -97 18 -48 103 -10 -67 105 -128 97 -52 264 45 -9 6 80 -50 209 -6 137 -18 183 -3
6008 -3 117 76 -129 104 40 37 -94 52 -63 -327 -33 22 -16 -15 103 45 102 83 -165 193 49 38 -143 31 184
6033 184 213 -86 51 -100 -194 241 59 115 -70 -116 -4 -127 177 -68 -141 -57 -111 -30 77 -39 4 -114 58
6056 58 26 -280 -310 -242 -59 -60 -26 -122 1 -250 87 94 -242 98 -121 96 12 -71 73 -20 -125 28 152 -93
6080 -93 131 11 -53 76 -188 -38 265 -49 -80 90 53 -74 20 -6 -50 -79 -22 15 85 -200 278 -211 -170 -71
6104 -71 128 -34 -75 89 -9 -69 -63 22 197 119 325 -147 53 -143 187 -106 -79 77 -193 96 -125 -161 209
6127 209 283 22 -18 -42 -359 61 -2 -125 67 -30 -76 98 215 185 12 134 76 0 78 -130 -141 47 97 58
6151 58 -170 -14 236 -72 4 -145 84 -118 153 -47 12 230 9 -35 -119 -226 -66 -95 78 51 -106 82
6173H2j84O1J11q6R4r0j21K36k0l01L18n0J31K2r2J8j86L7j68J99o0k30M46l4
6197A33k24K02j04j79K2L63j68j84K54p6k85J39P9K19j41j0lP2r2j17J20J72j77
6220A5o9O5Ro8L7O5q7p8J21j98L39j40r1Q9l0K55k37Q6j97J66j44K14j70N3O7
6245G2O4k30K00q3J37l24L6K14p0j46J47J42k97j69K51K5J01k61J92K33n2k96
6267a14R1J0j7p4J02J2j42J68l25L22o7J80J16l00q4K42l07K05l8j20J01M5k32
6290b26K34l7n23M03oj1L28p5k38J0J75J37j82j57P2O8n5J17p2J19K46k89J21
6313A59p2j88j25K41J5J4j12M2K40k03q0Q4K06r8j44j25n1k8L98k31L48k16p9
6336eL4j78k23M41O8m37M76l15J74j2r7K9K99j14p8j01j88k5L66j32q1J82j30
$$ plain form
6173 82 -102 -41 70 -16 78 -12 -133 103 83 -218 100 50 181 203 111 129 -57 -20 -188 11 -49 -279 167 133
6197 133 -91 111 7 -172 -150 213 45 -139 115 39 -246 -107 -28 191 50 40 37 109 17 -100 20 192 15
6220 15 -54 11 20 -48 -11 54 -33 -111 10 -188 151 11 -80 9 -21 234 -3 83 -114 52 -92 122 -48 5 72
6245 72 136 -94 106 23 160 -164 -128 86 16 -130 17 159 -138 -307 -56 -31 70 -191 1 234 182 -114
6267 -114 -23 -13 -30 -104 -2 10 -132 36 -289 33 -34 146 262 -38 -122 120 -187 18 -20 -140 -39 6 -226
6290 -226 8 -29 -552 -149 -155 -166 162 87 -151 -141 34 171 -11 -168 -96 -28 -83 34 -38 81 327 38 159
6313 159 87 -101 -226 15 30 44 -68 -26 214 11 -69 15 221 123 -21 -146 -197 -225 173 -58 290 74 -5
6336 -5 29 -149 -372 69 137 -300 176 -139 35 23 -74 -45 254 140 62 -39 -227 -252 114 -18 -99 83 -47
6359d7M0P7m9P4j22L9Q4P3j69m0N4j39J98l84J34L2R0Q0k04K89o2n4N2LQ9j57
6385a9R0l5n4j31O1R9p0l1J8j7P1K5o1k32L98L1j95J01Pk2k35K61k9N4O0k15K11
6412A41j62j8k7R5L6K24l04j2l7J20j81K73J30j17j46J19k61K70m0l5m2n6r4K35
6436A11r8j0l8K10j30J27j54N8o0J00l66K88r8nK61o41N02l28L10J18j29k44L6
6459a80J31P3J36j95N6k71K00j27M24l30K32n9n3m1P3o0n0K65j32J0j73k4k8J05
6483a8Q4k9j25N1J4j04J20j91K07J5Q5l40L13k42K20o3J35k42J04J43j75m7j99
6506b84M08P2k66L27k52q0J99k48L07j69J85m13L04R7l07l9L14j32m4pN8J01j63
6529c2L9p3J63j37m3jM5j03J21j5m5K08k04J34n7k91J29J23P2J98l17n6K26k56
$$ plain form
6359 -47 -7 70 21 95 -27 12 96 169 0 -40 14 -125 73 -311 -177 -145 -55 25 -179 110 48 -6 46 49 138 -19
6385 -19 71 36 -18 -149 -88 11 -59 -90 -72 -89 -18 7 -54 -286 112 143 -52 49 56 34 -201 60 31 85 145 -70 141
6412 141 -21 -39 -66 29 65 289 -15 -27 -64 56 -125 148 278 161 15 134 -127 143 103 68 26 -30 -124 111
6436 111 13 3 -35 175 45 172 18 76 16 116 -250 38 -60 -65 196 -445 57 -271 39 157 28 -216 -180
6459 -180 -49 24 160 -35 21 -250 -50 -177 247 -83 149 90 37 -4 69 9 -41 224 92 102 -71 -95 -123 -18
6483 -18 66 37 -88 -37 -23 -127 -7 -198 9 24 109 -231 82 -160 60 -3 132 -110 -6 137 -38 -85 -284
6506 -284 124 196 -70 257 5 -75 124 -124 183 14 199 -214 90 187 -120 -159 155 23 -21 -28 30 131 -32
6529 -32 7 -66 97 -40 -83 -84 -39 -142 -21 -36 -81 127 -77 57 0 -291 -162 -39 33 231 -86 -142 84 -172
6553a72K52j05M07l99k26J63J1K04p6k21m8J72K09l60R2J95j1J22p1q0J50l10
6575a02J84j18J26n0K0l1R7j68j64m5L04k68L15Lk36J51l03L54L9j05j07J83k71
6598a92K93j88J27N6o8j90J10J38p5j74K67j42p4j9M4J79N1j31n9o4J86j0j1J81
6622B35l27K76k73k4L14Q7j93r6J27j75j16K85j09J95n2k13K57j20j66J64l1J87
6644B32n84L54k39J32L0k5J42k4o8Q7j82J44k9K5Ro4K66j72k76J99nj19J09J29
6668G1n2L7j18R3j9j00P8j82rK23O5o1r2J22m2l20K42m8Q2k3K72nJ1m3k69J75
6694H8k8k01J27J32Oj43J5j9J77j20j68K19n7j48J42K48j25q2o8J65o3l4Kj48
6718h3K4J60j26o1R9N8n5j36n3J17pL8Q6R2j28l0K56j59k85L04lm28K05Q9J97
$$ plain form
6553 -172 80 -25 382 -17 -243 -80 -69 135 59 -162 -210 -38 171 -189 -97 98 87 209 138 58 208 -102
6575 -102 82 -36 90 40 60 29 126 -42 -206 -251 53 -215 100 103 -133 18 -285 69 108 3 -104 79 -192
6598 -192 101 -87 40 96 28 -162 -52 86 11 -163 104 -38 -112 -131 -87 92 143 12 -47 -111 75 65 54 235
6622 235 -92 184 -89 -113 201 288 95 -1 126 -49 -165 120 11 206 154 -59 198 78 -88 76 45 232
6644 232 -352 2 -237 -105 -75 -100 42 18 -50 37 -145 -1 -30 -5 4 -60 206 34 -242 -43 -48 -167 -58 71
6668 71 19 56 -62 31 12 -88 -10 -192 -201 22 87 26 -66 56 14 -306 -64 -112 -30 -53 219 214 225 182 -87 88
6694 88 60 -141 -14 118 124 -19 -4 -23 154 34 -134 85 28 -120 22 270 145 63 -5 160 97 63 65 -83
6718 -83 -59 101 -25 -86 13 71 16 -120 -173 -56 -63 -25 61 153 25 -5 251 92 -193 111 108 -320 -115 -26 171
6743A71k35k22L12j45K20l26J87j30J90N1j54J23r5L6L6P3j10j05J08K67K1m03
6765a30J30k2j46LK58l1m4k0j28O1J09R9j70K39l93J58m0K56j07M9j92j08K14
6788D5j71J11J12j66J12J85o1k95J42k34P6K73l53N05l09J42q6k18K03J32n9j19
6810c3P8m0J4j33K3j78L86j44j25K4J71J04m06J36K32j9n9J65n12K49j27L10k42
6833a26L21k34J82K7o7k53K01o9j1j5K43k60m4j2J84r8l2J07r4j5P1J17P9l37
6857a35J11P2k23J87k3L0M5p9L8M8k28L58M7j14p7lj52K04o3K42l37J21J24k55
6881f2J45L0j92K72m7l12L03o7j49l8m5j67M05p6j11J72L5k32K62m17N04N1l76
6904a12K39p2k86J17P8J5J29o0M7J12n9L3o1j35J16j45J36J5k88R1l1J80k35K74
$$ plain form
6743 171 -64 -286 26 -119 101 -225 -38 -168 22 73 -81 42 -53 -17 19 92 -18 -123 -15 252 273 -130
6765 -130 0 -22 -168 -165 93 62 18 -2 -130 -69 40 139 -31 208 -185 -27 -67 189 82 131 -61 -169 45
6788 45 -126 -15 97 -69 43 228 167 -128 14 -220 -144 129 -224 281 -28 114 28 -190 13 145 86 -33
6810 -33 45 5 19 -114 -91 -269 117 -27 -152 -128 43 147 -259 -123 109 90 31 196 -316 -67 -194 116 -126
6833 -126 195 -39 143 170 103 -150 51 -18 -29 -44 199 -61 -105 -117 67 -31 -63 44 -50 -65 6 123 202 -135
6857 -135 -24 48 -175 12 -11 19 64 -15 23 71 -157 201 248 134 57 54 -98 106 43 285 -52 69 193 -62
6881 -62 83 113 -79 193 146 -166 137 70 -79 -117 -162 -329 76 0 -111 61 96 -136 126 -291 213 264 -112
6904 -112 127 55 -231 -114 -36 -21 108 48 95 207 148 181 120 -15 101 -44 92 107 -181 -90 -121 59 -176 98
6928I8P0j82O7o3M4o8J10N0Qr1J0o5K78k91J58k91L58l02L76k2k28oK42j81K16
6953B95l08K11M3j23k5k81K05J40j07k4m7N3k02O4J8J90j64L08j66j9Q4l8k04
6976i7J2L74k62M2j9O2j60K9q5K66j27k22N8J95j37J15j65K54j25j57K07j57N0
6999d9K27k34j27J19J6L8j4L0r3J18J13l3j94K9J60l26K21r2R4J27k33r9J23K71
7023A92k66K34j27l56M85M2j6m24M00l32K36p3J24j11j12J27mj02R5r5M3J48j1
7046I7J14l64J16k2L1p4K06k29q1L10J3k21nJ92j24o6K97l2k43J44k90J91l8q
7070h6p3q5J67l00M78k42K8qM5Q0K40k11j38m3qr4N5L9Q6M5k49L55J9r7P5k09
7096a31O5l0Q4Kk11L97l84J37J83k28oK30j1m37K32k3J0L56j14k29K20l6J84j63
$$ plain form
6928 98 168 -14 53 -10 34 -34 76 126 134 43 53 -12 266 -25 133 -158 200 -102 274 252 24 18 260 79 295
6953 295 -13 198 241 118 93 -188 17 157 50 26 -21 32 -170 -106 -88 102 -62 246 80 61 145 107 -97
6976 -97 -85 289 27 69 50 112 -48 -19 -104 162 35 -187 -129 66 -71 44 -121 133 8 -149 58 -99 -49
6999 -49 178 -56 -183 -64 -48 -10 -24 6 -87 31 144 111 -83 -54 106 -220 1 -91 3 130 -103 -202 -79 192
7023 192 -74 160 33 -323 162 204 188 -236 164 -168 68 -5 119 8 -104 23 19 -83 12 -83 -40 108 97
7046 97 211 -153 -37 -59 -28 -102 104 -125 -206 104 117 -104 -109 83 -41 -107 190 158 -85 59 -231 -40 -78 -86
7070 -86 -159 -244 -77 -377 101 -141 -113 -121 -76 4 244 33 -105 -148 -156 -250 -195 -156 -70 -25 -274 81 100 3 78 -131
7096 -131 -66 -96 -12 -10 -221 176 -208 -71 112 -116 -122 108 97 -340 -108 -131 -121 235 121 -108 112 76 260 97
7120I7k57M7J16K19l06L03j76P4k08J54j12l9N1k4k0m4L58k44o7L49k37k91O4
7143a93K13L9j68L39j96r6K81k51jKj3j23J19Q1Lj98q7K5K28J07J82j60J74j37
7167A70k08Q0N7j70mL2J55k66K96M5k08P8Qj04j51K58m8n2j12K1J1J59l5J01o2
7192E1l95M15J86n01N21k70r1p7J93r6k27K04j3R2j77K26jR6p5l4n3J75j03n4
7216hl0K35j9j12k1j18N2J82l39M96n00J15L9M7J27j95K27l01O0j0K53p4k41J47
7240A2k00K05o8O5R8j5j70r3N3J41L7j87k4K57Q5k58K12j05l13M18j49K2Q2k46
7264a41K00J60l53k64M22K06r6M4l73J37J27n6L9m5k31J01M3N3J7Q8L7j77r7J92
7288C3mk11q4K28j27J36q7J60j50K6J68J20m00L7J25k6K02l87L33J6R6k39K66
$$ plain form
7120 97 -160 -113 3 222 -84 219 43 117 -91 63 -49 -88 -37 -61 -81 -125 233 -11 -78 271 34 -257 -193
7143 -193 20 59 -109 230 34 -62 219 -32 -33 -31 -44 -167 -48 33 36 -162 -249 -224 4 111 293 133 307 170
7167 170 -38 42 99 -71 -75 -43 112 -154 142 187 -21 57 65 -39 -190 68 20 -32 -144 -123 -112 47 12 113 51
7192 51 -344 71 257 -244 277 7 -84 -161 32 -64 -291 -87 -100 -8 -185 41 40 136 61 27 -26 149 46 -8
7216 -8 -38 197 178 66 45 -73 -21 161 -178 318 -182 -67 -28 19 146 -49 178 -123 -63 -73 180 106 -135 12
7240 12 -188 17 -51 14 112 97 -73 -166 -113 28 65 -122 -146 111 196 -62 150 45 -268 150 1 23 105 -141
7264 -141 59 219 -134 -398 24 230 134 178 -195 -58 69 13 52 7 -224 -123 -80 -27 -10 78 115 -62 -159 33
7288 33 29 -182 -266 -38 -165 -29 -116 44 -106 -80 88 208 -192 -155 -30 -56 146 -241 92 108 204 -35 231
7311B31j90m5j07K21m8k8p7K88m37K22M4k1p4j43K05j34l3J99Lj68j12K80J17
7334A93k54J91j72L56k72l50J25J92j65L55j5L62m72J3q5J53j72m9r2J47j79K15
7356B5o0J04k76K86J02o6j14j01Q3r9j7K16k5J65m7k11o9O4J15o5k75Q3P5K85
7380A78j58K10m78J45J46M1j20K08M6k59J19J7k12n7K21j80k9J39J87k19J2N2
7402Il67O31k67k88L23k42J70PP3J11j80R3k42J41J58l7m5j51K59J12l28K94k78
7425d4j79K04j03J57j11R5K6J48m04M48m30R2K16k3j52j5m0J87k05o5L81j43N8
7448I8j02J1j45M14l19N8j27J07J79k02j01J13k9K9K66j3l62P6N6j45q0J81k9
7471f6m0Q2O2n7L1j13K4J88k16o3rK50k26J78P8j42J3J15M6m7j82K5M1K43k46
$$ plain form
7311 231 41 -4 -111 110 62 34 -43 245 -192 30 74 53 -21 -164 41 -93 -126 73 76 -92 -204 76 193
7334 193 -61 130 -42 314 42 -308 -183 9 -156 199 184 546 74 87 2 155 -17 -66 -158 -11 -190 25
7356 25 -35 69 -207 79 181 115 1 -100 -17 -116 -133 83 58 223 176 -35 -104 -40 75 10 -265 -182 -107 178
7380 178 20 230 -248 -103 43 84 -36 172 218 -41 78 95 -117 -174 47 -133 -162 -23 164 -55 -43 9
7402 9 -358 273 6 -282 41 -201 -31 -24 49 160 -20 73 -169 -28 130 93 48 -103 156 268 -60 234 -44
7425 -44 -223 -19 -122 35 -76 19 45 193 -211 237 -193 -101 115 92 -60 -75 -115 72 -133 -198 183 40 98
7448 98 -4 7 -138 276 -43 15 -112 -5 174 -28 -129 -16 -45 -16 250 237 -125 -49 7 -138 -218 -37 -66
7471 -66 -106 -24 38 -19 12 -101 -77 111 -105 -168 -177 73 -153 25 103 -39 -26 89 135 88 -94 -69 -28 215 -31
7496c1K9K04k74K8lO2k0k0K79j99k43J37J47k1j48ON6J43n8j12J98pj62m6N4J12
7522A11j90q4J05J49j39J8N5J63r8p4p0J08rk69O4L40oj21K9q5N7Nl21K33k29
7547b58J96J32j69q8K53l0j03J9j03J28j44L05o1K7k55q9K21k2k3J84j74k38M40
7570A48J52j77q4L1o1o5p5K57k66L29j15l15J20n7J16J04j09K19r1J64l60L28
7592A93k00J8j51Q4K27r2j38J77j61o1pK05k3k08K61l1j46k0J7J16k24K83J24
7615B43k12J17O4l58J6K8m3J66J33O9k88J43j23K1j06K05l12J89OJ6J50k16K38
7638A46n5j22K9R6j10o8%k04J53J92M4j31K44j68L9k30J97J09k13J0J09j11m1
7661h5J61j73l2J42k9Q5O2k45J63P1j35j5N0L2k04OO3J50J46k31L4n1m3QP3j40
$$ plain form
7496 -31 -2 202 -72 -44 -47 15 -5 -25 254 55 -188 -51 96 75 -73 -67 -11 132 74 -38 160 153 -9 -55 -1 111
7522 111 -79 -163 -58 91 -48 -30 25 188 90 16 -54 54 45 -224 -160 180 174 53 82 -3 54 59 -262 -29 -258
7547 -258 -62 70 -99 -187 66 36 -67 -48 -151 -23 -167 138 77 104 -151 -240 -19 -41 -64 120 -54 -292 148
7570 148 300 123 39 70 9 -56 -131 126 -140 189 74 -241 -121 -178 -62 42 -67 152 61 225 -135 193
7592 193 -7 11 -140 -56 171 79 -59 118 -43 -104 -111 94 71 -137 124 93 -53 -73 -56 60 -164 119 243
7615 243 31 148 212 -146 -130 -102 -145 21 154 223 -65 78 -45 -24 -130 75 -237 -48 -42 -26 124 -92 146
7638 146 91 -31 -2 94 -16 -84 -84 -288 -135 57 101 -30 214 46 85 -145 52 161 -52 -42 67 -44 -85
7661 -85 76 -97 -129 13 -16 69 131 -114 49 120 -15 -30 20 52 -152 -146 -83 67 213 -18 16 -35 -78 -70 3 -137
7687a37J13J09M6k62N6K31l5k7J2M4K26o01o5J83N5j80R7J48jk15J78o4l6R7n
7712c3O4J37J1Kl53K45j38L62l38L99n01K33p6jJ07k11J04l7j0k0O0l8j9M4M5
7737C8j84K83k15J72n5k47L75JL13l66m2R4j13O2j77J62l24J06L12j96J25r5J62
7760A91m2j4l11J27N4J5j0j55R5j68J57K5l3J96j32j3j32L02l33J48LN7J23j52
7784bm0q9n7k7L01j23k1K85k16o4Q5j62L53k56n7J74L4k06mp6Q4K83l78Q3O9O2
7810C5K3O0j08O0K19j90j55O3j59J92L7K0k47J87o3j84L04j10q2jK96j84k71L22
7834F4p3K1j62J02K77l56k2P1J4J97j05p7P5k9q3J8RQ0k5J30M3k18K5j74L01j68
7860f5L38j89j13k8J4K20l2%k01M0k09J54O1J26k48L4J51p9Q1q4J73j70K34l65
$$ plain form
7687 -137 -24 85 131 -131 -75 156 121 94 106 150 376 -225 -290 -107 -52 -232 -135 13 12 -203 -25 -89 -125 -28 -33
7712 -33 31 168 179 181 -172 73 -65 297 -41 358 -143 90 14 13 120 -91 13 -24 -34 -54 6 -32 -51 -7 38
7737 38 -146 137 -78 94 39 -208 167 168 481 115 73 167 54 116 -61 101 -223 -117 195 -1 124 29 191
7760 191 149 135 -176 -49 5 20 10 -145 -50 -218 -61 -36 -69 127 -5 -18 -150 152 -181 -33 -30 27 150 -2
7784 -2 -42 -131 -188 -215 86 -37 -58 227 11 -53 32 -130 223 -33 -90 84 118 -88 -92 -168 -84 199 -179 -96 -27 35
7810 35 58 118 10 70 289 99 -56 7 -152 40 77 97 -150 37 -26 -210 94 -16 -98 -99 197 13 -258 64
7834 64 -9 12 -150 -48 229 -127 -149 -78 -64 133 28 -49 26 -3 -86 -68 -59 21 -4 126 169 -49 -24 -198 103 -65
7860 -65 273 84 -29 -57 -43 177 145 145 -56 -16 -225 -71 -10 116 -132 -98 53 -26 55 -29 144 -26 208 -157
7884a57N01k17Pr0l5Q2L7p4J4nj24J16j03j9lm8J15J73k60K64j17j95j23K97m2
7909fj22J82p6J16qj23J34l3J56j29R8j29j76j30L37J7qp6kk1n9J60j94J90j58
7934f0P6o8M13k64k11O9L5oOJ06j72J3K07P9k62r1Q1n2L12m53K72J6K5M4l18Q0
7960a23j1m1Q6K26k33j0J73j48m7NK67j36j72J53k2J12o2J43m3j05j70J18K02
7983A62l05M4K35l38K43k31J99m2K2J54l44L9O4L3k50M27J78l92J75p2m4K44m18
8006b17J44pK22k57j0K05j91o4j34L50k10o2L29o5j07K90l73K79n9Q5L3j52n5
8029b6k47L58R5k49J99n8q1m2N2j54L18k71L10j39O8k29L54l50J71j16r5J50o0
8052d2M4J58k74j7p7J43j8jJ88M6k29J07O3M8L6l99P5J14J98l46K70k9l22J93
$$ plain form
7884 -157 344 127 134 44 9 91 128 54 68 63 -61 55 -48 -67 -70 -118 -3 170 -90 174 57 -138 -261 36 -6
7909 -6 -128 54 -22 94 86 -37 97 64 220 91 189 60 -116 -246 91 108 100 24 22 1 -58 102 -92 98 -60
7934 -60 16 -52 361 97 -114 -45 -10 -16 -10 96 -76 -63 144 223 -39 -130 -49 -101 211 -242 30 46 71 115 -203 -123
7960 -123 -134 -175 -89 137 -96 -106 67 -81 -128 -123 144 8 -164 -11 -33 79 17 160 117 12 -158 -40 162
7983 162 -143 -99 136 -202 41 -190 9 -33 -11 143 -201 -162 -98 -65 -315 112 290 -102 73 1 -43 201 -217
8006 -217 -73 -80 142 -115 -125 80 -111 -175 -309 41 -169 -231 98 33 -74 216 -157 122 63 148 181 29 -26
8029 -26 -273 85 180 -69 130 72 -9 -51 1 -153 165 -106 204 65 133 -96 258 -92 79 -37 -132 18 -42
8052 -42 2 160 -114 -131 -208 -65 -83 -84 104 150 -79 28 91 139 175 -224 -149 -35 163 -183 87 58 -264 -71
8076g1J86q5m6j88M73k42j30J28j00J04j62J44J5K72l36J67o0O1m6j19K67k70
8098c8K8m1N8k7o5j63N4K13J7J5Q6j51r0nk2L90k28J25j45Oj81J93K24l88J73
8123C8M5n5L6J2o0J9K2mm4K40l82J27j63K76k6j60N8J57k19K04PJJ19l06K36j59
8149A9K2j36J77j18j2K12k53J58p6P6n5J86m32K59j7j55K6J16J54k62J6K8M37
8172C70l44nj24L07m50n3L53K3J3l03L82k61J38j51O7J37m1K66k46
$$ plain form
8076 -71 115 30 -16 -204 269 27 -103 25 -75 29 -133 11 26 298 -38 129 69 130 84 -35 232 -38
8098 -38 -10 -51 7 -20 -85 -248 -194 19 36 51 137 -14 -104 -109 -131 259 31 156 11 17 -164 29 253 -135 38
8123 38 83 28 64 76 16 35 57 53 9 249 -133 -6 -169 107 81 -79 -21 136 -83 121 128 129 248 -58 178 19
8149 19 41 -95 82 -36 -48 164 -89 69 -7 69 14 200 -232 27 10 -145 -119 -3 151 -111 -95 -67 370
8172 370 26 21 -103 204 -246 -299 54 77 90 -213 169 -92 46 -105 -38 99 58 324 78
8191G8
$$ Imaginary data points
##PAGE= N=2
##DATA TABLE= (X++(I..I)), XYDATA
0@%%%%%%%%%%%%%%%%%%%JrJ6j6J6j6J6k3L1l2L2l9M7n2N9o7P5q6R8j07J19j34
41g1J50j66J83k02K24k47K73l00L29l64M00m40M86n37N94o59P34q19R18j039J185
62F32j367J600j914K363l051M272p084K8317l893l9171J2644J5639L601j3861
76a273n930O994N551k414Q06r033K257J0338m420o298K632N55N263k328p813M874
92b39P040m384n213P36Q861j480r860N228N593n968J751J338m989K743M056k593
108B620l970K05N948j557n975M014J077l844L275m55k945L646j646k040L645j86
124A812k344j043K302L760m960k007N485k145n33L786m741j488O371k44m337j742
140b068L946L013m671r80K470j649J676J109n189J710M726l887k240K097J252
$$ plain form
0 0 0 0 0 0 0 0 0 0 0 0 0 0 0 0 0 0 0 0 0 1 -8 8 -8 8 -8 8 -15 16 -16 16 -23 24 -28 31 -36 39 -47 51 -56 63 -71
41 -71 79 -87 96 -106 118 -129 144 -156 173 -191 209 -231 255 -282 312 -347 387 -432 486 -553 632
62 632 -735 865 -1049 1314 -1737 2535 -4549 23768 19875 -19296 -6652 8987 12588 -1273
76 -1273 -7203 -209 5342 2928 3734 -5299 -3042 7296 2876 -3422 -790 -235 5028 2700 -5113 -239
92 -239 6801 2417 -2796 -2060 6801 5321 -4539 689 6282 314 2065 3403 -1586 1157 5213 2620
108 2620 -1350 -1145 4803 3246 -2729 1285 2362 -1482 1793 1338 -1607 2039 393 -1647 1998 1812
124 1812 -532 -1575 727 4487 -473 -2480 3005 860 327 4113 -628 -2116 4255 4011 -326 -2068
140 -2068 1878 4891 220 -760 1710 61 1737 2846 -2343 -633 4093 206 -2034 63 1315
155A315l95k135Q54J153j236K058j116l599N069J208n792J846L272j274j089j31
171HJ556p97r01K245k061j683M790j946l173L557J14k487Q86J86k83k91N21K11
189D52k452J898K376m300j73M087k026j317J671n56m48J178O0j073m16K835o02
206A194l278K027K145k745N82J159j863Q11J398j437j231J181J739j974j290K282
222G00n09k053K337p2k521J709J096j641l07J305k12r48P26J098j928K21K189
239A190j182j377K201n96q99J487k93j645P11J769r56k036J481J524k162r0J389
256E16j200j63J980j830j169J915O34j552n86J270k09o35R61k25j441J963O36
273H65k581N23J914n16r77N69K87p63N45Q29j495n95K310p53j568J306K01r59
$$ plain form
155 1315 920 -1215 -361 792 -444 1614 498 -3101 1968 3176 -2616 -770 2502 1228 139 8
171 8 1564 767 -134 2111 50 -1633 3157 1211 -1962 1595 1709 -778 108 294 11 -280 241 452
189 452 -2000 -102 2274 -2026 -2199 1888 -138 -1455 216 -340 -788 390 450 -623 -1039 1796 1194
206 1194 -2084 -57 2088 -657 -75 1084 -779 32 1430 -7 -1238 -57 1682 -292 -1582 700
222 700 191 -1862 475 403 -2118 -409 687 -954 -1261 44 -168 -1116 -390 708 -1220 -999 1190
239 1190 8 -1369 832 236 -663 824 531 -1114 -403 1366 410 -1626 -145 1379 -783 -873 516
256 516 -684 -847 1133 -697 -1866 49 683 -869 -1455 -185 -394 -1029 -68 -293 -1734 229 865
273 865 -1716 -1193 721 205 -772 -203 84 -679 -134 695 -800 -1395 915 162 -1406 -100 101 -858
291h58J67P45o57m58J136l31j177Q01J113j418k05J178n90q71J505kj418O27J085
310C72r16l64J303n66r47R35P45j548N20J050o05p18R55k76n74M32O48j178nJ241
330E04n44j040J084K3j035O65R26j337j33J057m15r36Q09N02j138O43M45o63j15
349f98R45l2r69L18Q11r30J20R71q22m73J157j05j390O51R32o67o55Q94k01m93
369f36Q95p4r62L34J045j022l44Q30k74l01M08K16p87K10J282p61p72Q31L08q32
389d06K38N03p59L55O60p23k24L70M94p13k17P00j72k86O84n90p58J017J50p57
409d34J69L53M5l40M09J49p14K47P85q91P7Q84n53l18L76O2l95J78M91j61p94
430c75R57O6q58L51K84l60P5O27q02k16O91J1n31NP24m91j90L57J37o32O81j33
$$ plain form
291 -858 -691 54 -603 -1061 75 -256 -1433 -632 481 -937 -1142 36 -554 -1425 80 78 -1340 -713 372
310 372 -544 -908 395 -171 -1118 -183 562 -986 -466 584 -21 -739 216 -60 -634 -202 446 -732 -737 504
330 504 -40 -1080 4 27 -1008 -343 583 -754 -887 170 -245 -1181 -372 130 -1008 -365 80 -583 -698
349 -698 247 215 -754 -436 375 -555 -435 536 -286 -759 398 293 -1097 -446 486 -181 -836 58 -143 -636
369 -636 259 185 -777 -443 602 -420 -764 66 -208 -509 -101 115 -672 -462 820 59 -713 118 426 -406
389 -406 -168 335 -424 -69 591 -132 -356 14 508 -205 -422 278 106 -180 504 -86 -844 173 323 -434
409 -434 -265 88 133 -207 202 351 -363 -116 669 -222 -145 739 186 -132 244 306 -89 89 580 419 -375
430 -375 582 648 -210 141 425 65 140 767 -35 -251 440 451 -80 -75 649 158 -32 325 462 -170 511 378
452C78m23j33K48on8K26j55j15K58M73r49K65M81l95m03L94K68m78L10L53n83
473d4j80O22K2n73L13L81n31K64L19n91J08L11j63k15L0J94j30P4qL6j75J04j04
496F4j04q1N34l56j30J88k65K37Q0K64m27j15N28j50m00L72nj81K46k96j14O7
518d4j7K28j79o2L07l21j52R5O3Q7J3j93p5M40q8pm54N15l74k82N21J63o61M61
542a6J78j67j48O8K43l04K52l14k1K45J81k43K0P0r4J25k46J96k39K91Nk55j85
565c58K98J16l17N7Q5j47J18L90o64J65L69l5k33q8K69K47l24J36l56Q0K68j43
587f7k8l1M4J03Qk33M5R8nj9o7O8P8mj75QJ35j64N5J17l68J32M19l9k44J7p6j4
615b07j38N44k95j75L79l58j7J75L1q9l2J91j30J68j22q8N0K6j27L19k3l59K12
$$ plain form
452 378 -45 -178 70 64 6 232 77 -38 220 693 -256 9 490 95 -308 86 354 -124 186 539 -44
473 -44 -224 398 420 -153 160 541 10 274 593 2 110 421 258 43 73 267 137 211 203 239 64 168 64
496 64 -40 -121 413 57 -73 115 -150 87 167 431 4 -111 417 267 -133 239 234 53 299 3 -111 -44
518 -44 -61 167 -12 -74 233 -88 -240 -145 -82 5 18 -175 -250 190 102 95 -359 156 -218 -500 21 184 -477 -16
542 -16 162 -5 -153 -85 158 -146 106 -208 -229 16 197 -46 -26 44 -50 75 -171 25 -214 77 82 -173 -358
565 -358 -60 56 -261 -204 -119 -266 -148 242 -422 -257 112 77 -156 -244 25 272 -52 84 -272 -192 76 -67
587 -67 -95 -126 -82 21 29 -204 -159 -61 -66 -85 -152 -84 -6 -10 -185 -177 -42 -206 -151 -34 -402 -270 149 110 -134 -117 -193 -207
615 -207 -345 199 -96 -271 108 -250 -267 -92 -61 -150 -182 9 -121 47 -75 -163 -113 -87 -214 105 82 -277 -65
638f5K8j12o7O1lM18l30j9k16K85J40m4j87n8K69k00r6N9J39k00M82l59K3j16
662a68J93M6n5r4j81J81M8j77R2L9j2J73k4k11J10L4j03O5k07R3O6O9J75l62l7
687b47M14nl93J20O9J07j76n7l0Q6K06l0j79J18K17l70K04k99K5K02J80j39j0
710A3j38K45q7k1j07k3L81l16j09N4J15J1o7L3N4P2j3j92J22M6R0j0j43J11J8
735A39J4o7k05J62L8j01Q3j88J66j59J52o6J56P4Q6J8j34k68Q1J40k1p1L69k96
759A02J92k68j44L92j76k02K00j78K88j82J68J2mQ1j47Oj71J55k45M17k21k17
781a42K19M5j33J60J22m44M11k11N4K15j03j00N9j5R1l32%M9J48O3j16K7J48j64
805E1o3j6m5J85k55J84J27j05R4J86k42L6j12R4k16K40n7R2p4L6r3m5Q3L1j21
$$ plain form
638 -65 -37 -149 -216 -155 -158 260 -70 -89 -305 -20 120 76 -111 -169 100 -100 -196 -137 2 -198 284 -75 -52 -168
662 -168 25 71 16 -78 -259 -78 -30 -207 -115 -76 -88 85 61 -150 -40 -6 -109 -44 -251 -158 -92 -23 152 -210 -247
687 -247 167 162 -231 -111 -42 65 -111 -168 -198 -112 94 64 -115 3 220 -150 54 -245 -220 -18 162 23 13
710 13 -125 120 33 12 -95 -118 263 -53 -162 -108 7 18 -49 -16 38 110 97 -95 27 73 163 153 10 121 139
735 139 153 86 -119 43 81 -20 63 -125 41 -118 34 -32 124 198 284 302 168 -100 -19 121 100 29 398 102
759 102 294 26 -118 274 98 -104 96 -82 206 24 192 204 200 281 134 140 -31 124 -121 296 75 -142
781 -142 77 122 -11 149 271 -173 238 27 81 296 193 93 152 137 228 -104 -104 -55 93 156 40 67 215 51
805 51 -12 -28 -73 112 -143 41 168 63 157 343 101 137 25 119 -97 143 86 178 104 140 47 2 85 116 -5
830eJ2N8K25k25n6O7J67j47J31k27J59l1j89p1Q3j40p2M84k11O9k01J27O9j02
854b6J40JO8j54j52J13k50K60J46k41P8j61Q0J02K3j63J76N2J34l76M82k43n9
877C0Q9j91N36l52l12L46k61J44K0P3k5k36K93Pm66K83J03k22J34p5j71K12K12
900A71k47qo0K6j8J09J02q2k71Q1K26l0j03j6O6K2j01J67n1k11J16j9J88J79k27
925Ij82J39L3j75o4N36n57o3M01k05n3k32N24m8k40K17k17j67K47m8J30J06o6
948B5j92j7l8L64l01L75j20j95j6J72j06R5o4l8k02J80K10k40L1K40l71J25L1
971e2l4j60L29L4j09j09J59q5j84J23K1q0L76m27K69p2k26J95OJ54k96PK16j04
995d9O5n1J29kl1r8O4q3J7P0J9m0O8j20j06J00J30j06r4j2J64k79M8J49k11L29
$$ plain form
830 -5 7 65 290 65 9 76 243 96 227 0 159 128 -61 -132 -49 -189 -261 223 12 81 -120 7 76 -26
854 -26 114 115 183 29 -123 -10 -260 0 146 -95 -17 -178 -98 4 27 -136 40 92 226 -150 332 89 30
877 30 119 -72 464 112 -200 146 -115 29 49 122 97 -139 154 161 -305 -22 81 -141 -7 -82 -253 -41 171
900 171 -76 -84 -144 -118 -136 -27 75 -7 -278 -197 29 -1 -104 -120 -54 -32 -133 34 -17 -228 -112 -131 57 236 9
925 9 -173 -34 -1 -176 -240 296 -261 -324 77 -128 -181 -413 111 63 -177 40 -177 -344 -97 -145 -15 91 25
948 25 -167 -184 -222 142 -159 216 96 -99 -115 57 -49 46 -18 -56 -258 -78 132 -108 -77 163 -208 -83 -52
971 -52 -86 -246 83 117 8 -101 58 -27 -211 -88 -67 -147 229 -198 71 -1 -227 -32 -26 128 -168 -161 55 -49
995 -49 16 -35 94 92 61 -37 27 -56 -39 31 50 10 78 -42 -148 -48 82 -24 -118 -130 34 -245 -197 -48 -259 70
1021G0L03l10l07R3N5j13L16k28j10K25l5K8j32M24m3p7j6j18j18o0K58j04K49
1044B50m52K48j57K34j26o8j44K28Nj74L01j05k8J8Q9m1j01P6J29k11Or7K06P8
1068A64O9j18r9J41k08P6l1J27M9k52M1J23L3j53J15Q4k98J01K66k12Pj05K70
1091A90l1j72N0j8J68k01K7k28M15j46J8k00O8j11J46r1J25L5K9j32j8J21m4Q6
1115H6j38K59m2j86J35j32K70l27J71j01q4jO0o3L72k51j0k7j21N9P9j16m2J34
1139a6J01J17P8j87N7k40J94M7m8R2o1l0j08j65K93l4j07J30j76J41k25K44j4
1162H3K28k91M1P5j45J30L9j20J49p5p9k68J2M07m4j04p9l07L69j11N6q8J00J79
1186A57k03L1J42j00j9m0O2K11k48J07l10o3L9L60N2j2O8r8R0k05p3j47J77oo9
$$ plain form
1021 70 373 63 -244 -151 -96 -209 107 -121 -231 -6 -41 -13 -145 279 236 159 143 25 -93 -153 105 1 250
1044 250 -202 46 -111 123 -3 -71 -215 13 18 -156 145 40 12 30 119 78 -23 53 182 -29 -23 -120 86 164
1068 164 233 115 16 157 -51 25 -6 121 170 -82 -41 82 115 -38 77 161 -137 -36 230 18 25 -80 190
1091 190 159 -13 37 19 187 -14 13 -215 200 54 72 -128 -60 -171 -25 -116 9 44 73 -59 -77 44 0 86
1115 86 -52 207 165 -21 114 -18 252 -75 96 -5 -89 -90 -30 -93 279 28 18 -9 -130 -71 8 -108 -150 -16
1139 -16 85 202 280 93 150 -90 104 151 103 195 134 104 -4 -169 124 90 -17 113 -63 78 -147 97 83
1162 83 311 20 61 136 -9 121 160 40 189 114 35 -233 -221 186 142 38 -41 -348 21 -90 -34 -122 -22 157
1186 157 -46 -15 127 27 8 -32 30 241 -7 100 -210 -273 -234 126 178 166 234 136 226 21 -52 -199 -22 -28 -97
1211i7q9K05j28J05k14L31j73j21J11M3N8O7n1M9l8j33L45k17k01J68q6K28k13
1234e1k1j55J53p3J75j90O2n4J04K70l27Q8p8j0Q9J92Jj05j24J85k35m1J90J07
1258A52k73J45lJ0l8j03J45j65K47j65J45j06j12P6k27R8J12j20K37j30r2l8K26
1281B1l5k54K60J0R1Q7j84J49o0j62K80k08m9N0n6j50L62pm41N27j53j63m0K17
1305I2m9K7k40K71J6l66L04Kj64n4J80j09K28k05r7R4K48j69o3M9N4p2K7K17l62
1330a41N3M1r1R6J25j05M2K88m08L03j15j0j78K20l60K78j24N2J62k60K60r3M4
1353G9l18J17K13L1l7p4l9l09J95J06m2j87K66Rj17J30r0LJ80r1P6j21j2J6J3
1378cJ31L4M4N2m0R9m51R2j70J05J71j6m9J25Mj18k25J67K24o3p3j15J85n5P7
$$ plain form
1211 -97 -186 19 -109 -4 -218 113 -60 -181 -70 -27 31 98 47 96 58 -75 270 53 -148 20 -66 162 -51
1234 -51 -72 -227 -74 -147 28 -162 -100 -154 -50 220 -107 -19 -97 -107 -18 174 175 70 -54 131 -104 -145 45 152
1258 152 -121 24 21 31 -7 -110 35 -130 117 -48 97 -9 -121 -45 -272 -174 -62 -182 55 -75 -167 -205 21
1281 21 -14 -268 -8 2 93 180 -4 145 85 -77 203 -5 -54 -4 -60 -210 152 145 -296 231 78 -85 -125 92
1305 92 43 70 -170 101 117 -249 55 57 -107 -161 19 -90 138 -67 -164 -70 178 9 -54 -5 49 -23 4 221 -141
1330 -141 -88 -47 -138 -42 83 -22 20 308 -100 203 88 78 -100 120 -240 38 -86 -34 128 -132 128 35 79
1353 79 -239 -122 91 122 85 11 -28 -337 -142 -36 -78 -265 1 10 -107 23 -67 -64 116 25 101 -20 -32 -16 -3
1378 -3 128 162 206 258 218 317 -134 -42 -212 -107 64 48 -1 124 128 10 -215 -48 176 113 40 -75 110 55 132
1403A32j24j49P0J6L6J56P8j30Qk14K19j32j92K68j44j44K19L3O0l4J1j3R4N2
1427A76k23M4P0L9J5p3j53K54k61r1N52l87J93J20j28j15J73j76k8OJ87k78l2
1450a16K30J08j61J9k42J27M09m32J4Q7L2J74j87N3Q2J20j49pk88J04J09Qj53
1473e9k22K96r8K02J49j41k28J38r0qJ0J98No4j34J11q0j62L44l35M13K1l31k3
1497h8P0J58j31j47J70O0j11K7m7J7J3k9l1N8P8J63m32J75k2J66k1k3J76l84K5
1522a10J48K7J2r4j71L09p5Ok8M33m20k36L33j22j81K9L21k98N4pqJ0r2R3R3J15
1548A41k71M6J74J1M9q3M2j05k73L81j17M6j18QJ16k36K26M4k31J74K90l25j49
1571a60J87m3n2lq9P9k21N88j76m34J88J29J63k81R5q5K35j88K6k43L42K06m26
$$ plain form
1403 132 8 -141 -71 -55 -19 137 215 85 93 -121 98 -34 -226 42 -102 -246 -27 6 66 32 43 30 124 176
1427 176 -47 -3 67 106 121 48 -105 149 -112 -203 349 -38 155 275 147 32 205 29 1 7 194 -84 -116
1450 -116 114 222 61 80 -162 -35 374 -58 -44 43 75 249 62 115 197 317 168 161 -127 -23 86 94 -59
1473 -59 -281 15 -83 119 268 127 -101 37 -53 -61 -51 147 152 88 -46 65 -15 -177 167 -168 245 266 -65 -88
1497 -88 -18 140 9 -138 32 92 -19 8 -39 -22 -9 -38 -69 -11 67 230 -202 -27 -49 117 96 73 249 -135 -110
1522 -110 38 65 77 -17 -188 121 46 52 24 457 37 -199 134 12 -169 -140 181 -117 -63 -70 -78 -68 -160 -67 26 141
1548 141 -130 -84 90 101 150 67 109 4 -269 112 -5 41 -77 -69 47 -189 37 81 -150 24 314 -11 -160
1571 -160 27 -16 -68 -71 -160 -81 -302 286 110 -324 -136 -7 156 -125 -30 -115 120 -68 -42 -285 57 263 -163
1594a63J44R9k14o2M16j17o4j50lj1K26p9L2%n4P0l21K49p8M9j10K68k38j36K18
1619b9J09k54O4K71k40j51M11k94j02L20J58l74K8L78l34l8j4K6o2K5K00l01J57
1642d6m3J30Q5j00J3l26M21Ok90p7J43J77k48J75J52l69J11K6L15m34K43m6o9
1665e1L1J48j12l57L89j16J58j08J02j04mQ8k62L05r3Qm2j06K21j35r3K24j84
1688i3j34M6O8J12k70N47j71k17K63k15l3K10n4R8k68L50qk09oj17r6K02K19j30
1712I4k08J86mj93J73l8j59j15K19r8J40J47j8k68K53n7Jk8J46l59R5L53l43j47
1736b28R9K11j34J55P4j53L2K52m21J03j05m8J11J58K9j01r7J37K25j94l4j65
1758i4J91j5J09j22Q6Q6j23k65m4K67k27k22O11j30j88R8l0m5K5K24J12m96L38
$$ plain form
1594 -163 -19 80 -134 -196 220 103 39 -111 -114 -125 101 22 54 54 0 70 -251 -2 -80 -31 -141 127 -111 -247 -29
1619 -29 80 -174 -110 161 -79 -230 181 -113 -215 105 263 -111 -83 295 -39 -77 -91 -65 -127 -102 98 -203 -46
1642 -46 -89 41 126 26 39 -287 134 140 -150 -227 -84 93 -155 20 172 -197 -86 -60 255 -179 64 18 -51
1665 -51 -20 128 16 -341 48 -68 90 -18 84 -20 -24 64 -198 107 14 22 -20 -126 95 -40 -133 91 -93
1688 -93 -227 -181 -113 -1 -271 276 105 -112 151 -64 -97 113 59 157 -111 239 231 22 16 -101 -197 5 224 94
1712 94 -114 72 68 -125 48 10 -149 -264 -45 -143 -3 144 126 -142 111 54 55 27 173 -186 -91 262 -81 -228
1736 -228 -129 82 -52 103 177 24 56 308 -113 -10 -115 -163 -52 106 135 34 -63 74 299 105 71 -94
1758 -94 97 82 191 69 155 241 118 -147 -191 76 -151 -373 238 108 -80 18 -12 -57 -32 192 304 -192 146
1781A46o7m24K07M77j54k47J14j68M1K61n2k79J55J35o9l0j32J0Q6J32k6j28j52
1804a64J81kK2P3Q0j69n9M8P2J37j50J47l71L61k50r1M3J09J98r4K22j30j84R8
1828A27o6K9j0r7m4k77M12J19k82K4l1L23l52P4J27M8p2J14j58J36N8j56k83L67
1852A30J86m87K32M2j46l02N34k37j41J81j39J45L5P2L7l92K83q6j98K6L71k22
1874g6j32M43p8j49QO0m02J98j4k8q2L18J3l53J91n8k2K38K02m61K4J59N8M8j47
1899d2J46k20L1K56l05N6P8R3k40J59N2M5l17M51kl11K08j63k3N4J44kq8j40Q0
1924@q8P8MK22k22j51J3J38K62l14M3P3j13N2J6R6k01J10q8K66l03R2j28J47n3
1949d9J21k37J34P3nO5j10q7J46j66m2M03k81q9R3K97l10R4j54P8L6L38n57M4
$$ plain form
1781 146 79 -345 -138 339 185 -62 52 -116 -75 186 134 -145 10 145 76 46 -86 -76 10 142 116 -12 -164
1804 -164 17 15 37 110 190 21 -38 10 82 219 69 216 -155 206 -44 -135 -92 17 215 121 343 213 29 127
1828 127 61 90 80 -17 -61 -338 74 193 -89 -65 -96 227 -125 -51 76 124 52 166 8 144 202 46 -237 130
1852 130 316 -171 61 103 -43 -345 189 -48 -189 -8 -147 -2 33 105 142 -250 33 -53 -251 -225 146 -76
1874 -76 -208 235 157 8 16 76 -326 -128 -142 -170 -252 66 79 -274 -83 -141 -163 75 277 -184 -160 -1 57 105 -42
1899 -42 104 -116 -85 171 -134 -78 0 93 -147 12 64 109 -208 243 241 -70 138 -25 -48 6 150 148 60 -80 0
1924 0 -88 -10 -6 216 -6 -157 -144 -6 256 -58 -15 58 -55 -3 13 109 -92 18 -70 196 -107 -15 -143 4 -49
1949 -49 72 -165 -31 42 37 102 -8 -95 51 -115 -157 246 -35 -124 -31 266 -44 50 -104 -26 10 348 -209 -165
1973a65N0J44J5P1J08k28m7J90k95J65J65k92K77k57J40R6p5L7rl5M4k66L1K00
1997F4l5j18o6L71l03n2J72j80L3K42O4j41k18Q0or3J05Q0j38J2J44j21MO1m9
2022h8R6L5K16m23j00M93k56j91K74nl12K87N0O0l2j11j07k4L49k79N9jN2p8j31
2047a67J94J47k49J17L4J42j59q8j03J96J37j59m2J97j40r2j45l4K27k1J47N0
2069A89j61pK1j56q6K13l9j89M07m76J95k3K92k84m5K59J1q2j79M19l93J75J33
2092A94j99k4j99L89k07K86j56K8q1r7J15J0R0J45m97N5J68m0oJ43J50j36m67
2115c36M14l76J93J21J10l24RL1q1K80j24nr7K35j35K12m9j29o0O4J93j33n5l3
2139g5Q0R1o4j0j6K08k93K7P4K15o8L3j74r1r8R1R1o3J7K11p9k02l9J77J51j65
$$ plain form
1973 -165 -115 29 44 115 223 -5 -52 138 -157 8 173 -119 158 -99 41 137 62 99 90 55 99 -167 -136 64
1997 64 29 -89 -155 216 -87 -139 33 -147 -114 128 192 51 -167 -87 -93 -186 -81 -1 -139 -127 17 -104 -100 -39 -88
2022 -88 8 43 259 -164 -264 229 -27 -218 56 51 -261 26 76 136 104 -7 -114 -138 211 -68 -9 -10 42 -36 -167
2047 -167 27 174 -75 42 76 218 59 -29 -132 64 201 42 0 197 57 -35 -180 -214 13 -8 139 189
2069 189 28 21 42 -114 -200 13 -26 -215 192 -284 -89 -112 180 -104 -149 110 121 39 -140 279 -114 61 194
2092 194 -5 -29 -228 161 -46 240 84 112 31 -66 49 59 149 294 -203 -148 20 -20 -26 117 267 131 -336
2115 -336 78 -298 -105 16 126 -198 -189 -158 -239 41 -83 -88 -185 50 -85 127 78 -51 -111 -47 146 13 -42 -75
2139 -75 5 96 32 22 6 214 -79 -52 22 237 169 202 28 -63 -161 -70 21 -42 -25 186 107 -95 -134 43 194 29
2165B9m4m7M5q2O9K87k54q5l5M32l4l47J04K69l44N1QO5j80K03j58j52J77Q2J84
2190B43k90K24k37M0Q6J9k15n5K27q7k2K48r0n2K01n1l5m3l33L72o0L8j13o7J29
2215G7j76J25N6L8k8k09K58j54J15l40K15Lj64K97J34l30J31n9P2l00J30k10K67
2238e2Q2J37J12l03K31k97J80r8r9K54j90j08K01J30p7j53J25k19L64l53Q7j0
2260e6J02j24K47M3k75j2j44K14j68M5L4K50k52Q0J06k30R5M8j16K47J85k36P
2283I0j50K27k36J2J3MJ3O2j5P2J29k35j27q8Q8n6P9R4l8J41J47O0j98j3L7j27
2309a5j00q8K75J18k29K87n18L63j47q1m6l1K76j43j11R1R0k14N10k23j4L3k69
2332a86J91Q2nk62r2K61J78l00L44j91k8j08K56k04MK42j81j99Q8J58k2K9J35
$$ plain form
2165 29 -15 -62 -17 -99 -30 257 3 -82 -117 315 281 -66 38 307 -37 14 22 87 -93 110 -48 -200 -23 59 243
2190 243 -47 177 -60 -20 66 85 -130 -185 42 -45 -67 181 91 39 240 189 154 111 -222 150 90 128 15 -52 77
2215 77 -99 26 82 120 92 -117 141 -13 102 -238 -23 -20 -184 113 247 -83 48 -11 61 -239 -109 -319 -52
2238 -52 30 167 279 -24 207 -90 90 -8 -107 147 -43 -151 50 180 103 -50 75 -144 220 -133 -46 -56
2260 -56 46 -78 169 212 -63 -75 -219 -5 -173 -128 -94 156 -96 -16 90 -140 -45 3 -113 134 319 83 90
2283 90 -60 167 -69 -57 -44 -40 -27 35 20 92 221 -14 -141 -229 -141 -197 -118 -24 -62 79 226 286 88 75 112 -15
2309 -15 -115 -203 72 190 -39 248 -270 93 -54 -135 -181 -212 64 -79 -190 -99 -9 -223 287 64 50 83 -186
2332 -186 5 87 82 -180 -272 -11 167 -133 211 20 -8 -116 140 -64 -60 182 1 -198 -110 48 26 55 190
2355A90j81J65J8j74m1O7J8j10j7j62J22J08J1j34k9P4K10k9l07J56Q9L1q1K27
2379B21p7l4j61K04j47p3K41j88M2j62J97k29J42K31l90K97j60j59K32J65k78
2400h6J24J74n29R4J37J03M4k53L02l14M87l5O5m21J23J39k10K88l09q3L97k91
2422e4l3J07rJ49j34n5j12k5J62MJ11j84J95k38J51l58M02l7N2K1j2J79m82J95
2446er1J33l06K53j0K1n6o3K61j44Q2j20rL3k9N8k9j65J37OO1N0j56L98n39M54
2472B25k36J50k06K3J25j40Q4j02O0P1J0N6Rj85J74j28J3j26K11j91L9J59K4K9
2496A48L8k32j64J9J05J90j34O6j04qJ46J08j66j54l0J78l7j55J73p7L39L8j55
2519A32J1k26o4j1K38n4J60k72J09j66K67j76J87r5j02K15m37M81j81P9JO5k04
$$ plain form
2355 190 9 174 192 18 -23 44 62 -48 -65 -227 -105 3 14 -120 -149 -75 135 106 -201 -45 44 75 -6 221
2379 221 144 110 -51 153 6 -67 174 -14 28 -134 63 -166 -24 207 -183 114 -46 -205 27 192 -86
2400 -86 38 212 -317 -223 -86 17 61 -192 110 -204 283 248 313 -108 15 154 -56 232 -77 -160 237 -54
2422 -54 -87 20 11 160 26 -29 -141 -166 -4 0 111 -73 122 -116 35 -323 79 42 94 115 103 282 -200 -5
2446 -5 -96 37 -269 -16 -26 -5 -61 -124 137 -7 75 -45 -54 -21 -50 8 -21 -186 -49 -43 18 68 -88 310 -229 225
2472 225 -11 139 -67 -44 81 -59 25 -77 -17 54 64 120 129 -56 118 -10 3 -123 88 -103 -64 95 119 148
2496 148 186 -46 -210 -191 -86 104 -30 36 -68 -76 70 178 12 -142 -172 6 -31 -186 -13 -90 249 287 132
2519 132 143 -83 -147 -158 80 26 186 -86 23 -143 124 -52 135 40 -62 153 -284 197 16 95 96 161 -43
2542d3l1o2L05r0k6q1k05J52K24j51L8o0J04J35r2p6l2j55J74J9j69K9K2J38J1
2567G8j23K88j43k95J40k6m1j33L04q3M1l00L71j23J83Mp4R4j76k0k5j35K52k97
2591b39K65j90P7J27o2R1j7j08M9l7Q2pJ3j06k63L40L5J29l14L88l11k55L19O3
2615F9J4n5k2K63j78j93J70j1J05o5l37K62j81J68J57k99K78j03J15l0j19m7j3
2638e2Lj04r9NK70j81J05j7P3j91J45Q3n4J54j02J71k84J10L4j07J08oj01R0J32
2663A85L9n0l01J52J24j75J64R5l13P9L9j13J4L6P0K8k24K21j62j10L25mk9p2
2687A8j0o2P8l3K14j58k57J98R5J5rk4J00l14K38Nj16L34m13J88km7q2J50n5k50
2713a99K27P5j20K00k72N7J39l16J56J77l9J01n49L76P8m1r7M2oPK05j33K5q8
$$ plain form
2542 -43 -74 -136 169 79 53 -28 -233 -81 143 -8 30 -30 74 209 117 41 9 -146 28 47 -122 -93 -71 67 78
2567 78 -45 243 100 -195 -55 -81 -122 -255 49 -34 7 -293 78 -45 138 142 68 162 -14 -34 -59 -194 58 -239
2591 -239 26 -164 -87 40 -22 69 52 -56 -7 -44 38 31 44 -62 -325 15 50 179 -135 253 -58 -313 6 69
2615 69 83 28 6 269 91 -102 68 57 162 97 -240 22 -159 9 166 -133 145 42 157 127 8 -39 -52
2638 -52 -49 -153 -252 -247 23 -158 -53 -70 3 -188 -43 40 -14 140 38 209 -75 35 69 -38 70 64 -37 53 185
2663 185 224 174 -127 25 149 -26 138 233 -80 -1 38 -75 -61 -25 45 73 -151 70 -92 -202 123 119 90 18
2687 18 8 -54 24 -9 205 47 -210 -12 83 98 89 65 165 -149 89 94 -22 312 -101 87 85 38 -44 106 51 -199
2713 -199 28 103 -17 183 -89 -32 107 -209 -53 124 85 186 -363 13 91 50 -47 -5 -11 -4 201 68 93 5
2737Eol0l8R4k4L11k42j48M2J01L7M0j50qK18l01J83J78l03J88l21L10j45j86
2761a95L85m4l2q1m0k6Qj5J51K7k52R4K30k09j65J12J39k24L31j26L4q8l7j56
2785a79L63k29j25M79k51O5j76n0L13k99M6J35j20J57j19j01J56j54J08k76J60
2806i7j2KR0j26J03L3M1j11J08j21J33k8R1j55J2J52k33K33p1m7j83K53j5q2j22
2831a52Q0J44o4J17k6n8J5l44K28J26o9k2q7j07J75k52L30n0rJ3j08K4Q5j20L11
2856A80l4k16K20k29M2q2K21j80R3j25R7oj32L94k04K4j09N6q3K84K2l33J84p8
2880FJ57k78N0O0O1J8q7j65J79O1pj32J67k25J19O3j02K10j00k74K76j37J36j18
2904f2J18J65j65J21l98L00qL6l06L51j91r0j9P5q1J33j09J0K29q0j20r4J79j29
$$ plain form
2737 5 -1 -31 -69 25 1 312 70 -78 -36 65 102 142 -8 -16 202 -99 84 262 -41 147 -174 136 -9 -195
2761 -195 190 146 114 33 -7 -33 -25 -40 111 138 -114 -20 210 1 -164 -52 87 -137 194 68 102 14 -23 -179
2785 -179 184 -45 -170 309 58 123 -53 -103 210 -89 -43 92 -28 129 10 -91 65 -89 19 -257 -97
2806 -97 -109 -107 -17 -143 -40 -7 34 -77 31 -90 43 15 106 -49 -37 115 -118 115 44 -3 -186 67 52 -30 -152
2831 -152 -72 72 8 125 99 41 56 -288 -60 66 -3 -25 -112 -219 -44 -296 34 -16 -25 -12 -120 -96 -11 -131 180
2856 180 146 -70 150 -79 -37 -119 102 -78 15 -110 -13 -19 -151 243 39 63 -46 10 -73 211 233 -100 84 6
2880 6 163 -115 -65 -5 56 74 -13 -178 1 62 55 -77 90 -135 -16 47 -55 155 55 -219 57 -80 56 -62
2904 -62 56 221 56 177 -221 79 71 107 -199 152 -39 -129 -148 -73 -154 -21 -130 -120 109 29 -91 -185 -6 -135
2928a35K04k15J04L3K0j06q9J93l2O2j03l7J60J24l00J37N1l7j2M9J08J5j15J03
2952A82L1j20j63m2j7K09j31j77K18l2M16l67o1J9k95J67K66j18Om3P1J51q5k2
2976F3R3l56K01K5J8R2j30j06K7J5PkpJ83K40l26k78J13K56k88J07K3j48O0k26
3001c44L70j52Nj36K53k75L09O9j8j86J51j2O3K4q6J0j02J45J61k08OK05k48q5
3025h1pj81K25q7P4J88j4k8k44O4O9r8k8K77l5Q3j70J71L5j28j11k09K06n9J44
3050E6j80J4R2K76l21J73l02M8K20k99L86j87j51L8j14M45k61J7K7N5q9j74K23
3073hM9j63L09k40J81k91P0kJ6J45j81l5L29j66J2O1m2j69J43J30j32l58K94J21
3097G3Q5Jj19J98r3m2k35K23P3p1J13j99j40K04k07N8K4k9R4J4K3N3k5O8k80K47
$$ plain form
2928 -135 69 -146 -42 -9 11 -95 -184 9 -23 39 -64 -101 59 183 -117 20 71 34 22 71 179 194 79 182
2952 182 213 93 -70 -112 -129 80 -51 -228 -10 -42 374 7 -54 -35 -330 -163 103 -15 -9 -52 19 170 85 63
2976 63 156 -200 1 26 44 136 6 -100 -73 -58 -51 -53 -60 123 363 37 -241 -128 128 -160 -53 -30 -178 -118 -344
3001 -344 26 -126 -121 -257 -4 -279 30 99 81 -105 46 34 97 121 35 45 -57 88 249 41 47 252 4 -81
3025 -81 -88 -269 -44 -131 -57 131 117 89 -155 -91 -22 -120 -148 129 94 177 7 178 213 85 -26 -235 -29 -88 56
3050 56 -124 -110 -18 258 -63 110 -192 -144 76 -223 163 -24 -175 -137 -251 194 -67 -50 -23 32 -57 -231 -8
3073 -8 41 -122 187 -53 128 -163 -93 -95 -79 66 -115 -150 179 13 25 86 44 -125 18 148 16 -342 -48 73
3097 73 158 159 40 238 145 103 -132 91 164 93 206 7 -133 71 -136 -78 -54 -83 11 25 48 101 76 144 -136 111
3123A11M4j22k6N6j80J39O7k19L98l66p3J0K83m16J54J08J26j3J05l30j26Q3k4
3146b11k9L89k99L05m21J63o7L47l33J51L8m9n5k6L3M2O0r5pmK45l79J75k9j35
3171a91K9R7J25k01J17K2M0K4r3K83j85k06K32L5j47J89l57K86R0k17L3j26R5
3194b6n2K08j13plJ57k47J17P9Q0j51j08j4L7J73k4k65K12k26M8K44j79PJ17j78
3219a14L82m12J06J48k08J31M6k72J60p8j29L76l10M5J91J71k14r6K62k50J87
3240A22j61L1k18K50k5J81J6k50J65l15L47l17J98J87q2J4m9j09P9lO3k17L11
3263B18o4j40mJ40k9j08J36j88R6q6Rl5J96j92j12K05J89j13j07j81K20p6L3l5
3287b8J11j62J46j13J6q0m0%L04j96NJ32j14J9J13P3j12j64P4O4n9Q5j65N0J57
$$ plain form
3123 111 155 33 7 63 -117 22 89 -130 268 -98 -171 -161 122 -294 -140 -32 94 81 186 -144 -270 -187 -211
3146 -211 -240 149 -150 155 -266 -103 -170 177 -156 -5 33 -16 -71 -97 -64 -22 38 -57 -64 -68 177 -202 -27 -56 -191
3171 -191 -162 -65 60 -141 -24 -2 38 62 -31 252 67 -139 93 128 -19 170 -187 99 189 -28 5 -121 -26
3194 -26 -78 130 17 10 7 164 -83 34 113 193 42 -66 -80 -43 130 106 -159 53 -173 -125 119 -60 -53 64 -114
3219 -114 268 -144 -38 110 -98 33 79 -193 -33 -111 -240 136 -174 -129 62 233 19 -77 185 -65 122
3240 122 -39 -8 -226 24 -1 180 196 -54 111 -204 143 -174 24 211 129 143 94 -15 64 61 124 -93 218
3263 218 154 14 10 150 121 13 149 -39 57 -29 -20 -55 141 -51 -163 42 231 118 11 -170 50 -26 7 -28
3287 -28 83 -79 67 -46 -30 -110 -150 -150 154 -42 -37 95 -19 0 113 186 74 -90 -16 48 -11 74 -91 -41 116
3312A16j88K04k02J03J31k02L2N5m1%N2n2j3o3J07j25O1J16k45K45j77N2L67k80
3336E3n3J5j13K62k82J80k0J30m5p5j83J45k3q7J30n7k4J69l87K88m6J24q9l81
3360c69L35l8J27j48J3J62r9K05j6j52j80K40Q9O8k24j70L16j82l1pJ03o7J55
3383A30k55l5n7J61J04k76K63Q8j19k5J69n1j97J08j66K44J05k34k2L45n51L05
3405C4j17j38L39j92O6q5J98n2J65n7q7k6j92P6Kj9J97L3%j27P0k63K64J25m12
3430a98K73j25M8k9J95k45J70j94j3K60k56Ok06M03k62N0Q5K45k13K1J1P9j19
3453a4n4K1K06j15o3K15l92K59k05K92l1j77J49j92J76k22L2K92k73%K14k42M5
3476g9R0n5J55j93R6K58p8l9j01K73k68j29J10J0o6J72k3j8r4j52K49j86R4K04
$$ plain form
3312 116 -72 132 -70 33 164 -38 -6 49 8 8 60 8 -5 -68 39 -86 -25 91 -154 91 -86 -34 333 53
3336 53 0 15 -98 164 -118 62 42 172 127 52 -131 14 -9 -96 34 -23 -47 122 -265 23 -23 101 12 -369
3360 -369 -34 -72 55 -93 -80 82 -17 188 172 20 -160 80 169 237 13 -157 159 -23 -54 -61 42 -25 130
3383 130 -125 -160 -217 -56 48 -228 35 123 4 -21 148 97 -100 8 -158 86 191 -43 -65 280 -271 34
3405 34 -83 -221 118 -74 -8 -93 105 53 218 161 74 48 -144 -68 -66 -85 112 145 145 18 88 -175 89 214 -198
3430 -198 75 -50 -2 -31 164 -81 89 -105 -118 142 -114 -108 -314 89 -173 -123 -38 207 -6 15 26 105 -14
3453 -14 -68 -47 159 44 -19 196 -196 63 -142 150 119 -58 91 -101 75 -147 -115 177 -96 -96 118 -124 -79
3476 -79 11 -44 111 -82 14 272 194 155 54 327 59 -70 40 50 -16 156 133 115 21 -131 118 -68 26 230
3500B30j08m3j42q3O2K61q7J6l4J90k78J02k2k85K40k4j07O4P8k21L15n9M9k92
3524a78L01p1j28m5O9p6K19j52N3j43LL52j23k1k76J18K11N1j00kp5j47R5q1J83
3549C7k28L28j80L46m62J00P4j81Q5p2l5J71kN2j13J58P8r0P3k34Q8K39m26J07
3573h7J03J9k23L11k00r6J90R3r0j05J65j67m7J84J72j89j40J20j16L03m38M86
3595B48l57q9L8K32j69Q4J6M3j86J15j14K42j38J74o8l70M3K51Q2p9J66m2j55
3618c3l1q9L24J2n12L33J22r4k53K71K2l5pj05k7m4J42rJ4m5J42k25J13j96J62
3643d8J29J25k94M1K62m15K48j38R1K00ll53K28l9O6k60J15Q8l0J1J1r8N7K33
3667B27k19p0j04P1R0N6Lj49R3P1Q1o4k26J67j12L76l81J16j17Lj34M36j53k54
$$ plain form
3500 230 122 79 -63 -146 -84 177 90 106 72 262 -16 86 64 -221 19 -5 -112 -48 30 -191 124 65 114 -178
3524 -178 123 52 -76 -121 -52 -128 91 -61 -8 -151 -148 204 81 60 -216 -98 113 164 64 62 -13 -160 -65 -146 37
3549 37 -191 137 -43 303 -159 -59 15 -166 -81 -153 -188 -17 -19 33 -80 78 156 66 139 -95 -7 232 -194 -87
3573 -87 16 35 -188 123 -77 -173 17 110 20 -85 80 -87 -134 50 222 33 -107 13 -103 200 -238 248
3595 248 -109 -198 -160 72 -97 -13 3 46 -140 -25 -139 103 -35 139 71 -299 -256 -5 77 -2 164 122 -33
3618 -33 -64 -153 171 183 -329 4 126 32 -221 50 72 37 30 -75 -102 -146 -4 -13 1 -44 98 -127 -14 -210 -48
3643 -48 81 206 -88 -47 215 -200 48 -90 1 201 198 -155 73 34 100 -160 -45 43 13 24 35 -63 -6 227
3667 227 8 -62 -166 -95 -5 51 54 -95 -2 69 150 86 -140 27 -85 291 -90 26 -91 -88 -222 214 61 -193
3691a93K99O3l1L4r8j47K11r9k6r9J88P5n2k22J7k08N12j69q7L5j14J15J09Q9
3715B02j94lJ86l62K80p7J29j66r9PP5J51k15l2J00k27K34J32k79j0K26K39k17
3738H0k75K00M4L4p9p8K3p8N0J46k48K14j10J23K6K13k80l5J31q1j87L44k3j71
3762a7lJ52l30K47L6p9J23k45L19j01J8k16k2J52p6K38l30J61k5k4N2j25J17j31
3786a09O9m1R7j90O2J80J45k21J97l41J9k79L41M05k81p0M2j79K79l25K73k85
3808b12L42n4j23Q0r2K3j6j22K03RJ30m88M89j81K64k17j87J90j23k25L86O0k25
3831h9j1o9J29P8N9r1J59P9J04m22j22N12l31n4k2N6P1j93j37L40R9o5j64J08
3855B4P2j71J79k90N67n17K3L6J16j9k04M21l41lj7K32K1j94q5L2j20J73Q3j62
$$ plain form
3691 -193 106 169 138 172 74 -73 138 39 13 -86 102 177 125 -97 -80 -288 224 55 -32 3 -111 4 113 202
3715 202 8 5 191 -171 109 32 161 -5 -104 -97 -22 129 -86 -118 -18 -245 -11 121 -158 -168 58 297 80
3738 80 -195 5 49 83 4 -74 -51 -129 -79 67 -181 33 -77 46 72 285 5 -30 101 20 -167 177 154 -17
3762 -17 -20 132 -198 49 85 6 129 -116 203 102 120 -96 -118 34 -42 196 -134 27 2 -22 30 -95 22 -109
3786 -109 -40 -81 16 -174 -112 68 213 -8 189 -152 -133 -412 -71 334 53 -17 25 -154 125 -200 73 -212
3808 -212 130 76 -47 33 -59 -36 -52 -174 29 38 168 -320 169 -12 252 35 -152 38 -85 -310 76 136 -89
3831 -89 -100 -169 -40 38 97 6 165 244 348 -74 -196 316 -15 -69 -91 -35 36 -157 -294 46 145 80 -84 24
3855 24 96 -75 104 -186 381 -136 -113 -77 39 20 -184 237 -104 -107 -124 108 129 -65 -150 -118 -238 -65 18 -144
3879a44L52j94J15j78J81r5J10O0j52J0qJ50k11j66K08K06m21K68l01J79P9j4
3901C4k34Q1M23k35O1r4k79L1K60j44m4K28j14j6L9J02O1j02J1j46K4KK32l39
3925a58J43K25j50l24M27j83m5k50K49J2MJ29k63K95j20qq9L4j25K19lJ76j65
3948C0m3K57k93L42l06M0q5J18m7k37L21k39L20k34j9j0K98k5k89K33j67Q9j68
3971a14r5Q9K76J69l62LR0N0j43M6k56J63R3j94M09k16k3j98K84j15rm3J12j38
3995a22J75j75L8L95n61K49j8J16k28Q2N9Q7j14r6K11l64M19O3M3j26j65p3K74
4018A69R6j46Q2j47K09l66jQ9j38L4R5L42m57J65R9o4j55l5K81Rk47k56K86J99
4042A43m1r0j37K94qn5N4j7k05J06m9qJ75k49r3K18O9l1L24l11l12L42Qm1Lk54
$$ plain form
3879 -144 208 14 129 -49 132 37 147 207 55 65 57 207 -4 -170 38 244 -177 91 -210 -31 48 34
3901 34 -200 -119 304 69 130 36 -243 -212 48 -96 -140 88 -26 -42 -3 99 160 58 69 -77 -53 -51 181 -158
3925 -158 -15 210 60 -264 163 -20 -65 -315 -66 -54 -50 79 -184 111 -9 -17 -106 -72 -197 22 19 195 30
3948 30 -13 244 -49 293 -13 27 -58 60 13 -224 97 -142 178 -56 -75 -85 213 188 -101 132 -35 54 -114
3971 -114 -209 -120 156 325 -37 -34 56 106 -37 9 -247 -84 9 -185 224 8 -15 -213 71 -44 -53 -96 16 -122
3995 -122 53 -122 -84 311 -250 -1 -19 97 -131 -49 10 97 -17 -113 98 -266 153 216 259 133 -32 -105 169
4018 169 265 119 201 54 263 -103 -104 -15 -153 -119 -24 318 -139 26 125 61 -94 -129 152 161 -86 -342 -56 143
4042 143 102 12 -125 169 161 106 160 143 -62 44 -5 -13 162 -87 -180 38 107 76 400 89 -223 119 127 86 89 -165
4068a65J14P5J26M9n8l73L81ln0J22j29k26J31P9j72L61j21k72L4J43J9j2M2L1
4092A26j13J24j06j25R9M5j43K98l46P4N0j15Q3L33j76O1j75p1K10k83J29M8j8
4115IR5k7J18k15k07qK38J78k77Q1L0J96k13l7r9K17k89J31P9o4j55Q0J16K0L2
4140B9j87K81l84K23J09J25q1m2J7lj84J79j12K7j38R3J79k28O1j71K79q3q1J28
4164C6k18p9L27j4j26M9K9J7J58k32r4K49o9M9k0j80K47l19K50R8O8l59J57K05
4188B29j35j38L4j23R8m0L7j46j8K31K2m3J01Kom2j78J09j9J09J33j14l30M40
4212B13k42J50j03p4J32J15l51K7J80k10M41j97%j22%qJ54N0j08q1j40K72k31
4235a33K41O3j57q3l7K0K74m41K63K60k33R9j91J35p0J30r5o5Nl8q8K86j41rL7
$$ plain form
4068 -165 -51 24 150 199 141 -232 149 146 96 218 89 -137 -6 73 -99 262 141 -131 -97 46 65 53 95 126
4092 126 13 137 31 -94 5 50 -93 205 -141 -67 -17 -132 -49 284 108 169 -6 -77 133 -150 -21 27 9
4115 9 104 77 195 -20 -227 -235 3 181 -96 -15 15 211 -2 -39 -138 79 -210 -79 0 -64 -219 -139 -23 -3 29
4140 29 -158 123 -261 -38 71 196 115 73 90 87 -97 82 -30 -3 -141 -48 131 -97 -36 -207 72 -11 -92 36
4164 36 -182 -261 66 52 -74 -25 4 21 179 -53 -147 102 33 82 62 -118 129 -190 60 158 226 -133 24 229
4188 229 94 -44 -10 -133 -35 -75 -38 -184 -202 29 51 8 109 111 105 63 -115 -6 -25 84 217 103 -227 213
4212 213 -29 121 18 -56 76 191 -160 -133 47 -163 278 81 81 -41 -41 -49 105 155 47 -34 -174 98 -133
4235 -133 108 171 14 -69 -106 -86 188 -253 10 270 37 136 -55 80 10 140 45 -20 -15 -53 -141 145 4 -5 32
4260C2q5j7M3R4n6q3K83n0j62k3P6P5j98J81j2m2M8j27j49J84O0p0n9m3P4j58
4286a84P6K76n4j33j8L65m22O7M1r4J6J24j57J08O2j64K39k9M3k47K40o8%l55
4310b68J95J96j26K5k22K26JM1m5o9q6M20l43J26j8k81L71j64O9q2N6Lj52M74
4334C47o08K64PQ0j33P9n6m5J42j0j09N4m5K00k44L6M7j40J37J04J24k93J18j86
4358a30O1K3J07r9q6K28P8J00k40pk7o3j8K31j46j35k5J45k8K59k35kr9N7N3j04
4384a02K73k47N4j1k42J45l4pO9j3Q6k6r2Q1K65k51K1n2J59l36J99K3J08J38K2
4409B30k87O0K8M0l86K10O0J99k69j7J18J04p9N6k59J99j34PJ48j26K12k26K69
4432A57k07K69j68j60L30j05m3k6k42M21k68q5J63j1l4K8l9p4L73j95N0m9k03
$$ plain form
4260 32 -53 -70 -27 67 11 -72 211 161 -1 -24 52 127 -71 110 98 56 104 -23 -172 12 72 2 -57 -100 -26 -184
4286 -184 -108 168 114 -19 -37 328 -94 -27 14 -80 -64 60 -97 11 73 -91 148 119 162 -85 155 87 87 -268
4310 -268 -73 123 -3 22 -200 26 27 68 23 -46 -132 288 -55 71 53 -228 143 -21 48 -34 22 25 -127 347
4334 347 -261 3 10 90 -43 36 -20 -65 77 67 -42 12 -33 167 -77 -41 6 -134 3 107 231 -62 56 -130
4358 -130 -69 -46 61 -38 -124 104 182 282 42 35 8 -55 -73 158 12 -123 -148 -3 -31 228 -7 -9 -108 -51 2 -102
4384 -102 171 -76 -22 -33 -275 -130 -164 -171 -102 -115 -29 -55 -147 -66 199 -52 -31 -83 76 -260 -61 -38 70 208 230
4409 230 -57 3 31 71 -315 -105 -45 154 -115 -132 -14 90 11 67 -192 7 -127 -120 28 -98 114 -112 157
4432 157 -50 219 51 -109 221 116 73 47 -195 226 -42 -127 36 25 -9 19 -20 -94 279 84 134 85 -118
4455a18qJ96J63r7m02K99k1p4R6k9K0m4m9m2N6O8J49j65k36J03J47r2Q2j82J26
4480e4op3R3P3k01J21J09n4k8j72m2K75j75J6k06L69p6Nq3K40j5j94o4L35j51
4505D2o0m5J19k2K5m5Q3j0O9l25K26L3k00j4J30r8K43N2k16R7j99L3m0L57l73
4530a38K49r8k23K14j76R1m4J55j39R5K78k14K2M0n0k32K30k26J02J38K4l08M02
4553A92j86nK52J5l28j07K48M5mk81K35j88M06m99J15K25q4k82L00j25L96m48
4575a08J97n7j01J40k54L75k10j16J06N3Q2m1r3K6k3J21j34n4J4K27k96J65j20
4598a01q2L62k5j61j57J89L9r9R7j08O7j74J90l3l6O8m6J23k03j27J62J28j5j99
4622a41L18j22k23K34J13p3oQ2p4p4l86K82J06k23K43J33j61j68J86jj49J0J17
$$ plain form
4455 -118 -126 70 233 136 -266 33 12 -62 34 5 25 -19 -68 -110 -54 14 163 -2 -238 -135 12 -80 2 -180 -54
4480 -54 -60 -133 -40 33 -168 -47 62 8 -20 -192 -234 41 -134 -118 -324 45 -31 -26 -109 131 116 -78 -142 193 42
4505 42 -18 -63 56 34 59 14 97 87 156 -169 57 90 -110 -124 6 -92 151 203 -13 84 -115 -82 -122 235 -138
4530 -138 111 13 -210 4 -172 -81 -125 30 -109 -14 264 50 72 112 62 -170 60 -166 -64 74 98 -210 192
4553 192 6 1 253 268 -60 -167 81 126 122 -159 76 -112 294 -205 -90 135 51 -231 69 -56 340 -108
4575 -108 89 32 -69 71 -183 192 -18 -134 -28 25 107 66 -27 -1 -24 97 -37 -91 -77 150 -146 19 -101
4598 -101 -183 179 154 -7 -164 25 64 -35 62 -46 21 -153 37 4 -32 36 -10 113 -90 -217 -55 73 58 -141
4622 -141 177 55 -168 66 179 106 100 182 108 34 -352 -70 36 -187 56 189 28 -140 46 45 -104 -94 23
4645B3K19l48p5O5J65J3l7J18O2k26r8L3Q5j33L77k98j41J92K15l35J18J51k08
4668f3J1O8j51J23M8J23l66J32K04l32L00k48J20qr4l0J84N4O6l9J30k28K11P3
4692B88m90L85j39R4q7o7j04N2J1j13J47J12k73J92p4J3n5O7N5M8r1k3K29k77
4716a00k04N86j27n7k93J44J07O8m3l37J52J32j65L4O1J00j42J04j15Q2j04K6
4738i1J55n4oK6l2l19K55J08j26J52r4J1j00o8L09ok37J13q6K04p2k59L33Oj95
4763g3J7Q3j86L2m3J40J71q0K36l59j79L79j62M0r9m8J07L1n2O0m6K37o1r2J62
4788B15O1j53j2r3m8K41k43j09J90j4J94l60j26L95j97m1J5K12o9j31Q5l4m1J39
4812G6j0j72J38j60R1K72j12l4n2n9K40o9j03j44J58j67kR5R1o8J20j76P1k54
$$ plain form
4645 23 242 -106 -181 -116 49 62 25 143 205 -21 -119 -86 -1 -134 243 -55 -196 -4 211 -124 -6 145 -63
4668 -63 -52 16 -135 -12 36 159 -207 -75 129 -203 97 -151 -31 -39 -133 -163 21 75 141 102 232 4 215 288
4692 288 -202 183 44 138 51 -16 -120 -68 -57 -170 -23 89 -184 8 -66 -53 -108 -41 14 62 -29 -52 177 -100
4716 -100 -304 282 155 98 -195 -51 56 124 81 -256 -104 28 -137 -103 -42 58 -84 20 -95 -13 -117 -91
4738 -91 64 10 4 30 -2 -321 -66 42 -84 68 -26 -15 -115 -183 126 120 -117 -4 -90 114 42 -217 116 122 -73
4763 -73 -56 27 -159 -127 -170 -30 141 61 297 -62 -241 138 -24 16 -83 -131 -24 7 -45 15 -31 206 145 53 215
4788 215 276 123 111 18 -30 211 -32 -141 49 35 229 -131 -257 138 -59 -100 -85 127 58 -73 12 -22 -63 76
4812 76 66 -106 32 -128 -37 235 123 89 37 -22 218 149 46 -98 60 -107 -109 -14 77 9 129 -47 24 -230
4836b30L67l56L8J39QJ49r0q3k0K87k75n1J66K57l02J25k9j98J63l0p3J23l6k81
$$ plain form
4836 -230 137 -219 -181 -42 -34 115 25 -58 -78 209 -66 -117 49 306 4 129 100 -98 65 35 -38 85 49 -232
$$ [...]
8191G6
##END NTUPLES=NMR FID
##END=
