##TITLE=1H_Pr T-114
 CDCl3, 8 sc, 
 4.9.2020
##JCAMPDX= 6.0         $$ Bruker NMR JCAMP-DX V2.0
##DATA TYPE= NMR FID
##DATA CLASS= NTUPLES
##ORIGIN= UXNMR, Bruker Analytische Messtechnik GmbH
##OWNER= root
$$ XWIN-NMR		Version 3.5
$$ Fri Sep  4 10:46:33 2020 Russian Standard Time (UT+4h)  she@DPX200
##.OBSERVE FREQUENCY= 200.1315066352
##.OBSERVE NUCLEUS= ^1H
##.DELAY= (6, 6)
##.ACQUISITION MODE= SIMULTANEOUS
##.ACQUISITION SCHEME= undefined
##.AVERAGES= 8
##.DIGITISER RES= 18
##SPECTROMETER/DATA SYSTEM= spect
##.PULSE SEQUENCE= zg30
##.SOLVENT NAME= DMSO
##.SHIFT REFERENCE= (INTERNAL, DMSO, 0, 15.7039)
##AUDIT TRAIL= $$ (NUMBER, WHEN, WHO, WHERE, WHAT)
$$ ##TITLE= Audit trail, XWIN-NMR		Version 3.5
$$ ##JCAMPDX= 5.01
$$ ##ORIGIN= Bruker BioSpin GmbH
$$ ##OWNER= she
$$ F:/spectra/data/she/nmr/H-F/1/audita.txt
$$ ##AUDIT TRAIL=  $$ (NUMBER, WHEN, WHO, WHERE, WHAT)
(   1,<2020-09-04 10:45:04.25 +0400>,<she>,<DPX200>,
      <created by zg, POWCHK disabled, PULCHK disabled
       configuration hash MD5:
       00 E9 B6 7A A2 85 ED C7 34 08 36 98 17 FE 4E 26
       data hash MD5: 16K
       06 B6 4E 3E 10 07 A9 15 5E 24 E2 07 AD 8D B7 12>)
$$ ##END=
$$ 
$$ hash MD5
$$ 43 1D 0D DC 05 80 A5 72 B4 29 A4 71 C6 F7 4A C1
##$RELAX= 
##$RELAX= 
##$RELAX= 
##$RELAX= 
##$RELAX= 
##$RELAX= 
$$ Bruker specific parameters
$$ --------------------------
##$DU= <F:/spectra>
##$EXPNO= 1
##$NAME= <H-F>
##$PROCNO= 1
##$TYPE= <nmr>
##$USER= <she>
##$AMP= (0..31)
100 100 100 100 100 100 100 100 100 100 100 100 100 100 100 100 100 100 
100 100 100 100 100 100 100 100 100 100 100 100 100 100 
##$AQSEQ= 0
##$AQ_mod= 1
##$AUNM= <au_zg>
##$AUTOPOS= <>
##$BF1= 200.13
##$BF2= 200.13
##$BF3= 200.13
##$BF4= 200.13
##$BF5= 200.13
##$BF6= 200.13
##$BF7= 200.13
##$BF8= 200.13
##$BYTORDA= 1
##$CFDGTYP= 0
##$CFRGTYP= 5
##$CHEMSTR= <none>
##$CNST= (0..31)
1 1 145 1 1 1 1 1 1 1 1 1 1 1 1 1 1 1 1 1 1 1 1 1 1 1 1 1 1 1 1 1 
##$CPDPRG= <>
##$CPDPRG1= <>
##$CPDPRG2= <>
##$CPDPRG3= <>
##$CPDPRG4= <mlev>
##$CPDPRG5= <mlev>
##$CPDPRG6= <mlev>
##$CPDPRG7= <mlev>
##$CPDPRG8= <mlev>
##$CPDPRGB= <>
##$CPDPRGT= <>
##$D= (0..31)
0 1.2 0 0 0 0 0 0 0 0.06 0 0.03 0 0 0 0 0.0002 0 0 0 0 0 0 0 0 0 0 0 0 
0 0 0 
##$DATE= 1599201903
##$DBL= (0..7)
120 120 120 120 120 120 120 120 
##$DBP= (0..7)
150 150 150 150 150 150 150 150 
##$DBP07= 0
##$DBPNAM0= <>
##$DBPNAM1= <>
##$DBPNAM2= <>
##$DBPNAM3= <>
##$DBPNAM4= <>
##$DBPNAM5= <>
##$DBPNAM6= <>
##$DBPNAM7= <>
##$DBPOAL= (0..7)
0.5 0.5 0.5 0.5 0.5 0.5 0.5 0.5 
##$DBPOFFS= (0..7)
0 0 0 0 0 0 0 0 
##$DE= 6
##$DECBNUC= <off>
##$DECIM= 32
##$DECNUC= <off>
##$DECSTAT= 4
##$DIGMOD= 1
##$DIGTYP= 9
##$DL= (0..7)
0 120 120 120 120 120 120 120 
##$DP= (0..7)
150 150 150 150 150 150 150 150 
##$DP07= 0
##$DPNAME0= <>
##$DPNAME1= <>
##$DPNAME2= <>
##$DPNAME3= <>
##$DPNAME4= <>
##$DPNAME5= <>
##$DPNAME6= <>
##$DPNAME7= <>
##$DPOAL= (0..7)
0.5 0.5 0.5 0.5 0.5 0.5 0.5 0.5 
##$DPOFFS= (0..7)
0 0 0 0 0 0 0 0 
##$DQDMODE= 0
##$DR= 18
##$DS= 0
##$DSLIST= <SSSSSSSSSSSSSSS>
$$ [...]
##$SUBNAM2= <"">
##$SUBNAM3= <"">
##$SUBNAM4= <"">
##$SUBNAM5= <"">
##$SUBNAM6= <"">
##$SUBNAM7= <"">
##$SUBNAM8= <"">
##$SUBNAM9= <"">
##$SW= 16.880792210976
##$SWIBOX= (0..15)
0 0 2 0 0 0 0 0 0 0 0 0 0 0 0 0 
##$SW_h= 3378.37837837838
##$TD= 16384
##$TD0= 1
##$TE= 0
##$TE2= 300
##$TE3= 300
##$TEG= 300
##$TL= (0..7)
0 120 120 120 120 120 120 120 
##$TP= (0..7)
150 150 150 150 150 150 150 150 
##$TP07= 0
##$TPNAME0= <>
##$TPNAME1= <>
##$TPNAME2= <>
##$TPNAME3= <>
##$TPNAME4= <>
##$TPNAME5= <>
##$TPNAME6= <>
##$TPNAME7= <>
##$TPOAL= (0..7)
0.5 0.5 0.5 0.5 0.5 0.5 0.5 0.5 
##$TPOFFS= (0..7)
0 0 0 0 0 0 0 0 
##$TUNHIN= 0
##$TUNHOUT= 0
##$TUNXOUT= 0
##$USERA1= <user>
##$USERA2= <user>
##$USERA3= <user>
##$USERA4= <user>
##$USERA5= <user>
##$V9= 5
##$VALIST= <valist>
##$VCLIST= <CCCCCCCCCCCCCCC>
##$VD= 0
##$VDLIST= <DDDDDDDDDDDDDDD>
##$VPLIST= <PPPPPPPPPPPPPPP>
##$VTLIST= <TTTTTTTTTTTTTTT>
##$WBST= 1024
##$WBSW= 4
##$XGAIN= (0..3)
0 0 0 0 
##$XL= 0
##$YL= 0
##$YMAX_a= 70960
##$YMIN_a= -82357
##$ZGOPTNS= <>
##$ZL1= 120
##$ZL2= 120
##$ZL3= 120
##$ZL4= 120
##$ABSF1= 10
##$ABSF2= 0
##$ABSG= 5
##$ABSL= 3
##$ALPHA= 0
##$AQORDER= 0
##$ASSFAC= 0
##$ASSFACI= 0
##$ASSFACX= 0
##$ASSWID= 0
##$AUNMP= <proc_1d>
##$AZFE= 0.1
##$AZFW= 0.1
##$BCFW= 1
##$BC_mod= 2
##$BYTORDP= 1
##$COROFFS= 0
##$CY= 11.3945322036743
##$DATMOD= 1
##$DC= 2
##$DFILT= <>
##$DTYPP= 0
##$F1P= 16.9975609425685
##$F2P= -3.02152046262296
##$FCOR= 0.5
##$FTSIZE= 0
##$FT_mod= 4
##$GAMMA= 1
##$GB= 0.15
##$INTBC= 1
##$INTSCL= 1
##$ISEN= 128
##$LB= 0.24
##$LEV0= 0
##$LPBIN= 0
##$MAXI= 10000
##$MC2= 0
##$MEAN= 0
##$ME_mod= 0
##$MI= 1.114404
##$NCOEF= 0
##$NC_proc= 0
##$NLEV= 6
##$NOISF1= 3.799351
##$NOISF2= 2.8
##$NSP= 1
##$NTH_PI= 0
##$NZP= 0
##$OFFSET= 15.70392
##$PC= 1
##$PHC0= -9987.212
##$PHC1= 29.6009
##$PH_mod= 1
##$PKNL= yes
##$PPARMOD= 0
##$PSCAL= 0
##$PSIGN= 0
##$REVERSE= no
##$SF= 200.130013532006
##$SI= 16384
##$SIGF1= 3
##$SIGF2= 2
##$SINO= 400
##$SIOLD= 16384
##$SREGLST= <1H.CDCl3>
##$SSB= 0
##$STSI= 0
##$STSR= 0
##$SW_p= 3612.71676300578
##$SYMM= 0
##$S_DEV= 0
##$TDeff= 0
##$TDoff= 0
##$TI= <>
##$TILT= no
##$TM1= 0
##$TM2= 0
##$TOPLEV= 0
##$USERP1= <user>
##$USERP2= <user>
##$USERP3= <user>
##$USERP4= <user>
##$USERP5= <user>
##$WDW= 1
##$XDIM= 8192
##$YMAX_p= 0
##$YMIN_p= 0
$$ End of Bruker specific parameters
$$ ---------------------------------
##NTUPLES= NMR FID
##VAR_NAME=  TIME,          FID/REAL,        FID/IMAG
##SYMBOL=    X,             R,               I
##VAR_TYPE=  INDEPENDENT,   DEPENDENT,       DEPENDENT
##VAR_FORM=  AFFN,          ASDF,            ASDF
##VAR_DIM=   8192,          8192,            8192
##UNITS=     SECONDS,       ARBITRARY UNITS, ARBITRARY UNITS
##FACTOR=    0.000296,      1,               1
##FIRST=     0,             0,               0
##LAST=      2.424536,      0,               0
##MIN=       0,             -82357,          0
##MAX=       2.424536,      70960,           0
$$ Real data points
##PAGE= N=1
##DATA TABLE= (X++(R..R)), XYDATA
$$ [...]
1683b42K71j73P1M6J4NpO7j83j87K62K35k93K01K4J58l91J81j55P7j6k90L25J1
$$ -242 29 -144 -73 -27 -13 -8 -15 52 -131 -318 -56 179 -114 87 111 269 -122 59 -96 -19 -35 -325 0 11
1707A1nk09M02k88K05Pm9j62R2N6q9N2J19k02J10j47N2P4L1p3N1j7j25K35j54
$$ 11 6 -203 199 -89 116 123 74 -88 4 60 -29 23 142 -60 50 -97 -45 29 60 -13 38 21 -104 131 -23
1732b3nj17J00l8j73K05J81l81K48K45l31j32K68L4qJ8L10j79k94K33k57r8K50
$$ -23 -28 -145 -45 -83 -256 -51 130 -251 -3 242 -89 -221 47 81 73 91 401 222 -72 161 -96 -194 56
1755E6k7J40l80L35j08K0O2k08P3K46j60j27M2J31k41J27j79L22n1k54J44o6K3
$$ 56 29 169 -211 124 16 36 98 -110 -37 209 49 -78 -36 95 -146 -19 -198 124 73 -181 -37 -103 -80
1778h0Q9J69k25N1J93k44k5J64l8m5K26k62p8J24K68j34k46J46j41Q5n6J10k82
$$ -80 9 178 -47 4 197 -47 -72 92 54 9 235 -27 -105 19 287 153 -93 53 -88 -3 -59 51 -231
1801b31L99q9M4k10m5J94j54Q3P6j5m7j00J13q0R7J0p7Nj03J7J72o2j03j69L51
$$ -231 168 79 123 -87 -132 62 -92 -9 67 52 5 -95 18 -62 35 45 -32 -27 -130 -113 59 -3 -106 -275 76
1826G6j77K1j22j62M39n3J09m5l5J54k04j94K04j9J34l02R6J72j08J62J8k03K40
$$ 76 -101 -80 -202 -364 75 22 131 86 51 205 1 -193 11 -8 126 -176 -80 92 -16 146 164 -39 201
1849B01l40Q0k21N85l31%K1K40l91M15j97M3j29R2Q6k53O7p2k59L47J16K6k88
$$ 201 -139 -59 -280 305 -26 -26 -5 235 -156 259 62 105 -24 68 154 -99 -32 -104 -363 -16 100 126 -162
1872a62J32J10j08j32M18l73Q0J14l24J67J75j92k3M9j53K70j19nR8l8M3J64j49
$$ -162 -30 80 -28 -160 258 -115 -35 79 -245 -78 97 -95 -118 -69 -222 48 -71 -76 22 -16 27 191 42
1895D2k20L58n2j99p5J51J33k77L72k32l8N6j24N5J11J9l6j86P5R3j03K4r8L4
$$ 42 -178 180 128 -71 -146 5 138 -139 233 1 -37 19 -105 -50 61 80 44 -142 -67 26 -77 -53 -151 -117
1919a17J6K74j04j76l4K09k20J83r7N0J16k66K34k84J05l2j3O0P8J80j48r4m7
$$ -117 -101 173 69 -107 -141 68 -152 31 -66 -16 100 -166 68 -216 -111 -143 -156 -96 -18 162 14 -80 -127
1942a27J8p2J78l34L60j21r3J55N9j9m3K1j8R8r4M0P0j14J53j83L4K7jJ18l01
$$ -127 -109 -181 -3 -337 23 -98 -191 -36 23 4 -39 -18 -36 62 -32 8 78 -36 117 -66 -32 -5 -6 112 -189
1967a89N08l31k07K19n1K1J23j46m2K37n4L0n11M67k00K26j22K75k02j09J27n4
$$ -189 319 -12 -219 0 -51 -30 93 -53 -95 142 88 118 -393 74 -126 100 -22 253 51 -58 69 15
1989A5p2n9J84N4Q1j65%M9m5R3K04n06R1K7RJ13k11j88L20l8L8j05K45p6k8q3
$$ 15 -57 -116 68 122 203 38 38 87 42 135 339 -167 -76 -49 -40 73 -138 -326 -6 -44 -6 -111 134 58 30 -53
2015e3Q1j14j61M71k58J95o0m67L05J54L2L9k1j93j66K67q3J47r2k0k8j9K41j78
$$ -53 28 -86 -247 224 -34 161 101 -366 -61 93 125 164 143 -50 -216 51 -32 115 23 3 -25 -44 197 19
2039A9r0k1K2o4N5J67j41J6M7J07l2Q4j81J45k9p8j59K46j36%q0m3J41j46qp4
$$ 19 -71 -92 -70 -134 -79 88 -53 -37 10 117 85 169 -12 133 104 26 -133 113 -23 -23 -103 -146 -5 -151 -159 -233
2065b33L61k52K34p3j97M1P4R9L0L28l1k19m5k49j73K53n3K51l99K42K02l00K40
$$ -233 128 -124 110 37 -160 -119 -45 54 84 412 381 162 117 -132 -305 -52 -105 146 -253 -11 191 -109 131
2088A31l2l5n5p8J46k53K2K21k00J40m6O1J63m69L15j20n6L69k58L48k63NJ7k77
$$ 131 99 64 9 -69 77 -176 -154 67 -133 7 -39 22 185 -284 31 -89 -145 224 -34 314 51 56 73 -204
2112b04M08j68M2k22J66K17k28Q5k7N8l01K48j52Q2J6j41L1o5J97j14J72p5k41
$$ -204 204 36 78 -144 22 239 11 96 69 127 -174 74 -78 4 20 -121 -90 -155 42 -72 100 25 -216
2135b16J96R5J0K20l26M4j80J85O2k56K52jk06J52Mj89J87r8J27j32K02j08K9
$$ -216 -20 75 85 305 -21 23 -157 28 90 -166 86 85 -121 31 35 -154 33 -65 62 -70 132 24 53
2158E3j10l9R2j07k6K04k68L22k78L12l14J22J71j19j59J17J09j82J48R5j50j57
$$ 53 -57 -96 -4 -111 -137 67 -201 121 -157 155 -159 -37 134 15 -144 -27 82 -100 48 143 -7 -164
2180a64K9J19N3n6k43N20r6j65qk14M07k26k21K05k0o4J67r6J7j83L41k11K33
$$ -164 -135 -16 37 -19 -262 258 162 -3 -11 -225 182 -44 -265 -60 -80 -144 23 -73 -56 -239 102 -109 124
2203A24p1j58j7j58K40L0Qn8j8l9K13J03r6L8l21J44n0n8N5p7K29K5Nk16K24l89
$$ 124 53 -105 -122 -280 -40 -10 -2 -60 -78 -117 96 199 103 141 -180 -36 -86 -144 -89 -166 63 88 93 -123 101 -288
2229b88M61j33j50K17k72K34%k23J19J39j69n9J37J62j60J99k48M1N3l02J27L08
$$ -288 173 40 -110 107 -165 69 69 -154 -35 104 -65 -124 13 175 15 214 -34 7 60 -242 -115 193
2251A93m4k58n6L32l06QK3K43k98o3K42j21J84k20J72m6j08P6pJ14j9r6N7J02
$$ 193 149 -109 -165 167 -139 -131 -108 135 -163 -226 16 -105 79 -141 31 -15 -123 -47 -54 60 41 -55 2 104
2275A04j37k70J94K34q5K7k3k77N9J06j01O9P5J92j11k90R7j35M48l43J65k07
$$ 104 -33 -303 -109 125 40 67 44 -233 -174 -68 -169 -100 -25 167 56 -234 -137 -272 176 -167 -2 -209
2297b09J77o5J99j8J03l14O6J37J1j33J17j4LJ1N2j30n5k33L32m4j7L4l8l5o5
$$ -209 -32 -97 102 84 187 -127 -61 76 87 -46 71 57 60 71 123 -7 -62 -295 37 -7 -24 10 -28 -63 -128
2322a28N27m59J10O3l82K35l9k33N46m16J72J28n9l0j65m7K29n3J3r5m0K98j97
$$ -128 399 -60 50 113 -269 -34 -73 -306 240 -176 -4 124 65 35 -130 -177 52 -1 12 -83 -123 175 -22
2345b2JK49q9k49J70p1p8q7K32k25L10Pj10l3J49k0j36j30J34p7jK4Q8N5M9j59
$$ -22 -21 228 139 -110 60 -11 -89 -176 56 -169 141 148 38 5 154 134 -2 -132 2 -75 -76 -52 36 91 140 -19
2371a9k26K03j30J03Q3R7r9n7K1P2p0J31j12o3K08j23o9K08l16O6L5K37o6j83
$$ -19 -245 -42 -172 -69 14 111 12 -45 -24 48 -22 109 -3 -66 142 19 -50 158 -158 -92 -57 180 114 -69
2395f9Rq1K7J27N9oO4j51m4Q5k14J20L6j68L82r0P8j96P6k4k08L95j94o2M23j64
$$ -69 -60 -141 -114 13 72 66 130 -21 -65 20 -194 -74 -38 -206 176 86 164 -32 44 20 -188 207 13 -49 374 210
2421B10n13L54j85K61J36j91j62J43J03l29K18N9L2j85mk26K87r7M8M7J26J4n5
$$ 210 -303 51 -134 127 263 72 -90 53 156 -173 45 104 136 -49 -53 -279 8 -89 -41 6 132 146 91
2444I1L3k45J89J66l56L2O6p6J7o8K34P0l70J61K32p9j71N9j61K12K00k57O3J87
$$ 91 124 -121 68 234 -122 -90 -24 -100 -83 -151 83 153 -217 -56 176 97 -74 -15 -176 36 236 -21 42 229
2468B29j31j51K17j58L2k64L99j16j22J52p0k3K9K1l00K41J08O1j74r9J73o0j64
$$ 229 98 -53 164 6 38 -226 173 57 -65 87 17 -6 23 44 -256 -15 93 154 -20 -119 54 -6 -170
2491a70K56l36N01k46k50K93n2j2j30R0p2L03r5j06M9M7M8K3k13R4j11K74k13
$$ -170 86 -250 251 5 -245 48 -4 -16 -146 -56 -128 175 80 -26 23 70 118 141 -72 22 -89 185 -28
2514b8j22K98j39pN6j71j33J18L8j1p9N08l75J47j42J47p5j24J71j29j9K33l03
$$ -28 -150 148 9 2 58 -113 -246 -128 -90 -101 -180 328 -47 100 -42 105 30 -94 77 -52 -71 162 -141
2537a41L16o9o8j2P9j6p5r5L30k01n2Pj23Q3r1L1l2L34n42K22J25m2J85n0K4j20
$$ -141 175 106 38 26 105 89 14 -81 249 48 -4 3 -120 -37 -128 -97 -129 205 -337 -115 10 -32 153 103 127 7
2563Gn1K48l62K56k04J29k5K4M7j64j7K04m3l55L20r6J92j76PJ54o4k42J85k09
$$ 7 -44 204 -158 98 -106 23 -2 22 69 -95 -112 92 49 -306 14 -82 110 -66 -59 95 31 -211 -26 -235
2587b35mJ31J45k58K14J24k4j6N0k36N3J6J41j32J69r6j8l1j13L60m21K27J1q5
$$ -235 -239 -108 37 -221 -7 117 93 77 127 -109 -56 -40 101 -31 138 42 24 -7 -120 240 -181 46 57 -28
2611b8r4O9p9j6J28J12J33j54p2l2K02k31N5k58K34K20k25o6K6k7j18J00K56r0
$$ -28 -122 -53 -132 -148 -20 92 225 71 -1 -33 169 -62 -7 -265 -31 189 -36 -102 -76 -103 -221 -121 135 45
2635D5M9k0o0r4J5K17O2k73q5j96K98J16j19P6j6n2q9j9K9J80k79M04k46n7J08
$$ 45 94 74 14 -80 -65 152 214 -59 -144 -340 -42 74 -45 31 15 -37 -126 -145 -116 64 -215 189 -57 -114 -6
2660fO5J06k53J92j62k3nj25M44j67j63J1R5j31L06k04j78K76n3q2j6J7K8J62
$$ -6 59 165 -88 104 -58 -81 -86 -211 233 66 -97 -86 9 -122 184 -20 -198 78 25 -57 -73 -56 -28 134
2684A34k39J90l6j52J06K70j54p3J84k07p3j44K61J58l71K00P4k47K17K8kr9K14
$$ 134 -105 85 49 -103 3 273 119 46 230 23 -50 -194 67 225 -146 54 128 -119 98 126 124 25 239
2707B39k34J75j86L8r8P0L2k2k02K06q2PK5q0K12M5p4m8j08l1K34o6j48Q4K62
$$ 239 5 180 -6 32 -66 4 36 14 -188 18 -64 -57 -32 -112 100 145 71 23 -85 -116 118 52 -96 -12 250
2732B50j2j99R7j31k8J18l00L69j69M0k7j66L21j07j99J40m2j00n2L6K79k86K51
$$ 250 238 39 136 5 -23 95 -205 164 -5 35 8 -158 163 56 -143 -3 -45 -145 -197 -161 118 -168 83
2755H3R7k57J75j72J36j08Q7j95j19K90J08m1pL0k49K15j37R8j55J07n5R4j0J09
$$ 83 180 -77 98 -74 62 -46 41 -154 -273 17 125 84 77 107 -142 73 -64 34 -121 -14 -69 25 15 124
2779A24o4K50k82J12k16P1K40r1l23J98J48k18o7P0k00J31J4j19L44r1j39J29
$$ 124 60 310 28 140 -76 -5 235 144 -179 19 167 -51 -118 -48 -248 -117 -103 -222 122 31 -108 21
2801B1o0J1J3j11K73q5j59J84j06M4J74j78J95m17K13J9j82lL64j70o3J40k89
$$ 21 -39 -28 -15 -126 147 62 -97 87 -19 25 199 21 216 -201 12 31 -151 -154 210 40 -23 117 -172
2824a72J26%l5J59o1l8J73k53K26k12K21m5q5J49j81O4N6j06mj41L31k47K93k17
$$ -172 -46 -46 -81 78 17 -21 152 -101 125 -87 134 89 4 153 -28 36 92 -14 -18 -159 172 -75 218 1
2848AN7j12K0J55j85N7j56K68J2j27J48q8O3o9J35j57j34N4j5J37J16l35J03K02
$$ 1 58 -54 -34 121 -64 -7 -163 105 117 -10 138 50 113 44 179 22 -112 -58 -73 64 180 -155 -52 150
2872A50q6j37LM1M6K11l24L2Q6OP0j80nj73K42J00j26O0j47Q9N7Rk35k18O23l03
$$ 150 64 -73 -70 -29 17 228 -96 -64 22 28 98 -82 -87 -260 -18 82 -44 16 -131 -42 15 24 -211 -429 194 -109
2898a09J27O1k75J31J70k15M49l93J73j11n5j30J34K88m17J57j6N6k51M6J48R
$$ -109 18 79 -196 -65 105 -110 339 -54 119 8 -47 -177 -43 245 -172 -15 -31 25 -226 -180 -32 -23
2920b3K0l02L53j58K95n8P9l95O0K36l9O7j43K65m45J46J81k56k1R7k4Q8k03J15
$$ -23 -3 -305 48 -110 185 127 206 -189 -129 107 68 135 -8 257 -188 -42 139 -117 -138 -41 -65 23 -180 -65
2944f5J16J02k47k0J68j41J42j55L35j85j52J05o5k8J10K0k60J62J29p5J38k58
$$ -65 51 153 -94 -114 54 -87 55 -100 235 50 -102 3 -62 -90 20 40 -220 -58 71 -4 134 -124
2966a24J42M0j41R3Qlj15J51j80L04l25P0K06j67J25K6k7Q3k23j28L97m69J10
$$ -124 18 58 -83 10 18 15 -100 51 -129 175 -150 -80 126 -41 84 110 83 166 -57 -185 212 -257 -147
2989a47J33j14J85j17J92k80m3J80j20K78l48M08j36L1%l13L36k18J76k12K30
$$ -147 -14 -128 57 -60 132 -148 -191 -11 -131 147 -201 207 71 102 102 -211 125 -93 83 -129 101
3010A01k12L7K90k41j38L37j73O8j83J85M1j90K22k88J75j44M4J01lj99J28P1
$$ 101 -111 -74 216 -25 -163 174 1 69 -114 71 112 -78 144 -144 31 -113 -69 32 29 -170 -42 29
3032B9J51k27J45pj71n3J79k03R1P3j55K37L4j20J28n3j45Q1o8J93k4P3l78J75
$$ 29 180 -47 98 91 -80 -133 46 -157 -66 7 -148 89 123 3 131 78 -67 14 -54 139 115 188 -190 -15
3056a5J49J54k31j90K28j37K31j35L6k14J32j88J80k31L38Nk09K09j78qP6O7P3
$$ -15 134 288 57 -133 95 -42 189 54 90 -124 8 -180 0 -231 107 112 -97 112 -66 -74 2 69 142
3079A42j80K46k61k8m2J61r4J72J27k70K61k20J5j64m9M40n58M46L7k21L9j66
$$ 142 -38 208 -53 -81 -123 38 -56 116 243 -27 234 14 29 -135 -184 256 -302 144 181 -40 -1 -167
3101a67J29J88j34j54r8M02J02m24J90Jj73p8J08J62k0j7K4k3l8LM9p2n3J04J49
$$ -167 -38 150 16 -138 -236 166 268 -156 34 35 -138 -216 -108 54 34 17 41 18 -20 -17 32 -40 -93 11 160
3126A60l08r4M94kk80N0O7l0j04j3L27l03k9J22j65K7M9L2J37j7j82n5R9J61k61
$$ 160 -148 -242 252 250 -30 20 87 57 -47 -60 267 -36 -65 57 -108 -81 -32 0 137 120 -62 -117 -18 143 -118
3151a18p2J73M33m55j30L50j00m6o6L1K52rk80j00J58P1k38JK64K8m53K17J18
$$ -118 -190 -17 416 -39 -169 181 81 35 -31 0 252 243 -37 -137 21 92 -146 -145 119 147 -306 -89 29
3174B9p1J0k6K52k12L7j86O7J39k67K64o0J80j47L8nr2r3J47j3L2k5lK77k91k4
$$ 29 -42 -32 -58 194 -18 19 -167 -100 39 -228 36 -24 156 9 47 42 -50 -143 4 -9 23 -2 -5 272 -19 -43
3200d3kK67m33Q4J46J77k21J86k07J24P2k33J12M6J5P7j53r9R4J06k48K34Q4p7
$$ -43 -45 222 -211 -127 19 196 -25 161 -46 78 150 -83 29 75 90 167 14 -85 9 115 -133 101 185 108
3224A08k35J87K6j28K6j18J03p9J53j87K77q6m8j32K65k69O4O1q1N9j32J06K66
$$ 108 -127 60 86 -42 -16 -134 -31 -110 43 -144 133 47 -1 -133 132 -137 -73 -12 -93 -34 -166 -60 206
3247B06j95p7L00R1k36k27J94J1p7J56k43J12q3p0J62l1N3k27K25l9J34j57J92
$$ 206 11 -66 234 325 89 -138 56 67 -10 146 -97 15 -68 -138 24 -7 46 -181 44 5 139 -18 174
3270A74k23K18j07m2J20j49k9J12k52K20Oj36O9K08j3m02J49N2J48j90k0L00j49
$$ 174 -49 169 62 20 140 -9 -38 74 -178 42 48 -88 -19 189 176 -226 -77 -25 123 -67 -87 213 64
3293F4l26L74j01l7j20J21p1N6J58k30L21r4j84K9O5j18p6K45L9j27P2l14L20
$$ 64 -262 112 11 -26 -146 -25 -96 -40 118 -112 209 115 -69 -40 25 -93 -169 76 115 -12 60 -254 66
3316F6j28K77m78L69J58k50M0m6J62k52J88j81l6j67L12J43m0m2m2k10K16P7r
$$ 66 -62 215 -263 106 264 14 54 8 170 -82 106 -75 -111 -278 34 177 137 95 53 -157 59 136 127
3339A27j57K82k73J5j29K8P3r7J70%q2r6k9K10j78J95j28jk2j5R8k74M09m10O7
$$ 127 -30 252 -21 -6 -135 -107 -34 -131 39 39 -43 -139 -168 42 -136 59 -69 -70 -92 -107 -9 -283 126 -284 -217
3364b17J43n5J02k1N6J37K6k94ML55m41L24r0o9K32r0l88K68j5q0K2j96K12Q8
$$ -217 -74 -129 -27 -48 8 145 171 -123 -119 236 -205 119 29 -40 192 102 -286 -18 -33 -113 -91 -287 -75 13
3388A3r3j46k8M1J1J83J87p2q3N5J07j51j52q7L18j23K32k64J1P4j2L6M0j24N0
$$ 13 -80 -226 -254 -213 -202 -19 168 96 13 68 175 24 -128 -215 103 -20 212 -52 -41 33 21 57 97 -27 23
3413B3j44J61q9K83j87k35K69L6k30q2L82j92j14K61k14M2P7k69L13j13K03l89
$$ 23 -121 40 -49 234 47 -188 81 117 -113 -195 187 -5 -119 142 -72 -30 47 -222 91 -22 181 -208
3435b08J42K14j51k0k37J18J75Q9l41K03O4J32j56k51K13l6k19M08K1l2l93J99
$$ -208 -66 148 -3 -23 -260 -142 33 122 -219 -16 48 180 24 -227 -14 -50 -269 139 160 128 -265 -66
3457f6R1J39j98K4j04K80l17K47j64r1M26l04l5K4M38m29J25Q0k29O1J70j31j8
$$ -66 25 164 -34 -10 -114 166 -151 96 -68 -159 267 -37 -72 -48 390 -39 86 166 -63 -2 168 37 19
3480A9k6p7M54l79J49Oj73oJ75j87R7j99L02l62L36k02J29p5P5N2j32P6K86k17
$$ 19 -7 -84 370 -9 140 146 -27 -33 142 -45 52 -147 155 -207 129 -73 56 -19 56 108 -24 52 338 121
3504A21P1o7k96rL11K0j8k52qK22k31K15K3N2l04k8J56P3J21n7j30j33LR7K51
$$ 121 192 125 -171 -180 131 151 133 -119 -127 95 -136 79 102 154 -150 -178 -22 51 172 115 -15 -148 -145 -48 203
3529B03k46Q4M7qj8J1k04J53r3L47k74L5n3n8J95L9Mj52M9j62K47o3k13M9L5J3
$$ 203 -43 41 88 80 62 73 -131 22 -71 276 2 37 -16 -74 121 160 164 12 61 -101 146 83 -130 -81 -46 -33
3555c3K46j45j76J14J6Q0Q2m38L22j71n2K14R8l03N4jL26m65K26J86k28m8J04
$$ -33 213 68 -108 6 22 102 184 -254 68 -103 -155 59 157 -146 -92 -93 233 -232 -6 180 -48 -96 8
3578HL9P6j85r7M49j78j28J26J34k23k8j98K84q0j00K00J48l42L31j52k82J04
$$ 8 47 123 -62 -159 290 112 -16 110 244 21 -7 -205 79 -1 -101 99 247 -95 236 84 -198 -94
3600i4J49r6J63j58k6M4j14K20k2j73qR8L5o4p0N7J74k14J17N1N6j29J73j01r9
$$ -94 55 -41 122 -36 -62 -18 -132 88 66 -107 -115 -17 18 -46 -116 -59 115 -99 18 69 125 -4 169 68 -31
3625c1J2j20K56j41j58l4J40K24k88K61j51o6J36K99m98K45K9j35q2K87m45L93
$$ -31 -19 -139 117 -24 -182 -216 -76 148 -140 121 -30 -96 40 339 -159 86 115 -20 -102 185 -260 133
3647A33r1K57o04M03q1p7P1j88J81j4P7l2N2m4J42j12j77R3M7j34K00L4j68K63
$$ 133 42 299 -305 98 17 -60 11 -177 4 -10 67 35 87 43 185 73 -104 -11 36 -98 102 136 -32 231
3671B31k91N8m6j09R5j18O9M8J21j01j27K75J8n2k31L10m6L1M3l08L2J67l7j35
$$ 231 -60 -2 -48 -157 -62 -180 -111 -63 58 -43 -170 105 123 71 -160 150 104 135 178 -130 -98 69 32 -103
3695a03R9n0MK40m37K15M7LO1j45J60J12k38p6n4K91n1l8j16P5k2L7j42J73j94
$$ -103 -4 -54 -50 190 -247 -32 15 18 79 -66 94 206 -32 -108 -162 129 78 40 -76 -1 -23 14 -128 45 -149
3720a49jJ70l4j41N1L31l51K4k2j9L70k48K51j57j38K49j55j99J59j42Q1o5J62
$$ -149 -150 20 -14 -155 -104 227 -124 -100 -122 -141 229 -19 232 75 -63 186 31 -168 -9 -151 -70 -135 27
3743B7J2o1K23l92J2J02J1L19k27j4o3p1Q3N4M4n0Q1j44L6N7O7j72j65Q2K82k39
$$ 27 39 -22 201 -191 -179 -77 -66 253 26 12 -51 -122 -39 15 59 9 90 -54 -18 39 106 -66 -231 -149 133 -106
3769a06K56j17j10J39l2J72j22j70j32K03J48p7l4Qj03o4M00k00%k11R4K03j61
$$ -106 150 33 -77 62 30 202 80 -90 -222 -19 129 52 18 26 -77 -141 259 59 59 -152 -58 145 -16
3792a6q1Nj96JJ88K84j98J06j28J47k36j60K96m2P7R2l40L05n5j47J0P0N8j02
$$ -16 -97 -92 -288 -287 -99 185 -13 93 -35 112 -124 -284 12 -30 47 139 -201 104 49 -98 -88 -18 40 -62
3816f2O0k3j33M2j6K48O4p4k28J71j10l4J34j29q4q3M39l54K88j42Kq2J98o9n2
$$ -62 -2 -25 -158 -116 -132 116 180 106 -122 49 -61 -95 39 -90 -174 -257 182 -172 116 -26 -24 -106 92 23 -29
3841b9r3J83p4J70j85J82n4k7j37K2j16J38k6R0oP0j38k14K82K9j58j7K34k39
$$ -29 -122 61 -13 157 -28 154 100 73 -64 -42 -158 -20 -46 44 38 108 -30 -244 38 67 -91 -108 126 -113
3865a13P5K28l01j09L05R3k10j4Q6p7R2n3l2K4j69L5K43j88R1Q5n4kK31j26ql76
$$ -113 -38 190 -111 -220 85 178 -32 -46 40 -37 55 2 -30 -6 -175 -140 103 -85 6 91 37 35 266 140 132 -244
3891b44K39N7j15J88j58k24M16j72k01J60o4L07l35J89q3j1RM6k3MK4q0J81l95
$$ -244 -5 52 -63 125 -33 -257 159 -13 -214 -54 -118 189 -146 43 -40 -51 -42 4 -19 -15 9 -71 110 -285
3915b85L71q8m1J4J54l81K33j8K08q8k9j12j0K0J41k83J08J13J04k49O7M4j92
$$ -285 86 -2 -43 -29 125 -256 -23 -41 167 79 50 -62 -72 -52 89 -194 -86 27 131 -118 -51 -7 -199
3938a99K31q6J2q1O9M13m43l1L0j02K34J15k99n4J70J91n7l67R8J52k8j66J49
$$ -199 32 -54 -42 -123 -54 359 -84 -115 -85 -187 47 162 -137 -191 -21 170 113 -254 -156 -4 -32 -198 -49
3961d9N7j65L47l75J04Q8j9M6Q1j28K22k20Nj73K00q5q5J05N4J18j53J01l3n0
$$ -49 8 -157 190 -185 -81 7 -12 34 115 -13 209 -11 -6 -179 21 -64 -149 -44 10 128 -25 76 43 -7
3985gJ22j51K19k81J80j35J02o6r0M9K24k10J24n8p6q7K05J06k2j59L6J45j94
$$ -7 115 -36 183 -98 82 -53 49 -17 -107 -58 166 -44 80 22 -54 -141 64 170 148 -11 25 170 -24
4008b4L8J6L1R7j4l53J90J36l06J94K02l12L17k46R4p6O1m7J64k42m1r6p4L32
$$ -24 14 30 61 158 144 -209 -19 117 -189 5 207 -105 212 -34 60 -16 45 -2 162 -80 -121 -217 -291 41
4032D1j16l6j08J29O8K0J6o3L51o09K81K08r1m6P8l23J29L7o7n5M30l20J87k71
$$ 41 -75 -111 -219 -90 -22 -2 14 -49 302 -307 -26 182 91 45 123 -200 -71 -34 -101 -156 274 -46 141 -130
4056a30J72j48k9J9J50m8k26L74j36J14j80K67k89J55k93J06J84k85J23n7L55
$$ -130 42 -106 -135 -116 34 -14 -240 134 -2 112 -68 199 -90 65 -228 -122 62 -223 -100 -157 198
4077A98l1k34j87J65j70J75j05J21Q1K1j2K9n2J57m2m33M18p2K04k74P5j10j95
$$ 198 167 -67 -254 -89 -259 -84 -189 -68 13 34 22 51 -1 156 114 -319 99 27 231 -43 32 -78 -273
4100b73J52K4q5J31K00j51J54j93j23K09K00j38m5j02j77R6j06K61n5J05M6k47
$$ -273 -121 -97 -182 -51 149 -2 152 -41 -164 45 245 107 62 -40 -217 -121 -227 34 -21 84 130 -117
4122a17K02l9j25J89j60M2Q7j75J32Pp4K25m02J58o3j49M67l83J45p5J04N6j73
$$ -117 85 46 -79 110 -50 -8 79 -96 36 43 -31 194 -208 -50 -113 -262 205 -178 -33 -108 -4 52 -121
4145a21L41j78nj15J74j78q7K08j05J54%j36J00k0o5m0j2K78k20q0K91j35l82
$$ -121 220 42 37 -78 96 -82 -169 39 -66 88 88 -48 52 32 -33 -73 -85 193 -27 -107 184 49 -333
4168c33K84J26q0j51j3L9K32j57l4O2j02P3J91j49kK4m16M62l69K58L2j51J85
$$ -333 -49 77 -3 -154 -167 -128 104 -53 -87 -25 -127 -54 137 -12 -14 10 -406 56 -313 -55 -23 -174 11
4191A1p3K8j04K05j10k35L04j50K31j43j64K22k70J09K63k73K61N6l08J45k57
$$ 11 -62 -34 -138 67 -43 -278 26 -124 107 -36 -200 22 -248 -139 124 -149 112 168 -140 5 -252
4212b52M94j49L7j55O3K05k99r6J66o7l7O3J11M2j66J8M5j56p8K52k0n3j04Q0
$$ -252 242 93 130 -25 38 243 -56 -152 14 -53 -90 -27 84 126 -40 -22 23 -133 -211 41 21 -32 -136 -56
4236e6M5K51j42j16j23Q0N1P5J7l5j05j1R7j19J76k70K32l8N8o5j29J31M7j75
$$ -56 -11 240 98 -18 -141 -61 -10 65 82 47 -58 -69 28 -91 85 -185 47 9 67 2 -127 4 51 -124
4260a24K71n8j82J19K20j94M3Mj0l4j6l28K22Om6M57k24q3r9K06j29J19k62Q4
$$ -124 147 89 -93 26 246 52 95 99 89 55 39 -289 -67 -61 -107 350 126 43 -56 150 21 140 -122 -38
4284c8J11p4K8Lj71M75n47J28q6K19j43K12j00J2q8j62L42k15q4k7J4N7K91j70
$$ -38 73 -1 27 30 -141 334 -213 -85 -171 48 -95 117 17 29 -59 -221 121 -94 -178 -205 -191 -134 157 -13
4308a3K10o5k53J88m6n5J32k20L46k44j61L82k97R8J89l86q7K74j19L01k7j97
$$ -13 197 132 -121 67 21 -34 98 -122 224 -20 -181 201 -96 2 191 -195 -282 -8 -127 174 147 -50
4330e0J64j68M6n7k5J36j32R1j65n9J59J8l7j27k2K12j05J92M5j81K91l69M0J74
$$ -50 114 -54 -8 -65 -90 46 -86 5 -160 -219 -60 -42 -79 -206 -228 -16 -121 71 116 -65 226 -143 -103 71
4354G1J6j29K41k42nJ11j27J05j2m0q7J7K99m28L40j82J12m4p6O3j98K77n9N8
$$ 71 87 -42 199 -43 -48 63 -64 41 29 -11 -98 -81 218 -210 130 -52 60 16 -60 3 -195 82 23 81
4378H1R7j98JQ2k88K4K38j42J32R8k62K72n4l04J92J44k2j39l1K44j84R3j39K86
$$ 81 178 -20 -19 63 -225 -201 37 -105 27 125 -137 135 81 -223 -31 113 91 -48 -79 165 -19 74 -65 221
4402B21n5j72J27j1j48r4K05r9k0J11j63J62l6q3k5o5K57k85M5M3j68L61k15J86
$$ 221 166 -6 121 110 -38 -132 73 -26 -46 65 -98 64 28 -55 -80 -145 112 -173 -128 -85 -253 108 -107 79
4426G9k50J53NP4O2o3qok9M9R0j69m4k40M53o7p5r7j16R0J8K22k84J48j33J01
$$ 79 -171 -18 -13 61 123 60 52 46 17 66 156 -13 -57 -297 156 89 14 -83 -199 -109 -91 131 -153 -5 -138 -37
4452c7J68j16M8J47o2k42M28l63j3rN4n2J63j97J9J02k30P0P3L5K6p9J43o5N8
$$ -37 131 15 63 210 148 -94 334 -29 -42 -51 3 -49 114 -83 -64 38 -192 -122 -49 -14 12 -67 76 11 69
4477F9j75K16p1Q8M3n9k82P6O1j9L1k06J58J45n6P9J2k20J58N0j95n1L8K46r9
$$ 69 -106 110 39 127 170 111 -171 -95 -34 -53 -22 -228 -70 75 19 98 110 -110 48 98 -97 -148 -110 136 37
4502C7O5k02K58k6j26J17J66k45k96K62r6K2P1j14M5j12m6K65n4N3J17l64L35
$$ 37 102 -100 158 132 6 123 289 44 -252 10 -86 -64 7 -107 -62 -174 -220 45 -9 44 161 -203 132
4525A32j23J89j59J21j99J26M8o4n9J0j75J99j62K80k16M3oo5j00P9P4N6q5KJ75
$$ 132 9 198 39 160 -39 87 135 71 12 22 -153 46 -116 164 -52 -9 -15 -80 -180 -101 -27 29 -56 -54 121
4550A21k00M5J44o4j65lJ03p6n4L8J82K9K9L4j96P0j7l1j45L58q2j41J04nr0j70
$$ 121 -79 -34 110 46 -119 -122 -19 -95 -149 -111 71 100 129 163 -33 37 20 -11 -156 202 120 -21 83 78 -12 -182
4576a82J66K6q7J13lm08K77JJ0J59J6J33l17J07k53J91m6O6P8n02N19j3P6j64
$$ -182 -16 10 -77 36 33 -375 -98 -97 -87 72 88 221 -96 11 -242 -51 -97 -31 47 -455 64 51 127 -37
4600c7N2k2k5n5R1j32J40k40K02k00L28k96K40j69L45l09P9j8J03j50L6N4j62
$$ -37 15 -7 -32 -87 4 -128 12 -228 -26 -226 102 -194 46 -123 222 -87 -8 -26 77 -73 -37 17 -145
4623a45K49Q3l68K34Q3j77r6N9m0Q5r6kK4O4k10K33j04J47p8R6k6J4m2l4N8j54
$$ -145 104 187 -181 53 136 -41 -137 -78 -118 -33 -129 -131 -107 -43 -253 -20 -124 23 -55 41 15 29 -13 -47 11 -143
4649a43J03j12Q8l7K53k09K3J9L09n08L50M1K7k76k3K59j71m7K35k67L37k10N4
$$ -143 -40 -152 -64 -101 152 -57 -34 -15 294 -214 136 177 204 -72 -95 164 -7 -54 181 -86 251 41 95
4672I5L1k89M9N0J23j39L94m17m0R0K17j46L6j54K46n9J48l38N8J56K6l91K9M01
$$ 95 126 -163 -114 -64 59 -80 314 -103 -143 -53 164 18 54 -100 146 87 235 -103 -45 111 137 -254 -225 176
4696A76r9m0l1J01k07k16L20k25O0Rm3K81r0J19j89k14N3J22K51J20m62L01k11
$$ 176 77 37 6 107 -100 -316 4 -221 -161 -152 -195 86 -4 115 -74 -288 -235 -113 138 258 -204 97 -114
4719a14K11j04J00j15o5P7J25j86N6J2O1j17j18Q1q7j4J03K74l49L8J43J39L8
$$ -114 97 -7 93 -22 -87 -10 115 -71 -15 -3 58 -59 -177 -96 -183 -197 -94 180 -169 -131 12 151 189
4742A89k90K00j97K22k94L87k93J17j27L87m13K02N4j80Q5j13m8K23l1Rk40J41
$$ 189 -101 99 -98 124 -170 217 -76 41 -86 301 -112 90 144 -36 49 -64 -112 111 80 89 -151 -10
4764a0K6j44j2K02m1pJ67j53R5j19Kj7J19M2j42k03K40Qj69m3J59k9M6J41j74
$$ -10 16 -128 -140 62 21 14 181 28 123 4 6 -11 108 150 8 -195 45 53 -116 -159 0 -29 17 158 -16
4789a6J09J7j91K51k44k32N50m5j78K03l63K68k28J10j40o0J28J57r3j35J39k17
$$ -16 93 110 -81 170 -74 -306 244 199 21 224 -139 129 -99 11 -129 -189 -61 96 3 -132 7 -210
4811b10R0Q7l7J92j91J8R6K6j83L7K39P3j81k93M43l05j1N8J31mM7k50J90o3N3
$$ -210 -120 -33 -70 122 -69 -51 45 71 -112 -75 164 237 56 -237 206 -99 -110 -52 79 75 122 -128 62 -1 52
4836E2Q8l29J7K67k4J8j68R0On3N2l1R9j95MO2k48L19m3J33k76J86O9r2O2O7j25
$$ 52 140 -189 -172 95 71 89 -79 11 17 -36 16 -15 84 -111 -107 -45 -293 26 -17 116 -160 26 95 3 65 132 7
4863Gk0R5j52J32j43J2L39j72j36%J88J7j66q0R9N7J18k53o0J73o6n3J91K37j85
$$ 7 -13 82 -70 62 -81 -69 270 98 -38 -38 150 167 1 -79 20 77 195 -58 -118 55 -11 -64 127 364 179
4888A79k13j18K73N8j89J47k63O6P2J47k10pP8K1J9k21j6J10N8J57q2l00L29j26
$$ 179 -34 -152 121 179 -10 137 -126 -60 12 159 -51 -58 20 41 60 -161 -177 -67 -9 148 66 -234 95 -31
4912c1P9q3k2KL1J39j49M7N5mm8K1J33M5j87M3j21K54j72NR8M1j02j61J40j83
$$ -31 48 -35 -57 -55 -24 115 -34 13 68 64 16 37 170 215 28 71 -50 204 32 37 135 176 74 -87 53 -130
4938a30J13J09q0R4j61M1M8J52k66o3K43OJ7J42j95j80j00J50J24R5l4P1l19M0
$$ -130 -17 92 12 106 -55 -14 34 186 -80 -143 100 106 123 265 70 -110 -210 -60 64 159 125 196 -123 -83
4962h3J42O7j70K14q0l09K39q0J04j15J5K34l26J15Ll6J4K04k23j28J34K8j22
$$ -83 59 126 -44 170 90 -219 20 -60 44 -71 -56 178 -148 -33 -30 -66 -52 152 -71 -199 -65 -37 -159
4985a59J83K3k94K87k19J64ok6n3O4J59p8j35K61l22mJ43N1l6p3j69K39O5l05
$$ -159 24 47 -247 40 -179 -15 -21 -47 -100 -36 123 45 -90 171 -151 -155 -12 39 3 -70 -239 0 65 -240
5009b40M88l23K55m91K82J37k13o0J0K35j37J60l69J84j6J35j92K65j89R9N3j34
$$ -240 248 -75 180 -311 -29 108 -105 -165 -155 80 -57 103 -266 -82 -98 37 -155 110 -79 20 73 -61
5031f1K65p8k07r7L6J37J38Kk04J81K9j80k5m7%J08K32m62K75L4K48k82on4Q4
$$ -61 204 126 -81 -178 -142 -5 133 135 -69 112 141 -39 -64 -111 -111 -3 229 -233 42 76 324 42 36 -18 66
5056F6L9jq5J0l7K17j41q0L4M2J27k39k21K72L4j65M50M3m75K13J08k20O4j03
$$ 66 105 104 19 29 -8 209 68 -12 22 64 191 -48 -269 3 37 -128 322 365 -110 103 211 -9 55 -48
5080d8M4N4Jo1r0Q5L8J06j48J26q3Q2l3m29L73r2J03l6j88K4j41L09M3n5M2j03
$$ -48 -4 50 51 -10 -100 -15 23 129 -19 107 24 106 73 -356 17 -75 28 -8 -196 -172 -313 -4 39 -16 26 -77
5106g7J15r4LJ12j99K63j19m6J30m2m23N75m24L2K48J64j20k04R5j50kJ59J06
$$ -77 38 -56 -53 59 -140 123 4 -42 88 46 -377 198 -226 -194 54 218 98 -106 -11 -161 -163 -4 102
5129A02p7m3O6Nj66L39l10J08o3J80j68N2k7J4P2j98J93O3p9j30M9L8j4J50o3
$$ 102 25 -18 48 53 -113 226 -84 24 -39 141 -27 25 -2 12 84 -114 79 142 63 -67 -18 20 6 156 93
5154I3j61J36J2l3J43j92P7J27j83J17j68J21R9k2o1J5k5L6k85R1j01PM2NM5j74
$$ 93 -68 68 80 47 190 -2 75 202 19 136 -32 89 188 166 105 120 95 131 -154 -63 -164 -157 -115 -110 -65 -239
5180b39L41N7k70k7K04N8j05j55N1K3j79L83r5n7J41j23M21m50l0j55K18J39J51
$$ -239 102 159 -111 -138 66 124 19 -136 -85 -62 -241 142 47 -10 131 8 429 -21 -51 -206 12 151 302
5203C02j94L7N4k46K06j25J68l20L75j73%l67L20l0n8MQJlR2m00M23o6L2j05j85
$$ 302 108 145 199 -47 159 34 202 -118 257 84 84 -283 37 7 -51 -47 -39 -38 -41 51 -349 74 8 40 -65 -250
5229b50N05k28K4l4j0k73%M89m5k64N6J04M0r3l9MJ48k80J56j21QK16k98K74j50
$$ -250 255 27 51 17 7 -266 -266 223 178 -86 -30 74 114 21 -18 -14 134 -146 10 -111 -103 113 -185 89 -61
5254f1q4Q9N9j43R2QJ51Kj59Q2j38j86L66j9j63O8r3J17j3J34M4j1k68J28j6m3
$$ -61 -145 -56 3 -140 -48 -40 111 113 -46 36 -102 -288 78 59 -104 -36 -129 -12 -25 109 153 142 -126 2 -14 -57
5280e7L6k27K18j08M4J81Q0k88J86k6P1j23n9nN7k3j12J99N7k0j40j3P4p2Ml2
$$ -57 -21 -248 -30 -138 -94 87 167 -121 65 39 110 -13 -72 -77 -20 -43 -155 44 101 81 -59 -72 2 -70 -66 -98
5306i8K9j48J99r8K02k80J51n7J25k28k9M9P5L1J13p3K51k62R5j18K55j49M0O9
$$ -98 -69 -217 -18 -116 86 -194 -43 -100 25 -203 -232 -183 -108 -77 36 -37 214 -48 47 -71 184 35 75 144
5330A44k67J53m0k4J28j89lJ62K8q1o6j06P9R7J15n7j32J67j82K65l3l95J85P7
$$ 144 -123 30 -10 -34 94 -95 -98 64 92 11 -55 -161 -82 15 130 73 -59 108 -74 191 158 -237 -52 25
5354B5j51J40j10J13j61K44j23m3LK40j56j7j34J29Lj30J29j24J31j24L07m25
$$ 25 -126 14 -96 17 -144 100 -23 -66 -63 177 21 4 -130 -1 2 -128 1 -123 8 -116 191 -234
5376b34M73j71Ml9Qn2N4l3l1l5J66j28J23q2j86J47J0k0k7j33J45j66M42pk65
$$ -234 239 68 72 33 41 -11 43 10 -21 -56 110 -18 105 23 -163 -16 -6 -26 -53 -186 -41 -207 235 228 -37
5401c7o3jN6j25O2J79j88k81M96j70J59k67M4J60J9Pk50q4M44r7K8Pm1k39O3J95
$$ -37 -100 -101 -45 -170 -108 71 -117 -398 98 -72 87 -180 -136 24 43 50 -200 -284 160 63 91 98 57 -182 -119 76
5427G6Q5j84m8J1J22q4K4M6K1J75l15J27j60J11K23k35m1pK05k34P5l0J5n0j44
$$ 76 161 -23 -71 -60 62 -22 2 48 69 244 -71 56 -104 7 230 -5 -46 -53 152 -82 -7 -37 -22 -72 -216
5452b16K79l06J59l8J64r3OJ36j15j91K23m2Kj7J53j56q6J57j07J88j10P5j40
$$ -216 63 -243 -84 -122 42 -51 -45 91 -24 -215 8 -34 -32 -49 104 -52 -138 19 -88 100 -10 65 -75
5475g5m8Q9j99J67k9J45j69J08K19j20l2R3k39l1J52K20k98J98l22K08r8J9J77
$$ -75 -123 -34 -233 -66 -95 50 -119 -11 208 88 56 149 -90 -121 31 251 -47 151 -171 37 -61 -42 135
5498A35J04k89MK08k38lK19J11k23O3o1j09j93L28J0j03l2J42j90K87k20K61j6
$$ 135 239 -50 -46 162 -76 -79 140 251 28 91 30 -79 -272 56 66 -37 -69 73 -117 170 -50 211 195
5521A95j99K3J38K9j42j28K03n4l7k5Q7j92J25O7K0j52q4P4J83k46j22K94J54
$$ 195 -4 19 157 186 44 -84 119 65 28 3 90 -102 23 90 110 -42 -126 -52 131 -115 -237 57 211
5544B11l41J46L18k36j50k02J37K14j35J82k57O3O7K26k49q6L8J01Q2nj57o5J81
$$ 211 -130 16 334 98 -52 -254 -117 97 -38 144 -113 -50 17 243 -6 -92 -54 47 129 124 -33 -98 83
5567H3k31K65j47R7k08K38K54j60m8j06n9r0K75k44R5J80j21k9l7q3PJ00j7k24
$$ 83 -148 117 -30 67 -141 97 351 191 143 37 -22 -112 163 -81 14 194 73 44 7 -76 -69 31 14 -210
5591b10J57o3R4j46J63J9l4J13p5J30m96L47Q5l0Q9l11K87j11n1l8J16R2k1k57
$$ -210 -53 -116 -22 -168 -5 14 -20 93 18 148 -348 -1 84 54 143 -168 119 8 -43 -81 35 127 106 -151
5615a51o3M9K3Q8n2P5Q0j45K9j07J31K37m3Kr1k25K67J15k24K3K15k21k39K20
$$ -151 -214 -165 -142 -54 -106 -31 49 -96 -67 -174 -43 194 151 153 62 -163 104 219 -5 18 233 12 -227 -7
5639gJ32Q5j58k95J01K44j34J80p8O3k56J94Rk89M27n19M13J79m21J81j13K69
$$ -7 125 210 52 -243 -142 102 -32 148 70 133 -123 71 80 -209 218 -301 112 291 -130 51 -62 207
5661B07r4q5N7k18J81k24J24Q2j0J3J2K16k33N5J6J9j47K17n1k82L04j82P8p2
$$ 207 113 28 85 -133 48 -176 -52 30 20 33 45 261 28 83 99 118 -29 188 137 -145 159 -23 55 -17
5685a7k2J07M2m0r2j1m8R1N5j6Kj44j57L88j84k5O1J25j76j69J20K20O8m24K21
$$ -17 -39 68 110 70 -22 -33 -81 10 65 49 51 -93 -250 138 -46 -71 -10 115 -61 -230 -110 110 178 -246 -25
5710b5J04O6j71L49k00k3Jo9j26J23J30k95N6j22K01j51M8K57O6n3j44k5N8L8
$$ -25 79 145 -26 323 123 100 101 32 -94 29 159 -136 -80 -202 -1 -152 -104 153 219 166 22 -3 55 93
5734I3J00j97k8k37J05O0N3j4K1J7M3j26J33n3knJ32pK66m91J26j50K81J15l90
$$ 93 193 -4 -32 -269 -164 -104 -51 -65 -44 -27 16 -110 23 -30 -32 -37 95 88 354 -137 -11 -161 120 235 -155
5759a55K7O4K6K3J40J8j33j13l0J20J0j26L03k84K59k86Q6q8Q4M5j4O4j25LJ15
$$ -155 -128 -64 -38 -15 125 143 10 -103 -133 -13 -3 -129 174 -110 149 -137 -51 -139 -55 -10 -24 40 -85 -82 33
5784C3q3L2q9L06l34J31J96j31j27n4J10%J85j94J54M4k33j24K67r7K7j03N7J12
$$ 33 -50 -18 -107 199 -135 -4 192 61 -66 -120 -10 -10 175 -19 135 179 -54 -178 89 -8 19 -84 -27 85
5808H5J88k59K11o9k49R6o3R0k05L65j54k33ML53m2j13N2l06K20J53q3l1N3J03
$$ 85 273 14 225 156 -93 3 -60 30 -175 190 36 -197 -193 160 118 5 57 -249 -29 124 41 10 63 166
5832A66M3m60K73J50j4r1k7n6o8m0Q5P3m6l2K45N2j91j06Km9J69Oj28k17L53k32
$$ 166 209 -251 22 172 158 67 40 -16 -84 -124 -39 34 -12 -44 201 253 62 -44 -42 -91 78 84 -44 -261 92 -140
5858a40J79n2J49l19J78kK7O0k18K13k23R7K1QK1N5j11J06Q0p2j10j3N2j68K45
$$ -140 39 -13 136 -183 -5 -7 20 80 -138 75 -148 -51 -30 -22 -1 54 -57 49 129 57 -53 -66 -14 -182 63
5883F3j9j05j1J02n4K69k82J70J21n80M90k63K76l03M4JM7J62r8j80m0K28m5l88
$$ 63 44 -61 -72 30 -24 245 -37 133 254 -326 164 -99 177 -126 -82 -81 -34 128 30 -150 -190 38 -7 -395
5907c95M08q1J79q0J21j78K61k69R5J02p0r0Mk6M4j80kL5R5j87K72Jk27Q5M5n1
$$ -395 13 -68 111 31 152 -26 235 -34 61 163 93 3 7 -19 25 -155 -157 -122 -27 -214 58 59 -168 -83 -38 -89
5933h9L19k39M8j14p5J87M2p4j8J09j04Q1j00N8j03j7J38J03j75j11K3J37k6P
$$ -89 230 -9 39 -75 -150 37 79 5 -13 96 -8 73 -27 31 -72 -89 49 152 -23 -134 -111 26 0 7
5957GL2O3K9l7r5J5j36j01L35k79K38J32k40K22k08Q5j65K44k48o3J07J15O6p7
$$ 7 39 102 131 94 -1 14 -122 -223 112 -167 71 203 -37 185 -23 62 -103 141 -107 -170 -63 52 118 41
5981D1j54J22J12k82K90L2l68P4M12k36N6k12j74L07R2j13L2P6j66J04n2j58J61
$$ 41 -113 9 121 -161 129 161 -207 -133 279 43 99 -113 -287 20 112 -1 31 107 -59 45 -7 -165 -4
6004dJ36k18L09j82J04k20R2q3K6j09J33J6J47J7j14j96J71O3pj48L0kJ05k34
$$ -4 132 -86 223 41 145 -75 17 -66 -40 -149 -16 0 147 164 50 -146 25 88 81 -67 -37 -39 66 -168
6028a68K73l56K93J5n7L7j4k19K45K5K4q8N2j28j6O6K4l2j10K7J83J3l7mj09J58
$$ -168 105 -251 42 57 0 37 23 -196 49 74 98 10 62 -66 -82 -16 8 -24 -134 -107 76 89 52 48 -61 97
6054I7M0o7L1j76J36k45K44J27j05r2P0o7q4J21j42J57l7P3j29q4K05p4j17J40
$$ 97 137 70 101 -75 61 -184 60 187 82 -10 60 -7 -91 30 -112 45 8 81 -48 -132 73 -1 -118 22
6078B2k29l4J50J53k96N9K07k95M22q3KR6j30k5r8Q9j9j05L3j5l5J77J00q5l93
$$ 22 -207 -241 -91 62 -234 -175 32 -263 159 76 78 174 44 19 -79 10 -9 -114 -81 -96 -131 46 146 61 -332
6103c32L68M3K45l11R3q1o5kK4Q5k18L5J72Q0m0j51K32m27L25j12K19j8m50J18
$$ -332 36 79 324 13 106 25 -40 -42 -18 67 -151 -116 56 136 96 -55 177 -250 75 -37 182 164 -286 -168
6127a68J1M24l13J57j77L65m26J01K7N7N0j93L22m35J51Q4J22j98J4P7j03R1m9
$$ -168 -157 267 -46 111 -66 299 -127 -26 1 58 108 -85 237 -198 -47 37 159 -39 -25 52 -51 40 -9
6150ij57K76k78N7L29k65K3j72J72L68j90k34M4O6J67j77L6K38k08LO4o3k47K04
$$ -9 -166 110 -168 -111 218 -47 -24 -196 -24 344 154 -80 -36 30 197 20 56 294 86 89 153 90 -157 47
6174D7p7j49L7J73j11K8K07j67J5l04L03r1L5J04J32n9k19R1K1J35k22J14r7j1
$$ 47 -30 -179 -142 31 -80 -52 155 -12 3 -301 2 -89 -54 50 182 123 -96 -5 16 151 -71 43 -54 -65
6198f5m1K32k34P1P8k3J0m8O8j95J64l2n5k80L73O0k73M25l95K14J8q1j49N15
$$ -65 -106 126 -108 -37 41 18 28 -20 48 -147 17 -15 -70 -350 23 83 -190 235 -160 54 72 -9 -158 357
6222C57l95j75L67%l63K52k29J49q6K87r6L9k60M44j73k73J55j09J68m4J77k72
$$ 357 -38 -213 154 154 -209 43 -186 -37 -123 164 68 107 -153 291 118 -155 0 -109 59 15 192 -80
6244h0M0k53K92J71n1J92j31Q4j97j7p0Nm0o8j15K6L17K3p3r6K09j28J73l05L1
$$ -80 -40 -293 -1 170 119 311 180 264 67 50 -20 -15 -55 -123 -238 -212 105 128 55 -41 168 40 213 -92 -61
6269f1n6K14j98J78l36R6k2L4J54m3J02K4j71K06j62K17l14K32k50K18l34J57
$$ -61 -117 97 -101 77 -259 -163 -185 -151 3 -40 62 86 -85 121 -41 176 -138 94 -156 62 -272 -115
6291a15P9Q3J58j45N5J09r8o8j84J33l2J52j66q5J62n2M6j33K03j09P6k1O7l39
$$ -115 -36 47 205 60 115 224 126 58 -126 7 -25 127 -39 -124 38 -14 32 -101 102 -7 69 48 115 -224
6315b24L00J5l33K87n3L0m1j09QJ07J45j57M9j78K36k13J21k84K28Q5J00j42J28
$$ -224 76 91 -242 45 -8 22 -19 -128 -120 -13 132 -25 24 -154 82 -131 -10 -294 -66 19 119 -23 105
6338A05k08J51N2k53j01K37J15J9r6o6L0O0J7j69K02J4j21O1j24R6r1k80K72J06
$$ 105 -103 48 100 -153 -254 -17 98 117 21 -45 -15 45 62 -107 95 109 -12 49 -75 21 -70 -350 -78 28
6362B8j94J74r8j3l3N6j06K06M1j38O9j06O0J82o6j05J30Q1k7L1k32k4n1R3K23
$$ 28 -166 8 -90 -103 -136 -80 -186 20 61 -77 -8 -114 -54 128 62 -43 87 168 141 172 -60 -84 -135 -42 181
6387A81p3j88j10K71j60oJ86j13j44J48j19K41j65k3J01N3k29J94O0k47J9r9J95
$$ 181 108 -80 -190 81 -79 -85 101 -12 -156 -8 -127 114 -51 -74 27 80 -149 45 105 -142 -123 -222 -27
6410b7J18n0j52K15PL06l64k06n7M65k13j16KJ15K05j4m98L72k11nJ31o5L67k98
$$ -27 91 41 -111 104 111 417 53 -153 -210 255 42 -74 -72 43 248 234 -264 108 -103 -108 23 -42 325 27
6434B7k5m4N0L5K08l32K76k4m42K62k03j80J31M56k33j51J97l5P8Q7n3L8q1j06
$$ 27 2 -42 8 43 251 -81 195 171 -271 -9 -212 -392 -261 195 -38 -189 8 -27 51 138 85 123 42 -64
6458f4LJ04p4mJ82l3K5K3l9q3qj25rp5K74q0k1k70L37k08O0L4k38M38J8k77Q2
$$ -64 -61 43 -31 -35 147 114 139 162 123 40 32 -93 -102 -177 97 17 -4 -274 63 -145 -85 -51 -289 149 167 -110 -28
6485b8RJ59k02m0m9L32j94m1JK24l52k3M24J8l52l2M5L9J82r1j31J84J07j84L8
$$ -28 -19 140 -62 -102 -151 181 -13 -54 -53 171 -181 -204 220 238 -114 -146 -101 -62 120 29 -102 82 189 5 43
6510D3p7J23k25K46j37o8QJ68m4M7J21l27K10N9j30l6M0k31K38RQ7k78K36n7L51
$$ 43 -34 89 -136 110 -27 -95 -87 81 37 84 205 -122 88 147 17 -19 21 -210 28 37 124 -154 82 25 376
6535C76l45j46K02l3j39J96k34p3k2L37J38j98n1J37ko5l91L19j01P1J98k68J9
$$ 376 31 -115 87 54 -85 111 -123 -196 -218 119 257 59 8 145 143 78 -313 6 -95 -24 174 -94 -75
6558g5j20J51R3p2O2j01O0J22p3K74l46M6j86J37j77J37K88k12p6M2l0%L9p2K12
$$ -75 -195 -44 49 -23 39 -62 -2 120 47 321 -25 21 -165 -28 -205 -68 220 8 -68 -26 -56 -56 -17 -89 123
6583A23o1l0m7J50m0J18k70J58j63K4P6p8rq4L7N11n55J26K38k15j5P0r4J57k8
$$ 123 62 32 -15 135 95 213 -57 101 -62 -38 38 -40 -49 -133 -96 415 -140 -14 224 9 -6 64 -30 127 99
6608I9k79N2J41m5M5J76k25J60k82M06k74K5lM6k06K51k04K3j30L45J0l35J78
$$ 99 -180 -128 13 -32 13 189 -36 124 -158 248 -26 -1 -4 42 -164 87 -117 -94 -224 121 131 -204 -26
6631b6L2K77k50k09K97L0j1j88l5K8J87l16K33j0p1q3K3j81R9K25J90k28Rp8J33
$$ -26 6 283 33 -176 121 151 140 -48 -83 -55 132 -184 49 39 -32 -115 -92 -273 -174 51 241 13 22 -56 77
6656G7O8j50J45pq5P2q9j88L83m67J89j7OK2j68K84p0j65L53m25K86j9n7j4L9
$$ 77 145 -5 140 133 48 120 31 -157 226 -241 -52 -69 -63 -41 -209 75 5 -160 193 -232 54 35 -22 -36 3
6681Cj51nK8J39j02J56k67P0L9n8J81R6p9M3Pl89L86o0r0N3j2J34k26m4L18k60
$$ 3 -148 -153 -125 14 -88 68 -199 -129 -90 -148 33 129 50 93 100 -289 97 37 -53 0 -12 122 -104 -148 170 -90
6707i0J37oJ49j77J1p5N3k04Q6K65J24J6j90j02q6j54M80l44P0J04K5j51J2N5
$$ -90 47 41 190 13 24 -51 2 -202 -116 149 273 289 99 -3 -89 -243 237 -107 -37 67 92 -59 -47 8
6731HLK29k71L6J5N8k49J35J73n0j8k9j20M5j13mM16j95j92Q1L40l40p7K27j90
$$ 8 11 240 -31 5 20 78 -171 -36 137 87 69 40 -80 -35 -148 -152 264 69 -123 -42 298 -42 -119 108 -82
6756h2J55O5k25J35l14M12O1k27O2J34n4N1n7r8J30O1n0l13J33K20j62k18J5J42
$$ -82 73 138 -87 48 -266 146 207 -20 42 176 122 173 116 18 148 209 159 -154 -21 199 37 -181 -166 -24
6780b4J10j60J61k29J08K87j13j66j53K98k46K41J7k2P9k10k13RK50k13L84j80
$$ -24 86 -74 87 -142 -34 253 140 -26 -179 119 -127 114 131 109 188 -22 -235 -226 24 -189 195 15
6802A5p4J71j26k4J07n4Oj05J08R6k9k10L72k55L0j08j7K18j39L1L5P7j08k47
$$ 15 -59 112 -14 -38 69 15 21 -84 24 120 91 -119 253 -2 28 -80 -97 121 -18 13 48 125 17 -230
6826b30J44K66k11L58k52j49L1N7j36J08J1n4pJ10O6mql2q8k2J3j69J88R1j80
$$ -230 -86 180 -31 327 75 -74 -43 14 -122 -14 -3 -57 -64 46 112 108 100 68 -20 -42 -29 -198 -10 81 -99
6851i9L42j43J12k19R9q2J19j10K0j58J47J38l74K37K5j45K25k68j09K26q7k21
$$ -99 243 100 212 -7 92 10 129 19 39 -119 28 166 -208 29 54 -91 134 -134 -243 -17 -104 -325
6873c25M85j90R3j8J57l10J79j11K7j0j24J0K71Kk40J11oJ60m4l8j06K66k73J31
$$ -325 160 -30 63 45 202 -108 71 -40 -13 -23 -147 -137 134 136 -104 7 1 161 117 79 -27 239 -34 97
6897I7j46L1j51M00l01K54k09k1K55k41j1m1J39j26j48L99j70q5J4J53k29J45
$$ 97 -49 -18 -169 231 -70 184 -25 -46 209 -32 -43 -84 55 -71 -219 180 10 -75 -61 92 -137 8
6919HK3M4k66J5J33J6J74j95J60o7n8N9JL5K5j62qJ5l1O4k3K3M7K40l14j69M16
$$ 8 31 75 -191 -176 -43 -27 147 -48 112 45 -13 46 47 82 107 -55 -63 -48 -79 -15 -38 -15 32 272 -42 -211 205
6946B05j04Qp5j89R1jj10R6J36J3j84%J42j55K46k34K8j29P3L12j75K0n2N4O1
$$ 205 101 109 34 -155 -64 -65 -175 -79 57 70 -114 -114 28 -127 119 -115 -87 -216 -143 169 -6 14 -38 16 77
6971G7l08J50j02M7R4kK58k2j45k83k9K30m3P0Q6N1N2j52j00J80k98K6K06J44
$$ 77 -231 -81 -183 -136 -42 -44 214 192 47 -236 -265 -35 -78 -8 78 129 181 29 -71 109 -189 -163 43 187
6995A87j89M0r2j47J24l8qL3K00l3J39k61K1J21Pj48mL74k23L7j19j8L9K1J22
$$ 187 -2 38 -54 -201 -77 -115 -123 -90 110 77 216 -45 -24 97 104 -44 -48 326 103 140 21 3 42 63 185
7020A85l07J65j89Q6M7q6Q4k6%K60j19q4K91k33M1j82J24K26k51P0n6j38J94k07
$$ 185 -122 43 -146 -60 -13 -99 -15 -41 -41 219 100 16 307 74 115 -67 57 283 32 102 46 -92 102 -105
7044a05j5J12O2j61j33O0K42j07j12n1L41k31K27j35L78m07l1K33k76J43k11M23
$$ -105 -120 -8 54 -107 -240 -180 62 -45 -157 -208 133 -98 129 -6 372 -35 -66 167 -109 34 -177 246
7066B46k70L9o9l3L39k01l4p2j5J7K07k04K4l0j1j53K90j73l6K82L3j69j58L4
$$ 246 -24 15 -54 -87 252 51 17 -55 -70 -53 154 -50 -26 -56 -67 -220 70 -103 -139 143 176 7 -151 -117
7090a17J71j48K35j26M0l8q1K77l21N1M8J40k60J56K9k14N3J02J90k25K75j14
$$ -117 54 -94 141 15 55 17 -64 213 -108 -57 -9 131 -129 27 56 -158 -105 -3 187 -38 237 123
7112A23j13J68k09n5J07k7P8r9M2L4l8k20K46m4J30j6j04m7K0p4J20L6j44O1R1
$$ 123 10 178 -31 -86 21 -6 72 -27 15 49 11 -209 37 -7 123 107 3 -44 -24 -98 22 58 -86 -25 66
7137F6P2k37N5O1q8l2k9K68l87K53J30j89K87k02j73K58j15o9K82k56J4Q3J18
$$ 66 138 -99 -44 17 -71 -103 -132 136 -251 2 132 -57 230 28 -145 113 -2 -71 211 -45 -31 52 170
7160A70j85Q3l89O0J50J21Nk3N8m2k23L94j26k51M09k54P9m8Rl9N2j55Q9L5l9
$$ 170 -15 68 -321 -261 -111 10 15 -8 50 8 -215 179 53 -198 211 -43 36 -12 -3 -42 10 -145 -56 -21 -60
7185f0J40k07L79k44J48j10j6N1Oj71J60o1j88J20p9K9J50p7J52j18r8K2K0J0
$$ -60 80 -127 252 8 156 46 30 81 87 -84 76 15 -173 -53 -132 -103 47 -30 122 4 -94 -72 -52 -42
7209d2Q6L2ll7j19M1o1Oj3J51P2j48l3J67o1J84l3k60R1M2m4P2k6k62L87m0n6
$$ -42 44 76 73 36 -83 -42 -103 -97 -110 41 113 -35 -68 99 38 222 189 -71 20 62 18 90 64 -198 189 149 93
7236I3j02O8l7j5m24M29k5k3p7Q3J40j70M0k2l9l5n7J98J70k42l17L34J23J56
$$ 93 -9 59 22 7 -417 12 -13 -36 -113 -30 110 -60 -20 -42 -81 -116 -173 25 195 -47 -364 -30 93 249
7260B49l26K74j40j64K2LJ83j19m9n0J01r7J17m2N3M4J97k12J76j6k39K7j69K73
$$ 249 -77 197 57 -107 -85 -82 101 -18 -67 -117 -16 -113 4 -38 15 59 256 44 220 204 -35 -8 -177 96
7284I6q0jm7J05p4k8J56J47m31J14Q3K08l03K68j12k59N5O2j11j15K60j44N7j02
$$ 96 16 15 -32 73 -1 -29 127 274 -157 -43 40 248 -55 213 101 -158 -103 -41 -152 -267 -7 -151 -94 -196
7308a96K03o2l0m4J42l7n6O9P2j02N4k46M3J67j64NR2R3j14J91l76N43k75J20
$$ -196 7 -55 -85 -129 13 -24 -80 -11 61 -41 13 -233 -190 -23 -187 -182 -90 3 -111 80 -296 247 -28 92
7332I2j02J04k89l0J26J23N8L8L9k97J36M8mo4O6j16n4J64j8N3k9l1n3j32J94
$$ 92 -10 94 -195 -225 -99 24 82 120 159 -138 -2 46 42 -22 44 -72 -126 38 20 73 44 13 -40 -172 22
7357B2J86j62N2k05K55Q4m78Q7K60k52J74Qj9k1q6M03o5l06m2K83l07j3J27q5
$$ 22 208 46 98 -107 148 232 -246 -159 101 -151 23 31 12 -9 -95 308 243 -63 -105 178 -129 -142 -15 -100
7381a00k6J78l3j08J22j00Q7j40J45p9K41m00N10k05j29L5n6J51l5k64J96p0P3
$$ -100 -126 52 19 -89 33 -67 20 -120 25 -54 187 -213 297 92 -37 -2 -58 93 58 -206 -10 -80 -7
7404gj6j02J15N4J22m34L98p2p1K5j01J37J0l22K82K3M4j00o8Q6k40K93k54O7
$$ -7 -23 -125 -10 44 166 -268 130 58 -13 12 -89 48 58 -264 18 41 85 -15 -83 3 -237 56 -198 -131
7428a31qK8K1K38k27n7L14k6k11K58l72K78l17J51m3QK07k18L48l13J78j80J91
$$ -131 -139 -111 -90 148 -79 -136 178 152 -59 199 -173 105 -212 -61 -104 -96 111 -107 241 -72 106 -74 117
7451A17q6q6J5J22n8n9K94m1k42p7K35j97Q6O4k80K57J8k1k1r7K0K55j52j85L82
$$ 117 31 -55 -40 82 24 -35 259 218 -24 -101 134 -63 23 87 -193 64 82 61 40 -57 -37 218 66 -119 263
7476B63j27k59L16j71j3J98k46j59J56N5M9j64J34N4o1j01j00L90m49M00r1J3
$$ 263 136 -123 193 22 9 207 -39 -198 -42 13 62 -102 32 86 25 -76 -176 214 -235 165 74 87
7498H7k6P4o0j44q4J37K8l50M12J86k72n6M08k71r8n1J36j40kQ6n0J15q8q6K73
$$ 87 61 135 75 -69 -153 -16 12 -338 74 260 -12 -68 340 69 -29 -80 56 -84 -86 0 -50 65 -23 -109 164
7523A64k97Q5k4Pj15L12k25j51K92j64J29P1k71J36pJ7J95j19J33k96J86j57J45
$$ 164 -133 -48 -72 -65 -180 132 -93 -244 48 -116 13 84 -187 -51 -58 -41 154 35 168 -128 58 -99 46
7546D6j88L52k87K69k84m2K15q8L44o02Q2KK49N3j3o8k0l4k17L36k20J05K2L8
$$ 46 -142 210 -77 192 -92 -134 81 -7 337 -265 -183 -181 68 121 108 40 20 -14 -231 105 -115 -10 12 50
7570E0J13o2n2j70J5N7K12l83K32J53J00j98j06J06Pl8k69%J80oL07k99P6j75
$$ 50 163 101 49 -121 -106 -49 163 -220 12 165 265 67 -39 67 74 36 -233 -233 -53 -59 248 -51 25 -150
7594a50l7J04L64m79L96j12k81j6K33O8j49j11LJ97j05J60R6j50oJ26m28K02J18
$$ -150 -187 -83 281 -198 198 86 -195 -211 22 90 -59 -170 -167 30 -75 85 181 31 25 151 -277 -75 43
7617D3j01q8J59l5Q9P3j7J36k36L3l1j60J00M9j83K3J85k17K13J00j70j6J8j07
$$ 43 -58 -146 13 -22 67 140 123 259 23 56 25 -135 -35 14 -169 -146 39 -178 35 135 -35 -51 -33 -140
7641a40L7R9L8L22k40j52O4p9J45J03k84R9J46j73l6J44k52QK60m2m2o4l9K06
$$ -140 -103 -4 34 356 116 -36 28 -51 94 197 -87 12 158 -15 -51 93 -159 -151 109 67 25 -39 -78 128
7665A28j70p5L8k4nK2J85O4o5O3p4j14J9o0R5lm3O1m7j48N6%P7L56m17k3o7P9
$$ 128 -42 -117 -79 -103 -108 -86 99 163 98 161 87 -27 -8 -68 27 24 -19 42 -5 -153 -97 -97 -20 336 -81 -104 -171 -92
7693i2J22m8L71k72j92J73K6k4O6j96J01j38J70p4Mql5j17J19J0R0m5j40J22R6
$$ -92 30 -18 353 81 -111 62 88 64 130 -66 35 -103 67 -7 -3 -11 -46 -163 -44 -34 56 11 -129 -7 89
7718H9j17j45M56k71m1k1J43j39R8p1J53k3k37J22K36j51p4n3M0L7o7k9P1r9K19
$$ 89 -28 -173 283 12 -29 -50 93 -46 52 -19 134 111 -126 -4 232 81 7 -46 -6 31 -36 -65 6 -93 126
7743A26k17P8J89l6k82M3N6j71L48j17J43j90j08N7Ok9M8KO9j15O6M4J27k80j05
$$ 126 -91 -13 176 140 -142 -99 -43 -214 134 17 160 -30 -138 -81 -75 -104 -56 -54 15 -100 -34 10 137 -143 -248
7768b48L18Q2j00J3j29j34J26k8N6L01k45n5o9L06l40R6N0L4m5n3J91jj54NK88
$$ -248 70 152 52 65 -64 -198 -72 -100 -44 257 12 -43 -112 194 -146 -50 0 34 -11 -64 127 126 -28 -23 265
7793B65j67k49J22N6J0J45m24J38O4R4J21k32k4K88k50J45J56j33j5k32L8J21
$$ 265 98 -151 -29 27 37 182 -242 -104 -40 54 175 -57 -81 207 -43 102 258 125 110 -122 -84 37
7815C7M5M3l23K11J64r2M6k49J64r3Q8n7J18mk4J15k19J83r3P3m15K67j35P5n0
$$ 37 82 125 -198 13 177 85 131 -118 46 -47 41 -16 102 98 74 189 -30 153 60 133 -282 -15 -150 -75 -125
7840a25J01k0p4q0r3L75j65K90k75J10k8K8j11o6K30j95M3K97l86N09m74J39L4
$$ -125 -24 -44 -118 -198 -291 84 -81 209 -66 44 16 44 -67 -133 97 -98 -55 242 -144 365 -109 30 64
7863F4O1j05j29R1K2J10q9mj74J48J63l11Q0O4k11J61M6l7j27R9J5J86j06k77
$$ 64 125 20 -109 -18 4 114 25 21 -153 -5 158 -153 -73 -9 -220 -59 -13 -50 -177 -78 -63 123 17 -260
7887b60R4L26p2l70K57J23k3j50P5L40l47m4j53K42k7l24L11l5L5p9j27Q6L67
$$ -260 -166 160 88 -282 -25 98 75 -75 0 340 -7 -51 -204 38 11 -313 -2 -37 -2 -81 -208 -122 245
7910B45k46J7m1j88K84k35k3J87k5%j88kJ45J39o7j39K91j64P9m1m1OJ00r0J79
$$ 245 -1 16 -25 -213 71 -164 -187 0 -25 -25 -213 -215 -70 69 2 -137 154 -10 69 28 -13 -7 93 3 182
7935A82Rl39J88J39l19L45j92l7k20k9K62JN9k6J71l08o5L29K7l77J65P2J9j11
$$ 182 191 -148 40 179 -140 205 13 -24 -244 -273 -11 -10 49 23 194 -114 -179 150 177 -200 -35 37 56 -55
7959e5J58j73NJ34q6J21p5J67q5j36j02Q4m2N5jp9J03j02j05J38o1K12K8j6r4
$$ -55 103 -70 -65 69 -17 104 29 196 111 -25 -127 -43 -85 -30 -31 -110 -7 -109 -214 -76 -137 75 103 87 -7
7984gk9Q4k20K01j19j33%L02j76r9K93k34R5j30Q6K41l14L36j92j2r3K78r6j04
$$ -7 -36 48 -172 29 -90 -223 -223 79 -97 -196 97 -137 -42 -172 -86 155 -159 177 -15 -27 -120 158 62 -42
8008d2k42K15l2p2K74j62K26j99j35K50on7r1k0J18j15K8ln5J21L1j68N1K52k35
$$ -42 -284 -69 -101 -173 101 -61 165 -34 -169 81 75 18 -73 -93 25 -90 -62 -65 -120 1 32 -136 -85 167 -68
8033f8M9NK3k27J46R0j86K91j57k0o3OJ27o0j66J41M30l68n6J07j06j07J04N1
$$ -68 -19 -14 9 -218 -72 18 -168 123 -34 -54 -117 -111 16 -44 -210 -69 361 -7 -63 44 -62 -169 -65 -14
8057a4j1j63l1J46j17K74k73L83j77J6K24k81J6n7L66l03l59K07O5K93j31l09
$$ -14 -25 -188 -219 -73 -190 84 -189 194 17 33 257 -24 -8 -65 301 -2 -361 -154 -89 204 73 -236
8079b36P4L22j62J27j21o6K68p4N2j62L8J47j26o8Mp3J14O1J1l4j96K47j72L4
$$ -236 -162 160 -2 125 4 -62 206 132 184 22 60 207 81 13 17 -56 58 119 130 96 -100 147 -25 9
8103Ij48J98j81k08K57K76l94J03q6O3K79m22R9N3J32j89k3J37J9Q9l10L11O9
$$ 9 -139 59 -122 -330 -73 203 -191 -88 -174 -111 168 -254 -155 -102 30 -159 -182 -45 -26 63 -247 64 133
8126A33p3j45O2k28L21l27J58K58k24r5K33p8K14l6j87L4ok48K70M6K7k02j0Q1
$$ 133 60 -85 -23 -251 70 -257 -99 159 -65 -160 73 -5 209 173 -14 20 14 -234 36 82 109 -93 -103 -22
8150b2J45k49L09k11j14j6J15J15l16K66R1LR8p3k43R1rJ70k67L37m22L09J39
$$ -22 123 -126 183 -28 -142 -158 -43 72 -244 22 113 116 214 141 -102 -11 -20 150 -117 220 -202 107 246
8173B46k69M0M0K4j2J26l62L81q4j28l6M7mq6k25L28l3M0
$$ 246 -23 17 57 81 69 195 -167 214 130 2 -34 13 9 -77 -302 26 -7 33
8191C3
$$ Imaginary data points
##PAGE= N=2
##DATA TABLE= (X++(I..I)), XYDATA
0@%%%%%%%%%%%%%%qJ6j6J6j6K4l2L2m0M8n6O4p2Q8j04J19j35J52j72J96k22K51
$$ 0 0 0 0 0 0 0 0 0 0 0 0 0 0 0 -8 8 -8 8 -8 16 -16 16 -24 24 -32 32 -40 48 -56 63 -72 80 -92 104 -118 133
36A33k82L15l50L91m38M86n38N95o59P30q06Q89r79J079j188J308j442J589j754
$$ 133 -149 166 -184 207 -231 255 -283 312 -347 383 -423 466 -513 566 -622 686 -756 833 -921
55i21J942k157K399k677L007l401L879m478N253o295P780j0080J4146k3425Q4112
$$ -921 1021 -1136 1263 -1414 1593 -1808 2071 -2407 2846 -3449 4331 -5749 8397 -15028 69084
70F9084J876j53317N6195O3333K0401o1615m8099O7429L0158o7268J9196J7098
$$ 69084 70960 -82357 -26162 37171 57572 -4043 -52142 15287 45445 -21823 -2627 14471
82A4471j6389M4p294K4030J5789o3210J3695N8061k3933k8849N628J5323K0987
$$ 14471 -1918 -1874 -9168 14862 30651 -32559 -18864 39197 15264 -13585 -7957 7366 28353
95B8353k8718j3858L3549o484j6977J3543l764R17L006j3973R350Q438j6600L927
$$ 28353 -365 -14223 19326 12842 -4135 9408 5644 6561 9567 -4406 4944 13382 -3218 709
109G09Q039j2857J849J0276l518n450q730Q480K0586j8008j8032K0170M749k956
$$ 709 8748 -4109 -2260 8016 4498 -952 -9682 -1202 19384 1376 -16656 3514 8263 5307
123E307J288j6701R037J8103j4576j919K577o659J4127j992j1286P764q316N099
$$ 5307 6595 -10106 -1069 17034 2458 539 3116 -3543 10584 8592 -2694 5070 -3246 1853
137A853J5207k3477j177J8367j1388R68J618r129J4021m089j1606J4030m662k810
$$ 1853 17060 -6417 -7594 10773 -615 353 1971 -7158 6863 2774 -8832 5198 536 -2274
151b274O699j1233R223P335j8071R250P205j2531P079J773m839L538o206N261
$$ -2274 4425 -6808 2415 9750 -8321 929 8134 -4397 2682 4455 -384 3154 -3052 2209
165B209P586j3987P4Q381k270L045o779p118J4611J248j1697J023L534K318k44
$$ 2209 9795 -4192 -4118 4263 1993 5038 -1741 -8859 5752 7000 -4697 -3674 -140 2178 1934
180A934m563J748P77j502M429j128m846K235L188j037R9j940k243M779K748n827
$$ 1934 -2629 -881 -104 -1606 2823 1695 -3151 -916 2272 1235 1334 -606 -2849 1930 4678 -1149
196a149k242N024J333k890j350J107J616j706J60J355l731J967L809n119m9L555
$$ -1149 -3391 1633 2966 76 -1274 -167 1449 -257 -97 1258 -2473 -506 3303 -1816 -1865 1690
212A690k775J908K96l978K911J987k287l73j916M164J126o411L001L221m853K485
$$ 1690 -1085 823 1119 -2859 52 2039 -248 -621 -2537 1627 2753 -3658 -657 2564 -2289 196
228A96J243l552K241L28j99Q52k670J078K107j623O69j571p10N138k058m501L764
$$ 196 1439 -2113 128 456 257 1109 -1561 -483 1624 1 670 -901 -1611 3527 1469 -3032 732
245G32J339j965n85O64K71r67N76J018k151m3J860r38m64ok98P56O60p5j784L27
$$ 732 2071 106 -479 185 456 -511 65 1083 -1068 -1111 749 -189 -653 -659 -957 -201 459 384 -1400 -1073
265a073L282k186j757K941n31r90J441q92m11M17Q84M50k464L99K891l028l3J719
$$ -1073 2209 23 -1734 1207 676 -314 1127 235 -176 241 1125 1575 -889 -490 2401 -627 -660 1059
283A059k513J085J635k644K26Q46l41O59j465P49J346k151J778L13k274K086Q49
$$ 1059 -1454 -369 1266 -1378 -1152 -306 -647 12 -1453 -704 642 -1509 269 582 -1692 394 1243
300A243k048J301P53o14J89m66O82n83l98J705j316j076J854m47j778J177M2j048
$$ 1243 -805 496 1249 635 824 358 1040 457 59 1764 448 -628 1226 779 -999 178 220 -828
318h28K55M60l86q82J125K76j174O35M34m08M25K13m49n8J267M41j657N69J784
$$ -828 -573 -113 -499 -1381 -256 20 -1154 -519 -85 -493 -68 145 -304 -362 905 1346 -311 258 2042
337B042j303n47P08Mj10P5j30p86J82O65m31j480Q59L99q92M26N5j155Q61R91
$$ 2042 739 192 900 904 794 869 739 -47 135 800 369 -1111 -252 147 -745 -319 -264 -1419 -558 433
357D33n16j003Q52Q01o85N1P65k44Q8O80m18n80R12O63o95p40O39l66l10N92k40
$$ 433 -83 -1086 -234 567 -118 -67 698 454 542 1222 804 224 1136 1799 1104 364 1003 637 327 919 679
378F79j038Q87K9o55l66K20J35l1j6J60o37L91J184j116n39J319J63m74O55n21
$$ 679 -359 528 557 -98 -464 -244 -109 -140 -156 4 -633 -242 942 -174 -713 606 769 295 950 429
398D29L22J28K25k21l26J59L36n48L4Q32j148kR27q83l90O19k43m93K19n2K89
$$ 429 751 879 1104 883 557 716 1052 504 538 1370 222 220 1147 264 -126 493 250 -243 -24 -76 213
419B13j48j11L08n31K82O80o91k39J240p92K36R72o76k25N57l36K43o70L85L32
$$ 213 65 -46 262 -269 13 693 2 -237 1003 211 447 1419 743 518 1075 739 982 312 697 1029
439A029j097K40R60j165R8R90j229L16K09q89O66M4m81N99l86M54N78j353P48
$$ 1029 -68 172 1132 -33 65 1055 -174 142 351 -538 128 172 -309 290 -96 358 936 -417 331
458C31N04q87L27N64q07N40J78o24M16n8r1K27l52pJ0l97O39j51r34P75J74q24
$$ 331 835 -52 275 839 32 572 750 126 542 484 393 620 268 261 271 -126 513 362 -572 203 377 -447
480d47N29K06q38L39J99j04J95j96O0K42j28J15J05m99O33k1q94O06J38l55K4
$$ -447 82 288 -550 -211 -12 -116 79 -117 -57 185 57 172 277 -222 411 390 -504 102 240 -115 -91
501i1K78j87m4K51k06r9j00K56l0m75K80R0l17J05K26m78N16l07r8M02J1j43P7
$$ -91 187 0 -44 207 1 -98 -198 58 28 -447 -167 -77 -394 -289 -63 -541 -25 -332 -430 -28 -17 -160 -83
524h3j49J16Q0m19M41N1o29M01L42l99K13k10L0K32p1o8J10l64L45J35n15O35
$$ -83 -232 -116 -36 -455 -14 37 -592 -191 151 -248 -35 -245 -215 17 -54 -122 -12 -376 -31 104 -411 224
546B24j06l23L80l00l66N43m6j51j72j06L04O4l56K90j78J23m5q3j61K05J45k87
$$ 224 118 -205 175 -125 -491 52 6 -145 -317 -423 -119 -55 -411 -121 -299 -176 -221 -304 -465 -260 -115 -402
568d02J30K76j90Q2j51K10LP5j62j34J56J36m5j88P1L8l69L13L0l47M65j11k86
$$ -402 -272 4 -186 -104 -255 -45 -42 33 -129 -263 -107 29 -16 -204 -133 -95 -464 -151 -121 -468 -3 -114 -400
591d00K75j42j36J34j13k27N14l74N17k71k03N21n6j78L11k43p0K50J15o7m2k96
$$ -400 -125 -267 -403 -269 -382 -609 -95 -469 48 -223 -426 95 39 -139 172 -71 -141 109 224 157 115 -181
613a81L51j56k62M49m06p9K68l35O5L37p39M94Qk64M07j86K23k71K78j53k7J93
$$ -181 170 14 -248 201 -205 -284 -16 -351 -286 51 -688 -194 -186 -450 -43 -229 -6 -277 1 -152 -179 14
635A4j30J70m8M4J21K3l50K77k30M8M3P3k0p3Ol76M17m52K93K78m63K02Q3l40
$$ 14 -116 54 6 50 171 194 -156 121 -109 -61 -18 55 35 -38 -32 -408 9 -443 -150 128 -335 -133 -50 -390
659c90K12m4P7J46k51K10k7l79O25j83k03K71j17LK09l40O8K12j12N7l7j6N1j79
$$ -390 -178 -222 -145 1 -250 -40 -67 -446 179 -4 -207 64 -53 -50 159 -181 -113 99 -13 44 7 -9 42 -137
683a37j40K25j58o6K00k97K21K49l57J21J9j26L46J0m85M82lN5j22o9j46L76l81
$$ -137 -277 -52 -210 -276 -76 -373 -152 97 -260 -139 -120 -246 100 110 -375 107 104 159 37 -32 -178 198 -183
706a83K45K56n45K95k11j4J53nl66L13j94k87L24lQ4j44K9L44l10J43j42J32k50
$$ -183 62 318 -227 68 -143 -157 -4 -9 -375 -62 -256 -543 -219 -222 -138 -282 -253 91 -219 -76 -218 -86 -336
729c36L31j23Nj36J49k3Q3J02j36n3K50j20q0j86K54k26p2L5Q5l54L30K43n25
$$ -336 -5 -128 -123 -259 -110 -133 -50 52 -84 -137 113 -7 -87 -273 -19 -245 -317 -282 -197 -551 -221 22 -503
752e03M45k82k8J81n5K31l63J68M8j69J52J51k20L2J45%k62M08k56j45M39k85
$$ -503 -58 -340 -368 -187 -242 -11 -374 -206 -158 -327 -175 -24 -244 -212 -67 -67 -329 79 -177 -322 117 -168
774a68J63j67Q9J92m10M00k00k11M11o4q4m3m06J77O47m04q3J90m05J90K51j45
$$ -168 -5 -172 -83 109 -301 99 -101 -312 99 35 -49 -92 -498 -321 326 -78 -161 29 -376 -186 65 -80
796h0j92jQ2J46n9L3j66J3k6Nk0J77M8k53j17M90n18L34J55j50K8J25m02K35k46
$$ -80 -272 -273 -191 -45 -104 -71 -237 -224 -250 -245 -265 -88 -40 -293 -410 80 -438 -104 51 -99 -71 54 -348 -113 -359
821c59K71pj14oQ5J03k61M1r6M70k12o1k17K49j4q1K47r3J6j03N6K22k81J18j50
$$ -359 -88 -95 -209 -215 -130 -27 -288 -247 -343 127 -85 -146 -363 -114 -128 -209 38 -55 -39 -142 -86 136 -145 -27 -177
846a77o0K6J79j91j4J09j50M01m33L2L31l57K16o1K95k81K66l29Q4K02k00j33
$$ -177 -237 -211 -32 -223 -237 -128 -278 123 -310 -278 53 -304 -88 -149 146 -135 131 -198 -114 88 -112 -245
868b45K50m1r4o4J73m5K04k96m3J69l40K52J63j40J15q9r1K07j86K17j42j82L52
$$ -245 5 -36 -130 -194 -21 -66 138 -158 -201 -32 -372 -120 43 -97 18 -71 -162 45 -141 76 -66 -248 104
891A04m12K33mQ1K2p1o7M4L3q8K16l13L69m67J31O9K64k63kN6P3N6o7K69m98O5
$$ 104 -308 -75 -79 2 24 -47 -114 -70 -37 -125 91 -222 147 -320 -189 -120 144 -119 -121 -65 8 64 -3 266 -232 -167
917a67K55k38J81k03Q5K33q3j28L15l13K69m8j32P8j21l15N55r7n2q0L4Kj63J90
$$ -167 88 -150 31 -172 -87 146 63 -65 250 -63 206 158 26 104 -17 -332 223 126 74 -6 28 30 -133 57
941E7p1j32K71j53p2J43j66K66k62K35m0J8j69QR8P6n2j62m9J5O7QP7Lp3m7K82
$$ 57 -14 -146 125 -28 -100 43 -123 143 -119 116 76 94 -75 -67 31 107 55 -107 -156 -141 -74 -66 11 14 -59 -106 176
968A76o0r8Q3k37j34Q2M07l34J46k00J41r0L59j20J8k51J09J29n5j68k8j03K71
$$ 176 116 18 101 -136 -270 -188 219 -115 31 -169 -28 -118 241 121 139 -112 -3 126 71 -97 -125 -228 43
991D3J51k34O8N6j25j23JJ33n2K05K6k76J49j91M63m85L24j94Q2L8O7k47l7J67
$$ 43 194 -40 28 84 -41 -164 -163 -30 -82 123 149 -127 22 -169 294 -191 133 -61 21 59 126 -121 -158 9
1015Ik0j75J75O3Pp0j9J22j78J06n8R9J17n04J54K03m1j11O8K4j97J85K17j76
$$ 9 -11 -186 -11 52 59 -11 -30 92 -86 20 -38 61 178 -326 -172 31 -10 -121 -53 -29 -226 -41 176 0
1039@k78R1K11j14J64n0n7J25j82J43j30O3q0PJ80Q3j84p4J54J44k60n9J30J59
$$ 0 -278 -187 24 -90 74 24 -33 92 -90 53 -77 -14 -94 -87 93 176 -8 -82 72 216 -44 -103 27 186
1063A86l21J44r5J02R2k27O0lj04J11J18p7J27j63n6J3J46R3j38J39Np8j26N4
$$ 186 -135 9 -86 16 108 -119 -59 -62 -166 -55 63 -14 113 -50 -106 -93 53 146 8 147 152 74 -52 2
1087Bj80L62j7J6j44p3O0Q0m1j21K34k69J25J10k97L02n5k72J83Q0j26Lp0J39
$$ 2 -178 184 167 183 39 -34 26 106 65 -56 178 -91 34 144 -153 149 94 -178 5 85 -41 -38 -108 31
1111C1J8k97L38l1j48O4N1j90Q0L33l64J51LJ04L8k60l2j8L12k15K26l57m7J10
$$ 31 49 -248 90 59 -89 -25 26 -164 -84 249 -115 36 39 143 181 -79 -111 -129 183 -32 194 -163 -210 -100
1135a00O3L4K09Mk66j06L59j31m2j6n0K07j26j69J58Q5j11L3q2J51k68Q1J96j81
$$ -100 -37 -3 206 210 -56 -162 197 66 24 8 -42 165 39 -130 28 113 2 35 -47 104 -164 -83 113 -68
1159f8p5J40q4K29k77K24J55l04N9l2P7N5j15kJ23j50J23k23J05k0j60J49j9K32
$$ -68 -143 -3 -87 142 -135 89 244 -60 -1 -33 44 99 -16 -18 105 -45 78 -145 -40 -60 -220 -71 -90 142
1183A42J1j93m7j4N41m32J48k23q7J12J11N0j93o8J44L5K39m81K22J16k56j28
$$ 142 153 -40 -87 -101 440 8 156 -67 -154 -42 69 119 -74 -142 2 37 276 -205 17 133 -123 -251
1205b51J61k0J79q0J18JK7l09j4K08k24J52J88q6J3K7j27O1k06L11L9j58k1j00
$$ -251 -90 -110 69 -11 107 108 135 -174 -188 20 -204 -52 136 50 63 90 -37 24 -182 129 168 10 -11 -111
1229a11j48L48rk1j40Q2J41j82J12K04j86L7P6M7l16j20K25k38L27r8j66n6L68
$$ -111 -259 89 80 59 -81 1 142 -40 72 276 90 127 203 250 -66 -186 39 -199 128 30 -136 -192 176
1252A76m8J48j67j42O3P5K5j29o9J76j5j01K75l1k1l19R2j43J06k1J2J27j21K2
$$ 176 128 276 109 -33 30 105 130 1 -68 108 93 -8 267 236 215 -104 -12 -155 -49 -70 -58 69 -52 -30
1276c0j38q1J42m0K3L92l62J72k33J61J5j39o4M20k49L8KJ51r7j33J49k67L94
$$ -30 -168 -249 -107 -147 -124 268 -94 78 -155 6 21 -118 -182 238 -11 27 29 180 83 -50 99 -168 226
1299B26l08m4R2J11j06J52J8J2k25M01n81L58l30J56J80j15M3M8j34J26k10K85
$$ 226 -82 -126 -34 77 -29 123 141 153 -72 329 -252 106 -224 -68 112 -3 40 88 -46 80 -130 155
1321A55o0j88R2j30KJ44k4k65J67M3J12N2o6J4Rl7j91P0J69kK7j97K13j10L8J53
$$ 155 95 -93 -1 -131 -129 15 -9 -274 -107 -64 48 100 34 48 57 20 -171 -101 68 66 93 -104 109 -1 37 190
1347A90j40q5k1m6K16j4l52K64n4j67J44N4j08K6J3L9J02k00J77J38k65Pk1J20
$$ 190 50 -35 -56 -102 114 100 -252 12 -42 -209 -65 -11 -119 -93 -80 -41 61 -139 38 176 -89 -82 -103 17
1371A7K28j3m16K67k08K37k12M3j97L4J73K80j69j29m5J72m6j5j84K09j46m4J28
$$ 17 245 232 -184 83 -125 112 -100 -57 -254 -220 -47 233 64 -65 -110 62 16 1 -183 26 -120 -164 -36
1394c6kJ40j77L2L1l9M4J49N5p7q7q7J55k33O6j51J42K78j51J38q2K7j21Jk19
$$ -36 -38 102 -75 -43 -12 -51 -7 142 197 120 33 -54 101 -132 -66 -217 -75 203 52 190 108 135 14 15 -204
1419b04K97j93n4J64p2K68l29j65J33L69n4l9k87K74J22k10n9N6K34n14M16j02
$$ -204 93 -100 -154 10 -62 206 -123 -288 -155 214 160 121 -166 108 230 20 -39 17 251 -263 153 51
1441E1m8pK22k91K3M1k06K34P4q8k8j39o9J80j44L38j31M2j32K43p1j72K13l7
$$ 51 3 -4 218 -73 -50 -9 -215 19 93 5 -23 -162 -231 -51 -195 143 12 54 -78 165 94 -78 135 98
1465I8r4Pj32J10K6J14l2jj43Q5j53K63j68o8J3j6N0O0k85J53kJ7L11r5J62j59
$$ 98 4 11 -121 -11 15 129 97 96 -47 38 -115 148 -20 -88 -75 -91 -41 19 -266 -113 -115 -98 213 118 280 121
1491A21k30K08j18M1M2l89M53M0j72j38K96j33K01j71j87K08p5j48J59k90M55
$$ 121 -109 99 -19 22 64 -325 128 168 -4 -142 154 21 222 51 -136 72 -3 -151 8 -282 173
1512A73k90J19P6l97J20L59n1j60k2J15R2p2m2L4N1p5j18L08m34L24p2l25L34
$$ 173 -117 2 78 -319 -199 160 109 -51 -73 42 134 62 20 54 105 30 -88 220 -214 110 38 -287 47
1535D7j6r3J26O3j25J15o9j18K13l15R7r1R1J38k83L15J17j52k9k55K71q5r2J97
$$ 47 31 -62 64 127 2 117 48 -70 143 -172 -75 -166 -75 63 -220 95 212 60 31 -224 47 -38 -130 67
1559F7J35j84jK22j06O6l03K00k04L6P4oJ07P9j93m8O2Q8k36M5J02K8mJ4m9l8
$$ 67 202 18 17 239 133 199 -104 96 -108 -72 2 -4 103 182 -11 -59 3 91 -145 -100 2 30 26 40 -9 -47
1585d7j65J56J7j52K21j0L0k69K74j1l84M56l37K64J9k61K62J21l05l1N4k9m6
$$ -47 -212 -56 -39 -191 30 20 50 -219 55 44 -340 116 -221 43 62 -199 63 184 -121 -152 -98 -127 -173
1608a73L57j72k04J9K97j14q5K44l78J94L7%N4k40J7o8L37j21J58j25j00J20r0
$$ -173 184 12 -192 -173 124 10 -75 169 -209 -15 22 22 76 -164 -147 -215 122 1 159 34 -66 54 -36
1631c6j4Q8J59k93K8O5k5J31J09o8k08K43j83rk26J32J41N8j17k62K89l1r2M3
$$ -36 -50 38 197 -96 -68 -3 -28 103 212 144 -64 179 -4 -13 -239 -107 34 92 -25 -287 2 -29 -121 -78
1655g8K1J11k76K7ok6L31QP5k06k6J65j30m5M7j41J06LJ64l69K09k4j16P8K94
$$ -78 -57 54 -222 -195 -201 -227 104 112 187 -19 -45 120 -10 -55 -8 -149 -43 -40 124 -245 -36 -60 -176 -98 196
1680A96j58p0J48r8n9K34l10j59J01J18J57j29J1q1m1J89j59L32r8o9j67L2N4
$$ 196 38 -32 116 18 -41 193 -117 -276 -175 -57 100 -29 -18 -99 -140 49 -110 222 124 55 -112 -80 -26
1703b6J77k82J20N8pj66K01q8J45j55j03J21p4K41k64p0K39K29l40J89l55J28
$$ -26 151 -131 -11 47 40 -126 75 -13 132 -23 -126 -5 -79 162 -102 -172 67 296 -44 145 -210 -82
1725h2J5Q7Q9O0m11J67nJ62o2j53J10m4K69l29J38P3j72l2K62l78O0J43J7p3r6
$$ -82 -67 20 109 169 -242 -75 -80 82 20 -133 -23 -67 202 -127 11 84 -88 -120 142 -236 -176 -33 -16 -89 -185
1750a85N80n90N9K35k31J89j99J11j17O3J96j2k05J89l14K01L2K2m6k34M30k09
$$ -185 395 -195 -136 99 -132 57 -142 -31 -148 -85 111 99 -106 83 -231 -30 2 24 -22 -256 174 -35
1772c5r4K11M7k64L5K62k15m4K41k0m3j58K2R7n0J51j74K1J6J05k70N2J6j24L18
$$ -35 -129 82 129 -135 -100 162 -53 -97 144 124 81 -77 -55 42 -8 143 -31 -10 6 111 -159 -107 -91 -215 103
1797A03j16O3m9R8o0J35j50J27j34j62J24J37j14k9l6R0m8m4O8J11p0j4p7OO2
$$ 103 -13 50 1 99 39 174 24 151 17 -145 -21 116 2 -27 -63 27 -21 -65 3 114 44 30 -47 -41 21
1822B1l11J03J94N1k31Q1O9K36n56L94j31j0j55K10j46K28J39k64M1j16JK2J31
$$ 21 -290 -187 7 58 -173 -92 -23 213 -343 51 -80 -90 -245 -35 -181 47 186 -78 -37 -153 -152 -130 1
1845Aj12l4J86j6J69k87K02j4j72N3r8J74j53mP1K2l4J58j13NP8m07M47j42J00
$$ 1 -111 -145 41 25 194 -93 109 95 -77 -24 -122 52 -101 -105 -34 -12 -46 112 -1 4 82 -325 122 -20 80
1870H0l00K56J09k33LK2K05j30q5K47l99J76J81k50n3K1P2r5L58j26j56J62p9
$$ 80 -220 36 145 -88 -85 -63 142 12 -73 174 -225 -49 132 -118 -171 -150 -78 -173 185 59 -97 65 -14
1893a4nK11k80j83K69J95J08k99L5Q7j32k24J87K77l09j1K3J91j85P4j77L07j30
$$ -14 -19 192 -88 -271 -2 193 301 2 37 124 -8 -232 -45 232 -77 -88 -65 126 -59 15 -162 145 15
1916A5N9K2p0J28j96j05m6K62jj80K99j34j74j9J32J2nJ35jj77M4O1k80K44J20
$$ 15 74 96 26 154 -42 -147 -193 69 68 -112 187 53 -121 -140 -8 4 -1 134 133 -44 0 61 -219 25 145
1941A45r6J5k2n9P3J51m25M03j0Oj68k0p2Q8l94N93l66L39N2k62J55k07J70r2
$$ 145 49 64 42 -17 56 207 -218 185 175 181 13 -7 -79 9 -385 208 -158 181 233 -29 126 -81 89 -3
1965cj18R6L7j9K7J08l13K55J6l82K62n6r0J46Qk14J59R1J66j87q8K88l7j69j52
$$ -3 -121 -25 12 -7 20 128 -185 70 86 -296 -34 -90 -180 -34 -26 -240 -81 10 176 -11 -99 189 152 -17 -169
1990a69J01j28J05rJ36N9k22J28K4k8J82rj85K3o5m0J28J48r2k11K39j53J5rK52
$$ -169 -68 -196 -91 -100 36 95 -127 1 25 -3 179 170 -15 8 -57 -97 31 179 87 -124 115 -38 -23 -32 220
2015B20j02j33J87q0j66k4J85k05o3J71K36k86q7j03J94J05j8j80K44j67j9M2
$$ 220 118 -15 172 92 -74 -98 87 -118 -181 -10 226 -60 -147 -250 -56 49 31 -149 95 -72 -91 -49
2037d9O1QR7n12M55J59j86MJ5J28o0j92q2M51j82k66K57k16R8j55Q5PP1j30n0
$$ -49 12 20 117 -395 60 219 33 37 52 180 120 -72 -154 297 115 -151 106 -110 -12 -167 -82 -75 -4 -134 -184
2062a84L08k87P2j23L11r6K44m87O7K96k75L5L52l14KK03Nj19j6k7kL19k65N8
$$ -184 124 -163 -91 -214 97 1 245 -242 -175 121 -154 -119 233 -81 -79 124 129 10 -6 -33 -35 284 19 77
2086G7n5M4j82K93l02K09j43K88m03j75M54mj49J95l5j71R5j31kK74k21O6n4m5
$$ 77 22 66 -116 177 -125 84 -59 229 -174 -349 105 101 -48 147 112 -59 36 -95 -97 177 -44 22 -32 -77
2110g7J67m3J50k96K49o8j92J71N2j43NJ00r3j44K54l4K6j2q9J54J27l80R1O5
$$ -77 90 47 197 -99 150 82 -110 61 113 -30 -25 75 -18 -162 92 58 84 72 -17 137 264 -116 -25 40
2134D0n5qJ17o9j14K75p6j27m8N6KJ51j40j2r6K01j19j08K0K45j86l8J06J4ql19
$$ 40 -15 -23 94 25 -89 186 110 -17 -65 -9 -7 144 4 -8 -104 97 -22 -130 -110 135 -51 -89 17 31 23 -296
2160b96K18nn7R8P8j32N1J60j01j93Q7K67J2j16j59j16K10L8j89O7MJ22p0N7J2
$$ -296 -78 -83 -140 -42 36 -96 -45 115 14 -179 -92 175 187 71 -88 -204 6 44 -145 -78 -74 48 -22 35 47
2185D7j72K65k96K18j07J78l5l78J36J25Q6J13l0l20J81j32J00Q5j87Q8J30j58
$$ 47 -125 140 -156 62 -45 133 98 -280 -144 -19 67 180 150 -170 11 -121 -21 64 -123 -35 95 -63
2207f3N0j11L32k86Q4j13L02k96M2J37k90Q5j5K59l04J04J25K9j89K3j4l1J00
$$ -63 -13 -124 208 -78 6 -107 195 -101 -59 78 -212 -127 -142 117 -187 -83 42 71 -118 -95 -109 -140 -40
2230d0o7L08j62j75J70J14j66R4j89J03j25j9J3K39n2J08k29j5J44l25L75j89
$$ -40 -107 201 39 -136 34 148 -18 76 -113 -10 -135 -154 -141 98 46 154 -75 -90 54 -271 104 -85
2252h5M8l7Q8J66l94J76rJ33J07j77j27J49k63L6J0J60M4L9L8J22l95RO2kJ95
$$ -85 -37 -74 14 180 -214 -38 -47 86 193 16 -111 38 -225 -189 -179 -19 25 64 102 224 -171 -162 -100 -102 93
2277I3L3j05k60K64J43k97K08J56j46j9q0J33nj51J76p2j34K46l75L69j09J8L2
$$ 93 126 21 -239 25 168 -129 79 235 89 70 -10 123 118 -33 143 71 -63 183 -192 177 68 86 118
2300A18j84J81J08k15Q3k57K89J55n02L63j38j80P8K84k83J94l02L02K10l61K36
$$ 118 -66 115 223 8 91 -166 123 278 -224 139 1 -179 -101 183 -100 94 -208 94 304 -57 179
2321A79j74j5k0R6L14m63j46K24n7l1m2M8j55J45R2J1J7jk03J16k49K30K7j84
$$ 179 5 -10 -30 66 380 -83 -229 -5 -62 -93 -135 -87 -242 -97 -5 6 23 22 -181 -65 -314 -84 -57 -241
2345b41R2K38j30L3l0N8L3R7j49N9q4J7K21n56K36K84l40K03K4n4j59J77m4j18
$$ -241 -149 89 -41 -8 -38 20 53 150 1 60 -24 -7 214 -342 -106 178 -162 41 65 11 -148 29 -15 -133
2369a33J95j94M54l55n8K85j83Q0o5k6k18K45N4k17J56j06j04MK78M2k04j8J78
$$ -133 62 -132 322 -33 -91 194 11 91 26 0 -218 27 81 -136 20 -86 -190 -186 92 134 -70 -88 90
2392I0k0p1k20K54k90R5K76j64M5j7K21k05N8K56m92K27n2J73k02m3RL4L7p1J09
$$ 90 70 -1 -221 33 -257 -162 114 -50 -5 -22 199 -6 52 308 -184 43 -9 164 -38 -81 -72 -38 -1 -72 37
2417C7k22K83p0j01J77j06j15J78j96J30K9LK1J1M5Q7j37p3O8O1j52K08P8k2l12
$$ 37 -185 98 28 -73 104 -2 -117 61 -135 -5 24 27 48 59 104 191 54 -19 49 110 -42 166 244 222 -90
2442i0J70l07Q0J62m15P60o01K72N0J8k28L00k99K57J28l91M2K2k18J11K53M0
$$ -90 80 -227 -147 15 -400 360 -241 31 81 99 -129 171 -128 129 257 -134 -92 -70 -288 -177 76 116
2464A16k87J00o5K11p5J1N1m3k1j1N3r2K55j39J2j77K65k53J84o4l6K24j33j31
$$ 116 -171 -71 -136 75 0 11 62 19 -2 -13 40 -52 203 64 76 -101 164 -89 95 31 -5 219 86 -45
2488d5K37j45o0J19k02j39J63J61Pj85L8N3j94K97O7j30j63J9l7J06Km3J14K63
$$ -45 192 47 -13 106 -96 -235 -72 89 96 -89 -51 2 -192 105 172 42 -121 -102 -139 -33 -31 -74 40 303
2512C03j41k21K18j82J2m5J55j44k9O9o3J02m2q3K53j61P0o6jK4r5L3k31L27k6
$$ 303 162 -59 159 -23 -11 -56 99 -45 -74 -5 -68 34 -8 -91 162 1 71 5 4 28 -67 -34 -265 62 36
2537C6Q7J5k19J60p9k5k93M12M2j13pj92J53p2p2k2J6K5R7o8P8J92m26K60O0j60
$$ 36 123 138 -81 79 0 -25 -318 94 136 23 16 -176 -23 -95 -167 -189 -173 -148 -51 -119 -41 151 -275 -15 45 -115
2563a15K51k33R9q7P9K03j40m9l0j38K14o1K12j96n5j0j97J47j05K40R9k65K80
$$ -115 136 -97 2 -85 -6 197 57 8 -22 -160 54 -7 205 9 -46 -56 -253 -106 -211 29 128 -137 143
2586A43j90J90q6J6n1o6j2m3j2J63k38L78j71L6N7j97K31k14j8L12m97J19K50
$$ 143 -47 143 57 73 22 -44 -56 -99 -111 52 -186 192 21 57 114 -83 148 -66 -84 228 -269 -150 100
2609A00J73k03K03l51N6Lj71J33J7K87l48L38j41J0L5M4l22K26QP9p5q8P1l11
$$ 100 273 70 273 -78 -22 -19 -190 -57 -40 247 -101 237 96 106 141 185 -137 89 97 176 101 13 84 -227
2633b27R5J85M3k18J03r8pL06q3j79L8J99j70J69j60J49j85J90mk34J52j56O9
$$ -227 -132 53 96 -122 -19 -117 -124 182 99 -80 -42 157 -13 156 -4 145 -40 150 146 -88 64 -92 -23
2656b3K0j32R0J89j89l27L65M01j72l86O0K23j28J40j32kj28J34Mn3O4O9R6k33
$$ -23 -3 -135 -45 144 -45 -372 -7 394 222 -164 -104 119 -9 131 -1 -3 -131 3 7 -46 18 87 183 -50
2680e0K06j70O0K3l4rL1k8K4M6m4K27j93k25q7K52J39j45N7L02n52L27L2k43K21
$$ -50 156 -14 46 69 35 26 57 29 53 99 55 282 89 -136 -223 29 168 23 80 382 -170 157 189 -54 167
2705A67l85K12r5O5l61M80j65L6j71J49L7L6j70J57m3J00R5j28K5m9m0l4K08j42
$$ 167 -218 -6 -101 -36 -397 83 -82 -46 -217 -68 -31 5 -165 -8 -51 49 144 16 41 -8 -48 -82 126 -16
2729a6P3j48J87PR0k32o3j46K03R3j56m1J57nj06Q2J16p5j19L07j95O1j21K96
$$ -16 57 -91 96 103 193 -39 -102 -248 -45 48 -108 -149 8 3 -103 -21 95 20 -99 208 13 74 -47 249
2753B49k06M4k51N6j92K07j22J42J56o8l1k6k17K90J50j85O5J6P7k2j71J94j38
$$ 249 43 87 -164 -108 -300 -93 -215 -73 83 15 -16 -42 -259 31 181 -4 61 77 154 132 -39 155 17
2776A7j60J65m9J71l42K92o0L7j28L14n90O09m41L0J24q0q7J53KL1J57r4P0j96
$$ 17 -143 22 -27 144 -198 94 34 71 -57 257 -333 276 -165 -135 -11 -91 -178 -25 -23 8 165 71 141 -55
2800e5J98r0p7K66k36j62J33N5J3l7j76K36j23M6K37k13J00J93k82p3J31r9Lj14
$$ -55 143 53 -24 242 6 -156 -23 32 45 8 -168 68 -55 -9 228 15 115 308 26 -47 84 -15 -12 -126
2824a26J02J45j00Q6j25pn7J75j15J47k54L6J82q3J79l3q4mj81P5L29j44R0k89
$$ -126 -24 121 21 107 -18 -25 -82 93 -22 125 -129 -93 89 6 185 152 68 64 -117 -42 287 143 233 -56
2848e6K50j92q1j75J87p0J41L18l86L6n6lR8j06Q1j30L41l64O8K40l06K35m4j21
$$ -56 194 2 -79 -254 -67 -137 4 322 -64 -28 -84 -87 11 -95 -14 -144 197 -167 -99 141 -165 70 26 -95
2872i5l8P7j63J83l8P5j68K77j2k24J04o6J88n8K8k06j7L38J00k68j32L4P1J0
$$ -95 -133 -56 -219 -36 -74 1 -167 110 98 -126 -22 -88 100 42 70 -136 -153 185 285 17 -115 -81 -10 0
2896@J19p2j41j71J46Q7o8J49n4R7j65j7n8o3J21J19N2O6j45R3qj31J9K37j08
$$ 0 119 47 -94 -265 -119 -32 -100 49 -5 92 -73 -90 -148 -211 -90 29 81 147 2 95 87 -44 -25 212 104
2921A04K7k07J89o0N5j07J19k93K56r3j85K10l9K19l60K82l9M3M7k75l9O9J28
$$ 104 131 -76 113 53 108 1 120 -173 83 -10 -195 15 -24 195 -165 117 78 121 168 -107 -146 -77 51
2944E1j6k01J40p0J25l7R3p7K30j35m1k40J25K01K5k08J51j58J19j83N8J10l91
$$ 51 35 -166 -26 -96 29 -8 85 8 238 103 62 -178 -53 148 173 -35 116 -42 77 -106 -48 62 -329
2967c29L08l41L79L1K34k64J40k42K25j78J01J51k10J16k42O5O7R5J81m66L12
$$ -329 -21 -362 17 48 282 18 158 -84 141 -37 64 215 5 121 -121 -56 11 106 287 -179 133
2988A33o0j8k6j67K75k91L26j8l99M35k67j34J54L9M9O7j56P7j90K01p2k6J1K20
$$ 133 73 55 29 -138 137 -154 172 154 -245 190 -77 -211 -57 -18 31 98 -58 19 -171 30 -42 -68 -57 163
3012A63k52K56j93p4L4J73k48J1K13P9j89L5O6j87J93j63Q7k6N1L31k86k99J91
$$ 163 -89 167 -26 -100 -66 107 -141 -130 83 162 -27 8 74 -113 80 -83 4 -22 29 360 74 -225 -34
3035c4J06l34K23J39j88l3L28q7k28k15L40J03k48o3J8l0N80j10k08k87J70L09
$$ -34 72 -262 -39 100 -88 -121 207 120 -108 -323 17 120 -128 -191 -173 -203 377 267 59 -228 -58 251
3057B51l09R7o5N9j21K7O8K48m39M79m84K47j37R5j98j23R5P0J29J13q1l06M14
$$ 251 -58 39 -26 33 -88 -61 7 255 -184 295 -189 58 -79 16 -182 -305 -210 -140 -11 102 21 -285 129
3080A29k3l6j00n9P9r4K53Pk78QJ25o8N7N6Nj37p1j7J19J23k87Q9J05N1j16l6
$$ 129 106 70 -30 -89 -10 -104 149 156 -122 -114 11 -57 0 56 61 -76 -147 -164 -45 78 -209 -120 -15 36 -80 -116
3106a16K47j38J2j15K05l77K11L20k02n1J39k90L48q1k02Q6k59K68R3j84QM4o9
$$ -116 131 -7 5 -110 95 -282 -71 249 47 -4 135 -155 193 112 -90 -4 -263 5 98 -86 -78 -34 -103
3129a03kL12j86k5m4p5K47j55j35Q6jJ12j84K01k21K13M9l3j72Q0l00M60j4r9
$$ -103 -105 207 21 -4 -48 -123 124 -31 -166 -80 -81 31 -153 48 -173 40 89 56 -116 -36 -336 124 110 11
3153A1K16j87j8j7q7J86k66J16jM3K40l61K94N1j75L5qr6j4K55l27L03LM6o8L6
$$ 11 227 40 22 5 -82 104 -162 -46 -47 -4 236 -125 169 220 45 80 72 -24 -38 217 -110 193 196 242 174 210
3179B10k53J14j99K44r3j64J53K8j02j61K76k9l8l67M20m3N8k01J64J00J6j69
$$ 210 -43 71 -128 116 23 -141 12 40 -62 -223 53 24 -14 -381 39 -4 54 -147 17 117 133 -36
3201c6NJ38l44K60J17l70P2J56r1J69k67K29O5j46J81n2j31J74j95o8O2K89k98
$$ -36 -31 107 -237 23 140 -230 -158 -2 -93 76 -191 38 103 -43 138 86 -45 129 -66 -134 -72 217 -81
3224h1j4O3K26K2l44k4J8J26j48K87m7q0M8O9m36L09J03j31J36p4r5M9n0J78k0
$$ -81 -95 -32 194 216 -128 -152 -134 -8 -156 131 84 4 52 121 -315 -6 97 -34 102 28 -67 -18 -68 110 90
3249I0j85J37j03p5J76mJ4J22j74l2J7j55J98k1j15k01M47j62k21L44k54M9K08
$$ 90 -95 42 -61 -136 40 36 50 172 -2 -34 -17 -172 26 5 -110 -311 136 -26 -247 97 -157 -108 100
3272A00K02k13j79J19r7m6q4L96l48N1R9j44K89k25K01k2j79m2K7J18k18J49j91
$$ 100 302 89 -90 29 -68 -114 -198 198 -150 -99 0 -144 145 -80 121 99 -80 -122 -95 23 -195 -46 -237
3295b37K07J22n2J04m16K67L8o5J12p4j07K08k74M2Q8J27j19M9n4j70K44J13q5
$$ -237 -30 92 40 144 -272 -5 33 -32 80 6 -101 107 -167 -125 -37 90 -29 20 -34 -204 40 153 68
3318F8k44J33J73m3J2k21n4K86j45K50m09J90J70j50J0j53J22l1K9R4j2r8J65
$$ 68 -176 -43 130 87 99 -122 -176 110 -35 215 -194 -4 166 16 26 -127 -5 -36 -7 87 75 -23 142
3341A42j38J7o0nK74k51q7o9J23J9J47Q8k61m8r3J12J19k04L19k20r8O1L54m51
$$ 142 4 21 -39 -44 230 -21 -108 -177 -54 -35 112 200 -61 -109 -202 -90 29 -175 144 -76 -174 -113 241 -210
3365b10L25J1j84K21j81J66k06L06k00m5j01P5RJ43M0j95o9Q2q5J04j62J75l7
$$ -210 115 126 -58 163 -18 148 -58 248 48 3 -98 -23 -14 129 169 -26 -95 -13 -98 6 -156 19 -18
3388a8J2k5o7J68j3J4j1kr0j1N4l7J52j64n5J89j08L5J36m13M05j62O1j23PO2
$$ -18 -6 -31 -98 70 57 71 60 58 -32 -43 11 -26 126 -38 -93 96 -12 23 159 -254 151 -11 50 -73 -66 -4
3414dl42N24m06K56j53n4J38m6K55k99R3R9j3R0L7j86q2J23OR2q1Rj96P7J85j29
$$ -4 -346 178 -228 28 -125 -179 -41 -87 168 -131 -38 61 48 138 175 -11 -93 30 36 128 47 56 -140 -63 122 -7
3440gj8J00o6j66K61o8j51O3j0j80J80J15j11J78J05m20M18l18K20k2k55K23k99
$$ -7 -25 75 9 -157 104 36 -115 -52 -62 -242 -62 53 -58 120 225 -195 223 -95 125 103 -152 71 -228
3463b28%K52j79O6J30mk90M61R6j81k67L03k42jQ8j23K73j12j10J06p4Qn1j09
$$ -228 -228 24 -155 -89 41 37 -253 208 304 123 -144 159 -83 -84 4 -119 154 42 -68 38 -36 -28 -79 -188
3487a88J06K02m4N1m8j60O6K08j34j39J9p1K9J10l1N2K20j74J0m2K02k01Or7J73
$$ -188 -82 120 76 127 79 -81 -15 193 59 -80 -61 -132 -103 7 -24 28 248 74 84 42 244 43 49 -48 125
3512A25L9r4O7l33J15J49j97M78l56k20K80P7m7j09p1j65J63J23k39L45k41j13
$$ 125 164 70 137 -196 -81 68 -129 349 -7 -227 53 130 83 -26 -97 -262 -99 24 -215 130 -111 -224
3534b24K54j81J8J19K79k64j34J16J9j31J91n0q1J33j87Q7q4L64k95J87j49%J4
$$ -224 30 -151 -133 -14 265 1 -133 -17 2 -129 62 12 -69 64 -123 -36 -120 244 -51 136 -13 -13 1
3557AJ45n9k46m9K74k82j09K97j76M21j07j57Q4m5q6K49j59J96j27q7J44K8j67
$$ 1 146 87 -159 -208 66 -216 -325 -28 -204 217 110 -47 37 -8 -94 155 -4 192 65 -22 122 150 -17
3580a7r2J11O7M9l16K27Q9j27J9l4L9k6J57rj17p6j0j47J87K94j69p5k5J70j12
$$ -17 -109 2 69 118 -198 29 118 -9 10 -24 15 -11 146 137 20 -56 -66 -213 -26 268 99 24 -1 169 57
3605E7j08J9Q4j68P1K14k38J22m53K86j2J43J64k06P5k39M2R0J22k10pJ55n5N5
$$ 57 -51 -32 52 -116 -45 169 -69 53 -400 -114 -126 17 181 -25 50 -189 -147 -57 65 -145 -152 3 -52 3
3629CJ03k36K12r8J26p2j9j63K50j32N8K6n4j03J64k47L03J04j00k73j8R6J00
$$ 3 106 -130 82 -16 110 38 19 -144 106 -26 32 58 4 -99 65 -182 121 225 125 -148 -166 -70 30
3652C0Nj40o9K90j11N5p5J41k20J28j10j32L74k10j14J28k6J40j29pJ05j07J04
$$ 30 35 -105 -174 116 5 60 -15 126 -94 34 -76 -208 166 -44 -158 -30 -56 84 -45 -52 53 -54 50
3675E0j00rk0J20jp2q4M4K92l55K03J25l68J2K08r3J57j64J38j41Q6j11J45k9
$$ 50 -50 -59 -79 41 40 -32 -116 -72 220 -135 68 193 -175 -163 45 -48 109 -55 83 -58 28 -83 62 33
3699C3k22M48o02L91J72j42q3J23K7j75m4O1Q3j34N0P2l1j41j99L52KJJ37k80
$$ 33 -189 259 -343 48 220 78 -5 118 145 -30 -74 -13 70 -64 -14 58 27 -114 -313 39 41 42 179 -101
3723a01j06K92k88J1L37j51j73L50l43L22j53No5J51J9O1k11J44J73n19N60l61
$$ -101 -207 85 -203 -192 145 -6 -179 171 -172 150 -3 2 -63 88 107 168 -43 101 274 -245 315 -46
3745d6J79J07m10J60J20k43J12N9RO8P0l57L02j3j23J90J17l75M67m36j60Q0M2
$$ -46 133 240 -170 -10 110 -133 -21 38 47 115 185 -172 130 117 -6 184 301 -74 393 -43 -203 -123 -81
3768h1J31J8o2NJ0k02K56J72n21L81q2K4k05R6N3j16J19p1P1j4O4j10q5J74J89
$$ -81 50 68 6 11 21 -181 75 247 -274 107 25 49 -156 -60 -7 -123 -4 -75 -4 -18 46 -64 -149 25 214
3793B14l07j56J48N3K56k55J03j6m6K1R2M3n25M06j30O1j30K60O5j4l77J58J61
$$ 214 -93 -249 -101 -48 208 -47 56 40 -6 15 107 150 -375 31 -99 -38 -168 92 157 143 -234 -76 85
3816H5j06J97l99J01O3j8K42j83J32Kj22r9J22k55P3J00j8J87j38J88J9Mj42J71
$$ 85 -21 176 -223 -122 -59 -77 165 -18 114 116 -6 -105 17 -238 -165 -65 -83 104 -34 154 173 177 35 206
3840B06J2q4p4p2R0j67M0P3J00k28M9J0l2J06J38K4j58J50k10j98M91k33j20J44
$$ 206 218 134 60 -12 78 -89 -49 24 124 -104 -55 -45 -77 29 167 191 33 183 -27 -225 266 33 -87 57
3864E7k12j30K47J87l23J62J25l24J60K31j60J86j10j49R6m9P1N7l7n8j9K7p9
$$ 57 -155 -285 -38 149 -174 -12 113 -211 -51 180 20 206 96 -53 43 -6 65 122 85 27 8 35 -44
3887d4q2J35J2L4P6j65O1J69k78J69lr0J53j19p0J6K6Pp6n9nO6K43k65R6qn7J34
$$ -44 -126 9 21 55 131 -34 27 196 -82 87 84 -6 147 28 -42 -26 0 7 -69 -128 -133 -67 176 -89 7 -1 -58 76
3915G6j06j12M21k94J20Kk60K70k8k03J81k09J99q6kl9L4J81k19M6O7m7r0R9r0
$$ 76 -30 -142 279 -15 105 107 -153 117 89 -114 67 -142 57 -29 -31 -70 -36 145 -74 -28 39 -8 -98 1 -89
3940h9J59q6m4J30j9Q3j21q5J22j60N1O7K10k48Q5k08L37K3k24j2m5K11j27O0
$$ -89 70 -16 -60 70 51 134 13 -72 50 -110 -59 8 218 -30 55 -153 184 207 -17 -29 -74 137 10 70
3964G0q4j14K4R2J16m1j05K20l26j26K04n1J94l10J20K8J00Q5r6J21O1k05K67
$$ 70 -14 -128 -104 -12 104 63 -42 178 -148 -274 -70 -121 73 -237 -117 -89 11 96 0 121 182 -23 244
3987B44j77rl61K00p3J04n3j6pL3L35l01J78r7L8j05Q7J42j80j19j4J66oj80J88
$$ 244 67 58 -303 -103 -176 -72 -125 -141 -148 -115 220 -81 97 0 38 -67 20 162 -18 -137 -151 15 9 -171 17
4012A7o4j3K46k05J0Q7l12L10j31QO9p6J0n7P9J31j49k58K38LO9n0q9K36P3j38
$$ 17 -47 -60 186 -19 -9 78 -234 76 -55 -47 22 -54 -44 -101 -22 109 -40 -298 -60 -57 12 -38 -127 109 182 44
4038D4K82m10j24K00J27j0Oj65J89k10J19q5R8k4j80q5J85P2J09j15Lr7K70l43
$$ 44 326 -84 -208 -8 119 109 115 -50 139 -71 48 -37 61 37 -143 -228 -43 29 138 23 26 -71 199 -144
4062a44J34Q3j38j66R4P5j17L37j21N0Pk87L27j98K20k76j1K73j6k8j09j22J91
$$ -144 -10 73 -65 -231 -137 -62 -179 158 37 87 94 -193 134 -64 156 -120 -131 142 126 98 -11 -133 58
4085E8k2Qo0j10K16j01j11J3k5K4K84j65j35K15m44K50l5J60J20q6j66k36L87
$$ 58 36 44 -16 -126 90 -11 -122 -109 -134 -110 174 9 -126 89 -355 -105 -140 20 140 54 -112 -348 39
4108C9k83J39j6J67p7J71k16mJ43j92J17o2J70o4k31M08Kj65k45K99K3pL1j44
$$ 39 -244 -105 -121 46 -31 140 -76 -80 63 -129 -12 -74 96 32 -199 209 211 46 -199 100 123 116 147 3
4132Cr9j1K45l07J09M5M8O6K23m24J28O7L8j20J69j47J62k15k88L28o0K09j79
$$ 3 -96 -107 138 -169 -60 -15 33 99 322 -102 26 93 131 11 180 33 195 -20 -308 20 -40 169 -10
4155a0p7J86k30j64L31j4j66L27j54j90K26k66J36K42j68j18L93m50K94J39l6
$$ -10 -87 99 -131 -295 36 22 -144 183 29 -161 65 -201 -65 177 9 -109 284 -166 128 267 231
4176B31j18j43k1j43O9J46Q9l5M2p4k71Q1J04J90q9j01K99l28K50k22J45l22L24
$$ 231 113 -30 -51 -194 -125 21 110 75 117 43 -228 -147 -43 147 58 -43 256 -72 178 -44 101 -221 103
4199A03j70K43j85l5L4J14k76M1P1m9j3J97j41o4O9K5j57j13L49L3O9nk13P4P4
$$ 103 -67 176 -9 -44 -10 104 -172 -131 -60 -109 -122 75 -66 -130 -61 -36 -193 -306 43 76 145 140 -73 1 75
4224G5k07N3JJ20j01N5j41K76j99K04k99L20l12K30P7j36Oj84K4L15j99j6P2m0
$$ 75 -132 -79 -78 42 -59 -4 -145 131 -68 136 -163 157 -155 75 152 16 22 -162 -138 177 -22 -38 34 -6
4248fJ03K4j29LJ90k89j88J29k5K67m6j20K1J09R2O0j90j19K37l9l90K15P6p3
$$ -6 97 121 -8 -5 185 -104 -292 -163 -188 79 33 -87 -66 43 135 195 5 -114 123 84 -306 -91 -15 -88
4272h8j50K95q3J82j44j74J17k62L38j40J6J70o9rj24K11k24K83k34j3Q3l48L99
$$ -88 -238 57 -26 156 12 -162 -45 -307 31 -109 -93 77 8 -1 -125 86 -138 145 -89 -102 -19 -367 32
4295C2j10N4N3j18J94j50r6K43N2k4n2l03L86p1j4j76Q4L68j89j84n7R3O6J79
$$ 32 -78 -24 29 -89 105 -45 -141 102 154 130 78 -225 161 90 76 -100 -16 352 163 -21 -78 15 81 260
4319B60m12K97m2l38J53N8O0O0n1k35J25j04J74K17j62P7q9r3J07j04j5o9J8K46
$$ 260 -152 145 103 -235 -82 -24 36 96 45 -190 -65 -169 5 222 60 137 48 -45 62 -42 -57 -126 -108 138
4343A38q8N7J89j79p2j63k4K28j61M8j24K5J62J39j28N1N1j90N5j01K19q7O0J24
$$ 138 50 107 296 117 45 -118 -142 86 -75 -27 -151 -126 36 175 47 98 149 -41 14 -87 132 45 105 229
4367B29k94Q0M2J0j69K09k41J28l00J68J18Q5k17R2J11Lj55K23j26j44K10r1r
$$ 229 -65 15 57 67 -102 107 -134 -6 -306 -138 -20 65 -152 -60 51 54 -101 122 -4 -148 62 -29 -38
4390c8KJ18j15M3J85k31j9mL6O6K24m17J38P5n5o6P0J19j62j3q1K7K49r4qj03
$$ -38 -36 82 -33 10 195 -36 -55 -59 -23 43 267 -150 -12 63 8 -58 12 131 -31 -44 -125 -98 151 57 49 -54
4416e4j23J14J12p6Q8L13k88l6Q3j7R7j48Pk83L00k17j84L23K14j16K8k67lk8
$$ -54 -177 -63 49 -27 61 374 86 50 133 116 213 65 72 -211 89 -128 -312 11 225 109 137 -130 -133 -161
4440a61J22o9K3ML39k53j04J07K44m19L04k34J34l0k91J44K92j92o3L13k85n0
$$ -161 -39 -108 -85 -81 258 5 -99 8 252 -167 137 -97 37 7 -284 -140 152 -40 -103 210 -75 -125
4462a25o1J04J41R0k1j3j73K4o4R0P5M8j77P9P8j6J2j02l1J17l73L28j08K33j62
$$ -125 -186 -82 59 149 128 115 -58 -34 -98 -8 67 115 -62 17 95 79 91 -11 -42 75 -298 30 -78 155 -7
4487gj46K61O1Nl78J93j2k3J06N9q9j84K8m9Q6j52J53K54k9j16K6kn8L9l22J00
$$ -7 -153 108 169 174 -204 -11 -23 -46 60 119 30 -154 -126 -175 -89 -241 -88 166 137 21 47 45 -13 26 -296 -196
4513a96J00J55J34j58k2k05K10O9o5L9mm1R2q4o2j0N6r9J72k96L00m7o6k36J49
$$ -196 -96 59 193 35 13 -192 18 87 22 61 57 16 108 24 -38 -48 8 -91 81 -215 85 38 -28 -264 -115
4538a15J19J49k67q4L72j38Q5j79J83j25l2J65k74L14j88J93k66L7P3j25Ql5K8
$$ -115 4 153 -114 -198 174 36 121 -58 125 0 -32 133 -141 173 -15 178 -88 -51 22 -103 -95 -130 -102
4561a02L2K51l62L9J04j98K8L81k37j7J22L8j11J87j84M5O3j32k70O10j57k06
$$ -102 -70 181 -181 -142 -38 -236 -208 173 -64 -81 41 79 -32 155 -29 16 79 -53 -323 287 130 -76
4583g6Q8N3K3q8Q5l42K04Q3j10N0r9K14j40L3p2L31l18Qm4J87j22k6J76j59J32
$$ -76 12 65 88 0 85 -257 -53 30 -80 -30 -129 85 -55 -22 -94 237 -81 -73 -117 70 -52 -78 98 -61 71
4608G1ql2N6j94J53N6J04J19l63O8j69J37j26L39p9j84K15j0j81m2J15L4q4J28
$$ 71 63 31 87 -107 46 102 206 325 -38 30 -139 -2 -128 211 132 -52 163 153 -28 -70 45 79 -5 123
4632A23p6o9J08j88j72M95l70J77j72K88j19J50K2j08k82K13R1Qk78L39j4k38
$$ 123 47 -22 86 -102 -274 221 -149 28 -144 144 25 175 197 89 -193 20 111 119 -159 180 166 -72
4654g2l5N4K24k52j88K26L0j95n8K99N9j35N9j55J94k4Q1l62L61k05Q3r9j43K43
$$ -72 -107 -53 171 -81 -269 -43 -13 -208 -266 33 92 -43 16 -139 55 31 112 -250 111 -94 -11 -110 -253 -10
4678a0k60L09r3N8O9l7j15P6j82O0q9J73j27J34j8N5j02J75K7p8J98l25M09k39
$$ -10 -270 39 -54 4 73 36 -79 -3 -185 -125 -214 -41 -168 -34 -52 3 -99 76 103 25 223 -102 307 68
4702F8j46N1R8K2l9j45K6K06Q1l38j40L40k25K21J49k36k20J11L3mK92k00P0l6
$$ 68 -78 -27 71 93 54 -91 -65 141 222 -116 -256 84 -141 80 229 -7 -227 -116 -83 -87 205 5 75 39
4726C9j58J16J83j88OL2Nj46O4j7K54j42j24J72m11L75K7p3k4J25L8j73K1K6q9
$$ 39 -119 -3 180 -8 -2 30 35 -111 -47 -64 190 48 -76 96 -315 60 87 14 -10 115 153 -20 1 27 -62
4751f2K23k97J11o0j47q6L14J03j36L9K38o6j53L7L3p2j66p4L30nj28L16l95J41
$$ -62 161 -136 -25 -85 -232 -318 -4 99 -37 2 240 174 21 58 91 19 -147 -221 109 104 -24 292 -103 38
4775C8nj55N5K23R7k64J44j94O5j61L85n3m06L87j72RQ7N8R2l85K04j12M7J17
$$ 38 33 -122 -67 156 253 -11 133 -61 4 -157 228 175 -231 156 -16 -7 80 138 230 -155 49 -63 -16 101
4799A01R7j98o5J05j47J47j11J57j6Q0k29jJ76J06o2k0k4N8j91l0L12j74j36J82
$$ 101 198 0 -65 40 -107 40 -71 86 70 150 -79 -80 96 202 140 120 96 154 -37 -67 245 71 -65 117
4823A17k95J65Q6O0j48R0L6j02j19Q4k1j51M07k08o8K78k13l1n4J73JO8n9q7q9
$$ 117 -178 -13 73 133 -15 75 111 9 -110 -26 -47 -198 209 1 -67 211 -2 -33 -87 86 87 155 96 9 -80
4848h0R0j25k6K59j89KJ07q0K43j05q2j1O7Lj56J15j3nK20k22K64J24m17Qk39
$$ -80 10 -115 -141 118 -71 -69 38 -42 201 96 14 3 70 73 -83 32 19 14 234 12 276 400 -17 -9 -248
4873b48J34j46L45l3l7M1l30L25m10N25k20N2l11M54j30j42j13K60J16j13J73
$$ -248 -114 -260 85 52 15 56 -274 51 -359 166 -54 -2 -313 141 11 -131 -244 16 132 19 192
4894A92k10j08K26l57J89K2R9o0o5K15j20j38J8m4K92q4l55N68l25Lk6L9K4k40
$$ 192 -18 -126 100 -257 -68 -46 53 -7 -72 143 23 -115 -97 -141 151 67 -288 280 -45 -42 -68 -29 -5 -245
4918b45K46q6ok7K25k40K44k42J33l9%j24M25m18o7K78j71q4L53l34N7n3m9L79
$$ -245 1 -85 -91 -118 107 -133 111 -131 2 -37 -37 -161 264 -154 -221 57 -114 -198 155 -179 -122 -175 -224 155
4942A55O9j33j00Q8%l1N7j94j31K79j2k46M37q8k16Q2o8K09j93n5J83j64J11m6
$$ 155 224 91 -9 79 79 48 105 -89 -220 59 47 -199 238 150 -66 16 -52 157 -36 -91 92 -72 39 -7
4966gj62K3J48M5j35m3J04J55N4p2j49K30k42J52n0M6p3p5M1J96j74j65J86j20
$$ -7 -169 -146 2 47 -88 -131 -27 128 182 110 -39 191 -51 101 51 97 24 -51 -10 186 12 -153 33 -87
4990h7O3o4q1L24l8j12J77j85n0L91m02O7J03j44J74O3j31K4l75K02K78j33o6
$$ -87 -24 -88 -169 155 117 5 182 -3 -53 338 -64 3 106 -38 136 199 68 92 -283 -81 197 64 -2
5013bn1Q4M5m1k20L04k16k27L70j81K9J34J9L05l36r2K22j09P7j50N5k72K68j77
$$ -2 -53 31 76 35 -185 119 -97 -324 46 -135 -106 28 47 352 16 -76 146 37 114 -36 19 -253 15 -162
5037a62J93P9j96J94o9Q1k13J53k09K02l6K07j2l12K98j02Nj50J99k67K50l26
$$ -162 31 110 -86 108 39 120 -93 60 -149 53 17 224 212 -100 198 96 101 -49 150 -117 133 -193
5059a93J98K66l81k1K30l7j67l21L11K95l04L08j26k0k28N3J91j23K24k41K28
$$ -193 5 271 -110 -131 99 62 -105 -426 -115 180 -124 184 58 38 -190 -137 54 -69 155 -86 142
5080A42r5k96L32j56J53p8m3M07m85L34l21J69j37R0%k28J06J46j50J02J82P9
$$ 142 47 -249 83 -73 80 2 -41 366 -119 215 -106 63 -74 16 16 -212 -106 40 -110 -8 174 253
5102B53j70j46J61k9j42K64j84P0k7J46k91J16K15k4j38p9J52p8j18P0Q8O8k40
$$ 253 83 -63 98 69 -73 191 7 77 50 196 -95 21 236 212 74 -5 147 69 -49 21 109 177 -63
5125f3l2J64m6j5k39K47j02J37o0j22q7J69n0K32m7J68k93J11O1R4k38j32J99
$$ -63 -95 69 23 8 -231 16 -86 51 -9 -131 -218 -49 -99 133 86 254 -39 72 133 227 -11 -143 56
5148E6J6L4k78K46k6J7m3p6j84L23K37n45K17J05r6q3L7J50k5p1J74k71J78k74
$$ 56 72 106 -172 74 48 65 22 -54 -238 85 322 -223 -6 99 3 -80 -43 107 82 11 185 -86 92 -182
5172a82J16l78L77L3j50J99K60k39J2P9k70K42k05J07l1j9K66n2l0l34K76Pk0
$$ -182 -66 -444 -67 -34 -184 15 275 36 48 127 -143 99 -106 1 -30 -49 217 165 135 -199 77 84 64
5195F4j8j09J34j25J95N8j1k35j77K14L06m46L48j89p6m4R4r5P3n5J88K9k43J00
$$ 64 46 -63 71 -54 141 199 188 -47 -224 -10 296 -150 198 9 -67 -111 -17 -112 -39 -94 94 123 -120 -20
5219b0Oj22j5J22J17l1Jj12m4K18m4j71P7K28j61j33l3J93l13J52K79j54j51j2
$$ -20 -14 -136 -151 -29 88 57 58 -54 -98 120 76 -95 -18 210 49 -84 -117 76 -237 -85 194 40 -111 -123
5243a23k6J18m4J12j23N7K55k25LJ00j31J95l92K84p5J84k57J81j06k9j3J8L85
$$ -123 -149 -31 -75 37 -86 -29 226 1 4 104 -27 168 -224 60 -15 169 -88 93 -13 -42 -55 -37 348
5266C48l85P5q5KJ7K0m3k0J16o1N2n5r4K84k95J56J64k38J25N7J01j75P1r9k7
$$ 348 -37 38 -47 -45 -28 -8 -51 -71 45 -16 36 -19 -113 171 -124 32 196 -42 83 140 241 66 137 38 11
5291A1K34j07k23J48q4lL6n8J93l44K05%J95k76K26K21q3l21LN8P8l62M50n6p6
$$ 11 245 138 -85 63 -21 -24 12 -46 147 -197 8 8 203 -73 153 374 291 -30 -27 31 109 -253 197 141 65
5316F5l22J74J99l11K02j36L88j11l97R9k5R3j21N0J55k80L11p1J72j54o5J32
$$ 65 -257 -83 116 -195 7 -129 259 148 -249 -150 -175 -82 -203 -153 2 -278 33 -38 134 -20 -85 47
5338D7l97L93N3k65J32j20K57k35J29J14p4J99l53J81j19J31r6j75J97J09J33
$$ 47 -350 43 96 -169 -37 -157 100 -135 -6 108 34 233 -120 61 -58 73 -23 -198 -1 108 241
5359B41k53k12J59j54K89m36J78L22k35M2J23k24N9p3L17r2k70K08m1m8M67l30
$$ 241 -12 -224 -65 -219 70 -366 -188 134 -101 -59 64 -160 -101 -174 143 51 -219 -11 -52 -100 367 37
5381C7l4o5J58p1j6j13K24l33J91q6K68p1m2l73M72k57K50j03k6J36p0q6k61O9
$$ 37 3 -62 96 25 9 -104 120 -213 -22 -108 160 89 47 -326 146 -111 139 36 10 146 76 -10 -271 -202
5405b02J32o8O8L01l83K62j75J00PNq9K12l2j8M5n4k5M4p2k06J01J89k49N0J83
$$ -202 -70 -138 -70 231 -152 110 -65 35 42 47 -42 170 138 120 165 111 86 130 58 -148 -47 142 -107 -57 126
5430A26Mj70J43q8J23j19j93J98k5l5J32J25l31J00j03P8N9O3p6k10R9J17J95
$$ 126 130 -40 103 15 138 19 -174 24 -1 -36 96 221 -110 -10 -113 -35 24 87 11 -199 -100 17 212
5453B12J30l34j5J1j10j22J36J23M1P2j69RN6K1J90l64j61N77l26M45m11K02m34
$$ 212 342 8 -7 4 -106 -228 -92 31 72 144 -25 -16 40 61 251 -113 -274 303 -23 422 11 213 -221
5476b21P6J82J51j07L3j69J13J74l68lQ7P5j6J08n0j91n3K3r1J08j56L70O6q6
$$ -221 -145 37 188 81 114 -55 58 232 -136 -139 -52 23 7 115 65 -126 -179 -156 -247 -139 -295 75 141 55
5500E5o2P6j96K3M6J80m3J96l25Q0qQ8o4K17k95J08L3p8j23J49l02J01M3K41q1
$$ 55 -7 69 -127 -104 -58 122 79 275 -50 30 22 110 46 263 -32 76 109 31 -92 57 -245 -144 -101 140 59
5525E9l0J3k94M65l17K96j25P5j90N5k8o9J31n5J26j5j78K45r0J07k70J09l93
$$ 59 29 42 -252 213 -104 192 67 142 -48 7 -21 -90 41 -14 112 97 -81 164 74 181 -89 20 -373
5548c73M65j17K23L1k14O3k4Rm2M5k23J93k34J12K0J3O0rO1N7l4L0qL1k63J65
$$ -373 92 -25 198 229 15 78 54 63 21 66 -157 36 -198 -86 -66 -53 7 -2 59 116 82 112 104 135 -128 37
5574C7J16j34j50k3J57L7K98l65L69l80L87m97J67k07K50N4l42K92j43J76r9M9
$$ 37 153 19 -131 -154 3 40 338 -27 342 -38 349 -148 19 -188 62 116 -226 66 -77 99 0 49
5596D9M4ol9j35L07k97k82L25J43P2j91J6k9K48k71J01j21K57o2j73j02J61J31
$$ 49 93 87 48 -87 220 -77 -359 -34 109 181 -10 6 -23 225 -46 55 -66 191 129 -44 -146 15 146
5619A46p5o5p8j95K90j53J37J07k01J17K5m5K40j17j73K02p8j84l2J42N0j43J75
$$ 146 71 6 -72 -267 23 -130 7 114 -87 30 55 10 250 133 -40 162 84 -100 -132 10 60 -83 92
5642I2n2nJ31L7l77K70k45K2p8K77J24j05L5J81l0k97K7m8Q7j09ol6K12k84J5
$$ 92 40 35 166 203 -174 96 -149 -127 -205 72 196 91 126 307 277 -20 7 -41 46 -63 -69 -105 107 -177 -162
5667a62QR1K60O3l56J15m1O2Q0q5j29M5J16J64k34j2J88j37K52k12r4J40R6n9
$$ -162 -154 -63 197 260 -96 19 -22 40 120 35 -94 -49 67 231 -3 -15 173 36 288 76 -18 122 218 159
5691A59j82r4K8l1J23K31o7j51k84L51j59m0M4K15k72J49k6m1Q6J24l7R8j73l8
$$ 159 -23 -117 -89 -120 3 234 167 16 -268 83 -76 -116 -72 143 -129 20 -6 -47 39 163 126 224 51 13
5715A3j68K90n1l22K14L6N5q0J06l34J05R3j19R2J48n2k43K13j1J0J40J24P0m70
$$ 13 -155 135 84 -238 -24 12 67 -13 93 -241 -136 -43 -162 -70 78 26 -217 -4 -15 -5 135 259 329 -141
5739a41J74p0k1J44q0j22M0M3k9J37k77M34l56N9J41k13N9k9J88LJ59l10L23l24
$$ -141 33 -37 -58 86 6 -116 -76 -33 -62 75 -202 232 -124 -65 76 -137 -78 -107 81 84 243 -67 256 -68
5763f8o6K25L7k27j03K79Q1j30M2ql7q8K0r6J72k14Q1L77k08r7K60n6j67R0j88
$$ -68 -134 91 128 -99 -202 77 158 28 70 62 25 -63 -43 -139 33 -181 -100 277 69 -28 232 176 9 99 -89
5788h9jj0K50k16P6j74J57j43J26n7P1M0j03J19j6k0L1Q1j2j94O9Q1j58L0Q5q9
$$ -89 -90 -100 150 -66 10 -164 -7 -150 -24 -81 -10 30 -73 46 30 10 41 122 110 -84 -15 66 -92 -62 23 -66
5814f6n8J94j32oJ92j24J00m9N3k54K50M0j85K03l07J37Q4Jk8k8j05j5K43o5l02
$$ -66 -124 70 -62 -68 124 0 100 51 104 -150 100 140 -45 158 -149 -12 72 73 45 17 -88 -103 140 75 -227
5839b27K82OM3k65J62n3J24l0L8m9N2l4J0k00J33p1Q3J47n8j22O6k46R1K44q4
$$ -227 55 61 104 -161 1 -52 72 42 80 31 83 49 59 -141 -8 -79 4 151 93 -29 37 -209 -118 126 42
5864D2J69l00L4J47n8J93j20Q1k11J51k89J08J13J7j00R1r1J6p8J44n0j83L24
$$ 42 211 -89 -55 92 34 227 107 188 -23 128 -161 -53 60 77 -23 68 -23 -7 -85 59 9 -174 150
5887A50k71O8M21j92l90Q4L12Jk97J70k14J94j47K70j05k31Q8J03N3L3r2J26j48
$$ 150 -121 -53 368 176 -214 -130 182 183 -114 56 -158 36 -111 159 54 -177 -89 14 67 100 8 134 -14
5910a4J86j08j24j8l5J69n0J56q3m9j91L41j66n6M9kM1j37J95J33j72mk36K12
$$ -14 172 64 -60 -78 -113 56 6 162 79 30 -161 180 14 -42 7 5 46 -91 104 237 65 61 -175 37
5934C7PJ27j84q5K45j66O0K7j06j2J88o1k17J99K3rJ61k05l92M51j26O3j7j84
$$ 37 44 171 -13 -98 147 -19 41 68 -38 -50 138 77 -140 59 82 73 234 29 -363 88 -38 25 8 -176
5958a76J29M3J03O1k46J10L4p7j04k9K24N4n4j66J60j45K42k77L2J65j04p6K07
$$ -176 -47 -4 99 160 -86 24 58 -19 -123 -152 72 126 72 -94 66 -79 163 -114 -82 83 -21 -97 110
5981A10j3N4j73K69j52k53O1J34P7K9k98L62q5k70L13j05L3j0L62p03M05p6r4
$$ 110 97 151 -22 247 95 -158 -97 37 114 143 -155 207 122 -148 165 60 93 83 445 -258 147 71 -23
6004b3k2J05j35k2K74l21p7m6N07l31J16j46K40q8M8L2p1k71N44k95j15M06q7
$$ -23 -45 60 -75 -97 177 -144 -221 -267 240 -91 25 -121 119 31 79 111 40 -231 313 18 -97 309 222
6027B22k28j07K16o4j10Q1l2k3J02k70K44m4L00j91P5j28q6oJ06k52K74j02j16
$$ 222 -6 -113 103 39 -71 10 -22 -45 57 -213 31 -13 287 96 171 43 -43 -49 57 -195 79 -23 -139
6050a39P4j23K45j20q4J96q1P4m3q0K08j60R3L8l36K80j7J19q8k5k81J64J22K5
$$ -139 -65 -188 57 -63 -147 49 -32 42 -1 -81 127 -33 60 98 -238 42 25 144 56 31 -250 -86 36 61
6074F1J1j89L24k13k73L98j0j87o1J59K41l59J9o0J57p1j6j1P8Q7k55K64Q8k29
$$ 61 72 -117 207 -6 -279 119 109 -78 -139 20 261 -98 -79 -139 18 -53 -69 -80 -2 85 -170 94 182 -47
6098d7J21l22J60M0J22lJ14j59Q9k6j84l6Q3mJj68L19k80K63j77J53J06p9j15
$$ -47 74 -248 -88 -48 74 71 185 26 115 89 -95 -131 -48 -52 -51 -219 100 -180 83 -94 59 165 86 -29
6122b9Q5O8J68k35j31J45J24l0l27M58k58R0j99J89oj35j46K85k30N5J77j4k00
$$ -29 56 124 292 57 -74 71 195 165 -162 296 38 128 -71 118 112 -23 -169 116 -114 -59 118 104 -96
6145i6Q3l1m8Q2j71O6K07j91K30p2k75J78m8J78o3j37k3M49m62J11r2R7O8j2k2
$$ -96 -13 -44 -92 -10 -181 -115 92 -99 131 59 -216 -38 -86 92 29 -108 -131 318 -144 -33 -125 -28 40 28 6
6170Fl7N5j8j43Q6P4P8l8k24L73j90L0N1J89k49q8j20K02N7j16p6O7J80q4j66
$$ 6 -31 24 6 -137 -51 23 101 63 -161 212 22 52 103 292 43 -45 -165 37 94 -22 -98 -31 149 65 -101
6195a01q8K31n9q0K01r2q3n5K45jl08K75o9L00l06m5J48m5k01K39m7j34K3J91
$$ -101 -189 42 -17 -97 104 12 -71 -126 119 118 -190 85 16 316 10 -35 113 68 -133 106 59 -75 -52 139
6219A39k58k9R0j05R4J3r3J67j68K13q1r1j91K07J38n3L3J8K0k68J94P5J05j97
$$ 139 -119 -148 -58 -163 -69 -56 -149 18 -150 63 -18 -109 -300 -93 45 -8 25 43 63 -205 -11 64 169 -28
6243b8k0k40K1L41k27oL3J15k9l2J43m0j92Q8l4j98L08j46K27p5j50J56j41J89
$$ -28 -48 -288 -267 74 -153 -159 -126 -11 -40 -72 71 31 -161 -73 -107 -305 3 -143 84 9 -141 15 -126 63
6267F3N5J3j27q6K12J6k92J42q6K03j24q3J01j06R7N0q4M5j67K18k24J09R4j07
$$ 63 118 131 4 -82 130 146 -146 -4 -90 113 -11 -94 7 -99 -2 48 -36 9 -158 60 -164 -55 39 -68
6291f8J88K0j83Ro9M4K44l68j20M35l20N48l40j40k61L59R4j42p3N2J39p0q2k7
$$ -68 120 140 -43 -34 -103 -59 185 -183 -303 132 -188 360 20 -120 -381 -22 72 -70 -143 -91 48 -22 -104 -131
6315a31L00k14N9oK0k28L44j85J49k95L19p9j86L14k20P1j60K40k8j15o0O1M4
$$ -131 169 -45 14 8 28 -200 144 -41 108 -187 132 53 -133 181 -39 32 -128 112 84 -31 -91 -30 14
6338A4q2J39o4j54J32J62J21j64o0N1j93Q9J25k6j92J35r6N4j00O3Qj18J30j9
$$ 14 -68 71 7 -147 -15 147 268 104 44 95 -98 -9 116 90 -102 33 -63 -9 -109 -46 -38 -156 -26 -45
6362d5q6jK64j5j92j03M9l2K29q3K29j90m9J98l1j56j54J57j48K11Q5j48J14K4
$$ -45 -131 -132 132 117 -75 -178 -129 -161 68 -15 214 24 -25 173 142 -14 -168 -11 -159 52 137 -11 103 127
6386A27k32R5J25j73J8j95K08L8l18N18j90q7J55j51L8j8J9j6m3J02r4N3K6l55
$$ 127 -105 -10 115 -58 -40 -235 -27 11 -307 211 21 -66 89 -62 -24 -42 -23 -39 -82 20 -74 -21 5 -350
6410c50K53J55m1j98R2j52L05p0o9P4qK68k37j16K56k54J70qo9r6K70m35L66j68
$$ -350 -97 58 17 -181 -89 -241 64 -6 -75 -1 -9 259 22 -94 162 -92 78 70 1 -95 175 -260 106 -62
6434f2K5k0j89J27m3K04j02K37j48K66j60k14J06p9j6J77j37k3p5K21k9J12j97
$$ -62 -37 -57 -246 -119 -162 42 -60 177 29 295 135 -79 27 -52 -68 109 -28 -51 -126 95 66 178 -19
6457a9kJ4N6j13J48j44J36q3l6jP9o0O1l7l8K49l10J33m9k24K75j4l8j44J81m
$$ -19 -21 -7 49 -64 84 -60 76 -7 -43 -44 35 -25 36 -1 -39 210 -100 33 -16 -240 35 21 -17 -161 20 16
6483A6M2k31J41J25r1P3l9k16J76J04j36K48j52M4j34j25K32J9j63M0r3qN0Q4
$$ 16 58 -173 -32 93 2 75 36 -180 -4 100 -36 212 60 104 -30 -155 77 96 -67 -27 -120 -128 -78 6
6507Flk15K33J00L3Np6j17r0K99k76O2P4n8j83m7K38l4K1r2K24p1r5J77K18n50
$$ 6 3 -212 21 121 154 159 83 -34 -124 175 -101 -39 35 -23 -206 -253 -15 -49 -28 -120 104 33 -62 115 333 -217
6533b17P3K30j35J97k50J17r6%m7J05j86M93l59K64k02J76j12j12L0oJ9J2J74
$$ -217 -144 86 -49 148 -102 15 -81 -81 -128 -23 -209 284 -75 189 -13 163 51 -61 -31 -37 -18 -6 168
6556A68l62L08l58M06l50L93o7j43l7K14l72M01m49j49L55K0N4r7j91L37k00K96
$$ 168 -194 114 -244 162 -188 205 138 -5 -42 172 -200 201 -248 -397 -42 -22 32 -65 -256 81 -119 177
$$ [...]
8191H
##END NTUPLES=NMR FID
##END=
