##TITLE=1H_Pr T-108-d
 DMSO, 8 sc, 
 18.12.2019
##JCAMPDX= 6.0         $$ Bruker NMR JCAMP-DX V2.0
##DATA TYPE= NMR FID
##DATA CLASS= NTUPLES
##ORIGIN= UXNMR, Bruker Analytische Messtechnik GmbH
##OWNER= root
$$ XWIN-NMR		Version 3.5
$$ Wed Dec 18 14:19:04 2019 Russian Standard Time (UT+4h)  she@DPX200
##.OBSERVE FREQUENCY= 200.1315
##.OBSERVE NUCLEUS= ^1H
##.DELAY= (6, 6)
##.ACQUISITION MODE= SIMULTANEOUS
##.ACQUISITION SCHEME= undefined
##.AVERAGES= 8
##.DIGITISER RES= 18
##SPECTROMETER/DATA SYSTEM= spect
##.PULSE SEQUENCE= zg30
##.SOLVENT NAME= DMSO
##.SHIFT REFERENCE= (INTERNAL, DMSO, 0, 15.7039)
##AUDIT TRAIL= $$ (NUMBER, WHEN, WHO, WHERE, WHAT)
$$ ##TITLE= Audit trail, XWIN-NMR		Version 3.5
$$ ##JCAMPDX= 5.01
$$ ##ORIGIN= Bruker BioSpin GmbH
$$ ##OWNER= she
$$ F:/spectra/data/she/nmr/H-F/1/audita.txt
$$ ##AUDIT TRAIL=  $$ (NUMBER, WHEN, WHO, WHERE, WHAT)
(   1,<2019-12-18 14:18:10.79 +0400>,<she>,<DPX200>,
      <created by zg, POWCHK disabled, PULCHK disabled
       configuration hash MD5:
       00 E9 B6 7A A2 85 ED C7 34 08 36 98 17 FE 4E 26
       data hash MD5: 16K
       B1 FF 6D 16 13 7C 83 1F CA B5 6B 7E 77 65 8F 49>)
$$ ##END=
$$ 
$$ hash MD5
$$ 02 B6 0E 0C 1B 53 0E 2C B1 44 A2 51 42 5E 7B BB
##$RELAX= 
##$RELAX= 
##$RELAX= 
##$RELAX= 
##$RELAX= 
##$RELAX= 
$$ Bruker specific parameters
$$ --------------------------
##$DU= <F:/spectra>
##$EXPNO= 1
##$NAME= <H-F>
##$PROCNO= 1
##$TYPE= <nmr>
##$USER= <she>
##$AMP= (0..31)
100 100 100 100 100 100 100 100 100 100 100 100 100 100 100 100 100 100 
100 100 100 100 100 100 100 100 100 100 100 100 100 100 
##$AQSEQ= 0
##$AQ_mod= 1
##$AUNM= <au_zg>
##$AUTOPOS= <>
##$BF1= 200.13
##$BF2= 200.13
##$BF3= 200.13
##$BF4= 200.13
##$BF5= 200.13
##$BF6= 200.13
##$BF7= 200.13
##$BF8= 200.13
##$BYTORDA= 1
##$CFDGTYP= 0
##$CFRGTYP= 5
##$CHEMSTR= <none>
##$CNST= (0..31)
1 1 145 1 1 1 1 1 1 1 1 1 1 1 1 1 1 1 1 1 1 1 1 1 1 1 1 1 1 1 1 1 
##$CPDPRG= <>
##$CPDPRG1= <>
##$CPDPRG2= <>
##$CPDPRG3= <>
##$CPDPRG4= <mlev>
##$CPDPRG5= <mlev>
##$CPDPRG6= <mlev>
##$CPDPRG7= <mlev>
##$CPDPRG8= <mlev>
##$CPDPRGB= <>
##$CPDPRGT= <>
##$D= (0..31)
0 1.2 0 0 0 0 0 0 0 0.06 0 0.03 0 0 0 0 0.0002 0 0 0 0 0 0 0 0 0 0 0 0 
0 0 0 
##$DATE= 1576664290
##$DBL= (0..7)
120 120 120 120 120 120 120 120 
##$DBP= (0..7)
150 150 150 150 150 150 150 150 
##$DBP07= 0
##$DBPNAM0= <>
##$DBPNAM1= <>
##$DBPNAM2= <>
##$DBPNAM3= <>
##$DBPNAM4= <>
##$DBPNAM5= <>
##$DBPNAM6= <>
##$DBPNAM7= <>
##$DBPOAL= (0..7)
0.5 0.5 0.5 0.5 0.5 0.5 0.5 0.5 
##$DBPOFFS= (0..7)
0 0 0 0 0 0 0 0 
##$DE= 6
##$DECBNUC= <off>
##$DECIM= 24
##$DECNUC= <off>
##$DECSTAT= 4
##$DIGMOD= 1
##$DIGTYP= 9
##$DL= (0..7)
0 120 120 120 120 120 120 120 
##$DP= (0..7)
150 150 150 150 150 150 150 150 
##$DP07= 0
##$DPNAME0= <>
##$DPNAME1= <>
##$DPNAME2= <>
##$DPNAME3= <>
##$DPNAME4= <>
##$DPNAME5= <>
##$DPNAME6= <>
##$DPNAME7= <>
##$DPOAL= (0..7)
0.5 0.5 0.5 0.5 0.5 0.5 0.5 0.5 
##$DPOFFS= (0..7)
0 0 0 0 0 0 0 0 
##$DQDMODE= 0
##$DR= 18
##$DS= 0
##$DSLIST= <SSSSSSSSSSSSSSS>
$$ [...]
##$SUBNAM2= <"">
##$SUBNAM3= <"">
##$SUBNAM4= <"">
##$SUBNAM5= <"">
##$SUBNAM6= <"">
##$SUBNAM7= <"">
##$SUBNAM8= <"">
##$SUBNAM9= <"">
##$SW= 24.9337058887773
##$SWIBOX= (0..15)
0 0 2 0 0 0 0 0 0 0 0 0 0 0 0 0 
##$SW_h= 4990.01996007984
##$TD= 16384
##$TD0= 1
##$TE= 0
##$TE2= 300
##$TE3= 300
##$TEG= 300
##$TL= (0..7)
0 120 120 120 120 120 120 120 
##$TP= (0..7)
150 150 150 150 150 150 150 150 
##$TP07= 0
##$TPNAME0= <>
##$TPNAME1= <>
##$TPNAME2= <>
##$TPNAME3= <>
##$TPNAME4= <>
##$TPNAME5= <>
##$TPNAME6= <>
##$TPNAME7= <>
##$TPOAL= (0..7)
0.5 0.5 0.5 0.5 0.5 0.5 0.5 0.5 
##$TPOFFS= (0..7)
0 0 0 0 0 0 0 0 
##$TUNHIN= 0
##$TUNHOUT= 0
##$TUNXOUT= 0
##$USERA1= <user>
##$USERA2= <user>
##$USERA3= <user>
##$USERA4= <user>
##$USERA5= <user>
##$V9= 5
##$VALIST= <valist>
##$VCLIST= <CCCCCCCCCCCCCCC>
##$VD= 0
##$VDLIST= <DDDDDDDDDDDDDDD>
##$VPLIST= <PPPPPPPPPPPPPPP>
##$VTLIST= <TTTTTTTTTTTTTTT>
##$WBST= 1024
##$WBSW= 4
##$XGAIN= (0..3)
0 0 0 0 
##$XL= 0
##$YL= 0
##$YMAX_a= 270794
##$YMIN_a= -184969
##$ZGOPTNS= <>
##$ZL1= 120
##$ZL2= 120
##$ZL3= 120
##$ZL4= 120
##$ABSF1= 10
##$ABSF2= 0
##$ABSG= 5
##$ABSL= 3
##$ALPHA= 0
##$AQORDER= 0
##$ASSFAC= 0
##$ASSFACI= 0
##$ASSFACX= 0
##$ASSWID= 0
##$AUNMP= <proc_1d>
##$AZFE= 0.1
##$AZFW= 0.1
##$BCFW= 1
##$BC_mod= 2
##$BYTORDP= 1
##$COROFFS= 0
##$CY= 11.3945322036743
##$DATMOD= 1
##$DC= 2
##$DFILT= <>
##$DTYPP= 0
##$F1P= 16.9975609425685
##$F2P= -3.02152046262296
##$FCOR= 0.5
##$FTSIZE= 0
##$FT_mod= 4
##$GAMMA= 1
##$GB= 0.15
##$INTBC= 1
##$INTSCL= 1
##$ISEN= 128
##$LB= 0.24
##$LEV0= 0
##$LPBIN= 0
##$MAXI= 10000
##$MC2= 0
##$MEAN= 0
##$ME_mod= 0
##$MI= 1.114404
##$NCOEF= 0
##$NC_proc= 0
##$NLEV= 6
##$NOISF1= 3.799351
##$NOISF2= 2.8
##$NSP= 1
##$NTH_PI= 0
##$NZP= 0
##$OFFSET= 15.70392
##$PC= 1
##$PHC0= -9791.381
##$PHC1= 19.40081
##$PH_mod= 1
##$PKNL= yes
##$PPARMOD= 0
##$PSCAL= 0
##$PSIGN= 0
##$REVERSE= no
##$SF= 200.130013532006
##$SI= 16384
##$SIGF1= 3
##$SIGF2= 2
##$SINO= 400
##$SIOLD= 16384
##$SREGLST= <1H.CDCl3>
##$SSB= 0
##$STSI= 0
##$STSR= 0
##$SW_p= 3612.71676300578
##$SYMM= 0
##$S_DEV= 0
##$TDeff= 0
##$TDoff= 0
##$TI= <>
##$TILT= no
##$TM1= 0
##$TM2= 0
##$TOPLEV= 0
##$USERP1= <user>
##$USERP2= <user>
##$USERP3= <user>
##$USERP4= <user>
##$USERP5= <user>
##$WDW= 1
##$XDIM= 8192
##$YMAX_p= 0
##$YMIN_p= 0
$$ End of Bruker specific parameters
$$ ---------------------------------
##NTUPLES= NMR FID
##VAR_NAME=  TIME,          FID/REAL,        FID/IMAG
##SYMBOL=    X,             R,               I
##VAR_TYPE=  INDEPENDENT,   DEPENDENT,       DEPENDENT
##VAR_FORM=  AFFN,          ASDF,            ASDF
##VAR_DIM=   8192,          8192,            8192
##UNITS=     SECONDS,       ARBITRARY UNITS, ARBITRARY UNITS
##FACTOR=    0.0002004,     1,               1
##FIRST=     0,             0,               0
##LAST=      1.6414764,     0,               0
##MIN=       0,             -184969,         0
##MAX=       1.6414764,     270794,          0
$$ Real data points
##PAGE= N=1
##DATA TABLE= (X++(R..R)), XYDATA
$$ plain form
0 0 0 0 0 0 0 0 0 7 -8 8 -8 8 -8 16 -16 24 -24 32 -35 43 -48 56 -69 80 -89 104 -119 135 -155 173 -195
31 -195 220 -247 275 -307 345 -382 424 -471 523 -579 642 -709 786 -871 964 -1074 1193 -1332
49 -1332 1494 -1682 1908 -2182 2526 -2969 3571 -4428 5767 -8162 13770 -56291 54465 212798
63 212798 78849 -111458 -184969 -74534 52960 105098 45080 -57091 -137755 -108115 12127
74 12127 117270 85967 -40198 -119846 -59232 59423 105534 31177 -77589 -119121 -61462
85 -61462 33459 75649 18932 -81357 -117230 -37563 75551 97383 5974 -89958 -83878 9010
97 9010 84873 74796 -397 -67606 -71822 -5394 77512 97298 24068 -72484 -86500 -1745 83097
110 83097 71967 -16593 -80405 -61926 4722 55689 60092 22399 -29259 -49953 -9031 59603
$$ packed form
0@%%%%%%%Pj5J6j6J6j6K4l2M0m8N6o7P8r1J04j25J49j69J93k23K54k90L28l68
31a95M15m67N22n82O52p27Q06q95R94j102J221j351J495j657J835k038K267k525
49a332K826l176L590m090M708n495O540p999J0195j3929K1932p0061J10756J58333
63B12798j33949j90307p3511J10435J27494N2138o0018j02171q0664K9640J20242
74A2127J05143l1303j26165p9648O0614J18655M6111p4357j08766m1532N7659
85f1462R4921M2190n6717j00289l5873P9667J13114K1832r1409r5932O080R2888
97I010P5863j0077p5193o7209m216O6428Q2906J9786p3230r6552j4016Q4755Q4842
110H3097j1130q8560o3812J8479O6648N0967M403l7693n1658k0694M0922O8634
$$ plain form
122 59603 76832 10088 -70124 -71374 7175 72759 55337 -14141 -54751 -32406 17011 41808
134 41808 23032 -19317 -50351 -43629 -4206 30063 23831 -14844 -40468 -23295 16755 37447
146 37447 20903 -14958 -40992 -37795 -6277 27162 26160 -15708 -55284 -41232 17265 55987
158 55987 31590 -24930 -48624 -20214 20651 29769 4461 -25561 -34634 -17124 12994 32750
170 32750 26258 180 -18762 -11741 11161 25723 16880 -6123 -23666 -18963 7150 31940 31919
183 31919 6502 -14386 -4405 25984 37522 13495 -19554 -25051 -563 22984 21865 2883 -10277
196 -10277 -5786 10421 23909 24951 10072 -11114 -19220 -4913 16586 20777 2190 -17090 -15405
209 -15405 4664 21925 22651 7850 -10931 -19932 -12055 6470 16233 2368 -22086 -29286 -7944
$$ packed form
122E9603J7229o6744q0212j250P8549O5584j7422o9478m0610K2345M9417K4797
134D1808j8776m2349l1034O722L9423L4269o232l8675k5624J7173M0050K0692
146C7447j6544l5861k6034L197L1518L3439j002m1868l9576J4052N8497L8722
158E5987k4397n6520k3694K8410M0865R118k5308l0022r073J7510L0118J9756
170C2750o492k6078j8942P021K2902J4562q843k3003j7543M703K6113K4790k1
183C1919k5417k0888R981L0389J1538k4027l3049n497K4488K3547j119j8982j3160
196a0277M491J6207J3488J042j4879k1186q106J4307K1499M191j8587j9280J685
209a5405K0069J7261P26j4801j8781r001P877J8525R763j3865k4454p200K1342
$$ plain form
222 -7944 21447 27757 6595 -17191 -18513 850 15623 8252 -13150 -25322 -17154 743 11019
235 11019 6894 -1714 -5120 -3196 570 4502 5892 -495 -12883 -20167 -9876 9763 17398 3921
249 3921 -13011 -9701 12473 26474 14125 -10714 -21114 -8301 8952 11713 202 -10638 -10202
262 -10202 423 13583 19215 12705 -1644 -10267 -4828 6613 11514 2534 -9760 -12625 -3530 9387
276 9387 16311 12774 2206 -7595 -7465 2837 11020 5045 -12582 -21955 -11567 8566 17568 7763
290 7763 -6940 -8429 3075 12675 7656 -6397 -15531 -12547 -3577 1775 578 -2753 -3110 -959 1094
305 1094 3097 4659 1319 -7125 -14789 -12238 -678 6862 1082 -10332 -10384 3660 15481 11573 -2330
320 -2330 -10811 -7204 724 2573 -1259 -6388 -8256 -4610 2724 9598 9525 2804 -2462 -1272 3188 3614
$$ packed form
222g944K9391O310k1162k3786j322J9363J4773p371k1402j2172Q168J7897J0276
235A1019m125q608l406J924L766L932J390o387j2388p284J0291J9639P635j3477
249C921j6932L310K2174J4001j2349k4839j0400J2813J7253K761j1511j0840M36
262a0202J0625J3160N632o510j4349q623N439J1441M901q980j2294k865R095J2917
276I387O924l537j0568r801J30J0302Q183n975j7627r373J0388K0133R002r805
290G763j4703j489J1504R600n019j4053r134K984Q970N352j197l331l57K151K053
305A094K003J562l340q444p664K551J1560P540n780j1414n2J4044J1821l908j3903
320b330q481L607P928J849l832n129j868L646P334O874p3o721n266J190M460M26
$$ plain form
336 3614 -739 -6070 -6237 -2459 1567 4739 7552 7412 3561 -229 1868 7586 7915 -2681 -12963
351 -12963 -10769 2452 11205 6389 -3220 -3880 5665 12580 8840 -80 -6144 -5756 -2852 -2078 -2402 -1419
367 -1419 214 878 417 2299 6084 6823 1173 -7404 -9501 -3606 1884 -597 -6905 -8211 -1470 6137
383 6137 7085 2168 -2577 -3212 -1250 -432 -2071 -5000 -7857 -6660 -2471 2707 4594 1893 -236 674
399 674 3602 3393 -814 -4324 -5303 -4405 -4163 -2337 2021 5970 4414 96 238 5388 7891 1871 -7483
416 -7483 -10042 -3277 3956 3042 -2044 -2036 4262 9428 7594 2405 -228 1011 734 -2314 -4478 -2270
432 -2270 405 1361 -430 1204 5012 7037 4365 -1147 -3149 -1281 97 -1641 -4761 -5580 -2093 1972
448 1972 4603 4056 2570 1235 1013 1243 637 -1505 -5468 -7265 -4848 -1067 850 -413 -865 1364
$$ packed form
336C614m353n331j67L778M026L172K813j40l851l790K097N718L29j0596j0282
351a2963K194J3221Q753m816r609o60R545O915l740q920o064L88K904P74l24R83
367a419J633O64m61J882L785P39n650q577k097N895N490k481o308j306O741P607
383F137R48m917m745o35J962Q18j639k929k857J197M189N178J887k701k129R10
399F74K928k09m207l510r79Q98K42J826M358L949j556m318J42N150K503o020r354
416g483k559O765P233r14n086QO298N166j834n189k633J239k77l048k164K208
432b270K675R56j791J634L808K025k672n512k002J868J378j738l120q19L487M065
448A972K631n47j486j335k22K30o06k142l963j797K417L781J917j263m52K229
$$ plain form
464 1364 3788 2843 -769 -2490 -2163 -3083 -5551 -6469 -2068 2611 2981 -37 -544 4044 7324 4515 -3350
481 -3350 -6850 -3762 42 -223 -4275 -4412 35 5042 5034 2086 1649 2844 1782 -1663 -3443 -1943 62
498 62 -1096 -2595 -923 3623 6786 5652 2258 367 1228 1639 171 -2303 -4161 -4430 -2437 209
514 209 2885 3700 2574 1636 2269 3738 2302 -1851 -4946 -4206 -1310 -354 -1250 -1182 1931 4372 3948 1328
532 1328 -128 -427 -2024 -5259 -6761 -4006 -259 -735 -3477 -2768 2511 6533 5092 -1228 -4895 -2146
548 -2146 648 -251 -3803 -4912 -2689 436 1527 1417 2674 3140 1860 -789 -2237 -999 -926 -2901
564 -2901 -5028 -3543 139 3228 3128 2139 2706 3908 3789 1859 279 -1267 -2577 -2997 -1334 1754
580 1754 3329 2245 1098 2996 5224 4503 258 -3097 -2792 -580 -603 -2569 -2153 797 4340 4454 2608
$$ packed form
464A364K424r45l612j721L27r20k468r18M401M679L70l018n07M588L280k809p865
481c350l500L088L804k65m052j37M447N007qk948m37J195j062l445j780J500K005
498F2j158j499J672M546L163j134l394j891Q61M11j468k474j858k69J993K646
514B09K676Q15j126r38O33J469j436m153l095P40K896R56q96O8L113K441m24k620
532A328j456k99j597l235j502K755L747m76k742P09N279M022j441o320l667K749
548b146K794q99l552j109K223L125J091j10J257M66j280k649j448J238P3j975
564b901k127J485L682L089j00r89N67J202j19j930j580j546j310m20J663L088
580A754J575j084j147J898K228p21m245l355L05K212k3j966M16K950L543J14j846
$$ plain form
597 2608 2279 3634 3366 -256 -3548 -3040 -294 -809 -2903 -2997 580 4480 3504 -406 -2017 25 1213
614 1213 -1155 -4448 -5191 -2291 -585 -816 -1135 519 2724 3585 2316 700 582 -499 -2303 -3624
630 -3624 -3535 -2230 -1494 -1299 -435 1746 3249 2351 678 -20 353 -675 -2938 -3630 -1881 498 1314 1732
648 1732 3066 4425 4419 2506 1121 1053 538 -1887 -4180 -3416 -98 2481 2115 138 966 3355 4869
665 4869 2633 -860 -2085 -1519 -1000 -1724 -1350 -76 1505 1225 993 2251 2864 2676 -358 -2912 -2902 -2024
683 -2024 -2261 -3790 -3519 -1531 701 1407 1156 894 1017 -187 -1363 -1867 -2119 -3143 -4206 -3634 -1199
700 -1199 1490 1834 63 -28 1187 1879 -212 -3326 -4342 -2923 -2040 -2239 -1844 21 2702 3181 1588
717 1588 837 1843 2204 -166 -2902 -3140 -569 488 -637 -1381 1047 4308 4420 2296 -74 362 1422
$$ packed form
597B608l29J355k68l622l292N08K746n15k094r4L577L900r76l910j611K042J188
614A213k368l293p43K900J706k31l19J654K205Q61j269j616j18j081j804j321
630c624Q9J305P36J95Q64K181J503q98j673o98L73j028k263o92J749K379Q16M18
648A732J334J359oj913j385o8n15k425k293P64L318K579l66j977Q28K389J514
665D869k236l493j225N66N19p24L74J274J581k80k32J258O13j88l034k554J0Q78
683b024k37j529K71J988K232P06k51k62J23j204j176n04k52j024j063N72K435
700a199K689L44j771r1J215O92k091l114j016J419Q83j99L95J865K681M79j593
717A588p51J006L61k370k736k38K571J057j125p44K428L261J12k124k370M36J060
$$ plain form
734 1422 187 -2165 -2618 -1036 316 471 197 1764 3645 3738 1714 329 246 441 -1080 -3096 -2747
751 -2747 -771 743 -134 108 1588 3431 2705 7 -1500 -1277 -1148 -2436 -3459 -2293 -198 562 -18
768 -18 307 2240 3187 1857 -1351 -2493 -1319 -865 -1869 -3310 -1738 1042 2076 1221 530 1216 2133
785 2133 1385 -1269 -2367 -1545 -1321 -1534 -2024 -72 2130 2763 1539 1134 1782 2774 1636 -513 -1887
802 -1887 -1560 -772 -968 -544 269 1777 2416 1899 1638 1565 1378 -479 -2105 -1844 -1387 -953 -1143 -791 1590
821 1590 3283 3126 1424 55 429 581 -835 -2623 -2691 -1916 -1184 -1132 -6 2233 2758 1448 -520 -704
839 -704 533 -62 -2170 -3469 -2764 -310 342 -57 331 1081 2412 1581 -202 -316 -417 -1218 -2069 -2895
857 -2895 -1605 -143 -218 -457 618 2242 2320 1019 -331 -599 -192 -906 -2031 -2262 -580 939 1166 1161
$$ packed form
734A422j235k352m53J582J352J55k74J567J881R3k024j385q3J95j521k016L49
751b747J976J514q77K42J480J843p26k698j507K23J29j288j023J166K095P60n80
768a8L25J933R47j330l208j142J174M54j004j441J572K780J034q55o91O86R17
785B133p48k654j098Q22K24k13m90J952K202O33j224m05O48R92j138k149j374
802a887L27P88j96M24Q13J508O39n17k61p3j87j857j626K61M57M34j90L52K381
821A590J693j57j702j369L74J52j416j788o8P75P32N2J126K239N25j310j968j84
839g04J237n95k108j299P05K454O52l99L88P50J331q31j783j14j01q01q51q26
857b895J290J462p5k39J075J624P8j301j350k68M07p14j125k31J682J519K27n
$$ plain form
875 1161 1906 2623 1983 406 -598 -946 -682 -1278 -2476 -1900 522 1989 2166 1135 1337 2225 2224 -83
893 -83 -1443 -1546 -1048 -1000 -1495 -914 768 2312 1396 883 1068 1589 938 -1023 -2662 -2101 -479 -943 -1780
912 -1780 -789 839 1806 1325 546 883 1131 219 -1936 -2656 -1630 -797 -677 -1547 -379 1390 2491 1322
930 1322 726 646 662 -300 -1978 -2692 -1136 -183 -149 -620 224 2505 2480 1590 275 150 379 -811 -2453
949 -2453 -1945 -849 546 483 422 1180 2135 2140 876 -157 -247 -15 -952 -1888 -1687 -149 930 825 399 1112
969 1112 1823 1897 237 -732 -537 -526 -1449 -2208 -1593 196 832 671 73 1314 2149 1049 -390 -1253 -842
988 -842 -921 -1805 -1842 -1176 813 874 962 449 1175 1542 377 -1425 -1999 -1272 -702 -1447 -1808 -521 1573 1949
1008 1949 1163 222 1202 903 -210 -1447 -1780 -924 -630 -801 -752 158 1809 1914 919 532 748 672 -858
$$ packed form
875A161P45P17o40j577j004l48K64n96j198N76K422J467J77j031K02Q88jk307
893h3j360j03M98M8m95N81J682J544r16n13J85N21o51j961j639N61J622m64q37
912a780R91J628R67m81p79L37K48r12k155p20J026Q33J20q70J168J769J101j169
930A322n96q0J6r62j678p14J556R53L4m71Q44K281k5q90j315j25K29j190j642
949b453N08J096J395o3o1P58R55Nj264j033r0K32r37r36K01J538J079j05m26P13
969A112P11P4j660r69J95J1r23p59O15J789O36j61n98J241Q35j100j439q63M11
988h42p9q84l7O66J989O1Q8n13P26L67j165j802n74P27N70p45l61J287K094L76
1008A949p86r41R80k99j113j237l33Q56K94j71M9R10J651J05r95l87K16p6j530
$$ plain form
1027 -858 -1294 -1430 -377 -192 -537 -441 782 1981 2061 930 360 522 28 -1088 -1751 -1513 -303 10 -513
1046 -513 -49 1297 2303 2084 299 -309 246 -318 -1202 -2337 -1468 -212 199 165 625 1578 2143 997
1064 997 -355 -504 -150 -340 -1452 -1724 -899 337 978 446 618 1478 1488 532 -771 -912 -304 -705 -1445
1083 -1445 -1491 -245 633 716 463 420 1593 1364 218 -644 -761 -221 -858 -1295 -1267 21 1445 1224 819
1102 819 483 1457 1064 -529 -990 -1200 -866 -591 -1169 -896 550 1540 1269 527 482 898 430 -739 -1516
1121 -1516 -1547 -341 -372 -532 -187 1009 1547 817 267 199 461 -112 -1311 -1435 -1173 -443 -158 -642 40 1099
1141 1099 1932 785 -230 -94 348 -42 -1210 -1493 -699 -90 -107 -327 283 1203 954 564 -337 -251 -16
1160 -16 -653 -1630 -2010 -572 726 682 244 665 1461 1765 575 -547 -561 -232 -630 -1149 -1094 106 896 843
$$ packed form
1027h58m36j36J053J85l45R6J223J199Q0j131n70J62m94j116o63K38J210L13n23
1046e13M64J346J006k19j785o08N55n64q84j135Q69J256M11l4M60R53N65j146
1064I97j352j49L54j90j112k72Q25J236O41n32J72Q60J0r56j303j41O08m01p40
1083a445m6J246Q78Q3k53m3J173k29j146q62j17N40o37m37K8J288J424k21m05
1102H19l36R74l93j593m61k10L34K75n78K73J446R90k71p42m5M16m68j169p77
1121a516l1J206l1j60L45J196N38p30n50o8K62n73j199j24K62P30K85m84O82J059
1141A099Q33j147j015J36M42l90j168k83P94O09j7k20O10R20k49l90r01Q6K35
1160a6o37r77l80J438J298m4m38M21P96L04j190j122j4L29l98n19N5J200P90n3
$$ plain form
1180 843 295 821 1511 959 -362 -1295 -1140 -465 -649 -1207 -727 814 939 594 605 760 959 788 -643
1199 -643 -978 -561 -161 -825 -1242 -519 790 1115 591 116 688 868 202 -970 -1169 -855 -429 -711 -833
1218 -833 -265 1030 1562 430 376 570 545 -451 -1065 -1344 -646 -37 -394 -446 303 1467 1442 487 359 106
1238 106 227 -579 -952 -951 -455 -47 -30 181 881 1648 1009 278 -264 269 -9 -902 -1102 -1199 -225 479 -1
1259 -1 -271 621 1281 909 15 -257 123 250 -511 -917 -594 229 646 140 262 959 1653 461 -672 -1084
1279 -1084 -119 -23 -727 -956 -958 -78 809 686 367 808 911 251 -524 -920 -485 -405 -809 -870 -33 893 814 455
1301 455 524 793 784 -397 -886 -800 -557 -372 -622 -629 192 716 800 208 303 787 491 -469 -1319 -749 -325 -149
1323 -149 -452 -592 616 922 560 210 -153 674 315 -339 -1118 -614 -265 22 -70 2 813 1025 566 94
$$ packed form
1180H43n48N26O90n52j321r33J55O75j84n58M80J541J25l45J1J55J99j71j431
1199f43l35M17M00o64m17P23J309L25n24m75N72J80o66j172j99L14M26k82j22
1218h33N68J295N32j132n4J94k5r96o14k79O98O09l57n2P49J164k5r55j28k53
1238A06J21q06l73JM96M08J7K11P00P67o39p31n42N33k78q93k00r7R74P04m80
1259ak70Q92O60l72q94k72L80J27p61m06L23Q23M17n06J22O97O94j192j133m12
1279a084R65R6p04k29kQ80Q87j23l19M41J03o60p75l96M35Q0m04o1Q37R26p9l59
1301D55O9K69rj181m89Q6K43J85k50pQ21N24Q4n92R5M84k96r60q50N70M24J76
1323a49l03j40J208L06l62l50l63Q27l59o54p79N04L49K87r2P2Q11K12m59m72
$$ plain form
1343 94 322 272 89 -781 -1281 -886 -180 278 165 385 557 905 543 -501 -69 -69 -664 -930 -1182 -491 317
1364 317 348 59 562 1061 648 140 -141 -360 165 -203 -1196 -806 -199 370 350 -88 306 1074 548 126 -510
1385 -510 -418 -294 -120 -785 -464 163 432 690 332 283 963 793 6 -728 -456 -100 -564 -638 -238 151 687
1406 687 814 592 412 817 306 -163 -962 -709 -128 -435 -432 25 674 972 777 378 372 445 -141 -633 -941 -216
1428 -216 -213 -164 -331 -33 924 899 313 -293 298 432 -90 -706 -1122 -294 148 17 -202 285 935 1067 475
1449 475 -349 3 79 -408 -651 -929 -364 184 -79 -52 347 994 585 273 -590 119 30 -280 -659 -280 -92
1470 -92 281 525 99 580 605 288 -38 -405 -412 -176 -551 -719 -353 797 483 266 -173 512 926 396 -270
1491 -270 -602 -76 43 -393 -498 72 791 348 247 76 546 654 152 -185 -437 -151 -272 -248 -542 -72
$$ packed form
1343I4K28n0j83q70n00L95P06M58j13K20J72L48l62j044M32%n95k66k52O91Q08
1364C17L1k89N03M99m13n08k81k19N25l68r93L90O07N69k0m38L94P68n26m22o36
1385e10R2J24J74o65L21O27K69K58l58m9O80j70p87p34K72L56m64p4M00L89N36
1406F87J27k22j80M05n11m69p99K53N81l07LM57O49K98j95l99oP3n86m92l08P25
1428b16LM9j67K98R57k5n86o06N91J34n22o16m16Q28M42j31k19M87O50J32n92
1449D75q24L52P6m87k43k78N65N48k63K7L99O47m09l12q63P09q9l10l79L79J88
1470i2L73K44m26M81K5l17l26l67pK36l75j68L66J150l14k17m39O85M14n30o66
1491b70l32N26J19m36j05N70P19m43j01j71M70J08n02l37k52K86j21K4k94M70
$$ plain form
1511 -72 436 730 -18 232 311 368 -19 -477 -1096 -460 -175 -255 -234 206 529 692 142 183 387 195 -285 -614
1533 -614 -676 -183 -147 -224 -80 613 654 573 -1 7 376 85 -549 -873 -432 -203 194 -37 -110 655 593 123 -161
1556 -161 -4 314 201 -504 -781 -74 507 662 -5 -61 364 603 290 -137 -244 0 -27 -558 -511 -268 382
1577 382 184 29 171 420 414 -108 -150 -528 -90 -30 -395 -486 -17 318 283 73 363 339 396 8 -780 -374 -659
1600 -659 -16 -496 -297 144 631 51 -53 265 194 173 -285 -684 -397 -20 -184 -413 -546 242 399 456 397
1621 397 229 452 232 -148 -758 -256 140 -252 -592 263 537 643 480 66 -197 -22 -193 -204 -385 -253
1641 -253 -170 -317 -272 290 535 683 217 -30 -149 221 -30 -520 -389 81 243 -96 -63 392 598 555 7
1662 7 -565 -79 32 -413 -473 -363 -86 415 34 101 261 667 480 -184 -329 -72 62 -199 -477 -549 66 331
$$ packed form
1511g2N08K94p48K50P9N7l87m58o19O36K85q0K1M40L23J63n50M1K04j92m80l29
1533f14o2M93L6p7J44O93M1q1n74QL69k91o34l24M41K29L97k31p3P65o2m70k84
1556a61J57L18j13p05k77P07N81J55o67n6M25K39l13m27j07K44k7n31M7K43O50
1577C82j98j55J42K49on22m2l78M38O0l65r1M69L35l5k10K90k4N7l88p88M06k85
1600f59O43m80J99M41M87n80j04L18p1k1m58l99K87L77j64k29j33P88J57N7n9
1621C97j68K23k20l80o10N02L96l92l40Q55K74J06j63m14k63J75j71j1j81J32
1641b53Q3j47M5N62K45J48m66k47j19L70k51m90J31M70J62l39L3M55K06m3n48
1662Gn72M86J11m45o0J10K77N01l81O7J60M06j87o64j45K57J34k61k78p2O15K65
$$ plain form
1684 331 41 -40 297 43 220 80 -324 -102 -246 -257 -100 -94 305 388 276 0 375 218 55 -528 -760 10
1706 10 -53 -29 -187 210 327 377 221 17 369 188 -103 -405 -470 48 28 111 -111 209 472 574 -144 74
1728 74 178 311 -276 -334 -321 -112 133 32 -211 315 461 307 117 -185 200 121 -364 -359 -426 -167 -18 -149
1750 -149 -235 -15 450 373 -64 -354 33 56 -222 -729 -211 40 180 -112 218 412 487 219 200 -155 67 -3
1772 -3 -220 -200 -177 342 300 88 160 471 523 110 -330 -418 -24 -182 -238 -168 -235 432 295 125 -319 278 32 294
1796 294 -286 -193 -103 -221 -521 -480 6 370 -33 6 22 462 250 -175 -540 -32 92 -87 -467 -113 197 415
1818 415 130 -81 -44 143 -140 -428 -398 -201 -56 -21 21 -48 92 495 78 -78 -156 -139 -74 68 -416 -200 -240
1841 -240 -40 -108 -59 181 223 224 -51 -132 163 113 -336 -169 -274 87 -44 -205 138 515 459 208 73 -364 -146
$$ packed form
1684C31k90q1L37k54J77j40m04K22j44j1J57OL99Q3j12k76L75j57j63n83k32P70
1706A0o3K4j58L97J17N0j56k04L52j81k91l02o5N18k0Q3k22L20K63J02p18K18
1728G4J04J33n87n8J3K09K45j01k43N26J46j54j90l02L85p9m85No7K59J49j31
1750a49q6K20M65p7m37k90L87K3k78n07N18K51J40k92L30J94P5k68j9l55K22p0
1772ck17K0K3N19m2k12P2L11N2m13m40q8L94j58n6P0o7O67j37j70m44N97k46K62
1796B94n80R3R0j18l00M1M86L64m03L9J6M40k12m25l65N08J24j79l80L54L10K18
1818D15k85k11L7J87k83k88L0J97J45L5M2o9J40M03m17j56p8J7O5J42m84K16m0
1841b40K00o8M9K40M2Jk75q1K95n0m49J67j05L61j31j61L43L77n6k51j35m37K18
$$ plain form
1864 -146 -49 -229 -330 -144 -94 -81 161 252 66 359 159 -56 -391 91 64 -318 -212 179 227 361 -355 -278
1886 -278 354 203 -272 -197 -154 -93 -85 -147 -137 -57 332 93 -157 94 -13 -37 -254 -223 -34 407 -84 4 -55 196
1910 196 254 337 -265 315 95 19 -153 -129 -248 8 94 -45 -39 65 267 136 -56 -5 204 45 -405 -339 189
1933 189 -113 -236 -58 299 293 66 -91 144 174 -62 -96 -195 -317 -443 -7 -24 124 118 284 364 -70 -164 -205 -51
1957 -51 -163 -358 -53 264 69 92 -421 61 259 -170 14 -293 -79 -36 -2 -100 -36 246 203 -326 -75 178
1979 178 78 238 -22 -233 55 -230 -49 -239 -117 386 329 -4 188 -66 311 -162 -260 -302 -600 229 -230
2000 -230 -385 -188 351 199 181 -296 244 -37 200 21 -79 59 -149 102 -228 3 243 -35 -6 -209 -91
2021 -91 252 -87 122 150 18 29 8 94 59 445 87 -157 -15 -246 9 -442 -135 26 134 -138 -28 -72
$$ packed form
1864a46R7j80j01J86N0J3K42R1j86K93k00k15l35M82k7l82J06L91M8J34p16P7
1886b78O32j51m75P5M3O1Qo2J0Q0L89k39k50K51j07k4k17L1J89M41m91Q8n9K51
1910A96N8Q3o02N80k20p6j72K4j19K56Q6j39OJ04K02j31j92N1K09j59m50O6N28
1933A89l02j23J78L57ok27j57K35L0k36l4r9j22j26M36j7J48oJ66Q0m34r4m1J54
1957e1j12j95L05L17j95K3n13M82J98m29J84l07K14M3L4r8O4K82m3n29K51K53
1979A78j00J60k60k11K88k85J81j90J22N03n7l33J92k54L77m73r8m2k98Q29m59
2000b30j55J97N39j52j8m77N40k81K37j79j00J38k08K51l30K31K40k78K9k03J18
2021i1L43l39K09K8j32J1k1Q6l5L86l58k44J42k31K55m51L07J61J08k72J10m4
$$ plain form
2043 -72 230 301 57 -41 83 72 -51 -73 -292 -169 160 207 -69 90 146 -80 -147 28 -413 -83 137 -78 -80
2066 -80 14 -87 157 128 284 283 170 130 -476 22 -83 176 7 -134 -81 356 99 -121 -10 23 266 -2 -141
2089 -141 -135 301 -202 87 -56 125 369 244 -259 -119 -60 67 -213 -210 63 166 -220 -132 236 179 282 64
2111 64 -65 -304 -181 142 -324 -354 -124 168 480 -133 207 129 305 393 -259 -395 160 142 -221 -160 42 46 -290
2134 -290 155 244 -143 166 -208 139 132 118 -60 -114 -166 -57 -20 151 -3 49 234 -7 -213 -329 -78 19 203
2157 203 -123 11 448 522 -212 75 126 103 123 120 -181 28 51 114 14 -356 153 82 64 51 111 108 17 -186 -30
2182 -30 -107 49 -174 275 -44 78 4 174 65 20 166 -153 -103 -88 151 335 90 -62 -115 208 156 138 -124
2205 -124 -114 -116 -277 -379 -114 57 5 65 161 94 -86 3 4 -32 -293 -197 206 -456 -209 169 198 23 -208 394
$$ packed form
2043g2L02P1k44r8J24j1j23k2k19J23L29M7k76J59N6k26o7J75m41L30K20k15k
2066h0R4j01K44k9J56jj13m0o06M98j05K59j69j41N3M37k57k20J11L3K43k68j39
2089a41OM36n03K89j43J81K44j25n03J40N9J27k80LK73J03l86Q8L68n7J03k18
2111F4j29k39J23L23m66l0K30K92L12o13L40p8J76Q8o52j36N55j8l63O1K02Ml36
2134b90M45Q9l87L09l74L47pj4j78n4n2J09L7J71j54N2J85k41k06j16K51R7J84
2157B03l26J34M37P4p34K87N1k3K0ll01K09K3O3j00l70N09p1j8j3O0lr1k03J56
2182c0p7J56k23M49l19J22p4J70j09m5J46l19N0J5K39J84k45j52n3L23n2j8k62
2205a24J0kj61j02K65J71n2O0R6o7j80Q9Jl6k61R6M03o62K47L78K9j75k31O02
$$ plain form
2229 394 244 182 -121 -240 -19 -342 -175 -351 -215 133 -47 99 81 157 464 231 -117 -152 -236 232 -84 -83
2251 -83 -52 78 -11 -361 -18 206 38 -165 -67 -364 235 -98 -319 -74 -38 9 70 50 26 -152 -2 49 94 -393
2275 -393 -189 43 -343 68 54 111 247 57 -83 126 156 -144 -212 -160 -50 71 80 -163 28 232 309 13 -227
2298 -227 -112 -245 -129 -319 -239 -23 -83 292 275 -33 217 237 -102 -79 -235 -196 -163 -197 -311 88 118 316 -76
2321 -76 101 300 36 20 -246 83 42 -18 -170 74 190 175 -77 165 191 -74 71 -169 -156 -113 -69 -130 -86 -309
2345 -309 -188 200 23 -101 71 34 58 101 -592 2 32 73 88 79 118 326 -51 -115 -10 135 -1 -309 60
2368 60 -84 118 205 17 103 22 334 36 53 147 -169 -377 -122 -127 -12 231 -169 96 385 78 -205 73 -6
2391 -6 9 -219 42 19 -154 348 236 93 -63 195 266 -283 -111 -512 -80 -170 -222 -366 -155 25 160 28
$$ packed form
2229C94j50o2l03j19K21l23J67j76J36L48j80J46j8P6L07k33l48l5q4M68l16J
2251h3L1J30q9l50L43K24j68k03R8k97N99l33k21K45L6M7O1k0k4j78J50N1M5m87
2275c93K04K32l86M11j4N7J36j90j40K09L0l00o8N2J10J21Rk43J91K04P7k96k40
2298b27J15j33J16j90Q0K16o0L75j7l08K50K0l39K3j56L9L3l4j14L99L0J98l92
2321g6J77J99k64j6k66L29m1o0j52K44J16j5k52K42K6k65J45k40J3M3M4o1M4k23
2345c09J21L88j77j24J72l7K4M3o93N94L0M1J5rL9K08l77o4J05J45j36l08L69
2368F0j44K02Q7j88Q6q1L12k98J7R4l16k08K55nJ15K43m00K65K89l07k83K78p9
2391fJ5k28K61k3j73N02j12j43j56K58P1n49J72m01M32r0n2j44K11J80J35j32
$$ plain form
2413 28 26 126 -138 -301 -390 -79 -254 -310 30 152 140 252 301 280 13 87 145 -5 -366 -218 116 52 154 -35
2437 -35 -210 81 45 182 73 -46 -133 5 -131 31 -129 -242 17 158 -23 286 77 54 -136 -75 149 -130
2459 -130 -376 -189 182 -23 169 135 157 358 -136 79 282 -223 -4 -32 -326 -256 -64 170 -130 88 109 194
2481 194 156 -28 -93 -151 -119 -309 -63 93 366 263 -14 237 76 98 241 199 41 -56 -114 -243 -86 34 91
2504 91 29 -87 220 -129 50 25 -164 -390 -283 -311 -91 -18 31 364 -170 -204 118 193 228 -78 -281 -323 23
2527 23 -184 -126 -9 281 231 357 -72 -151 265 201 -62 -121 -254 -307 85 6 -43 87 245 61 -133 -75 131
2550 131 -257 35 -381 -111 -227 -286 -169 126 52 178 98 -158 -176 -175 -249 -277 -182 126 31 -85 7 87 171 183 -3
2575 -3 -44 73 -65 -248 -53 -231 -261 274 -192 7 -3 198 104 102 -30 -39 14 -203 -63 -176 -92 409 281 -71
$$ packed form
2413B8kJ00k64j63q9L11j75n6L40J22j2J12M9k1k67P4N8j50l61J48L34o4J02j89
2437c5j75K91l6J37j09j19q7J38j36J62j60j13K59J41j81L09k09k3j90O1K24k79
2459a30k46J87L71k05J92l4K2K01m94K15K03n05K19k8k94P0J92K34l00K18K1Q5
2481A94l8j84o5n8L2j90K46J56K73j03k77K51j61K2J43m2j58r7n8j29J57J20N7
2504I1o2j16L07l49J79k5j89k26J07k8K20P3M9L33n34l4L22P5L5l06k03m2L46
2527B3k07N8J17K90n0J26m29p9M16o4k63n9j33n3L92p9m9J30J58j84j94N8K06
2550A31l88K92m16K70j16n9J17K95p4J26q0k56j8Jp4k8R5L08r5j16R2Q0Q4J2j86
2575cm1J17j38j83J95j78l0N35m66J99j0K01r4kj32rN3k17J40j13Q4N01j28l52
$$ plain form
2599 -71 -26 103 -28 212 -178 12 -10 17 3 -235 552 -116 206 -127 -30 247 -9 -20 81 -2 -34 -381 -96
2622 -96 -218 420 177 -105 91 338 -262 142 -562 -347 -66 -78 -227 -164 117 295 137 -176 -98 -115 -383 30
2644 30 -347 -100 -279 -71 -33 -40 -147 18 11 203 140 -157 -256 160 -231 -176 -32 10 -74 -115 207 229 276 250 -136
2669 -136 163 -12 -262 -357 -115 -90 176 253 135 130 373 59 18 -103 -94 -260 -227 162 -236 32 76 136 40 76
2693 76 11 -205 -129 -372 -63 165 -316 -47 -64 41 129 153 -134 303 24 224 -488 -295 -59 -163 107 -233
2715 -233 9 200 119 78 197 90 -64 -225 0 -138 -347 -209 -117 -97 93 321 256 10 77 218 -100 -68
2737 -68 -34 -177 -252 -54 -122 -40 414 -6 100 194 179 103 -256 -153 -239 -382 294 137 79 -6 305 -8 -19 -68
2761 -68 -121 56 -49 -110 -44 13 -144 0 82 128 400 269 -147 -227 92 67 -26 -41 94 -216 -141 54 133 169 -19
$$ packed form
2599g1M5J29j31K40l90J90k2K7j4k38P87o68L22l33R7K77k56j1J01q3l2l47K85
2622i6j22O38k43k82J96K47o00M04p04K15K81j2j49O3K81J78j58l13P8j7k68M13
2644C0l77K47j79K08L8pj07J65pJ92o3k97r9M16l91N5J44M2q4m1L22K2M7k6l86
2669a36K99j75k50r5K42K5K66P7j18nK43l14m1j21Rj66L3L89l98K68M4O0r6L6
2693G6o5k16P6k43L09K28m81K69j7J05Q8K4k87M37k79K00p12J93K36j04K70l40
2715b33K42J91q1m1J19j07j54j61K25j38k09J38R2K0J90K28o5k46O7J41l18L2
2737f8L4j43p5J98o8Q2M54m20J06R4j5p6l59J03q6j43O76j57n8q5L11l13j1m9
2761f8n3J77j05o1O6N7j57J44Q2M6K72j31m16q0L19k5r3j5J35l10P5J95P9L6j88
$$ plain form
2786 -19 250 170 -101 -204 -335 96 -155 -233 -309 -9 142 -184 97 55 40 -178 -177 -151 -213 168 -179 63 287
2809 287 -44 187 47 -49 232 -150 122 -515 5 -44 283 132 -35 45 287 114 -151 56 245 -11 13
2830 13 -273 -186 95 -64 166 -226 31 274 349 -86 -45 366 198 -105 -128 -374 460 71 62 -75 97 266
2852 266 187 120 -14 -25 -373 -111 -292 -275 -70 -289 227 5 283 510 56 35 31 -268 -455 -415 -315 -111 185
2875 185 -128 59 57 -89 103 -98 -325 -150 143 -201 -282 -585 211 -226 23 -120 80 101 174 220 -142 -119
2897 -119 23 -310 -36 -232 -170 188 -26 236 158 5 0 -254 -120 -104 -200 278 -108 180 125 7 49 167 228
2920 228 -288 -69 -266 -257 -232 21 -42 -44 -14 32 215 209 105 34 -97 -247 -11 -138 144 120 -289 -216 152 141 239
2945 239 197 75 144 21 230 -3 79 -57 90 -12 2 110 215 302 317 25 -68 80 -208 -137 -206 -227 0
$$ packed form
2786a9K69q0k71j03j31M31k51p8p6L00J51l26K81m2j5k18JK6o2L81l47K42K24
2809B87l31K31j40r6K81l82K72o37N20m9L27j51j67Q0K42j73k65K07J89k56K4
2830A3k86Q7K81j59K30l92K57K43P5m35M1M11j68l03k3k46Q34l89rj37J72J69
2852B66p9o7j34j1l48K62j81J7K05k19N16k22K78K27m54k1mk99j87M0J00K04K96
2875A85l13J87kj46J92k01k27J75K93l44q1l03P96m37K49j43K00K1P3M6l62K3
2897a19J42l33K74j96O2L58k14K62p8j53nk54J34J6r6M78l86K88n5j18M2J18O1
2920B28n16K19j97RK5K53o3kL0M6J83oj04p1j31j50K36j27K82k4m09P3L68j1R8
2945B39m2j22O9j23K09k33Q2j36J47j02J4J08J05Q7J5k92r3J48k88P1o9k1K27
$$ plain form
2968 0 -76 116 31 152 229 39 274 -228 -107 -305 -250 -238 138 67 79 233 273 -211 360 -2 -185 -169 -147 -78
2992 -78 -119 -206 195 284 62 94 5 -54 -233 305 -137 129 -145 -65 -43 -257 248 80 318 -84 179 379 -68
3015 -68 4 -207 -92 -114 -46 -164 56 89 315 258 -242 19 17 -147 -263 -29 92 -216 49 -120 83 172 201
3038 201 -38 -22 -193 144 -403 -552 -109 -74 83 135 102 -3 244 335 -47 -399 -247 -326 -57 -280 80 -292
3060 -292 155 257 3 51 108 53 -230 -307 29 -361 -140 18 -195 180 -123 54 83 130 368 126 -156 -208
3082 -208 -6 -129 -403 -26 -77 -3 -23 57 -77 95 -22 70 -110 -183 -16 -2 -328 -151 179 168 84 42 -108
3105 -108 66 164 -301 -190 -129 -233 -143 178 21 479 -34 244 -262 98 -196 0 135 -174 -315 -262 -118
3126 -118 -327 -65 96 10 107 -3 -244 -137 -5 46 -229 18 -15 -341 -168 166 -114 501 178 387 43
$$ packed form
2968@p6J92q5J21P7j90K35n02J21j98N5J2L76p1J2J54M0m84N71l62j83J6K2O9
2992g8m1q7M01Q9k22L2q9n9j79N38m42K66k74Q0K2k14N05j68K38m02K63K00m47
3015f8P2k11J15k2O8j18K20L3K26n7n00K61kj64j16K34J21l08K65j69K03Q9K9
3038B01k39J6j71L37n47j49M43L5J57N2l3j05K47R1l82l52J52p9K69k23L60l72
3060b92M47J02k54M8N7n5k83p7L36l90K21J58k13L75l03J77K9M7K38k42k82n2
3082b08K02j23k74L77n1P4k0Q0j34J72j17R2j80p3J67J4l26J77L30j1q4m2j50
3105a08J74R8m65J11O1j04R0L21j57M58n13K78n06L60k94J96J35l09j41N3J44
3126a18k09K62J61q6R7j10k41J07J32N1k75K47l3l26J73L34k80O15l23K09l44
$$ plain form
3147 43 138 -71 -60 -149 -80 -9 177 22 65 368 84 108 51 0 49 -176 -205 64 -44 108 -209 7 7 285 311
3172 311 -204 -357 39 -331 -202 -19 76 101 113 216 -201 95 195 230 -23 -80 -246 100 -101 -146 -172 65
3194 65 331 82 -94 86 413 250 -8 -34 -400 -106 11 -414 -29 144 86 -82 28 103 125 179 -146 -356
3216 -356 178 213 -21 -66 -117 269 274 -39 -180 59 -92 -122 -106 -143 -142 -142 164 10 103 -2 62 106 -292 100 -118
3241 -118 -124 -10 -196 -115 105 210 -60 -13 393 -94 43 -64 60 -20 -147 3 -307 198 20 -42 26 63 190
3264 190 3 -254 100 -64 -36 -120 111 -545 39 -40 57 421 189 125 87 -128 -247 -132 220 -132 29 -62
3286 -62 296 238 76 140 -18 394 -8 -253 7 -241 -223 -133 80 -144 123 132 150 -91 93 293 88 36 -245
3309 -245 -69 -16 -77 170 34 209 456 -176 265 -108 206 -114 -103 -165 -109 -21 -312 409 108 261 378 -75
$$ packed form
3147D3R5k09J1q9O9P1J86j55M3L03k84K4n7n1M9k25k9K69j08J52l17K16%K78K6
3172C11n15j53L96l70J29J83R5K5J2J03m17K96J00L5k53n7j66L46k01m5k6K37
3194F5K66k49j76J80L27j63k58k6l66K94J17m25L85J73n8j68J10P5K2N4l25k10
3216c56N34L5k34m5n1L86Nl13j41K39j51l0J6l7J%L06j54R3j05O4M4l98L92k18
3241a18oJ14j86Q1K20J05k70M7M06m87J37j07J24q0j27J50l10N05j78o2O8L7J27
3264A90j87k57L54j64K8q4K31o56N84p9R7L64k32o4l8k15j19J15L52l52J61r1
3286f2L58n8j62O4j58M12m02k45K60k48J8R0K13k24K67RJ8k41J84K00k05n2k81
3309b45J76N3o1K47j36J75K47o32M41l73L14l20J1o2N6Q8k91P21l01J53J17m53
$$ plain form
3331 -75 -111 223 -137 78 -229 -389 95 77 -137 263 165 563 146 105 9 26 -77 -34 -79 100 150 47 -2 254
3355 254 89 -46 49 107 43 -194 -232 -324 88 -106 -181 77 -66 -83 -200 99 134 -97 145 -230 -86 96 -73
3378 -73 155 -28 43 95 65 153 92 36 -300 -241 -60 -12 -31 -179 96 216 -4 -239 -23 182 2 -49 73 -57
3402 -57 -329 -95 -231 34 144 2 43 106 -114 154 59 -34 38 -196 205 -186 -440 -31 101 -80 5 13 169
3425 169 173 27 -163 -255 -216 211 -26 -107 138 204 541 96 40 25 270 -46 -233 54 12 -133 -124 134 92 249
3449 249 380 -136 -314 16 74 -12 -235 -184 -71 115 41 -50 42 375 61 17 -210 27 -204 69 -225 57
3471 57 -19 344 -44 35 122 173 6 -31 118 -74 -132 125 -373 -356 -153 -101 159 -5 179 72 224 -596 -26
3494 -26 -312 0 0 87 394 -282 61 45 224 -156 177 308 270 138 -85 103 -216 -99 -47 -79 178 16 24
$$ packed form
3331g5l6L34l60K15l07j60M84j8k14M00r8L98m17m1r6J7j03M3m5J79N0j03m9K56
3355B54j65j35R5N8o4k37l8r2M12j94p5K58j43j7j17K99L5k31K42l75J44J82j69
3378g3K28j83P1N2l0Q8o1n6l36N9J81M8j9j48K75J20k20k35K16K05j80n1J22j30
3402e7k72K34j36K65J10j42M1O3k20K68r5r3P2k34M01l91k54M09J32j81Q5QJ56
3425A69Mj46j90r2L9M27k37q1K45O6L37m45n6j5K45l16j87K87m2j45RK58m2J57
3449B49J31n16j78L30N8q6k23N1J13J86p4r1R2L33l14m4k27K37k31K73k94K82
3471E7p6L63l88P9Q7N1j67l7J49j92n8K57m98J7K03N2K60j64J84j07J52q20N70
3494b6k86L12%Q7L07o76L43j6J79l80L33J31l8j32k23J88l19J17N2l2K57j62Q
$$ plain form
3517 24 72 132 349 32 -293 46 -107 -285 206 -191 240 177 259 -86 -108 140 166 -19 99 91 -109 -120 -224
3540 -224 -102 -91 -60 41 58 165 -34 170 -361 -115 -51 -52 195 257 209 -26 81 52 103 -28 2 -131 -117 20
3564 20 -190 -24 365 25 214 -10 95 -42 -86 -182 -145 -29 -340 -87 -340 144 -45 102 201 -142 402 -210
3586 -210 43 -153 225 -46 -249 26 121 -255 -341 -90 111 -2 450 301 -358 276 -82 82 -292 29 152
3607 152 262 25 -238 67 -11 -9 303 -166 149 -272 31 138 -124 -61 69 20 226 183 -99 -155 -198 -410 -192
3630 -192 212 134 184 149 109 179 -111 36 162 -184 -104 -454 218 -104 -282 4 63 -7 444 267 171 -211 142
3653 142 71 -327 -32 63 129 -43 291 -2 -190 -127 -49 -159 174 -11 -11 -183 -251 22 -211 -34 -48 1 -108
3676 -108 211 -135 56 174 106 62 -322 -66 90 -160 -134 -71 -12 305 106 -7 -158 -15 -435 -155 -133 -16
$$ packed form
3517B4M8O0K17l17l25L39j53j78M91l97M31o3Q2l45k2K48K6j85J18qk00j1j04
3540b24J22J1L1J01J7J07j99K04n31K46O4jK47O2m8k35J07k9N1j31L0j33J4J37
3564B0k10J66L89l40J89k24J05j37m4r6L7J16l11K53k53M84j89J47R9l43N44o12
3586b10K53j96L78k71k03K75R5l76q6K51K01j13M52j49o59O34l58J64l74L21J23
3607A52J10k37k63L05p8KL12m69L15m21L03J07k62O3J30m9K06m3k82n6m3k12K18
3630a92M04p8N0l5m0P0k90J47J26l46Q0l50O72l22j78K86N9p0M51j77r6l82L53
3653A42p1l98K95R5O6j72L34k93j88O3P8j10L33j85%j72o8K73k33J77j4M9j09
3676a08L19l46J91J18o8m4l84K56J56k50K6O3N9L17j99j13j51J43m20K80K2J17
$$ plain form
3698 -16 -47 -99 -58 25 147 -7 -87 235 -2 -68 -79 -101 75 46 -56 103 155 -60 -6 160 153 -49 -99 71 42
3723 42 168 -167 -150 132 -2 -90 103 143 -63 43 -13 -3 84 246 -91 -140 121 209 -237 -82 63 23 -43 264
3747 264 106 -217 68 -58 -217 107 -117 143 263 238 -66 -209 -10 171 41 -198 -143 -134 55 167 -213
3768 -213 61 168 -132 -318 129 299 -107 -56 -113 3 273 -117 -236 229 264 -36 150 20 32 -31 126 54
3790 54 -155 -167 46 -33 268 -16 132 -30 -49 288 53 -3 -86 -29 -64 -5 175 -136 60 -24 116 -35 55 -128
3814 -128 148 103 52 -92 -173 237 -176 142 -140 35 63 32 -18 -309 175 -68 -327 -10 -167 -52 218 48
3836 48 158 34 25 -189 50 -32 -72 -114 -92 21 -141 -37 127 47 152 290 -143 183 121 -209 -87 10 64 -14
3860 -14 163 -35 234 -56 125 110 93 -74 5 2 50 -19 -186 114 -125 121 160 -198 -69 163 -5 -13 8 -210
$$ packed form
3698a6l1n2M1Q3J22j54q0L22k37o6j1k2J76k9j02J59N2k15N4J66pk02n0J70k9
3723D2J26l35J7K82j34q8J93M0k06J06n6J0Q7J62l37m9K61Q8m46J55J45m0o6L07
3747B64j58l23K85j26j59L24k24K60J20k5l04j43J99J81j30k39N5RJ89J12l80
3768b13K74J07l00j86M47J70m06N1n7J16K70l90j19M65L5l00J86j30J2o3J57p2
3790E4k09j2K13p9L01k84J48j62j9L37k35n6q3N7l5N9J80l11J96q4J40j51R0j83
3814a28K76m5n1j44q1M10m13L18k82J75K8l1n0k91M84k43k59L17j57J15K70j70
3836D8J10j24rk14K39q2m0m2K2J13j62J04J64q0J05J38m33L26o2l30J22R7N4p8
3860a4J77j98K69k90J81j5j7j67P9lM8o9j67L00k39K46L9l58J29K32j68qK1k18
$$ plain form
3884 -210 -12 -127 -81 245 298 -47 -93 -75 48 27 -59 66 330 -124 147 -110 -112 -36 113 429 8 270 -35
3907 -35 -187 -59 -240 -227 -54 -205 130 -170 -202 325 46 55 -24 302 -220 -195 -182 -191 -276 -190 192 58 373 -106
3931 -106 253 -9 -156 260 62 31 -110 -71 110 -39 92 259 -127 93 -197 199 68 -65 91 254 173
3952 173 -247 -38 -227 4 -80 343 -74 225 199 -107 -74 7 -157 -288 -167 -55 228 190 41 91 -272 -92
3974 -92 126 -104 -191 154 62 19 148 264 385 -47 62 39 65 173 86 -57 -143 -100 170 -107 47 382 254
3997 254 -40 -50 -130 310 142 45 -175 -345 226 -75 610 181 210 -32 144 156 18 -140 -228 31 81 176 -155
4020 -155 51 -218 38 28 -115 -132 -198 -350 -327 73 -30 -249 156 232 70 212 78 30 3 -198 7 26 2
4043 2 -216 68 -50 -97 -81 -59 -10 5 -124 -258 -245 -34 5 -12 276 -132 -47 281 18 61 8 -197 -19 218
$$ packed form
3884b10J98j15M6L26N3l45m6J8J23k1q6J25K64m54K71k57kP6J49L16m21K62l05
3907c5j52J28j81J3J73j51L35l00l2N27k79Rp9L26n22K5J3rq5Q6L82j34L15m79
3931a06L59k62j47M16j98l1j41L9J81j49J31J67l86K20k90L96j31j33J56J63q1
3952A73m20K09j89K31q4M23m17K99k6l06L3Q1j64j31J21J12K83l8j49N0l63J80
3974i2K18k30q7L45r2m3J29J16J21m32J09k3K6J08q7j43q6M3K70k77J54L35j28
3997B54k94j0q0M40j68r7k20j70N71l01O85m29K9k42J76J2j38j58q8K59N0R5l31
4020a55K06k69K56j0j43j7o6j52K3M00j03k19M05P6j62J42j34m8k7k01K05J9k4
4043Bk18K84j18m7J6K2M9J5j29j34J3K11L9j7K88m08Q5L28k63M3n3k05J78K37
$$ plain form
4067 218 306 -135 -180 13 -161 -121 158 161 201 66 -205 237 117 108 -66 101 14 0 -341 37 121 113 -7 183
4091 183 321 -49 199 -113 169 -143 -73 31 209 -124 207 79 -45 133 64 79 -168 -105 -289 -164 41
4112 41 -123 -236 -34 235 140 24 -7 145 437 15 -144 -199 18 -4 -296 72 59 -80 18 73 188 157 -39
4135 -39 316 -405 -298 -55 167 9 49 -61 134 -166 196 231 65 -150 -51 50 39 136 2 177 -180 338
4157 338 281 254 5 204 -198 139 -144 5 275 -92 134 102 34 114 105 -151 311 194 -188 123 -21 41 237
4180 237 174 -92 328 150 195 0 232 -172 -314 107 -34 181 -242 43 151 226 -163 203 -105 -71 -184
4201 -184 -284 -63 -216 -156 -128 -158 29 -121 170 280 192 3 131 -174 197 -87 -265 -57 -92 69 104 90
4223 90 57 -51 -343 -16 163 17 -251 -80 -7 105 -87 -103 -71 184 -102 57 -208 -195 -274 -311 -217 123 148
$$ packed form
4067B18Q8m41m5J93j74M0K79LM0j35k71M42j20rj74J67q7j4l41L78Q4qj20J90
4091A83J38l70K48l12K82l12P0J04J78l33L31j28j24J78o9J5k47O3j84J25K05
4112D1j64j13K02K69r5j16l1J52K92m22j59n5K17k2k92L68j3j39R8N5J15l1j96
4135c9L55p21J07K43K22j58M0j10J95l00L62L5j66k15R9J01j1R7j34J75l57N18
4157C38n7k7k49J99m02L37k83J49K70l67K26l2o8Q0rk56M62j17l82L11j44O2J96
4180B37o3k66M20j78M5j95K32m04j42M21j41K15m23K85J08P5l89L66l08L4j13
4201a84j00K21j53O0K8l0J87j50K91J10q8j89J28l05L71k84j78K08l5J61L5j4
4223I0l3j08k92L27J79j46k68J71P3J12j92j6L2K55k86J59k65J3p9l7R4L40K5
$$ plain form
4246 148 -193 -10 397 60 -287 121 179 240 -391 178 -219 6 -250 197 36 190 -109 -95 -64 -140 152 -62
4268 -62 -457 -23 -29 -42 108 299 -121 173 37 109 -23 36 -206 -72 55 -179 -186 -50 -199 255 129 -135 -16
4291 -16 104 47 31 350 -111 -38 38 39 -13 74 191 281 -102 -222 -89 -45 203 -127 -168 -232 -254 -12 91 106 -14
4316 -14 33 -13 -56 -73 -35 -129 -114 -246 -50 -183 -36 -265 -42 5 -260 204 106 120 -130 86 -228 -40 -127 -266
4340 -266 222 153 119 327 191 93 26 141 -71 -253 -46 311 67 -111 -157 -34 39 -74 18 -155 -1 -209
4362 -209 -213 -184 -157 111 -76 -33 204 275 95 -103 84 93 105 -115 -116 112 -129 -62 195 -30 -74 169 148 101 -53
4387 -53 -170 42 -142 71 -142 42 362 94 90 13 22 -144 -232 233 124 -121 -99 -118 -113 9 318 129 201 -245
4411 -245 240 -21 -6 -109 -178 -74 -206 -151 145 278 -112 108 290 -251 132 -223 85 138 -21 38 -171 -52
$$ packed form
4246A48l41J83M07l37l47M08N8O1o31N69l97K25k56M47j61J54k99J4L1p6K92k14
4268f2l95M34oj3J50J91m20K94j36P2j32N9k42J34J27k34pJ36j49M54j26k64J19
4291a6J20n7j6L19m61P3P6Jn2Q7J17R0l83j20J33M4K48l30m1o4k2K42J03J5j20
4316a4M7m6m3j7L8r4J5j32J96j33J47k29K23M7k65M64r8J4k50K16l14J88q7j39
4340b66M88o9l4K08j36r8o7J15k12j82K07L57k44j78m6J23P3j13R2j73J54k08
4362b09mK9K7K68j87M3K37P1j80j98J87RJ2k20jK28k41O7K57k25m4K43k1m7j54
4387e3j17K12j84K13k13J84L20k68mp7Rj66q8M65j09k45K2j9NJ22L09j89P2m46
4411b45M85k61J5j03o9J04j32N5K96J33l90K20J82n41L83l55L08N3j59N9k09J19
$$ plain form
4433 -52 -72 157 60 -3 42 -131 22 -61 -9 -115 -154 136 -54 -109 18 -14 51 122 -275 -109 26 -183 -49 50
4457 50 -159 -137 -152 -113 -56 49 96 -10 -310 58 -75 -186 -217 -89 -229 -99 182 247 518 120 100 71 197
4480 197 -140 67 36 -204 -112 62 -129 122 -13 -72 -158 -258 134 -235 146 167 104 -10 114 106 0 38 -98
4503 -98 -23 319 -21 -135 -210 -20 98 -203 74 81 -67 202 -286 320 91 -25 -122 105 -139 -211 34 -111
4525 -111 -136 49 47 31 80 131 211 -61 -58 -90 11 -169 40 138 -89 -23 -138 123 65 16 111 -156 -90 -274 -168
4550 -168 -45 -31 -55 374 310 -79 157 98 -26 211 -248 -212 -219 -199 -234 -201 -45 51 21 -90 181 -64 54 -76
4574 -76 -129 -319 285 53 -122 53 184 -41 -258 34 59 1 -12 212 -120 30 130 19 355 -17 -57 -133
4596 -133 40 344 -192 -96 -46 6 5 -125 -20 -107 148 186 -57 -186 -43 24 37 52 -201 102 135 123 -227 24
$$ packed form
4433e2k0K29r7o3M5j73J53q3N2j06l9K90j90n5J27l2O5P1l97J66J35k09J34R9
4457E0k09K2j5L9N7J05M7j06l00L68j33j11l1J28j40J30K81O5K71l98k0k9J26
4480A97l37K07l1k40R2J74j91K51j35n9q6j00L92l69L81K1o3j14J24qj06L8j36
4503i8P5L42l40j14p5J90J18l01K77Pj48K69m88O06k29j16r7K27k44p2K45j45
4525a11k5J85kj6M9N1Q0k72Ll2J01j80K09R8k27O6j15K61n8m9R5k67O6j84J06
4550a68J23J4k4M29o4l89K36n9j24K37m59L6pK0l5L3J56R6l0j11K71k45J18j30
4574g6n3j90O04k32j75J75J31k25k17K92K5n8j3K24l32J50J00j11L36l72m0p6
4596a33J73L04n36R6N0N2jj30J05q7K55L8k43j29J43O7J3J5k53L03L3j2l50K51
$$ plain form
4620 24 5 254 -209 -94 7 63 -9 30 33 -57 -7 -174 -59 194 121 -275 35 -142 -160 -190 23 -124 -1 145
4644 145 -90 49 224 422 247 262 16 6 -69 -20 32 45 -90 -21 -144 42 -84 99 -16 -158 211 -88
4666 -88 114 110 -11 187 -26 -121 -4 37 51 186 -124 -157 59 26 14 -146 -262 -374 83 -193 -124 101 253
4689 253 -42 -68 -42 -448 -4 355 24 -27 74 -103 -97 71 64 0 251 54 153 -44 68 7 41 58 -51 303
4713 303 -287 148 8 -275 45 -30 16 47 -136 -121 -168 -329 -213 -49 342 249 263 184 -39 -109 -140 -190 -289 -11
4737 -11 -282 113 133 8 -100 243 181 112 43 310 -31 92 -290 -194 -217 -44 243 133 114 325 166 115 99
4760 99 -141 79 -165 83 4 101 68 -56 -21 155 -142 -31 -131 -123 -19 -118 -4 9 63 -24 109 -13 -55 424
4784 424 121 374 144 52 2 -84 96 -311 91 -172 -30 -97 97 151 -32 -159 76 -28 -115 24 210 125
$$ packed form
4620B4j9K49m63J15J01N6p2L9Lr0N0j67J15K53p3l96L10j77j8l0K13j47J23J46
4644A45k35J39J75J98j75J5k46j0p5M9N2J3j35O9j23J86j26J83j15j42L69k99
4666h8K02mj21J98k13r5J17M1J4J35l10l3K16l3j2j60j16j12M57k76O9K25J52
4689B53k95k6K6m06M44L59l31n1J01j77OJ68po4K51j97R9j97J12o1L4J7j09L54
4713C03n90M35j40k83L20p5M6L1j83J5m7j61J16J64L91r3J4p9k23p0l1n0r9K78
4737a1k71L95K0j25j08L43o2o9o9K67l41J23l82R6k3J73K87j10j9K11j59n1j6
4760I9k40K20k44K48p9R7l3j24L5J76k97J11j00QJ04r9J14J3N4q7J33j22m2M79
4784D24l03K53k30r2n0q6J80m07M02k63J42o7J94N4j83j27K35j04q7J39J86q5
$$ plain form
4806 125 -6 140 -209 -134 59 -151 170 65 -48 -29 -190 240 162 -235 30 -299 62 78 209 -37 -94 -13
4828 -13 -67 185 -166 -96 92 139 -109 -63 -64 -14 -197 29 -122 207 21 -111 -225 2 152 37 312 58 80
4851 80 460 21 16 -79 58 -259 334 52 -136 52 -44 5 -27 -3 -176 -237 -43 36 -67 -227 148 -64 34 120
4875 120 68 -25 -109 -204 -76 -63 -122 -205 -137 -113 -144 -44 120 152 205 232 45 274 136 -50 2 3 -125 152 164 -1
4901 -1 115 -48 290 -98 -181 -189 45 -237 -107 210 -201 -224 29 257 -42 -32 154 -227 130 80 64 -290 -65
4924 -65 -40 3 30 90 278 160 27 58 79 -265 97 -13 -54 105 -112 90 5 306 102 112 44 -215 -198 40
4948 40 -105 65 -20 -131 -296 187 61 217 -156 441 -98 -42 15 181 24 105 -59 -123 69 -104 219 176
4970 176 -144 -42 185 -171 -28 -100 61 -93 -132 -31 -148 1 285 -109 -310 -84 73 -154 -130 -92 -114 -110
$$ packed form
4806A25j31J46l49P5J93k10L21j05j13J9j61M30p8l97K65l29L61J6J31k46n7Q1
4828a3n4K52l51P0J88M7k48M6jN0j83K26j51L29j86j32j14K27J50j15K75k54K2
4851H0L80m39nr5J37l17N93k82j88J88r6M9l2K4j73o1J94P9j03j60L75k12R8Q6
4875A20n2r3q4r5J28J3n9q3O8K4l1J00J64L2N3K7j87K29j38j86N2Jj28K77J2j65
4901aJ16j63L38l88q3qK34k82J30L17m11k3K53K28k99J0J86l81L57n0j6l54K25
4924f5K5M3K7O0J88j18j33L1K1l44L62j10m1J59k17K02q5L01k04J0o8k59J7K38
4948D0j45J70q5j11j65M83j26J56l73N97n39N6N7J66j57Q1j64o4J92j73L23m3
4970A76l20J02K27l56J43p2J61j54l9J01j17J49K84l94k01K26J57k27K4L8k2M
$$ plain form
4992 -110 -109 -336 -132 222 -94 133 -59 -291 -118 -91 -222 -91 17 74 135 -126 215 9 -155 -76 -187 46
5014 46 145 -147 -18 29 238 -9 24 -236 110 -281 -279 -46 -190 -59 189 -41 18 -46 -20 268 340 -147 127
5037 127 -189 25 161 -95 -252 -330 -146 104 214 -335 340 126 94 -3 -88 -49 -26 93 114 -142 395 -1
5059 -1 -27 63 -7 126 -169 -89 199 98 -244 -110 -381 -125 48 -1 -136 33 126 71 70 -79 -530 -351 -10 -125
5083 -125 214 -118 -14 -228 113 112 33 248 -279 44 -411 114 -85 -215 -124 -242 -53 113 264 115 4
5104 4 28 191 223 48 -3 -171 32 147 -73 236 215 -145 211 285 138 209 59 -186 11 274 -134 -125 121
5127 121 -184 23 282 29 144 -201 206 181 54 -102 -215 -37 75 125 -21 144 318 218 183 -186 95
5148 95 -46 -156 -65 10 -8 -80 -81 119 -24 47 -163 -216 -128 -150 38 68 32 -193 15 -37 179 97 -88 -233 -25
$$ packed form
4992a10Jk27K04L54l16K27j92k32J73K7j31J31J08N7O1k61L41k06j64P9j11K33
5014D6R9k92J29M7K09k47L3k60L46l91KK33j44J31K48k30N9o4K6K88P2m87K74
5037A27l16K14J36k56j57p8J84K50J10n49O75k14l2r7q5L9K3J19K1k56N37l96
5059ak6R0p0J33k95Q0K88j01l42J34k71K56J73m9j35J69R3n5jj49m51J79L41j15
5083a25L39l32J04k14L41jp9K15n27L23m55N25j99j30R1j18J89J66J51j49j11
5104DK4J63L2j75n1j68K03J15k20L09k1l60L56P4j47P1j50k45J97K63m08RK46
5127A21l05K07K59k53J15l45M07k5j27j56j13J78J12N0j46J65J74j00l5l69K81
5148I5j41j10R1P5j8p2jK00j43P1k10n3Q8k2J88L0l6k25K08n2K16q2j85j45K08
$$ plain form
5173 -25 -59 -266 -259 115 -4 218 83 -26 -19 -151 97 -120 57 -34 -20 40 87 36 -36 91 133 114 66 203 250
5198 250 -292 -211 -65 -97 -214 -97 -132 71 -28 44 200 38 56 -59 -151 62 -82 -396 -75 -13 304 291 139
5221 139 11 78 85 105 -105 -126 -134 -353 -69 117 86 -115 -275 219 8 -103 75 -245 277 -258 -42 -109 132
5244 132 351 -56 -136 -97 92 146 -102 -129 -142 218 -25 28 -67 12 156 112 -103 -98 250 -158 95 134 -129 -145
5268 -145 -44 -192 94 -34 -106 -165 -15 78 120 305 178 -93 199 -192 -48 37 132 64 -123 6 17 7 93
5291 93 -211 -90 -22 143 -37 203 103 80 79 86 -236 -413 227 35 -245 161 -509 -110 220 179 76 121 18
5314 18 346 282 -42 -312 157 -231 -449 -113 -65 -28 -116 -179 -13 -186 136 -119 77 63 3 11 -201 -220 213 6
5338 6 28 220 317 104 22 149 152 46 61 183 257 195 -146 192 -82 -284 -157 18 180 -8 8 -26 -1 3 -355
$$ packed form
5173b5l4k07PL74j19K22j35j09Pj32K48k17J77r1J4O0M7n1p2J27M2j9m8J37M7
5198B50n42Q1J46l2j17J17l5K03r9P2J56j62J8j15r2K13j44l14L21O2L17j3j52
5221A39j28O7PK0k10k1qk19K84J86l1k01j60M94k11j11J78l20N22n35K16o7K41
5244A32K19m07q0L9J89N4k48k7j3L60k43N3r5P9J44m4k15NL48m08K53L9k63j6
5268a45J01j48K86j28p2n9J50R3M2J85j27k71K92l91J44Q5R5o8j87J29J1j0Q6
5291I3l04J21O8J65j80K40j00k3jPl22j77O40j92k80M06o70L99L30m1j03M5j03
5314A8L28o4l24k70M69l88k18L36M8L7q8o3J66j73L22k55J96j4o0Qk12j9M33k07
5338FK2J92R7k13q2J27Lj06J5J22P4o2l41L38k74k02J27J75J62j88J6l4K5Ml58
$$ plain form
5363 -355 59 217 -42 263 180 -91 -91 -129 -26 -368 -118 66 5 -161 -59 -253 188 268 174 60 146 3 -23
5386 -23 149 -290 -161 82 -54 14 -86 -84 226 124 -216 -205 28 -164 34 58 -76 -490 -148 58 194 -194
5408 -194 -272 -43 -34 -332 -182 -158 315 103 161 146 -99 -68 36 1 107 -74 200 -19 -21 -87 -23 -189 -22 -2
5432 -2 -125 190 -14 -172 45 92 -406 -442 9 294 -35 -107 -51 81 11 -127 -301 44 -30 -334 29 6 -270
5455 -270 54 11 161 -2 -181 230 50 -202 44 -205 -96 -376 -23 -53 -81 -108 -11 -88 219 -269 88 -21
5477 -21 111 -79 -7 106 3 188 126 -338 16 122 43 -209 -38 87 -67 265 -43 100 94 -113 5 133
5499 133 192 -143 157 406 -101 -30 -177 88 115 14 -443 42 60 -194 -12 17 7 89 109 -40 -322 5 12
5522 12 -111 153 177 59 43 -40 -56 119 -154 73 -167 147 11 -259 208 138 109 216 20 -123 34 -187
$$ packed form
5363c55M14J58k59L05q3k71%l8J03l42K50J84o1j66J02j94M41Q0r4j14Q6j43k6
5386b3J72m39J29K43j36O8j00KL10j02l40J1K33j92J98K4j34m14L42K06J36l88
5408a94p8K29Rk98J50K4M73k12N8j5k45L1J04l5J06j81K74k19ko6O4j66J67K0
5432bj23L15k04j58K17M7m98l6M51K85l29p2N6J32p0j38j74L45p4l04L63k3k76
5455b70L24m3J50j63j79M11j80k52K46k49J09k80L53l0k8k7R7p7L07m88L57j09
5477b1J32j90P2J13j03J85o2m64L54J06p9k52J71J25j54L32l08J43ok07J18J28
5499A33N9l35L00K49n07P1j47K65K7j01m57M85J8k54J82K9j0Q2K0j49k82L27P
5522A2j23K64K4j18j6q3j6J75k73K27k40L14j36k70M67p0k9J07j96j43J57k21
$$ plain form
5544 -187 156 62 -300 38 -145 29 118 -272 35 165 59 161 114 66 47 23 -108 211 59 193 156 -132
5566 -132 -183 204 6 113 -326 176 -46 -200 30 -305 147 -80 87 39 -157 238 7 -243 -38 313 -94
5587 -94 164 194 187 -91 -30 203 94 108 170 61 -88 -11 133 -103 25 210 243 -131 80 19 -28 -75 80 -23
5611 -23 73 -39 145 -4 -65 77 243 252 135 -164 -90 44 134 267 -235 -305 -39 -69 -295 -170 -31 40 114 233
5635 233 -302 -61 -44 -95 -54 -102 82 187 3 111 266 72 -152 73 -244 -200 -310 -137 -98 -36 -241 127
5657 127 -158 50 -15 35 221 -259 57 82 -212 -16 88 -301 15 98 353 50 -20 335 -64 9 -108 -5
5679 -5 -105 150 140 -194 205 -292 -125 -56 -165 18 -135 -35 191 -42 -286 -235 -23 68 -64 -247 263 -45
5701 -45 142 77 327 -78 -166 31 219 28 137 86 -208 312 290 36 318 -240 13 -35 94 -100 -255 -87
$$ packed form
5544a87L43r4l62L38j83J74Q9l90L07J30j06J02m7m8j9k4j31L19j52J34l7k88
5566a32n1L87j98J07m39N02k22j54K30l35M52k27J67m8j96L95k31k50K05L51m07
5587i4K58L0pk78O1K33j09J4O2j09j49P7J44k36J28J85L3l74K11o1m7m7J55j03
5611b3R6j12J84j49o1J42J66Rj17k99P4J34R0J33n02p0K66l0k26J25J39P1P4J19
5635B33n35K41J7n1M1m8J84J05j84J08J55j94k24K25l17M4j10J73L9O2k05L68
5657A27k85K08o5N0J86m80L16K5k94J96J04l89L16Q3K55l03p0L55l99P3j17J03
5679ej00K55j0l34L99m97J67O9j09J83j53J00K26k33k44N1K12R1j32j83N10l08
5701d5J87o5K50m05q8J97J88j91J09n1k94N20k2k54K82n58K53m8J29j94j55J68
$$ plain form
5723 -87 45 216 -138 97 41 148 -43 30 -53 -122 -266 -280 -176 159 28 4 61 -203 107 -30 -18 -29 -11 55
5747 55 -163 110 -152 11 120 39 50 -242 210 -10 12 -84 26 -159 129 -71 97 -32 -40 242 58 -351
5769 -351 -124 -69 -56 -74 72 -141 -246 247 -297 -52 -21 125 -150 -51 -94 187 27 -427 227 -221 -120 22
5791 22 -70 -128 172 156 -139 91 149 -303 105 6 4 -414 125 -87 -6 -98 213 187 229 29 -107 3 -93 210
5815 210 -92 -488 -76 -107 -104 -175 -21 -72 -128 204 84 -42 -45 126 83 -115 54 218 67 72 270 314 116 -241
5839 -241 109 -1 242 15 177 76 -99 -43 -384 372 54 -3 -51 -57 117 113 66 3 164 47 148 -46 -16
5862 -16 22 -297 228 -30 386 -10 159 -50 11 57 11 -186 43 19 -262 217 -73 -90 -30 73 18 3 -169
5885 -169 197 53 90 -134 -324 -230 -45 65 -420 -227 116 -42 -84 35 -107 -177 -77 -375 -362 -57 75 -44
$$ packed form
5723h7J32J71l54K35n6J07j91P3q3o9j44j4J04L35j31k4N7k64L10j37J2j1J8O6
5747E5k18K73k62J63J09q1J1k92M52k20K2r6J10j85K88k00J68j29qK82j84m09
5769c51K27N5J3j8J46k13j05M93n44K45L1J46k75R9m3K81j60m54O54m48J01J42
5791B2r2n8L00j6k95K30N8m52M08r9km18N39k12Q1r2L11k6M2k00j36J10r6L03
5815B10l02l96M12l1Lp1J54n1n6L32j20j26lJ71m3j98J69J64j51NJ98M4j98l57
5839b41L50j10K43k27J62j01j75N6l41P56l18n7m8oJ74mm7o3J61j17J01j94L0
5862a6L8l19N25k58M16l96J69k09O1M6m6j97K29k4k81M79k90j7O0J03n5j5j72
5885a69L66j44L7k24j90R4J85J10m85J93L43j58m2J19j42p0J00k98J3L05J32j19
$$ plain form
5907 -44 62 87 68 80 -28 228 -204 53 -166 32 28 -36 -67 -202 150 142 103 -31 85 -150 -96 -26 44 -23 -92
5932 -92 -118 -242 -227 -245 -81 188 0 96 -8 44 -11 -130 -2 175 282 282 -128 158 17 84 -80 297 -457
5955 -457 103 95 -58 -10 44 -197 96 -84 -77 -12 -44 156 86 260 -7 63 -16 78 -76 336 60 -99 194 135
5979 135 82 -20 117 -119 141 99 379 -64 128 19 110 84 96 -146 -178 193 3 127 -69 13 -158 -247 53
6002 53 -8 196 -11 -152 -34 168 -236 -195 86 215 -21 -201 -77 95 81 -15 278 85 175 207 416 34
6024 34 -188 33 -205 -89 452 -145 -5 -250 -76 44 126 -157 -216 16 61 -11 208 184 27 271 -124 -16
6046 -16 -30 -129 -88 -341 152 104 -152 59 -67 -19 42 -49 177 -65 34 -70 102 -25 149 130 -230 263 84
6069 84 38 71 -75 84 33 -75 3 258 305 153 -235 168 258 347 -152 -34 198 -33 -29 108 -44 -80 -41 98
$$ packed form
5907d4J06K5j9J2j08K56m32K57k19J98mo4l1j35L52ql9j34J16k35N4P0P0o7o9
5932i2k6j24J5j8J64K69j88R6j04N2n5j19J28J77J07%m10K86j41O7j64L77p54
5955d57N60qj53M8N4k41K93j80PO5l2K00p0J74k67P0p9R4j54M12k76j59K93n9
5979A35n3j02J37k36K60m2K80m43J92j09R1k6J2k42l2L71j90J24j96Q2j71q9L00
6002E3o1K04k07j41J18K02m04M1K81J29k36j80J24J72j4r6K93j93R0L2K09l82
6024C4k22K21k38J16N41n97J40k45J74J20Q2k83n9K32M5p2K19k4j57K44l95J08
6046a6j4r9M1k53M93m8k56K11j26M8O1r1K26k42R9j04J72j27J74j9l60M93j79
6069H4m6L3j46J59n1j08P8K55M7j52l88M03R0Q9m99J18K32k31MJ37j52l6L9J39
$$ plain form
6093 98 15 -133 -124 -32 194 -34 -146 74 -23 -271 -53 25 138 310 20 -3 -68 -146 232 25 -129 -1 134
6116 134 210 -100 -378 -72 -39 155 11 -134 106 -44 -110 195 -123 -53 -130 -158 -11 205 77 -33 141 -161
6138 -161 169 -161 120 118 -33 -49 -130 -112 138 23 -28 -27 -201 -17 8 35 -80 -124 66 -50 178 -173 35 187
6162 187 -168 136 6 -150 111 -62 -160 -150 200 -155 115 -173 202 260 -264 -90 -86 32 103 -101 -69 -11 239
6185 239 -184 -4 -52 118 -156 -331 -66 240 273 -19 441 -115 -66 -117 -283 251 170 146 89 156 50 204 -209
6208 -209 -180 126 -76 -106 -90 -1 -54 326 116 -160 -27 67 77 201 -60 -44 -3 138 257 69 -166 -114 233
6231 233 27 -236 -207 -71 422 86 1 221 -128 11 103 -119 -2 49 -29 100 56 -162 -209 158 4 38 23
6254 23 117 23 -47 -202 -59 -114 79 -83 -74 173 -397 -227 -49 202 66 199 -141 113 91 57 296 -85 33
$$ packed form
6093I8q3j48RR2K26k28j12K20r7k48K18P8J13J72k90k3o5p8L78k07j54J28J35
6116A34P6l10k78L06L3J94j44j45K40j50o6L05l18P0p7k8J47K16j28j10J74l02
6138a61L30l30K81kj51j6q1J8K50j15n1Jj74J84K5K7j15m4J90j16K28l51K08J52
6162A87l55L04j30j56K61j73r8J0L50l55K70k88L75N8n24J74MJ18P1k04L2N8K50
6185B39m23J80m8J70k74j75K65L06L3k92M60n56M9n1j66N34q1k4n7O7j06J54m13
6208b09K9L06k02l0J6Q9n3L80k10k76J33R4J0J24k61J6M1J41J19j88k35N2L47
6231B33k06k63K9J36M93l36q5K20l49J39R2k22J17N1p8J29m4k18m7L67j54L4j5
6254B3R4r4p0j55J43n5J93j62RK47n70J70J78K51j36J33l40K54k2l4K39l81J18
$$ plain form
6277 33 28 -239 17 112 286 84 50 52 92 184 24 -243 158 -65 -156 -106 266 321 248 -198 -19 -258 -78 106
6301 106 116 60 77 143 130 -60 -67 31 199 -47 -61 243 74 67 -73 -52 -91 272 212 -136 -78 -150 -90 -63 -104 72
6327 72 3 355 -39 261 -4 131 276 -11 90 -110 119 -94 -59 217 202 -317 -206 -263 -79 260 -147 164
6349 164 -39 -98 173 214 -67 -43 86 19 -61 -126 214 -86 38 16 46 -146 -4 -17 75 164 5 212 -18 92
6373 92 67 -16 -143 97 -31 266 13 330 -68 -52 160 37 48 7 79 6 292 -121 124 -22 101 285 210
6396 210 83 -36 -21 74 68 -29 -71 121 -7 -200 -72 -5 -156 128 185 -153 111 35 57 -157 12 -102 143
6419 143 203 55 124 133 -25 101 108 6 122 -12 206 33 29 -129 149 -105 235 166 372 99 19 -52 -465 -40
6443 -40 102 152 166 94 -155 -8 -135 -194 71 -3 298 135 -137 131 175 -280 -28 -26 -193 -17 70 -35 63 113
$$ packed form
6277C3nk67K56R5J74k02l4KM0R2j60k67M01k23r1N0L72N5p3m46J79k39J80J84
6301A06J0n6J7O6j3j90pR8J68k46j4L04j69pj40K1l9L63o0l48N8p2O0K7m1J76
6327G2o9L52l94L00k65J35J45k87J01k00K29k13L5K76j5n19J11n7J84L39m07L11
6349A64k03n9K71M1k81K4J29o7q0o5L40l00J24k2L0j92J42j3R2Q9j59K07k30J10
6373I2k5q3j27K40j28K97k53L17l98J6K12j23J1m1P2p3K86m13K45j46J23J84p5
6396B10j27j19J5R5or7m2J92j28j93J28O7j51K84N7l38K64p6K2k14J69j14K45
6419A43O0j48O9Rj58J26Pj02J16j34K18j73mj58K78k54L40o9K06k73q0p1m13M25
6443d0J42N0J4p2k49J47j27n9K65p4L01j63k72K68M4m55K52Kj67J76Q7j05R8N0
$$ plain form
6467 113 -43 216 226 6 -17 -90 -211 -379 226 -215 121 -9 -70 -238 -148 -131 -198 -17 -9 -63 95 11 -27 100
6491 100 85 186 6 -281 -9 200 15 105 97 -209 114 -211 -240 95 -220 132 -18 5 -163 162 -248 -148
6513 -148 -64 -131 139 130 -81 264 206 -119 4 524 -53 130 -233 28 63 -79 121 -45 89 -414 -238 13
6535 13 55 -11 130 -43 -84 299 55 131 -22 113 -278 81 -31 -6 -63 80 -14 192 154 -148 333 -79 94
6558 94 -97 283 156 253 21 -111 186 49 252 -86 184 134 -77 93 21 -74 129 226 -156 148 -159 -128
6580 -128 -47 -30 21 66 103 -236 183 -115 -43 27 -143 42 42 -77 119 374 -109 158 133 35 241 -338 33 -167
6604 -167 -187 82 38 -128 -34 -39 -210 -123 424 -23 178 -55 252 106 7 472 -160 135 245 66 -68 96
6626 96 195 147 106 -222 65 -72 -591 10 -373 165 163 -36 -88 -116 46 -163 43 -42 64 -96 -98 50 0 333
$$ packed form
6467A13j56K59J0k20k3p3j21j68O05m41L36j30o1j68R0J7o7J81Qn4J58q4l8J27
6491A00j5J01j80k87K72K09j85R0ql06L23l25k9L35l15L52j50K3j68L25m10J00
6513a48Q4o7K70rk11L45n8l25J23N20n77J83l63K61L5j42K00j66J34n03J76K51
6535A3M2o6J41j73m1L83k44P6j53J35l91L59j12K5n7J43r4K06l8l02M81m12J73
6558I4j91L80j27R7k32j32K97j37K03l38K70n0k11J70p2r5K03R7l82L04l07L1
6580a28Q1J7N1M5L7l39M19k98P2P0j70J85%j19J96K55m83K67k5r8K06n79L71k00
6604a67k0K69m4j66R4nj71Q7N47m47K01k33L07j46r9M65o32K95J10j79j34J64
6626I6R9m8m1l28K87j37n19O01l83N38kj99n2k8J62k09K06q5J06j60kJ48n0L33
$$ plain form
6650 333 256 262 -186 -192 -102 97 -112 12 252 70 -34 108 24 330 28 269 358 -23 -147 -118 -41 74 126 -190
6674 -190 105 178 385 374 -77 179 2 -318 -82 -30 142 137 -238 76 -210 129 213 155 -85 -17 -113 83 159
6697 159 -48 -252 7 -186 170 84 -143 289 194 298 99 -64 -122 -49 400 -2 -95 42 -341 -18 -144 120
6719 120 -209 49 231 65 83 -18 -141 38 177 -12 174 13 115 -48 166 213 21 -347 -29 -99 -44
6740 -44 -418 191 109 184 95 92 16 -267 9 7 -54 -150 -22 240 7 40 -88 -157 56 51 108 262 106 32 -138 9
6766 9 -57 -160 -53 148 205 -29 38 -271 -4 105 -20 -73 -351 -71 -28 210 190 -142 29 217 -122 207 -11
6789 -11 -289 76 -43 182 -452 317 47 29 -63 -6 -160 15 -21 -176 23 137 111 182 -134 40 -204 132
6811 132 -337 127 64 -143 -81 71 -21 59 -289 8 117 -290 258 -163 55 -43 82 60 123 181 23 132 -56
$$ packed form
6650C33p7Om48oR0J99k09J24K40j82j04J42q4L06l02K41Q9l81j24K9P7J15N2l16
6674a90K95P3K07j1m51K56j77l20K36N2J72nl75L14k86L39Q4n8k40O8r6J96P6
6697A59k07k04K59j93L56q6k27M32r5J04j99j63n8P3M49m02r3J37l83L23j26K64
6719A20l29K58J82j66J8j01j23J79J39j89J86j61J02j63K14M7j92l68L18p0N5
6740d4l74O09q2P5q9lp6k83K76ko1r6J28K62k33L3j28o9K13nN7J54j56p4j70J47
6766Io6j03J07K01N7k34O7l09K67J09j25n3k78K80M3K38k0l32J71J88l39L29k18
6789a1k78L65j19K25o34P69k70j8r2N7j54J75l6j55J99J14k6P1l16J74k44L36
6811A32m69M64o3k07O2J52r2Q0l48K97J09m07N48m21K18r8J25k2O3N8j58J09j88
$$ plain form
6834 -56 -124 -128 168 143 85 -140 98 -76 102 -198 184 -99 -181 301 -150 106 21 -39 334 -1 -197 97 225
6857 225 298 27 112 -25 14 -1 98 20 384 96 162 -131 -91 -102 128 -97 -27 -526 -77 -106 -160 120 -49 14
6881 14 -132 87 -238 469 31 -86 -366 9 -102 -146 98 227 -152 -72 278 -189 -88 107 -216 9 213
6902 213 106 176 -76 -3 -69 104 85 271 -49 -162 -123 -213 -143 332 -127 198 -57 -52 76 41 92 -142 230 139
6926 139 -75 -160 235 -101 334 -128 -110 -89 -140 -129 -158 211 256 101 73 150 23 -14 -129 -258 223 263 67 276
6950 276 -17 -360 -146 -289 144 4 -114 15 30 -19 -25 77 -78 -16 -126 -174 -74 -50 87 85 -46 -120 -31 -49
6974 -49 229 0 -3 143 -178 155 -106 -233 220 154 219 184 52 41 -204 90 -237 -73 -122 64 -183 60 148
6997 148 168 321 81 -296 301 29 194 103 144 -82 -211 -104 -19 -11 -71 -38 -106 182 144 34 44 200 -105 126
$$ packed form
6834e6o8mK96k5n8k25K38j74J78l00L82k83q2M82m51K56q5o0L73l35j96K94J28
6857B25P3k71Q5j37L9j5R9p8L64k88O6k93M0j1K30k25P0m99M49k9n4K80j69O3
6881A4j46K19l25P07m38j17k80L75j11m4K44J29l79Q0L50m67J01J95l23K25K04
6902B13j07P0k52P3o6J73j9J86l20j13L9r0P0M75m59L25k55NJ28l5N1k34L72r1
6926A39k14q5L95l36M35m62J8K1n1J1k9L69M5j55k8P7j27l7j15j29M81M0j96K09
6950B76k93l43K14j43M33j40j18J29J5m9oJ02j55O2j10m8J00K4J37kj31p4Q9j8
6974d9K78k29lJ46l21L33k61j27M53o6O5l5j32j1k45K94l27J64m9J86k47K43Q8
6997A48K0J53k40l77N97k72J65r1M1k26j29J07Q5Qo0L3o8K88l8j10J0J56l05K31
$$ plain form
7021 126 138 13 -65 -218 -166 349 286 -174 73 -196 -42 -78 287 117 57 294 -137 118 271 199 -17 -228
7043 -228 -57 -99 -215 173 -57 -177 107 -126 -11 -18 84 98 -16 51 33 -255 27 34 -164 -60 -105 111 -80
7066 -80 273 28 -46 -225 9 -76 135 -45 -112 -154 463 93 -178 -115 307 64 -86 95 333 90 -49 -87
7088 -87 -61 159 -134 14 176 -269 85 52 -118 -1 -385 -214 -169 122 125 68 54 -105 177 -159 -307 95 360
7111 360 99 -56 45 112 -42 -37 -245 399 -134 95 3 -54 -242 -30 137 -240 19 48 155 -172 116 107 104
7134 104 -37 80 -101 86 180 -95 0 -141 133 27 239 161 53 122 40 43 126 -191 -55 50 -23 199 106
7157 106 -91 -21 -191 -85 -41 122 54 -15 29 -55 -232 53 71 -264 -190 -374 -188 -39 -70 -262 -119 -181 95
7180 95 -105 -54 -162 -178 -264 169 -54 249 103 20 206 196 -38 -29 159 352 -26 24 -259 -281 -52 29 -115 17
$$ packed form
7021A26J2j25p8j53N2N15o3m60K47k69J54l6L65j70o0K37m31K55J53p2k16k11
7043b28J71m2j16L88k30j20K84k33J15pJ02J4j14O7j8k88K82Pj98J04m5K16j91
7066h0L53k45p4j79K34q5K11j80o7m2O17l70k71O3M22k43j50J81K38k43j39l8
7088h7K6K20k93J48J62m45L54l3j70J17l84J71M5K91Ln7j4j59K82l36j48M02K65
7111C60k61j55J01O7j54Nk08O44n33K29r2n7j88K12J67l77K59K9J07l27K88rl
7134A04j41J17j81J87R4k75R5j41K74j06K12p8j08O9q2LQ3l17J36J05p3K22r3
7157A06j97P0j70J06M4J63o8o9M4q4j77K85J8l35P4j84J86J49l1j92J43o2K76
7180I5k00N1j08j6q6M33k23L03j46q3J86j0k34RJ88J93l78N0k83k2K29Q1j44J32
$$ plain form
7204 17 -3 -67 -355 44 191 -2 -33 -307 -217 -98 -20 29 23 214 -164 211 -163 -284 -78 73 -176 202 83
7227 83 -77 -81 -237 -118 102 61 26 252 19 107 180 90 -77 206 -198 -193 -210 14 -194 79 -153 -113 227 -47
7251 -47 -60 -109 -280 -45 -184 -168 -46 104 -74 -203 -144 -151 -76 114 -158 204 175 -91 -52 -73 -67 50 186 -211
7275 -211 111 121 313 -16 205 -108 -218 -85 143 -30 -200 -44 -30 -29 62 45 272 -8 -17 50 39 -145 -338
7298 -338 209 79 -175 -117 221 91 475 -121 298 -189 97 -179 -232 -38 -73 137 217 -275 -249 -19 29 -17
7320 -17 190 171 23 153 -31 59 -23 -63 -224 -364 60 334 54 76 -79 -81 -42 42 -26 196 -161 67 118 -56
7344 -56 141 -89 -244 195 73 101 277 89 162 153 145 -20 -150 -4 -47 -38 71 62 11 17 -96 134 -85 3 131
7369 131 48 439 74 57 -148 19 0 -135 127 -15 -299 160 -75 212 116 -117 -177 -200 -174 -16 -285 -305 129
$$ packed form
7204A7k0o4k88L99J47j93l1k74R0J19P8M9oJ91l78L75l74j21K06J51k49L78j19
7227H3j60mj56J19K20m1l5K26k33Q8P3r0j67K83m04Nj7K24k08K73k32M0L40k74
7251d7j3m9j71K35j39J6J22J50j78j29N9pP5J90k72L62k9k66L9k1OJ17J36l97
7275b11L22J0J92l29K21l13j10J33K28j73j70J56J4JR1j7K27k80rO7j1j84j93
7298c38N47j30k54N8L38j30L84n96M19m87K86k76n3J94l5K10Q0m92K6K30M8m6
7320a7K07j9j48J30j84R0q2m0j61j40M24K74k80K2j55kL9Q4o8K22l57K28N1j74
7344e6J97k30j55M39j22K8J76j88P3rqj65j30J46m3RJ09rn1Oj13K30k19Q8J28
7369A31q3L91l65j7k05J67j9j35K62j42k84M59k35K87r6k33o0k3K6J58k69k0M34
$$ plain form
7392 129 39 112 -114 -175 -310 -151 -23 -142 0 288 117 31 -82 47 -53 56 -130 128 -24 -49 -279 212
7414 212 197 30 122 139 155 -100 -75 163 331 -294 116 -37 -139 20 -142 16 62 -42 18 -71 244 94 -43
7437 -43 -32 256 -13 291 29 188 -48 265 150 -5 -158 -132 116 -160 106 -85 132 130 144 44 267 98
7459 98 44 87 51 -95 13 432 -169 145 -365 -36 98 -325 -179 -100 -43 243 -146 -50 390 -46 53 -366 -444
7482 -444 -63 201 229 145 -30 21 24 25 -112 129 43 13 -59 -129 -223 4 34 205 107 130 54 32 96 -14 -68 -27 66
7509 66 -292 -277 183 163 0 35 191 -137 -95 -21 -308 99 -257 57 3 -120 183 11 97 -14 121 289 170
7532 170 213 -47 -6 358 137 100 -68 103 -132 50 19 -3 -45 -285 224 -75 -165 -18 140 -113 144 21
7554 21 -67 118 -287 5 -268 68 -145 -17 41 -139 66 -257 397 -12 104 73 78 -247 -187 149 -129 -66 51
$$ packed form
7392A29r0P3k26o1j35J59J28j19J42K88j71q6j13J29j00J09j86K58j52k5k30M91
7414B12j5j67R2J7J6k55K5K38J68o25M10j53j02J59j62J58M6j04O0q9L15j50j37
7437d3J1K88k69L04k62J59k36L13j15j55j53K6K48k76K66j91K17kJ4j00K23j69
7459I8n4M3l6j46J08M19o01L14n10L29J34m23J46P9N7K86l89R6M40m36R9m19p8
7482d44L81K64K8q4j75N1LJj37K41q6l0p2p0r4K27L0J71r8K3p6k2O4j10n4M1R3
7509F6l58J5M60k0j63L5J56l28M2P4k87M07l56L14n4j23L03j72Q6j11J35J68j19
7532A70M3k60M1L64k21l7j68J71k35J82l1k2m2k40N09k99r0J47J58k53K57j23
7554B1q8J85m05K92k73L36k13J28N8j80K05l23O54m09J16l1Nl25O0L36k78O3J17
$$ plain form
7577 51 5 -114 -62 88 -285 -138 139 -53 -49 37 -25 -153 128 89 52 -6 134 -17 50 1 238 48 188 -93
7601 -93 -62 159 -159 95 49 215 22 -40 82 166 31 88 151 -340 -48 353 -69 119 211 270 -52 230 110
7624 110 5 -252 -146 326 -163 -51 -150 -97 0 -145 -501 157 17 83 237 -104 265 -254 -122 72 137 77
7646 77 -154 311 -17 -268 113 132 -84 28 188 -189 2 -80 211 22 109 -335 -139 106 -145 25 37 -12
7668 -12 -29 -70 -263 -237 -23 461 -176 11 -36 25 -80 -167 327 -149 -33 159 -84 5 134 41 93 -27 -216
7691 -216 -44 -6 -142 19 147 44 -188 127 335 -47 -69 183 64 -72 -102 262 -248 -105 -179 16 34 27
7713 27 255 -41 -16 -145 -196 -148 297 -41 48 225 194 -29 -127 -115 271 32 -150 -39 256 -75 306 147 13
7736 13 20 -197 29 -57 -285 -57 -224 76 -32 176 -21 -245 -57 -36 -65 122 -115 62 -93 15 -40 -153
$$ packed form
7577E1m6j19N2J50l73J47K77j92MQ6o2j28K81l9l7n8J40j51O7m9K37j90J40k81
7601i3L1K21l18K54m6J66j93o2J22Q4j35N7O3m91K92M01m22J88R2N9l22K82j20
7624A10j05k57J06M72m89J12r9N3R7j45l56O58j40O6J54l41L69n19J32J94O5o0
7646G7k31M65l28k51L81J9k16J12J60l77J91q2K91j89Q7m44J96K45k51J70J2m9
7668a2j7m1j93K6K14M84o37J87m7O1j05q7M94m76J16J92k43Q9J29r3N2j20j89
7691b16J72L8j36J61J28j03k32L15K08l82k2K52j19j36l0L64n10J43p4J95J8p
7713B7K28k96K5j29n1M8M45l38Q9J77l1k23r8J2L86k39j82J11K95l31L81j59j34
7736A3Pk17K26q6k28K28j67L00j08K08j97k24J88K1k9J87k37J77j55J08n5j13
$$ plain form
7758 -153 -47 -45 71 5 -101 -178 40 -176 20 243 -81 17 500 -8 -147 -247 -128 201 48 -22 253 149
7780 149 136 -6 36 -179 27 -22 -10 308 64 -36 -66 113 143 308 72 448 46 -327 -26 -191 33 142
7802 142 58 -7 -28 -5 350 -162 213 -229 113 -256 -34 71 -43 -79 -10 -98 217 16 154 -67 357 185
7824 185 -89 154 -154 -262 104 2 170 -101 -15 140 206 55 107 194 -190 72 8 221 -23 2 186 192 -185
7847 -185 -87 106 -41 -28 -1 -139 87 113 -51 -164 114 -92 -116 32 -138 -100 -77 32 116 44 38 291 228 187
7871 187 109 13 -51 -253 -113 120 146 243 171 70 119 64 -43 51 46 97 -28 -32 4 -128 10 -3 -269 -27 100
7896 100 166 151 -173 56 -122 -55 274 26 75 -76 -46 -38 -289 -221 43 339 -372 -1 162 79 -62 249 -33
7919 -33 266 338 -124 119 -138 -130 9 96 -55 56 -188 -236 -39 250 -54 -173 246 282 -31 182 -240 62
$$ packed form
7758a53J06KJ16o6j06p7K18k16J96K23l24R8M83n08j39j00J19L29j53p0K75j04
7780A49j3j42M2k15K06m9J2L18k44j00l0J79L0J65k36L76m02l73L01j65K24J09
7802A42q4o5k1K3L55n12L75m42L42l69K22J05j14l6O9q8L15k01J38k21M24j72
7824A85k74K43l08j08L66j02J68k71Q6J55O6j51N2Q7l84K62o4K13k44K5J84Ol77
7847a85R8J93j47J3K7j38K26K6j64j13K78k06k4J48j70L8K3J09Q4p2oK53o3m1
7871A87p8r6o4k02J40K33K6R7p2j01M9n5j07R4nN1j25mL6j32J38j3k66K42J27
7896A00O6j5l24K29j78O7L29k48M9j51L0Qk51O8K64K96p11L71J63q3j41L11k82
7919c3K99P2m62K43k57QJ39Q7j51J11k44m8J97K89l04j19M19L6l13K13m22L02
$$ plain form
7941 62 -104 -55 324 -212 -275 -3 77 8 -10 -104 40 212 297 169 162 130 -336 107 -115 -238 -314 -29 -146 -204
7965 -204 -112 95 -266 117 151 136 255 -115 -31 198 366 30 4 -90 -12 -99 84 -37 -200 33 -136 144 84
7988 84 -20 -17 201 -194 -65 -250 -94 -127 139 49 40 -16 76 131 121 90 124 -34 112 251 7 -23 240 -137 64
8013 64 -194 -35 -116 179 117 -95 18 -174 -179 42 64 117 186 -177 152 43 -283 39 75 -138 -48 201 73
8036 73 -198 -150 -65 -35 -142 -103 -69 -226 32 -123 -90 -45 252 -178 -131 -96 -392 -191 120 346 53 -90 50
8059 50 38 13 -87 -192 -22 -123 -149 136 -26 4 22 273 230 35 -185 101 -176 -198 -22 -218 -69 143 161
8082 161 -192 179 -49 -59 -153 412 273 -20 -103 -2 -167 -13 -205 -222 77 -145 -142 117 62 -9 16 -166 173
8105 173 -180 38 148 -67 190 -60 10 83 72 154 45 -10 3 46 15 31 58 115 36 14 5 92 -272 -21 70 2
$$ packed form
7941F2j66M9L79n36o3K72Q0o9j8r4J44J72Q5j28pl2m66M43k22j23p6K85j17n8
7965b04R2K07l61L83L4j5J19l70Q4K29J68l36k6r4P8q7J83j21j63K33j69K80o0
7988H4j04LK18l95J29j85J56l3K66r0rn6R2N5j0l1L4j58J46J39k44l0K63l77K01
8013F4k58J59q1K95o2k12J13j92nK21K2N3O9l63L29j09l26L22L6k13R0K49j28
8036G3k71M8Q5L0j07L9L4j57K58j55L3M5K97m30M7L5k96K01L11K26k93j43J40
8059E0j2k5j00j05J70j01k6K85j62L0J8K51m3j95k20K86k77k2J76j96J49K12J8
8082A61l53L71k28j0r4N65j39k93q3J01j65J54j92j7K99k22LK59n5p1K5j82L39
8105A73l53K18J10k15K57k50P0P3j1Q2j09n5J3M3l1J6K7N7p9k2rQ7l64K51R1o8
$$ plain form
8131 2 -271 159 -61 312 -169 209 -201 19 -112 48 -5 57 -252 -85 171 -47 170 -142 0 80 87 186 -129
8154 -129 50 -78 6 26 -202 27 -97 -123 -275 234 20 192 -90 151 220 -99 -337 113 8 65 -2 -64
8176 -64 -7 120 278 43 105 -110 -183 83 -100 -106 -2 55 214 386 -109
$$ packed form
8131Bk73M30k20L73m81L78m10K20j31J60n3O2l09J67K56k18K17l12J42Q0PR9l15
8154a29J79j28Q4K0k28K29j24k6j52N09k14J72k82K41O9l19k38M50j05N7o7o2
8176f4N7J27J58k35O2k15p3K66j83oJ04N7J59J72m95
8191a09
$$ Imaginary data points
##PAGE= N=2
##DATA TABLE= (X++(I..I)), XYDATA
$$ plain form
0 0 0 0 0 0 0 0 8 -8 8 -8 16 -16 16 -24 25 -32 40 -48 56 -66 78 -90 105 -121 138 -160 179 -205 234 -263
30 -263 297 -333 373 -417 466 -517 576 -640 711 -787 873 -966 1071 -1185 1312 -1456 1618
47 1618 -1803 2015 -2265 2557 -2911 3345 -3895 4618 -5614 7084 -9477 14049 -25981 123965
61 123965 270794 17996 -149560 -149759 17722 120588 106955 -9189 -102321 -122818 -33725
72 -33725 81231 126957 37847 -85620 -113570 -6755 104126 101611 -8101 -96440 -83475
83 -83475 11368 87564 77554 -13104 -94932 -84711 15448 94403 59273 -58928 -127328 -74797
95 -74797 32548 76078 22530 -61075 -91985 -46242 36662 88718 61295 -30027 -96076 -63014
107 -63014 38878 94150 40495 -57882 -90537 -32849 43258 65415 30203 -24072 -58126 -46204
$$ packed form
0@%%%%%%Qj6J6j6K4l2L2m0M9n7P2q8J04j22J44j68J95k26K59k98L39l84M39m97
30b63N60o30P06p90Q83r83J093j216J351j498J660j839K037k256K497k768L074
47A618l421L818m280M822n468O256p240Q513j0232J2698j6561K3526m0030J49946
61A23965J46829k52798j67556j99J67481J02866j3633j16144r3132k0497Q9093
72c3725J14956M5726q9110j23467k7950J06815J10881k515j09712q8339J2965
83h3475R4843P6196j0010r0658q1828J0221J00159P8955l5130j18201o8400N2531
95g4797J07345M3530n3548q3605l0910M5743Q2904N2056k7423r1322o6049L3062
107f3014J01892N5272n3655r8377l2655N7688P6107K2157l5212n4275l4054J1922
$$ plain form
119 -46204 8765 59588 45964 -28272 -79477 -39566 51306 91387 40484 -35174 -51555 -3293
131 -3293 46526 48036 7643 -33756 -42862 -14457 26676 43681 18295 -22654 -33769 -3140 33080
144 33080 34305 42 -33906 -40880 -17415 17780 35458 16018 -26711 -46824 -14547 39146
156 39146 51025 2843 -52294 -54966 -9079 27710 18968 -17432 -39785 -30580 -1418 22853 24730
169 24730 2569 -25211 -34168 -16974 6416 10798 -7354 -28663 -32226 -13507 13392 26125 12485
182 12485 -15867 -27301 -8293 18852 19211 -10160 -33963 -22973 10711 28829 16156 -7046
194 -7046 -14301 -1738 14915 19920 9936 -8400 -21227 -16336 5543 23986 19189 -2584 -14407
207 -14407 -2268 20282 28833 17270 -3118 -15447 -13474 2127 17883 18363 -101 -18087 -13393
$$ packed form
119d6204N4969N0823j3624p4236n1205L9911R0872M0081n0903p5658j6381M8262
131c293M9819J510m0393m1399r106K8405M1133J7005k5386m0949j1115L0629L6220
144C3080J225l4263l3948o974K3465L5195J7678j9440m2729k0113L2277N3693
156C9146J1879m8182n5137k672M5887L6789q742l6400k2353R205K9162K4271J877
169B4730k2161k7780q957J7194K3390M382j8152k1309l563J8719K6899J2733j3640
182A2485k8352j1434J9008K7145L59k9371k3803J0990L3684J8118j2673k3202
194g046p255J2563J6653N005r984j8336j2827M891K1879J8443m797k1773j1823
207a4407J2139K2550Q551j1563k0388j2329J973J5601J5756M80j8464j7986M694
$$ plain form
220 -13393 12996 33353 24210 -5084 -23433 -13934 9324 18292 3784 -16006 -18212 -832 17390
233 17390 19752 7063 -4648 -6375 -2521 1032 1500 -1788 -8805 -16378 -14789 -329 15333 14754
247 14754 -3347 -16284 -7303 13178 17934 -2159 -23977 -22873 -1828 14724 10699 -4609 -11880
260 -11880 -4974 7572 15133 11297 -1145 -13784 -15563 -4501 8043 8820 -1956 -10363 -5416 8040
274 8040 17709 16854 6580 -5195 -10002 -4311 6623 10067 1041 -12346 -13010 3443 20898 20888 4059
289 4059 -10190 -7063 6416 11964 2501 -10647 -13268 -2978 8470 11330 6493 1955 1573 3284
303 3284 3780 2721 -103 -4189 -9917 -12164 -4947 6453 10015 741 -9078 -5408 7567 13307 2774
318 2774 -12262 -15699 -6249 2515 2699 -2847 -6512 -4933 996 6874 8368 3009 -5462 -9557 -6190
$$ packed form
220a3393K6389K0357r143k9294j8349R499K3258Q968j4508j9790k206J7380J8222
233A7390K362j2689j1711j727L854L553M68l288p017p573J589J4460J5662n79
247A4754j8101j2937Q981K0481M756k0093k1818J104K1045J6552m025j5308p271
260a1880O906J2546P561l836j2442j2639j779J1062J2544P77j0776q407M947J3456
274H040R669q55j0274j1775m807N691J0934L444r026j3387o64J6453J7455j0j6829
289D059j4249L127J3479N548r463j3148k621J0290J1448K860m837m538l82J711
303C284M96j059k824m086n728k247P217J1400L562r274r819L670J2975N740j0533
318B774j5036l437R450Q764J84n546l665J579N929N878J494n359q471m095L367
$$ plain form
333 -6190 -1253 -1069 -5878 -8263 -4774 1314 5083 5891 4979 2093 -2242 -4350 -1739 2512 578 -7663
349 -7663 -12315 -4308 9878 14200 5359 -4287 -3054 6679 10174 2429 -7202 -9393 -3874 1791 3200
364 3200 2784 3696 5128 4780 3280 3814 4941 2938 -3558 -9115 -6431 1441 6282 2680 -2740 -1926
380 -1926 5570 10328 6839 -1405 -5560 -4635 -1779 -721 -2382 -4194 -3970 -895 3670 6486 4941 328
396 328 -3424 -2059 -205 -1489 -5649 -7513 -5324 -1696 -147 1479 4299 5154 1826 -2869 -2879 1090
412 1090 1283 -4953 -11639 -9090 885 6725 3829 -2146 -1454 4433 6949 1852 -4596 -5942 -2836 -1234
428 -1234 -2789 -2796 948 4514 4621 2263 3107 5418 4829 383 -4467 -4949 -1413 847 -457 -2168 -1118
445 -1118 2992 6562 6233 3532 605 -498 -554 -483 -950 -2291 -3692 -2548 1529 5546 5891 3007 1149
$$ packed form
333f190M937J84m809k385L489O088L769Q08r12k886m335k108K611M251j934q241
349g663m652Q007J4186M322q841r646J233R733L495p745r631k191N519N665J409
364C200m16R12J432l48j500N34J127k003o496n557K684P872M841l602n420Q14
380a926P496M758l489q244m155R25K856J058j661j812K24L075M565K816j545m613
396C28l752J365J854j284m160j864K189L628J549J626K820Q55l328m695j0L969
412A090J93o236o686K549R975N840k896n975O92N887K516n097o448j346L106J602
428a234j555pL744L566J07k358Q44K311n89m446m850m82L536K260j304j711J050
445a118M110L570l29k701k927j103n6P1m67j341j401J144M077M017L45k884j858
$$ plain form
462 1149 1905 3069 -87 -3916 -5263 -3440 -2809 -3665 -2872 1821 5201 3691 -341 -1211 2341 3542
478 3542 -1307 -7836 -8113 -2458 2327 1187 -1797 -1445 3288 5626 2852 -1721 -3280 -2495 -2942 -5203
494 -5203 -5210 -2418 437 -140 -599 1318 5042 5816 2187 -1631 -2638 -1343 -132 -1241 -2464 -2423 -617
511 -617 2073 4551 5363 3462 1389 -616 -328 -35 -1425 -4344 -5001 -1684 2432 3784 2333 2829 4690
528 4690 5592 3056 -852 -1776 -1295 -1564 -3432 -2888 713 3706 2494 -385 21 3654 5064 487 -5945
545 -5945 -7506 -2931 745 -250 -3158 -2708 1208 4044 3596 1940 1196 895 -1490 -3682 -3930 -2528 -2021
562 -2021 -3353 -3599 -1492 2392 3533 1279 -1012 -1284 -696 -1264 -3562 -3820 -3768 -2716 -1311 1184 3867
579 3867 4331 2219 901 1717 2981 927 -3852 -5270 -3291 256 848 -796 -23 3229 5149 3414
$$ packed form
462A149P56J164l156l829j347J823O31q56P93M693L380j510m032q70L552J201
478C542m849o529k77N655M785j140k984L52M733K338k774m573j559P85m47k261
494e203pK792K855n77m59J917L724P74l629l818j007J295J211j109j223M1J806
511f17K690K478Q12j901k073k005K88K93j390k919o57L317M116J352j451M96J861
528D690R02k536l908r24M81k69j868N44L601K993j212k879M06L633J410m577o432
545e945j561M575L676r95k908M50L916K836m48j656p44l01k385k192k48J402N07
562b021j332k46K107L884J141k254k291k72N88n68k298k58N2J052J405K495K683
579C867M64k112j318Q16J264k054m779j418J979L547N92j644P73L252J920j735
$$ plain form
595 3414 110 -749 617 333 -2589 -3839 -1371 2351 2852 1138 1445 4497 6522 3626 -1144 -2210
611 -2210 -88 437 -1913 -4150 -2732 763 2710 1145 722 1716 2985 2123 -625 -2227 -2261 -1883 -2299
628 -2299 -2390 -968 1092 1782 1485 2060 2523 2043 -688 -2838 -3420 -2786 -3090 -4270 -3506 -788 1727 1730 1702
647 1702 1493 2180 1476 -1496 -2410 -1673 -1113 -2112 -2913 -20 3342 5009 3003 284 464 2156 2127 -576
665 -576 -3769 -3652 -1316 395 508 1207 2801 3942 3039 2238 2323 2877 1382 -1119 -2228 -1163 700
682 700 962 253 1169 2518 3876 2902 1188 173 -501 -1440 -2633 -2470 -1824 -1308 -949 204 2498 4253
700 4253 2641 273 -594 195 -97 -2596 -4785 -4139 -1488 10 -387 -293 1176 2485 1298 -1262 -2621
717 -2621 -1537 -1339 -3258 -4419 -2672 327 1964 336 -532 1779 3527 2492 -892 -3160 -2025 -927
$$ packed form
595C414l304q59J366k84k922j250K468L722N01j714L07L052K025k896m770j066
611b210K122N25k350k237J418L495J947j565m23R94J269q62k748j602l4L78m16
628b299r1J422K060O90k97N75M63m80k731k150n82O34l04j180P64K718K515Lk8
647A702k09O87p04k972r14P37N60r99q01K893L362J667k006k719J80J692k9k703
665e76l193J17K336J711J13O99J594J141r03q01Q5N54j495k501j109J065J863
682G00K62p09R16J349J358r74j714j015o74r39j193J63O46N16L59J153K294J755
700D253j612k368q67P89k92k499k189O46K651J498l97R4J469J309j187k560j359
717b621J084J98j919j161J747K999J637j628q68K311J748j035l384k268J135J098
$$ plain form
733 -927 -1343 -2546 -2029 376 1919 1485 1256 2057 2989 1508 -1029 -2070 -1255 -792 -1360 -2093 -326 1948
751 1948 3069 2020 1513 2542 2922 1208 -1534 -2471 -1698 -760 -1017 -959 687 2641 2811 1409 894 1719
769 1719 1559 -1043 -3967 -3489 -1391 -226 -1044 -1531 538 3107 2919 1227 -508 -282 -98 -1123 -3443
786 -3443 -3323 -1547 -516 -444 -515 849 2606 1811 48 -692 -468 351 -1066 -3152 -2939 -1149 585 545
804 545 1070 1810 2837 2208 1120 -279 -432 -1115 -1931 -2635 -1644 382 1096 909 1307 3028 3427 1986
822 1986 -562 -1619 -724 -672 -1122 -1759 -866 1051 1963 2065 2306 2866 2351 -121 -1755 -1593 -300 -745
840 -745 -2223 -2657 -433 2013 2110 1055 889 1346 1288 94 -1635 -1580 -1251 -1327 -1548 -1496 229 1833 1273
859 1273 351 960 1429 804 -1063 -2549 -2298 -1219 -1120 -1807 -992 774 2411 1856 803 1126 734 -338
$$ packed form
733i27m16j203N17K405J543m34k29Q01R32j481k537j041Q15M63n68p33J767K274
751A948J121j049n07J029L80j714k742r37P73R38k57N8J646J954J70j402n15Q25
769A719j60k602k924M78K098J165q18m87K069K569j88j692j735K26J84j025k320
786c443J20J776J031P2p1J364J757p95j763p40K24Q19j417k086K13J790J734m0
804E45N25P40J027o29j088j399j53o83q16p04R91K026P14j87L98J721L99j441
822A986k548j057Q95N2m50o37Q93J917R12J02K41N60n15k472j634J62J293m45
840g45j478m34K224K446R7j055j66M57n8j194j729N5L29p6k21N2J725J604n60
859A273r22O09M69o25j867j486K51J079R9o87Q15J766J637n55j053L23l92j072
$$ plain form
877 -338 -1732 -2345 -1733 -920 -1002 -1090 249 2137 2791 1675 113 40 435 -211 -1798 -2488 -1291 136 665
896 665 93 1231 2656 2734 1486 119 -159 54 -322 -2095 -2509 -728 333 513 703 907 2150 2130
914 2130 819 -361 -735 40 -1550 -2011 -2323 -250 1071 693 372 1108 1872 1663 177 -1356 -1040 -957
932 -957 -1562 -2661 -1788 199 1427 1073 405 1102 2115 1414 -537 -1792 -1312 -1100 -1420 -1894 -1036 1008
950 1008 1677 1159 601 1158 1298 644 -1057 -1713 -1158 -457 -883 -1381 -464 1515 2043 1166 472 925 873 171
970 171 -976 -1633 -992 -669 -878 -707 381 1757 2240 794 482 778 855 -162 -1726 -1979 -806 -156
988 -156 -636 -371 915 2087 1904 748 1 219 -3 -1090 -2133 -1904 -301 183 85 68 1207 2038 1853
1007 1853 28 -811 -653 -465 -1550 -2313 -1481 165 780 174 -287 1080 1870 920 -393 -1078 -486 -921
$$ packed form
877c38j394o13O12Q13q2q8J339J888O54j116j562p3L95o46j587o90J197J427N29
896F65n72J138J425P8j248j367k78K13l76j773m14J781J061J80J90K04J243k0
914B130j311j180l74P75j590m61l12K073J321l78l21P36P64k09j486j533L16Q3
932i57o05j099Q73J987J228l54o68O97J013p01j951j255M80K12l20m74Q58K044
950A008O69n18n58N57J40o54j701o56N55P01m26m98R17J979N28q77o94M53n2p02
970A71j147o57O41L23k09J71J088J376M83j446l12K96P7j017j564k53J173O50
988a56m80K65J286J172j83j156p47K18k22j087j043K29J603M84r8j7J139Q31j85
1007A853j825q39J58J88j085p63Q32J646O15o06m61J367P90r50j313o85N92m35
$$ plain form
1025 -921 -1596 -1791 -555 733 709 555 434 1509 2000 884 -839 -963 -896 -734 -1315 -1518 -522 983 958
1044 958 437 738 1423 1784 146 -1333 -1487 -562 -384 -774 -950 82 1349 1572 1121 898 1328 918 -594
1063 -594 -1738 -2010 -759 -384 -859 -950 461 1569 1860 960 356 706 105 -680 -2129 -1352 -540 -242 -450
1082 -450 -253 942 1727 1278 269 501 245 -263 -1036 -1955 -1246 -313 -153 -559 276 1368 2039 1365 226
1101 226 317 2 74 -997 -1775 -781 45 60 258 352 1803 1986 667 -666 -932 -210 -497 -1497 -1781 -958
1121 -958 135 909 652 1091 1547 1755 493 -787 -761 -244 -848 -1304 -1132 -123 749 463 272 439 992
1140 992 996 -219 -1184 -870 -402 -401 -1470 -923 281 945 1160 306 837 1448 759 -564 -1121 -1039 -305 -932
1160 -932 -1358 -694 707 1423 991 263 266 862 419 -717 -1615 -968 -611 -609 -569 144 1377 1442 834 346 555
$$ packed form
1025i21o75j95J236J288k4j54j21J075M91j116j723j24O7J62n81k03R96J505k5
1044I58n21L01O85L61j638j479j54R25J78l90j76J032J267K23m51k23M30m10j512
1063e94j144k72J251L75m75r1J411J108K91r00o04L50o01p85j449P77Q12K98k08
1082d50J97J195P85m49j009K32k56n08p73r19P09R33J60m06Q35J092O71o74j139
1101B26R1l15P2j071p78R94Q26J5J98R4J451J83j319j333k66P22k87j000k84Q23
1121i58J093P74k57M39M56K08j262j280K6N17o04m56J72J009Q72k86j91J67N53
1140I92Mj215r65L14M68Jj069N47J204O64K15q54N31O11o89j323n57Q2P34o27
1160i32m26O64J401P16m32p28LN96m43j136q98O47L57KM0P13J233O5o08m88K09
$$ plain form
1181 555 772 -188 -1238 -1392 -998 -83 -236 -338 249 1336 1497 688 307 10 -3 -777 -1005 -1251 -174
1200 -174 129 89 -289 822 1494 1509 218 -43 157 -261 -659 -1606 -1295 -436 632 354 384 411 1358 990
1220 990 15 -31 -232 -301 -1222 -1370 -787 130 738 330 99 909 1403 711 -29 -1043 -500 -693 -884 -1038
1240 -1038 -509 468 652 542 389 1029 1073 182 -794 -1045 -63 -61 -768 -1003 2 854 1037 453 190 544
1260 544 803 -17 -918 -1178 -556 -144 -394 -738 42 997 825 371 210 753 497 -235 -1282 -862 -197 -99
1280 -99 -215 -668 326 1226 1236 399 30 -103 77 -866 -1466 -1212 -49 -98 -51 -2 739 1180 626 -3 -76 84
1302 84 52 -881 -1303 -701 296 201 -68 -266 366 932 487 -99 -299 32 -433 -780 -1331 -693 516 368 -24
1323 -24 -16 878 1197 292 -398 -680 -323 -37 -860 -1065 -554 540 507 365 312 651 906 165 -753 -722 -237 -434
$$ packed form
1181E55K17r60j050j54L94R15j53j02N87J087J61q09l81k97j3p74k28k46J077
1200a74L03m0l78J111O72J5j291k61K00m18l98r47L11Q59J068k78L0K7R47l68
1220I90r75m6k01o9r21j48N83R17O08m08k31Q10M94o92p40j014N43j93j91j54
1240a038N29R77J84j10j53O40M4q91r76k51R82Kp07k35J005Q52J83n84k63L54
1260E44K59q20r01k60O22M12k50l44P80R55j72m54j61N43k56p32j047M20O65R8
1280i9j16m53R94R00J0q37l69j33J80r43o00K54J163m9M7M9P41M41n54o29p3J60
1302H4l2r33m22O02R97r5k69j98O32N66m45n86k00L31m65l47n51O38J209j48l92
1323b4QQ94L19r05o90k82L57K86q23k05N11J094l3j42n3L39K55p41r18L1M85j97
$$ plain form
1345 -434 -860 -1064 -121 740 983 497 359 592 671 -117 -525 -862 -388 -517 -687 -202 324 786 580 306
1365 306 566 637 358 -411 -919 -423 -160 -220 -301 -73 624 926 608 72 199 323 263 -610 -1281 -531 191
1386 191 -376 -574 -217 706 858 604 -209 146 236 100 -653 -1014 -498 -252 -9 -103 146 868 1228 515 -156
1407 -156 14 -51 -438 -713 -496 -1 311 229 319 676 910 870 25 -453 -265 0 -313 -795 -600 74 523
1428 523 63 10 719 986 548 -207 -737 -327 127 -615 -572 -429 529 777 151 268 253 889 564 -371 -830
1449 -830 -165 -166 -284 -539 -484 315 565 298 535 597 489 -23 -587 -1003 -476 -262 -595 -495 -84 771 888
1470 888 472 205 226 291 -38 -915 -695 -368 -85 -267 -309 197 801 686 159 12 251 159 -35 -909 -746
1491 -746 -322 -14 -75 -275 -23 872 579 234 -42 40 -212 -180 -811 -711 133 223 206 -104 223 502 440 -63
$$ packed form
1345d34m26k04R43Q61K43m86j38K33P9p88m08l37M74j29j70M85N26M62k06k74
1365C06K60P1k79p69n08M96K63o0q1K28O97L02l18n36J27J24o0q73o71P50P22
1386A91n67j98L57R23J52k54q13L55R0j36p53l61N16K46K43r4K49P22L60p13o71
1407a56J70o5l87k75K17M95L12q2R0L57K34m0q45m78J88K65l13m82J95O74M49
1428E23m60n3P09K67m38p55n30M10M54p42M3J43R58K48o26J17j5O36l25r35m59
1449h30O65jj18k55N5P99K50k67K37O2j08n12n64m16N27K14l33J00M11Q55J17
1470H88m16k67K1O5l29q77K20L27K83j82m2N06O04j15n27j47K39r2j94q74J63
1491g46M24L08o1k00K52Q95k93l45k76Q2k52L2o31J00Q44R0j7l10L27K79o2n03
$$ plain form
1513 -63 -143 64 168 -435 -727 -531 245 542 -171 -135 578 738 536 -245 -103 -149 -230 -536 -394 -124 46 201
1535 201 456 225 614 286 400 -346 -477 -197 -249 -290 -366 50 868 425 -40 -64 578 546 -57 -737 -344 293
1557 293 -249 -844 -467 67 350 236 417 26 408 680 -310 -599 -365 -149 348 -286 43 181 736 209
1577 209 149 58 246 250 -285 -673 -777 -164 189 -95 49 618 871 530 -81 203 169 -290 -100 -453 -379 279
1599 279 -5 -165 229 537 645 482 -130 20 -82 -90 -833 -519 -327 30 288 -83 153 287 454 11 -244
1620 -244 135 -114 -64 -547 -818 -36 333 259 -38 190 494 594 -176 -816 -200 -36 -595 -497 -460 410 323 -102
1642 -102 -2 172 577 394 -451 -391 -507 128 79 -191 -23 290 506 183 262 567 693 35 -134 -483 -580
1663 -580 -11 -253 -435 68 669 732 199 156 -44 385 89 -166 -732 -264 202 -284 -492 85 187 458 276
$$ packed form
1513f3q0K07J04o03k92J96P76K97p13L6P13J60k02p81J42m6q1l06J42K70J70J55
1535B01K55k31L89l28J14p46j31K80n2m1p6M16Q18m43m65k4O42l2o03o80L93O37
1557B93n42n95L77N34K83j14J81l91L82K72r90k89K34K16M97o34L29J38N55n27
1577B09o0r1J88Mn35l88j04O13L53k84J44N69K53l41o11K84l4m59J90l53P4O58
1599B79k84j60L94L08J08j63o12J50j02qp43L14J92L57K58l71K36J34J67m43k55
1620b44L79k49N0m83k71P82L69p4k97K28L04J00p70o40O16J64n59R8L7Q70q7m25
1642a02J00J74M05j83q45O0j16O35m9k70J68L13K16l23P9L05J26o58j69l49r7
1663e80N69k42j82N03O01O3n33m3k00M29k96k55n66M68M66m86k08N77J02K71j82
$$ plain form
1684 276 -74 75 168 -46 -474 -453 -262 173 10 -98 61 361 358 124 -142 154 342 -276 -623 -515 -97
1705 -97 276 62 -351 428 593 276 -188 -64 -29 -92 -260 -535 -195 81 448 -8 75 244 487 406 -242 -200
1727 -200 54 -68 85 -436 -199 234 377 243 64 165 510 -25 -180 -461 -79 -118 -463 -291 74 146 -109
1748 -109 33 127 638 313 97 -383 -327 -151 0 -308 -454 36 326 292 171 44 133 148 -281 -519 -412 -246
1770 -246 246 -81 -255 303 244 355 63 27 326 104 -112 -581 -43 57 -168 -17 163 442 287 62 91
1791 91 -6 452 -85 -51 -414 -275 -70 208 -27 -128 268 564 62 -101 -43 58 -59 -250 -507 -292 81
1812 81 291 -287 -198 276 286 435 176 -48 -102 -202 -483 -304 -74 96 148 184 3 274 391 116 -340 -115
1834 -115 -199 -331 -257 -471 -12 153 154 -65 285 -114 310 -169 -175 56 108 -102 -197 -166 137 432 369 228 -240
$$ packed form
1684B76l50J49R3k14m28K1J91M35j63j08J59L00lk34k66K96J88o18l47J08M18
1705i7L73k14m13P79J65l17m64J24L5o3j68k75L40K76L67m56Q3J69K43q1o48M2
1727b00K54j22J53n21K37M33J43j34j79J01L45n35j55k81L82l9l45J72L65P2k55
1748a09J42R4N11l25k16m80N6J76J51l08j46M90K90l4j21j27Q9J5m29k38J07J66
1770b46M92l27j74N58n9J11k92l6K99k22k16m69N38J00k25J51J80K79j55k25K9
1791I1r7M58n37L4l63J39K05K78k35j01L96K96n02j63N8J01j17j91k57K15L73
1812H1K10n78Q9M74J0J49k59k24n4j00k81J79K30J70N2L6j81K71J17k75m56K25
1834a15q4j32P4k14M59J65Jk19L50l99M24m79oK31N2k10r5L1L03K95o3j41m68
$$ plain form
1857 -240 241 301 -132 -427 -234 -178 -80 -93 -263 165 263 230 -208 40 379 64 69 -227 -11 11 -72 28 -139
1880 -139 -4 162 162 -112 218 -89 5 -231 -461 -54 232 124 -181 174 286 326 290 39 63 -107 -26 -237
1902 -237 -381 -123 249 80 119 146 11 101 -80 -206 -102 21 -14 -227 -110 69 343 -39 -245 147 211 81
1924 81 -39 -216 -263 -67 -145 -506 -347 -95 460 -158 160 376 151 484 -152 -143 -157 28 -354 -252 64 452
1946 452 275 142 -127 153 -60 8 -86 -283 250 -60 56 107 -33 193 200 -5 90 -74 182 199 -452 -178
1968 -178 -25 -1 218 12 185 207 -125 134 11 321 238 -166 -178 -170 -16 -53 -94 -173 -44 50 34 -151 -46 57
1992 57 305 93 -282 -224 216 -12 -184 42 150 85 234 -101 -67 202 229 -246 -233 41 200 -114 -114 56 -58
2015 -58 201 75 -121 -206 40 160 15 -46 -150 -186 161 160 -215 260 77 -42 -483 -296 48 73 -132 -267
$$ packed form
1857b40M81O0m33k95J93N6R8j3j70M28R8l3m38K48L39l15Nk96K16K2q3J00j67
1880a39J35J66%k74L30l07R4k36k30M07K86j08l05L55J12M0l6k51K4j70Q1k11
1902b37j44K58L72j69L9K7j35R0j81j26J04J23l5k13J17J79K74l82k06L92O4j30
1924H1j20j77m7J96p8l61J59K52N55o18L18K16k25L33o36Rj4J85l82J02L16L88
1946D52j77j33k69K80k13O8r4j97N33l10J16N1j40K26Pk05R5j64K56J7o51K74
1968a78J53K4K19k06J73K2l32K59j23L10q3m04j2QJ54l7m1p9J29R4j6j85J05J03
1992E7K48k12l75N8M40k28j72K26J08o5J49l35L4K69K7m75J3K74J59l14%J70j14
2015e8K59j26j96q5K46J20j45o1j04l6L47jl75M75j83j19m41J87L44K5k05j35
$$ plain form
2037 -267 -63 365 200 -121 -43 -30 123 -207 -156 -183 -115 -37 -403 -345 229 188 312 -76 -58 342 197 -95 -170
2060 -170 -197 -208 181 106 -33 244 306 37 46 -211 -138 6 -22 -259 -266 -155 144 -204 -276 75 386 167 -289 -108
2084 -108 52 -235 -282 -171 14 351 49 45 -25 12 132 -33 -361 -104 128 -222 -296 -327 42 -61 346 -82
2106 -82 -27 101 62 -96 -150 72 -91 -277 -159 194 -76 108 296 81 -226 -227 -33 -249 -272 -31 93 153 -96
2129 -96 -5 337 -8 129 -38 -127 -60 -141 -83 175 -353 247 -157 9 199 130 115 318 -203 -35 58 -29 -337
2152 -337 -462 -47 -117 -68 40 -20 196 117 65 -9 -144 -388 -65 130 -370 -378 184 75 -159 -216 -142 47 69 165
2176 165 -231 187 295 -149 -283 21 83 167 86 293 310 211 135 52 -345 -14 -54 -375 190 233 109 -170 -35
2199 -35 146 157 53 234 -133 -134 -92 -66 -210 -318 372 296 73 -206 -56 15 103 -271 -184 66 -168 -281 105
$$ packed form
2037b67K04M28j65l21P8J3J53l30N1k7O8P8l66N8N74m1J24l88J8M00j45k92p5
2060a70k7j1L89p5j39K77O2k69Rk57P3J44k8k37pJ11K99l48p2L51L11k19m56J81
2084a08J60k87m7J11J85L37l02mp0L7J20j65l28K57K32l50p4l1L69j03M07m28
2106h2N5J28l9j58n4K22j63j86J18L53k70J84J88k15l07jJ94k16k3K41J24O0k49
2129i6R1L42l45J37j67q9O7q1N8K58n28O00m04J66J90o9j5K03n21J68R3q7l08
2152c37j25M15p0M9J08o0K16p9n2p4j35k44L23J95n00qN62j09k34n7P4J89K2R6
2176A65l96M18J08m44j34L04O2Q4q1K07J7r9p6q3l97L31m0l21N65M3j24k79J35
2199c5J81J1j04J81l67jM2K6j44j08O90p6k23k79J50P1Q8l74Q7K50k34j13L86
$$ plain form
2222 105 -188 121 221 41 65 -109 143 -85 -89 -114 158 -110 -217 -217 -105 153 363 181 86 169 -108 -105 -318
2245 -318 -97 211 -333 131 72 363 63 -34 293 -25 -131 -79 -309 61 -381 -10 218 216 238 88 203 7
2267 7 224 -165 -22 83 -245 -271 -55 0 319 423 221 -35 64 131 -53 -166 -86 -117 37 115 36 25 -111 -35
2291 -35 -199 -184 -162 5 24 -342 -69 94 -138 -165 -170 379 -32 114 253 -180 -19 -148 -406 -278 4 -5 145
2314 145 -210 58 121 171 -120 414 272 -136 -381 -47 52 -8 -34 94 -59 7 174 372 126 -257 -153 -66
2336 -66 9 71 -206 334 148 35 84 191 173 -227 157 -245 -205 0 -290 -124 -268 -95 150 86 166 214 197
2359 197 -265 -44 -249 -250 -85 -161 148 -34 -46 244 357 -24 164 224 -160 124 -143 -3 -153 136 119 -174
2381 -174 86 103 57 194 -192 9 166 -196 -196 63 -285 -224 50 175 357 45 -88 -175 -139 343 -179 -132 -542
$$ packed form
2222A05k93L09J00j80K4j74K52k28mk5K72k68j07%J12K58K10j82r5Q3k77Lk13
2245c18K21L08n44M64n9K91l00r7L27l18j06N2k30L70m42L71K28kK2j50J15j96
2267GK17l89J43J05l28k6K16N5L19J04k02k56R9O7j84j13Q0l1J54P8p9j1j36P6
2291c5j64J5K2J67J9l66K73J63k32k7nN49m11J46J39m33J61j29k58J28K82rJ50
2314A45l55K68O3N0k91N34j42m08k45L34R9o0k6J28j53O6J67J98k46l83J04Q7
2336f6P5O2k77N40j86j13M9J07j8m00L84m02M0K05k90J66j44J73K45o4Q0M8j7
2359A97m62K21k05jJ65p6L09j82j2K90J13l81J88O0l84K84k67J40j50K89j7k93
2381a74K60J7m6J37l86K01J57l62%K59l48O1K74J25J82l12j33q7L6M82n22M7m10
$$ plain form
2404 -542 -159 -140 53 -391 -30 191 19 -198 65 -380 -218 -178 -407 -397 -141 38 -155 41 187 205 180 94
2426 94 -25 -211 -41 -13 -78 27 153 12 303 194 275 85 114 -402 279 111 -34 -166 -167 -29 -241 133
2448 133 146 313 59 168 -27 -126 -411 -91 -121 -95 -324 8 -17 124 9 46 163 209 -278 -135 13 201
2470 201 40 -31 -186 49 136 349 -39 -118 28 120 104 -263 51 -95 199 -58 43 119 174 154 36 -7 104
2493 104 -135 56 127 -252 -18 -47 -9 189 130 264 -291 227 78 228 -42 -216 78 -69 -69 147 -19 -59
2515 -59 65 161 55 -219 -52 125 -82 -127 -218 -40 86 -140 -69 -146 -79 71 -333 -54 -86 -30 -155 -283 -126
2538 -126 -118 -49 -90 -121 158 139 205 26 -102 -166 70 -3 124 5 -12 123 180 335 57 -150 -79 271 -318 -167
2562 -167 -292 -366 -88 -55 33 283 300 151 28 382 -350 69 -56 -17 196 21 -229 90 259 -63 231 23
$$ packed form
2404e42L83J9J93m44L61K21j72k17K63m45J62M0k29J0K56J79j93J96J46J8k5q6
2426I4j19j86J70K8o5J05J26j41K91j09Q1j90K9n16O81j68j45j32jJ38k12L74
2448A33J3J67k54J09j95r9k85L20l0K6k29L32k5J41j15L7J17M6m87J43J48J88
2470B01j61p1j55K35Q7K13l88p9J46R2j6l67L14j46K94k57J01P6N5k0j18m3J11
2493A04k39J91P1l79K34k9L8J98n9J34n55N18j49J50k70j74K94j47%K16j66m0
2515e9J24R6j06k74J67J77k07m5r1J78J26k26P1p7O7J50m04K79l2N6j25j28J57
2538a26QO9m1l1K79j9O6j79j28o4K36p3J27j19j7J35N7J55k78k07P1L50n89J51
2562a67j25p4K78L3Q8K50J7j49j23L54p32M19j25L9K13j75k50L19J69l22K94k08
$$ plain form
2584 23 -90 28 -46 -149 -392 25 5 48 -108 -201 163 301 -140 209 -192 -130 53 -186 -44 -527 -44 280
2606 280 317 232 30 13 127 169 -29 -207 -220 -228 103 239 23 32 -71 98 -79 -207 -285 104 95 -185 -19 -57
2630 -57 66 -205 -28 -69 -74 188 269 -71 -161 99 -107 -251 -340 -318 57 -150 297 198 310 114 103 61 -256 -318
2654 -318 -221 -206 -26 -235 -17 -91 317 299 -74 -59 168 -100 -155 -382 -323 -235 -75 165 134 176 36 227 41
2677 41 390 306 -22 17 -37 11 119 -62 74 253 103 -117 208 4 -29 -146 -111 -482 -248 -90 -124 -256 83
2700 83 136 200 434 119 -191 83 -93 56 207 -266 -166 -112 175 98 226 204 150 -99 -547 -136 55 192
2722 192 -217 -359 260 19 88 270 289 304 276 -281 -251 -85 -293 -215 -69 263 29 235 52 -30 177 95 377
2745 377 -146 -153 36 -74 67 78 196 110 4 215 111 -198 12 -34 -26 -108 281 -82 33 -227 -222 188 63
$$ packed form
2584B3j13J18p4j03k43M17k0M3j56r3L64J38m41L49m01O2J83k39J42m83M83L24
2606B80L7q5k02j7J14M2j98j78j3qL31J36k16Rj03J69j77j28p8L89rk80J66l8
2630e7J23k71J77m1nK62Q1l40r0K60k06j44q9K2L75k07M47r9J12j96j1m2l17o2
2654c18R7J5J80k09K18p4M08j8l73J5K27k68n5k27N9Q8J60K40l1M2j40J91j86
2677D1L49q4l28L9n4M8J08j81J36J79j50k20L25k04l3j17L5l71K34J58l4j32L39
2700H3N3O4K34l15l10K74j76J49J51m73J00N4K87p7J28k2n4k49m48M11J91J37
2722A92m09j42O19k41O9J82J9J5k8n57L0J66k08P8J46L32k34K06j83q2K07q2K82
2745C77n23pJ89j10J41J1J18q6j06K11j04l09K10m6Qq2L89l63J15k60NM10j25
$$ plain form
2768 63 54 265 -236 166 39 -371 -421 -76 -109 -7 34 34 -34 179 221 -253 -2 13 -12 -405 22 -33 -291 247
2792 247 8 19 37 216 -319 -7 30 -84 -180 -338 -152 83 -22 64 -36 159 115 16 -184 101 27 23 -170
2815 -170 -363 -124 92 164 58 74 368 320 -224 -83 -177 123 -209 89 -120 206 257 399 350 100 87 -158
2837 -158 25 177 -299 -138 241 -74 -25 -52 182 291 218 138 41 110 -195 -88 -221 -54 -104 306 97 27 253
2860 253 174 -151 281 105 151 -174 -372 -249 -242 122 43 -10 159 371 -81 10 -255 85 -106 -36 -525 -87 51
2883 51 -232 27 -241 140 167 -115 -21 -44 -185 -68 -185 -256 -383 80 161 -270 135 130 142 1 -127 -173 -253 -66
2907 -66 -201 82 -318 -68 94 -40 -66 346 126 75 52 -145 50 -239 -409 -77 44 344 -1 -71 290 -201
2929 -201 -272 -133 -158 -400 21 -196 -374 -91 49 181 -70 37 65 290 -117 -196 -304 -84 -4 -277 -51 5
$$ packed form
2768F3rK11n01M02j27m10n0L45l3J02M1%o8K13M2m74K51J5k5l93M27n5k58N38
2792B47k39J1J8J79n35L12L7j14r6j58J86K35j05Q6j00J95m4r9k00K85p4mj93
2815a70j93K39K16P2j06J6K94m8n44J41r4L00l32K98k09L26N1J42m9k50j3k45
2837a58J83J52m76J61L79l15M9k7K34J09p3q0r7O9l05J07j33J67n0M10k09p0K26
2860B53p9l25M32j76M6l25j98J23PL64p9n3J69K12m52R1k65L40j91P0m89M38J38
2883E1k83K59k68L81K7k82R4k3j41J17j17p1j27M63Q1m31M05nJ2j41j28m6q0J87
2907f6j35K83m00K50J62j34k6M12k20n1k3j97J95k89j70L32J21L00l45p0L61m91
2929b01p1J39k5k42M21k17j78K83J40J32k51J07K8K25m07p9j08K20Q0k73K26N6
$$ plain form
2951 5 247 168 260 115 14 226 48 -170 -140 7 25 163 -33 196 -103 397 -53 197 238 -229 -105 155
2973 155 -2 -349 198 9 1 -169 75 151 38 -268 12 -6 -136 -344 -63 -115 -159 184 -45 -11 139 -121
2995 -121 196 163 -238 -40 -266 5 -309 -180 -95 48 -36 98 -192 244 136 -134 32 -45 216 -527 -227
3016 -227 -156 186 -40 -23 -27 170 -72 -90 -124 124 88 -160 -368 -78 89 371 354 274 410 146 206 70 -39
3039 -39 -151 53 -124 189 -79 190 30 269 276 81 212 -52 -69 -61 -33 -410 104 226 86 -7 281 91 303
3062 303 89 158 138 -265 -279 49 120 -91 -325 32 -45 251 176 -96 427 -49 -196 -414 -384 -39 -167 -176 153
3085 153 24 93 -69 134 -415 -13 251 -76 -35 -383 187 107 -82 -101 77 344 -65 172 -88 -42 165 -164
3107 -164 -179 -244 344 60 162 285 103 133 -101 -296 -213 24 -324 -474 23 -8 28 24 278 140 73 142 150 -294
$$ packed form
2951EK42p9R2j45j01K12j78k18L0J47J8J38j96K29k99N00m50K50M1m67J24K60
2973A55j57l47N47j89qj70K44P6j13l06K80j8j30k08K81n2m4L43k29L4J50k60
2995a21L17l3m01J98k26K71l14J29Q5J43q4J34k90M36j08k70J66p7K61p43L00
3016b27P1L42k26J7mJ97k42j8l4K48l6k48k08K90J67K82j7q0J36k64O0j36j09
3039c9j12K04j77L13k68K69j60K39Pj95J31k64j7QK8l77N14J22j40r3K88j90K12
3062C03k14O9k0m03j4L28P1k11k34L57p7K96p5k72N23m76j47k18L0L45j28rL29
3085A53j29O9j62K03n49M02K64l27M1l48N70q0j89j9J78K67m09K37k60M6K07l29
3107a64j5o5N88k84J02J23j82L0k34j95Q3K37l48j50M97l1L6mK54j38o7O9Qm44
$$ plain form
3131 -294 152 99 -324 -97 -196 141 62 329 -22 99 45 108 -97 -140 -162 61 -29 65 51 -234 218 -38 158
3154 158 -31 212 -241 141 -43 -178 -138 -317 -28 11 74 104 62 -21 264 200 222 20 -128 303 30 99 -46
3177 -46 133 194 284 178 -98 137 315 -49 -118 -188 -314 -122 190 -199 26 17 133 206 253 -61 -72 191 -127
3200 -127 -158 -121 156 29 154 1 210 193 -37 132 -149 169 -200 46 -225 25 -306 193 369 159 371
3221 371 154 129 123 -167 69 -22 -352 -457 296 -138 -34 282 58 106 -51 151 -38 66 64 -146 47 -93
3243 -93 94 187 171 -206 17 234 180 -263 -56 -47 -142 59 -248 40 -123 23 180 -2 -94 314 32 -34 -264
3266 -264 -283 145 111 -53 -18 257 250 13 -49 -74 173 -192 -321 -89 -19 259 -93 15 60 63 351 59 -50 115
3290 115 -220 -317 -128 -132 -8 23 7 -135 229 277 21 -148 182 -319 187 -176 40 -115 -204 159 -162 -230 67
$$ packed form
3131b94M46n3m23K27r9L37p9K67l51J21n4O3k05m3k2K23r0R4j4k85M52k56J96
3154A58j89K43m53L82j84j35M0j79K89L9O3L0m2q3K85o4K2k02j48M31k73O9j45
3177d6J79O1R0j06k76K35J78l64o9p0j26J92L12l89K25rJ16P3M7l14j1K63l18
3200a27l1L7K77j27J25j53K09j7k30J69k81L18l69K46k71K50l31M99J76k10K12
3221C71k17k5ok90K36r1l30j05P53m34J04L16k24M8j57K02j89J04kk10J93j40
3243i3J87R3j6l77K23K17n4m43K07Rr5K01l07K88j63J46J57j82r2M08k82o6k30
3266b64j9M28l4j64L5K75pk37o2k5K47l65j29K32P0K78l52J08M5LK88k92j09J65
3290A15l35r7J89mJ24L1j6j42L64M8k56j69L30n01N06l63K16j55q9L63l21o8K97
$$ plain form
3313 67 164 -124 280 21 -63 -39 34 6 -248 232 164 -38 97 319 219 60 -175 -124 -301 194 -261 -244 147
3336 147 -60 -113 -19 202 126 91 221 65 24 112 -32 -285 -152 301 90 2 0 -288 94 71 116 107 25 74 -29
3361 -29 51 129 -300 186 186 324 -64 226 -10 -103 -58 -250 -19 -222 -250 -159 278 337 -214 -77 42 89 -70 -449
3385 -449 -215 -179 -71 186 -31 -257 283 -83 -87 -35 -40 162 163 -109 -111 -158 200 110 -108 -46 257 287 140 -43 97
3410 97 -91 -3 -312 -412 95 220 -127 -38 235 315 -40 166 -167 46 30 -7 -5 2 -157 168 -103 52 77 32
3434 32 172 4 -195 -286 -38 -437 -198 0 200 25 -22 -326 170 146 260 -91 -33 93 -111 40 -213 115
3456 115 -205 47 -52 125 57 272 293 47 -423 151 201 82 -233 16 225 320 107 41 235 127 80 -328
3478 -328 -242 -29 -80 -133 139 166 78 229 317 126 -79 6 -113 -77 221 -59 -72 -195 -193 168 0 199 260 177
$$ packed form
3313F7R7k88M04k59q4K4P3k8k54M80o8k02J35K22j00j59k35N1j77M95m55J7L91
3336A47k07n3R4K21p6l5J30j56m1Q8j44k53J33M53k11q8kk88L82k3M5rq2M9j03
3361b9Q0P8m29M86%J38l88K90k36r3M5j92K31k03k8R1M37N9n51J37J19M7j59l79
3385d49K34L6J08K57k17k26N40l66mN2nK02Jk72km7L58r0k18O2L03L0j47j83J40
3410I7j88Q8l09j00N07J25l47Q9K73Q0l55K06l33K13j6l7KPj59L25k71J55K5m5
3434C2J40j68j99r1K48l99K39J98K00j75m7l04M96k4J14l51N8J26k04J51k53L28
3456A15l20K52r9J77o8K15K1k46m70N74N0j19l15K49K09R5k13o6J94j08m7m08
3478c28Q6K13n1n3K72K7q8J51Q8j91k05Q5j19L6K98k80j3j23KL61j68J99O1q3
$$ plain form
3502 177 -49 147 -43 -157 -226 -284 277 -35 -211 238 124 177 190 -27 147 8 2 -41 -52 194 32 105 -92
3525 -92 101 195 30 183 -90 8 140 -54 108 -493 -264 -189 -104 -123 -15 197 -1 192 -14 37 6 -72 -130
3548 -130 -163 -66 -61 121 -394 245 -111 -103 -75 115 -14 -106 -271 4 -150 7 85 108 30 221 310 131 -291 -272
3572 -272 -5 102 -294 25 -217 36 -236 6 64 -29 26 -49 -222 -163 53 -2 136 81 -61 77 145 -118 -37
3595 -37 55 119 -98 -125 -248 114 36 115 -127 31 113 -68 -42 246 159 80 282 53 -275 -7 -95 215 230 -21
$$ packed form
3502A77k26J96j90j14o9n8N61l12j76M49j14N3J3k17J74j39om3j1K46j62P3j97
3525i2J93R4j65J53k73R8J32j94J62o01K29P5Q5j9J08K12j98J93k06N1l1p8n8
3548a30l3R7NJ82n15O39l56QK8J90j29r2j65K75j54J57P8K3p8J91Q9j79m22J9
3572b72K67J07l96L19k42K53k72K42N8r3N5p5j73N9K16n5J38n5j42J38O8k63Q1
3595c7R2O4k17k7j23L62p8P9k42J58Q2j81K6K88q7p9K02k29l28K68q8L10J5k51
$$ [...]
8191C17
##END NTUPLES=NMR FID
##END=
