##TITLE=1H_PR T-108-C
 CDCl3, 32 sc, 
 18.12.2019
##JCAMPDX= 6.0         $$ Bruker NMR JCAMP-DX V2.0
##DATA TYPE= NMR FID
##DATA CLASS= NTUPLES
##ORIGIN= UXNMR, Bruker Analytische Messtechnik GmbH
##OWNER= root
$$ XWIN-NMR		Version 3.5
$$ Wed Dec 18 14:13:12 2019 Russian Standard Time (UT+4h)  she@DPX200
##.OBSERVE FREQUENCY= 200.1315
##.OBSERVE NUCLEUS= ^1H
##.DELAY= (6, 6)
##.ACQUISITION MODE= SIMULTANEOUS
##.ACQUISITION SCHEME= undefined
##.AVERAGES= 32
##.DIGITISER RES= 18
##SPECTROMETER/DATA SYSTEM= spect
##.PULSE SEQUENCE= zg30
##.SOLVENT NAME= D2O
##.SHIFT REFERENCE= (INTERNAL, D2O, 0, 15.7039)
##AUDIT TRAIL= $$ (NUMBER, WHEN, WHO, WHERE, WHAT)
$$ ##TITLE= Audit trail, XWIN-NMR		Version 3.5
$$ ##JCAMPDX= 5.01
$$ ##ORIGIN= Bruker BioSpin GmbH
$$ ##OWNER= she
$$ F:/spectra/data/she/nmr/H-F/1/audita.txt
$$ ##AUDIT TRAIL=  $$ (NUMBER, WHEN, WHO, WHERE, WHAT)
(   1,<2019-12-18 14:12:06.73 +0400>,<she>,<DPX200>,
      <continue with go, POWCHK disabled, PULCHK disabled
       configuration hash MD5:
       00 E9 B6 7A A2 85 ED C7 34 08 36 98 17 FE 4E 26
       data hash MD5: 16K
       4E BC 48 02 88 44 66 1E E1 0D D0 8A EA 25 EE DA>)
$$ ##END=
$$ 
$$ hash MD5
$$ CB 03 19 2F A0 6A 5C B8 C7 17 FA 75 22 85 67 03
##$RELAX= 
##$RELAX= 
##$RELAX= 
##$RELAX= 
##$RELAX= 
##$RELAX= 
$$ Bruker specific parameters
$$ --------------------------
##$DU= <F:/spectra>
##$EXPNO= 1
##$NAME= <H-F>
##$PROCNO= 1
##$TYPE= <nmr>
##$USER= <she>
##$AMP= (0..31)
100 100 100 100 100 100 100 100 100 100 100 100 100 100 100 100 100 100 
100 100 100 100 100 100 100 100 100 100 100 100 100 100 
##$AQSEQ= 0
##$AQ_mod= 1
##$AUNM= <au_zg>
##$AUTOPOS= <>
##$BF1= 200.13
##$BF2= 200.13
##$BF3= 200.13
##$BF4= 200.13
##$BF5= 200.13
##$BF6= 200.13
##$BF7= 200.13
##$BF8= 200.13
##$BYTORDA= 1
##$CFDGTYP= 0
##$CFRGTYP= 5
##$CHEMSTR= <none>
##$CNST= (0..31)
1 1 145 1 1 1 1 1 1 1 1 1 1 1 1 1 1 1 1 1 1 1 1 1 1 1 1 1 1 1 1 1 
##$CPDPRG= <>
##$CPDPRG1= <>
##$CPDPRG2= <>
##$CPDPRG3= <>
##$CPDPRG4= <mlev>
##$CPDPRG5= <mlev>
##$CPDPRG6= <mlev>
##$CPDPRG7= <mlev>
##$CPDPRG8= <mlev>
##$CPDPRGB= <>
##$CPDPRGT= <>
##$D= (0..31)
0 1.2 0 0 0 0 0 0 0 0.06 0 0.03 0 0 0 0 0.0002 0 0 0 0 0 0 0 0 0 0 0 0 
0 0 0 
##$DATE= 1576663828
##$DBL= (0..7)
120 120 120 120 120 120 120 120 
##$DBP= (0..7)
150 150 150 150 150 150 150 150 
##$DBP07= 0
##$DBPNAM0= <>
##$DBPNAM1= <>
##$DBPNAM2= <>
##$DBPNAM3= <>
##$DBPNAM4= <>
##$DBPNAM5= <>
##$DBPNAM6= <>
##$DBPNAM7= <>
##$DBPOAL= (0..7)
0.5 0.5 0.5 0.5 0.5 0.5 0.5 0.5 
##$DBPOFFS= (0..7)
0 0 0 0 0 0 0 0 
##$DE= 6
##$DECBNUC= <off>
##$DECIM= 24
##$DECNUC= <off>
##$DECSTAT= 4
##$DIGMOD= 1
##$DIGTYP= 9
##$DL= (0..7)
0 120 120 120 120 120 120 120 
##$DP= (0..7)
150 150 150 150 150 150 150 150 
##$DP07= 0
##$DPNAME0= <>
##$DPNAME1= <>
##$DPNAME2= <>
##$DPNAME3= <>
##$DPNAME4= <>
##$DPNAME5= <>
##$DPNAME6= <>
##$DPNAME7= <>
##$DPOAL= (0..7)
0.5 0.5 0.5 0.5 0.5 0.5 0.5 0.5 
##$DPOFFS= (0..7)
0 0 0 0 0 0 0 0 
##$DQDMODE= 0
##$DR= 18
##$DS= 0
##$DSLIST= <SSSSSSSSSSSSSSS>
$$ [...]
##$SUBNAM2= <"">
##$SUBNAM3= <"">
##$SUBNAM4= <"">
##$SUBNAM5= <"">
##$SUBNAM6= <"">
##$SUBNAM7= <"">
##$SUBNAM8= <"">
##$SUBNAM9= <"">
##$SW= 24.9337058887773
##$SWIBOX= (0..15)
0 0 2 0 0 0 0 0 0 0 0 0 0 0 0 0 
##$SW_h= 4990.01996007984
##$TD= 16384
##$TD0= 1
##$TE= 0
##$TE2= 300
##$TE3= 300
##$TEG= 300
##$TL= (0..7)
0 120 120 120 120 120 120 120 
##$TP= (0..7)
150 150 150 150 150 150 150 150 
##$TP07= 0
##$TPNAME0= <>
##$TPNAME1= <>
##$TPNAME2= <>
##$TPNAME3= <>
##$TPNAME4= <>
##$TPNAME5= <>
##$TPNAME6= <>
##$TPNAME7= <>
##$TPOAL= (0..7)
0.5 0.5 0.5 0.5 0.5 0.5 0.5 0.5 
##$TPOFFS= (0..7)
0 0 0 0 0 0 0 0 
##$TUNHIN= 0
##$TUNHOUT= 0
##$TUNXOUT= 0
##$USERA1= <user>
##$USERA2= <user>
##$USERA3= <user>
##$USERA4= <user>
##$USERA5= <user>
##$V9= 5
##$VALIST= <valist>
##$VCLIST= <CCCCCCCCCCCCCCC>
##$VD= 0
##$VDLIST= <DDDDDDDDDDDDDDD>
##$VPLIST= <PPPPPPPPPPPPPPP>
##$VTLIST= <TTTTTTTTTTTTTTT>
##$WBST= 1024
##$WBSW= 4
##$XGAIN= (0..3)
0 0 0 0 
##$XL= 0
##$YL= 0
##$YMAX_a= 202425
##$YMIN_a= -85914
##$ZGOPTNS= <>
##$ZL1= 120
##$ZL2= 120
##$ZL3= 120
##$ZL4= 120
##$ABSF1= 10
##$ABSF2= 0
##$ABSG= 5
##$ABSL= 3
##$ALPHA= 0
##$AQORDER= 0
##$ASSFAC= 0
##$ASSFACI= 0
##$ASSFACX= 0
##$ASSWID= 0
##$AUNMP= <proc_1d>
##$AZFE= 0.1
##$AZFW= 0.1
##$BCFW= 1
##$BC_mod= 2
##$BYTORDP= 1
##$COROFFS= 0
##$CY= 11.3945322036743
##$DATMOD= 1
##$DC= 2
##$DFILT= <>
##$DTYPP= 0
##$F1P= 16.9975609425685
##$F2P= -3.02152046262296
##$FCOR= 0.5
##$FTSIZE= 0
##$FT_mod= 4
##$GAMMA= 1
##$GB= 0.15
##$INTBC= 1
##$INTSCL= 1
##$ISEN= 128
##$LB= 0.24
##$LEV0= 0
##$LPBIN= 0
##$MAXI= 10000
##$MC2= 0
##$MEAN= 0
##$ME_mod= 0
##$MI= 1.114404
##$NCOEF= 0
##$NC_proc= 0
##$NLEV= 6
##$NOISF1= 3.799351
##$NOISF2= 2.8
##$NSP= 1
##$NTH_PI= 0
##$NZP= 0
##$OFFSET= 15.70392
##$PC= 1
##$PHC0= -9791.718
##$PHC1= 23.60081
##$PH_mod= 1
##$PKNL= yes
##$PPARMOD= 0
##$PSCAL= 0
##$PSIGN= 0
##$REVERSE= no
##$SF= 200.130013532006
##$SI= 16384
##$SIGF1= 3
##$SIGF2= 2
##$SINO= 400
##$SIOLD= 16384
##$SREGLST= <1H.CDCl3>
##$SSB= 0
##$STSI= 0
##$STSR= 0
##$SW_p= 3612.71676300578
##$SYMM= 0
##$S_DEV= 0
##$TDeff= 0
##$TDoff= 0
##$TI= <>
##$TILT= no
##$TM1= 0
##$TM2= 0
##$TOPLEV= 0
##$USERP1= <user>
##$USERP2= <user>
##$USERP3= <user>
##$USERP4= <user>
##$USERP5= <user>
##$WDW= 1
##$XDIM= 8192
##$YMAX_p= 0
##$YMIN_p= 0
$$ End of Bruker specific parameters
$$ ---------------------------------
##NTUPLES= NMR FID
##VAR_NAME=  TIME,          FID/REAL,        FID/IMAG
##SYMBOL=    X,             R,               I
##VAR_TYPE=  INDEPENDENT,   DEPENDENT,       DEPENDENT
##VAR_FORM=  AFFN,          ASDF,            ASDF
##VAR_DIM=   8192,          8192,            8192
##UNITS=     SECONDS,       ARBITRARY UNITS, ARBITRARY UNITS
##FACTOR=    0.0002004,     1,               1
##FIRST=     0,             0,               0
##LAST=      1.6414764,     0,               0
##MIN=       0,             -85914,          0
##MAX=       1.6414764,     202425,          0
$$ Real data points
##PAGE= N=1
##DATA TABLE= (X++(R..R)), XYDATA
$$ [...]
$$ plain form
2382 -438 -1525 -1610 -503 -1067 -944 -904 -371 -811 -639 -892 69 -1022 -211 -990 -569 -121 -268 -164 -250 -585
2402 -585 -491 35 232 522 101 434 627 448 365 736 642 172 315 344 602 572 523 1042 1508 494 1193 982
2424 982 1303 1220 378 1556 1915 1180 925 1310 1260 1299 1344 759 1347 1384 775 1227 1561 740 498 1497 1088
2445 1088 1560 466 1197 1189 521 1093 1060 1294 463 793 249 450 887 421 724 642 800 165 37 370 483
2466 483 -493 60 450 389 -250 242 -142 -210 98 -399 -372 319 -928 -598 -299 -493 -728 -1033 -543 -628 -502
2487 -502 -1237 -801 -164 -1007 -430 -370 -1119 -1371 -1013 -1522 -874 -1333 -1214 -934 -1375 -1741 -1242 -1397 -1023 -1230
2507 -1230 -1238 -807 -848 -760 -1359 -529 -1414 -36 -1269 -976 -612 -763 -765 -531 -206 -1064 -1058 89 -778 -743 -620 -67
2529 -67 -273 -418 -160 -523 177 186 77 25 -120 2 -151 676 795 355 181 715 1343 627 323 967 1136
$$ packed form
2382d38j087q5J107n64J23M0N33m40J72k53R61j091Q11p79M21M48j47J04q6l35
2402e85R4N26J97K90m21L33J93j79q3L71r4m70J43K9K58l0m9N19M66j014O99k11
2424I82L21q3q42J178L59p35k55L85n0L9M5n85N88L7o09M52L34q21k42R99m09
2445A088M72j094P31qo68N72l3K34q31L30n44K01M37m66L03q2J58o35j28L33J13
2466D83r76N53L90o1o39M92l84o8L08m97K7O91j247L30K99j94k35l05M90q5J26
2487e02p35M36O37q43N77O0p49k52L58n09O48m59J19K80m41l66M99j55L74k07
2507a230qM31m1Q8n99Q30q85J378j233K93L64j51kK34L25q58OJ147q67L5J23N53
2529f7k06j45K58l63P00Rj09n2j45J22j53Q27J19m40j74N34O28p16l04O44J69
$$ plain form
2550 1136 -88 304 1699 1173 1071 557 1159 800 752 1297 962 1100 1171 957 1009 1168 1249 485 1605 1067
2570 1067 646 480 1267 792 784 1091 708 381 1380 870 309 559 592 215 620 1033 300 -129 480 918 391
2591 391 -189 168 368 538 43 -55 92 0 -295 -322 -474 367 -1216 -401 102 -220 -577 -175 -97 -676 -951
2612 -951 -396 -327 -1257 -861 -971 -562 -768 -1349 -1330 -368 -1348 -854 -1529 -515 -1121 -944 -1305 -1263 -1327 -1108 -1215
2633 -1215 -904 -1024 -329 -1026 -1311 -943 -1382 -943 -933 -369 -449 -1076 -819 -159 -673 -405 -110 -262 -764 -758 -792
2654 -792 -283 -977 -398 -114 -249 -300 -628 233 213 -78 -80 57 102 79 165 628 211 286 707 746 519 537 345
2677 345 1020 872 452 295 717 1044 1129 667 1242 1318 265 804 1494 1498 -103 748 857 336 1009 1087 1258
2698 1258 296 381 1190 560 640 690 307 871 1285 1204 477 1423 1074 439 635 637 554 442 806 163 1047 967
$$ packed form
2550A136j224L92J395n26j02n14O02l59m8N45l35J38P1k14N2J59Q1p64J120n38
2570A067m21j66P87m75qL07l83l27R99n10n61K50L3l77M05M13p33m29O09M38n27
2591C91n80L57K00J70m95r8J47r2k95k7j52Q41j583Q15N03l22l57M02P8n79k75
2612i51N55O9r30L96j10M09k06n81J9R62r80M94o75J014o06J77l61M2o4K19j07
2633a215L11j20O95o97k85L68m39M39J0N64q0o27K57O60n14K68K95j52n02Ol4
2654g92N09o94N79K84j35n1l28Q61k0k91kJ37M5k3Q6M63m17P5M21L9k27J8j92
2677C45O75j48m20j57M22L27Q5m62N75P6j053N39O90Mj601Q51J09n21O73P8J71
2698A258r62Q5Q09o30Q0N0l83N64M14q1p27R46l49o35J96Kq3j12L64o43Q84q0
$$ plain form
2720 967 358 179 554 -166 -558 602 496 -778 -216 74 346 -324 -543 -164 -570 -289 -415 -373 -793 -674
2740 -674 -509 -671 -838 -179 -845 -598 -1270 -889 -1163 -445 -899 -1000 -1050 -524 -481 -673 -1197 -433 -1403 -981 -916
2761 -916 -767 -311 -695 -971 -1116 -1457 -1193 -744 -177 -749 -1160 -1120 -387 -1001 -372 -531 -816 -363 -917 -1096
2781 -1096 -957 -100 -349 -182 -295 -100 664 78 -205 52 -440 20 95 -140 69 647 748 266 16 306
2801 306 537 467 409 1086 566 1176 278 373 917 1169 37 378 1134 890 670 448 643 1124 959 1396 901
2822 901 968 839 538 914 1543 625 1094 957 923 1028 622 911 941 563 462 603 813 803 456 446 199 288
2844 288 676 273 611 19 -143 351 516 -212 184 245 -18 271 186 423 -56 16 -449 -241 436 -189 -346
2865 -346 -100 -332 -460 -1049 -94 -765 -1121 -209 -538 -397 -535 -1084 -750 -483 -375 -731 -1041 -298 -793 -582
$$ packed form
2720I67o09j79L75p20l92J160j06j274N62K90K72o70k19L79m06K81j26M2m20J19
2740f74J65j62j67O59o66K47o72L81k74P18m54j01n0N26M3j92n24P64r70M22O5
2761i16J49M56l84k76j45l41K64M49N67n72m11M0P33o14O29j59k85M53n54j79
2781a096J39Q57k49J67j13J95P64n86k83K57m92M60P5k35K09N78J01m82k50K90
2801C06K31p0n8O77n20O10q98R5N44K52j132L41P56k44k20k22J95M81j65M37m95
2822I01O7j29l01L76O29r18M69j37l4J05m06K89L0l78j01J41K10j0l47j0k47Q9
2844B88L88m03L38n92j62M94J65p28L96O1k63K89q5K37m79P2m65K08O77o25j57
2865c46K46k32j28n89R55o71l56R12l29J41j38n49L34K67J08l56l10P43m95K11
$$ plain form
2885 -582 -671 -562 -868 -832 -841 -682 -507 -1087 -358 -934 -922 -1214 -650 -755 -780 -1011 -954 -877 -477 -690 -839 -437 -152
2908 -152 -520 -374 -421 -359 -491 -409 174 -683 -582 -534 -374 67 375 66 268 97 -481 170 180 696 428 403
2930 403 411 36 71 420 173 528 408 214 586 688 579 380 750 966 741 993 1477 1313 1032 658 969
2951 969 1332 971 798 905 1006 1400 289 467 659 559 495 817 918 364 209 678 721 21 273 608
2971 608 438 5 442 -169 907 735 514 514 -25 470 -182 325 361 -317 212 -234 -3 -342 -413 -705 -297
2992 -297 -352 -805 -360 -365 -152 -949 9 -485 -313 -439 6 -230 -727 -762 -288 -937 -739 -820 -327 -523 -554 -1118
3014 -1118 -1008 -745 -916 -1019 -1195 -790 -976 -313 -738 -69 -914 -1011 -977 -862 -831 -315 -693 -976 -16 -942 -867
3035 -867 -468 -1134 -700 -179 -578 187 -875 28 684 235 244 102 124 147 -199 -129 12 376 136 442 352 354
$$ packed form
2885e82q9J09l06L6rJ59J75n80P29n76J2k92N64j05k5k31N7P7M00k13j49M02K85
2908a52l68J46m7O2j32Q2N83q57J01M8J60M41L08l09K02j71n78O51J0N16k68k5
2930D03Ql75L5L49k47L55j20j94L72J02j09j99L70K16k25K52M84j64k81l74L11
2951I69L63l61j73J07J01L94j111J78J92j00o4L22J01n54j55M69M3p00K52L35
2971F08j70m33M37o11J076j72k21%n39M95o52N07L6o78N29m46K31l39p1k92M08
2992b97n5m53M45nK13p97R58m94J72j26M45k36m97l5M74o49J98q1M93j96l1n64
3014a118J10K63j71j03j76M05j86O63m25O69q45r7L4J15L1N16l78k83R60r26P5
3035h67L99o66M34N21l99P65j062R03O56m49Rj42K2K3l46P0J41L64k40L06r0K
$$ plain form
3057 354 125 228 246 468 188 397 1070 309 -28 697 684 223 661 664 770 253 244 995 616 921 1155 620
3079 620 569 399 203 1046 888 343 143 235 767 1071 41 693 905 474 1254 336 570 675 859 393
3099 393 881 87 737 654 21 491 192 603 -333 403 177 -556 179 13 -319 -79 -314 -516 35 -56 -524
3120 -524 165 55 -768 -331 -652 -266 -510 -69 -493 -500 -237 -701 -517 -345 -746 -62 -446 -553 -593 -510 -467 -1040
3142 -1040 -1359 -835 -1023 -339 -1094 -136 -732 -614 -771 -617 -775 -636 -713 -185 -708 -743 -571 -766 436 -387
3162 -387 -629 -486 -298 -536 -209 -29 -92 -272 215 273 -885 -460 -663 226 -39 -125 420 37 352 81 65
3183 65 -216 -344 -501 429 444 268 266 539 738 328 724 576 577 1013 654 445 677 610 231 388 823 717
3205 717 197 544 517 274 219 110 572 395 500 852 619 530 646 597 947 373 645 313 500 1255 661
$$ packed form
3057C54k29J03J8K22k80K09O73p61l37P25j3m61M38LJ06n17rP51l79L05K34n35
3079F20n1j70j96Q43j58n45k00R2N32L04j030O52K12m31P80r18K34J05J84m66
3099C93M88p94O50q3o33M70k99M11r36P36k26p33P35j66l32K40k35k02N51r1m68
3120e24O89j10q23M37l21L86k44M41m24pK63m64J84J72m01O84l84j07m0Q3M3n73
3142a040l19N24j88O84p55R58n96J18j57J54j58J39p7N28n23l5J72j95J202q23
3162c87k42J43J88k38L27J80o3j80M87N8j158M25k03Q89k65q6N45l83L15k71j6
3183F5k81j28j57R30J5j76kK73J99m10L96j48JM36l59k09K32o7l79J57M35j06
3205G17n20L47k7k43n5j09M62j77J05L52k33q9J16m9L50n74K72l32J87P55n94
$$ plain form
3226 661 2 620 532 449 251 394 77 709 299 233 -172 70 438 928 119 -399 -208 28 736 351 58
3247 58 30 176 -687 299 -368 -470 -348 -825 -286 -302 -67 -732 -175 -411 -691 -798 -97 -646 -768 -663 -501
3268 -501 -684 -320 -528 -1275 -1100 -169 -563 -922 -576 -302 -308 -596 89 -454 -416 -842 -791 -956 -159 -1052 375
3289 375 -894 -671 -257 -971 -347 -482 -185 -416 139 -794 -1247 -366 -353 -321 255 482 -186 -338 262 -315
3309 -315 177 957 160 -109 545 -69 -144 526 110 24 440 113 612 532 184 956 111 383 1010 -428 1026
3330 1026 681 944 659 239 529 781 405 1227 991 558 902 564 899 794 838 336 -132 832 -36 796
3350 796 499 487 581 637 1097 727 467 415 999 303 250 554 61 605 478 160 411 570 253 -209 386 708
3372 708 -363 -21 164 -65 488 -69 -281 -978 -306 -217 -499 64 -220 -262 -199 104 -70 -418 -507 -65 -449
$$ packed form
3226F61o59O18q8q3j98J43l17O32m10o6m05K42L68M90q09n18J91K36P08l85k93
3247E8k8J46q63R86o67j02J22m77N39j6K35o65N57k36k80j07P01n49j22J05J62
3268e01j83L64k08p47J75R31l94l59L46K74ok88O85n43L8m26N1j65P97q93J427
3289C75j269K23M14p14O24j35K97k31N55r33m53Q81J3L2N76K27o68j52O00n77
3309c15M92P80p97k69O54o14p5O70m16q6M16l27M99q0l48P72q45K72O27j438J454
3330A026l45K63k85m20K90K52l76Q22k36m33L44l38L35j05M4n02m68R64q68Q32
3350G96k97j2R4N6M60l70k60n2N84o96n3L04m93N44j27l18K51J59l17m62N95L22
3372G08j071L42J85k29N53n57k12o97O72Q9k82N63k84m2O3L03j74l48q9M42l84
$$ plain form
3393 -449 -539 -863 -637 -722 -638 -707 -800 -569 -1037 -738 -1181 -784 -486 -742 -754 -757 -693 -374 -1279 -349 20 -268 -559
3416 -559 -763 -342 -542 -256 -383 -165 -648 -668 -346 -253 -276 -431 -431 128 0 36 57 -201 13 236 -454 606
3438 606 152 -60 -26 -80 225 38 154 757 -89 -152 385 -4 139 140 560 157 543 514 581 220 389 1048
3460 1048 32 278 151 315 267 784 816 681 493 532 572 529 263 814 917 744 1035 479 -232 301 719
3481 719 1088 440 65 371 630 413 647 494 107 181 649 -90 405 -71 43 -74 183 407 -174 119
3501 119 -2 -191 66 -52 -717 -490 215 -406 569 -204 -66 88 -105 -79 -29 41 -390 -81 -505 -327 -724
3522 -724 -146 -373 -251 -791 -295 -649 -630 198 -223 -741 -449 -759 -713 -596 -430 -482 -265 -470 -280 -315 -616
3543 -616 -84 -184 -210 -603 -661 -276 -423 -582 -271 -49 -776 -363 -299 -308 -842 -884 -238 -65 470 25 -581 -88
$$ packed form
3393d49r0l24K26q5Q4o9r3K31m68K99m43L97K98k56j2lO4L19r05R30L69k88k91
3416e59k04M21k00K86j27K18m83k0L22R3k3j55%N59j28L6K1k58K14K23o90J060
3438F06m54k12L4n4L05j87J16O03q46o3N37l89J43JM20m03L86k9O7l61J69O59
3460A048j016K46j27J64m8N17L2j35j88L9M0m3k66N51J03j73K91n56p11N33M18
3481G19L69o48l75L06K59k17K34j53l87P4M68p39M95m76J14j17K57K24n81K93
3501A19j21j89K57j18o65K27P05o21R75p73J38J54j93K6N0P0m31L09m24J78l97
3522g24N78k27J22n40M96l54J9Q28m21n18K92l10M6J17J66n2K17k05J90l5l01
3543f16N32j00k6l93n8L85j47j59L11K22p27M13O4rn34m2O46J73N35m45o06M93
$$ plain form
3565 -88 -14 280 605 -119 -144 726 -110 386 0 600 0 8 295 405 435 209 432 594 296 788 342 241
3587 241 797 399 989 94 599 372 1038 324 582 398 301 998 -46 -385 946 607 513 260 440 552
3607 552 278 189 120 245 430 475 575 143 780 -369 19 392 -14 124 660 549 -166 612 -214 -108 270
3628 270 865 331 -281 -46 279 -100 -385 77 -295 279 439 -403 376 107 46 -624 -499 -495 -252 162 -68
3649 -68 -325 -554 -752 -796 -548 395 -466 -716 -355 -526 -415 -321 -400 -267 -523 -125 -329 -463 -265 -306 -714 -399
3671 -399 -288 233 -236 -604 -246 -157 46 -776 -821 -648 -336 383 10 -474 -256 -383 -106 34 421 -28 -89
3692 -89 34 -352 -541 -753 445 246 434 -65 593 628 104 88 189 -171 587 721 398 602 38 600 264
3713 264 189 174 470 360 478 136 282 693 1199 556 319 261 692 526 -68 389 1375 543 285 355 254
$$ packed form
3565h8P4K94L25p24k5Q70q36M96l86O00o00QK87J10L0k26K23J62k98M92m46j01
3587B41N56l98N90q95N05k27O66p14K58j84r7O97j044l39J331l39r4k53J80J12
3607E52k74q9o9J25J85M5J00m32O37j149L88L73m06J38N36j11p15P78q26J06L78
3628B70N95n34o12K35L25l79k85M62l72N74J60q42P79k69o1o70J25MK43M14k30
3649f8k57k29j98m4K48R43q61k50L61j71J11R4p9J33k56L98k04j34J98m1m08L15
3671c99J11N21m69l68L58Q9K03q22m5J73L12P19l73m84K18j27K77J40L87m49o1
3692h9J23l86j89k12J198j99J88m99O58L5n24j6J01l60P58J34l23K04n64N62l36
3713B64p5j5K96j10J18l42J46M11N06o43k37n8M31j66n94M57R86q32k58P0j01
$$ plain form
3734 254 207 837 74 370 66 -188 822 907 497 512 161 334 199 330 -24 92 -280 -25 343 -397 221
3755 221 291 305 401 318 -89 -112 -265 -315 -147 -488 -684 -234 52 -675 -210 119 -350 335 -370 -814 -2 -348
3777 -348 -457 -294 -280 -219 -250 158 -304 -650 6 -700 -756 -868 -955 -692 -961 -756 -524 -763 -294 -662 -849 583
3799 583 -367 -630 -487 -604 -171 -49 -966 -506 -57 -209 -502 -293 346 -289 -245 -403 34 -626 -542 -267 305
3820 305 267 64 451 -502 -71 -123 398 80 62 -6 224 520 403 304 295 246 351 515 -489 675 522 722
3842 722 250 746 140 443 451 163 199 34 161 536 217 541 602 425 885 267 493 236 439 9 24 3
3864 3 215 588 -285 436 311 305 -362 -146 510 404 555 315 -258 98 415 -273 638 -48 425 -355 153
3885 153 306 -191 -493 46 -424 29 231 -262 261 -462 -376 -331 -304 151 -298 -13 -646 63 -377 -853 -471
$$ packed form
3734B54m7O30p63K96l04k54J010Q5m10J5l51J73j35J31l54J16l72K55L68p40O18
3755B21P0J4R6q3m07k3j53n0J68l41j96M50K86p27M65L29m69O85p05m44Q12l46
3777c48j09J63J4O1l1M08m62l46O56p06n6j12q7K63k69K05K32k39M69l68j87J432
3799E83r50k63J43j17M33J22r17M60M49j52k93K09O39o35M4j58M37o60Q4K75N72
3820C05l8k03L87r53M31n2N21l18j8o8K30K96j17r9rm9J05J64j004J164j53K00
3842G22m72M96o06L03Qk88L6j65J27L75l19L24O1j77M60o18K26k57K03m30J5k1
3864CK12L73q73P21j25oo67K16O56j06J51k40n73L56L17o88R11o86M73p80N08
3885A53J53m97l02N39m70M53K02m93N23p23Q6M5K7M55m49K85o33P09m40m76L82
$$ plain form
3906 -471 -102 -373 24 -290 -984 109 -471 -1036 -552 -494 256 -339 -250 -252 -568 -125 151 -504 -251 -880 -614
3927 -614 -83 -46 -203 -274 -425 -396 -199 -323 -123 -574 14 -304 209 -155 -487 200 192 -86 -409 -22 345 138
3949 138 -64 -104 2 198 -284 -194 -125 641 -21 232 450 -142 527 572 165 -67 125 124 0 -181 458 492
3971 492 74 883 323 361 -56 544 451 -367 -99 118 372 572 322 387 426 161 210 470 492 -113 87 735
3993 735 492 22 633 400 484 415 314 588 -19 243 307 -356 86 307 306 25 519 60 -262 115 189 143
4015 143 152 212 -163 -179 -479 -397 -564 591 -475 -187 -41 -174 284 -622 92 -397 -288 -942 -321 -619 -309
4036 -309 10 -101 -606 -592 -589 -207 -522 -362 -549 -36 -340 -781 -391 -420 -202 -230 6 125 -661 -138 71 -518
4058 -518 -1079 -73 -528 -544 -281 -474 -382 -338 -119 -474 -275 -433 -494 -278 -317 -156 -246 170 -568 231 -198 178
$$ packed form
3906d71L69k71L97l14o94J093n80n65M84N8P50n95Q9kl16M43K76o55K53o29K66
3927f14N31L7j57p1j51K9J97j24K00m51N88l18N13l64l32O87qk78l23L87L67k07
3949A38k02m0J06J96m82R0O9P66o62K53K18n92O69M5m07k32J92jj24j81O39L4
3971D92m18Q09n60L8m17O00r3q18K68K17K54K00k50O5L9k65M9K60K2o05K00O48
3993G35k43m70O11k33Q4o9j01K74o07K62O4o63M42K21jk81M94m59l22L77P4m6
4015A43RO0l75j6l00Q2j67J155j066K88J46j33M58r06P14m89J09o54O21k98L10
4036c09L19j11n05J4LL82l15J60j87N13l04m41L90k9K18k8K36J19p86N23K09n89
4058e18n61J006m55j6K63j93R2M4K19l55J99j58o1K16l9J61r0M16p38P99m29L76
$$ plain form
4080 178 -76 151 -207 142 482 403 290 -262 -232 334 -274 492 -78 -267 796 47 -367 49 -155 148
4100 148 -53 76 518 -315 277 104 297 358 484 709 721 -109 280 689 177 367 94 -328 475 442 770
4121 770 149 -35 58 300 632 201 463 -4 1164 -191 243 291 311 266 27 314 157 307 450 -91 -337
4142 -337 57 105 443 90 -36 679 791 448 -411 -14 386 -315 349 143 -111 -167 244 -146 -600 -396 -61
4163 -61 45 -729 -772 -83 -121 -666 -465 -405 143 -147 -111 -346 -515 -124 -911 -217 -468 -407 -421 -214 -359 -757
4185 -757 -435 -468 -429 17 -137 -864 -1011 84 85 -206 266 -679 227 64 -388 203 -562 135 -48 -701 -81
4206 -81 -243 204 -26 -369 672 -416 107 -425 -460 -152 46 437 -518 77 551 -201 -85 389 379 -50
4226 -50 348 122 -335 465 134 8 228 624 -126 208 -319 99 392 531 676 -11 -52 1004 319 570
$$ packed form
4080A78k54K27l58L49L40p9j13n52L0N66o08P66n70j89J063p49m14M16k04L03
4100A48k01J29M42q33N92j73J93O1J26K25J2q30L89M09n12J90k73m22Q03l3L28
4121G70o21j84R3K42L32m31K62m67J168j355M34M8K0m5k39K87j57J50J43n41k46
4142c37L94M8L38l53j26P15J12l43q59L97M00p01O64k06k54n6M11l90m54K04L35
4163f1J06p74m3O89l8n45K01O0N48k90L6k35j69L91p87O94k51O1j4K07j45l98
4185g57L22l3L9M46j54p27j47J095Jk91M72r45R06j63m52N91p65O97j83o53O20
4206h1j62M47k30l43J041j088N23n32l5L08J98L91r55N95M74p52J16M74j0m29
4226e0L98k26m57Q00l31j26K20L96p50L34n27M18K93J39J45o87m1J056o85K51
$$ plain form
4246 570 442 301 80 694 151 -596 -101 -66 307 1080 413 684 -124 216 20 -385 -230 187 -84 47
4266 47 74 252 798 -312 -265 114 183 -123 480 138 143 183 -201 448 -303 348 -29 -456 -486 -351 -273 3 -822
4289 -822 -222 -511 304 256 -853 -170 -662 -261 -701 -75 -146 -434 -351 -461 -224 -340 -853 -409 -591 -380 -302
4310 -302 -432 -182 -38 -26 -296 -430 -450 -212 -555 -682 -897 27 -216 -60 -139 -183 31 -165 29 -526 -352
4331 -352 -365 273 -2 -343 -283 -105 106 -418 -280 242 -134 -37 -193 -246 -204 597 -57 -177 283 158 168 -324
4353 -324 266 83 45 523 122 -146 489 357 574 673 174 481 353 276 521 504 202 226 132 587 669 -403
4375 -403 282 -27 85 291 1000 320 417 -429 308 -76 -32 5 408 128 286 794 778 135 -197 -169 127 -237
4397 -237 33 263 -274 334 575 209 -51 369 41 -251 745 106 167 15 114 -230 -635 -208 139 -111 77
$$ packed form
4246E70j28j41k21O14n43p47M95L5L73P73o67K71q08L40j96m05J55M17k71J31
4266D7K7J78N46j110M7L79O9l06O03l42NM0l84O49p51O51l77m27l0J35P8K76q25
4289h22O00k89Q15m8j109O83m92M01m40O26p1k88Q3j10K37j16n13M44j82K11P8
4310c02j30K50J44J2k70j34k0K38l43j27k15R24k43J56p9m4K14j96J94n55J74
4331c52j3O38k75l41O0J78K11n24J38N22l76R7j56n3M2Q01o54j20M60j25J0m92
4353c24N90j83l8M78m01k68O35j32K17R9m99L07j28p7K45j7l02K4r4M55Q2j072
4375d03O85l09J12K06P09o80R7q46P37l84M4L7M03k80J58N08j6o43l32K8K96l64
4397b37K70K30n37O08K41l66k60M20l28k92R96o39O1j52R9l44m05M27L47k50J88
$$ plain form
4418 77 34 145 373 377 -43 -577 316 -291 -385 -217 -217 -394 -43 -22 -512 -284 -111 -439 -513 -258 -663 -714 232
4441 232 -780 -280 -57 -143 132 -187 25 -379 -475 -272 -29 -1000 -347 -534 -509 195 152 -454 -446 -297 -576 -420
4463 -420 -597 -702 -497 -292 -739 36 -229 136 -538 388 67 -235 259 -167 -177 174 43 302 -55 -114 666
4484 666 707 14 524 317 -51 -245 -167 -76 597 71 -6 195 283 503 1 462 265 -178 438 617 162 576
4506 576 636 479 609 -111 -307 596 -43 15 -100 687 226 330 441 61 235 -409 16 -518 645 444
4526 444 -287 -184 -197 859 -27 73 -222 41 707 -18 -723 -370 -692 72 35 -342 -21 419 281 -110
4546 -110 -388 -250 -330 -283 -319 -36 -86 -548 -410 -138 -644 -86 -660 -499 -19 -620 323 -174 -293 -45 -25 -341
4568 -341 -331 -147 -336 -403 -252 58 136 -139 -393 318 103 -551 -508 -573 -390 -462 13 172 -272 -247 -439 136
$$ packed form
4418G7m3J11K28Mm20n34Q93o07r4J68%j77L51K1m90K28J73l28p4K55m05n1R46
4441B32j012N00K23q6K75l19K12m04r6K03K43r71O53j87K5P04m3o06QJ49k79J56
4463d20j77j05K05K05m47P75k65L65o74R26l21l02M94m26j0L51j31K59l57n9P80
4484F66M1o93N10k07l68j94P8R1O73n26p7K01Q8K20n02M61j97m43O16J79m55M14
4506E76O0j57J30p20j96R03o39N8j15P87m61J04J11l80J74o44M25n34J163k01
4526D44p31J03j3J056q86J00k95K63O66p25p05L53l22P64l7l77L21M40j38l91
4546a10k78J38q0M7l6K83n0m62J38K72n06N58n74J61M80o01R43m97j19K48K0l16
4568c41J0J84j89o7J51L10P8k75k54P11k15o54M3o5J83p2M75J59m44K5j92N75
$$ plain form
4590 136 386 318 432 226 -120 -289 137 109 635 170 74 94 -548 -569 -28 -334 35 681 250 95 63 -360
4612 -360 246 121 113 -449 -132 -77 410 65 -200 100 -66 453 748 265 554 -266 133 -156 342 -85 129
4633 129 472 286 155 66 408 437 191 982 215 -40 280 -192 157 479 776 -79 295 511 673 -244 154
4654 154 23 471 -181 -2 128 -395 380 -168 259 54 158 379 -106 365 117 111 -432 -643 -560 152 436
4675 436 -212 -575 -42 -103 -360 59 -60 121 -74 -107 -194 -610 114 -172 -15 -655 -416 -94 -28 476 -453
4696 -453 409 -266 -241 -246 85 -77 -319 -268 141 316 -272 -485 -148 137 -415 -741 -559 -437 -421 -384 -124 -12
4718 -12 102 -298 -42 -235 -25 -435 -246 -117 0 -258 -2 -272 -350 233 252 -14 172 -65 621 227 352
4739 352 109 187 -161 -233 -282 -143 232 -79 286 -82 261 102 751 408 199 94 -61 -130 -598 383 645
$$ packed form
4590A36K50o8J14k06l46j69M26k8N26m65r6K0o42k1N41l06L69O46m31j55l2m23
4612c60O06j25qn62L17N5M87l45k65L00j66N19K95m83K89q20L99k89M98m27K14
4633A29L43j86j31q9L42K9k46P91p67k55L20m72L49L22K97q55L74K16J62r17L98
4654A54j31M48o52J79J30n23P75n48M27k05J04K21m85M71k48on43k11Q3P12K84
4675D36o48l63N33o1k57M19j19J81j95l3q7m16P24k86J57o40K39L22O6N04r29
4696d53Q62o75K5nL31j62k42N1M09J75n88k13L37K85n52l26J82J22J6L7K60J12
4718a2J14m00K56j93K10m10J89J29J17k58K56k70p8N83J9k66J86k37O86l94J25
4739C52k43P8l48p2m9J39L75l11L65l68L43j59O49l43k09j05j55o9m68R81K62
$$ plain form
4760 645 364 705 123 626 196 497 424 222 663 3 32 -236 337 98 592 -9 -65 655 106 557 412
4781 412 -64 92 469 337 -147 -17 -28 386 55 -187 223 -359 -208 -136 -26 53 174 -337 33 -674 113
4802 113 -403 -199 6 -25 -787 -73 -332 -558 403 -501 14 -599 -49 24 -67 -605 -241 -328 -94 -651 -76
4823 -76 63 346 198 -271 24 159 -326 -487 452 -297 -100 -91 143 -414 -404 45 -346 -513 320 -160 -8
4844 -8 -235 119 247 110 -32 -393 -604 -56 25 -462 375 189 396 -233 -458 55 -416 304 -248 203 -429
4865 -429 501 95 -19 -42 69 70 187 -125 152 133 147 395 354 91 350 879 58 994 448 389 -261 -28
4887 -28 806 481 251 282 468 152 -384 427 201 672 338 670 458 -171 93 -94 -202 -206 264 -274 77
4908 77 -377 129 -234 530 -314 -308 -46 -178 287 -33 -325 5 -300 -280 273 271 -115 94 -115 -25 60 -660 -23
$$ packed form
4760F45k81L41n82N03m30L01p3k02M41o60K9k68N73k39M94o01n6P20n49M51j45
4781D12m76J56L77j32m84J30j1M14l31k42M10n82J51P2J10P9J21n11L70p07P87
4802A13n16K04K05l1p62P14k59k26R61r04N15o13N50P3r1n38L64q7K34n57N75
4823g6J39K83j48m69K95J35m85j61R39p49J97RK34n57J0M49l91j67Q33m80J52
4844hk27L54J28j37j42l61k11N48Q1m87Q37j86K07o29k25N13m71P20n52M51o32
4865d29R30m06j14k3J11JJ17l12K77j9J4K48m1k63K59N29q21R36n46n9o50K33
4887b8Q34l25k30L1J86l16n36Q11k26M71l34L32k12o29K64j87j08mM70n38L51
4908G7m54N06l63P64q44OK62j32M65l20k92L30l05K0N53kl86K09k09R0Q5p20O37
$$ plain form
4931 -23 -323 -667 -578 -58 -383 243 -149 165 -303 262 -660 105 -403 -290 215 -251 -185 85 -262 258 124
4952 124 -26 -46 -559 -64 -226 -500 -408 -195 -342 -642 -2 -483 -339 -157 -433 417 337 -378 -164 -65 -678
4973 -678 -274 -638 246 -473 -690 -31 310 -274 -222 -142 -338 120 -222 326 -282 -205 -227 382 -247 -256 -501 381
4995 381 413 -40 -464 -36 236 122 333 436 -111 -263 132 205 528 126 213 294 -166 125 -257 984 513
5016 513 124 328 425 -206 171 698 116 332 54 259 -278 -532 345 28 -210 339 431 108 30 202 108
5037 108 421 324 -85 10 119 237 52 -52 365 -186 87 249 215 289 -205 -112 315 114 97 675 571 -397
5059 -397 220 -160 131 -12 123 -264 -265 -655 -237 -7 94 46 -117 -219 437 28 -213 239 -196 234 -199
5080 -199 -676 -47 8 -336 109 -255 -104 -154 -437 100 290 -225 239 -221 -756 -211 157 -17 -178 -80 115
$$ packed form
4931b3l00l44Q9N20l25O26l92L14m68N65r22P65n08J13N05m66O6K70l47N20j34
4952A24j50k0n13M95j62k74R2K13j47l00O40m81J44J82k76Q50q0p15K14R9o13
4973f78M04l64Q84p19k17O59L41n84N2Q0j96M58l42N48o08P7k2O09o29rk45Q82
4995C81L2m53m24M28K72j14K11J03n47j52L95P3L23m02Q7Q1m60K91l82J241m71
5016E13l89K04R7o31L77N27n82K16k78K05n37k54Q77l17k38N49R2l23p8J72r4
5037A08L13r7m09R5J09J18j85j04M17n51K73J62l4P4m94R3M27k01j7N78j04r68
5059c97O17l80K91j43J35l87jl90M18K30J01m8j63j02O56m09k41M52m35M30m33
5080a99m77O29N5l44M45l64J51n0k83N37J90n15M64m60n35N45L68j74j61R8J95
$$ plain form
5101 115 -565 -406 -89 -22 548 114 84 313 226 186 471 193 -349 94 -89 260 284 145 -273 736 483
5122 483 690 485 158 -81 462 -31 463 -90 375 -19 52 149 -221 355 -216 358 244 -44 828 249 92
5143 92 607 267 681 296 -301 102 61 8 50 381 385 -37 207 -282 199 434 170 595 0 -89 224 133 -357
5166 -357 -325 -30 109 -400 442 -227 -496 29 254 -496 664 392 396 334 -518 262 -434 412 -367 -146 -72
5187 -72 -97 340 -293 -255 252 -183 -244 466 167 116 127 -362 -617 -585 150 -546 159 -277 -146 -147 -258 185 -230
5210 -230 264 -85 -228 -427 -295 -349 -103 -27 -474 -361 310 6 165 -193 -523 -347 -475 57 175 692 1
5231 1 -327 -279 -118 -201 -351 -76 70 275 100 -21 50 185 -244 -106 -302 106 8 61 197 -57 -469 30
5253 30 -952 322 -103 179 62 495 593 475 193 -23 592 353 753 416 62 261 390 377 -51 59 -24
$$ packed form
5101A15o80J59L17O7N70m34l0K29q7m0K85k78n42M43j83L49K4j39m18J009k53
5122D83K07k05l27k39N43m93M94n53M65l94P1R7l70N76n71N74j14k88Q72n79j57
5143I2N15l40M14l85n97M03m1n3M2L31Mm22K44m89M81K35k64M25n95q9L13r1m90
5166c57L2K95J39n09Q42o69k69N25K25p50J160k72Mo2q52P80o96Q46p79K21P4
5187g2k5M37o33L8N07m35o1P10k99n1J1m89k55L2P35o96P05m36J31jj11M43m15
5210b30M94l49j43j99J32n4K46P6m47J13O71l04J59l58l30J76j28N32J18N17o91
5231Al28M8J61q3j50K75J46K05j75j21P1J35m29J38j96M08r8N3J36k54m12M99
5253C0r82J274m25K82j17M33R8j18k82k16O15k39M00l37l54J99J29j3m28J10q3
$$ plain form
5274 -24 -105 293 346 12 241 -86 572 11 389 410 572 350 267 43 -30 -297 -126 -110 179 277 359 372 -205
5297 -205 35 -586 -309 -637 96 -135 -129 55 118 -49 40 504 419 504 57 -377 -291 -359 -142 -432 -367 -437 -170
5320 -170 306 -224 505 -30 252 148 -42 -103 29 -426 -555 -239 -335 485 -303 -412 -497 -212 -554 81 -20
5341 -20 254 -438 226 110 227 -106 -345 -199 -376 83 -312 143 -87 -33 -164 -198 -190 -240 -206 -341 132 -399
5363 -399 -330 -515 81 255 108 215 24 -545 -218 -650 -191 82 260 -57 -294 -386 -283 50 342 -109 22
5384 22 -402 14 65 744 211 -71 -255 -67 211 -378 21 -192 -160 -512 799 62 -121 -253 -463 -207 112
5405 112 80 315 288 -439 554 195 -212 -136 165 5 764 473 461 -72 -10 146 3 46 269 -272 -132 -87
5427 -87 377 446 191 -24 -201 196 -434 -170 -117 160 -97 78 -537 73 406 -76 -125 -89 141 33 403 19
$$ packed form
5274b4q1L98N3l34K29l27O58n61L78K1J62k22q3k24p3k67J71J6K89R8Q2J3n77
5297b05K40o21K77l28P33k31OJ84O3j67Q9M64q5Q5m47m34Q6o8K17k90O5p0K67
5320a70M76n30P29n35K82j04j90o1J32m55j29L16r6Q20p88j09q5K85l42O35j01
5341b0K74o92O64j16J17l33k39J46j77M59l95M55k30N4j31l4Qn0L4j35M73n31
5363c99O9j85N96J74j47J07j91n69L27m32M59K73J78l17k37r2J03L33K92m51J31
5384B2m24M16N1O79n33k82j84J88K78n89L99k13L2l52J311p37j83j32k10K56L19
5405A12l2K35k7p27R93l59m07P6L01j60P59k91j2n33O2J56j43M3K23n41J40M5
5427h7M64O9k55k15j77L97o30K64N3K77k57J75o15O10L33m82m9L6K30j08L70l84
$$ plain form
5449 19 -117 -60 -390 -100 -647 500 -256 -17 10 470 206 473 -252 -293 113 -65 -92 29 -256 -464 54
5470 54 -706 -274 56 -96 148 -229 -390 -16 185 409 -170 -532 81 -451 -85 -222 -271 -221 -97 243 -192
5491 -192 -6 -300 173 -266 -448 117 -203 413 -9 131 -76 19 -295 166 584 241 -332 538 -498 263
5511 263 -860 -403 258 -13 621 -280 190 -56 319 145 665 600 128 -130 -589 179 -313 -17 513 467
5531 467 -194 565 437 64 475 39 -57 6 321 701 428 487 1106 53 74 -278 -185 498 -289 -164 -49
5552 -49 -200 -394 331 -277 97 161 -247 51 -160 -170 263 -149 -72 238 -40 -19 321 41 -2 -362 -303 -571
5574 -571 -49 -194 -406 -454 -167 260 42 -914 15 -191 475 -197 175 -148 -340 -343 -124 -406 -857 -10 -398
5595 -398 -111 -87 -266 408 44 -703 427 -151 -92 -585 -348 154 -507 -266 -234 -241 -420 169 -524 -450 -318 51
$$ packed form
5449A9j36N7l30K90n47J147p56K39K7M60k64K67p25m1M06j78k7J21k85k08N18
5470E4p60M32L30j52K44l77j61L74K01K24n79l62O13n32L66j37m9N0J24L40m35
5491a92J86k94M73m39j82N65l20O16m22J40k07R5l14M61M18l43n73Q70j036P61
5511B63j123M57O61k71O34r01M70k46L75j74N20o5m72k58m59P68m92K96N30m6
5531D67o61P59j28l73M11m36r6O3L15L80k73N9O19j053K1l52R3O83p87J25J15
5552d9j51j94P25o08L74O4m08K98k11j0M33m12P7L10k78K1L40k80m3l60N9k68
5574e71N22j45k12m8K87M27k18r56R29k06O66o72L72l23j92lK19k82m51Q47l88
5595c98K87K4j79O74l64p47J130n78N9m93K37N02o61K41L2pj79N89o93P4J32L69
$$ plain form
5617 51 53 218 231 33 -595 31 8 -55 301 199 462 -6 359 45 -13 462 -293 260 370 -89 -239 -61
5639 -61 316 -538 324 168 194 283 127 -286 -28 -172 -414 133 -123 81 -51 -235 108 273 -410 -479 171
5660 171 197 309 192 -64 -24 -446 212 26 -92 684 405 158 237 185 143 -168 98 282 362 444 78 74 201
5683 201 -44 -219 141 -453 -83 -454 -4 -178 -30 -87 21 -109 12 52 -480 -10 -279 -638 299 47 -379
5704 -379 -405 -313 285 185 -472 70 139 -222 -439 -51 422 6 -421 176 -342 384 213 -18 -286 265 256 -125
5726 -125 238 -435 240 -71 -68 129 -390 -465 -421 -260 369 -228 -58 -315 -148 -205 -172 -566 -22 -201 -496 -237
5748 -237 70 23 310 -214 -174 512 -462 48 26 -486 168 379 -377 201 -115 689 379 134 -63 131 378
5769 378 203 385 -234 -437 114 76 180 517 -20 -33 -410 515 -36 46 -766 25 -51 -99 -33 276 174 532
$$ packed form
5617E1KJ65J3j98o28O26k3o3L56j02K63m68L65l14n8M75p55N53J10m59j50J78
5639f1L77q54Q62j56K6Q9j56m13K58j44k42N47k56K04j32j84L43J65o83o9O50
5660A71K6J12j17k56M0m22O58j86j18P76k79k47P9n2m2l11K66J84Q0Q2l66mJ27
5683B01k45j75L60n94L70l71M50j74J48n7J08j30J21M0n32M70k69l59R37k52m26
5704c79k6R2N98j00o57N42O9l61k17L88M73m16m27N97n18P26j71k31k68N51rl81
5726a25L63o73O75l11LJ97n19p5M4J61O29n97J70k57J67n7L3l94N44j79k95K59
5748b37L07m7K87n24M0O86r74N10k2n12O54K11p56N78l16Q04l10k45j97J94K47
5769C78j75J82o19k03N51l8J04L37n37j3l77R25n51Q2q12P91p6m8O6L09j02L58
$$ plain form
5791 532 249 -81 -63 -9 634 -74 414 130 426 24 26 244 142 297 -160 53 420 313 359 67 -46 268
5813 268 266 169 147 -146 -413 144 485 -191 368 489 -101 450 -542 -428 -415 277 -48 117 64 -102 -94 411 -25
5836 -25 22 266 93 -236 152 560 -105 58 137 -518 -6 -430 -339 96 -442 -464 780 -193 -298 -137 237
5857 237 927 227 -15 70 -350 148 -240 -154 -252 131 484 -111 306 168 528 -331 -293 399 125 -106 182
5878 182 58 130 222 722 583 -52 -49 460 113 -126 -83 349 1060 -174 584 -569 -29 -2 179 -618 63
5899 63 -800 66 -254 -599 471 62 198 1 -216 140 309 -358 332 121 295 279 -466 96 276 172
5919 172 355 100 -90 59 -467 196 21 -535 37 403 35 -130 -143 113 116 -226 207 136 227 96 -305 449
5941 449 53 -235 588 -191 242 460 17 215 -104 -302 -172 -616 96 156 136 -102 -247 397 -59 -74 317
$$ packed form
5791E32k83l30J8N4O43p08M88k84K96m02KK18j02J55m57K13L67j07M6k92j13L14
5813B68kr7k2k93k67N57L41o76N59J21n90N51r92J14J3O92l25J65n3j66QN05m36
5836b5M7K44j73l29L88M08o65J63P9o55N12m24R1M35n38k2J244r73j05J61L74
5857B37O90p00k42Q5m20M98l88Q6r8L83L53n95M17j38L60q59L8O92k74k31K88
5878A82j24P2R2N00j39o35LN09l47k39M3M32P11j234P58j153N40K7J81p97O81
5899F3q63Q66l20l45J070m09J36j97k17L56J69o67O90k11J74j6p45N62J80j04
5919A72J83k55j90J49n26O63j75n56N72L66l68j65j3K56Ll42M33p1R1j31m01P54
5941D49l96k88Q23p79M33K18m43J98l19j98J30m44P12O0k0k38j45O44m56j5L91
$$ plain form
5962 317 -102 156 -15 -181 466 18 341 -118 174 -129 -359 -241 331 46 20 -455 -102 25 -36 352 -425
5983 -425 209 -526 -286 -396 -53 380 -550 -48 -442 715 190 88 590 -195 478 -8 -537 188 -363 545
6003 545 423 727 -536 -377 -332 -86 -135 -123 4 -25 -288 -189 280 -6 179 -208 -319 -260 -159 10 29 -24
6025 -24 387 152 -5 -78 164 -188 343 29 306 -186 -698 621 1 277 -171 273 118 -453 338 121
6045 121 -364 -74 146 144 -1 40 -23 -4 -232 -528 -150 263 210 70 -20 223 160 -554 -16 92 -223 -509 23
6068 23 55 385 306 561 272 88 -481 -114 26 -205 652 150 791 -382 240 85 -257 -663 0 25 -724
6089 -724 -245 -133 12 -390 -1 22 266 81 174 -23 321 -355 -270 336 -363 -253 112 60 191 512 -104
6110 -104 -259 -439 -301 -291 7 -416 -400 140 -187 -280 385 21 148 -94 -73 214 -139 -215 -28 -344 -166 -294
$$ packed form
5962C17m19K58j71j66O47m48L23m59K92l03k30J18N72k85k6m75L53J27o1L88p77
5983d25O34p35K40j10L43M33r30N02l94J157n25j02N02p85O73m86n29P25n51R08
6003E45j22L04j263J59M5K46m9J2J27k9k63R9M69k86J85l87j11N9J01J69J9n3
6025b4M11k35j57p3K42l52N31l14K77m92n12J319o20K76m48M44j55n71P91k17
6045A21m85K90K20kj45M1o3J9k28k96L78M13n3j40r0K43o3p14N38J08l15k86N32
6068B3L2L30p9K55k89j84n69L67J40k31Q57n02O41j173O22j55l42m06O63K5p49
6089g24M79J12J45m02L89K3K44j85R3j97L44o76Q5O06o99J10L65n2J31L21o16
6110a04j55j80J38J0K98m23J6N40l27r3O65l64J27k42K1K87l53p6J87l16J78j28
$$ plain form
6132 -294 -365 -236 -564 -177 -238 33 191 -69 286 -374 -48 435 -76 -64 336 385 461 -212 -69 -801 -219 313
6154 313 -128 571 358 -270 394 169 -243 -591 -115 269 473 108 141 -186 343 -117 506 128 470 305
6174 305 -25 -186 -111 209 70 218 17 -159 -57 170 -259 100 452 -388 314 37 -8 645 -270 41 -415
6195 -415 -107 -93 -169 -555 -62 576 -284 -247 -91 -8 -324 62 -391 478 555 -249 -259 222 220 -278 -218 113 -243
6218 -243 255 -200 295 284 -654 -159 48 -68 -532 -72 -390 -20 97 -166 223 4 -266 246 261 108 -56
6239 -56 -77 -148 673 -419 -343 -273 266 558 315 -186 -151 -153 -234 613 -53 120 -520 803 67 -632 70 -334
6261 -334 255 425 -221 -617 181 -521 -129 176 41 208 -66 92 295 -364 -110 568 298 668 -386 536
6281 536 255 -26 414 76 349 280 -2 175 -508 220 405 58 990 -285 110 -90 708 180 396 -287
$$ packed form
6132b94p1J29l28L87o1K71J58k60L55o60L26M83n11J2M00M9P6o73J43p32N82N32
6154C13m41O99k13o28O64k25m12l48M76L84K04l65L3l27N29m60O23l78L42j65
6174C05l30j61P5L20j39J48k01j76J02K27m29L59L52q40P02k77m5O53r15L11m56
6195d15L08J4p6l86M93O38q60L7J56Q3l16L86m53Q69P7q04j0M81km98O0L31l56
6218b43M98m55M95j1r38M95K07j16m64M60l18L70J17k63L89k19k70N12J5j53j64
6239e6k1p1Q21j092P6P0N39K92k43n01L5kq1Q47o66J73o40J323p36o99P02m04
6261c34N89J70o46l96P98p02L92L05j35J67k74J58K03o59K54O78k70L70j054R22
6281E36k81k81M40l38K73o9k82J77o83P28J85l47R32j275L95k00P98n28K16o83
$$ plain form
6301 -287 162 256 -139 12 577 535 58 102 247 -229 -343 -5 192 672 -280 552 332 339 335 44 -158 -738
6323 -738 6 -195 -644 -150 -467 461 100 348 45 176 -289 579 -362 294 -143 379 -4 -270 821 -113
6343 -113 -122 202 -24 -648 -251 104 128 133 -124 -342 653 272 581 60 -707 -186 -19 228 -202 -416 -175 83
6365 83 -31 -10 -85 3 297 -32 -52 322 -218 79 350 -248 -82 -15 44 295 -611 -419 -147 -67 473 -30 763
6388 763 25 -74 -412 -467 133 207 117 -144 71 76 -685 234 -122 -161 -118 -107 259 221 239 -253 -355 67 -84 -20
6412 -20 -196 946 85 -490 555 -239 100 -129 -47 -144 74 -689 -162 81 731 388 116 324 -216 -421
6432 -421 88 308 498 -308 71 163 229 -248 59 341 306 232 -409 120 233 -741 69 780 366 128 465
6453 465 417 56 62 268 431 -173 364 -376 -77 -20 61 -75 447 146 208 -42 -231 628 92 396 -103 -280
$$ packed form
6301b87M49R4l95J51N65m2m77M4J45m76j14L38J97M80r52Q32k20Pmk91k02n80
6323g38P44k01m49M94l17R28l61K48l03J31m65Q68r41O56m37N22l83k66J091r34
6343a13rL24k26o24L97L55K4Nk57k18R95l81L09n21p67N21J67K47m30k14K41K58
6365H3j14K1p5Q8K94l29k0L74n40K97K71n98J66O7N9K51r06J92K72Q0N40n03P93
6388G63p38r9l38n5O00P4r0k61K15Np61R19l56l9M3J1L66l8J8m92j02M22j51O4
6412b0j76J142q61n75J045p94L39k29Q2r7K18p63N27K43O50l43k72K08n40k05
6432d21N09K20J90q06L79R2O6m77L07K82l5p4o41N29J13r74Q10P11m14k38L37
6453D65m8l61OK06J63o04N37p40K99N7Q1j36N22l01O2k50j89Q59n36L04m99j77
$$ plain form
6475 -280 -530 334 -347 336 -374 -633 256 -431 315 131 -539 337 -590 -104 22 -148 -30 21 -332 -137
6495 -137 -29 -359 43 -21 -592 260 91 -343 -155 -21 -208 -343 662 151 118 -487 212 -60 401 95
6515 95 -194 -85 -572 107 -209 104 -499 -41 117 606 118 -244 -49 404 0 102 211 -470 336 34
6535 34 -509 94 -205 258 -176 278 464 -6 534 -146 324 482 -22 -120 789 -468 171 356 -75 300
6555 300 -185 -142 -500 388 416 41 293 -546 299 -228 385 -826 341 540 -195 -112 61 625 238 -206
6575 -206 28 -226 94 -128 -2 190 -116 414 -209 3 -153 633 847 761 -21 -509 86 -214 -362 472
6595 472 -272 -320 5 153 156 -93 136 185 -430 179 -30 -126 -665 487 -424 -520 -104 -487 1033 -114 188
6616 188 -276 -239 283 -39 -207 -515 -767 -143 112 54 335 -314 -132 521 29 266 458 -131 90 -354 -630
$$ packed form
6475b80k50Q64o81O83p10k59Q89o87P46j84o70Q76r27M86J26j70J18N1l53J95
6495a37J08l30M02o4n71Q52j69m34J88J34j87j35J005n11l3o05O99k72M61l06
6515I5k89J09m87O79l16L13o03M58J58M89m88l62J95M53m04J02J09o81Q06l02
6535C4n43O03k99M63m34M54J86m70N40o80M70J58n04r8R09j257O39J85m31L75
6555C00m85M3l58Q88K8l75K52q39Q45n27O13j211J167J99p35Q3J73N64l87m44
6575b06K34k54L20k22J26J92l06N30o23K12j56P86K14q6p82m88N95l00j48Q34
6595D72p44m8L25J48Lk49K29M9o15O09k09r6n39J152r11r6M16l83J520j147L02
6616A88m64L7N22l22j68l08k52O24K55n8K81o49J82O53m92K37J92n89K21m44k76
$$ plain form
6637 -630 286 -201 148 436 -323 173 80 353 104 -142 588 -427 -483 131 115 92 -168 -263 -492 196 233 -98
6659 -98 5 150 -99 283 -145 339 -49 -226 -176 614 -20 -57 -141 -311 -419 -327 10 86 -164 32 -36 -157
6681 -157 -273 -96 511 -728 134 459 43 -109 -50 584 314 159 -73 -77 446 23 -210 -201 260 5 130
6702 130 54 168 437 428 -100 109 -173 221 -285 -525 -686 -375 105 -220 -527 462 243 112 -443 291 -471
6723 -471 -631 87 -74 233 -259 -35 262 -343 -165 754 213 407 -495 524 -262 88 -400 -204 -574 -213
6743 -213 -61 -165 171 -377 -134 218 -811 46 -165 -194 427 -222 -357 396 -354 -306 230 -353 23 -10 457
6764 457 20 144 -455 -66 326 1 -611 -1 277 879 -74 -39 263 18 -65 -110 206 -113 -115 251 271 -331
6786 -331 -181 5 -177 119 98 -543 -348 -81 -125 -567 400 -775 344 186 250 371 116 -406 -273 -102
$$ packed form
6637f30R16m87L49K88p59M96r3K73k49k46P30j015n6O14j6k3k60r5k29O88L7l31
6659i8J03J45k49L82m28M84l88j77N0P90o34l7q4j70j08R2L37P6k50J96o8j21
6681a57j16J77O07j239Q62L25m16j52N9O34k70j55k32mN23m23k33RM61k55J25
6702A30p6J14K69rn28K09k82L94n06k40j61L11M80l25l07R89k19j31n55P34p62
6723d71j60P18j61L07m92K24K97o05J78R19n41J94r02J019p86L50m88J96l70L61
6743b13J52j04L36n48K43L52j029Q57k11k9O21o49j35P53p50M8N36n83L76l3M67
6764D57m37J24n99L89L92l25o12O10K78O02r53L5L02k45q3m5L16l19kL66K0o02
6786c31J50J86j82K96k1o41J95K67m4m42R67j175J119j58O4J21k55n22J33J71
$$ plain form
6806 -102 206 278 -477 215 460 -130 -30 -81 61 -20 299 351 -111 44 -887 -99 -208 125 -438 10 -571
6827 -571 -290 251 -158 13 92 -111 283 -248 197 -348 134 351 -504 -473 -6 -194 -333 -267 700 -46 -576
6848 -576 -607 -700 -64 -25 268 257 14 -176 -36 64 -511 -581 35 12 -9 -75 230 -139 -391 -175 -46 -580 126
6871 126 -281 -770 -427 -142 -199 39 -32 78 750 -219 39 167 260 -201 -191 290 373 392 785 -16 438 248
6893 248 -117 101 -173 -10 -314 118 117 -622 363 826 -218 -91 -37 70 640 566 -434 123 234 35 130
6914 130 -381 255 100 222 -189 543 445 -182 -372 -89 -21 -41 424 -515 427 -46 -227 -115 89 351 -90
6935 -90 -102 -307 53 -154 -237 -82 292 257 -211 -85 -194 -32 -297 111 103 54 118 -492 -69 -276 144 -101 9
6958 9 80 -390 26 65 124 -348 98 -484 471 114 -266 -718 206 -203 -414 126 169 -21 98 303 123 -84
$$ packed form
6806a02L08P2p55O92K45n90J00n1J42q1L19N2m62J55r31P88j09L33n63M48n81
6827e71K81N41m09J71P9k03L94n31M45n45M82K17q55L1M67j88j39O6R67p46n30
6848e76l1r3O36L9K93j1k43j90J40J00n75p0O16k3k1o6L05l69k52K16J29n34P06
6871A26m07m89L43K85n7K38p1J10O72r69K58J28R3m61J0M81Q3J9L93q01M54j90
6893B48l65K18k74J63l04M32jp39R85M63j044J27N4J07N70p4j000N57J11j99R5
6914A30n11O36j55J22m11P32r8o27j90K83O8k0M65r39R42m73j81J12K04K62m41
6935i0j2k05L60k07q3J55L74l5m68J26j09J62k65M08qm9O4o10M23k07M20k45J10
6958IP1m70M16L9N9m72M46n82R55l57l80m52R24m09k11N40M3j90J19K05j80k07
$$ plain form
6980 -84 -304 -223 -245 -394 49 195 294 132 379 -407 -382 291 391 -295 -213 356 -362 377 -702 66 -208 95
7002 95 56 -413 133 395 -1 -409 -175 -248 -13 -674 83 -124 -58 -117 -418 -554 70 89 163 -599 -498 -19
7024 -19 450 135 109 248 -275 -610 -563 497 343 265 251 -97 234 88 -391 447 40 -1016 -162 161 291
7045 291 66 -274 649 22 -471 -488 -16 420 268 54 341 -404 -287 -199 470 -43 -58 -4 330 -64 43
7066 43 -298 -72 196 -353 341 141 345 -504 -210 -76 -117 172 427 -82 -240 190 -204 -161 -222 -187 358 598
7088 598 404 -378 -234 -494 -12 -20 550 714 -428 138 23 271 -426 -7 -35 8 469 -905 -325 -100 -305
7109 -305 -729 -458 24 -67 347 356 -276 -258 144 -582 307 -140 95 222 376 616 10 -293 -671 -42 143
7130 143 -513 -83 -293 111 -445 -41 -68 -513 223 399 113 -402 -127 333 -265 -175 6 -24 159 76 32 -375
$$ packed form
6980h4k20Q1k2j49M43J46R9j62K47p86K5O73J00o86Q2N69p18P39j079P68k74L03
7002I5l9m69N46K62l96m08K34p3K35o61P57k07O6n9l01j36O24J9P4p62J01M79
7024a9M69l15k6J39n23l35M7J060j54p8j4l48L31j46m79Q38m07j056Q54L23J30
7045B91k25l40R23o27m93j7M72M36j52k14K87p45J17Q8O69n13j5N4L34l94J07
7066D3l41K26K68n49O94k00K04q49K94J34m1K89K55n09j58M30l94M3o1L5N45K40
7088E98j94p82J44k60M82qN70J64j142N66j15K48o97M19k8M3M61j374N80K25k05
7109c05m24K71M82r1M14Ro32J8M02p26Q89m47K35J27J54K40o06l03l78O29J85
7130A43o56M30k10M04n56M04k7m45P36J76k86n15K75M60n98R0J81l0J83q3m4m07
$$ plain form
7152 -375 -356 155 73 38 39 -198 -241 -449 -139 -516 -181 -14 -290 -168 238 464 -112 79 38 -72 304 -64
7174 -64 -91 478 255 -71 314 -103 0 487 -274 -7 -493 340 -141 145 115 293 403 504 218 -21 137
7195 137 -8 -317 -438 -269 329 72 -524 181 243 487 -10 326 311 -53 -436 -34 425 -455 56 303 410
7216 410 -95 -359 125 -108 -212 -332 -45 -49 136 -48 -209 -43 447 -85 491 -237 8 367 114 -176 -397
7237 -397 -315 197 -242 198 -9 586 -71 392 -156 -388 116 -270 -504 90 306 223 389 -57 -216 86 43
7258 43 -242 -444 136 489 96 285 -121 232 338 23 293 -2 -296 155 -121 20 312 -376 -427 -104 -498
7279 -498 215 -30 -169 -394 -547 245 43 829 -358 27 -230 -98 245 -99 -127 142 -200 -329 -237 325
7299 325 96 571 -124 -31 -553 266 -458 621 157 -174 -134 -377 -281 -361 -227 26 19 251 136 426 152 51
$$ packed form
7152c75J9N11q2l5Jk37m3k08L10l77L35J67k76J22M06K26n76J91m1j10L76l68
7174f4k7N69k23l26L85m17J03M87p61K67m86Q33m81K86l0J78J10J01k86k39J58
7195A37j45l09j21J69N98k57n96P05O2K44m97L36j5l64l83M02M59q80N11K47J07
7216D10n05k64M84k33j04j20K87mJ85j84j61J66M90n32N76p28K45L59k53k90k21
7237c97Q2N12m39M40k07N95o57M63n48k32N04l86k34N94K16q3J66m46j59L02m3
7258D3k85k02N80L53l93J89m06L53J06l15K70k95k94M51k76J41K92o88n1L23l94
7279d98P13k45j39k25j53P92k02P86j187L85k57J32L43l44k8K69l42j29R2N62
7299C25k29M75o95R3n22Q19p24J079m64l31M0k43R6q0J34K53pK32j15K90k74j01
$$ plain form
7321 51 368 -376 252 -439 -152 83 241 55 -154 354 75 595 -78 -296 278 -427 -81 534 277 -21
7341 -21 392 497 150 192 -561 172 -790 -139 -398 113 -205 98 3 89 -38 -358 377 359 112 469 -80 518
7363 518 -100 142 -452 173 149 20 -116 -153 18 -475 -62 -314 -170 13 163 368 -149 90 -499 -95 420
7384 420 -84 23 24 -264 -657 -459 482 357 -276 -62 201 319 -199 77 -213 -135 -106 189 -80 133 -185
7405 -185 511 79 -389 573 -304 63 -305 -215 334 12 12 198 -339 250 -220 -123 -38 435 -227 762 -402
7426 -402 -31 -302 33 -475 91 431 -210 104 -38 -110 389 144 127 227 -955 -52 -526 543 137 -67
7446 -67 141 207 444 761 178 -117 144 -67 275 498 -13 -135 44 531 440 -400 575 524 -321 498 478 668
7468 668 230 -169 1 225 500 -97 -183 197 -172 -82 519 339 -128 -558 -12 195 327 331 6 -190 -334
$$ packed form
7321E1L17p44O28o91K87K35J58j86k09N08k79N20o73k18N74p05L46O15k57k98
7341b1M13J05l47M2p53P33r62O51k59N11l18L03r5Q6j27l20P35j8k47L57n49N98
7363E18o18K42n94O25k4j29j36l7J71m93M13k52J44J83J50K05n17K39n89M04N15
7384D20n04J07Jk88l93J98R41j25o33K14K63J18n18K76k90P8K9K95k69K13l18
7405a85O96m32m68R62q77L67l68R0N49l22%J86n37N89m70R7Q5M73o62R89j164
7426d02L71k71L35n08N66L40o41L14j42p2M99k45j7J00j182R03m74J069m06k04
7446f7K08O6K37L17n83k95K61k11L42K23n11j22J79M87r1q40R75n1q45Q19k0J90
7468F68m38l99J70K24K75n97q6L80l69R0O01j80m67m30N46K07J32Ml25j96j44
$$ plain form
7489 -334 314 -45 -26 -343 296 -11 -357 -169 -184 -236 245 -58 649 0 -95 442 543 368 289 178 -114 -275
7511 -275 199 165 -375 163 -85 373 199 213 -493 -18 77 -342 121 -360 313 114 36 419 4 -71 183 -499
7533 -499 209 -606 19 -299 -87 70 -39 -322 752 523 -104 223 4 170 -26 -91 -340 58 731 -268
7553 -268 51 183 -140 192 -140 -25 -410 -167 -124 256 -326 149 -161 91 134 560 497 -109 40 302 426
7574 426 -250 -268 -162 -297 285 263 229 -118 -252 -267 -175 -215 -18 -18 254 199 -231 -265 -174 -312 524 -424 379 -530
7598 -530 52 23 350 -150 -362 40 663 -36 508 282 -16 460 -145 28 -275 55 169 334 284 75 -426
7619 -426 -14 567 -156 441 115 -195 -545 -386 163 -642 17 222 -125 -746 -384 -78 400 -107 -294 212
7639 212 181 -43 -355 419 -259 -189 -173 -125 680 149 -480 -136 71 115 -494 74 382 6 -200 21 -160 557
$$ packed form
7489c34O48l59J9l17O39l07l46J88j5n2M81l03P07o49r5N37J01j75p9j11k92j61
7511b75M74l4n40N38k48M58j74J4p06M75R5m19M63m81O73j99p8L83m15p5K54o82
7533d99P08q15O25l18K12J57j09k83J074k29o27L27k19J66j96o5k49L98O73r99
7553b68L19J32l23L32l32J15l85K43M3L80n82M75l10K52M3M26o3o06J49K62J24
7574D26o76j8J06j35N82k2l4l47j34j5R2m0J97%K72n5m30l4R1j38Q36r48Q03r09
7598e30N82k9L27n00k12M02O23o99N44k26k98M76o05J73l03L30J14J65n0k09n01
7619d26M12N81p23N97l26l10l50J59N49q05O59K05l47o21L62L06M78n07j87N06
7639B12l1k24l12P74o78P0J6M8Q05n31o29L44K07M4o09N68L08l76k06K21j81P17
$$ plain form
7661 557 -591 5 166 258 187 16 435 -342 105 -72 -740 -142 234 -258 282 -17 -74 57 -252 -286 87
7682 87 7 557 -198 -65 -94 -11 413 -490 83 -87 77 294 429 -210 -58 -110 76 -114 -123 -179 -301 -310 -81
7705 -81 -267 332 -439 175 575 -70 96 381 237 -404 414 155 -51 30 -330 487 -117 157 207 705 382
7726 382 -186 236 -526 435 454 179 374 396 447 30 19 -533 -432 -331 43 519 315 -28 -66 140 38 56
7748 56 -41 93 -64 -224 -228 8 -113 -402 349 169 334 -233 -353 605 -188 239 321 -512 -127 -113 -434 146
7770 146 503 709 165 370 -356 269 508 -576 215 -349 -278 -734 -102 -146 520 -68 220 -247 -90 -195
7790 -195 -1 242 -490 103 286 489 15 -183 356 268 -43 -41 -79 246 115 462 -483 195 -42 333 182
7811 182 -198 172 -167 -82 -15 40 -216 210 307 -74 71 425 282 15 204 129 252 378 -664 10 39 -205
$$ packed form
7661E57j148N96J61R2p1j71M19p77M47j77o68N98L76m92N40k99n7J31l09l4L73
7682H7q0N50p55J33k9Q3M24r03N73j70J64K17J35o39J52n2J86j90rn6j22rK29
7705h1j86N99p71O14M00o45J66K85j44o41Q18k59k06Q1l60Q17o04K74N0M98l23
7726C82n68M22p62R61J9k75J95K2N1m17j1n52J01J01L74M76k04l43l8K06j02J8
7748E6r7J34j57j60mK36j21k89P51j80J65n67j20R58p93M27Q2q33L85J4l21N80
7770A46L57K06n44K05p26O25K39j084P91n64P1m56O32m4O66n88K88m67J57j05
7790a95J94K43p32N93J83K03m74j98N39q8l11Kl8L25j31L47r45O78k37L75j51
7811A82l80L70l39Q5O7N5k56M26R7l81J45L54j43k67J89p5J23J26j042O74K9k44
$$ plain form
7833 -205 -171 85 439 -485 -121 -165 -83 -132 343 -552 -31 93 -241 66 -374 230 153 627 509 636 -456
7854 -456 165 -257 258 -310 116 -132 278 457 196 415 -168 -178 -178 41 303 -274 -484 -261 -134 -189 -295
7875 -295 127 -375 -355 -56 371 290 -65 -175 316 -87 -186 294 91 -240 -407 -230 185 93 645 -296 -176
7896 -176 78 267 -83 73 176 333 98 -39 -91 -439 199 202 -498 105 407 910 -295 194 182 -155 76
7917 76 -31 142 -771 147 206 -626 -204 -151 -203 -84 558 -196 -26 -23 -173 370 27 112 -8 66 -245 309 338
7940 338 328 61 541 -251 -74 -286 265 56 304 -189 -32 -37 -333 44 -113 68 306 313 402 273 136 774
7962 774 416 462 -302 -544 421 -266 -84 195 65 -58 17 198 122 321 122 485 405 101 186 -346 281 -70
7984 -70 -31 -254 423 180 -470 -65 -530 -310 -138 112 145 195 -197 -100 315 609 -459 94 -284 -208 97 -535
$$ packed form
7833b05L4K56L54r24L64m4Q2m9M75q95N21J24l34L07m40O04p7M74j18J27j092
7854d56O21m22N15n68M26k48M10J79k61K19n83j0%K19K62n77k10K23J27n5j06
7875b95M22n02K0K99M27q1l55j10M91m03r9M80k03l31j67J77M15r2N52r41J20
7896a76K54J89l50J56J03J57k35j37n2l48O38Lp00O03L02N03j205M89j2l37K31
7917G6j07J73r13R18N9q32M22N3n2J19O42p54J70Lj50N43l43Q5j20P4l11N54K9
7940C38j0k67M80p92J77k12N51k09K48m93J57nk96L77j57J81K38PQ9j29j37O38
7962G74l58M6p64k42R65o87J82K79j30j23P5J81p6J99j99L63q0l04Q5n32O27l51
7984g0L9k23O77k43o50M05m65K20J72K50L3N0l92R7M15K94j068N53l78P6L05o32
$$ plain form
8006 -535 -164 784 -143 367 562 -218 2 -353 11 43 -3 -468 -163 -110 382 337 -238 -97 516 509 203 -543
8028 -543 76 170 9 -39 332 669 -329 -525 511 -395 46 402 -269 123 213 -15 -204 608 -251 -455 36
8049 36 -516 0 183 207 -84 288 -590 -28 22 -61 -181 -291 -134 -66 -239 -96 -49 -107 940 -287 -69 -326
8071 -326 145 -244 201 -488 -222 252 -30 -640 -16 214 -194 -3 -567 107 -413 210 179 -475 -278 -316 531
8092 531 284 405 -65 -414 -93 334 761 -93 -80 -265 270 191 -82 81 48 715 291 -238 -283 529 45
8113 45 27 29 -272 384 -634 -303 -227 -56 1029 -155 199 -161 -470 -231 -899 -116 5 295 -170 19 192
8134 192 49 -226 422 -257 639 -316 -407 660 104 -294 108 -80 -426 108 -537 -717 383 -170 -236 489
8154 489 -211 -130 282 410 368 -358 -500 -141 50 -60 -489 -585 -226 -295 283 156 -54 -20 -99 62 88 -17
$$ packed form
8006e35L71R48r27N10J95p80K20l55L64L2m6m65L05N3M92m5n75J41O13pl06p46
8028e43O19R4j61m8L71L37r98j96J036r06M41L56o71L92R0k28j89Q12q59k04M91
8049C6n52N16J83K4k91L72q78N62N0q3j20j10J57O8j73J43M7n8J047j227K18k57
8071c26M71l89M45o89K66M74k82o10O24K30m08J91n64O74n20O23l1o54J97l8Q47
8092E31k47J21m70l49L21M27M27q54J3j85N35p9k73J63l3O67m24n29m5Q12m84
8113D5j8Kl01O56j018L31P6J71J085j184L54l60l09K39o68P83J21K90m65J89J73
8134A92j43k75O48o79Q96r55r1J067n56l98M02j88l46N34o45j80J100n53o6P25
8154D89p00Q1M12J28m2p26j42L59J91j10m29r6L59o9N78j27k10L4p9J61K6j05
$$ plain form
8176 -17 89 -51 -274 -235 -408 242 646 325 468 61 12 134 911 529 341
$$ packed form
8176a7J06j40k23L9j73O50M04l21J43m07m9J22P77l82j88
8191C41
$$ Imaginary data points
##PAGE= N=2
##DATA TABLE= (X++(I..I)), XYDATA
$$ plain form
0 0 0 0 0 0 0 0 0 0 0 0 0 -5 32 -32 32 -32 32 -49 64 -64 74 -96 102 -127 137 -161 187 -209 238 -266 304 -339
32 -339 381 -426 475 -532 593 -657 725 -804 893 -987 1092 -1210 1341 -1491 1652 -1843
48 -1843 2060 -2316 2608 -2968 3407 -3967 4695 -5698 7171 -9553 14066 -25678 120959 202425
62 202425 -42423 -75142 30741 77953 -27488 -30459 56662 69751 -33054 -51197 27302
73 27302 68888 14123 -8468 16794 21623 -9924 652 31711 21013 -11425 7942 42157
85 42157 25516 -15174 -9470 22491 25354 -605 -6413 12782 18893 -749 -3072 25175 30151
98 30151 -12339 -33357 -17 25624 -3214 -25042 1794 19632 -11441 -26139 13065 33680
110 33680 -11367 -45639 -8438 27718 -5387 -39231 -5959 21269 -16086 -39868 577 21303
$$ packed form
0@%%%%%%%%%%%nL7o4O4o4O4q1J13j28J38j70J98k29K64k98L48l96M47n04N70o43
32c39P20q07R01j007J125j250J382j529J697j880K079k302K551k832L143l495
48a843L903m376M924n576O375p374Q662j0393J2869j6724K3619l9744J46637Q1466
62B02425k44848l2719J05883M7212j05441k971Q7121J3089j02805j8143P8499
73B7302M1586n4765k2591K5262M829l1547J0576L1059j0698l2438J9367L4215
85D2157j6641m0690N704L1961K863k5959n808J9195O111j9642k323K8247M976
98C0151m2490k1018L3340K5641k8838k1828K6836J7838l1073j4698L9204K0615
110C3680m5047l4272L7201L6156l3105l3844L3272K7228l7355k3782M0445K0726
$$ plain form
122 21303 -21889 -39062 7848 23192 -24090 -41953 2989 21059 -21088 -35003 7222 22825
134 22825 -21698 -41691 -171 25680 -10381 -32339 -3153 14869 -13346 -28804 -4335 9227
146 9227 -9076 -23093 -8991 161 -12721 -18523 -2393 7440 -7536 -21752 -7469 11777 3234
159 3234 -13116 -3685 8898 -3871 -18152 674 23126 9910 -14854 -7410 15150 10816 -7901
172 -7901 446 21458 8464 -17328 -4112 24754 14515 -11516 1656 26725 9917 -16847
184 -16847 1308 29348 15576 -10147 3622 25856 9909 -12079 5878 32726 16174 -13129
196 -13129 -2651 22621 14711 -3677 9009 24058 7393 -10369 7149 26909 14787 -3853
208 -3853 2836 16742 11636 1113 10321 21365 10293 -7465 1102 20485 14206 -4745 -2821
$$ packed form
122B1303m3192j7173M6910J5344m7282j7863M4942J8070m2147j3915M2225J5603
134B2825m4523j9993M1520K5851l6061k1958K9186J8022k8215j5458K4469J3562
146I227j8303j4017J4102R152j2882n802J6130R833j4976j4216J4283J9246q543
159C234j6350R431J2583j2769j4281J8826K2452j3216k4764P444K2560m334j8717
172g901Q347K1012j2994k5792J3216K8866j0239k6031J3172K5069j6808k6764
184a6847J8155K8040j3772k5723J3769K2234j5947k1988J7957K6848j6552k9303
196a3129J0478K5272p910j8388J2686J5049j6665j7762J7518J9760j2122j8640
208c853O689J3906n106j0523R208J1044j1072j7758Q567J9383o279j8951J924
$$ plain form
221 -2821 14232 11161 -5055 -2756 12562 8774 -7240 -6481 9583 9098 -7792 -10296 7503 10269
235 10269 -7442 -10269 6811 6742 -11207 -10027 9523 6769 -13141 -11757 6960 5617 -13055 -13681
249 -13681 2926 2686 -13293 -12323 4700 1087 -18956 -15763 4692 4201 -16349 -16162 1387 -1579
263 -1579 -17265 -12355 3856 -675 -17896 -16312 1065 1086 -13397 -14657 -908 133 -13840 -13576
277 -13576 2092 802 -14023 -14499 408 1701 -10836 -11031 2130 2948 -9344 -11173 2729 6096
291 6096 -6043 -10538 1004 6458 -6431 -9742 5669 10670 -3705 -9290 3851 9119 -2593
304 -2593 -5851 5975 9428 -1952 -6905 6667 13455 2125 -4474 7603 13400 880 -4031 10253
318 10253 15843 1475 -4482 9782 15556 2842 -989 11184 14729 2459 -2145 9108 15515
$$ packed form
221b821J7053l071j6216K299J5318l788j6014P59J6064m85j6890k504J7799K766
235A0269j7711k827J7080o9j7949J180J9550k754j9910J384J8717j343j8672o26
249a3681J6607k40j5979R70J7023l613k0043L193K0455m91k0550J87J7549k966
263a579j5686M910J6211m531j7221J584J7377K1j4483j260J3749J041j3973K64
277a3576J5668j290j4825m76J4907J293j2537j95J3161Q18j2292j829J3902L367
291F096j2139m495J1542N454j2889l311J5411N001j4375n585J3141N268j1712
304b593l258J1826L453j1380m953J3572O788j1330o599J2077N797j2520m911J4284
318A0253N590j4368n957J4264N774j2714l831J2173L545j2270m604J1253O407
$$ plain form
331 15515 5264 -1075 9922 16041 4946 -3116 9503 15355 2260 -3101 9244 14115 3384
344 3384 -1627 8855 12864 2840 -3397 6332 12743 2549 -5782 3373 12267 2620 -5734 3546
358 3546 11460 -233 -8337 1371 9166 -1059 -8109 -150 6484 -171 -7891 -1397 5554 -2246 -11425
373 -11425 -4880 5824 -1382 -10715 -3898 4153 -5067 -13223 -4229 3787 -4710 -12353 -5852 328 -5637
388 -5637 -12485 -5950 1546 -4757 -14491 -9142 1181 -4181 -13490 -7313 1825 -5319 -15144 -7830 1751
403 1751 -4871 -12761 -6657 973 -4176 -11601 -6352 3346 -1316 -10795 -7160 2787 -2029 -11160 -5709
418 -5709 4789 -520 -9906 -3750 5541 597 -8052 -3496 5347 1445 -5686 -2843 7308 4674 -4635
433 -4635 -1633 7397 5221 -4790 -1371 8762 6259 -2896 256 9988 5994 -1043 1573 9579 6842
$$ packed form
331A5515j0251o339J0997O119j1095q062J2619N852j3095n361J2345M871j0731
344C384n011J0482M009j0024o237R729O411j0194q331R155Q894r647q354R280
358C546P914j1693q104R708P795j0225p050P959O634o655p720O494O951p800r179
373a1425O545J0704p206r333O817Q051r220q156Q994Q016q497p643O501O180n965
388e637o848O535P496o303r734N349J0323n362r309O177R138p144r825P314R581
403A751o622p890O104P630n149p425N249R698m662r479L635R947m816r131N451
418e709J0498n309r386O156R291m944q649M556Q843l902p131K843J0151k634r309
433d635L002R030k176j0011L419J0133k503r155L152R732l994p037K616Q006k737
$$ plain form
448 6842 -341 788 9628 8683 1075 1256 11183 10378 -199 724 11793 9788 158 1919 11895 10106
464 10106 707 2588 10546 8729 652 1825 9112 8802 -392 91 9557 8882 -1602 -1165 8361 7193
480 7193 -2770 -1138 8468 5786 -2950 -1932 5550 6165 -1901 -2847 4529 5081 -2831 -4537 4031 5403
496 5403 -4388 -6690 2556 3085 -6272 -6194 1041 1699 -6726 -7562 387 1004 -6910 -8876 -1940 922 -6356
513 -6356 -9289 -1960 405 -6469 -9914 -2121 -95 -8560 -10746 -3009 -624 -7386 -10294 -2995 -1523
528 -1523 -7346 -10075 -3484 190 -7702 -11158 -3005 1906 -5854 -8899 -1364 1200 -6178 -8793 -32
543 -32 1524 -5765 -7745 -805 2839 -2728 -6554 -586 2926 -3378 -6583 -54 4396 -3042 -6371 1148
559 1148 6479 20 -3604 2023 4690 -200 -1475 3709 7246 1896 -2387 4092 9369 3756 -848
$$ packed form
448F842p183J129Q840r45p608J81R927q05j0577R23J1069k005r630J761R976j789
464A0106r399J881P958j817q077J173P287l10r194M83R466o75j0484M37R526j168
480G193r963J632R606k682q736J018P482O15q066r46P376N52p912j706Q568J372
496E403r791k302R246N29r357P8P235O58q425q36P949O17p914j966O936K862p278
513f356k933P329K365o874l445P793K026q465k186P737K385o762k908P299J472
528a523n823k729O591L674p892l456Q153M911p760l045P535K564p378k615Q761
543c2J556p289j980O940L644n567l826N968L512o304l205O529M450p438l329P519
559A148N331o459l624N627K667m890j275N184L537n350m283O479N277n613m604
$$ plain form
574 -848 3783 8138 2999 -807 5010 9974 3808 -906 5991 9399 4753 14 4399 7963 5011
589 5011 739 5329 10080 4659 -447 4909 10388 4725 -1904 3505 8331 3059 -1046 4044 8161
604 8161 3007 -2133 2279 7476 3386 -1393 1197 5867 3038 -2231 1975 5806 1175 -3056 1432
619 1432 6764 -9 -4648 -75 3890 172 -4898 -1887 2344 -650 -6134 -3602 1118 -472 -6652
634 -6652 -5233 -303 -1951 -7571 -5606 27 -2745 -8047 -5381 -538 -2639 -8258 -6048 -187 -1668
649 -1668 -8234 -7839 -229 -839 -8951 -8037 -348 -1674 -9148 -7389 -509 -2989 -8367 -5987 -363 -2014
665 -2014 -7510 -6639 -433 -2169 -7257 -5438 1038 -169 -7201 -5073 2074 205 -6218 -4107 1820
680 1820 -364 -4898 -3013 1276 -51 -2367 -642 3334 1311 -2781 -754 4397 3723 -1033 -546 4315
$$ packed form
574h48M631M355n139l806N817M964o166m714O897L408m646m739M385L564k952
589E011m272M590M751n421n106N356N479n663o629N409M826n272m105N090M117
604H161n154n140M412N197m090m779K590M670k829n269M206L831m631m231M488
619A432N332o773m639M573L965l718n070L011M231k994n484K532M720j590o180
634f652J419M930j648n620J965N633k772n302K666M843k101n619K210N861j481
649a668o566L95P610o10q112R14P689j326p474J759O880k480n378K380N624j651
665b014n496Q71O206j736n088J819O476j207p032K128P147j869o423K111N927
680A820k184m534J885M289j327k316J725L976k023m092K027N151o74m756M87M861
$$ plain form
696 4315 4007 172 1582 5871 5502 -348 -105 5635 7125 2891 1108 4333 5383 2540 1378 6094
712 6094 8303 1323 125 5596 7648 2954 1016 6891 7554 2196 1394 7233 8245 2286 1265 6611
728 6611 8362 2752 296 4332 7412 1487 690 5494 6360 -872 -550 6249 6450 -761 -1524 4507
744 4507 4678 -162 -412 3144 3410 -1824 -2477 3172 3948 -1766 -3530 1052 2681 -1826 -3404 420
760 420 -174 -4160 -3337 520 -201 -2771 -5414 -2754 -49 -2433 -5543 -3234 -691 -3702 -6216 -2732
776 -2732 -106 -4273 -7078 -3995 -892 -3653 -7092 -3763 -1382 -4469 -7383 -4458 -961 -3547 -7442
791 -7442 -4448 439 -3648 -7832 -2992 877 -3869 -6747 -1982 587 -3674 -5611 -807 1713 -2853
806 -2853 -5442 -2088 1158 -1004 -3415 -369 1860 -1336 -3908 574 3497 -844 -3441 733 2419
$$ packed form
696D315l08l835J410M289l69n850K43N740J490m234j783L225J050k843j162M716
712F094K209o980j198N471K052m694j938N875O63n358q02N839J012n959j021N346
728F611J751n610k456M036L080n925p97M804Q66p232L22O799K01p211p63O031
744D507J71m840k50L556K66n234o53N649P76n714j764M582J629m507j578L824
760D20n94l986Q23L857p21k570k643K660K705k384l110K309K543l011k514L484
776b732K626m167k805L083L103k761l439L329K381l087k914K925L497k586l895
791g442K994M887m087m184M840L869m746k878M765K569m261j937M804K520m566
806b853k589L354L246k162k411L046K229l196k572M482K923m341k597M174J686
$$ plain form
821 2419 -76 -1026 2294 3962 776 -761 1926 4165 2202 394 2412 5256 3326 -535 1766
836 1766 6494 3927 654 2064 5327 3697 1193 3662 6272 4316 1161 1865 6332 6139 1960 2226
852 2226 7037 5282 650 3354 7800 4889 -807 2266 6651 4553 445 2327 5596 2435 -1123
867 -1123 1814 5886 2761 -971 556 4659 2727 -560 693 4211 1269 -2966 -137 2632 885
882 885 -2315 425 1766 463 -2366 -2102 383 710 -2776 -3366 -792 -1024 -4053 -3145 -269 -1124 -4465
899 -4465 -4228 -847 -1657 -3897 -4865 -2028 -2231 -4693 -5644 -1723 -765 -5104 -5872 -2344 -1098 -5027 -5409
916 -5409 -1332 -1397 -5851 -6183 -1478 -1602 -4694 -5070 -1466 -1772 -4951 -5092 -696 -409 -4060 -4546 -297
933 -297 406 -4516 -3799 423 94 -4102 -2639 1495 311 -2581 -1777 718 1312 -1291 -972 1390 1818
$$ packed form
821B419k495r50L320J668l186j537K687K239j963j808K018K844j930l861K301
836A766M728k567l273J410L263j630k504K469K610j956l155P04M467j93m179K66
852B226M811j755m632K704M446k911n696L073M385k098m108J882L269l161l558
867a123K937M072l125l732J527M103j932l287J253L518k942m235K829K769j747
882H85l200K740J341j303k829K64K485L27l486n90K574k32l029R08K876q55l341
899d465K37L381q10k240r68K837k03k462r51L921R58m339p68L528J246l929l82
916e409M077o5m454l32M705j24l092l76L604l06l179j41M396K87l651m86M249
933b97P03m922P17M222l29m196J463M134j184k892Q04K495N94k603L19K362M28
$$ plain form
950 1818 -1040 -1620 2083 2403 144 -447 2419 2512 -65 -3 2895 3586 1698 1005 2153 4092 2741
967 2741 1723 3287 4883 2193 511 3636 5711 2888 1604 4295 5484 2448 1610 4343 5705
982 5705 2616 806 2757 5095 3673 1262 3717 5178 2008 465 3467 5912 2195 -58 3078
997 3078 3901 1283 -151 3037 3057 -51 -945 1394 3209 577 -849 740 2209 363 -2044 434
1013 434 2279 -881 -2456 -585 314 -1457 -2370 -669 255 -2197 -2895 -1929 -306 -1731 -3371 -2156
1029 -2156 -832 -2470 -4537 -2990 -525 -2758 -4827 -2826 -1586 -3338 -4494 -2957 -990 -2790 -5667
1044 -5667 -3392 -1251 -2350 -4769 -3979 -1154 -2597 -5363 -3173 -698 -2528 -4203 -2892 -212 -2272
1059 -2272 -3595 -1667 -441 -2061 -3486 -1970 -184 -1212 -2330 -2593 849 -872 -2754 -1443 1534
$$ packed form
950A818k858n80L703L20k259n91K866R3k577O2K898O91j888o93J148J939j351
967B741j018J564J596k690j682L125K075k823j284K691J189l036q38K733J362
982E705l089j810J951K338j422k411K455J461l170j543L002K445l717k253L136
997C078Q23k618j434L188K0l108q94K339J815k632j426J589J469j846k407K478
1013D34J845l160j575J871Q99j771r13J701R24k452o98R66J623j425j640J215
1029b156J324j638k067J547K465k233k069K001J240j752j156J537J967j800k877
1044e667K275K141j099k419P90K825j443k766K190K475j830j675J311K680k060
1059b272j323J928J226j620j425J516J786j028j118k63L442j721j882J311K977
$$ plain form
1074 1534 8 -2688 -207 1772 769 -1217 189 1858 707 -656 642 2099 2505 587 -191
1089 -191 2526 3024 151 754 3849 3135 325 1349 4670 3580 964 2524 3499 3678 1986 1974 4308
1106 4308 4044 2061 1995 3876 4776 1716 1505 5213 4064 352 1738 4664 3367 1005 1174 3961
1122 3961 2965 1455 1506 3195 3230 685 573 2599 3254 728 914 2721 1745 -679 208 2427 1151
1139 1151 -1380 -73 1140 106 -923 -1268 529 369 -2250 -2575 -377 240 -1836 -3139 -468 -404
1155 -404 -2762 -3324 -773 -1177 -3542 -2911 -1541 -1597 -3490 -4095 -2554 -1625 -3291 -4193 -2314 -1534 -3839
1172 -3839 -4283 -1885 -1337 -4068 -4209 -2352 -1944 -4110 -3535 -1775 -1604 -3130 -3465 -1880 -950 -2727 -3502
1189 -3502 -1414 -450 -2464 -3426 -1130 -236 -1841 -3329 21 754 -1947 -2542 -928 724 -719 -707 496
$$ packed form
1074A534j526k696K481J979j003j986J406J669j151j363J298J457M06j918p78
1089a91K717M98k873O03L095p14k810J024L321j090k616J560R75J79j692j2K334
1106D308k64j983o6J881R00l060k11L708j149l712J386K926j297k362J69K787
1122C961r96j510N1J689L5k545j12K026O55k526J86J807r76k424Q87K219j276
1139A151k531J307J213j034j029l45J797j60k619l25K198O17k076j303K671O4
1155d04k358n62K551m04k365O31J370n6j893o05J541R29j666r02J879P80k305
1172c839m44K398N48k731j41J857M08k166N75J760J71j526l35J585R30j777p75
1189c502K088R64k014r62K296Q94j605j488L350P33k701n95J614J652j443J2J203
$$ plain form
1206 496 1194 180 -537 582 2328 518 -1112 590 2584 1122 -420 1790 2440 1038 33 1912
1222 1912 2729 1179 945 1924 3080 2262 1069 2394 3886 2587 986 2577 4811 2038 903 2309
1238 2309 3928 2760 2092 2609 3289 2299 1642 2361 3636 2353 650 1538 3640 2514 1512 1573 3573
1255 3573 1982 259 2409 3080 1337 -243 1920 2479 1219 -556 742 2258 42 -1387 21
1270 21 1380 66 -2653 -509 1476 -673 -1752 -287 309 -1495 -2440 -852 -314 -1666 -2513 -2081 -923
1287 -923 -1277 -2036 -2430 -1315 -1730 -3953 -2612 -1439 -2260 -4122 -2737 -1704 -2288 -3931 -2332 -1627 -2515
1304 -2515 -3512 -3192 -2191 -1438 -3751 -3600 -1417 -1366 -3686 -3260 -686 -1383 -3354 -2604 -1352 -1463 -2652
1321 -2652 -2252 -860 -924 -1880 -2202 11 -32 -2621 -2186 1046 90 -2072 -1347 1382 1365 -1448 -621 1752
$$ packed form
1206D96O98j014p17J119J746j810j630J702J994j462j542K210O50j402j005J879
1222A912Q17j550k34R79J156q18j193J325J492j299j601J591K234k773j135J406
1238B309J619j168o68N17O80r90o57P19J275j283j703Q88K102j126j002O1K000
1255C573j591j723K150O71j743j580K163N59j260j775J298J516k216j429J408
1270B1J359j314k719K144J985k149j079J465N96j804r45J588N38j352q47M32J158
1287i23l54p59l94J115m15k223J341J173q21j862J385J033n84j643J599P05q88
1304b515r97L20J001P53k313J51K183N1k320M26K574o97j971P50J252j11j189
1321b652M00J392o4r56l22K213m3k589M35L232r56k162P25K729j7k813Q27K373
$$ plain form
1339 1752 778 -733 290 1568 1516 330 447 1941 2496 341 1078 2472 1996 394 995 3146 2578
1356 2578 1410 1375 3076 2728 2051 1682 2725 2541 2616 1837 3311 3071 2153 1949 2984 3072 1883 1912 2625
1375 2625 2758 1593 735 2753 3070 2298 1458 2078 2884 1109 35 2261 3107 343 448 1572 2137
1392 2137 547 -27 772 1962 -416 -400 940 521 151 142 220 410 -1381 -1551 -192 556 -1116 -2458
1410 -2458 -970 -55 -2017 -1985 -875 -1210 -2318 -2224 -597 -1268 -2956 -2720 -1973 -1768 -2347 -2784 -1855 -1910 -2336
1429 -2336 -2593 -2568 -1524 -2543 -4000 -2463 -939 -3004 -2451 -2133 -1581 -2567 -2811 -1910 -1234 -1986 -2689 -2851
1447 -2851 -784 -1522 -2238 -1757 -176 -1580 -2983 -578 491 -1674 -2418 -493 -22 -785 -1557 -215 1024
1464 1024 70 -626 316 1822 395 -1140 1173 1607 1019 -91 1180 1588 472 134 1999 1663 810
$$ packed form
1339A752r74j511J023J278n2j186J17J494N55k155P37J394m76j602O01K151n68
1356B578j168l5J701l48o77l69J043j84P5p79J474k40r18k04J035Q8j189K9P13
1375B625J33j165q58K018L17p72q40O20Q06j775j074K226Q46k764J05J124N65
1392B137j590n74P99J190k378J6J340m19l70rP8J90j791j70J359P48j672j342
1410b458J488R15j962L2J110l35j108R4J627o71j688K36P47K05n79m37R29n5m26
1429b336k57K5J044j019j457J537J524k065N53L18N52r86k44R01O76p52p03j62
1447b851K067p38p16M81J581j404j403K405J069k165p44J925M71p63p72J342J239
1464A024r54o96R42J506j427j535K313M34n88j110J271M08j116l38J865l36q53
$$ plain form
1481 810 973 1723 2933 1286 1580 2129 2941 1905 1539 2388 3510 2081 1332 2010 3040 2055 1617 2473
1499 2473 2793 2088 1227 1991 2165 2775 1300 1273 3017 2326 1293 1175 3137 2175 -15 1203 1811 1732
1517 1732 349 1305 2237 1349 -438 667 1625 579 -202 -252 1500 671 -760 -442 1575 1 -1049
1534 -1049 180 882 -783 -2277 -1080 -171 -805 -1670 -1247 -861 -1392 -1597 -2262 -714 -1355 -2146 -2448 -1481
1552 -1481 -1171 -2643 -2081 -1107 -1530 -2215 -2055 -786 -2273 -2612 -2214 -1866 -1119 -2146 -2160 -1828 -1128 -1974 -2214
1571 -2214 -1613 -819 -2783 -2553 -1706 -1290 -2629 -2058 -878 -1167 -1914 -1577 -950 104 -1311 -1768 2 811
1589 811 -1314 -1452 567 604 -1222 -494 1041 1252 -258 -36 927 549 -63 478 1381 1074 1493 980 1571
1608 1571 2136 1007 1098 2019 1901 1087 1754 2721 1839 1539 1522 2375 1801 913 2295 2326 2894 1666 1562 2218
$$ packed form
1481H10J63P50J210j647K94N49Q12j036l66Q49J122j429p49O78J030r85m38Q56
1499B473L20p05q61P64J74O10j475k7J744o91j033j18J962r62k190J218O08p9
1517A732j383R56R32q88j787J105R58j046p81n0J752q29j431L18K017j574j050
1534a049J229P02j665j494J197R09o34q65M23L86n31k05o65J548o41p91l02R67
1552a481L10j472N62R74m23o85J60J269j487l39L98L48P47j027j4L32P00q46k40
1571b214O01P94j964K30Q47M16j339N71J180k89p47L37O27J054j415m57J770Q09
1589H11k125j38K019L7j826P28J535K11j510K22R63l78o12N41R03l07M19n13N91
1608A571N65j129R1R21j18q14O67R67q82l00j7Q53n74q88J382L1N68j228j04O56
$$ plain form
1628 2218 2438 1969 1062 2168 3198 1111 1126 1897 2497 2009 1733 1401 2338 1830 796 1133 2107 1062
1646 1062 1001 601 2264 461 -156 1448 1518 144 -189 693 1053 -92 -184 1028 149 -43 -1215 -377
1664 -377 370 -1110 -1931 -980 -99 -1449 -1443 -933 -183 -1701 -2317 -1117 -1310 -2125 -1709 -1606 -1268 -2184 -2344
1683 -2344 -1954 -1590 -2334 -2442 -2133 -1231 -1940 -2500 -2043 -1777 -2288 -2749 -1998 -1345 -2361 -1857 -2543 -1508 -1557
1702 -1557 -1679 -1758 -772 -1113 -2300 -2033 -582 -843 -1919 -1189 -350 -1531 -2062 -1252 -36 -325 -1368 461
1720 461 552 -63 -780 216 773 418 -319 266 1593 867 -171 873 1511 489 363 965 1560 1537 635
1739 635 1432 1514 1610 1067 1671 1649 1415 911 722 2458 2098 644 1907 2440 2085 1195 1975 2464 1880 1540
1759 1540 1137 2016 1891 1925 1462 1338 1940 777 683 2048 1867 679 1462 2257 1753 544 547 1344 1546 112
$$ packed form
1628B218K20m69r07J106J030k087J5P71O00m88k76l32R37n08j034L37R74j045
1646A062o1m00J663j803o17J604P0j374l33Q82L60j145r2J212q79j92j172Q38
1664c77P47j480q21R51Q81j350ON10P50j518o16J200j93q15M16J03L38r16j60
1683b344L90L64p44j08L09R02p09n60M57K66n11m61P51O53j016N04o86J035m9
1702a557j22p9R86l41j187K67J451k61j076P30Q39j181n31Q10J216k89j043J829
1720D61R1o15p17R96N57l55p37N85J327p26j038J044O38j022j26O02N95k3r02
1739F35P97Q2R6n43O04k2k34n04j89J736l60j454J263N33l55q90P80M89n84l40
1759A540m03Q79j25L4m63j24O02j163r4J365j81j188P83P95n04j209LP97K02j434
$$ plain form
1779 112 -44 319 1276 -61 -119 651 953 -369 -916 428 395 -1049 -181 317 -202 -1421 -595 -753 64
1798 64 -837 -937 -723 -596 -760 -1192 -928 -1152 -1440 -1557 -553 -720 -1978 -2348 -1171 -1866 -2303 -1667 -1364
1817 -1364 -1148 -2362 -1645 -1687 -1426 -1573 -2045 -1648 -1479 -1076 -1865 -1746 -974 -1815 -2639 -1038 -1162 -1248 -1700 -1309
1837 -1309 -1287 -1258 -1206 -941 -303 -1134 -1529 -325 82 -800 -1816 -537 228 -954 -1150 175 385 -327 216
1856 216 421 666 -31 72 527 951 477 965 993 1381 1200 395 2080 1867 768 800 1645 1772 1416 1789
1876 1789 1933 2156 1565 1003 1369 1925 2200 1879 1896 2245 1879 895 1102 2229 1247 1192 1548 1693 759 843
1896 843 1929 1339 1017 1758 938 1242 1643 750 1111 1667 709 261 397 1546 700 -319 263 792 -217
1915 -217 380 -74 821 396 -544 -76 -737 190 -824 -598 -243 -647 -1176 -1253 -346 -936 -2041 -759 -556
$$ packed form
1779A12j56L63R57j337n8P70L02j322n47J344l3j444Q68M98n19j219Q26j58Q17
1798F4r01j00K14J27j64m32K64k24k88j17J004j67j258l70J177o95m37O36L03
1817a364K16j214P17m2K61j47m72L97J69M03p89J19P72q41q24J601j24q6m52L91
1837a309K2K9N2K65O38q31l95J204M07q82j016J279P65j182j96J325K10p12N43
1856B16K05K45o97J03M55M24m74M88K8L88j81q05J685k13j099L2Q45J27l56L73
1876A789J44K23n91n62L66N56K75l21J7L49l66r84K07J127r82n5L56J45r34Q4
1896H43J086n90l22P41q20L04M01q93L61N56r58m48J36J149q46j019N82N29j009
1915b17N97m54Q95m25r40M68o61R27j014K26L55m04n29p7R07n90j105J282K03
$$ plain form
1934 -556 -1462 -1601 -882 -1271 -1194 -1799 -1426 -1270 -2021 -1855 -1476 -1162 -1380 -1867 -1854 -1126 -2064 -2304 -1766 -1190 -1898
1955 -1898 -2230 -1690 -1378 -1877 -1306 -1742 -962 -1127 -1387 -1337 -1634 -647 -1944 -1513 -257 -922 -1178 -711 -571
1974 -571 -212 -1405 -619 -225 -6 -506 -137 242 668 -781 -122 595 112 -113 -25 1104 400 -145 303
1993 303 1485 1031 106 499 714 1107 672 667 1943 1161 1143 1014 1701 1612 1252 1612 2153 1514 1014 1553 2173
2014 2173 1269 1657 1612 1065 1746 1891 1246 1664 1759 1547 864 1412 1837 1637 620 1539 1442 1105 961 1372
2034 1372 1152 570 549 622 645 582 569 377 406 -182 118 796 227 145 -654 112 -32 -692 -757 17 -197 -1059
2056 -1059 -698 -319 -394 -505 -701 -693 -740 -944 -1074 -1218 -878 -1077 -1822 -1422 -1172 -1680 -1832 -1501 -1038 -1758 -1892
2077 -1892 -1086 -1529 -2258 -1818 -1521 -1787 -1378 -1723 -1252 -1377 -1820 -1687 -1012 -391 -1642 -1303 -1332 -1684 -1131 -1513
$$ packed form
1934e56r06j39P19l89P7o05L73J56p51J66L79L14k18m87J3P28r38k40N38N76p08
1955a898l32N40L12m99N71m36P80j65k60N0k97R87j297M31J256o65k56M67J40
1974e71L59j193P86L94K19n00L69L79M26j449O59P17m83k25Q8J129p04n45M48
1993C03J182m54r25L93K15L93m35nJ276p82j8j29O87q9l60L60N41o39n00N39O20
2014B173r04L88m5n47O81J45o45M18R5k12o83N48M25k00j017R19r7l37j44M11
2034A372k20n82k1P3K3o3j3j92K9n88L00O78n69q2p99P66j44o60o5P74k14q62
2056a059L61L79p5j11j96Qm7k04j30j44L40j99p45M00K50n08j52L31M63p20j34
2077a892Q06m43p29M40K97k66M09l45M71j25m43J33O75O21j251L39k9l52N53l82
$$ plain form
2097 -1513 -880 -861 -959 -728 -726 -250 -230 -1035 -530 201 -587 -388 94 181 -45 -792 413 391 -313 -189 1016
2118 1016 789 366 303 989 687 1002 169 671 1795 909 -123 1101 2235 666 1260 1232 1964 755
2136 755 841 1515 1057 991 1534 889 1695 1328 1562 1602 1209 1316 1023 1669 1352 1442 291 1310 1580 1570 1445
2157 1445 1608 1361 1160 981 803 1157 1253 818 446 1183 1349 331 275 1004 283 -53 269 654 633 211
2177 211 -343 481 247 -227 -156 110 -634 -525 -427 157 -357 -529 -919 -901 -1021 -1548 -878 -557 -778 -1140 -852
2198 -852 -1333 -1225 -1998 -2160 -1264 -1460 -1948 -950 -932 -1163 -1670 -1011 -754 -1613 -1957 -1280 -1167 -1628 -1236 -998
2218 -998 -990 -924 -873 -729 -1061 -1070 -1690 -1259 -288 -892 -1218 -491 -361 -418 -682 -83 -168 -681 -218 -63 326 -3 -279
2241 -279 -219 92 204 346 -77 479 258 444 -105 955 846 643 693 1452 966 507 1039 1118 861 1454 500
$$ packed form
2097a513O33J9r8K31KM76K0q05N05P31p88J99M82Q7k26p47J205k2p04J24J205
2118A016k27m23o3O86l02L15q33N02J124q86j032J224J134j569N94k8P32j209
2136G55Q6O74m58o6N43o45Q06l67K34M0l93J07k93O46l17R0j151J019K70j0j25
2157A445J63k47k01j79j78L54R6m35l72P37J66j018n6P29p21l36L22L85k1m22
2177B11n54Q24k34m74P1K66p44J09R8N84n14j72l90J8j20n27O70L21k21l62K88
2198h52m81J08p73j62Q96j96m88R98J8k31n07O59K57q59l44O77J13m61L92K38
2218i98QO6N1J44l32ro20M31R71o04l26P27J30n7k64N99q5n13M63J55L89l29k76
2241b79O0L11J12J42m23N56k21J86n49J060j09k03N0P59m86m59N32P9k57N93r54
$$ plain form
2262 500 1492 1914 1409 1340 1385 1899 1062 955 1785 974 515 1149 1688 791 1214 1233 1273 1219 963 923 1200 1745
2284 1745 372 1174 631 1090 1508 694 913 784 909 910 637 731 150 892 384 734 921 478 113 -109
2304 -109 96 -126 -10 -16 -383 -6 60 -246 -414 -860 -277 -547 -314 -1245 -438 -290 -405 -792 -1050 -932 -1163
2325 -1163 -916 -754 -925 -1109 -1733 -1272 -663 -875 -1395 -1660 -1551 -1311 -1377 -416 -822 -1057 -1771 -1071 -969 -1524
2345 -1524 -1358 -634 -1339 -1438 -1247 -1141 -1018 -782 -1386 -866 -609 -927 -736 -741 -200 -335 -904 -577 -672 301 -207
2366 -207 -651 -305 -267 -493 275 98 -63 154 294 949 59 212 738 283 523 1029 896 628 1123 347
2386 347 1095 1678 602 1265 475 1225 941 806 809 1279 1184 1082 1195 986 1813 1202 977 1469 1115 984 1298
2407 1298 1183 575 794 1169 1283 1021 1020 644 928 421 890 990 1161 1173 906 1053 1035 377 533 800 625
$$ packed form
2262E00R92M22n05o9M5N14q37j07Q30q11m59O34N39q97M23J9M0n4k56m0K77N45
2284A745j373Q02n43M59M18q14K19j29J25Jk73R4n81P42n08L50J87m43l65k22
2304a09K05k22J16ol67L77O6l06j68m46N83k70K33r31Q07J48j15l87k58J18k31
2325a163K47J62j71j84o24M61O09k12n20k65J09K40o6R61m06k35p14P00J02n55
2345a524J66P24p05r9J91J06J23K36o04N20K57l18J91nN41j35n69L27r5R73n08
2366b07m44L46L8k26P68j77j61K17J40O55q90J53N26m55K40N06j33k68M95p76
2386C47P48N83j076O63p90P50k84j35LM70r5j02J13k09Q27o11k25M92l54j31L14
2407A298j15o08K19L75J14k62jl76K84n07M69J00J71J2k67J47j8o58J56K67j75
$$ plain form
2428 625 700 863 111 401 516 34 566 -85 164 283 -53 -387 98 483 -816 170 -258 -241 -385 -608
2448 -608 -475 -148 -1066 -545 -1134 -514 -854 -539 -502 -625 -552 -1568 -825 -1182 -1326 -719 -1021 -1588 -1294 -637
2468 -637 -324 -1303 -1062 -1171 -767 -1474 -1277 -1013 -1390 -911 -1283 -1548 -545 -1425 -1164 -963 -590 -1242 -684 -498
2488 -498 -689 -828 -328 -297 -114 -947 -602 171 -839 -581 -557 -86 -556 656 -391 170 943 486 101 635
2508 635 591 293 831 1118 218 926 1067 1121 692 833 1208 1116 1228 1096 564 887 1195 752 735 1195 1475
2529 1475 586 1294 1417 1477 863 672 870 911 1131 1388 1076 1747 507 541 685 1726 927 570 329 1044
2549 1044 801 918 1351 646 417 716 520 1014 766 0 -178 331 434 -32 -481 270 -107 -1118 -373
2568 -373 -146 -98 -820 -205 -189 -551 -826 -524 -95 -556 -557 -1179 -749 -1075 -841 -1131 -552 -1125 -1528 -773 -673
$$ packed form
2428F25P5J63p52K90J15m82N32o51K49J19l36l34M85L85j299R86m28J7j44k23
2448f08J33L27r18N21n89O20l40L15L7j23P3j016P43l57j44O07l02n67K94O57
2468f37L13r79K41j09M04p07J97K64l77M79l72k65J003q80K61K01L73o52N58J86
2488d98j91j39N00L1J83q33L45P73j010K58K4M71m70J212j047N61P73m57l85N34
2508F35m4k98N38K87r00P08J41N4m29J41L75r2J12j32n32L23L08m43j7M60K80
2529A475q89P08J23O0o14j91J98M1K20K57l12O71j240L4J44J041p99l57k41P15
2549A044k43J17M33p05k29K99j96M94k48p66j78N09J03m66m49P51l77j011P45
2568c73K27M8p22O15J6l62k75L02M29m61jo22M30l26K34k90N79n73m03P55J00
$$ plain form
2589 -673 -851 -1000 -1300 -1372 -1245 -1262 -1292 -867 -1482 -1151 -990 -483 -872 -1653 -942 -1126 -1184 -1194 -1023 -628 -990 -1390
2611 -1390 -513 -1018 -645 -1097 -487 -492 -101 -129 -770 -88 -95 -682 -460 -192 -291 -597 -339 254 418 -432 343 87
2633 87 184 858 458 201 618 165 545 698 952 1062 458 981 246 547 1181 774 1451 682 811 1145 757
2654 757 1111 776 1360 827 1507 1758 937 764 1217 796 1030 809 548 1013 1565 1121 364 1046 943 485
2674 485 987 1045 891 634 1048 924 734 1200 726 265 961 595 265 -226 420 52 -120 -209 32 643 422
2695 422 -84 -320 9 -346 -446 -66 -414 -993 -256 -522 -272 -922 -613 -501 -415 -1274 -564 -686 -978 -772
2715 -772 -1085 -631 -607 -1043 -952 -763 -495 -798 -1364 -918 -1302 -1128 -590 -624 -602 -1360 -1211 -333 -1137 -630 -720 -695
2737 -695 -578 -1130 -760 -1005 -435 -384 -1084 -921 355 -438 -164 -90 -510 -390 114 -319 -213 -659 63 -596
$$ packed form
2589f73j78j49l00p2J27j7l0M25o15L31J61N07l89p81P11j84n8j0J71L95l62m00
2611a390Q77n05L73m52O10nL91k8o41O82pn87K22K68r9l06K58N93J64q50P75k56
2633H7R7O74m00k57M17m53L80J53K54J10o04N23p35L01O34m07O77p69J29L34l88
2654G57L54l35N84n33O80K51q21j73M53m21K34k21k61M65N52m44p57O82j03m58
2674D85N02N8j54k57M14j24j90M66m74m61O96l66l30m91O46l68j72q9K41O11k21
2695D22n06k36L29l55j00L80l48n79P37k66K50o50L09J12Q6q59P10j22k92K06
2715g72l13M54K4m36R1J89K68l03n66M46l84J74N38l4K2p58J49Q78q04N07r0K5
2737f95J17n52L70k45N70N1p00J63J276p93K74P4m20J20N04m33J06m46P22o59
$$ plain form
2757 -596 21 755 -254 243 93 622 468 586 538 -46 -238 901 845 312 630 899 55 401 917 195
2777 195 1052 780 468 886 1204 744 1058 1048 1154 799 510 496 1062 762 1015 779 985 569 336 766 773
2798 773 880 861 719 1539 1047 473 745 833 913 348 550 295 -60 -27 581 508 517 303 14 -383 -82 162
2820 162 -28 209 -588 -256 103 430 202 -541 206 -566 -215 -85 -204 -463 -384 -614 -354 -270 -642 -460 -367
2841 -367 -281 -583 -1283 -704 -141 -1258 -948 -436 -913 -977 -684 -789 -887 -660 -637 -1146 -934 -345 -1227 -1035 -1289
2862 -1289 -1231 -859 -1112 -766 -982 -906 -1180 -690 -1070 -348 -1052 -804 -892 -243 229 -653 -371 -368 -22 -29 -63 -665
2884 -665 -531 212 295 19 323 -628 -565 -35 19 164 173 -90 801 697 9 734 68 562 727 868 237 514
2906 514 841 795 484 1160 560 439 736 1252 845 742 579 455 1356 869 1246 1486 1161 435 954 338
$$ packed form
2757e96O17P34j009M97j50N29j54J18m8n84j92J139n6n33L18K69q44L46N16p22
2777A95Q57k72l12M18L18m60L14j0J06l55k89j4N66l00K53k36K06m16k33M30P
2798G73J07j9j42Q20m92n74K72Q8Q0n65K02k55l55L3O08p3Rk14k89l97L01K44
2820A62j90K37p97L32L59L27k28p43P47p72L51J30j19k59P9k30K60Q4l72J82R3
2841c67Q6l02p00N79N63j117L10N12m77o4K93j05r8K27K3n09K12N89q82J92k54
2862a289N8L72k53L46k16P6k74M90l80P22p04K48q8O49M72q82K82LL46pl4o02
2884f65J34P43Q3k76L04r51O3N30N4J45Rk63Q91j04o88P25o66M94J65J41o31K77
2906E14L27m6l11O76o00j21K97N16m07j03j63j24R01m87L77K40l25p26N19o16
$$ plain form
2926 338 873 75 417 608 560 783 1193 767 109 703 1106 286 11 638 165 95 291 362 590 685 69
2947 69 70 456 -53 201 15 -53 457 68 -534 -40 -44 -565 -345 -5 -461 -359 -747 -426 72 -224 -369 -1449
2969 -1449 -482 -646 -1235 -439 -995 -681 -358 -819 -856 -275 -675 -527 -701 -761 -897 -1298 -943 -662 -774 -838 -902
2990 -902 -489 -387 -933 -263 -771 -169 -469 -299 -1064 -552 -873 -1075 -239 -425 -770 -14 -239 -1145 -678 -32
3010 -32 -167 -416 384 -419 -927 337 -229 -128 429 464 -474 -19 83 546 137 -244 329 -144 280 318 197
3031 197 890 518 1284 369 245 1009 593 997 666 959 287 1159 686 289 981 716 144 141 827 655 187
3052 187 820 540 1159 494 198 498 873 909 951 518 -264 398 50 533 1272 440 1010 840 146 454 303
3073 303 240 -164 -373 -390 213 66 914 -88 -66 65 -332 -286 -238 178 -282 -994 -656 -688 -91 -367 -209 -461
$$ packed form
2926C38N35p98L42J91m8K23M10m26o58N94M03q20k75O27m73p0J96P1K28R5o16
2947F9JL86n09K54j86o8N10l89o02M94mn21K20L40m56J02l88L21M98k96j45j080
2969a449R67j64n89P96n56L14L23m61l7N81m00J48j74o0j36m01L55K81j12o4o4
2990i02M13J02n46O70n08O02l00J70p65N12l21k02Q36j86l45P56k25r06M67O46
3010c2j35k49Q00q03n08J264n66J01N57L5r38M55J02M63m09l81N73m73M24L8j21
3031A97O93l72P66r15j24P64m16M04l31K93o72Q72m73l97O92k65n72lO86j72m68
3052A87O33k80O19o65k96L00L75L6M2m33p82O62l48M83P39q32N70j70o94L08j51
3073C03o3m04k09j7O03j47Q48j002K2J31l97M6M8M16m60p12L38l2N97k76J58k52
$$ plain form
3095 -461 -174 -621 -736 -851 -653 -502 -751 -564 -802 -729 -880 -245 -1192 -1109 -363 -879 -1017 -816 -759 -480 -226
3116 -226 -468 -851 -892 19 -519 -761 -258 -996 -723 -749 -663 -543 -1343 -1042 -724 -377 -561 -879 -529 -361 -309
3137 -309 -974 -241 -277 308 19 -573 3 -47 -166 -34 507 242 492 152 430 508 324 404 423 1055 219 512
3159 512 707 740 109 355 1017 283 726 520 761 526 1115 953 865 758 794 219 821 1115 1179 154 1018
3180 1018 813 719 1207 185 564 641 670 906 323 311 891 713 134 606 348 471 1126 384 -411 682
3200 682 22 467 -80 396 666 305 428 459 262 493 336 213 -306 -644 -153 455 370 -411 -641 41 -127
3221 -127 -177 -438 -232 -910 -403 -394 -990 90 1 -369 -356 -237 -765 -498 -410 -203 -688 -1002 -511 -748 -479 -593
3243 -593 -205 -619 -432 -770 -541 -1303 -571 583 -879 -426 -273 -995 -730 -678 -527 -479 -280 59 -366 -512
$$ packed form
3095d61K87m47j15j15J98J51k49J87k38P3j51O35r47Q3P46n16j38K01N7K79K54
3116b26k42l83m1R11n38k42N03p38K73k6Q6J20q00L01L18L47j84l18L50J68N2
3137c09o65P33l6N85k89n92N76n0j19J32N41k65K50l40K78P8j84Q0J9O32q36K93
3159E12J95L3o31K46O62p34M43k06K41k35N89j62q8j07L6n75O02K94O4j025Q64
3180A018k05r4M88j022L79P7K9K36n83j2N80j78n79M72k58J23O55p42p95J093
3200F82o60M45n47M76K70l61J23L1j97K31j57j23n19l38M91O08q5p81k30O82j68
3221a27n0k61K06o78N07Rn96J080q9l70J3J19n28K67Q8K07m85l14M91k37K69j14
3243e93L88m14J87l38K29p62P32J154j462M53J53p22K65N2J51M8J99L39m25j46
$$ plain form
3263 -512 -133 -384 -760 -371 -444 -686 -173 -296 104 97 -199 86 187 -81 61 47 -85 318 76 -87 520
3284 520 881 368 754 251 -273 224 861 316 989 811 541 501 441 209 583 485 403 753 698 445 595 531
3306 531 605 991 888 359 304 545 654 445 678 691 1020 698 482 194 1039 26 116 448 399 148 1103
3327 1103 652 308 -82 -552 209 -400 118 346 626 -210 530 193 225 278 -208 75 166 -46 -61 -137 -690
3348 -690 -279 248 -284 -179 243 -675 -902 -335 -924 -124 -312 -360 -229 -675 -836 184 -429 -594 -453 -974
3368 -974 -280 -269 -373 -303 -1053 -700 -773 -338 -253 -442 -522 -740 -199 -375 96 -384 -781 -596 -102 -619 -607 -185
3390 -185 -289 -670 -698 -411 -12 -364 -99 -947 -572 237 234 405 -602 135 -280 742 -616 432 -20 -41
3410 -41 -325 672 -42 282 552 391 229 311 8 -159 503 177 611 718 597 175 499 236 540 231 227
$$ packed form
3263e12L79k51l76L89p3k42N13j23M00pk96K85J01k68J42j4j32M03k42j63O07
3284E20L61n13L86n03n24M97O37n45O73j78k70m0o0k32L74r8q2L50n5k53J50o4
3306E31P4L86j03n29n5K41J09k09K33J3L29l22k16k88Q45j013R0L32m9k51R55
3327A103m51l44l90m70P61o09N18K28K80q36P40l37L2N3m86K83R1k12j5p6n53
3348f90M11N27n32J05M22r18k27N67n89Q00j88m8J31m46j61J020o13j65J41n21
3368i74O94J1j04P0p50L53p3M35Q5j89q0k18N41j76M71m80l97J85M94n17J2M22
3390a85j04l81k8K87L99l52K65q48L75Q09lJ71j007P37m15J022j358J048m52k1
3410d1k84R97p14L24K70j61j62Q2l03j67O62l26M34J07j21m22L24k63L04l09m
$$ plain form
3431 227 1134 660 834 1246 436 363 673 34 697 612 312 548 599 903 613 1159 220 563 204 924 330
3452 330 786 600 579 272 -45 848 89 517 537 421 24 344 587 490 38 -464 -123 279 -294 -551 -303
3473 -303 -441 -824 30 -570 -313 -135 -436 -211 -418 -823 -280 320 -603 -187 -580 -71 -604 -292 -351 87
3493 87 -810 -27 -693 -509 -381 -408 -718 72 -501 -670 -260 -913 -994 -829 -506 -303 -919 -77 -1082 -877 -360
3514 -360 -369 -305 -181 44 -529 -614 -208 -292 -338 -712 310 -292 -470 -192 -394 279 -100 308 -3 563 -83 -271
3536 -271 194 393 -236 137 -292 -114 20 284 248 35 60 616 492 -98 253 422 -34 804 103 -245 739
3557 739 190 141 519 596 1107 165 108 349 583 343 605 334 731 199 387 865 682 581 316 750 105
3578 105 -68 129 623 392 551 524 560 810 711 40 904 292 241 325 -76 362 493 -125 148 474 -241 434
$$ packed form
3431B27R07m74J74M12q10p3L10o39O63q5l00K36N1L04k90N46r39L43l59P20n94
3452C30M56j86k1l07l17Q93p59M28K0j16l97L20K43r7m52n02L41M02n73k57K48
3473c03j38l83Q54o00K57J78l01K25k07m05N43O00r23M16l93N09n33L12n9M38
3493H7q97P83o66J84J28k7l10P90n73j69M10o53q1J65L23K03o16Q42j005K05N17
3514c60rO4J24K25n73q5M06q4m6l74J022o02j78K78k02O73l79M08l11N66o46j88
3536b71M65J99o29L73m29J78J34K64l6k13K5N56j24n90L51J69m56Q38p01l48R84
3557G39n49m9L78P7N11r42n7K41K34k40K62k71L97n32J88M78j83j01k65M34o45
3578A05j73J97M94k31J59k7L6K50r9o71Q64o12n1Q4m01M38J31o18K73L26p15O75
$$ plain form
3600 434 -31 -373 -291 4 460 -10 -206 -123 -416 -86 -350 -272 -331 146 115 96 -627 -433 -399 -607 -84 -349
3622 -349 94 -471 -349 -478 -710 -856 -544 -491 -947 -247 -431 -170 -448 223 -418 -150 -473 -379 -187 -923 -532
3643 -532 -31 -37 -34 -365 -34 -614 -470 -588 186 205 -243 368 -268 -852 -624 482 -5 744 -429 -301 -316
3664 -316 266 14 641 -15 284 -73 316 236 61 101 -842 849 313 238 346 72 850 583 330 4 1030
3685 1030 780 425 583 892 -203 827 10 156 427 106 466 414 -5 603 731 877 961 365 285 588
3705 588 182 -329 763 207 318 215 51 -68 256 947 400 -314 481 -206 -266 -18 111 178 98 -316 -174
3726 -174 1 7 -89 -49 153 -516 -186 -805 47 -693 -299 253 -140 -611 -332 169 -170 -218 -452 -170 -511 -525
3748 -525 -224 -656 36 -1074 -499 -189 -581 110 -605 -331 -1007 -286 -176 -458 -463 -945 -183 -600 -525 -1040 -933
$$ packed form
3600D34m65l42Q2K95M56m70j96Q3k93L30k64P8n9M77l1j9p23J94L4k08N23k65
3622c49M43n65J22j29k32j46L12N3m56P00j84K61k78O71o41K68l23R4J92p36L91
3643e32N01oLl31L31n80J44j18P74J9m48O11o36n84K28J106m87P49j173J28j5
3664c16N82k52O27o56K99l57L89q0j75M0r43J691n36p5J08k74P78k67k53l26J026
3685A030k50l55J58L09j095J030q17J46K71l21L60n2m19O08J28J46Q4n96q0L03
3705E88m06n11J092n56J11j03j64j19L24O91n47p14P95o87o0K48J29O7q0m14J42
3726a74J75Or6M0K02o69L30o19Q52p40L94N52l93m71K79N01l39m8k34K82l41j4
3748e25L01m32O92j110N75L10l92O91p15K74o76P21J10k82nm82P62m17P5n15J07
$$ plain form
3769 -933 -333 -624 -49 -431 154 218 -366 -536 -653 -661 -251 -177 -53 198 -436 141 -506 -177 -266 -169 -300 -237
3791 -237 452 -310 85 381 -212 489 339 267 130 -572 32 380 521 -35 698 -362 546 -119 679 653
3811 653 420 454 790 261 719 727 435 513 330 301 371 348 409 703 685 709 35 1020 653 277 -168 -165 562 -293
3835 -293 109 596 405 1092 126 284 218 478 216 592 524 286 193 3 190 -172 -26 197 285 176 -282
3856 -282 38 404 -212 320 -101 303 -595 -326 62 281 236 109 -10 -599 -359 -167 -461 -173 39 -75
3876 -75 -254 282 -865 -219 -456 -616 -229 -729 -516 -83 -398 -556 -377 -2 -396 -371 67 69 -865 -704 -38
3897 -38 388 -655 -244 -338 -449 -784 -645 730 -128 0 -246 415 -38 -244 232 -62 -282 -405 232 -605
3917 -605 -455 -380 152 -221 278 890 -474 804 194 -181 523 21 360 -245 -119 -562 174 625 371 40
$$ packed form
3769i33O00k91N75l82N85O4n84j70j17qM10P4J24K51o34N77o47L29q9R7j31O3
3791b37O89p62L95K96n93P01j50p2j37p02O04L48J41n56P33j060R08o65P98k6
3811F53k33L4L36n29M58Qk92P8j83k9P0k3O1K94j8K4o74R85l67l76m45LP27q55
3835b93M02M87j91O87r66J58o6K60k62L76o8k38r3j90J87l62J46K23Q8j09m58
3856b82L20L66o16N32m21M04q98K69L88K19m5j27j19n89K40J92k94K88K12j14
3876g5j79N36j147O46k37j60L87n00K13M33l15j58J79L75l94K5M38Kr34J61O66
3897c8M26j043M11r4j11l35J39J375q58J28k46O61m53k06M76k94k20j23O37q37
3917f05J50P5N32l73M99O12j364J278o10l75P04n02L39o05J26m43P36M51k54l31
$$ plain form
3937 40 -1 179 -182 15 644 414 -23 444 569 601 178 493 202 161 716 153 -164 549 729 271 255 -53
3959 -53 341 1018 411 639 87 186 528 271 377 3 430 797 144 -256 6 573 694 313 448 604 468
3980 468 -338 439 -20 8 -282 -245 322 -63 -700 -172 -344 -426 -134 -229 474 -59 -268 114 122 -588 -539 -401
4002 -401 69 -464 -404 -85 -403 -1117 -909 -315 -534 -287 -303 -935 -255 -15 -766 -667 229 -812 -64 64 -311
4023 -311 -97 -472 -951 -292 161 -62 -385 -488 -751 -233 46 -679 46 268 -415 -150 167 -564 694 32
4043 32 643 196 375 -555 -151 104 -343 210 -483 148 -46 -67 -255 416 -78 18 919 1053 100 140 535
4064 535 37 582 263 181 268 103 334 419 322 -184 -319 631 642 206 194 221 56 468 12 1000 122 147 -177
4087 -177 322 129 599 477 397 23 512 724 -433 -16 497 148 547 496 -258 193 -350 194 886 451
$$ packed form
3937D0m1J80l61J97O29k30m37M67J25L2m23L15k91m1N55n63l17P13J80m58j6l08
3959e3L94O77o07K28n52R9L42k57J06l74M27L67o53m00K62N67J21l81J35J56j36
3980D68q06P77m59K8k90L7N67l85o37N28j72q2K92r5P03n33k09L82Qp10M9J38
4002d01M70n33O0L19l18p14K08N94k19K47j6o32O80K40p51R9Q96j041P48J28l75
4023c11K14l75m79O59M53k23l23j03k63N18K79p25P25K22o83K65L17p31J258o62
4043C2O11m47J79r30M04K55m47N53o93O31j94k1j88O71m94R6R01J34r53M0L95
4064E35m98N45l19q2Q7j65K31Q5r7n06j35R50J1m36j2K7j65M12m56R88q78K5l24
4087a77M99j93M70j22q0l74M89K12j157M17N13l49L99n1p54M51n43N44O92m35
$$ plain form
4107 451 -147 495 652 306 -25 181 330 254 -318 -233 -854 314 -45 -602 -335 278 -792 -42 289 -742
4127 -742 -350 -113 -362 -836 -109 -75 -592 -465 -437 -386 -234 -726 -7 -785 -387 426 -702 -569 -87 -798 -671
4148 -671 -423 -83 -33 -79 -176 -607 -343 -493 -552 -274 -374 -502 -295 -315 -171 -200 180 -203 134 -7 40 -282
4170 -282 -199 -565 -118 -368 74 -271 452 -143 -245 91 330 -384 -233 -199 -269 918 352 217 -178 429 222
4191 222 795 520 200 -73 -4 478 586 -402 -173 108 239 344 348 54 338 331 105 70 95 -146 102 108 312
4214 312 160 425 280 848 456 462 47 306 884 251 9 -669 636 -6 367 331 -336 521 157 555 33
4235 33 -255 409 652 142 263 403 -442 91 366 307 244 200 323 -135 45 -858 -48 -447 -253 -430 3
4256 3 -383 -257 69 -341 -111 12 -2 -1003 -184 -443 -429 -580 -298 -932 -385 -444 -347 -312 -360 -211 65 -539
$$ packed form
4107D51n98O42J57l46l31K06J49p6n72Q5o21J168l59n57K67O13j070P50L31j031
4127g42L92K37k49m74P27L4n17J27K8N1J52m92P19p78L98Q13j128J33M82p11J27
4148f71K48L40N0m6r7m31K64j50n9K78j00j28K07k0J44k9L80l83L37j41M7l22
4170b82Q3l66M47k50M42l45P23n95j02L36K39p14J51L4p0J187n66j35l95O07k07
4191B22N73k75l20k73O9M82J08r88K29K81J31J05Mk94K84pk26l5K5k41K48OK04
4214C12j52K65j45N68l92Om15K59N78o33k42o78J305o42L73l6o67Q57l64L98n22
4235C3k88O64K43n10J21J40q45N33K75n9o3m4J23m58J80r03Q10l99J94j77M33
4256Cl86J26L26m10K30J23j4j001Q19k59J4j51K82o34N47n9R7L5m8J49K76o04
$$ plain form
4278 -539 -98 -613 -540 -366 -764 -597 -356 720 295 -533 240 -356 -545 559 272 -819 84 -47 -269
4297 -269 -355 -579 -300 210 -355 -56 156 -425 408 -338 -30 290 279 681 25 306 56 -176 -162 279 759
4318 759 -113 -27 847 721 -40 241 -13 363 349 629 -281 426 -270 218 553 -311 455 714 530 5 430
4339 430 -67 -14 438 181 529 453 543 35 742 133 123 508 874 132 445 17 -162 631 119 408 624
4360 624 195 -217 240 538 129 728 48 -64 23 -503 144 -43 -151 -118 -70 -16 -14 -270 -233 -208 217 -145 -173
4383 -173 16 350 526 -205 47 -524 -370 -304 -606 191 -207 269 218 20 -86 -748 9 -620 35 166 401
4404 401 -41 -292 -669 -493 6 -120 -139 -205 60 -363 -269 -52 -317 -485 -503 280 -460 -612 -187 -375 -441 -350
4426 -350 384 -268 -203 -249 -143 -158 89 -291 -357 113 -398 111 259 255 -91 -682 592 -33 127 587 116 954
$$ packed form
4278e39M41n15P3J74l98J67K41J076m25q28P73n96j89J104k87j091R03j31k22
4297b69q6k24K79N10n65K99K12n81Q33p46L08L20j1M02o56K81k50k32J4M41M80
4318G59q72Q6Q74j26p61K81k54L76j4K80r10P07o96M88L35q64P66K59j84n25M25
4339D30m97N3M52k57L48p6R0n08P07o09j0L85L66p42L13m28j79P93n12K89K16
4360F24m29m12M57K98m09N99o80j12Q7n26O47j87j08L3M8N4Kk56L7K5M25l62k8
4383a73J89L34J76p31K52n71J54O6l02P97l98M76n1j98j06o62P57o29O55J31K35
4404D01m42k51l77J76M99j26j9o6K65m23R4K17k65j68j8P83p40j52M25j88o6R1
4426c50P34o52O5m6J06j5K47l80o6M70n11N09J48ml46n91J274o25J60M60m71Q38
$$ plain form
4448 954 182 99 -162 81 -240 -86 -183 289 657 48 -94 160 350 -240 -262 708 427 57 -355 -441 293
4469 293 290 93 219 223 246 431 431 358 545 -75 646 296 -146 618 205 121 801 218 -50 -116 364 288 -109 574
4493 574 -187 435 62 124 125 426 -77 136 862 462 557 -303 -227 -665 224 -160 -280 -216 150 -493 -13 -265
4515 -265 -394 -210 -128 -273 -538 -429 246 -374 254 -443 -219 -622 -719 -619 8 436 -50 -161 -550 -186 -412
4536 -412 103 113 -84 363 -43 -62 266 -291 -596 -410 -51 72 399 -393 -460 -131 -266 1 -46 -105 -835 -102
4558 -102 -269 -397 56 -82 -621 -176 376 30 63 -114 -179 -133 -345 41 -76 238 -607 229 804 341 94
4579 94 209 225 66 91 564 593 261 663 297 538 269 58 140 481 276 -791 166 228 -164 -295 772
4600 772 449 219 -40 343 169 476 -110 -287 559 -31 641 56 550 249 509 14 269 997 -130 340
$$ packed form
4448I54p72q3k61K43l21J54r7M72L68o09j42K54J90n90k2R70k81l70m12q6P34
4469B93lj97J26MK3J85%p3J87o20P21l50m42P64m13q4O80n83k68o6M80p6l97O83
4493E74p61O22l73O2JL01n03K13P26m00R5q60P6m38Q89l84j20O4L66o43M80k52
4515b65j29J84Q2j45k65J09O75o20O28o97K24m03r7J00O27M28m86j11l89L64k26
4536d12N15J0j97M47m06j9L28n57l05J86L59J23L27p92o7L29j35K67m7n9p30P33
4558a02j67j28M53j38n39M45N52l46L3j77o5M6k12L86j17L14q45Q36N75m63k47
4579I4J15J6j59K5M73K9l32M02l66K41k69k11Q2L41k05j067R57O2l92j31J067
4600G72l23k30k59L83j74L07n86j77Q46n90O72n85M94l01K60m95K55P28j127M70
$$ plain form
4620 340 642 -222 152 -153 43 -59 -629 235 -234 -282 -64 -281 256 -95 138 -380 -287 364 -340 -28 242
4641 242 464 -132 -261 -351 -612 98 -106 -307 -32 119 346 556 -780 -276 -197 184 -229 -485 -598 -110
4661 -110 -434 375 -306 -273 -529 -229 -396 -184 -258 -69 -6 -272 -526 -599 -252 -240 -1485 -923 -88 -213 -336
4682 -336 -814 223 -462 -100 293 268 -87 425 739 144 -354 -56 390 335 109 -126 -127 -124 -460 -72 -566 434
4704 434 -485 567 433 320 -168 40 -137 328 -110 554 561 -15 178 -83 3 -297 90 101 -39 174 629
4725 629 143 28 18 -149 652 624 304 44 -151 -275 -274 352 -50 263 -87 231 66 -281 -184 -397 -63 -248
4747 -248 435 -88 -96 84 412 -129 -104 -81 7 50 12 177 -669 233 73 -111 116 -34 -90 200 131 -75 113
4770 113 -194 459 28 -431 346 257 -249 -199 -76 -760 -249 32 -356 823 43 -113 -587 331 -69 -1119
$$ packed form
4620C40L02q64L74l05J96j02n70Q64m69m8K18k17N37l51K33n18R3O51p04L12K70
4641B42K22n96j29r0k61P10k04k01K75J51K27K10j336N04P9L81m13k56j13M88
4661a10l24Q09o81L3k56L00j67K12p4J89O3k66k54p3L47J2j245N62Q35j25j23
4682c36m78J037o85L62L93k5l55N12L14n95m98K98M46n5k26k35jLl36L88m94J000
4704D34r19J052j34j13m88K08j77M65m38O64Pn76J93k61Q6l00L87J1j40K13M55
4725F29m86j15j0j67Q01k8l20k60j95j24JO26m02L13l50L18j65l47R7k13L34j85
4747b48O83n23qJ80L28n41K5K3Q8M3l8J65q46R02j60j84K27j50n6K90o9k06J88
4770A13l07O53m31m59P77q9n06N0J23o84N11K81l88J179p80j56m74R18m00j050
$$ plain form
4790 -1119 177 -450 -300 -401 -66 -675 -482 -44 -161 -413 -192 -232 -68 -666 -458 12 -485 -50 -465 -175
4810 -175 111 -310 -665 159 -215 33 -923 -305 -118 161 -513 -41 -52 -110 -356 -413 762 -187 -229 -136 -24
4831 -24 233 -210 390 43 452 -8 1064 -188 511 193 847 776 421 197 837 396 199 26 -46 -207
4851 -207 543 177 421 -262 283 400 691 244 606 251 -320 907 -293 94 110 718 78 319 -134 290
4871 290 -144 251 175 -158 95 198 282 22 369 211 -75 -109 535 316 429 145 -482 -63 -398 183 692
4892 692 403 287 -123 198 349 -32 -112 388 -530 -214 -469 169 -66 -39 138 419 -40 -18 -211 -367 -186
4913 -186 -734 -48 -320 -399 -416 -19 -468 -433 -120 129 50 -567 -751 -245 -30 -534 57 -148 185 298 367 443
4935 443 115 -425 -314 142 -334 -57 237 -67 503 -47 -288 -89 -163 -33 -44 47 77 -67 -526 -185 -570
$$ packed form
4790a119J296o27J50j01L35o09J93M38j17k52K21m0J64n98K08M70m97M35m15K90
4810a75K86m21l55Q24l74K48r56O18J87K79o74M72j1n8k46n7J175r49m2R3J12
4831b4K57m43O00l47M09m60J072j252O99l18O54p1l55k24O40m41j97j73p2j61
4851b07P50l66K44o83N45J17K91m47L62l55n71J227j200L87J6O08o40K41m53M24
4871B90m34L95p6l33K53J03Q4k60L47j58k86l4O44k19J13k84o27M19l35N81N09
4892F92k89j16m10L21J51l81q0N00r18L16k55O38k35K7J77K81m59K2j93j56J81
4913a86n48O86k72p9j7L97m49L5L13K49p9o17j84N06K15n04N91k05L33J13O9P6
4935D43l28n40J11M56m76K77K94l04N70n50k41J99p4J30j1R1L0j44m59L41l85
$$ plain form
4956 -570 209 323 -462 236 -69 706 687 236 -293 414 647 86 142 205 -83 224 -213 502 99 -550 314
4977 314 -178 -290 -9 627 105 -61 275 697 169 453 432 266 -201 -128 47 60 -77 234 848 465 86
4998 86 -456 229 3 441 323 -99 114 -730 -74 19 110 761 610 23 64 -351 65 144 537 -506 567
5019 567 -408 4 251 228 933 297 -275 52 360 213 -19 -269 -414 -99 -455 218 -46 -142 -571 -282 -91
5040 -91 -78 111 -76 151 -254 -255 -165 -92 -782 -287 -154 -4 -435 -404 -106 4 -568 514 -157 -442 138 -102
5062 -102 -66 -125 236 -320 548 -94 448 -90 -79 -128 301 529 -368 204 -82 282 133 135 364 -305 -45 -271
5084 -271 340 339 3 -266 254 -24 149 -154 381 170 -7 -249 413 -486 -230 -22 589 257 10 132 272
5105 272 -75 192 -637 313 426 410 -61 4 -358 369 -132 453 271 -404 -178 103 -337 245 -99 -9 412
$$ packed form
4956e70P79J14p85O98l05P75j9m51n29P07K33n61N6O3k88L07m37P15m03o49Q64
4977C14m92j12K81O36n22j66L36M22n28K84k1j66m67P3J75J3j37L11O14l83l79
4998H6n42O85k26M38j18m22K13q44O56R3R1O51j51n87M1m15M16P9L93j043J073
5019E67r75M12K47k3P05o36n72L27L08j47k32k50j45L15l56O73k64r6m29K89J91
5040i1J3J89j87K27m05jR0P3o90M95J33J50m31L1K98J10n72J082o71k85N80k40
5062a02L6n9L61n56Q68o42N42n38J1m9M29K28q97N72k86L64j49KK29o69K60k26
5084b71O11jl36k69N20k78J73l03N35k11j77k42O62q99K56K08O11l32k47J22J40
5105B72l47K67q29R50J13j6m71O5l62P27n01N85j82o75K26K81m40N82l44R0M21
$$ plain form
5126 412 389 184 -127 -140 -167 253 627 277 92 -225 246 370 368 270 -418 31 -176 323 72 366 227 430
5148 430 -244 -15 -423 339 -376 41 -205 -87 304 311 -493 -456 -424 -270 209 -450 -389 103 -283 -239 -99 -130
5170 -130 178 246 -152 -178 121 -362 -595 139 -551 -484 -433 -650 -135 -149 -223 141 -581 -419 153 54 -12 299 62
5193 62 193 -308 241 -236 60 -63 -156 255 -28 29 295 30 -110 109 -16 401 -356 434 36 -736 -208
5214 -208 -73 -264 -343 339 169 -281 -326 245 -707 548 70 258 503 720 162 203 -265 -103 128 5 -275
5235 -275 322 427 368 382 704 253 -3 50 -478 -311 577 363 152 187 -313 -26 339 257 -680 610 76
5256 76 596 -57 -168 101 242 403 314 122 138 -316 249 30 -483 365 -28 98 200 -641 457 -157 -243
5277 -243 -223 -53 12 -528 335 75 671 -87 -333 239 -436 -556 267 -26 -272 -274 100 -277 -50 196 -252
$$ packed form
5126D12k3k05l11j3k7M20L74l50j85l17M71J24kr8o88M49k07M99k51K94j39K03
5148D30o74K29m08P62p15M17k46J18L91Pq04L7L2J54M79o59O1M92l86M4J40l1
5170a30L08O8l98k6K99m83k33P34o90O7N1k17N15j4p4L64p22J62N72r9o6L11k37
5193F2J31n01N49m77K96j23r3M11k83N7K66k65j40K19j25M17p57P90l98p72N28
5214b08J35j91p9O82j70m50m5N71r52J255m78J88K45K17n58M1m68J62K31j23k80
5235b75N97J05n9J4L22m51k56N3n28J67Q88k14k11L5n00K87L65q2r37J290n34
5256G6N20o53j11K69J41J61q9j92J6m54N65k19n13Q48l93J26J02q41J098o14q6
5277b43K0J70O5n40Q63k60N96p58k46N72o75j20Q23k93k46kL74l77K27K46m48
$$ plain form
5298 -252 132 -85 -271 -484 -306 140 -273 -337 -9 218 -34 222 285 -378 -711 -394 -536 -255 -266 213 181
5319 181 75 61 -261 -493 -166 -182 -79 249 -404 -283 -42 -224 -283 145 -33 347 -195 286 -691 -341 393
5340 393 -305 -322 335 -283 425 301 197 66 143 33 -98 24 195 220 104 46 141 -138 205 197 -105 -202 -178
5363 -178 -434 -803 603 -294 -360 -74 -228 31 437 519 -469 268 -310 -164 -25 -60 346 435 197 392 451
5384 451 -168 129 583 76 -130 522 123 -107 -211 -48 307 147 -214 620 139 -369 31 220 -212 -140
$$ packed form
5298b52L84k17j86k13J78M46m13o4L28K27k52K56O3o63l33L17j42K81j1M79l2
5319A81j06j4l22k32L27j6J03L28o53J21K41j82n9M28j78L80n42M81r77L50P34
5340C93o98j7O57o18P08j24j04j31P7j10j31J22J71K5j16n8R5k79L43ql02r7K4
5363a78k56l69J406q97o6K86j54K59M06Q2r88P37n78J46J39l5M06Q9k38J95N9
5384D51o19K97M54n07k06O52l99k30j04J63L55j60l61Q34m81n08M00J89m32P2
$$ [...]
8191a33
##END NTUPLES=NMR FID
##END=
