##TITLE=1H_Pr T-105
 DMSO, 8 sc, 
 20.11.2019
##JCAMPDX= 6.0         $$ Bruker NMR JCAMP-DX V2.0
##DATA TYPE= NMR FID
##DATA CLASS= NTUPLES
##ORIGIN= UXNMR, Bruker Analytische Messtechnik GmbH
##OWNER= root
$$ XWIN-NMR		Version 3.5
$$ Wed Nov 20 13:51:45 2019 Russian Standard Time (UT+4h)  she@DPX200
##.OBSERVE FREQUENCY= 200.1315
##.OBSERVE NUCLEUS= ^1H
##.DELAY= (6, 6)
##.ACQUISITION MODE= SIMULTANEOUS
##.ACQUISITION SCHEME= undefined
##.AVERAGES= 8
##.DIGITISER RES= 18
##SPECTROMETER/DATA SYSTEM= spect
##.PULSE SEQUENCE= zg30
##.SOLVENT NAME= CDCl3
##.SHIFT REFERENCE= (INTERNAL, CDCl3, 0, 15.7039)
##AUDIT TRAIL= $$ (NUMBER, WHEN, WHO, WHERE, WHAT)
$$ ##TITLE= Audit trail, XWIN-NMR		Version 3.5
$$ ##JCAMPDX= 5.01
$$ ##ORIGIN= Bruker BioSpin GmbH
$$ ##OWNER= she
$$ F:/spectra/data/she/nmr/H-F/1/audita.txt
$$ ##AUDIT TRAIL=  $$ (NUMBER, WHEN, WHO, WHERE, WHAT)
(   1,<2019-11-20 13:50:37.37 +0400>,<she>,<DPX200>,
      <created by zg, POWCHK disabled, PULCHK disabled
       configuration hash MD5:
       00 E9 B6 7A A2 85 ED C7 34 08 36 98 17 FE 4E 26
       data hash MD5: 16K
       3D 43 91 B3 E2 8C 58 0C A0 B6 28 74 7F E5 75 C1>)
$$ ##END=
$$ 
$$ hash MD5
$$ 98 7A A8 0C 36 F4 93 3B 17 DF 72 1C 91 62 82 B5
##$RELAX= 
##$RELAX= 
##$RELAX= 
##$RELAX= 
##$RELAX= 
##$RELAX= 
$$ Bruker specific parameters
$$ --------------------------
##$DU= <F:/spectra>
##$EXPNO= 1
##$NAME= <H-F>
##$PROCNO= 1
##$TYPE= <nmr>
##$USER= <she>
##$AMP= (0..31)
100 100 100 100 100 100 100 100 100 100 100 100 100 100 100 100 100 100 
100 100 100 100 100 100 100 100 100 100 100 100 100 100 
##$AQSEQ= 0
##$AQ_mod= 1
##$AUNM= <au_zg>
##$AUTOPOS= <>
##$BF1= 200.13
##$BF2= 200.13
##$BF3= 200.13
##$BF4= 200.13
##$BF5= 200.13
##$BF6= 200.13
##$BF7= 200.13
##$BF8= 200.13
##$BYTORDA= 1
##$CFDGTYP= 0
##$CFRGTYP= 5
##$CHEMSTR= <none>
##$CNST= (0..31)
1 1 145 1 1 1 1 1 1 1 1 1 1 1 1 1 1 1 1 1 1 1 1 1 1 1 1 1 1 1 1 1 
##$CPDPRG= <>
##$CPDPRG1= <>
##$CPDPRG2= <>
##$CPDPRG3= <>
##$CPDPRG4= <mlev>
##$CPDPRG5= <mlev>
##$CPDPRG6= <mlev>
##$CPDPRG7= <mlev>
##$CPDPRG8= <mlev>
##$CPDPRGB= <>
##$CPDPRGT= <>
##$D= (0..31)
0 1.2 0 0 0 0 0 0 0 0.06 0 0.03 0 0 0 0 0.0002 0 0 0 0 0 0 0 0 0 0 0 0 
0 0 0 
##$DATE= 1574243436
##$DBL= (0..7)
120 120 120 120 120 120 120 120 
##$DBP= (0..7)
150 150 150 150 150 150 150 150 
##$DBP07= 0
##$DBPNAM0= <>
##$DBPNAM1= <>
##$DBPNAM2= <>
##$DBPNAM3= <>
##$DBPNAM4= <>
##$DBPNAM5= <>
##$DBPNAM6= <>
##$DBPNAM7= <>
##$DBPOAL= (0..7)
0.5 0.5 0.5 0.5 0.5 0.5 0.5 0.5 
##$DBPOFFS= (0..7)
0 0 0 0 0 0 0 0 
##$DE= 6
##$DECBNUC= <off>
##$DECIM= 24
##$DECNUC= <off>
##$DECSTAT= 4
##$DIGMOD= 1
##$DIGTYP= 9
##$DL= (0..7)
0 120 120 120 120 120 120 120 
##$DP= (0..7)
150 150 150 150 150 150 150 150 
##$DP07= 0
##$DPNAME0= <>
##$DPNAME1= <>
##$DPNAME2= <>
##$DPNAME3= <>
##$DPNAME4= <>
##$DPNAME5= <>
##$DPNAME6= <>
##$DPNAME7= <>
##$DPOAL= (0..7)
0.5 0.5 0.5 0.5 0.5 0.5 0.5 0.5 
##$DPOFFS= (0..7)
0 0 0 0 0 0 0 0 
##$DQDMODE= 0
##$DR= 18
##$DS= 0
##$DSLIST= <SSSSSSSSSSSSSSS>
$$ [...]
##$SUBNAM2= <"">
##$SUBNAM3= <"">
##$SUBNAM4= <"">
##$SUBNAM5= <"">
##$SUBNAM6= <"">
##$SUBNAM7= <"">
##$SUBNAM8= <"">
##$SUBNAM9= <"">
##$SW= 24.9337058887773
##$SWIBOX= (0..15)
0 0 2 0 0 0 0 0 0 0 0 0 0 0 0 0 
##$SW_h= 4990.01996007984
##$TD= 16384
##$TD0= 1
##$TE= 0
##$TE2= 300
##$TE3= 300
##$TEG= 300
##$TL= (0..7)
0 120 120 120 120 120 120 120 
##$TP= (0..7)
150 150 150 150 150 150 150 150 
##$TP07= 0
##$TPNAME0= <>
##$TPNAME1= <>
##$TPNAME2= <>
##$TPNAME3= <>
##$TPNAME4= <>
##$TPNAME5= <>
##$TPNAME6= <>
##$TPNAME7= <>
##$TPOAL= (0..7)
0.5 0.5 0.5 0.5 0.5 0.5 0.5 0.5 
##$TPOFFS= (0..7)
0 0 0 0 0 0 0 0 
##$TUNHIN= 0
##$TUNHOUT= 0
##$TUNXOUT= 0
##$USERA1= <user>
##$USERA2= <user>
##$USERA3= <user>
##$USERA4= <user>
##$USERA5= <user>
##$V9= 5
##$VALIST= <valist>
##$VCLIST= <CCCCCCCCCCCCCCC>
##$VD= 0
##$VDLIST= <DDDDDDDDDDDDDDD>
##$VPLIST= <PPPPPPPPPPPPPPP>
##$VTLIST= <TTTTTTTTTTTTTTT>
##$WBST= 1024
##$WBSW= 4
##$XGAIN= (0..3)
0 0 0 0 
##$XL= 0
##$YL= 0
##$YMAX_a= 352555
##$YMIN_a= -162128
##$ZGOPTNS= <>
##$ZL1= 120
##$ZL2= 120
##$ZL3= 120
##$ZL4= 120
##$ABSF1= 10
##$ABSF2= 0
##$ABSG= 5
##$ABSL= 3
##$ALPHA= 0
##$AQORDER= 0
##$ASSFAC= 0
##$ASSFACI= 0
##$ASSFACX= 0
##$ASSWID= 0
##$AUNMP= <proc_1d>
##$AZFE= 0.1
##$AZFW= 0.1
##$BCFW= 1
##$BC_mod= 2
##$BYTORDP= 1
##$COROFFS= 0
##$CY= 11.3945322036743
##$DATMOD= 1
##$DC= 2
##$DFILT= <>
##$DTYPP= 0
##$F1P= 16.9975609425685
##$F2P= -3.02152046262296
##$FCOR= 0.5
##$FTSIZE= 0
##$FT_mod= 4
##$GAMMA= 1
##$GB= 0.15
##$INTBC= 1
##$INTSCL= 1
##$ISEN= 128
##$LB= 0.24
##$LEV0= 0
##$LPBIN= 0
##$MAXI= 10000
##$MC2= 0
##$MEAN= 0
##$ME_mod= 0
##$MI= 1.114404
##$NCOEF= 0
##$NC_proc= 0
##$NLEV= 6
##$NOISF1= 3.799351
##$NOISF2= 2.8
##$NSP= 1
##$NTH_PI= 0
##$NZP= 0
##$OFFSET= 15.70392
##$PC= 1
##$PHC0= -9796.489
##$PHC1= 27.00086
##$PH_mod= 1
##$PKNL= yes
##$PPARMOD= 0
##$PSCAL= 0
##$PSIGN= 0
##$REVERSE= no
##$SF= 200.130013532006
##$SI= 16384
##$SIGF1= 3
##$SIGF2= 2
##$SINO= 400
##$SIOLD= 16384
##$SREGLST= <1H.CDCl3>
##$SSB= 0
##$STSI= 0
##$STSR= 0
##$SW_p= 3612.71676300578
##$SYMM= 0
##$S_DEV= 0
##$TDeff= 0
##$TDoff= 0
##$TI= <>
##$TILT= no
##$TM1= 0
##$TM2= 0
##$TOPLEV= 0
##$USERP1= <user>
##$USERP2= <user>
##$USERP3= <user>
##$USERP4= <user>
##$USERP5= <user>
##$WDW= 1
##$XDIM= 8192
##$YMAX_p= 0
##$YMIN_p= 0
$$ End of Bruker specific parameters
$$ ---------------------------------
##NTUPLES= NMR FID
##VAR_NAME=  TIME,          FID/REAL,        FID/IMAG
##SYMBOL=    X,             R,               I
##VAR_TYPE=  INDEPENDENT,   DEPENDENT,       DEPENDENT
##VAR_FORM=  AFFN,          ASDF,            ASDF
##VAR_DIM=   8192,          8192,            8192
##UNITS=     SECONDS,       ARBITRARY UNITS, ARBITRARY UNITS
##FACTOR=    0.0002004,     1,               1
##FIRST=     0,             0,               0
##LAST=      1.6414764,     0,               0
##MIN=       0,             -162128,         0
##MAX=       1.6414764,     352555,          0
$$ Real data points
##PAGE= N=1
##DATA TABLE= (X++(R..R)), XYDATA
$$ [...]
2094C56j73j41j82M20k29n80N92j78K32j08J56M0l25l8lN60k07j47j89L87l72
$$ 356 183 42 -140 280 51 -529 63 -115 117 9 165 205 -120 -158 -161 399 192 45 -144 243 -129
2115a29K42q1k79L04k59O9J55K84j18l67K91L7k08j79Q07k13o89J1P33m4l90n65
$$ -129 113 32 -247 57 -202 -133 22 306 188 -179 112 149 -59 -238 569 356 -333 -322 411 367 -23 -588
2137e88R65m74k25M17K27r2m06R6L91k35n16N00N45o79m11M23K21k62k47N88j43
$$ -588 377 -97 -322 95 322 230 -176 -80 311 76 -440 60 605 -74 -485 -62 159 -103 -350 238 95
2158I5j95j06L36J03j084M22Q24K9q44J84N69k79n51M12N10p43k53L89R72o32
$$ 95 -100 -206 130 233 -851 -429 395 424 -420 -236 333 54 -497 -85 425 -318 -571 -182 790 158
2178A58q18O88P84j150l08J174P4n94n34R33pr25K2J286m12q10O3J338n26j079
$$ 158 -660 28 812 -338 -646 528 602 8 -526 407 400 -525 -503 783 371 -439 -376 962 436 -643
2198f43O74J117q40j213P89J195j057q04P19R48r21r09P87O13o92p01J332M29
$$ -643 31 1148 308 -905 -116 1079 22 -782 -63 885 -36 -945 -158 455 -237 -938 394 823
2216H23j176l58J159K21j380M48R58Oj635M86J560r39j244O75J229p06j175J169
$$ 823 -353 -711 448 669 -711 -263 695 701 -934 -448 1112 173 -1071 -396 833 127 -1048 121
2234A21J267j545r27R61J208j363o33J421N28j671j35J664j9j815o0J972o6j829
$$ 121 1388 -157 -1084 -123 1085 -278 -911 510 1038 -633 -768 896 877 -938 -998 974 908 -921
2252i21L7J618J40j687O87J233n55j565Q89J223j093j094J251J085j487j038J334
$$ -921 -884 734 874 -813 -126 1107 552 -1013 -124 1099 6 -1088 163 1248 -239 -1277 57
2269E7J078j517n20J646M61j842l64J915pj859M9K004k75k092M30K327r92j374
$$ 57 1135 -382 -902 744 1205 -637 -1001 914 907 -952 -903 1101 826 -1266 -836 1491 499 -875
2287h75K63J561n39j359R17J364j415j023J302J008j404j419J861R95j672r16
$$ -875 -612 949 410 -949 -32 1332 -83 -1106 196 1204 -200 -1619 242 1237 -435 -1351
2303a351J872O05j915j99J907p5j893M10J787o25j752N12K067q07j857J059J784
$$ -1351 521 1126 -789 -988 919 844 -1049 -639 1148 523 -1229 -717 1350 543 -1314 -255 1529
2320A529j369j371R87J908j889j102J588J051j407j142J709Q39k143r13K482Q72
$$ 1529 160 -1211 -224 1684 -205 -1307 281 1332 -75 -1217 492 1331 -812 -1725 757 1629
2336A629k570l00K381j13k225N94J761j79k134L56K096r95j667R59K035j363k006
$$ 1629 -941 -1241 1140 1027 -1198 -604 1157 978 -1156 -800 1296 301 -1366 -407 1628 265 -1741
2353a741J718J271j226j398J553J317k033r39K187N64k191l35K128L10k322q1
$$ -1741 -23 1248 22 -1376 177 1494 -539 -1478 709 1273 -918 -1253 875 1185 -1137 -1218
2369a218K553l00k261M68J972n28k272J403J589j142j638R50J873j307j922J823
$$ -1218 1335 1035 -1226 -758 1214 686 -1586 -183 1406 264 -1374 -424 1449 142 -1780 43
2385D3J522j794j196J709J345k066q81J891Q48k537J28K355l81k147N0K204o5
$$ 43 1565 -229 -1425 284 1629 -437 -1318 573 1421 -1116 -988 1367 986 -1161 -1111 1093 1028
2402A028k229J21K370k13k559M94K533j049j890R98K204j733j685J672J666k065
$$ 1028 -1201 -1080 1290 1077 -1482 -988 1545 496 -1394 -396 1808 75 -1610 62 1728 -337
2418c37j492K410P37j780r28K117N38j702n68J626L73k082J65K191m08k180L83
$$ -337 -1829 581 1318 -462 -1390 727 1265 -437 -1005 621 994 -1088 -923 1268 860 -1320 -937
2435i37K229l71k288J175J531j059j688J405J809k073j344J702J246j861r60J967
$$ -937 1292 921 -1367 -192 1339 280 -1408 -3 1806 -267 -1611 91 1337 -524 -1484 483
2451D83J013k171q05K225N52k414M26K158n18k327L54K342p95j766O23J985j164
$$ 483 1496 -675 -1480 745 1297 -1117 -691 1467 949 -1378 -1024 1318 523 -1243 -620 1365 201
2468B01j608J321J712j121k138J501J537j432j383J812J243j960j341K247O26
$$ 201 -1407 -86 1626 505 -1633 -132 1405 -27 -1410 402 1645 -315 -1656 591 1217
2483A217k078l53K291Lk240j25K294K98k193J68J890o19j954J259J489r79j922
$$ 1217 -861 -1214 1077 1080 -1160 -1285 1009 1307 -886 -718 1172 553 -1401 -142 1347 368 -1554
2500a554J272J808j657j139J547J221j783j326J771R19j437q75K062N24k543M5
$$ -1554 -282 1526 -131 -1270 277 1498 -285 -1611 160 1079 -358 -1233 829 1353 -1190 -1145
2516a145K249K7k245M75J920m84k136O96K105r18k156J048J932j056j460J185
$$ -1145 1104 1131 -1114 -639 1281 797 -1339 -643 1462 544 -1612 -564 1368 312 -1148 37
2532C7J242j480j367J420J691j632j153J544O33j782k06J799N55k087l23J851
$$ 37 1279 -201 -1568 -148 1543 -89 -1242 302 935 -847 -1053 746 1301 -786 -1109 742
2548G42J86j895N23J774m12k062L77J974o47j680J066J221j184j261J385R39j035
$$ 742 928 -967 -444 1330 918 -1144 -767 1207 560 -1120 -54 1167 -17 -1278 107 1046 11
2565A1j236J611P83j830m69J619R33j964p90J753O14j569l35J896k29j953L66
$$ 11 -1225 386 1169 -661 -1130 489 1422 -542 -1332 421 1035 -534 -869 1027 798 -1155 -789
2582g89J861j49j789O14J565p74j875R34J822j416q84Q42J011j288q64J625Q40
$$ -789 1072 923 -866 -252 1313 539 -1336 -402 1420 4 -880 -38 973 -315 -1179 446 1286
2599A286j481r57J796L75j530o67K107K22k027j03J670k1j707L56J899r02j388
$$ 1286 -195 -1152 644 1019 -511 -1178 929 1151 -876 -979 691 670 -1037 -681 1218 316 -1072
2616a072Q82J421o30j672J231R28j105j313J004J533j405j132J516K65j112l71
$$ -1072 -190 1231 601 -1071 160 1088 -17 -1330 -326 1207 -198 -1330 186 451 -661 -1032
2632a032J375N59j399n68J645L77j638L1J523k92j502P62R16n21j157Q62R87q37
$$ -1032 343 902 -497 -1065 580 957 -681 -650 873 581 -921 -159 757 236 -921 -59 928 91
2650I1j325J439R28j444m71R17Q91j433m72J193K55r30p40J641J34j219k93J402
$$ 91 -1234 205 1133 -311 -782 135 1026 -407 -879 314 569 -361 -1101 540 674 -545 -838 564
2668E64q8j246K27J185o9j538K75J502m73j176P03J039p61j072Q58Q48r41n90
$$ 564 476 -770 -543 642 573 -965 -690 812 339 -837 -134 905 144 -928 -70 778 -163 -753
2686g53J052P56j297o92J364M76j455l10J134N66j409O2J296n35r87M07R96k53
$$ -753 299 1055 -242 -934 430 906 -549 -859 275 841 -568 -506 790 255 -732 -325 671 418
2704D18j272O35J135o28r09K89J030l92j154Q98M78o07n28Q42N28j172l19J100
$$ 418 -854 -219 916 288 -621 -332 698 306 -848 50 528 -79 -607 235 763 -409 -728 372
2722C72L12j219j87J455Rj182k9Q58k33r32N83R44p46p47M49J002n01n97O5Q81
$$ 372 684 -535 -722 733 742 -440 -469 389 156 -776 -193 751 5 -742 -293 709 208 -389 -324 557
2742E57n20o56P58M95o07k77L56M66p67l95R27K32p09k82J105j35j045LQ25j03
$$ 557 37 -619 139 634 27 -250 106 572 -195 -590 337 569 -140 -422 683 548 -497 -494 331 228
2762B28o32O4P58J34j206O44P04o33o24N28O14m58o85O61O12p73m95N21K53k27
$$ 228 -404 -340 418 552 -654 -10 694 61 -563 -35 579 121 -564 97 709 -64 -559 -38 215 -12
2782a2m16P13J39q52L74N16k38p42M24M98j27q25K25R25j95n65k07O10l51k29
$$ -12 -428 285 424 -428 -54 462 224 -518 -94 404 277 -548 -323 602 407 -158 -365 245 -106 -335
2802c35K86O06n80l54L61L46k46q00Q98M15p50j14L92K99r56L94M80n0o50j9N39
$$ -335 -49 557 -23 -377 -16 330 84 -716 182 597 -153 -267 125 424 -532 -138 342 292 -358 -377 162
2823A62O8p34K25M72L4l56j29M23j42Q1p1R8k03j26J50M66o12Oj18N02k48l35
$$ 162 230 -504 -279 193 227 -129 -258 165 23 104 33 131 -72 -198 -48 418 -194 -188 -306 196 -52 -387
2845c87O86k6o08K19K44m3k91K9L25p9j24j77K87p7k43J49M61l98k5M9J60j40
$$ -387 299 273 -335 -116 128 85 -206 -177 148 69 -55 -232 55 -22 -265 -116 345 -53 -78 -29 131 -9
2867iM1k4k2Q2k95K97Qk78M8K46L06l78j6j5K12k99J40L78k35m6m8J45l69J64
$$ -9 32 8 -14 68 -227 70 78 -200 -152 94 400 22 6 -9 203 -96 44 422 187 141 93 238 -131 33
2891C3K4K0q9l03M45j86J37J16m1l15k1K07l05L51k15j56K25J77m29J97J0M4r2
$$ 33 57 77 -12 -315 130 -56 81 197 156 -159 -180 27 -278 73 -142 -298 -73 104 -325 -128 -118 -74 -166
2914a66J16k0m1L05k82k1k28M89L9k44j55J57J16O8kn5J52j23j44Kpp1n3J10j8
$$ -166 -50 -70 -111 194 -88 -109 -337 152 191 -53 -208 -51 65 133 131 76 228 105 -39 -37 -44 -115 -168 -58 -76
2939g6l0J72l02L30k83J85K3Qj48N12j59k50L5L01m97J21L85o69K3N7K47P8k45
$$ -76 -106 66 -236 94 -189 -4 19 27 -121 391 232 -18 17 318 -179 -58 327 -342 -319 -262 -15 63 -182
2962a82J02K2J5k10J12M06l30R5j46P4L53o16M03l5K04m95J71J93j88k81L16J48
$$ -182 -80 -58 -43 -253 -141 265 -65 30 -116 -42 311 -305 98 63 267 -228 -57 136 -52 -333 -17 131
2984A31j41m21K30N58k18k48k9M40m44J48N8p0k70O8K91j37q1m7M96l99l57J71
$$ 131 -10 -431 -201 357 139 -109 -138 302 -142 6 64 -6 -276 -208 83 -54 -135 -182 314 -85 -442 -271
3006b71J98L65l39K91q7k92o3J35J65k81J3j5L20m93K4M86M03p76r0N79k30k35
$$ -271 -73 292 -47 244 157 -135 -198 -63 102 -179 -166 -181 139 -354 -330 156 559 -217 -307 272 42 -193
3028a93j21M16m5j75J6M35k03l12J35K80k36m07M13L00j15n15K75M84m57n47N73
$$ -193 -314 102 57 -118 -102 333 130 -182 -47 233 -3 -410 3 303 188 -327 -52 432 -25 -572 1
3049AJ81j49m29M52p4k1j73K89J96m96j8L41r1k15LK59j3l20M83K5l01l27M14
$$ 1 182 33 -396 56 -18 -39 -212 77 273 -223 -241 100 9 -206 -203 56 43 -277 206 231 -70 -397 17
3072A7J51k48k16K45L77k79m41Q68l93j06k32M61K7m00l5M03m7k62j19M67l09
$$ 17 168 -80 -296 -51 326 47 -394 474 81 -25 -257 204 231 -169 -204 199 152 -110 -229 238 -71
3093g1l22J00O33j91l89P9Q21n92m43L83L03l70o50Q99o1k21k91J69N80o57j57
$$ -71 -393 -293 340 149 -240 -161 660 68 -375 8 311 -59 -709 190 129 -92 -383 -214 366 -291 -448
3114d48P45pp25j03O48j02j55l73R08m78k98K58O25k79o54L00L31l1p71M42M18
$$ -448 297 290 -435 -538 110 8 -147 -520 388 -90 -388 -130 495 216 -438 -138 193 162 -609 -167 251
3135B51k93j56J08N68n75j65L49L35m94k13N70Q6o46J60M93N6r03P1P23l48m44
$$ 251 -42 -198 -90 478 -97 -262 87 422 -72 -285 285 371 -275 -115 378 434 -469 -398 325 -23 -467
3156d67M15M34l80l48L51M60l78p35P58M02o03n71Q09L16l32o15N79L57p39Q6
$$ -467 -52 382 2 -346 5 465 87 -648 110 512 -91 -662 147 463 131 -484 95 452 -287 -201
3176b01L35L94q75J46M30j93l83q6M76K37p97K67Q06n70o08N41N27j85o00M39
$$ -201 134 528 -347 -201 229 36 -347 -433 43 280 -517 -250 556 -14 -622 -81 446 261 -339 100
3196A00K95m29l56O34K4k78k77M05M63n52l62M13J96n97qO73k01k46k53Q31j53
$$ 100 395 -34 -390 244 268 -10 -287 118 581 29 -333 80 276 -321 -329 344 143 -103 -356 475 322
3217C22o20L10K95m14j85L10L00J34q97J29R37o38k99L68L39l85m20N35K26n55
$$ 322 -298 12 307 -107 -292 18 318 452 -445 -316 621 -17 -316 52 391 6 -414 121 347 -208
3237b08J40K10j42k41n8N58Q7o76M01K73j81o98N44O06n38l38j46R68m32j16K72
$$ -208 -68 142 0 -241 -299 259 346 -330 71 344 163 -535 9 615 77 -261 -407 561 129 13 285
3258B85k73O4m88N37J03l26n15Q62J23p15K34O35j83o01j29O67k1o88J69O73r7
$$ 285 12 76 -412 125 228 -98 -613 249 372 -343 -109 526 343 -258 -387 280 259 -429 -260 413 316
3279C16p18K41M56j99m38K23O30p38l02Q25J24n36m60O54N30p26k16N71J65p33
$$ 316 -402 -161 295 96 -342 -119 511 -227 -529 296 420 -116 -576 78 608 -118 -334 237 402 -331
3299c31O3M38K98o27J7Q38o95m59L54N26O4q63K36M33k92l33J90P80q10n10P15
$$ -331 -268 170 468 -159 -142 696 1 -458 -104 422 486 -377 -141 292 0 -333 -143 637 -173 -683 32
3320C2M90p93Q6N51O0o39k59J30O24m70l6M19j59l10R7J004o81l52P3L80J54r10
$$ 32 522 -271 -185 366 426 -213 -472 -342 282 -188 -224 195 36 -274 -177 827 146 -206 -133 247 401 -509
3342e09N09M45l68m06K75O28m69o64O08L64o77k29N28R1l54k34O33j41j74Q8L33
$$ -509 0 445 77 -329 -54 574 105 -559 49 413 -264 -493 35 126 -228 -462 171 30 -144 -56 277
3363B77Lm65p2N78k98m76K20O67l79m50K06Q07m29l77K29K62k09m28J97P47q31
$$ 277 280 -185 -257 321 23 -453 -233 434 55 -395 -189 618 189 -188 41 303 94 -334 -137 610 -221
3384b21P7M08j14l76r6M88K84n88K5J22K5k6PL16k54m06K31N44j88p50K76O38
$$ -221 -144 264 150 -226 -322 166 450 -138 -113 9 34 8 15 331 77 -329 -98 446 258 -492 -216 422
3406D22m42k95N0O48n14q3M14j94m25J11L29O23q65OK91jk85J15K30j51k44o8
$$ 422 -20 -315 -265 383 -131 -214 200 6 -419 -308 21 644 -221 -215 76 75 -210 -95 135 -16 -260 -328
3428c28N73q3o58J33N15M2m53J23O24o04j72K38L34l60o56R50K93r07j32N75K5
$$ -328 245 162 -496 -363 152 194 -259 -136 488 -116 -288 -50 284 -76 -732 218 511 -396 -528 47 72
3449G2J8m44L99J99n53J02N37j23n39J67N70N1q73L20L84L1o26J16N91m18k89
$$ 72 90 -354 45 244 -309 -207 330 207 -332 -165 405 456 -417 -97 287 318 -308 -192 399 -19 -308
3470c08K47Q1k70k38N95K92n59QL69k50j87k07O75L5l32J6M53m8n19P0L96o2l82
$$ -308 -61 20 -250 -488 107 399 -160 -152 217 -33 -220 -427 248 283 -49 -33 420 372 -147 -77 319 257 -125
3493a25P0J31n8j72J44M79o13k16O89J14o09l3L53P5m94P1L28O4l27l21J82P89
$$ -125 -55 76 18 -154 -10 469 -144 -360 329 443 -166 -199 154 229 -265 -194 134 198 -129 -450 -268 521
3515E21o80m4L20r8k86n8P50m85j74J72J96j16jJ36J78j39n4k72M35m61j78N27
$$ 521 -159 -203 117 19 -267 -325 425 -60 -234 -62 134 18 17 153 331 192 138 -134 301 -160 -338 189
3537A89K29k98m27L74K87n78p1N84j04l68j43P73l65k24r8N03o3m68Q8N31m77
$$ 189 418 120 -307 67 354 -224 -295 289 185 -183 -326 447 82 -142 -240 263 200 -268 -180 351 -126
3558a26r3J39M16k23j07K6K13k90j8K87R5m21j10L17J41n54N91J01j52l57j42
$$ -126 -219 -80 336 113 6 32 245 -45 -63 224 319 -102 -212 105 246 -308 283 384 232 -125 -267
3579b67L83j46l29J15N35k52Q4k45K66K85n95K6L61l97L2K67J57n19p2M24N2p0
$$ -267 116 -30 -359 -244 291 39 123 -122 144 429 -166 -140 221 -176 -144 123 280 -239 -311 113 165 95
3601I5p2O2jl31J27K65k43K66j79L54r8n45J84Q1j1j32N04o3j43k46j16N00j83
$$ 95 23 85 84 -247 -120 145 -98 168 -11 343 245 -300 -116 -35 -46 -178 326 263 120 -126 -242 258 75
3624G5k06K03L45m48m4J31j89J39l25O03j97l10k64L05K35l44K93J44L9k37q0
$$ 75 -131 72 417 -31 -75 56 -133 6 -319 284 87 -223 -487 -182 53 -291 2 146 185 -52 -132
3645a32L51l1l86Q7M02j10j9j78K32k87j25K28M1m6k88L78J16l70J45n3n3j03
$$ -132 219 188 -198 -111 291 181 162 -16 216 -71 -196 32 73 27 -261 117 233 -137 8 -45 -98 -201
3667b01J10K62k50J17j62R4q7J29J50m03R2J39l4M41l26j10K45k82P5k14R5Nr4
$$ -201 -91 171 -79 38 -124 -30 -117 12 162 -241 -149 -10 -44 397 71 -39 206 -76 -1 -215 -120 -115 -209
3690b09K12j70J42q2OJ63L5n23O14j17j35P2J8J60k57k21K26J37l1k21j08K57
$$ -209 3 -167 -25 -107 -101 62 97 -426 188 71 -64 8 26 186 -71 -292 -66 71 40 -181 -289 -32
3712c2j17J58k49J60K05j08k9J54Q5k76K3O6L1J43k88k6O2O2R6L4o6J7L4K0O8
$$ -32 -149 9 -240 -80 125 17 -12 142 227 -49 -26 40 71 214 -74 -100 -38 24 120 154 88 105 139 159 227
3737B27KJ9k56m5O5L2k40Q7M9J75k28J58m9J48n7J4l26L50l12J76K04k46n0L5
$$ 227 229 248 -8 -53 12 44 -196 -109 -60 115 -113 45 -4 144 87 101 -225 125 -187 -11 193 -53 -103 -68
3761f8J9n8M7K13l06m7K43J21J37l97J59k38k3L95o8m06K82j08L46k42K5j17p9
$$ -68 -49 -107 -60 153 -153 -200 43 164 301 -96 63 -175 -198 197 129 -277 5 -103 243 1 26 -91 -170
3784a70L88k76L52l87J10O5p1j3j44m6J06q5L23n19K03L07k50qM72m20J46J05
$$ -170 218 -58 294 -93 17 82 11 -2 -146 -192 -86 -171 152 -367 -164 143 -107 -115 357 -63 83 188
3806A88M8r3l35M49j94l5k37M77l4m43N5L48l07K69k27M01k55n47P32P1l22o3
$$ 188 236 143 -192 257 63 28 -209 268 234 -209 -154 194 -113 156 -71 330 75 -472 260 331 9 -54
3828e4k4J86k2j55K14J9l04O2J89l7m4m10K78M52m23QL62k20p7j94N16l90QL20
$$ -54 -78 108 86 -69 145 164 -140 -78 111 74 30 -380 -102 350 -73 -65 297 77 0 -194 322 -68 -60 260
3852B60m40K20p2k58M90J4k52J64o2j49O2k53K90m7j67R9L07n15M00K16j70j84
$$ 260 -180 40 -32 -290 200 214 -38 126 64 -85 -23 -276 14 -33 -200 -101 206 -309 91 307 137 -47
3874d7k22M78K1m04L2o1K80o76M48K91N1j86k74L78m8k20N4L19k75j70J65L15
$$ -47 -269 209 230 -174 -142 -203 77 -599 -151 140 191 5 -269 109 61 -159 -105 214 -61 -231 -66 249
3896B49l93j20M65j9k23P5L9K83k74j35K58Q1m74J57K60m18K0J3O45j57n47O7
$$ 249 -144 -264 201 182 -41 34 73 356 82 -53 205 286 -188 -31 229 -189 -169 -156 489 332 -215 -148
3918a48O55m54j80J67N39n93j30K66j23P3l58O66J6o53L31j92L81k53k81N92o4
$$ -148 507 53 -127 40 579 -14 -144 122 -1 72 -286 380 396 -257 74 -118 263 10 -271 321 257
3939B57n19J23M70k49m62O04m0j91m28M31L56j76p28P42O1j65m11M08K31k88m18
$$ 257 -262 -139 331 82 -380 224 184 -7 -435 -4 352 176 -552 190 251 86 -325 83 314 26 -392
3960c92O76j23l94l8N90j26k55j08M46n9n32J44K63J36m56J58L49k97k23O47q6
$$ -392 284 161 -233 -271 319 193 -62 -170 276 217 -315 -171 92 228 -228 -70 279 -18 -241 406 320
3981C20k01l72K36m4K08m62K60K11r7m94M89K71m62N8K50K3m34O7L83j27m72L34
$$ 320 119 -253 -17 -61 147 -315 -55 156 59 -435 54 325 -137 -79 171 194 -240 -173 210 83 -389 -55
4003e5L85j51p82N64M01k25l78J58M70l73k46K00M07m69k14L75M5k42N1L6M69
$$ -55 330 179 -603 -39 362 137 -241 -83 387 14 -232 -32 375 -94 -308 67 112 -130 -79 -43 426
4024D26p18J2L21M87p68J9O16k31m26O4M25j36o5NK37q9n12L51L94n36N3J60M17
$$ 426 -292 -280 41 528 -240 -221 395 164 -262 -198 227 91 26 31 268 179 -333 18 412 -124 -71 89 506
4047E06m31m17L46N03r77K46L82J12l24j54M85j07r1k59Q09k81o00K28K69j79
$$ 506 75 -342 4 507 -470 -224 158 270 -54 -208 277 170 79 -180 629 348 -252 -24 245 66
4067F6l37R0P77n25p20L33P05m64j95K84K34m25q6M21K45n60j40M45J98l96j87
$$ 66 -271 -181 596 71 -649 -316 389 -75 -270 14 248 -177 -263 158 403 -157 -297 148 346 -50 -237
4088b37O61j22p09L65M94k25n47J47M27l03k37j11P26l44k50L01L68k08k62j4
$$ -237 424 302 -407 -42 452 227 -320 -173 254 -49 -286 -397 329 -15 -265 36 404 196 -66 -80
4108h0J56m9k38M00Q1r19N13N06j61o11L56L92j69n05l4M57j08l97L49N07k94
$$ -80 76 27 -211 189 270 -649 -136 370 209 -402 -46 346 177 -328 -362 95 -13 -410 -61 446 152
4129A52k74J65L1l69j03M12N53n89l32M05r4K9j44J64L28n66l10Q04m0m41j1M81
$$ 152 -122 43 74 -295 -398 14 567 -22 -354 51 -43 -14 -158 6 334 -232 -542 262 222 -219 -230 251
4151B51m9k97Q3K77k50j65K68K36m35j56M53J63l90q4N00Q0n87j47L10L37o51
$$ 251 202 -95 -12 265 15 -150 118 354 -81 -237 216 379 -11 -95 405 485 -102 -249 61 398 -253
4172b53r1L48Q7j85M3M43l35l85j29Q98k70n62M86%Q8n04L36L20K13j000M28M02
$$ -253 -344 4 91 -94 -51 392 57 -328 -457 441 171 -391 95 95 183 -321 15 335 548 -452 -24 378
4194C78l83l77N56L95j041J82N87j90l06l78P65k64m72N06M6J65m45J96J61P4
$$ 378 -5 -382 174 569 -472 -290 297 107 -199 -577 188 -76 -548 -42 4 169 -276 -80 81 155
4214A55l84j22O93j95p33O41L00p04P9N06%m37l88M91M81n27O7K63k61J5k84M11
$$ 155 -229 -351 342 147 -586 55 355 -349 -270 236 236 -201 -589 -98 383 -144 -77 186 -75 -60 -344 67
4236F7K14m53L5L83j24l60M1K85J62m96L09K16j33m77L61K84k51k90K55L72l75
$$ 67 281 -172 -137 246 122 -238 -197 88 250 -246 63 279 146 -331 30 314 63 -227 28 400 25
4257B5j33M40p2l37K9K40R4m96J15L40O9o74R0P29m49l17L1M90l07l70M92L19
$$ 25 -108 332 260 -77 -48 192 286 -210 -95 245 314 -360 -270 459 10 -307 -276 214 -93 -463 29 348
4279C48k01k13P2O4K17n33L77j58k19Q6M23k18n5k49O29l94j64j55P46k70n87
$$ 348 147 -66 6 70 287 -246 131 -27 -246 -160 263 45 -10 -259 370 -24 -188 -343 403 133 -454
4300d54K01P07j97m69r4N09j46M2QJ01j85J07j51J37pl30L60k08j64Q2Q31o52
$$ -454 -253 454 257 -212 -306 203 57 99 107 208 23 130 -21 116 109 -221 139 -69 -233 -151 680 28
4322B8j63p4P06m85j20p2N40k87l61L59J57l57k64K92L8J63j93J67J65m13rK41
$$ 28 -135 -209 497 12 -108 -180 360 73 -288 71 228 -129 -393 -101 -63 100 -93 74 239 -174 -183 58
4344E8l2J63m92N75k22p5k43K74L06n23J92K46J30p58M03L19l93k49L12K95m51
$$ 58 26 189 -303 272 50 -25 -268 6 312 -211 -19 227 357 -401 2 321 -72 -321 -9 286 -165
4365a65R1K09Q7k13j69L53j13o9j98J81Q0k54r1K99K70m83R4K20r4o0n2J33j6
$$ -165 -74 135 222 9 -160 193 80 11 -187 -6 74 -180 -271 28 298 -185 -91 129 35 -25 -77 56 40
4388D0k01K40k8J10j85k02O14o33L53j16Q8L3k16K54pj86J34J4J9k46O7J55J4
$$ 40 -161 79 51 161 -24 -226 388 -245 108 -8 80 113 -103 151 144 -42 92 106 125 -121 -54 101 115
4411A15J8k31K60R4k87k8M52l99j79J03K41j53r2Q1P7Q0k42J08K21k40q3J51k7
$$ 115 133 -98 162 256 -31 -59 393 -6 -185 -82 159 6 -86 -5 72 152 -90 18 239 -1 -84 67 40
4434D0j8j24J77J95o7m23L27O2j60j42L50j07m64M07K80k20j29n8Q4J17o8M6J46
$$ 40 22 -102 75 270 203 -220 107 169 9 -133 217 110 -354 53 333 113 -16 -74 10 127 59 105 251
4457B51m85J45k9L47k98j29K23K46m46J58J38k74J28j22J19n8j31K8K15K3k65
$$ 251 -234 -89 -118 229 -69 -198 25 271 -175 -17 121 -153 -25 -147 -28 -86 -217 -189 26 49 -216
4478b16j7K48J09m38J77K2K36k54Q2L22j87l23L67p2m9M1J25rj2q2m4O9j29L0
$$ -216 -233 15 124 -314 -137 -115 121 -133 -51 271 84 -239 128 56 7 48 173 164 152 70 26 95 -34 -4
4502do6M03l63l1J51o8M66o62J24J42k78L75j35k11o7J68J77m58M29P7l59N8J56
$$ -4 -70 333 -30 -61 90 22 488 -174 -50 92 -186 189 54 -157 -224 -56 121 -337 92 169 -190 -132 24
4525B4J21K9l39L40jj36K3p4J82k94J06l05P70n81j76L56J19n05L35r7M17j75
$$ 24 145 174 -165 175 174 38 61 -13 169 -125 -19 -324 446 -135 -311 45 164 -341 -6 -103 314 139
4547A39J1Lo0J04m46O65m01j39n1K79J64l85J27J73j00Q5r9J8j7r7M0m5L6j38
$$ 139 150 153 93 197 -249 416 15 -124 -175 104 268 -117 10 183 83 168 69 87 70 -27 13 -32 4 -134
4571a34J11K06j16j04K12m40N9R1J38j25K19M57l42k58J12k2n1M4n4J16k67Q6
$$ -134 -23 183 67 -37 175 -265 -206 -115 23 -102 117 574 232 -26 86 64 13 57 3 119 -148 -62
4593f2K89o0n2Q5j60j6l54L34L19ll98O5J7j22J05J69k62N37l80M8r9J15l95J86
$$ -62 227 167 115 200 40 24 -330 4 323 320 -78 -13 4 -118 -13 156 -106 431 51 99 0 115 -280 -94
4617i4L4P7j05j41L84k57K1R5M6j20O0Pj40J09L55m60K87k29J32j47L83l84L98
$$ -94 -60 17 -88 -229 155 -102 -81 14 60 -60 0 7 -133 -24 331 -129 158 -71 61 -86 297 -87 311
4640C11n98M53n9K16j40k69R2J8J20k02R7J5l22N7J90k00J81r1J27K76N1l44O3
$$ 311 -287 166 107 323 183 -86 6 24 144 -58 39 54 -268 -211 -21 -221 -40 -131 -4 272 323 -21 42
4663D2o0n8R9N2j01k20J30K75Nk26J14J30q8j34j78J87j39l6L13K8j53k61L6O9
$$ 42 -18 -76 23 75 -26 -246 -116 159 164 -62 52 182 94 -40 -218 -31 -170 -206 107 135 -18 -279 -243 -174
4687a74K29j71l09N29m0k84K24l0l36O3K67K57k65L6k9J39j90pL37r6j09j30N10
$$ -174 55 -116 -425 104 64 -220 4 -26 -362 -299 -32 225 -40 -4 -33 106 -84 -91 246 150 41 -89 421
4710D21m32l8KK46J40n75K42M4k51J28k23M53j32l1j25J10k7R5j26J67r5l54O49
$$ 421 -11 -49 -47 199 339 -236 6 50 -201 -73 -296 157 25 -6 -131 -21 -48 47 -79 88 -7 -361 288
4733B88k03j93j05J77K79l99p4M27l06j03L69j29m6l16K23K90l32J16O0J94n5
$$ 288 85 -108 -213 -36 243 -156 -230 197 -109 -212 157 28 -18 -334 -111 179 -153 -37 23 217 162
4754A62k91J90L52o32j4L85J51m29k80L98L1p1K2q2L67m57K49L9J59n50j54O45
$$ 162 -129 61 413 -219 -233 152 303 -126 -406 -8 23 -48 -26 -108 259 -198 51 90 249 -301 -455 190
4776A90p3j28Q5K49j30j34k42P50n93k69J35K68r7j41K61j25n5j42K19L29n40
$$ 190 117 -11 74 323 193 59 -183 567 -26 -295 -160 108 11 -130 131 6 -49 -191 28 357 -183
4797a83N6M18j20k09j82M82k16m7K2L36j08o37L73M53m67l04%N78K6l68M09k5
$$ -183 -127 291 171 -38 -220 262 46 -1 21 357 249 -388 -15 438 -29 -333 -333 245 271 -97 312 287
4819B87m10k79N88k08n5o3M29k56j39j4M12q7m66L66R5j94N4l80O39j06k70k1
$$ 287 -123 -402 186 -22 -77 -140 289 33 -106 -120 292 205 -261 105 200 6 60 -320 319 213 -57 -78
4841g8J82k57Q7L07j14K2r1O9kl60M1K06K09l94l0L47j85Q3mp4J23j36PM14n39
$$ -78 104 -153 -66 241 127 149 58 127 125 -235 -194 12 221 -173 -203 144 -41 42 38 -36 87 -49 -42 372 -167
4866a67N5K46L7k71j96K94J34p8k28J19N79m39l09M20l4l15P1K93p6k37P7L5L62
$$ -167 -112 134 171 -100 -296 -2 132 54 -174 -55 524 85 -224 196 162 -153 -82 211 135 -102 -25 10 372
4889C72l69o3P6j5l44Q9O1l6K21j87M52k64j10Q5O9k05j20L04K33k18o8r6K86
$$ 372 3 -60 16 1 -343 -254 -193 -229 -8 -195 257 -7 -117 -32 37 -168 -288 16 249 31 -37 -133 153
4912A53k44K1J69K71o19J10K42j21k20m6M76m58mK67M51m19m52M35L08m51m4L21
$$ 153 -91 -70 99 370 -249 -139 103 -18 -238 -284 192 -266 -270 -3 448 29 -423 12 320 -131 -175 146
4934A46J23j34m24L46J9j03j11KM88m88J31M70l30j09L8Q6j33l40NP00j07l28
$$ 146 269 135 -289 57 76 -27 -138 -136 352 -136 -5 465 135 26 64 150 17 -323 -318 382 275 -53
4956e3k12N64m80l05K00M71Qm53K37L08n30K28q3L76m57J82L28Rl56M7L34k81
$$ -53 -265 299 -181 -486 -286 185 193 -260 -23 285 -245 -17 -100 276 -181 1 329 338 -18 29 363 82
4978H2k34M2N5L15n18J22J98q9k70P3M77l42j18L87K33k46m62L42j38N2j24L37
$$ 82 -152 -110 -55 260 -258 -136 62 -27 -297 -224 253 -89 -207 180 413 167 -295 47 -91 -39 -163 174
5000A74M8k42J56R2k31k47L3M15j89j30KL69k01l59M86J06k08m58K39M72l24j32
$$ 174 222 -20 136 228 -3 -250 -217 198 9 -121 -119 250 49 -310 176 282 74 -384 -145 327 3 -129
5022a29R2K5j76k51L08K51l09k86O81j9j35k46L19Pk66O5J49P9l14O3K10j1n70
$$ -129 -37 -12 -188 -439 -131 120 -189 -475 206 187 52 -194 125 132 -134 -69 80 159 -155 -92 118 107 -463
5045d63L58L69k98p1M32j55m73L69J84k14j11j71K50M9j50j43N36j67m65L49J18
$$ -463 -105 264 -34 -105 327 172 -301 68 252 38 -73 -244 6 55 -95 -238 298 131 -334 15 133
5066A33r8j66l59P74j70l42J04K58n4j45r0M05n48R8J86J33Q3l60N26k43k48r6
$$ 133 35 -131 -490 284 114 -228 -124 134 80 -65 -155 250 -298 -200 -14 119 202 -158 368 125 -123 -219
5088b19L12N5k93oJ86J94k66oL26J20p32p1L74J21n68L17L38K2p0J29m1j52j58
$$ -219 93 148 -145 -151 35 229 -37 -43 283 403 -329 -400 -26 95 -473 -156 182 204 134 263 222 70 -88
5111h8M81o4k99j02K72n9j84m9J48K42n49m7K63q3m4L3R3R0k99K46K83l94M3J4
$$ -88 393 329 30 -72 200 141 -43 -92 56 298 -251 -298 -35 -118 -162 -129 -36 54 -245 1 284 -110 -67 -53
5135e3K35l00q1K96Rk66m4K41K9l51J55j3J63m13K57L81j65m01K50n8J16k09K5
$$ -53 182 -118 -199 97 106 -160 -204 37 66 -285 -130 -143 20 -393 -136 245 80 -321 -71 -129 -13 -222 -197
5158a97R6L0l90L30O58j53o99N41j23j56r8J13N15l46k94K72L5j41j95K74j57
$$ -197 -101 -71 -461 -131 527 374 -325 216 93 -63 -161 -48 467 121 -173 99 134 -7 -202 72 -85
5179h5K3R9K91k17J9j27O2j04J90j78K86q8m56J34p3K68l62L89K97l62q7K24J06
$$ -85 -62 37 328 111 130 3 65 -39 151 -27 259 171 -285 -151 -224 44 -318 71 368 6 -81 143 249
5202B49j39l88M16k76M52n16M34l07Nr1N23j79k97J02R3j76q2P9K45j35k34J70
$$ 249 110 -278 138 -138 314 -202 232 -75 -70 -161 362 183 -114 -12 81 -95 -177 -98 147 12 -222 -52
5224e2J64l01K3J52K21p7l48L71R1m19j28K11J33n5J34L4O7l87L87k27k40p0N52
$$ -52 112 -189 -166 -14 207 130 -218 153 244 -175 -303 -92 41 -14 120 154 221 -166 221 -6 -246 -316 236
5247B36j6l78L33m28L78k50j35K31J52m58J86L49n54L54j33l8o6K74m2J67q0j17
$$ 236 220 -158 175 -253 125 -125 -260 -29 123 -335 -149 200 -354 0 -133 -171 -237 37 -5 162 82 -35
5269c5J79n19K36K40l18M32O9m40R1J60p4l39K05K35m46N33J03j40j29j31m18
$$ -35 144 -375 -139 101 -217 215 284 -156 -65 95 21 -318 -113 122 -324 209 312 172 43 -88 -506
5290e06M53O6o9M34k44j31N4P6K6l71P3M07l62J24l15K64j36K97k61K41k2j43
$$ -506 -53 13 -56 378 134 3 57 133 159 -212 -139 268 -94 30 -285 -21 -157 140 -121 120 98 -45
5312d5N92m52j23j47J34j23J17j54J73K09l30Q2J45j32j89L29j50j9j0R4j1Q9
$$ -45 547 95 -28 -175 -41 -164 -47 -201 -28 181 -149 -67 78 -54 -243 86 -64 -83 -93 1 -10 79
5334G9k22J68N6p2j2Q7k6n0j18M4l8J62o8j03L15m44K63k53J90NK0K84k59r7J9
$$ 79 -143 25 81 9 -3 84 58 8 -110 -66 -104 58 -10 -113 202 -242 21 -232 -42 -37 -17 267 8 -89 -70
5359g0P1j85J8K6L64k96J27l99L62P2l21K36om73M05J85r4J07k49q4L09L7n8j39
$$ -70 1 -184 -166 -140 224 -72 55 -344 18 90 -231 5 -1 -474 -69 116 22 129 -120 -204 105 142 84 -55
5383e5j08J44j83K44M1q2j9r5Q3K99k45j39O4K23k67J72J28k13J36j39L3K34J9
$$ -55 -163 -19 -202 42 83 1 -18 -113 -30 269 24 -115 -51 172 -95 77 205 -8 128 -11 22 256 275
5406B75j24k34o5K36O1j33O9q3K4q1m2K62j80K36l14k4l2Q1k7R0N1M1K7k05O4
$$ 275 151 -83 -148 88 149 16 85 2 26 -55 -97 165 -15 221 -93 -117 -149 -68 -95 -5 46 87 114 -91 -27
5431b7P4rj08P9j20J89l34K04L7Kj10J89n4j42K22M3R2l36K1J8J59l48L77L00
$$ -27 47 38 -70 9 -111 78 -256 -52 -15 -13 -123 66 12 -130 92 135 227 -109 -88 -70 89 -259 118 418
5455D18n78P1PmK57l44J34Q8O7l18PL00j38j23R8j06J49K33j75K0o1m3oO7j02
$$ 418 -160 -89 -82 -86 171 -173 -39 49 116 -202 -195 105 -33 -156 -58 -164 -15 218 43 63 2 -41 -47 20 -82
5480h2j05PJ72n2L85m98L66k65PL03k8l72L50k82qj18M50j01k80K38k33M64o07
$$ -82 -187 -180 -8 -60 325 -173 193 -72 -65 238 210 -162 188 -94 -102 -220 230 129 -151 87 -146 318 -289
5503b89K80J78j32K50l14p4j45J50k50P33n58k81K64M08q4l35J32JK1R2J43k19
$$ -289 -9 169 37 287 -27 -101 -246 -96 -346 387 -171 -452 -188 220 136 -199 -67 -66 -45 47 190 -29
5525b9J74n30M00k8O9m04L05Ok6K3r3J67j04J05J04j28q9q4K36j05l81K95J71
$$ -29 145 -385 15 -13 56 -348 -43 -37 -63 -40 -133 34 -70 35 139 11 -78 -162 74 -31 -412 -117 54
5548E4l2j10q2M90m58r9L94J21k59K4J10r2m01J69K29l8Mj94K78J18l81J62J36
$$ 54 22 -88 -170 320 -138 -237 157 278 19 43 153 61 -340 -171 58 20 24 -170 108 226 -155 7 143
5571A43o09P37j25j42J15m02N39j63J52l48j91K27J4j5J27M8j3j99O1J69j71J0
$$ 143 -466 271 146 4 119 -283 256 93 245 -103 -294 -67 -53 -68 59 107 94 -105 -44 125 -46 -36
5593c6K33j29m49K12P6O0k46K14K10j19j50J48M19l94n6p8K78l00K90m38M76j54
$$ -36 197 68 -381 -169 -93 -33 -279 -65 145 26 -124 24 443 49 -7 -85 193 -107 183 -255 221 67
5615F7l53K56L14o03k9N94l05K61k79J80K74l98J42N0j40m21K12M14j48j21Q0
$$ 67 -286 -30 284 -319 -348 246 -59 202 -77 103 377 -21 121 171 31 -390 -178 236 88 -33 47
5636D7J44l16K02p2J57M4l45O9M36n62L73k21J18o4J7J95j95j60O5O46o35q9Q8
$$ 47 191 -125 77 5 162 206 -139 -70 366 -196 177 -44 74 10 27 222 27 -133 -68 578 -57 -146 -58
5659e8K75p7k16k50L86L9M9k48R3k0J17j66J77Mj93J37q6O4n0K60l14l7K14j13
$$ -58 217 140 -76 -326 60 99 148 -100 -7 -27 90 -76 101 105 -88 49 -37 27 -23 237 -77 -114 100 -13
5683a3j70Q8Q4R1k67j2J77J76L7k67J16Q3j29r9Q4K00k40k65M19J46q9k03K00
$$ -13 -183 -95 -11 80 -187 -199 -22 154 191 -76 40 123 -6 -105 -21 179 -61 -326 93 239 150 -53 147
5706A47n1j68J72j32L13l54p0L62k50j25P4K42N8k86j49J78Kq0J91L4K19p01O85
$$ 147 96 -72 100 -32 281 -73 -143 219 -31 -156 -82 160 218 -68 -217 -39 -37 -117 74 108 327 -374 311
5729C11j78k37l7M03rl80OJ34l2k7J82j23Q1m24J95L66k73k80L37L20k00j27k08
$$ 311 133 -104 -141 262 253 -127 -121 13 -19 -46 136 13 94 -330 -135 231 -42 -322 15 335 135 8 -200
5752b00M09q7m21M12j53M6k37N34k00j49J08K23j05m9J57J87m30m29K71N33n31
$$ -200 209 122 -299 113 -40 6 -231 303 103 -46 62 285 180 131 288 475 45 -384 -113 420 -111
5773a11J23O4J41l51k32N89j45j31o8J20K11k68m7j28l7R4j78M02K29m98O5L85
$$ -111 12 76 217 -134 -366 223 78 -53 -121 -1 210 -58 -105 -233 -270 -176 -354 48 277 -221 -156 229
5795B29l14O2JR5l4j55m2K28n4j84L64j92j69n6O2L01o1l96M15K86o24kM1K34
$$ 229 -85 -23 -22 73 39 -116 -158 70 16 -168 196 4 -165 -221 -159 142 81 -315 100 386 -238 -240 -199 35
5819C5k26K07l4N6l41N33j21o4j34P5J01N3k75p2L17q3j66K16N5j47r3K00J86
$$ 35 -191 16 -18 38 -303 230 109 45 -89 -14 87 140 -135 -207 110 27 -139 77 132 -15 -108 92 278
5842B78k05m7J93N7n20j81M59K53k86M3K88j98k36j98L94j1k83o2L71K49m52Q2
$$ 278 73 26 219 276 -244 -425 34 287 1 44 332 134 -102 -300 94 83 -200 -262 109 358 -94 -12
5864a2K39l90j24J91j03K51l31O44l25R2k60N1O4M3m6o0K54l58j80N90k1p2m47
$$ -12 227 -163 -287 -96 -199 52 -279 365 40 132 -128 -77 -13 30 -16 -76 178 -180 -360 230 209 137 -310
5887c10M79q4l07K40n4J49l45K18k8n8q5M95o6l87M9K31k01J92p1Q0J51k81j25
$$ -310 169 85 -222 18 -36 113 -232 -14 -42 -100 -185 310 244 -143 -94 137 -64 128 57 137 288 7 -118
5910a18K39j2m4j38j64K63J23l62L69Q6o6k64K49j31m7M0M02l00m08K58K73n18
$$ -118 121 109 65 -73 -237 26 149 -213 156 242 176 -88 161 30 -17 23 425 125 -283 -25 248 -270
5932b70K94r7J89J07k15L17k34k71R9J4J79j45N6j79MJ15j81K57k03n6L02J2j54
$$ -270 24 -73 116 223 8 325 91 -180 -81 -67 112 -33 23 -156 -152 -37 -218 39 -164 -220 82 94 -60
5955f0q6k1J12k64M43k12J16J66J12k26J53k19M2n1q2q0k15M44K67k04k96J68
$$ -60 -146 -167 -55 -319 124 -88 28 194 306 80 233 14 56 5 -77 -157 -372 72 339 135 -161 7
5977Gp5M0K81k63o7L50k61K6l5k59Q1o0J38K31k15%O9K2n0j6j78M58k50J63k56
$$ 7 -68 -28 253 -10 -77 273 12 38 3 -256 -175 -235 -97 134 -81 -81 -12 10 -40 -56 -234 224 -26 137 -119
6002a19j32L78K21k03q1j26m2j55J81J57J61p3l85L15j60j10K06L57k10J4j86
$$ -119 -251 127 348 145 64 -62 -104 -259 -78 79 240 167 -218 97 -63 -173 33 390 180 194 8
6023HJ89k68K48k03k5k49K48l9J07J69j91n9J26j89P5L07o50K93K56Q4l19j80
$$ 8 197 -71 177 -26 -51 -300 -52 -91 16 185 -6 -65 61 -128 -53 254 -396 -103 153 237 -82 -262
6045b62L04R7l59J01M03k65o1p7J63J43k24j17J56MK5Pl60M52K8j30r4K34j87
$$ -262 42 139 -220 -119 284 19 -42 -119 44 187 -37 -154 2 6 31 38 -322 130 158 28 -66 168 -19
6068a9j62L13r7j42J76lK23l04J41j63k64J98J3l1J8J30q7J70L8k76n4J43n5j00
$$ -19 -181 132 35 -107 69 66 289 -15 126 -37 -301 -103 -90 -121 -103 27 -60 110 148 -128 -182 -39 -94 -194
6092a94N26l41j41K30k66K95j23K2k36K64R1m29K44j66L48K07l90J32l6j32j62
$$ -194 332 -9 -150 80 -186 109 -14 8 -228 36 127 -302 -58 -224 124 331 -59 73 37 -95 -257
6113b57K13lJ85R4k35j99R6K24j70L07k39k12L01k15K58l80j8K00K99j82L3P0
$$ -257 -44 -47 138 232 -3 -202 -106 118 -52 255 16 -196 105 -110 148 -232 -250 -50 249 67 100 170
6135A70m51M49o6k43L91j52j19J30k2N1K11l98K58j53j33l5J09p7q7P0K10l03
$$ 170 -281 168 102 -141 250 98 -21 109 87 138 349 -49 209 56 -77 -112 -3 -80 -167 -97 113 -190
6157a90J00J45j20K20R7l41L04m31J68J64k60M0Q6J68m36L07M7k40J68k42M66
$$ -190 -90 55 -65 155 252 -89 215 -216 -48 116 -144 -104 -18 150 -286 21 68 -172 -4 -246 220
6178B20j19l2k68J52O0O3J00J98l37J14j10K61o2k33l2L6J62m18J2J70K34k07
$$ 220 101 69 -199 -47 13 76 176 374 37 151 41 302 240 7 -25 11 173 -245 -233 -63 171 -36
6200c6q3J94M0o50O51k21j20K1n8L34m0j70L65j54n1L2n5m4J8L18n26J53k7K13
$$ -36 -119 75 115 -535 116 -105 -225 -204 -262 72 32 -138 227 73 22 54 -1 -45 -27 291 -235 -82 -109 104
6224A04k82n4K73J08j54J97j01O1l9N1k8j23J27J29j13k91K63j16q2r7K83l19
$$ 104 -178 -232 41 149 -5 192 91 152 113 164 136 13 140 269 156 -135 128 12 -70 -167 116 -203
6246b03K60j9p7j8o5J62K11k14RQJ39l79N2L89k09J08P2l63N3k30K52L8k7r9n5
$$ -203 57 38 -39 -57 -122 40 251 37 46 54 193 -186 -134 255 46 154 226 -137 -84 -314 -62 -24 -51 -150 -205
6271b05K17K41m9l06L02Ql01m8j25M70k26L52k37J78k51J3j88K84l5M1j34p1L95
$$ -205 12 253 204 -102 200 208 -93 -141 -266 204 -22 330 93 271 20 33 -155 129 94 135 1 -70 325
6294C25j41l81L62Q2k22K5Q9M2K5kk57r7J49O2p7r2n7J99P7o5R8k27l65O76j87
$$ 325 184 -197 165 247 25 50 139 181 206 204 -53 -150 -1 61 -16 -108 -165 34 111 46 144 -83 -448 228 41
6319D1j28k2K28j74J23p2R6j57m5J89l15K30k6J18k71K54J28k59L42J17n34J00
$$ 41 -87 -109 119 -55 68 -4 92 -65 -110 79 -236 -6 -32 86 -185 69 197 -62 280 397 -137 -37
6341c7O2m8r9K8o5L5K99j93J15LL3k42K00o7L7n0n5K32j76Q4J24k22q1J9L09l25
$$ -37 25 -23 -122 -94 -159 -124 175 -18 97 100 133 -109 91 24 61 11 -44 188 12 96 220 -2 -83 -64 245 -80
6367h0j54J82p8J84j27j26K18J65l52K94l85L48oj27M7l3k07M40k87r8L1K05J74
$$ -80 -234 -52 -130 54 -73 -199 19 184 -168 126 -259 89 83 -44 3 -30 -237 203 -84 -182 -151 54 228
6390B28m53K00J68J6j88J88j89K75m44L14q0q8J70j4J19k57j31L43p8k66K17q0
$$ 228 -225 -25 143 159 -29 159 -30 245 -199 115 35 -53 117 103 222 -35 -166 177 99 -167 50 -30
6412c0Ok44N36J5k76N4O6j11r6J01r0K86j68p7j94K20k2l9J52J8k39N3L30l59
$$ -30 -24 -268 268 283 7 61 127 16 -80 21 -69 217 49 -28 -222 -2 -24 -63 89 107 -132 -79 251 -108
6436a08N4n6K03p6J3j41K14K68m57j02P4m0O0J86q2J39j08M7j19J80m51L85J04
$$ -108 -54 -110 93 17 30 -111 103 371 -86 -188 -114 -154 -94 92 10 149 41 88 -31 149 -302 83 187
6459A87j71kJ69k46J80l10J46NK20m15L97j64qk55L81J13j20k79J27j77L14rj80
$$ 187 16 14 183 -63 117 -193 -47 -42 178 -237 160 -4 -12 -267 114 227 107 -172 -45 -222 92 83 -97
6482i7m5k41K20J17J90m6n15N12j16k51J52K32j0j01n7J37M4j08JN3M9l43L61
$$ -97 -142 -383 -163 -46 144 98 -417 95 -21 -272 -120 112 102 1 -56 81 125 17 18 71 120 -223 138
6505A38J41m82K48K14j53j30nK51k13P2q7Q1r4q1M3L08l51O4J06p0j89K69r0k9
$$ 138 279 -203 45 259 106 -24 -29 222 9 81 -6 75 -19 -100 -57 251 -100 -36 70 0 -189 80 -10 -39
6529c9J74k19J05J57j30p5J14J9k08R0J27L3l28L64p3j07MlJ70l51J28J88J21
$$ -39 135 -84 21 178 48 -27 87 106 -102 -12 115 148 -180 184 111 4 8 5 175 -176 -48 140 261
6552B61k15k43L38J76m70N1K56j44J49l08Q2Q6k22L89N5l11rj72k4L55k13P3Q0
$$ 261 46 -197 141 317 -153 -102 154 10 159 -149 -67 19 -203 186 241 -70 -79 -251 -275 80 -133 -60 20
6575B0l8j40J32j53J11J06M8P9l26K20r2J39O1k09K13l12j93M82o8J89k96J10
$$ 20 -18 -158 -26 -179 -68 38 86 165 -161 59 -33 106 167 -42 171 -141 -334 148 80 269 -27 83
6597H3o7j80rO1Rk9O9q1J07j93J00J94j45j24j6K38J59l02K34J75q6j2k65L94
$$ 83 16 -164 -173 -112 -103 -132 -63 -144 -37 -230 -130 64 -81 -205 -221 17 176 -126 108 283 197 185 -80 314
6621C14k75k23L3J32MJ77J7m1k08j00R4K55r2l38L93j05l08K18J38K40k97j94
$$ 314 39 -184 -151 -19 -15 162 179 138 -70 -170 -76 179 87 -251 142 37 -271 -53 85 325 28 -166
6643a66K38j61N6J9k09L39k60J85N4%k9p1o5K67j7k32pj31k34L64P2P5m3k83K12
$$ -166 72 -89 -33 -14 -223 116 -144 41 95 95 66 -5 -70 197 180 -52 -59 -190 -424 -60 12 87 44 -239 -27
6668b7m2j20J80k5n8Q1N2O3l0K75j96J88m70K1J72qp6r1J05Q9k12J94K3l2l1K80
$$ -27 -69 -189 -9 -34 -92 -11 41 104 74 349 153 341 -129 -108 64 56 -20 -111 -6 83 -129 65 88 56 25 305
6694C05k64P1j63n6L27k72J19j30j13L45k21R7k24J33R2rM6k15J86O0k45J83j73
$$ 305 41 112 -51 -107 220 -52 67 -63 -176 169 -52 45 -179 -46 46 37 83 -132 54 114 -131 52 -121
6717a21k9NN9MJ17p4j31L64k09J07J0L3p4pj03J03q1q2J10J31m0m93N68N1l13
$$ -121 -150 -145 -86 -82 35 -39 -170 194 -15 92 102 135 61 54 -49 54 -27 -109 1 132 92 -401 167 218 -95
6742i5k44K89J35o5k81J30O9O9J15J6k54K56k75%J81j72J74k27K62j27N8J6j48
$$ -95 -339 -50 85 20 -261 -131 -62 7 122 138 -116 140 -135 -135 46 -126 48 -179 83 -44 14 30 -118
6765a18K12r9Ppm29K07M21l06j15K09O7k78J67M9K4j78P2l0K33l14j17L44J43
$$ -118 94 -5 2 -5 -434 -227 194 -112 -227 -18 49 -229 -62 -13 11 -167 -95 -125 108 -206 -323 21 164
6788A64m3j88k59K79K6K50k50j08K2q9Nn0N51k03J21J26j86Q5j58j39J36p3j31
$$ 164 121 -67 -326 -47 -21 229 -21 -129 -107 -196 -191 -241 310 107 228 354 168 253 95 -44 92 19 -112
6811a12K41o4OM7r1j65k63L27K27k32J30kN9j90LJ44m57K09R6J60k73M20k65j93
$$ -112 129 65 71 118 27 -138 -401 -74 153 -79 51 49 108 -82 -79 65 -392 -183 -87 73 -200 220 -45 -238
6835b38J72J77k31J41m8j20jL08k80N2L71j36k58r3J43j94K71n4Q7j25N9J42j74
$$ -238 -66 111 -120 21 -27 -147 -148 160 -120 -68 303 167 -91 -184 -41 -235 36 -18 69 -56 3 145 -29
6858b9j0%l56j38L97K72k08J90p0j16j49M09m90J72n8K14l8j31M61j77k31j25
$$ -29 -39 -39 -395 -533 -136 136 -72 118 48 -68 -217 192 -298 -126 -184 30 -8 -139 322 145 -86 -211
6880b11J93o5plK84j37J24j77k08J09l7K81l10L68l31J30J36k7k0j61QO8k39J34
$$ -211 -18 -83 -90 -93 191 54 178 1 -207 -98 -135 146 -164 204 -127 3 139 112 92 -69 -61 7 -232 -98
6904i8n0Q3M06k49j92K77j17L1j88J6J91K02m45K60l53N23n01K21J24l33K63j37
$$ -98 -148 -65 341 92 -100 177 60 91 -97 -81 110 312 -133 127 -226 297 -204 17 141 -192 71 -66
6926f6J21j40rl1K96k66m4r6N85k25j69k11M47k52L14k06k08j39L56p8J43j02
$$ -66 55 -85 -94 -125 171 -95 -139 -235 350 125 -44 -255 192 -60 254 48 -160 -299 57 -21 122 20
6948B0K3j1K6k12m5L10l16K90M4p2J51j34J51j89R5l45J62J12l96K57J45N8k09
$$ 20 43 32 58 -154 -199 111 -205 85 129 57 208 74 225 36 131 -214 -52 60 -336 -79 66 124 -85
6971h5j71J48K42k00K74m03R3L3J7L9K98k28j30Rm4j6l8J86j73k20N30j06M8j94
$$ -85 -256 -108 134 -66 208 -195 -102 -69 -52 -13 285 57 -73 -64 -108 -124 -162 24 -149 -369 161 55 103 -91
6995i1o3M34k67k7j17L46l24J65M1J78k17k41K05j4L8p9P7N4n6p2J26J67k72J23
$$ -91 -154 280 13 -14 -131 215 -109 56 97 275 58 -183 22 8 46 -33 44 98 42 -30 96 263 -9 114
7019A14J33k06p9j1j63N37j88j62j90K43J64k5j18m4J84l65J86jK32l24J68J04
$$ 114 247 41 -38 -49 -212 325 137 -25 -215 28 192 167 49 5 189 -176 10 9 241 -83 85 189
7041A89K6r8J1l37r1K08K09m5J16j22m8r5J63q2j52J90k98K92M4j37QJ93N9j93
$$ 189 215 117 128 -209 -300 -92 117 72 188 66 18 -77 86 4 -148 42 -256 36 80 -57 -49 144 203 10
7065A0J14l6l11J67P0J71l8l07M12k55r8k0K09M1j00rn3K46Lk22P2Q6p8J6J76
$$ 10 124 88 -223 -56 14 185 147 -160 252 -3 -101 -121 88 129 29 20 -33 213 216 -6 66 152 74 90 266
7090B66j45n08M68k7l9j1J70j09K41n05J13J03k34L30m3J60p4k37L28j40o6j37
$$ 266 121 -387 81 54 15 4 174 65 306 -199 -86 17 -217 113 70 230 156 -81 247 107 41 -96
7112i6m9J66K1n2K18j06M1k76K67J1J5k53n5K49l26O08j62n10J54K06q5J01k86
$$ -96 -145 21 42 -10 208 102 143 -133 134 145 160 -93 -148 101 -225 383 221 -289 -135 71 -14 87 -199
7135a99K86q0Q5k64K47l20J15J83o5K89k4l84n3K66K5Kl37L83j23J72l17L11j03
$$ -199 87 7 92 -172 75 -245 -130 53 -12 277 253 -131 -184 82 107 109 -228 155 32 204 -113 198 95
7158I5pk14J99J54l84K32Q9l38O5J1J48k2j59K98k42oR3L9L7l83M19J1k93j5K06
$$ 95 88 -126 73 227 -157 75 164 -174 -109 -98 50 28 -131 167 -75 -81 12 51 88 -295 124 135 -158 -173 33
7183C3k86M10m81K81Q2o21N52J96m96K21J37m6j61L32J10k47J06j71r5J75J20
$$ 33 -253 157 -324 -43 39 -582 -30 166 -330 -109 28 -18 -179 153 263 16 122 -49 -144 31 151
7204A51j32qK57l47%J99j35O4J77L1j25j56j30J43L64n29M1J28OK06n57K97J57
$$ 151 19 11 268 -79 -79 120 -15 49 226 257 132 -24 -154 -11 353 -176 -135 -7 -1 205 -352 -55 102
7227A02k65L09k6O5k31p5L47m8J22k94k6o9J33j47R4J94l07O4p9pj14J69k6J24
$$ 102 -163 146 120 185 -46 -121 226 178 300 6 -20 -89 44 -103 -9 185 -122 -58 -137 -144 -258 -89 -115 9
7251Ij33R0J08r0O3j54J70R0k66K27n39M12L12j58q5m44N13j44j18J94O0j72O2
$$ 9 -124 -34 74 -16 47 -107 63 153 -113 114 -425 -13 299 141 56 -388 125 -19 -137 57 117 -55 7
7274GK1k1r9j66J23N4K53j28l62M76l75M70k22K63r9l82M90l01L18m54K26j78
$$ 7 28 7 -92 -258 -135 -81 172 44 -318 158 -217 253 31 294 195 -187 303 2 320 -134 92 -86
7296h6J53j41j69M24O6p7j16l17L91l8%J89n15K44J3J93j13r3j14L96k07l26L24
$$ -86 67 -74 -243 181 247 170 54 -263 128 90 90 279 -236 8 21 214 101 8 -106 290 83 -243 81
7319H1J10k29j72L11m3l9k4L3L74m41p8J79k8j77L55J8j08j93K22P5k75m8O0P4
$$ 81 191 -38 -210 101 58 19 -5 28 402 -39 -117 62 34 -143 212 230 122 -71 151 226 -49 -97 -37 37
7343C7N8o05P50k74q5K92k78J28m46L80J96j31k01L78r5j65K6J6L0M1k44K23O6
$$ 37 95 -510 240 -34 -119 173 -105 23 -423 -43 153 22 -179 199 104 -61 -35 -19 11 52 -192 31 97
7366I7J81m01j8L20p4R4J31j87j46M1J22j60k77M1L25k7j51J36m4Q1o0q6L76j72
$$ 97 278 -123 -141 179 105 199 330 143 -3 38 160 0 -277 -236 89 62 -89 47 3 84 24 -62 314 142
7390A42J35n18K42J99m33K88P7l18J02K50q2N4k24J10L2j36J39J01j74L59l79
$$ 142 277 -241 1 200 -233 55 132 -186 -84 166 84 138 -86 24 56 -80 59 160 -14 345 -34
7411c4k41Q5J32j36J22K24k85L4K83j58k95L40j8k11R3N0N4J02p2l91N36n6k32
$$ -34 -275 -190 -58 -194 -72 152 -133 -99 184 26 -269 71 53 -158 -65 -15 39 141 69 -322 214 158 -74
7434g4l3L66k41k57L69p2J0j90M7l2J34j45J85J62l71L53j75j37L34m5Km1j76
$$ -74 -107 259 18 -239 130 58 68 -122 -75 -107 27 -118 67 229 -142 211 36 -101 233 188 190 149 -27
7457b7k8L29j60k3J07l09J42P6k9J40j71rj4K21m84M13k28J68m7k3O3j31n5J62
$$ -27 -55 274 114 91 198 -111 31 107 78 218 47 38 24 245 -239 174 -54 114 67 44 107 -24 -79 83
7481H3R6N7l24J06K2j09J08q4o8K78j41l31J20J52n6N9j9n8k7K06J54l13K61p9
$$ 83 179 236 -88 18 40 -69 39 -45 -113 165 24 -307 -187 -35 -91 -32 -51 -109 -136 70 224 -89 172 93
7505I3K30m48Q6O8k95M02k03J30J57l27n4j20L32K65k48Ok85PJ29k1j07L29J2
$$ 93 323 -125 -39 29 -266 136 -67 63 220 -107 -161 -281 51 316 68 74 -211 -204 -75 -96 -203 126 138
7528A38J63j97k17K42Q2l55M49m03N9o3K34j02J5j80rP3rJ16r8J80k25k2n2K13
$$ 138 301 104 -113 129 211 -144 305 -98 -39 -102 132 30 45 -135 -144 -71 -80 36 -62 118 -107 -129 -181 32
7552C2J28m16P07l29om20L43J26l29L3R2l8j32O1op5L79l2J53q0m37K9N9O4JJ3
$$ 32 160 -256 451 122 116 -304 39 165 -164 -131 -39 -77 -209 -148 -154 -229 150 118 271 191 -246 -217 -158 -94 -93 -80
7578h0K00k1jm1j6J13M0J18j58k74K85j61P3qP2l0l04K3K42J80k13k21Q3J11J76
$$ -80 120 99 98 57 41 154 194 312 154 -120 165 4 77 69 141 111 -193 -170 72 252 39 -182 -99 12 188
7603A88j31k3j5J05j00j31J22J08l19L20k10K84k93J88J04Pn71J24M16J8m21K84
$$ 188 57 34 19 124 24 -107 15 123 -196 124 -86 198 -95 93 197 204 -367 -243 173 191 -230 54
7625E4j64j16Q8J38k2L1J10j49k5j75L43K0j47q1J83k06o1M02l84L73l45Lq4J17
$$ 54 -110 -226 -138 0 -22 9 119 -30 -55 -230 113 133 -14 -95 88 -118 -179 223 -161 212 -133 -130 -214 -97
7649i7J4K58k01n5j99QJ60J17j61J84J88l55P2K76j68J04N1n4j4k48J91R0K0j90
$$ -97 -83 175 -26 -81 -280 -272 -112 5 -156 28 216 -139 -67 209 41 145 196 142 128 -120 71 161 181 -9
7673iJ16r1R8j72Q6k59L99k3j89P8p0J27k8j39k00K68p8L7j84J78J62k92L80j15
$$ -9 107 16 114 -58 28 -231 168 145 -44 34 -36 91 63 -76 -276 -8 -86 -49 -233 -55 107 -185 195 80
7697H0r8J47l16K04p4L80k75L8j28J35Q5k85P0R5J5l52K73j66k8M4J16l4K01j96
$$ 80 -18 129 -187 17 -57 323 48 86 -42 93 178 -107 -37 58 73 -279 -6 -172 -200 -156 -40 -74 127 -69
7721f9J43k31M5p7K04j21R3k55K87K05m69K57J0m7R5r1O0j41j9Q0J71j38K31m25
$$ -69 74 -157 -112 -189 15 -106 -13 -268 19 224 -245 12 22 -25 70 -21 39 -102 -121 -41 130 -8 223 -202
7745b02r9M23pj01K74j76J4j02K8P7k90n8M03k15l0O5j37p3K19N3k82M66k85J74
$$ -202 -301 122 115 14 288 112 126 24 52 129 -161 -219 184 -31 -61 4 -133 -206 13 66 -216 250 -35 139
7769A39j8K46n20M04j13k66K19J97j71O5k18Q0k26J63K48j18j55J08k88nL28j45
$$ 139 121 367 -153 251 138 -128 91 288 117 182 -36 44 -182 -19 229 111 -44 64 -224 -229 99 -46
7791d6K43j70n5K54l28o0J40K39m8j02m2N7o1K05k08P3N4j5j79J65J48m22J86
$$ -46 197 27 -28 226 -102 -162 -22 217 169 67 25 82 21 226 18 91 145 130 -49 116 264 -158 28
7814B8k42J05P9j41K00J55l66L7J08K06P2l38J79j99K97L3j60J62k93k6K3O8K63
$$ 28 -214 -109 -30 -171 29 184 -182 -145 -37 169 241 -97 82 -117 180 213 53 215 -78 -104 -81 -13 250
7837B50k82J60j26O9j33l58K89K79k12l5J65j63J43O6k87J15n9p6J81%k80N54
$$ 250 -32 128 2 71 -62 -420 -131 148 -64 -99 66 -97 46 112 -175 -60 -119 -195 -14 -14 -294 260
7859B60m30K41m2l05K05J91k58n6J82j19K4L34j05j93j6j48K57J18k36L19J20
$$ 260 -170 71 29 -276 -71 120 -138 -194 -12 -131 -107 227 122 -71 -87 -235 22 140 -96 223 343
7880C43o14N32l8k82j06K09n7o9J60j2k1J31n3l30L7K02nj90K87M6k66J68O3L6
$$ 343 -271 261 223 -59 -165 44 -13 -82 78 66 45 176 123 -207 -170 32 27 -163 124 170 -96 72 135 171
7904A71m8l01K66j46j5j83J93J39j0rj52K28l30K56m6m7J36n9N1k55L82j75J7
$$ 171 123 -178 88 -58 -73 -256 -63 76 66 57 -95 133 -197 59 13 -34 102 43 94 -161 221 46 63
7927F3l51M87r8j88J68R6r0n09N61k06J2J5L0n4l2L6J70j64N8M4J9k77L42k61
$$ 63 -288 199 101 -87 81 177 87 -422 139 -67 -55 -40 -10 -64 -96 -60 110 -54 4 48 67 -210 132 -129
7951a29J05k27K43M2J61K4l34J73k8k72J66p7K30q7J99k77L12k12L0L6r4J15l8
$$ -129 -24 -251 -8 34 195 219 -115 58 30 -242 -76 -153 77 -10 189 -88 224 12 42 78 -16 99 61
7974F1J21r9J5j22l6m6j84N7M16j79q5L06j79J6k70L16j60J19m09M08j22K48l65
$$ 61 182 83 98 -24 -60 -106 -290 -233 183 4 -81 225 46 62 -208 108 -52 67 -342 66 -56 192 -173
7997a73J58J42j56J62o6k9m1N3K8j94L00k72L43j91j11R0n5P8j22J62M7j58L08
$$ -173 -15 127 -29 133 67 38 -3 50 78 -116 184 -88 255 64 -47 43 -12 66 -56 106 153 -5 303
8020C03m98J45J94j13o8Q6J78l93QJ6K43J97q2K9q31N00K33J15l31o2M48n08j19
$$ 303 -195 -50 144 31 -37 49 227 -166 -158 -142 101 298 216 245 -586 -86 147 262 -69 -131 317 -191 -310
8043c10N8M51n54K65K12j44J9J1oj13L14l11j8l4L08l85M12l40J30j83M00j31
$$ -310 -252 199 -355 -90 122 -22 -3 8 2 -111 203 -108 -126 -160 148 -237 175 -165 -35 -218 182 51
8065E1J00m7o8L7q9On9J49J4K80l16P6m9k34Q8qj62K05J87l1k8o8R1j57n0j21
$$ 51 151 104 36 73 -16 -10 -69 80 94 374 58 134 85 -149 -61 -69 -231 -26 161 130 102 34 125 -32 -82 -203
8091b03M5J37r7J84m78N20j42R5J78l15L7j11R9k15J06L54j17Q0P0l49J34P5k30
$$ -203 -158 -21 -118 66 -412 108 -34 61 239 -76 -39 -150 -51 -266 -160 194 77 157 227 -122 12 87 -143
8114a43P1Qk27L29n3n1j13L9L67r4l05M19j82l28L19K22k71j25K47J29l01O0j08
$$ -143 -72 -64 -291 38 -15 -66 -179 -140 227 133 -172 247 65 -263 56 278 7 -118 129 258 -43 17 -91
8137i1P4J82k29J73K0J07l67O8L76k70J70P8k66r1l3L15k87j77L93J65k37k80
$$ -91 -17 165 -64 109 129 236 -131 -63 313 43 213 291 25 -66 -99 216 -71 -248 145 310 73 -207
8159b07N06m88K72J00j60J43k7k44K95k68k1r6K36j45L41m51mM97l12j65L00j21
$$ -207 299 -189 83 183 23 166 139 -105 190 -78 -99 -195 41 -104 237 -214 -218 279 -33 -198 102 -19
8181a9J94l16J16J10k20N53j87k62j51K11
$$ -19 175 -141 -25 85 -135 418 231 -31 -182 29
8191B9
$$ Imaginary data points
##PAGE= N=2
##DATA TABLE= (X++(I..I)), XYDATA
0@%%%%JjQj6J6k4L2l5M3n6P2q8J04j20J41j66J94k28K66l06L51m07M65n28N99
$$ 0 0 0 0 0 1 0 8 -8 8 -16 16 -19 24 -32 40 -48 56 -64 77 -89 105 -123 143 -163 188 -219 246 -282 317
29C17o76P62q57R63j079J205j342J493j660J844k044K264k509K780l077L407l778
$$ 317 -359 403 -454 509 -570 635 -707 786 -874 970 -1074 1190 -1319 1461 -1616 1791 -1987
46a987M196m669N210n838O576p455Q525r863J1591j3922J7260k2478L1858n3996
$$ -1987 2209 -2460 2750 -3088 3488 -3967 4558 -5305 6286 -7636 9624 -12854 19004 -34992
60c4992K00183J87364l13834j54933K939J03074M6485O5509j3349j05530j07555
$$ -34992 165191 352555 38721 -116212 -113273 -10199 36286 101795 88446 -17084 -124639
71a24639M6946Q8372K4946j7171J9543k9014p4222K518J09183K9271r2803m6918
$$ -124639 -77693 10679 35625 18454 37997 8983 -65239 -62721 46462 75733 -17070 -63988
83f3988Q2563M5053p1362o3501K9743L1699p032P723J3614n0299n1086M5329P5956
$$ -63988 18575 63628 -7734 -71235 -41492 -9793 -16825 -9102 4512 -45787 -96873 -51544 24412
96B4412j7416n6704J1291L0697l0881j5754O8861M4900o7745o3869M7048O2061
$$ 24412 6996 -49708 -38417 -7720 -38601 -54355 14506 59406 -8339 -72208 -25160 36901
108C6901k2117l5060K0916J1148l1881L506M6963k447m8218P530M9837j5435n3936
$$ 36901 14784 -20276 640 11788 -20093 -16587 30376 27929 -20289 -12759 37078 21643 -32293
121c2293J9382N5713k1798n4328K8898N8735l1196o8601J6815O1587q08l1405
$$ -32293 -12911 42802 21004 -33324 -4426 54309 23113 -45488 -28673 32914 32106 701
133G01J0501J0668l3280r355M6634J4693m4450n837M6846j2125p5726n356Q0930
$$ 701 11202 21870 -11410 -20765 25869 40562 -3888 -9725 37121 24996 -50730 -56086 24844
146B4844K6544o4517l7210K8055Q553k3177J5635L5025j9117l8166J8617L1616
$$ 24844 51388 -13129 -50339 -22284 -13731 -36908 -21273 13752 -5365 -43531 -24914 6702
158F702k2291j9695M0543K4751m9841l3015M9991L8862m7042m3915L2633L6087
$$ 6702 -15589 -35284 5259 30010 -19831 -52846 -2855 36007 -11035 -54950 -22317 13770
170A3770k0616j8258J6184o881l1203J9791N3198o621n1083M068M6069m718l4384
$$ 13770 -6846 -25104 -8920 -15801 -47004 -27213 25985 19364 -31719 -27651 18418 13700 -20684
183b0684K1080M3857j9487m3527J6715L5795j9600k7472K8962K8184l2649l0710
$$ -20684 396 44253 24766 -18761 -2046 33749 14149 -13323 15639 43823 11174 -19536
195a9536K6118K0082k6945o165M1601O610n0282j5523M5418J9276k8975o106K3000
$$ -19536 6582 26664 -281 -6446 35155 41765 -8517 -24040 21378 40654 11679 5573 28573
208B8573j5193l6640K2571N2159j2589n5738m508L6122K382j8890J2492J1978
$$ 28573 13380 -23260 -689 51470 38881 -16857 -21365 14757 17139 -1751 10741 22719
220B2719l1169k0444L3162K4397l1811k2771K8234J4453l3613j4209L3454J0939
$$ 22719 -8450 -28894 4268 28665 -3146 -25917 2317 16770 -16843 -31052 2402 13341
232A3341l3646p617L4386O593l2105p724K4560K124j3192J6428J8348k9959l3302
$$ 13341 -20305 -27922 6464 13057 -19048 -26772 -2212 -88 -13280 3148 21496 -8463 -41765
245d1765K8110M3096j4702l7121P478K1193j4490j3839K4374J6615k4882j4851
$$ -41765 -13655 29441 14739 -22382 -14904 6289 -8201 -22040 2334 18949 -5933 -20784
257b0784K3370R199k3572m19L3099M129l2672l095L1536J079l0241K509L1118
$$ -20784 2586 11785 -11787 -12206 20893 25022 -7650 -10745 20791 21870 -8371 -5862 25256
270B5256j123k8699j143J6899q005j2467K1970J7783k8817k8929K1376K8827j2029
$$ 25256 24133 -4566 -5709 11190 3185 -9282 12688 30471 1654 -27275 -5899 22928 10899
283A0899j7729J3216Q944k1095q551K4666J0141k2314q533J6378k802k0988P830
$$ 10899 -6830 6386 15330 -5765 -14316 10350 20491 -1823 -10356 6022 3220 -17768 -9938
296i938K8137o631l3025j535K5251R92j6763O004J4261j3329j5632J4515J6678
$$ -9938 18199 11568 -21457 -22992 2259 3251 -13512 -7508 6753 -6576 -22208 -7693 8985
309H985j4028j2049J7015Q747k2581r963K4868J3920k1290j3189J6525Q089j3732
$$ 8985 -5043 -17092 -77 8670 -13911 -23874 994 14914 -6376 -19565 -3040 5049 -8683
322h683k81J6567l730j9088O145K2345n425k0144O918K0864p626k0431P853J9329
$$ -8683 -8964 7603 3873 -15215 -9070 13275 7850 -12294 -5376 15488 7862 -12569 -4716 14613
336A4613n612j4642P257J0437j0119p514J4014P015j6628o957J8213P769j7858
$$ 14613 9001 -5641 1616 12053 1934 -5580 8434 15449 -1179 -8136 10077 17846 -12
349a2o851J6450O563j5673o490J2359L002r963J709R187p229j2419P391J3683
$$ -12 -6863 9587 16150 477 -6013 6346 9348 -615 1094 10281 3052 -9367 -1976 11707
363A1707q332j4113P715J2472q279j2149P079J0427o336p905N460K870q369N2
$$ 11707 3375 -10738 -3023 9449 1170 -10979 -3900 6527 191 -7714 -2254 616 -7753 -7701
377g701J1686m97j4472j205J5129J367j3217k168J1341P70r893J474R280k766
$$ -7701 3985 3488 -10984 -12189 2940 4307 -8910 -11078 263 1033 -8860 -7386 1894 -872
391h72o734N024O554q287p013R514Q850q162q190R045Q667p212q060N268O539
$$ -872 -7606 -2582 3972 -4315 -11328 -1814 7036 -1126 -9316 -271 8396 1184 -6876 -1608 4931
406D931k978j112M376j478p094L192J0762j079j0889j580Q241M51o264N62O860
$$ 4931 1953 841 5217 3739 -3355 -163 10599 9520 -1369 -2949 5292 5743 -521 41 6901
421F901j256o560r54M192Q42l3K617j924p260j298R437N902o051o477J033K625
$$ 6901 5645 -915 -1869 2323 3165 3132 5749 3825 -3435 -4733 4704 10606 4555 -1922 -889 1736
437A736j305n8K410j215m089p11J857o99j685K724J796m862m374L381O855o30
$$ 1736 431 373 2783 1568 -2521 -3232 -1375 -2074 -3759 -1035 761 -4101 -8475 -5094 1761 1131
453A131m226j323J850J171Q15M50j061j890J538L290r18m666j211M107L206j821
$$ 1131 -3095 -4418 -2568 -1397 -582 -132 -1193 -3083 -1545 1745 827 -3839 -5050 -943 2263 442
469D42m054l27J860J694k82J90J047J21r79j327J642K858J987k56k616k786J8
$$ 442 -3612 -3939 -2079 -385 -667 -477 570 691 -288 -1615 27 2885 4872 4616 2000 -786 -768
486g68M608M653j614o913k264M161L507k145k314J339r2l411l22L375Q66k367
$$ -768 3840 8493 6879 -34 -2298 1863 5370 3225 911 2250 2158 -1253 -1575 1800 2666 299
502B99O26J607k797l359L697O004k370o421J017N147n87l996P13K525k088k649
$$ 299 925 2532 -265 -3624 73 6077 3707 -2714 -1697 3450 2863 -1133 -420 2105 17 -2632
518b632K207Q60m554j287O125J748o930l745O011L004m912q49O343O62o176q32
$$ -2632 -425 435 -4119 -5406 719 2467 -4463 -8208 -2197 807 -4105 -4954 1389 2051 -4125 -4957
534d957M739J204j851L743J774p815n751Q080R967n157r725J482M467k236j165
$$ -4957 -218 986 -865 2878 4652 -3163 -8914 -834 9133 3976 -5749 -4267 200 -2036 -3201
549c201O497J743r821l431Q974N021o341j060N970j391p765L172J1689j615j2398
$$ -3201 3296 5039 -4782 -8213 761 5782 -559 -1619 4351 2960 -4805 -1633 10056 8441 -3957
564c957J33J0112O55p934J049N381n656n623R435P785j1157j1373P121J1581l665
$$ -3957 -3824 6288 6943 -991 58 5439 -217 -5840 3595 11380 223 -11150 -4029 7552 3887
579C887o548L596J603q046M28J3365K569j3849n510R712L944o647K052Q829o304
$$ 3887 -2661 935 2538 -5508 -5080 8285 10854 -2995 -8505 1207 5151 -1496 556 9385 3081
594C081j4205M269J5026n68j2970o86O686l245m021Q482N126j2857o955J2549
$$ 3081 -11124 -6855 8171 7603 -5367 -6053 633 -2612 -6633 1849 6975 -5882 -12837 -288
608b88R323j1066p677J0843N921j0625k394J1721J349j2967r17J3267O2j2153
$$ -288 9035 -2031 -9708 1135 7056 -3569 -5963 5758 7107 -5860 -6777 6490 6552 -5601
622e601J608J0695n449j2241Q112J3480q857j4600P473J4105p065j0364R054R011
$$ -5601 -3993 6702 1253 -10988 -2876 10604 1747 -12853 -5380 8725 1660 -8704 350 9361
636I361j0408p388J2653P762j3095n542J3553L593j4722k853J5841K045j6283
$$ 9361 -1047 -8435 4218 11980 -1115 -6657 6896 10489 -4233 -7086 8755 10800 -5483
649e483k139J3824n19j3325L529J3810n650j5529N782J5104n837j2025P349J0057
$$ -5483 -7622 6202 5683 -7642 -4113 9697 4047 -11482 -5700 9404 3567 -8458 -1109 8948
663H948r727q345J2093Q736j3461q994J3450P405j2994o053J3655K388j5820q79
$$ 8948 -779 -9124 2969 11705 -1756 -10750 2700 10105 -2889 -8942 4713 7101 -8719 -9598
677i598J6480m1j7547J2J6122p92j3241L399J2213q047j1944J2075J4514j2781
$$ -9598 6882 6841 -10706 -10694 5428 4636 -8605 -5206 7007 -1040 -12984 -909 13605 824
691H24j5111J1997J5026j1583j1507J2144Q588j4217p521J6098P028j6966n343
$$ 824 -14287 -2290 12736 1153 -10354 1790 10378 -3839 -11360 4738 11766 -5200 -10543
704a0543J5604L011j5745J53J6752k714j8136N367J9386m772j9788N055J8663
$$ -10543 5061 8072 -7673 -7520 9232 6518 -11618 -6251 13135 8363 -11425 -6370 12293
717A2293m577j5280O609J2557j0493j0506J3151J1049j4735j2002J4315R205j4348
$$ 12293 7716 -7564 -955 11602 1109 -9397 3754 14803 68 -11934 2381 11586 -2762
730b762o504J5511M008j8108k881J8284K742j8168j466J7577p94j6085L100J5369
$$ -2762 -9266 6245 10253 -7855 -10736 7548 10290 -7878 -9344 8233 7439 -8646 -5546 9823
744I823n513j3946Q318J4191j1636j5807J1885J5231j0828j2669J1201Q289j5584
$$ 9823 4310 -9636 -1318 12873 1237 -14570 -2685 12546 1718 -10951 250 8539 -7045
757g045o748J9645P906j9938r803J7344P419j4196j463J5662l233j9309M159K1707
$$ -7045 -13793 5852 13758 -6180 -15983 1361 8780 -5416 -6879 8783 5550 -13759 -9600 12107
771A2107k579j9450L173J6110p133j5136J1340J6724j2916j7241J1747J5315j1698
$$ 12107 9528 -9922 -6749 9361 2228 -12908 -1568 15156 2240 -15001 -3254 12061 363
784C63j1630J3729R526j5371q529J6193P197j6571l963J8654K171k0050k129J9845
$$ 363 -11267 2462 11988 -3383 -11912 4281 11478 -5093 -9056 9598 11769 -8281 -10410 9435
798I435J604j7256J346J5615o116j6949Q500J8250p579j7352P340J2911j0425
$$ 9435 11039 -6217 -4871 10744 4628 -12321 -3821 14429 6850 -10502 -3162 9749 -676
811f76j0677J4882J1136j6932j2417J5461J0683j4183o288J5352L226j8809k393
$$ -676 -11353 3529 14665 -2267 -14684 777 11460 -2723 -9011 6341 9567 -9242 -11635
824a1635J9754K330j8051n75J6166l247j7405N981J9098o735j8972O300J6382
$$ -11635 8119 10449 -7602 -8177 7989 4742 -12663 -6682 12416 5681 -13291 -6991 9391
837I391q706j3597J2102J3354j4208j3988J4613J2914j3492r428J4459O700j7247
$$ 9391 685 -12912 -810 12544 -1664 -15652 -1039 11875 -1617 -11045 3414 10114 -7133
850g133m787J9384M782j9053l490J7594J202j7226J632J8077m143j8328N460J7312
$$ -7133 -11920 7464 12246 -6807 -10297 7297 8499 -8727 -7095 10982 6839 -11489 -6029 11283
864A1283n894j5447Q061J4439j0530j3317J2206J2391j2717j0851J4555Q506j5642
$$ 11283 5389 -10058 -1997 12442 1912 -11405 801 13192 475 -10376 4179 12685 -2957
877b957p399J6708O195j7114n488J6461K387j5809J12J7117k132j8247K774J7364
$$ -2957 -10356 6352 12547 -4567 -10055 6406 8793 -7016 -6904 10213 8081 -10166 -7392 9972
891I972m102j5317O318J4117r695j4719J1721J5251j1482j4694J1180J0859j3152
$$ 9972 5870 -9447 -3129 10988 1293 -13426 -1705 13546 2064 -12630 -1450 9409 -3743
904c743q251J5956P905j7094q104J5831O052j4934k434J6442m04j8091J37J8685
$$ -3743 -11994 3962 11867 -5227 -13331 2500 8552 -6382 -8816 7626 7222 -10869 -10732 7953
918G953l26j6115K810J4346o301j5450Q209J7169q099j4942P819J1818j0160q845
$$ 7953 7627 -8488 -5678 8668 2367 -13083 -4874 12295 4196 -10746 -2927 8891 -1269 -10114
932a0114J3841R349j5153j0463J3888Q539j2174m452J4382J105j6622j091J7855
$$ -10114 3727 13076 -2077 -12540 1348 9887 -2287 -6739 7643 8748 -7874 -8965 8890
945H890J066j5851J76J3711k774j4187O317J4976p108j4860O880J3117q179j1056
$$ 8890 9956 -5895 -5719 7992 5218 -8969 -2652 12324 5216 -9644 -2764 10353 2174 -8882
959h882J0352J0074j1973j0083J2356Q214j2842o496J3857N282j5613m339J5442
$$ -8882 1470 11544 -429 -10512 1844 10058 -2784 -9280 4577 9859 -5754 -10093 5349
972E349K847j4217q17J4133j917j5295K811J5513k626j4352L582J1779o213j1012
$$ 5349 8196 -6021 -6838 7295 5378 -9917 -7106 8407 5781 -8571 -4989 6790 577 -10435
986a0435Q785J2000r156j2631Q760J0433r075p123J1583N662j3804n625J3331
$$ -10435 -1650 10350 1194 -11437 -2677 7756 -1319 -8442 3141 8803 -5001 -10626 2705
999B705O224j2325l891J1484P88j2455J548J4045j651j3984J934J2424l213j0306
$$ 2705 8929 -3396 -7287 4197 4985 -7470 -5922 8123 6472 -7512 -5578 6846 3633 -6673
1013f673O149J0100q082j0749Q488J0692q114q880R167O775j1171n252J1592N293
$$ -6673 -524 9576 1494 -9255 -767 9925 1811 -7069 2098 8873 -2298 -7550 4042 9335
1027I335j2506m357J2257K737j2175r22J2466p00j2062J322J2238l155j1970M133
$$ 9335 -3171 -7528 4729 7466 -4709 -5631 6835 6135 -5927 -4605 7633 4478 -7492 -3359
1041c359J1565m620j0936N349R671o946r229Q480Q413q552q241Q494O738r297
$$ -3359 8206 3586 -7350 -2001 7670 724 -8505 -25 8388 -164 -8405 89 6827 -2470
1055b470n009J0186L289j0671k986J1023K307j0325j593J0302l62j0115K390J0122
$$ -2470 -7479 2707 5996 -4675 -7661 3362 5669 -4656 -6249 4053 3691 -6424 -4034 6088
1069F088k958j0162L218R691l767q321N422P190o627o803P534O508p750n863Q101
$$ 6088 3130 -7032 -3814 5877 2110 -6211 -789 6401 -226 -7029 505 7013 -737 -6600 1501
1084A501M971q640l372R010K404r410j363R947J077j0156N5R594j075q860K641
$$ 1501 6472 -2168 -5540 3470 5874 -3536 -4899 5048 6125 -4031 -3976 5618 4543 -4317 -1676
1099a676Q465l300r118M153Q282m776p166N092O162o034o103P337N369p514n008
$$ -1676 6789 3489 -5629 -1476 6806 2030 -5136 -44 6118 84 -6019 1318 6687 -827 -5835
1114e835P616L879p784k874Q289J779q117j466P702K92p352O0P506j078p890K045
$$ -5835 1781 5660 -2124 -4998 3291 5070 -3047 -4513 3189 3481 -3871 -3811 3695 2617 -5273 -3228
1130c228O863k439o408L321N787l863n644M355N095m636m603N088L949n443l168
$$ -3228 3635 1196 -5212 -1891 3896 33 -5611 -1256 3839 -797 -5400 -312 3637 -1806 -4974
1145d974O172K173n652j426N795O65n900k23O712p28o423J521N376j270n536K787
$$ -4974 1198 3371 -2281 -3707 2088 2753 -3147 -3370 3342 2614 -3809 -2288 3088 1818 -3718 -931
1161i31M934l180n005L579M986l559m169M082L364m526k962N224K650n254k246
$$ -931 4003 823 -4182 -603 4383 824 -3345 737 4101 -425 -3387 1837 4487 -767 -3013
1176c013N394J505n650p47N139M97n390K12N173q01n196Q86N342j503m526R37
$$ -3013 2381 3886 -1764 -2511 2628 3125 -2265 -2053 3120 2319 -2877 -1991 3351 1848 -2678 -1741
1192a741M040j478l201K338K817k964l463L812K675l038k583K730J495l242l81
$$ -1741 2299 821 -2380 -42 2775 -189 -3652 160 2835 -203 -2786 -56 1439 -1803 -2184
1207b184L697L67m226o82L531O97k748k87K873p23k808J482L046j403k657J390
$$ -2184 1513 1880 -2346 -3028 503 1200 -1548 -1835 1038 315 -2493 -1011 2035 632 -2025 -635
1223f35K467j227j946J803J416k142j460K823J391l030j382K640J292k146j133
$$ -635 1832 605 -1341 462 1878 -264 -1724 1099 2490 -540 -1922 718 2010 -136 -1269
1238a269K329N14k454R8K557k19k192P0K218o0j942P32J543j011j802R41K011
$$ -1269 1060 1574 -880 -782 1775 1556 -636 -566 1652 1592 -350 382 1925 914 -888 53 2064
1255B064j186j672Q54J019o14r77O00J146j275o28K34J042q99n95R63P3m88m00
$$ 2064 878 -794 60 1079 465 -512 88 1234 -41 -669 -435 607 -292 -887 76 149 -339 -739
1273g39P23J7j87l3M84n61n18K28M77M37m96l55m84M88k5N47j57l75J41j43J47
$$ -739 -16 1 -186 -219 265 -296 -814 -586 -109 328 -168 -523 -1007 -519 -544 3 -154 -529 -388 -531 -384
1294c84O61j94k84n67J97K79N13k04q2J06j62K86J25j94l01K32O29q0p32j25L32
$$ -384 277 83 -201 -768 -571 -292 221 17 -65 41 -121 165 290 96 -205 27 656 576 -156 -281 51
1315E1l06j49J033L15q43j089R29O87q55L21R85m31j758P28J732k02j808M32J076
$$ 51 -255 -404 629 944 101 -988 -59 628 -227 94 1079 648 -1110 -382 1350 1148 -660 -228 848
1334H48m52j656J214J754j489j715J439J688j673j756J464J630j751j469K035
$$ 848 396 -1260 -46 1708 219 -1496 -57 1631 -42 -1798 -334 1296 -455 -1924 111
1349A11J209j849j163K408N23k259q68K585Q94k540n55K734n60k519R52K237j02
$$ 111 1320 -529 -1692 716 1239 -1020 -1888 697 1591 -949 -1504 1230 670 -1849 -897 1340 1238
1366A238l268N94K615j020k254J538K317j934j861K066J822k067j961L142J444
$$ 1238 -2030 -1436 1179 159 -2095 -557 1760 -174 -2035 31 1853 -214 -2175 967 2411
1381B411k927j831L327J098l210p71L868k13l563J66L625k26l444Q39L404j714
$$ 2411 -516 -2347 980 2078 -1132 -1903 1965 1752 -1811 -1645 1980 1754 -1690 -851 2553 839
1397H39l137K142L056j841l387K508K808k853k986L903J969l718k043M117J854
$$ 839 -2298 -156 2900 1059 -2328 180 2988 135 -2851 1052 3021 -697 -2740 1377 3231
1412C231m387j674M653O79m080p88M358j1m533O29M789j583m309J422M383j577
$$ 3231 -1156 -2830 1823 2502 -1578 -2366 1992 1981 -2552 -1923 2866 1283 -3026 -1604 2779 1202
1428A202m478K245L987k704l790L087L800l308l855L970K501l450k416M446J614
$$ 1202 -3276 -1031 2956 252 -3538 -451 3349 41 -3814 156 2657 -793 -3209 1237 2851
1443B851m725j185M749J044n495K96M706l53m460N49M748j431m252K179M606l010
$$ 2851 -1874 -3059 1690 2734 -2761 -2465 2241 1888 -2572 -2023 2725 1294 -2958 -779 3827 817
1459H17m464L125M390l435l815L752L206m318k731M735K807n144k275M941J753
$$ 817 -3647 -522 3868 433 -3382 370 3576 -742 -3473 1262 4069 -1075 -3350 1591 3344
1474C344n309p43N600K12o147M14O077o67n900J177N715k068n309K613N232k822
$$ 3344 -1965 -2708 2892 3104 -3043 -2629 3448 2781 -3119 -1942 3773 1705 -3604 -991 4241 1419
1490A419n411L390M724m238m044M608L601n060l158N449K160n400k192O520J257
$$ 1419 -3992 -602 4122 -116 -4160 448 4049 -1011 -4169 1280 3440 -1960 -4152 2368 3625
1505C625o401p65O145K0n779O2O437j322n842J299O408k413n523K979M877l781
$$ 3625 -2776 -3541 2604 2624 -3155 -3093 3344 2022 -3820 -2521 3887 1474 -4049 -1070 3807 26
1521B6m599M520M414m545l982M920L006n318k375O289K027o616j716O259J102
$$ 26 -4573 -53 4361 -184 -4166 754 3760 -1558 -3933 2356 4383 -2233 -3949 2310 3412
1536C412n911j67O270j071o428J499O652j792o160K170N820l352n338M072N561
$$ 3412 -2499 -2666 3604 2533 -3895 -2396 4256 2464 -3696 -1526 4294 942 -4396 -324 5237
1551E237m946n395N019M832m938m376O091K948n986l074O677J814o186j723O911
$$ 5237 291 -5104 -85 4747 -191 -4567 1524 4472 -1514 -4588 2089 3903 -2283 -4006 2905
1566B905N88o896J35O822q76o514J406O543k587o137K812N806l064n635L827N031
$$ 2905 3493 -3403 -3268 3554 2678 -3836 -2430 4113 1526 -4611 -1799 4007 943 -4692 -865 4166
1582D166m317m263N160L848n835l679N873L081n990j763O083J152p140k12P175
$$ 4166 -151 -4414 746 4594 -1241 -4920 953 4034 -1956 -3719 2364 3516 -3624 -3836 3339
1597C339qo784L21O771j609o075K291O644l291o515L545N828l347n416M726M462
$$ 3339 3331 -3453 -3132 3639 2030 -4045 -1754 4890 1599 -4916 -1371 4457 1110 -4306 420 4882
1613D882n725m410O693L795n945l633O262K332o581j620P268J219p415n55O670
$$ 4882 -843 -5253 1440 5235 -710 -4343 1919 4251 -2330 -3950 3318 4537 -2878 -3433 3237
1628C237lo589J025O830k335o845K569O597k485o139L396N073m672m895N587M778
$$ 3237 3234 -3355 -2330 4500 2165 -4680 -2111 4486 2001 -4138 -742 4331 -341 -5236 351 5129
1644E129n460m296N419L130n881k274O793J773p017j826O768Q40o227P93O223
$$ 5129 -331 -4627 792 3922 -1959 -4233 2560 4333 -2684 -4510 2258 3098 -3129 -2336 3887
1659C887j467p114J941O978k112o148K820N271l902n486M916N362m598n336M936
$$ 3887 2420 -4694 -2753 4225 2113 -4035 -1215 4056 154 -5332 -416 4946 348 -4988 -52
1674e2L956n230k755O070K516o597k482O511K047o134r82O643k53p312J033O659
$$ -52 3904 -1326 -4081 1989 4505 -2092 -4574 1937 3984 -2150 -3132 3511 3258 -4054 -3021 3638
1690C638n95o377J647N656k687n593L783N899l947n882L944M787m257m041N382
$$ 3638 3043 -3334 -1687 3969 1282 -4311 -528 5371 1424 -4458 -514 4273 16 -4025 1357
1705A357L555o183l041N413K988n810j382N715P06o834j46O537N25o320O28N426
$$ 1357 4912 -1271 -4312 1101 4089 -1721 -3103 2612 3318 -3516 -3662 2875 3400 -2920 -2292 3134
1721C134j778n684L142N525k882n926L280M984l713m266M783L564n511l607N796
$$ 3134 1356 -4328 -1186 4339 1457 -4469 -1189 3795 82 -4184 599 4163 -1348 -4955 841
1736H41L716n881k471N772J255o371m02O526N14o361m94O186o12n882K177N904
$$ 841 4557 -1324 -3795 1977 3232 -3139 -3541 2985 3499 -2862 -3356 2830 2218 -3664 -1487 4417
1752D417k740n770K621N201k872m555L847M052m373m368M948L622m367k980M691
$$ 4417 1677 -4093 -1472 3729 857 -3698 149 4201 -172 -4540 408 4030 -337 -3317 1374
1767A374K284n202j806N726J415o001o13M904P11n682P06N898j456n815J701N514
$$ 1374 3658 -1544 -3350 2376 3791 -2210 -2823 2081 2792 -2890 -2184 3714 2258 -3557 -1856 3658
1783C658k415m377K623M254l469m361L967M070m146l427L958K719m422k320N117
$$ 3658 1243 -3134 -511 3743 274 -4087 -120 3950 -196 -3623 335 3054 -1368 -3688 1429
1798A429J780m631j900M945Q59n182j69O158r56n622R91N272j446m973K017M795
$$ 1429 3209 -1422 -3322 1623 2482 -2700 -2869 3289 2333 -3289 -2298 2974 1528 -3445 -1428 3367
1814C367l074m184L243M297l186l985L252L379l950k437M421K338m765k214M702
$$ 3367 293 -3891 -648 3649 463 -3522 -270 3109 -841 -3278 1143 3481 -1284 -3498 1204
1829A204J666m676q45M882K22m888J02M998k53m803O95M471j463m137J903M026
$$ 1204 2870 -1806 -2651 2231 2453 -2435 -2333 2665 2412 -2391 -1696 2775 1312 -2825 -922 3104
1845C104j977l667K323L380l367k684L323K503l258k790L927J804l797j452M297
$$ 3104 1127 -2540 -217 3163 -204 -2888 435 2938 -320 -3110 817 2621 -1176 -2628 1669
1860A669N73l961n78M196J98m288M43M136j180m072J728L713j763l581J830L233
$$ 1669 2242 -1719 -2297 1899 2097 -2191 -1748 2388 1208 -2864 -1136 2577 814 -2767 -937 2296
1876B296j866k957K448K928l163k648L658K216l706j759L356J227l308j273M156
$$ 2296 430 -2527 -79 2849 -314 -2962 696 2912 -794 -2553 803 2030 -1278 -2551 1605
1891A605M46l840q6L901o07l883J049M018j259l650J166L498j619l052K208K556
$$ 1605 2051 -1789 -1875 2026 1419 -2464 -1415 2603 1344 -2306 -1140 2358 739 -2313 -105 2451
1907B451k555j956K269K214k579k012K788J750l216q59L066P88l438k71L018J93
$$ 2451 -104 -2060 209 2423 -156 -2168 620 2370 -846 -1705 1361 2149 -1289 -1560 1458 1651
1923A651l127M8L394p14k987P64K795j086k631J483K452j587k523J929K057k017
$$ 1651 -1476 -1428 1966 1252 -1735 -971 1824 738 -1893 -410 2042 455 -2068 -139 1918 -99
1939i9j926K255J740k667j291K430J412k685q78K750R6k480l51K832j66k520J75
$$ -99 -2025 230 1970 -697 -1988 442 1854 -831 -1709 1041 1137 -1343 -1694 1138 972 -1548 -1373
1956a373K841n72k432R32K241r90k430J304J938j318k044J742J756j726j352J697
$$ -1373 1468 896 -1536 -604 1637 647 -1783 -479 1459 141 -1903 -161 1595 -131 -1483 214
1972B14J353j890j320K206Q91k214m27J859M82j860k48J858M05k396K83K129o58
$$ 214 1567 -323 -1643 563 1454 -760 -1187 672 1154 -706 -954 904 1309 -1087 -804 1325 667
1989F67j467J80J853o86j756J213J226j150j561J735J031j454q30J329J020j671
$$ 667 -800 -620 1233 547 -1209 4 1230 80 -1481 254 1285 -169 -999 330 1350 -321
2005c21m19J326L02j659l3J523L7j386j35J494m7j640L90J219o29r55O44J278
$$ -321 -740 586 888 -771 -804 719 756 -630 -765 729 682 -958 -568 651 22 -933 -289 989
2023I89q33j559J234J219j009q22N67J262j246p43J078Q19j159m02J049J92j057
$$ 989 156 -1403 -169 1050 41 -781 -214 1048 -198 -941 137 956 -203 -605 444 636 -421
2040d21j82R41n6p83r6J137Q0j237K18Q47k25p99J21J200l75n98L28M65l95l86
$$ -421 -603 338 282 -501 -597 540 620 -617 -399 448 223 -576 -455 745 370 -228 100 565 170 -216
2060b16Q7O90p13r4N82J48l40k35L79j28o91M37N53k30k98J75L88k98k84O9K13
$$ -216 -129 561 -152 -246 336 484 144 -91 288 160 -531 -94 459 229 -69 106 494 196 -88 -19 194
2081A94L3k38n9L52j30j93J1J52k68l22M60J19l59M08r2J00k45k17N63l15L21
$$ 194 227 -11 -70 282 152 -41 -30 122 -146 -468 -8 111 -248 160 68 168 -77 -294 269 -46 275
2102B75l89J88J22j25r1l7j0K53k87PK23j23l8n4Mj06K74m5J12K78n72K58nJ08
$$ 275 -114 74 196 71 -20 -57 -67 186 -101 -94 129 6 -32 -86 -82 -188 86 41 153 431 -141 117 112 220
2126B20m75M86k24L65l17l22N67L5n34o6N01l81l16M32O61n51n43M03N21k86n06
$$ 220 -255 231 7 372 55 -267 300 335 -199 -265 236 -145 -461 -29 632 81 -462 -59 462 176 -330
2147c30N39K3l2p33N01M23n01k94K67M55l82j73N95l05m15K9P91l02q27O91L35
$$ -330 209 232 200 -533 -32 391 -110 -404 -137 318 -64 -237 358 53 -362 -333 458 156 -671 20 355
2168C55j94r15P38O57o83p43R24Q8o19m82J057K52p24k65R15K55r40m84J308Q9
$$ 355 161 -754 -16 641 -42 -785 139 227 -392 -874 183 435 -289 -554 361 616 -324 -808 500 589
2188E89j118o1J061O0j060m2J385k78j369N22R84k71j253P88R17q69r26R39P74
$$ 589 -529 -590 471 531 -529 -571 814 536 -833 -311 673 402 -851 -63 854 -15 -941 -2 772
2207G72o26j041J220N39j066n64J312J68p94l08R84K13j083l13J281l35j198J72
$$ 772 146 -895 325 864 -202 -766 546 714 -80 -388 596 809 -274 -587 694 359 -839 -667
2225f67J605o02j070K72J423j053j132J284J203j319r58J267N61r61q57J247N96
$$ -667 938 336 -734 -462 961 -92 -1224 60 1263 -56 -1014 253 814 -147 -1004 243 839
2242H39j317n04J590J99j446j38J624j47j595K57J543j27j398K50J384k40j765
$$ 839 -478 -982 608 807 -639 -777 847 700 -895 -638 905 778 -620 -370 1014 774 -991
2259i91N95J651q92j567J201J237j324j110J461R17j345j307K027Q13j918o72
$$ -991 -396 1255 363 -1204 -3 1234 -90 -1200 261 1178 -167 -1474 553 1366 -552 -1224
2275a224J901J12j723L0J393O33j869K26J481k10j813N06J712o90j733J288J083
$$ -1224 677 789 -934 -904 489 1122 -747 -521 960 750 -1063 -557 1155 465 -1268 20 1103
2292A103r92j538J461J107j185j233J344J589j889j028J901P90k174l38J684O26
$$ 1103 111 -1427 34 1141 -44 -1277 67 1656 -233 -1261 640 1430 -744 -1082 602 1228
2308A228k364K15J701N7k201Q04J925p43j753M43K145j126j675R18K093j668j293
$$ 1228 -1136 -921 780 837 -1364 -560 1365 622 -1131 -688 1457 331 -1344 -426 1667 -1 -1294
2325a294J401J214j665r78J758R54k186p86K269R64k358q92K572M07k229j59K052
$$ -1294 107 1321 -344 -1322 436 1390 -796 -1582 687 1651 -707 -1599 973 1380 -849 -1008 1044
2342A044p1k260N38K139p60k029R84J912j065j878J041J812j041j800J535J366
$$ 1044 973 -1287 -749 1390 630 -1399 -415 1497 432 -1446 -405 1407 366 -1434 101 1467
2358A467j659j040J722O43j952n33K125L80j695p61K406J49k696R16J780m30k083
$$ 1467 -192 -1232 490 1133 -819 -1352 773 1153 -542 -1303 1103 1252 -1444 -528 1252 822 -1261
2375a261Q31J870j472j396J169J544j006k018J853J583j855j594K103J442j992
$$ -1261 -430 1440 -32 -1428 -259 1285 279 -1739 114 1697 -158 -1752 351 1793 -199
2390a99j064J885M87j718p21K139K72k563K27K155L96k687O99K118p49k118R15
$$ -199 -1263 622 1109 -609 -1330 809 1081 -1482 -1255 900 1296 -1391 -692 1426 677 -1441 -526
2407e26K011r51k066J390J546j607j494J885J581j973j597J696J437k097o74K130
$$ -526 1485 534 -1532 -142 1404 -203 -1697 188 1769 -204 -1801 -105 1332 -765 -1439 691
2423F91O72k166m67J970L91j934K96J717n19k036O76K306p40k471J235J465j071
$$ 691 1363 -803 -1270 700 1091 -843 -547 1170 651 -1385 -709 1597 857 -1614 -379 1086 15
2440A5j593J270J983j555j287J388J203j682r88J910R49k442r56K373P25k187
$$ 15 -1578 -308 1675 120 -1167 221 1424 -258 -1246 664 1613 -829 -1785 588 1313 -874
2456h74j26J958l0k230J81K280m31j813M61J722p94j815J154K046j410j982J304
$$ -874 -1000 958 928 -1302 -1121 1159 728 -1085 -624 1098 304 -1511 -357 1689 279 -1703 -399
2473c99J737j315j591J543J581j927j004J882R97k012p14J915J77j849l79K466
$$ -399 1338 23 -1568 -25 1556 -371 -1375 507 1504 -508 -1222 693 870 -979 -1358 1108
2489A108K53k321P7J676j03k054R42J897j052j796J123J619j417j160J644J079
$$ 1108 1361 -960 -883 793 690 -1364 -422 1475 423 -1373 -250 1369 -48 -1208 436 1515
2505A515j639j601J788J499j781q64J799L13j648m70J747N22k103L2K030j58k015
$$ 1515 -124 -1725 63 1562 -219 -1083 716 1029 -619 -1089 658 1180 -923 -891 1139 981 -1034
2522a034J62K095n63k094P77J997j019j532R37J438j487j084J569J392j537j448
$$ -1034 -872 1223 660 -1434 -657 1340 321 -1211 -274 1164 -323 -1407 162 1554 17 -1431
2538a431J808R66k412k84K197O37k448l69J802M40j839M61J829n38k079M79J755
$$ -1431 377 1343 -1069 -1353 844 1481 -967 -1336 466 906 -933 -472 1357 819 -1260 -781 974
2555I74n76j103L55J607j010j852J753R15r55j420J469J127j769p05J608O18j410
$$ 974 398 -705 -350 1257 247 -1605 148 1063 108 -1312 157 1284 -485 -1190 418 1036 -374
2572c74q62J820M69j737k30J799j67j989O12J598l70j650M67J931r29j568P55
$$ -374 -1236 584 1053 -684 -914 885 718 -1271 -659 939 569 -1081 -614 1317 388 -1180 -425
2589d25J673j016j731J239J472j043j428J642P31j626n65J416Q58j881j18J795
$$ -425 1248 232 -1499 -260 1212 169 -1259 383 1114 -512 -1077 339 1197 -684 -802 993
2605I93l07j529o3J836P5j767K7J867o60j572O70J322m07j753J074J213r72q74
$$ 993 686 -843 -906 930 1005 -762 -735 1132 472 -1100 -430 892 485 -1268 -194 1019 47 -827
2623h27J025O13p91j334J284J096j470m59J294L72j404l38J441M86j789J66J483
$$ -827 198 811 20 -1314 -30 1066 -404 -863 431 803 -601 -939 502 988 -801 -635 848
2640H48l53j418L16J364k48j117K42J313q45j353J390J092j380r15J340R60j547
$$ 848 495 -923 -607 757 509 -608 -366 947 102 -1251 139 1231 -149 -1064 276 1236 -311
2657c11p43J081P86j213o24J426N45j581j14J330q9j306L39J693p54j454M79J406
$$ -311 -1054 27 813 -400 -1024 402 947 -634 -748 582 493 -813 -474 1219 465 -989 -510 896
2675H96l27j315L95J309p75j125J157Q83r52r85Q33P61q50o94J209L40j186m08
$$ 896 569 -746 -351 958 183 -942 215 1098 146 -839 -6 755 -95 -789 420 760 -426 -834
2693h34J481j54o59o63J433n12q35L08J006l21j076M99J312l83j396M76J217p80
$$ -834 647 493 -166 -829 604 92 -743 -435 571 250 -826 -327 985 602 -794 -318 899 119
2711A19j200J071P84j067k55N40O11j015j31P91L67r58l51R76K99j087q1R57L50
$$ 119 -1081 -10 774 -293 -548 -8 603 -412 -543 248 615 -343 -694 282 581 -506 -587 370 720
2730G20j078MR23m27n95OJ251j108j98L97R16q25l97M11N54l21q71R95J69p43
$$ 720 -358 -354 569 142 -453 -447 804 -304 -502 -105 811 -14 -411 0 554 233 -638 357 526 -217
2750b17j88N24L86p93k6O48J92r83N6Q88Pr56j05R92k11n07q9R53n14p87P66P73
$$ -217 -405 119 505 -288 -314 334 526 -457 -401 487 494 -462 -567 425 214 -293 -382 571 57 -730 36 809
2772H09q14n40M56P26o26j22K48Jn37j04O20L68p98j36O56qm91J19P94n48o43
$$ 809 -5 -545 -89 637 11 -111 137 138 -399 -503 117 485 -313 -449 207 199 -292 -173 621 73 -570
2793e70K14R36l79m46K71J48R6n77N20K81m43l71J61Q00n41m62L04N30o25l4M05
$$ -570 -356 580 201 -245 26 174 270 -307 213 494 51 -320 -159 641 100 -362 -58 472 -153 -187 218
2814B18J48p56K51M87l57l90J69M12K8m00p4O46j05p52L59N07l66k22K02K0Rl01
$$ 218 366 -390 -139 348 -9 -399 -230 182 210 -190 -264 382 277 -475 -116 391 25 -197 5 25 34 -267
2836b67L69Kl40K75K63J03m07J59j54J68m06Q8J89P3k03J29l71L9J13K33K3j62
$$ -267 102 104 -236 39 302 405 -2 157 3 171 -235 -147 42 115 -88 41 -330 -291 -178 55 78 -84
2858h4k69L01L27l00qk93P40k58l15K88j34J33l20L65J02k75n31Q57L4m64k38
$$ -84 -353 -52 275 -25 -33 -326 414 156 -159 129 -5 128 -192 173 275 0 -531 326 360 -104 -342
2879c42L20J23k21l5K31J16l01J59O6J57m39J59j48J62k22J74M52k01j96J21J81
$$ -342 -22 101 -120 -155 76 192 -109 50 116 273 -166 -7 -155 7 -215 -41 411 210 14 135 316
2900C16l79J95k1n8k26J75J34j39j03K27O2o2l69K32oj50N89q09L63l9M7J72j76
$$ 316 -63 132 111 53 -173 2 136 -3 -106 121 183 121 -248 -16 -22 -172 417 -392 -29 -68 -21 151 -25
2923b5j64J97K56r8p2N9j66J00K8l23p5N59J8m33Q4m8P4J40j66Q9j43L20l53J29
$$ -25 -189 8 264 166 94 153 -13 87 115 -208 -283 276 294 -139 -55 -103 -29 111 -55 34 -109 211 -142 -13
2947a3P4k45Q5R3L40j65j78k55J30K80k72L91n04j9L48j80L96l97N4R3Q4j23k3
$$ -13 61 -184 -99 -6 334 169 -9 -264 -134 146 -126 265 -239 -258 90 -90 306 -91 -37 56 140 17 -6
2970fJ09o8k36J80K45L9k38j84L12l15K83L7J64l05k44l1J36J12m27N36L4k07
$$ -6 103 35 -201 -21 224 263 25 -159 153 -162 121 158 322 17 -227 -258 -122 -10 -437 99 133 -74
2992g4j67K68q5o7P7J83k71l21K35L16J28l18J29O36m13k46j62N88m24l83M83
$$ -74 -241 27 -58 -125 -48 135 -136 -457 -222 94 222 -96 33 669 256 10 -152 436 12 -371 112
3013A12kj12N6m6K51l33k72L01N9j10k00O20m22J11KK33o9k51j43O43o55K07J79
$$ 112 110 -2 54 8 259 -74 -346 -45 14 -96 -296 324 -98 13 15 248 179 -72 -215 428 -227 -20 159
3036A59N05n09l60J27M80m03M5k3J37m63L13R7K1k70m5L61J19p48K22K44L76o05
$$ 159 664 155 -205 -78 402 -1 44 21 158 -305 8 105 126 -144 -189 172 291 -457 -235 9 385 -220
3058b20J25K86J80q49K22O61l00k77k77M61K21n34K19J64k49J89j6L73l89n39
$$ -220 -95 191 371 -478 -256 405 105 -172 -449 12 233 -301 -82 82 -167 22 6 379 -10 -549
3078e49N08K40j33k02K44J23n49M14J66O5p92J70P09r5m50K2L25L3o98L67O16
$$ -549 -41 199 66 -136 108 231 -318 96 262 327 -465 -295 414 319 -131 -109 216 249 -449 -82 534
3099E34l56p35M14M61k37l45J41O84n98k83N09K49o00j42N50K09p44q4M52o6m75
$$ 534 178 -557 -143 318 81 -264 -123 561 -37 -320 189 438 -162 -304 246 455 -289 -373 79 13 -462
3120d62M93J66R7n28m2N45o9o80K88N08m30j30J3M25k38l48K13L15k10k46L85
$$ -462 31 197 294 -234 -276 269 200 -480 -192 316 -114 -244 -231 194 -44 -392 -179 136 -74 -320 65
3141F5J87m22r2L28K10n06l7M54k53n53L84N35q9j021M80R83m02n83K72L94l85
$$ 65 252 -170 -262 66 276 -230 -267 187 -66 -619 -235 300 211 -810 -330 653 251 -332 -60 334 -51
3162e1j94j76P87l89l02M09K46o20l3P33Jn95l69N76M36l63o23P06R1o13L7Q33
$$ -51 -245 -421 366 -23 -325 84 330 -290 -323 410 411 -184 -553 23 459 96 -527 179 270 -343 -306 527
3184E27m66m24L61N87l44m89J45M95mj095O94L36l25m36N32L54p00j44O33J17
$$ 527 61 -363 -2 585 241 -248 -103 392 388 -707 -13 323 -2 -438 94 448 -252 -396 237 354
3204C54n65l62J010K34j102P8N31j01j80j72P91k40p01K87O80p45l39L95N84n14
$$ 354 -211 -573 437 671 -431 -353 178 77 -103 -275 516 276 -425 -138 542 -203 -542 -147 437 -77
3224g7k92O35R0n37l93P34J3l87k72P55N7o16m8P29L7p75o1Q04N8m49o2L42q4
$$ -77 -369 266 356 -181 -574 160 173 -214 -486 269 326 -290 -338 391 428 -347 -408 396 454 5 -57 285 201
3247B01o46L54L35J09q37k8P52n5o70O01J02k12l62L04N31k77p97N94L57j012
$$ 201 -445 -91 244 353 -484 -512 240 185 -485 116 218 6 -356 -52 479 202 -595 -1 356 -656
3267f56L43M90L40p29l6N88j32m38p2R50m34o70L15K65j54m11O23K81n44k82J79
$$ -656 -313 177 517 -212 -248 340 208 -230 -302 648 214 -456 -141 124 -30 -441 182 463 -81 -363 -184
3288a84J021r03l08O16P5n77j77N84N45p54l89Q35L8n21j54M23p2o68L04O04j27
$$ -184 837 -66 -374 242 317 -260 -437 147 692 -62 -451 384 422 -99 -253 170 98 -570 -266 338 211
3309B11n90J7P78j24o17L20L81o67l65L08O21l95l36K73M78n56N2M92K40n59l25
$$ 211 -379 -362 416 292 -325 -5 376 -291 -656 -348 273 -122 -458 -185 293 -263 -211 281 521 -38 -363
3330c63P23j31q54M52N57Pq50M32O89o05m78K99N87k57m41L12M49m08n30M93J17
$$ -363 360 229 -625 -173 384 391 -459 -27 662 57 -421 -122 465 208 -233 79 528 120 -410 83 200
3351B00m19k91N12K03o05k51P44J87o48J00L64L31o50j44O00l2p19J73Q75m55
$$ 200 -219 -510 2 205 -400 -651 93 280 -368 -268 96 427 -223 -367 233 201 -518 -345 530 75
3371G5o45L43M82k88l14M89M24o82k50N56N9j0n66J94O44p81j65N61J66l89q3
$$ 75 -570 -227 255 -33 -347 142 566 -116 -366 190 249 239 -327 -133 511 -270 -435 126 292 -97 -180
3392a80M05j02n36O16J16p2n95K21O24m07n93M72N40o36m35O90K59m14m88M12
$$ -180 225 123 -413 203 319 247 -348 -127 497 90 -503 -31 509 -127 -562 128 387 -27 -515 -103
3412a03O84m40o09O96J2m67k54P74J34n87l44O72R5l87l92P02o4q8k86M93j83
$$ -103 581 141 -468 228 240 -227 -481 293 427 -160 -504 168 263 -124 -516 186 122 34 -252 241 58
3433E8l05J48M61m77l93L48K77k55l11O43K37o11j75K75L24l39j60M24j06l10
$$ 58 -247 -99 362 -115 -508 -160 117 -138 -449 194 431 -180 -355 -80 244 -95 -255 169 63 -247
3453b47k0N40%p66L33M48n03k28L98L11O5o73J89P41p06l74O19K55m56l53L91
$$ -247 -267 273 273 -493 -160 288 -215 -443 -45 266 331 -342 -153 588 -118 -492 127 382 -74 -427 -36
3474c6J66J07n81K90R7l80J68M00j48m7m54N37M9l11J46R1J18l39ON68m97k81
$$ -36 130 237 -344 -54 43 -337 -169 231 83 36 -418 119 168 -143 3 94 212 -127 -121 447 -50 -331
3496c31M89L87n99k67J63M07k77j75L25L78n33m88P13K69o99o6N24L1n60lN20
$$ -331 158 545 -54 -321 -158 249 -28 -203 122 500 -33 -521 192 461 -238 -304 220 251 -309 -312 208
3517B08n12j63J0O22k13j58K08K56j31o36M41L87l39l54N12n8k20j57L99J01m21
$$ 208 -304 -467 -457 165 -48 -206 2 258 127 -509 -68 319 -20 -374 138 80 -140 -297 102 203 -218
3538b18J06L00L02o21r7M12k7j38k49M46j54k86l4L08J55o19N07J57l30k19K41
$$ -218 -112 188 490 -131 -228 184 157 19 -230 216 62 -224 -258 50 205 -414 93 250 -80 -299 -58
3559e8L03k05j10m7M40n40j53M13Jj86j65N60j2l13k83N45l90o4r8O42l54k93
$$ -58 245 40 -70 -117 323 -217 -370 43 44 -142 -307 253 241 -72 -355 190 -200 -264 -362 280 -74 -367
3581c67K37N05j31m39O3L40mm87K45L02k60n6o4J76n4m0j44L08l17K12l5K38l99
$$ -367 -130 375 244 -195 -132 208 204 -283 -38 264 4 -52 -116 60 6 -34 -178 130 -187 25 -10 228 -171
3604a71Q3J21M48n67j79L50J91o53L97J7K6j66k09M47k54l7k49N18R5k07j31L57
$$ -171 -88 33 481 -86 -265 85 276 -377 20 37 63 -103 -312 135 -119 -156 -405 113 208 1 -130 227
3626B27k01k22L73Qm13J14J53O2M6m08L50j79l0p9N98o15J1M62l11K93j33J45
$$ 227 26 -196 177 185 -228 -114 39 101 147 -261 89 -90 -120 -199 399 -216 -205 257 -54 239 106 251
3648B51n16K31r8M5J91j96L1K64jk99J20M9n1n1p3J96J7m49J88K85K23m06k26
$$ 251 -265 -34 -132 -87 104 -92 -61 203 202 -97 23 72 21 -30 -103 93 110 -339 -151 134 357 -49 -275
3671b75J33K40O8k63J43k9k78M8J91N0k13Q0J23p4l62L03K88j92p5M8k08L40k53
$$ -275 -142 98 166 -97 46 17 -261 -213 -22 28 -185 -105 18 -56 -418 -115 173 -19 -94 -46 -254 86 -167
3694a67J98R8m16K24M41k07j73K2K33m35K4nM4n8L17j80RK28l11J0j26J51j09
$$ -167 31 129 -287 -63 378 171 -2 20 253 -182 -158 -163 -119 -177 140 -40 -31 197 -114 -104 -230 -79 -188
3717a88J49k2J36N1l00j28J29J92q8K71M4l68L35j43J23P8k81N7J0j04J49j28
$$ -188 -39 -61 75 126 -174 -302 -173 19 -69 202 246 -122 213 70 193 271 -10 47 57 -47 102 -26
3739b6j06M96k88m5l36J52J60Q5L09l58j86j11L15p5L1N18k23j53n24L34n5k5
$$ -26 -132 364 76 31 -305 -153 7 92 401 43 -143 -254 61 -14 17 535 312 159 -365 -31 -86 -111
3761a11J39j93J78k27Q5L88l75L3K10l3m9J51m67L97k09k67M71l5J76o9k42J3
$$ -111 28 -165 13 -214 -129 259 -116 -83 127 94 45 196 -271 126 -83 -350 121 86 262 193 -49 -36
3783c6j43k00K68J40l06M42k48K06p6J25k78R4j85M38nj78l0q4J78l00J76J24
$$ -36 -179 -379 -111 29 -277 165 -83 123 47 172 -106 -12 -197 241 236 58 28 -56 122 -178 -2 122
3805A22p7k01j36K88J58k04k1J72J02r0j78J28pm9o6j35K95l19K17q2N80l30j13
$$ 122 45 -156 -292 -4 154 -50 -71 101 203 113 -65 63 56 7 -59 -194 101 -218 -1 -83 497 167 54
3828E4K52l43k57L70K08n51m7O06k19L3j32o4L56n73J04K13m2J55l30M66j55o10
$$ 54 306 -37 -294 76 284 -267 -314 292 73 106 -26 -90 266 -307 -203 10 -32 123 -207 259 104 -506
3850e06M88K40r6j21r1J83J99k82M0o7K27r9m5J83l83J30n2K40l15k34N28N3l59
$$ -506 -18 222 126 5 -86 97 296 14 54 -13 214 115 70 253 -130 0 -52 188 -127 -361 167 220 -139
3873a39l9M04n30J44L77j55j18l0j65N94l0n85N2M81k41NMM28m61k27L95p8j0
$$ -139 -178 226 -304 -160 217 62 -56 -86 -251 343 313 -272 -220 261 20 25 29 457 -4 -231 164 86 76
3896G6m01M26J88m79j99O29J81m96lL96o2n6k31k9L9l14M96j5k28l27M00K78l07
$$ 76 -325 101 289 -190 -389 240 421 -75 -78 318 256 200 -31 -60 -21 -335 161 146 -82 -409 -9 269 -38
3919c8j6P8N28m74k22L81P2m86k1K43L39l59j73L15r8k41m3L43k42l33L93PP4
$$ -38 -54 24 552 78 -144 237 309 -177 -198 45 384 25 -148 167 69 -172 -215 128 -114 -447 -54 -47 27
3942B7l50K50K60k64k49N70J77k65n25N29l7k6n10K58L49n04J0N72l3m88l31Q22
$$ 27 -323 -73 187 -77 -326 244 421 156 -369 160 123 97 -413 -155 194 -310 -300 272 239 -249 -580 242
3964B42Lm35j6M30k65j36L20l3J24m99K05K67n6m06K72L55m08k75K26N94l58l65
$$ 242 245 -190 -206 224 -41 -177 143 110 234 -265 -60 207 151 -255 17 372 -36 -311 -85 509 151 -214
3986b14J30O94o53n33P03K97o45l00Q13k01m37J61L40J87o65lN32m7n93J40Q57
$$ -214 -84 610 -43 -576 127 424 -221 -521 292 91 -346 -185 155 342 -323 -326 206 159 -434 -294 563
4007E63l72k68L5P4L9l58M25K03l18k41N73J6m36j28L84pl23k37O12K39o19j24
$$ 563 191 -77 -42 32 71 -287 138 341 23 -218 355 371 -65 -193 191 184 -139 -376 236 475 -144 -268
4029b68N26j2n63J63N68p6m67K73K74k59l79L74K11l53l06N18L6l53k80L60M32
$$ -268 258 246 -317 -154 414 338 -129 144 418 159 -220 154 365 12 -294 224 260 -93 -373 -13 419
4050D19p26l7L02M76m92k98N28k51j27J69L05K70q41K1N63l63m1J18L30l77l94
$$ 419 -307 -344 -42 434 -58 -356 172 -79 -206 -37 268 538 -303 -282 281 -82 -123 -5 325 -52 -446
4071d46K55M99j85j65L20J83n61o09R02J31o55J52K27J66k2n26O14k21m24K03
$$ -446 -191 308 123 -42 278 461 -100 -709 193 324 -331 -179 48 214 192 -334 280 59 -365 -162
4091a62K65J75o55M35L03k05q19P89M27o78p3N71o1n18k04P00K13o42q9L06N30
$$ -162 103 278 -377 58 361 156 -663 126 553 -125 -198 373 312 -206 -410 290 503 -139 -228 78 608
4112F08p80p5P25j58n56N0N50n0n69j31Q38n33q59Q31O55m99m39L15K55k36l64
$$ 608 -172 -247 478 320 -236 -186 364 314 -255 -386 452 -81 -940 -109 546 47 -392 -77 178 -58 -422
4133d22M13K96m78k01N22J23n03k67R52j60n32PO31J0k82j86M48k65l75N0N25
$$ -422 -9 287 -191 -392 130 253 -250 -517 435 275 -257 -250 381 391 109 -77 371 106 -269 -219 306
4154C06o7k02k1R7J76p46Q98p6o47o5N01L43m88k27M22J41n18k30P87J34p70M06
$$ 306 239 37 16 113 289 -457 441 365 -282 -347 154 497 9 -218 204 345 -173 -403 384 518 -252 154
4176A54J03J15o86K96J34j60k13L24K38l61k9j75N19l99m41P01J01j10n94P20
$$ 154 257 372 -314 -18 116 -44 -257 67 305 -56 -85 -260 259 -140 -581 120 221 111 -483 237
4196B37J93n40l85P87m1k77l64O45J56o38N8O92l85l36o7K03L43n83M1O03m46
$$ 237 430 -110 -495 292 251 -26 -390 255 411 -227 -169 523 138 -198 -265 -62 281 -302 -261 342 -104
4217a04n89P09J89L2m95K33K05l98j44N35pk86P6M46j48l01j53K91K65m35k3L07
$$ -104 -693 16 205 237 -258 -25 180 -218 -362 173 166 -120 -44 402 254 -47 -200 91 356 -79 -102 205
4239B05l0l79J30O45o00j37M61L8j24m82J83J77l58j33M17L91n28k75O37j07l46
$$ 205 175 -204 -74 571 -29 -166 295 333 209 -273 -90 87 -271 -404 13 404 -124 -399 238 131 -215
4260b15J69M3O9k30K18L50k05n16L02K74j52m97L78n6K77m38L6M63o09K4L75L2
$$ -215 -46 -3 66 -164 54 404 199 -317 -15 259 107 -390 -12 -68 209 -229 -193 270 -339 -315 60 92
4282I2J38m79J30M82k78n64P77K5m76j67N26r4l02k02O03m6n26J42M45p4k11J27
$$ 92 230 -249 -119 363 85 -479 298 323 -153 -320 206 112 -190 -392 211 165 -361 -219 226 152 -59 68
4304F8K02k17k44N17l54k28l5P15j78j66k79J72mk60k48N53J21l96M7M07Q2k35
$$ 68 270 53 -191 326 -28 -256 -291 424 246 80 -199 -27 -31 -291 -539 14 135 -261 -214 193 275 40
4326D0j74K89j31j1k29L23j47k59R6N71l55j60L67P3k16n10N74m0m63L52J40J02
$$ 40 -134 155 24 13 -216 107 -40 -299 -203 368 13 -147 220 293 77 -433 141 101 -362 -10 130 232
4348B32j83m4L42k65l11R0N8J76j42q2M30n17q6J00M90k87k43L56J68k85k33L23
$$ 232 49 5 347 82 -229 -139 -81 95 -47 -129 301 -216 -302 -202 288 1 -242 114 282 -3 -236 87
4370H7N5l40j19M09l8l9k66L70N5k0n78M38K17l32k5L27K2n44K41N3K75l21nL23
$$ 87 142 -198 -317 92 54 15 -251 119 174 154 -424 14 231 -101 -126 201 223 -321 -80 -27 248 -73 -78 245
4394B45l3m21O2J98l9l74M09J36ok58O2j0K58l75M9J57m69K54M64K3p11K76K94
$$ 245 212 -209 -147 51 12 -362 47 183 177 -81 -19 -29 229 -146 -97 60 -409 -155 309 332 -379 -103 191
4417A91J33k94j01J08O1l38J21O52n87l28M94l2J07o07L72K35k87m0K26N7l19
$$ 191 324 30 -71 37 98 -240 -119 533 -54 -382 112 80 187 -420 -48 187 -100 -140 86 143 -176
4438a76M48m52L01k00m5K82n3l54L49K16p27K99P6M3J79k92J0k7J92l42M45m7
$$ -176 272 -180 121 -79 -124 158 105 -249 100 316 -411 -112 -36 7 186 -106 -96 -123 69 -273 172 125
4460A25j29j17K68M39o39k91J58L31l46J91MJ42J7m31O87j87k57m88M99j3J09
$$ 125 -4 -121 147 586 -53 -344 -186 145 -201 -10 -6 136 153 -278 409 222 -35 -523 -24 -37 72
4481G2k98p7M82o6RJ50j29l24J69L26j22k01J77j6m06J67j2j50K78r3N5P5j3m63
$$ 72 -226 -303 179 113 122 272 143 -181 -12 314 192 -9 168 152 -254 -87 -99 -249 29 -64 -9 66 53 -410
4505d10N02J20m84L30J10j56R9l27N22j59k89J69J99k65J37l23J56k5QR0j22K32
$$ -410 92 212 -272 58 168 12 111 -216 306 147 -142 27 226 -39 98 -225 -69 -94 -86 4 -118 114
4527A14R1kj16k96K68J63m09K7M1j67N58R0l41qK49l13r0O02m79L1J75l13L45
$$ 114 205 203 87 -209 59 222 -187 -160 -119 -286 272 362 21 13 262 -51 -141 461 -18 13 188 -125 220
4550B20k22q2P8Nj24J72j16K09j53J85N4l20j59K81k58K26P0p7k11K13o4j87L65
$$ 220 -2 -84 -6 -1 -125 47 -69 140 -13 172 226 -94 -253 28 -230 -4 66 -11 -222 -9 -73 -260 105
4573A05j66L41n34K88j33M31m54J24K23k34Q7R8j77j19P0Q2O8j98J58r7r5N8p0
$$ 105 -61 280 -254 34 -99 332 -122 2 225 -9 78 176 -1 -120 -50 32 100 -98 60 -37 -132 -74 -144
4596a44L4O1M1Q3J90l38J20j40kL41o19N22r7j40J53q7K83k33K16m36J97RL59
$$ -144 -110 -49 -8 75 265 -73 47 -93 -95 246 -373 149 52 -88 65 -22 261 28 244 -192 5 14 373
4619C73k90N6k25q4J18k23N63j25N2j33n1j46N54n23r8L3J79q9Ol93M31r6K35
$$ 373 83 139 -86 -170 -52 -275 288 163 215 82 31 -115 439 -84 -182 -149 30 -59 -53 -446 -15 -111 124
4642A24j56p7o9l2K80j42r1M8oJ9K96m48L02j31k0k94N71k80j88J71K44Km55L89
$$ 124 -32 -109 -178 -210 70 -72 -163 -115 -121 -102 194 -254 48 -83 -103 -397 174 -106 -294 -123 121 123 -332 57
4666E7l0j90OJ52K6m1K8K18o5l54J70o0J34L0j91N1J77K70m48K49k46J05m8K49
$$ 57 27 -163 -157 -5 21 -20 8 226 161 -193 -23 -83 51 81 -110 -59 118 388 -60 189 -57 48 0 249
4690B49Mo15M9N79j80j92J34J41j57m27M88K47k51j99J32O5m5n34N69J40k77l7
$$ 249 253 -362 -313 266 86 -106 28 169 12 -415 73 320 69 -130 2 67 22 -512 57 197 -80 -117
4712a17k7N0j7J27l3K10m42K45N14m17k99J82K39l51J94K8J53p7N1k40J76k59
$$ -117 -144 -94 -111 16 -17 193 -249 -4 510 93 -206 -24 215 -136 58 86 239 162 213 -27 149 -110
4734a10j6K40k71K45j32K24j49J3j69L74K2m65R1p6M50k08j36M65k45n67N31K95
$$ -110 -126 114 -157 88 -44 180 31 44 -125 249 271 -194 -103 -179 271 63 -73 392 147 -420 111 406
4756D06m58l69L93L61l69k35O1L34j87J21r0L08k19k33J71L11k50j90J62j11Q0
$$ 406 -52 -421 -28 333 -36 -271 -210 124 -63 58 -32 276 57 -176 -5 306 56 -134 28 -83 -3
4777cj39L87k9o22K79K90k22k69K42L35l39k32M48J38k05l19L99Ll82M6L01j3
$$ -3 -142 245 216 -406 -127 163 -59 -328 -86 249 -90 -322 126 264 59 -260 139 142 -240 -194 107 94
4799I4l77J44M10k46l55L22k34J71j52oN26j78j5k05L80j29k72K19M9o1k20L2
$$ 94 -283 -139 271 25 -330 -8 -242 -71 -223 -229 297 119 104 -101 279 150 -122 97 146 85 -135 -103
4821a03L28j58l68O68p0l25M6K88r0n07L28K47j57l62J32M62l20k72J08M89j99
$$ -103 225 67 -301 367 297 -28 18 306 216 -291 37 284 127 -235 -103 359 39 -233 -125 364 165
4842A65m56M39P7l51J74rJ26n22R0L65O6j50j03K1M67n96R9K61j14j03o1M33l30
$$ 165 -291 148 225 -126 48 39 165 -357 -267 98 164 14 -89 -68 399 -197 -98 163 49 -54 -115 318 -12
4865a2K84l48M54k25o83M79M78m85k69M24L38m42k63N15j55m29K39L60j56l95
$$ -12 272 -76 378 153 -530 -51 427 -58 -327 97 435 -7 -270 245 90 -339 -100 260 104 -291
4885b91J58M10k0k24p8Q9J59k03j92M47k54n1p5L31N9n92M26J82o54K89J03L13
$$ -291 -133 277 257 33 -45 44 203 0 -192 255 1 -50 -125 206 265 -327 99 281 -373 -84 19 332
4907C32l14k37M99j27j10j12l7M2J1P0L07j98l13k62M85J45m49K56K60l39j99
$$ 332 18 -219 280 153 43 -69 -106 -64 -53 17 324 126 -187 -449 36 181 -268 -12 248 -91 -290
4928b90L33J24l62k98N27L31k35k81K03K25l80Q6r8L18k87j93N99j44m02M1K17
$$ -290 43 167 -195 -493 34 365 130 -151 52 277 -103 -17 -115 203 -84 -277 322 178 -224 -183 34
4949C4L8n03L54K54j47j91P7M05l60m83M67L05l28o5J23M43m37k68O31k57k74
$$ 34 72 -431 -77 177 30 -161 -84 321 -39 -522 -55 250 -78 -143 -20 423 -14 -282 349 92 -182
4970a82q2L96Mj36j5R0J30k68J28N01k97l94J99q6J6j75J31L95k73m39N04J0k06
$$ -182 -264 132 136 0 -15 75 205 -63 65 566 269 -125 74 -12 4 -171 -40 355 82 -357 147 157 -49
4993d9j63K79K24l28k90K12M61m74J28K61j0n14qN34l50j23K56J54k90k79N50
$$ -49 -212 67 291 -37 -327 -115 346 -128 0 261 251 -263 -271 263 -87 -210 46 200 -90 -369 181
5014A81K09m68j89O8M12j53q1J91J05k30j17P8N1k39L6K42j51L0j11J97J88o16
$$ 181 390 -78 -267 -199 213 60 -21 170 275 45 -72 6 57 -182 -146 96 -55 -25 -136 61 249 -367
5036c67K3N56j87o2k92M30j57l68K37N70m16p3L34l23J51l09K54J68k17l81L08
$$ -367 -344 212 25 -37 -329 101 -56 -424 -187 383 -33 -106 228 -95 56 -253 1 169 -48 -429 -121
5057a21J99k34Q3L81l1l13k21K33M17p67N60K22k73k73K11L35o24O6M2K51m94
$$ -121 78 -156 -73 308 277 -36 -257 -24 393 -374 186 408 135 -138 73 408 -216 -150 -108 143 -351
5078c51QL56L17j03n63L66J39m33K18O7K49n16q4N52k97l02N14M3l26K10j9OJ4
$$ -351 -343 13 330 227 -336 30 169 -264 -46 21 270 -246 -330 222 -75 -377 137 180 -146 64 45 51 65
5101F5k68K22P1j91J06k06L19l04J07K74j1l70K68O3k79K19j20K26J30k78k34
$$ 65 -203 19 90 -101 5 -201 118 -186 -79 195 184 -186 82 145 -134 85 -35 191 321 43 -191
5122a91L53j04k46K04J32l48j09R8L48K17p77L44M36k08l80K45j45M64n47O5K01
$$ -191 162 58 -188 16 148 -200 -309 -211 137 354 -423 -79 357 149 -231 14 -131 333 -214 -149 52
5143E2K6q8j4P2j83K22M26k42p08K88L78k74j52K12K53k63m0L50j42k97O1J23
$$ 52 78 -10 -24 48 -135 87 513 271 -437 -149 229 -45 -197 15 268 5 -35 315 173 -124 -63 60
5165F0J40k01j8J15o2l66P3Q5L95j03k60K61O1l82J6N29j87m59M2K47L46p90L06
$$ 60 200 -1 -19 96 34 -332 -259 -174 221 118 -142 119 180 -202 -186 343 156 -303 -261 -14 332 -458 -152
5188a52L85k30N9j07O5k17K34P7J8k07l82M58%J0p0jJ74J8l81L11k93M33l18L32
$$ -152 233 3 62 -45 20 -197 37 114 132 -75 -457 1 1 11 -59 -60 114 132 -249 62 -231 202 -116 216
5212B16k48N0n0K88k01q5K8L7K55l50o9K35j16Q2J86j57k8k82j1O16n31J54L6
$$ 216 -32 18 -32 256 55 -30 -2 35 290 -60 -129 106 -10 72 258 101 73 -209 -220 396 -135 19 55
$$ [...]
8191C02
##END NTUPLES=NMR FID
##END=
