##TITLE=1H_Pr T-104
 DMSO, 8 sc, 
 19.11.2019
##JCAMPDX= 6.0         $$ Bruker NMR JCAMP-DX V2.0
##DATA TYPE= NMR FID
##DATA CLASS= NTUPLES
##ORIGIN= UXNMR, Bruker Analytische Messtechnik GmbH
##OWNER= root
$$ XWIN-NMR		Version 3.5
$$ Tue Nov 19 14:24:03 2019 Russian Standard Time (UT+4h)  she@DPX200
##.OBSERVE FREQUENCY= 200.1315
##.OBSERVE NUCLEUS= ^1H
##.DELAY= (6, 6)
##.ACQUISITION MODE= SIMULTANEOUS
##.ACQUISITION SCHEME= undefined
##.AVERAGES= 8
##.DIGITISER RES= 18
##SPECTROMETER/DATA SYSTEM= spect
##.PULSE SEQUENCE= zg30
##.SOLVENT NAME= DMSO
##.SHIFT REFERENCE= (INTERNAL, DMSO, 0, 15.7039)
##AUDIT TRAIL= $$ (NUMBER, WHEN, WHO, WHERE, WHAT)
$$ ##TITLE= Audit trail, XWIN-NMR		Version 3.5
$$ ##JCAMPDX= 5.01
$$ ##ORIGIN= Bruker BioSpin GmbH
$$ ##OWNER= she
$$ F:/spectra/data/she/nmr/H-F/1/audita.txt
$$ ##AUDIT TRAIL=  $$ (NUMBER, WHEN, WHO, WHERE, WHAT)
(   1,<2019-11-19 14:23:06.89 +0400>,<she>,<DPX200>,
      <created by zg, POWCHK disabled, PULCHK disabled
       configuration hash MD5:
       00 E9 B6 7A A2 85 ED C7 34 08 36 98 17 FE 4E 26
       data hash MD5: 16K
       A2 6F C6 63 FF 6B 15 D1 75 54 21 10 03 1A D7 49>)
$$ ##END=
$$ 
$$ hash MD5
$$ 47 11 DB CF C2 95 78 16 FA E2 CA B2 48 69 CB 63
##$RELAX= 
##$RELAX= 
##$RELAX= 
##$RELAX= 
##$RELAX= 
##$RELAX= 
$$ Bruker specific parameters
$$ --------------------------
##$DU= <F:/spectra>
##$EXPNO= 1
##$NAME= <H-F>
##$PROCNO= 1
##$TYPE= <nmr>
##$USER= <she>
##$AMP= (0..31)
100 100 100 100 100 100 100 100 100 100 100 100 100 100 100 100 100 100 
100 100 100 100 100 100 100 100 100 100 100 100 100 100 
##$AQSEQ= 0
##$AQ_mod= 1
##$AUNM= <au_zg>
##$AUTOPOS= <>
##$BF1= 200.13
##$BF2= 200.13
##$BF3= 200.13
##$BF4= 200.13
##$BF5= 200.13
##$BF6= 200.13
##$BF7= 200.13
##$BF8= 200.13
##$BYTORDA= 1
##$CFDGTYP= 0
##$CFRGTYP= 5
##$CHEMSTR= <none>
##$CNST= (0..31)
1 1 145 1 1 1 1 1 1 1 1 1 1 1 1 1 1 1 1 1 1 1 1 1 1 1 1 1 1 1 1 1 
##$CPDPRG= <>
##$CPDPRG1= <>
##$CPDPRG2= <>
##$CPDPRG3= <>
##$CPDPRG4= <mlev>
##$CPDPRG5= <mlev>
##$CPDPRG6= <mlev>
##$CPDPRG7= <mlev>
##$CPDPRG8= <mlev>
##$CPDPRGB= <>
##$CPDPRGT= <>
##$D= (0..31)
0 1.2 0 0 0 0 0 0 0 0.06 0 0.03 0 0 0 0 0.0002 0 0 0 0 0 0 0 0 0 0 0 0 
0 0 0 
##$DATE= 1574158986
##$DBL= (0..7)
120 120 120 120 120 120 120 120 
##$DBP= (0..7)
150 150 150 150 150 150 150 150 
##$DBP07= 0
##$DBPNAM0= <>
##$DBPNAM1= <>
##$DBPNAM2= <>
##$DBPNAM3= <>
##$DBPNAM4= <>
##$DBPNAM5= <>
##$DBPNAM6= <>
##$DBPNAM7= <>
##$DBPOAL= (0..7)
0.5 0.5 0.5 0.5 0.5 0.5 0.5 0.5 
##$DBPOFFS= (0..7)
0 0 0 0 0 0 0 0 
##$DE= 6
##$DECBNUC= <off>
##$DECIM= 24
##$DECNUC= <off>
##$DECSTAT= 4
##$DIGMOD= 1
##$DIGTYP= 9
##$DL= (0..7)
0 120 120 120 120 120 120 120 
##$DP= (0..7)
150 150 150 150 150 150 150 150 
##$DP07= 0
##$DPNAME0= <>
##$DPNAME1= <>
##$DPNAME2= <>
##$DPNAME3= <>
##$DPNAME4= <>
##$DPNAME5= <>
##$DPNAME6= <>
##$DPNAME7= <>
##$DPOAL= (0..7)
0.5 0.5 0.5 0.5 0.5 0.5 0.5 0.5 
##$DPOFFS= (0..7)
0 0 0 0 0 0 0 0 
##$DQDMODE= 0
##$DR= 18
##$DS= 0
##$DSLIST= <SSSSSSSSSSSSSSS>
$$ [...]
##$SUBNAM2= <"">
##$SUBNAM3= <"">
##$SUBNAM4= <"">
##$SUBNAM5= <"">
##$SUBNAM6= <"">
##$SUBNAM7= <"">
##$SUBNAM8= <"">
##$SUBNAM9= <"">
##$SW= 24.9337058887773
##$SWIBOX= (0..15)
0 0 2 0 0 0 0 0 0 0 0 0 0 0 0 0 
##$SW_h= 4990.01996007984
##$TD= 16384
##$TD0= 1
##$TE= 0
##$TE2= 300
##$TE3= 300
##$TEG= 300
##$TL= (0..7)
0 120 120 120 120 120 120 120 
##$TP= (0..7)
150 150 150 150 150 150 150 150 
##$TP07= 0
##$TPNAME0= <>
##$TPNAME1= <>
##$TPNAME2= <>
##$TPNAME3= <>
##$TPNAME4= <>
##$TPNAME5= <>
##$TPNAME6= <>
##$TPNAME7= <>
##$TPOAL= (0..7)
0.5 0.5 0.5 0.5 0.5 0.5 0.5 0.5 
##$TPOFFS= (0..7)
0 0 0 0 0 0 0 0 
##$TUNHIN= 0
##$TUNHOUT= 0
##$TUNXOUT= 0
##$USERA1= <user>
##$USERA2= <user>
##$USERA3= <user>
##$USERA4= <user>
##$USERA5= <user>
##$V9= 5
##$VALIST= <valist>
##$VCLIST= <CCCCCCCCCCCCCCC>
##$VD= 0
##$VDLIST= <DDDDDDDDDDDDDDD>
##$VPLIST= <PPPPPPPPPPPPPPP>
##$VTLIST= <TTTTTTTTTTTTTTT>
##$WBST= 1024
##$WBSW= 4
##$XGAIN= (0..3)
0 0 0 0 
##$XL= 0
##$YL= 0
##$YMAX_a= 136042
##$YMIN_a= -66579
##$ZGOPTNS= <>
##$ZL1= 120
##$ZL2= 120
##$ZL3= 120
##$ZL4= 120
##$ABSF1= 10
##$ABSF2= 0
##$ABSG= 5
##$ABSL= 3
##$ALPHA= 0
##$AQORDER= 0
##$ASSFAC= 0
##$ASSFACI= 0
##$ASSFACX= 0
##$ASSWID= 0
##$AUNMP= <proc_1d>
##$AZFE= 0.1
##$AZFW= 0.1
##$BCFW= 1
##$BC_mod= 2
##$BYTORDP= 1
##$COROFFS= 0
##$CY= 11.3945322036743
##$DATMOD= 1
##$DC= 2
##$DFILT= <>
##$DTYPP= 0
##$F1P= 16.9975609425685
##$F2P= -3.02152046262296
##$FCOR= 0.5
##$FTSIZE= 0
##$FT_mod= 4
##$GAMMA= 1
##$GB= 0.15
##$INTBC= 1
##$INTSCL= 1
##$ISEN= 128
##$LB= 0.24
##$LEV0= 0
##$LPBIN= 0
##$MAXI= 10000
##$MC2= 0
##$MEAN= 0
##$ME_mod= 0
##$MI= 1.114404
##$NCOEF= 0
##$NC_proc= 0
##$NLEV= 6
##$NOISF1= 3.799351
##$NOISF2= 2.8
##$NSP= 1
##$NTH_PI= 0
##$NZP= 0
##$OFFSET= 15.70392
##$PC= 1
##$PHC0= -9791.938
##$PHC1= 20.80086
##$PH_mod= 1
##$PKNL= yes
##$PPARMOD= 0
##$PSCAL= 0
##$PSIGN= 0
##$REVERSE= no
##$SF= 200.130013532006
##$SI= 16384
##$SIGF1= 3
##$SIGF2= 2
##$SINO= 400
##$SIOLD= 16384
##$SREGLST= <1H.CDCl3>
##$SSB= 0
##$STSI= 0
##$STSR= 0
##$SW_p= 3612.71676300578
##$SYMM= 0
##$S_DEV= 0
##$TDeff= 0
##$TDoff= 0
##$TI= <>
##$TILT= no
##$TM1= 0
##$TM2= 0
##$TOPLEV= 0
##$USERP1= <user>
##$USERP2= <user>
##$USERP3= <user>
##$USERP4= <user>
##$USERP5= <user>
##$WDW= 1
##$XDIM= 8192
##$YMAX_p= 0
##$YMIN_p= 0
$$ End of Bruker specific parameters
$$ ---------------------------------
##NTUPLES= NMR FID
##VAR_NAME=  TIME,          FID/REAL,        FID/IMAG
##SYMBOL=    X,             R,               I
##VAR_TYPE=  INDEPENDENT,   DEPENDENT,       DEPENDENT
##VAR_FORM=  AFFN,          ASDF,            ASDF
##VAR_DIM=   8192,          8192,            8192
##UNITS=     SECONDS,       ARBITRARY UNITS, ARBITRARY UNITS
##FACTOR=    0.0002004,     1,               1
##FIRST=     0,             0,               0
##LAST=      1.6414764,     0,               0
##MIN=       0,             -66579,          0
##MAX=       1.6414764,     136042,          0
$$ Real data points
##PAGE= N=1
##DATA TABLE= (X++(R..R)), XYDATA
$$ [...]
$$ plain form
1990 755 -159 -736 394 606 -344 -480 239 588 -422 -423 508 438 -497 -614 557 560 -589 -394 192 109 -561
2011 -561 -61 446 121 -661 -276 226 30 -519 -134 114 248 -158 49 199 88 -308 319 31 -363 -34
2031 -34 96 75 -33 -117 340 32 -304 327 563 -89 -325 -13 382 61 -441 126 398 -304 -505 441 456
2052 456 85 -11 294 461 -196 -295 139 454 -121 -226 180 274 58 -400 19 -229 -383 -66 264 148 -467
2073 -467 -258 227 343 31 -327 182 202 -255 53 -213 -111 113 -2 -64 3 -159 -78 25 33 -164 3 -6 -59
2096 -59 16 -83 -132 32 25 -437 -42 301 267 -90 206 -26 454 11 -81 90 27 -14 -46 246 43 -59 -243 218
2120 218 33 -48 -11 100 -234 -36 118 -152 -80 55 -63 353 5 10 16 38 -209 257 -191 103 107 3 151
2143 151 -314 99 31 3 136 95 225 196 -311 -110 395 163 50 -78 37 218 -65 159 165 -14 -318 -254
$$ packed form
1990G55r14n77J130K12r50j36P19L49j010jR31p0r35j17J171Lj149J95N86q3o70
2011e61N00N07l25p82L85N02j96n49L85K48J34m06K07J50j11l96O27k88l94L29
2031c4J30k1j08q4M57l08l36O31K36o52k36L12L95l21n02N67K72p02k01R46J5
2052D56l71r6L05J67o57r9M34L15n75j05M06R4k16m58M19k48j54L17L30j16o15
2073d67K09M85J16l12l58N09K0m57L08k66J02K24j15o2O7j62Q1J03Qj97J67rn3
2096e9P5r9m9J64pm62L95L43l4l57K96k32M80m43r2J71o3m1l2K92k03j02j84M61
2120B18j85q1L7J11l34J98J54k70P2J35j18M16l48NOK2k47M66m48K94Mj04J48
2143A51m65M13o8k8J33m1J30k9n07K01N05k32j13j28J15J81k83K24Oj79l04O4
$$ plain form
2165 -254 536 -91 -332 -291 33 96 -409 -134 170 86 -375 -244 148 -206 -298 85 43 -98 -531 138 -171 17
2187 17 -330 35 270 45 149 -15 40 -160 -163 203 28 -289 -24 -93 68 -312 -188 148 -65 -143 154 302
2209 302 -35 -147 187 234 -466 -106 301 404 -528 -172 874 163 -291 -750 225 419 -83 -309 484 226
2229 226 -479 -361 832 142 -382 15 438 -63 -706 -166 475 54 -434 -226 415 -49 -460 -278 529 -212
2249 -212 -349 173 269 -380 -578 644 419 -365 -573 380 376 -251 -34 370 135 -129 153 400 -172 -606 136
2270 136 458 -95 -524 14 411 111 -160 99 226 -212 -462 491 318 -633 -489 608 315 -828 -326
2289 -326 577 453 -632 -110 164 407 -332 -3 629 265 -457 -75 892 -32 -1046 -20 713 -8 -704
2308 -704 126 969 -8 -877 167 403 -211 -510 378 193 -850 -379 573 416 -569 -401 560 476 -544
$$ packed form
2165b54P90o27k41M1L24O3n05K75L04q4m61J31L92l54r2L83m2j41m33O69l09J88
2187A7l47L65K35k25J04j64N5k00lL66j75l17K65o9J61l80J24L36k13p8K97J48
2209C02l37j12L34M7p00L60M07J03r32L56J046p11m54m59R75J94n02k26P93k58
2229B26p05J18J193o90n24L97M23n01o43N40O41m21m88K08O41m64m11J82Q07p41
2249b12j37N22R6o49j98J222k25p84k08R53mo27K17M04k35k64K82K47n72m34P42
2270A36L22n53m29N38L97l00k71K59J27m38k50R53j73r51J44J097k93j143N02
2289c26R03j24j085N22K74K43p39L29O32l64p22L82R67r24j014J026P33p21o96
2308g04Q30Q43r77q69J044K36o14k99Q88j85j043M71R52j57r85J68R61q4j020
$$ plain form
2327 -544 -75 299 24 -596 -158 394 49 -500 390 955 -354 -731 423 835 -204 -430 287 977 -329
2346 -329 -309 724 568 -470 -126 1204 390 -750 -265 802 455 -665 -383 825 320 -1184 -278 606
2364 606 -54 -848 370 696 -78 -782 581 863 -147 -740 383 793 -86 -532 -15 707 -339 -784
2382 -784 425 296 -466 -401 752 173 -967 -317 722 485 -881 -283 336 26 -815 -18 345 -205 -258
2401 -258 67 556 -531 -599 393 771 -482 -796 503 902 -566 -712 539 460 -190 -310 601 160 -788
2420 -788 -10 826 230 -938 -249 939 78 -939 -81 1008 103 -953 -194 672 87 -527 170 766
2438 766 -263 -620 495 1086 -513 -1244 314 837 -386 -632 568 71 -603 -258 561 -97 -865 118
2456 118 774 19 -880 -337 923 297 -736 -299 672 127 -501 144 500 -83 -558 123 369 -773 -505
$$ packed form
2327e44M69L74k75o20M38N52l45n49Q90N65j309l77J154M12j039k26P17O90j306
2346c29K0J033j56j038L44J330q14j140M85J067l47j120K82J208n05j504R06Q84
2364F06o60p94J218L26p74p04J363K82j010n93J123M10q79m46N17P22j046m45
2382g84J209j29p62O5J153n79j140O50J039k37j366N98O19l10q41P97L63n50n3
2401b58L25M89j087o8R92L78j253l14J299L99j468j46J251p9o50j20R11m41r48
2420g88P78Q36n96j168O89J188q61j017Q58J089r05j056P59Q66n85o14O97N96
2438G66j029l57J115N91j599p31J558N23j223k46J200m97o74L45Q19o58p68R83
2456A18O56p55q99N43J260o26j033M37R71n45o28O45L56n83m75O81K46j142K68
$$ plain form
2475 -505 804 477 -707 -784 457 390 -729 -571 411 190 -459 99 1176 46 -891 226 1122 93
2493 93 -1272 192 1387 -9 -874 42 693 -122 -822 165 588 -209 -623 461 613 -672 -780 526
2511 526 833 -796 -383 406 438 -444 -419 510 119 -295 34 893 -20 -602 -133 646 -30 -562 -83 741
2531 741 156 -453 -54 206 -271 -353 680 346 -724 -506 483 430 -786 -215 502 590 -611 -241 478 486
2551 486 -743 277 555 -203 -395 -45 1000 -218 -849 173 986 -327 -758 -49 903 -80 -557 175
2569 175 605 -150 -444 386 523 -545 -598 622 580 -539 -698 361 836 -460 -553 684 493 -307 -141
2588 -141 586 441 -273 236 583 131 -671 39 710 -66 -839 162 787 -20 -208 397 382 -610 76 497
2608 497 335 -712 -330 709 444 -687 -232 977 260 -524 -25 209 5 -688 126 654 -193 -612 395
$$ packed form
2475e05J309l27j184p7J241o7j119J58R82k21o49N58J077j130r37J117Q96j029
2493I3j365J464J195j396q65R16O51q15p00R87M23p97m14J084J52j285j08J306
2511E26L07j629M13P89L2q82K5R29l91m14L29Q59r13n82M69P79o76n32M79Q24
2531G41n85o09L99K60m77q2J033l34j070K18R89n3j216N71P17Q8j201L70P19Q
2551D86j229J020K78p58j92L50J045j218o31J022Q13j313m31P09R52r83m77P32
2569A75M30p55k94Q30J37j068n3J220m2j119j59J059M75j296r3J237j91q00J66
2588a41P27j45p14N09L47m52q02P10O71p76p73J001O25q07j88O05j5r92O86M21
2608D97j62j047L82J039k65j131M55J209p17p84M99K34k04o93Q14N28q47m19J007
$$ plain form
2627 395 641 -414 -807 239 777 -482 -750 561 688 -782 -433 116 347 -573 -295 620 -121 -759
2645 -759 -243 631 445 -612 -392 436 140 -342 -158 213 50 -403 228 239 -427 -549 298 644 -373 -785
2665 -785 340 802 -326 -302 -20 516 -322 -472 284 18 -389 -208 653 38 -661 -28 631 304 -416 -208
2685 -208 331 -162 -285 -64 -11 -432 -632 462 226 -371 -763 947 756 -440 -570 215 621 -206 -378
2704 -378 219 390 -91 -300 419 20 -413 -162 402 346 -596 -313 935 330 -553 -372 358 81 -257 -21
2724 -21 255 -189 -396 61 331 -593 -374 300 230 -170 -370 173 635 -396 -53 512 173 -371 -69 502
2744 502 -77 -368 -26 573 -88 -470 -92 354 41 -470 -101 233 -193 -467 138 465 -348 -205 312 207
2764 207 -630 -372 237 589 -344 -546 353 220 -214 -356 -32 303 -244 37 175 -68 -287 43 682 37
$$ packed form
2627C95K46j055l93J046N38j259k68J311J27j470L49N49K31r20K78R15p41o38
2645g59N16Q74j86j057K20Q28k96m82J84L71j63m53O31J1o66j22Q47L46j017m12
2665g85J125M62j128K4K82N36q38j50P56k66m07J81Q61o15o99O33O59l27p20K08
2685b08N39m93j23K21N3m21k00J094k36n97l92J710j91j196j30P85M06q27j72
2704c78N97J71m81k09P19l99m33K51N64n6r42K83J248o05q83J81P30k77l38K36
2724b1K76m44k07M57K70r24K19O74p0m00k00N43M62j031L43N65l39n44L02N71
2744E02n79k91L42N99o61l82L78M46l13n11L69L34m26k74O05L27q13J43N17j05
2764B07q37K58O09L52r33k02Q99j33m34j42L24L35n47K81J38k43k19L30O39o45
$$ plain form
2784 37 -488 -174 205 290 -263 -116 110 -228 -393 -245 -21 -292 -206 428 -212 -48 151 672 175 -140 -295
2805 -295 14 -85 -139 -74 58 39 -232 133 -83 -240 -130 309 62 79 -180 2 307 -171 -121 37 -56 -220
2827 -220 -209 253 222 -403 -435 80 125 -356 33 445 229 -136 -305 -40 170 -160 -180 38 -68 -284 2 37
2849 37 -163 -473 74 265 -159 -268 -70 34 -9 -111 -229 217 47 221 107 229 -217 85 432 -8 -66
2870 -66 -128 164 130 -317 69 -37 -133 106 -11 77 -218 -66 268 262 -318 -133 51 129 -203 82 104 -68 -97
2893 -97 -247 -132 -138 -41 -36 493 92 -48 -185 485 210 -90 -164 -18 430 -169 -135 69 -33 63 171 -82 -401
2916 -401 -13 9 67 78 -294 -131 23 314 -18 126 -249 -1 -33 -125 -147 190 71 144 -506 -85 185 -140
2938 -140 -172 -72 -87 -137 -51 212 76 -242 139 31 220 136 -250 82 318 -3 258 -27 88 -56 317 88
$$ packed form
2784C7n25L14L79Q5n53J47K26l38j65J48K24k71Q6O34o40J64J99N21m97l15j55
2805b95L09r9n4O5J32j9k71L65k16j57J10M39k47J7k59J82L05m78N0J58r3j64
2827b20J1M62l1o25l2N15M5m81L89M12k16l65j69K65K10l30k0K18j06k16K86L5
2849C7k00l10N47J91m24j09J98J04m3j02j18M46j70J74j14J22m46L02L47m40n8
2870f6o2K92l4m47L86j06r6K39j17Q8k95J52L34on80J85J84P8l32K85K2j72k9
2893i7j50J15oR7NN29m01j40j37O70k75l00p4J46M48n99L4K04j02R6J08k53l19
2916d01L88K2N8J1l72J63J54K91l32J44l75K48l2r2k2L37j19P3o50M21K70l25
2938a40l2J00j5n0Q6K63j36l18L81j08J89q4l86L32K36l21K61k85J15j44L73k29
$$ plain form
2960 88 -104 -110 1 350 -3 -72 18 -86 181 174 -52 127 -16 -75 116 136 296 212 157 44 -93 52 230 97
2984 97 -165 128 77 -69 171 -39 11 -88 29 184 -51 -378 -125 95 57 -33 8 133 -13 -150 -128 -59 375
3007 375 -176 66 -98 -40 -364 156 312 6 53 306 -4 28 -196 -10 34 138 -341 86 -308 -109 95
3028 95 51 178 -275 -53 180 -32 -220 -15 -219 -154 -150 173 54 -33 -141 85 119 -238 -187 260 256 -22 -61 132
3052 132 239 215 -225 -33 59 -45 5 465 -50 -221 -153 241 -114 -197 108 565 11 -333 92 273 193 72
3074 72 -128 -27 -171 -310 400 470 230 1 103 23 61 -490 59 330 -86 -133 -48 113 -305 56 493 -261
3096 -261 -160 -16 434 268 -504 -57 78 81 -154 -15 120 -42 -254 282 50 -94 -219 178 145 -218 -295
3117 -295 423 115 -61 -135 248 38 -188 -38 189 12 -218 178 493 109 -432 35 479 88 -397 137
$$ packed form
2960H8j92oJ11L49l53o9R0j04K67pk26J79j43n9J91K0J60q4n5j13j37J45J78j33
2984I7k62K93n1j46K40k10N0r9J17J55k35l27K53K20l8r0M1J25j46j37K2O9M34
3007C75n51K42j64N8l24N20J56l06M7K53l10L2k24J86M4J04m79M27l94J99K04
3028I5m4J27m53K22K33k12j88K05k04O5ML23j19q7j08K26L4l57N1M47mk78l9J93
3052A32J07k4m40J92R2j04N0M60n15j71O8L94l55q3L05M57n54l44M25J81q0j21
3074G2k00J01j44j39P10P0k40k29J02q0L8n51N49K71m16m7Q5J61m18L61M37p54
3096b61J01J44M50j66p72M47J35Lk35J39J35j62k12N36k32j44j25L97l3l63p7
3117b95P18l08j76p4L83k10k26J50K27j77k30L96L15l84n41M67M44l91m85N34
$$ plain form
3137 137 438 -109 -195 -18 62 -359 -389 89 243 -205 -293 92 296 -182 -318 732 -48 -179 -158 146 -49
3158 -49 3 199 57 144 19 -276 468 -14 -14 130 273 89 17 230 551 -108 -79 291 174 -186 -396 264
3180 264 -67 -284 -459 582 142 -366 -225 269 -176 -328 -212 368 142 -415 -48 217 -149 -353 386 429
3200 429 -119 -543 88 535 115 -349 199 360 -104 -23 353 126 -656 -323 483 32 -221 -248 184 73 -362
3221 -362 276 562 143 -276 80 241 -16 -588 37 351 -260 -464 68 434 59 -25 50 -10 -102 -62 348 79
3243 79 -302 -170 508 -123 -358 -146 320 69 -595 -166 304 -167 -426 -70 123 9 -588 -212 209 226 -140
3264 -140 309 492 -269 -651 213 318 -402 -323 320 560 -121 -130 0 493 -280 -149 174 96 -492 -345 492
3285 492 166 -138 -14 126 285 -270 -89 229 73 -167 51 427 -20 -452 -87 232 -67 10 262 299 -277
$$ packed form
3137A37L01n47q6J77Q0m21l0M78J54m48q8L85K04m78j36J050p80j31K1L04j95
3158d9N2J96j42Q7j25k95P44m82%J44J43j84p2K13L21o59K9L70j17l60k10O60
3180B64l31k17j75J041m40n08J41M94m45j52J16N80k26n57L67K65l66k04P39M3
3200D29n48m24O31M47m20m64N48J61m64Q1L76k27p82L33Q06m51k53k7M32j11m35
3221c62O38K86m19m19L56J61k57n72O25L14o11k04N32L66l75q4P5o0r2M0M10k69
3243G9l81J32O78o31k35K12M66k51o64M29M70m71k59L56J93j14n97L76M21J7l66
3264a40M49J83p61l82Q64J05p20P9O43K40o81rJ30M93p73J31L23p8n88J47Q37
3285D92l26l04J24J40J59n55J81L18j56k40K18L76m47m32L65L19k99P7K52L7n76
$$ plain form
3306 -277 -242 435 291 -141 -312 291 42 -333 -341 242 32 -422 -48 568 -8 -512 152 234 59 -433 97
3327 97 367 277 -118 5 203 -163 -283 -15 356 -404 -695 292 238 -202 -164 149 214 -223 -260 428 260 -580
3349 -580 -280 383 86 -81 49 143 279 -421 25 47 -130 -241 117 530 -374 -310 -69 14 -441 -66 55
3370 55 247 -502 -185 105 116 -524 -138 121 208 -239 -96 44 -157 -381 393 362 72 -182 -157 416 129 -547
3392 -547 224 549 -179 -405 26 431 74 -379 293 284 -637 -54 467 188 -516 -178 458 210 -281 -223 232
3413 232 316 -380 -145 114 213 -401 72 160 -62 -489 152 574 -74 -30 217 113 -133 -186 -20 235 -373 -384
3435 -384 270 143 -24 -244 257 264 -260 -17 122 233 -222 125 183 -104 -121 -21 373 -323 -355 116 272 -133
3457 -133 -191 45 356 -7 -438 108 369 -30 -221 15 258 -153 -261 198 148 14 -254 201 82 -274 -294
$$ packed form
3306b77L5O77j44m32j71O03k49l75qN83k10m54L74O16n76n04O64Q2j75m92N30
3327I7K70r0l95J23J98l66j20K68L71p60k91R87n4m40L8L13O5m37l7O88j68q40
3349e80L00O63k97j67J30R4J36p00M46K2j77j11L58M13r04O4K41Q3m55L75J21
3370E5J92p49L17K90J1o40L86K59Q7m47J43J40k01k24P74l1k90k54K5N73k87o76
3392e47P71L25p28k26M31M05l57m53O72rr21N83N21k79p04L38O36k48m91N8M55
3413B32Q4o96K35K59R9o14M73Q8k22m27O41M22o48M4K47j04k46n3J66K55o08j1
3435c84O54j27j67k20N01Pn24K43J39J11m55L47N8k87j7J00L94o96l2M71J56m05
3457a33n8K36L11l63m31N46K61l99j91K36K43m11j08M59n0j34k68M55j19l56k0
$$ plain form
3478 -294 337 -138 -247 -263 249 216 -202 2 271 29 -468 -20 5 87 -289 -259 608 64 -146 296 46 -346
3500 -346 -202 193 314 -302 -112 126 -54 -323 108 366 93 -111 -93 413 -229 -400 -41 43 -45 -385 90
3521 90 250 -401 -393 79 379 -292 -162 -158 279 -53 -93 107 -36 -452 -193 427 52 -299 -75 146 148 -226 3
3544 3 324 -203 -387 191 384 -103 -151 -107 112 -1 -37 -108 80 -296 -55 -147 -67 -214 -59 131 169 -72 -311
3567 -311 328 348 1 -205 -12 122 25 -139 376 112 -354 -76 72 -147 -271 24 134 -193 -267 -1 7 93
3589 93 -325 -42 164 -113 -285 254 -68 -70 -77 -45 225 -218 249 125 311 -130 -56 335 218 -8 -242 330
3611 330 -85 -340 -60 109 87 -39 8 243 -138 -101 -153 13 287 -53 -282 257 -230 -478 44 8 -191 -103
3633 -103 -55 -30 21 -141 -300 59 275 24 56 -74 85 -168 -425 -2 -38 -136 183 47 -393 -157 -3 -141
$$ packed form
3478b94O31m75j09j6N12l3m18K04K69k42m97M48K5Q2l76L0Q67n44k10M42k50l92
3500c46J44L95J21o16J90K38j80k69M31K58k73k04J8N06o42j71L59Q4q8l40M75
3521I0J60o51QM72L00o71J30MM37l32m0K00j43m16K59O20l75l51K24K21Kl74K29
3544CL21n27j84N78J93m87m8M4K19j13l6p1J88l76K41r2Q0j47J55J90L8k41k39
3567c11O39K0l47k06J93J34r7j64N15k64m66K78J48k19j24K95J10l27p4K66QQ6
3589I3m18K83K06k77j72N39l22kpL2K70m43M67j24J86m41P4L91j17k26k34N72
3611C30m15k55K80J69k2j26M7K35l81L7n2J66K74l40k29N39m87k48N22l6j99Q8
3633a03M8K5N1j62j59L59K16k51L2j30J59k53k57M23l6r8L19j36m40K36J54j38
$$ plain form
3655 -141 -222 141 -17 -387 -336 199 -25 -184 113 289 163 -141 -103 -49 162 -17 -26 -3 -70 -170 149 97 -233
3678 -233 20 -1 -35 99 53 235 201 144 -185 -209 255 -13 -291 -188 -28 215 -241 -120 261 49 -105 37
3700 37 139 -247 -10 -311 -108 -90 -119 -292 -166 -78 -151 85 -245 53 31 -77 -17 166 74 1 23 78 99 102 270
3725 270 -71 21 -102 -243 25 206 -304 -121 -129 -81 57 -322 -116 64 -131 -182 -154 60 194 74 164 -58
3747 -58 -85 -159 -306 -229 -123 116 -27 -157 -26 174 129 52 -52 123 -511 -364 24 167 -17 -79 -70 -153 -169 95
3771 95 81 -130 71 168 -40 -138 137 -61 49 42 -10 -283 113 65 -179 12 72 283 64 91 153 -20 -130 -286
3795 -286 -9 -158 -149 25 73 -277 77 -4 40 -114 -25 3 -154 267 51 207 -223 -47 -44 282 90 136 -130
3818 -130 75 -297 -196 -243 -60 -112 -204 163 -128 122 -66 108 123 -98 190 -171 7 34 158 155 205 -16 -171
$$ packed form
3655a41q1L63j58l70N1N35k24j59K97J76j26l04L8N4K11j79rK3o7j00L19n2l30
3678b33K53k1l4J34m6J82l4n7l29k4M64k68k78J03J60K43m56J21L81k12j54J42
3700C7J02l86K37l01K03J8k9j73J26Q8p3K36l30K98k2j08O0J83r2p3K2N5K1LJ68
3725B70l41R2j23j41K68J81n10J83qM8J38l79K06J80j95n1K8K14J34j20R0k22
3747e8k7p4j47P7J06K39j43j30J31K00m5p7j04J75o34J47L88J43j84o2Rq3j6K64
3771I5j4k11K01R7k08r8K75j98J10pn2k73L96m8k44J91O0K11k19K7O2j73j10j56
3795b86K77j49RJ74M8l50L54q1M4j54Q9K8j57M21k16J56m30J76LL26j92M6k66
3818a30K05l72J01m7J83n2r2L67k91K50j88J74J5k21K88l61J78K7J24lN0k21j55
$$ plain form
3841 -171 65 -32 -247 -6 38 -334 -25 30 108 -66 204 172 -146 -122 -220 241 145 -534 -19 -5 -153 92 140
3864 140 -13 142 -190 224 112 45 193 14 164 -122 -402 26 31 -120 -87 -161 184 -2 38 146 -56 -498
3886 -498 -54 122 -166 -322 -200 49 145 129 21 266 77 -41 -39 332 25 121 170 60 -358 -292 -23 74 187
3909 187 -522 126 92 -29 -47 175 131 4 -215 -97 82 -58 -216 28 -100 -240 157 111 188 -141 60 122
3931 122 134 83 62 -92 -386 -215 -68 120 -283 -165 101 203 9 -352 -104 273 -124 28 -17 72 -394 -219
3953 -219 -53 365 -419 -156 355 27 -345 73 25 496 66 39 173 117 -123 80 103 -85 -9 107 306 -190
3975 -190 -168 -109 144 -366 -87 353 118 -53 -117 279 -65 47 -146 39 158 -61 -28 380 -26 -17 154 -73
3997 -73 -110 -240 -220 116 -3 -186 -39 35 156 -164 -43 248 99 -14 114 72 -137 -60 13 378 0 -364
$$ packed form
3841a71K36r7k15K41M4l72L09N5P8j74K70l2l18K4r8M61r6o79N15J4j48K45M8
3864A40j53J55l32M14j12o7J48j79J50k86k80M28Nj51L3p4L45j86M0J08k02m42
3886d98M44J76k88j56J22K49R6j6j08K45j89j18KL71l07R6M9j10m18O6K69R7J13
3909A87p09O48l4j21j8K22m4j27k19J18J79j40j58K44j28j40L97m6P7l29K01O2
3931A22J2n1k1j54k94J71J47J88m03J18K66J02j94l61K48L77l97J52m5Q9m66J75
3953b19J66M18p84K63N11l28l72M18m8M71m30k7J34n6k40K03K3j88P6J16J99m96
3975a90K2N9K53n10K79M40k35j71o4L96l44J12j93J85J19k19L3M08m06RJ71k27
3997g3l7j30K0L36j19j83J47P4J21l20J21K91j49j13J28m2k09P7P3L65l78l64
$$ plain form
4019 -364 -35 73 -340 -2 241 187 -106 6 346 -106 -118 126 294 -178 122 -150 123 -125 -104 155 -111
4040 -111 -181 -45 66 274 -233 -308 301 221 -427 -169 66 -220 -120 24 120 7 -59 -64 120 162 -73 0 90
4063 90 40 -350 -32 187 -13 -280 66 -78 -252 -257 16 140 -265 40 109 -22 -125 -58 201 -177 -193 -85
4085 -85 181 -131 -300 68 103 208 -460 396 447 -279 145 -60 360 41 -301 131 141 -229 -62 -142 446 -107
4107 -107 68 172 110 -102 -175 144 150 47 -221 114 118 -291 45 374 -50 -279 -33 80 -134 -19 284 81
4129 81 -242 -118 -101 281 -235 -8 196 231 -79 1 298 202 -181 44 30 218 -15 90 45 -238 -237 76 400
4152 400 -66 -32 33 241 -252 19 337 399 62 -94 -31 258 -54 -293 -68 348 -253 -289 68 305 -127 -237
4174 -237 105 94 -88 -32 225 186 77 -58 41 154 54 -322 215 212 -247 -238 -33 -40 -10 -308 271 104 -186 -138
$$ packed form
4019c64L29J08m13L38K43n4k93J12L40m52j2K44J68m72L00k72K73k48K1K59k66
4040a11p0J36J11K08n07p5O09q0o48K58K35k86J00J44R6j13o6nJ84M2k35P3R0
4063I0n0l90L18K19k00k67L46j44j74nK73J24m05L05O9j31j03O7K59l78j6J08
4085h5K66l12j69L68L5J05o68Q56N1p26M24k05M20l19l42M32J0l70J67q0N88n53
4107a07J75J04o2k12p3L19Oj03k68L35Mm09L36L29m24k29K46J13k14J15L03k03
4129H1l23J24J7L82n16K27K04L5l10Q0K97r6l83K25j4J88k33J05m5k83JL13L24
4152D00m66L4O5K08m93K71L18O2l37j56O3K89l12k39K25M16o01l6L57K37m32j10
4174b37L42j1j82N6K57l9j09j35R9J13j00l76N37lm59RK05pL0k98N79j67k90M8
$$ plain form
4198 -138 265 114 -443 218 -64 -130 40 77 58 -284 -233 144 180 -68 -87 236 -56 -96 64 149 -127 -10 -42
4221 -42 416 64 -351 -116 159 45 -118 99 35 -92 -72 -80 140 -292 164 180 324 61 0 -82 -80 -77 128 10
4245 10 141 -511 -238 37 75 67 -119 314 -230 -419 147 346 -94 -45 209 194 -74 -47 22 -43 -166 30 100
4268 100 -97 127 -71 -27 -243 -75 -228 172 -44 -129 -64 -24 -20 -5 -110 -181 -151 -314 198 234 68 -230 -7
4291 -7 264 198 -264 125 14 -3 -184 56 335 -126 -34 197 147 -316 -249 183 210 -96 47 70 43 -6 256 -18
4315 -18 463 -136 -300 35 -59 82 -195 206 -151 -99 170 -44 -106 -121 283 353 394 -39 -179 -196 -242 207 229
4338 229 -111 -223 17 68 98 -128 -63 -66 33 -111 185 335 -104 29 122 200 -333 -281 171 170 -173 -210 91 154
4362 154 285 -216 116 215 -225 222 123 129 -168 -64 -16 -230 -251 180 132 68 -80 -186 117 157 56 174 163
$$ packed form
4198a38M03j51n57O61k82o6J70L7j9l42N1L77L6k48j9L23k92m0J60Q5k76J17l2
4221d2M58l52m15K35K75j14j63K17o4j27K0qK20m32M56J6J44k63o1q2KLK05j18
4245A0J31o52K73K75L8qj86M33n44j89N66J99m40M9K54j5k68K7O9o5j23J96P0
4268A00j97K24j98M4k16J68j53M00k16q5O5M0MJ5j05p1L0j63N12L6j66k98K23
4291gK71o6m62L89j11j7j81K40K79m61R2K31n0m63O7M32K7l06J43K3k7m9K62k74
4315a8M81n99j64L35r4J41k77M01l57N2K69k14o2j5M04P0M1m33j40j7m6M49K2
4338B29l40j12K40N1L0k26O5lR9j44K96J50m39J33R3P8n33N2M52jl43l7L01O3
4362A54J31n01L32R9m40M47r9Ok97J04M8k14k1M31m8o4j48j06L03M0j01J18j1
$$ plain form
4385 163 59 75 43 183 -110 -147 214 80 8 -39 -219 -46 125 172 182 307 57 -223 225 76 -203 -210 140
4408 140 -157 -136 37 267 -31 -138 -43 -123 -98 -324 -191 98 -74 -147 -107 56 -12 -301 -44 104 -162 36
4430 36 -3 -160 35 -127 225 156 -143 -9 169 -69 -108 15 51 15 19 220 -204 218 -72 -37 117 187 -70
4453 -70 272 116 -46 147 216 22 -90 -17 -130 221 11 150 -156 -86 -273 -38 7 344 32 -26 -226 25
4475 25 27 -23 -56 179 82 82 87 -233 -117 -305 6 38 -88 -109 -45 -126 59 -80 -93 151 215 216 246 -186 -119 147 -298
4502 -298 -371 69 -122 309 -41 -73 -256 -64 223 200 56 71 31 251 -153 142 -11 -117 -30 26 158 15
4524 15 226 -69 235 113 136 195 -16 110 121 -69 169 -190 -40 -61 135 -223 -75 19 -174 83 -26 205
4546 205 183 -240 38 -26 -333 83 196 -5 72 65 290 168 59 82 -126 -5 47 -222 77 -200 85 -168
$$ packed form
4385A63j04J6l2J40k93l7L61j34p2m7j80J73J71M7J0J25k50k80M48j49k79pL50
4408A40k97K1J73K30k98j07R5q0K5k26J33K89j72p3M0J63o8k89K57J48k66J98
4430C6l9j57J95j62L52o9k99J34J78k38l9J23L6l6MK01m24M22k90L5J54P0k57
4453g0L42j56j62J93O9j94j12P3j13L51k10J39l06P0j87K35M5L37l12n8k00K51
4475B5Kn0l3K35r7%Nl20J16j88L11L2j26k1O4q1J85j39j3K44O4JL0m32O7K66m45
4502b98p3M40j91M31l50l2j83J92K87k3j44J5m0K20m04K95j53j06Q7N6J32j43
4524A5K11k95L04j22K3N9k11J26J1j90K38l59J50k1J96l58J48R4j93K57j09K31
4546B05k2m23K78o4l07M16J13k01P7pK25j22j09K3k08J21N2k69K99k77K85k53
$$ plain form
4568 -168 -149 103 137 100 -95 133 -214 29 -179 153 327 134 -119 -66 119 108 -135 4 -114 112 -47 -319
4590 -319 1 155 -2 -43 29 68 -33 -202 64 -235 283 153 -35 177 15 -88 28 90 -74 -154 135 -192
4612 -192 -49 -16 -113 -167 -165 -39 112 -19 8 36 -102 -93 156 -222 -167 -253 84 -21 127 61 -1 -65 -139 342 -75
4637 -75 -153 -166 -281 266 -129 25 24 -39 38 -184 122 -264 265 22 102 63 -198 -103 -121 63 -46 172 -195 -114
4661 -114 -135 -203 -120 52 38 -107 28 -62 33 220 -267 10 178 -24 75 -312 -1 -217 94 121 -65 67 165
4684 165 -143 32 164 -35 -205 2 73 200 -71 175 97 -145 196 -115 -377 37 -209 -33 -161 -132 86
4705 86 -215 -59 -13 118 -21 163 84 31 -5 95 -252 64 -299 -46 38 -16 -145 100 42 -87 -62 -138 -79 7
4729 7 -198 205 114 175 -91 2 227 -6 -86 152 144 198 -168 71 201 65 -15 12 -10 172 -31 393 65 -97
$$ packed form
4568a68J9K52L4l7j95K28l47K43k08L32J74j93k53N3J85j1k43J39j18K26j59k72
4590c19L20J54j57m1P2L9j01j69K66k99N18j30j88K12j62j03J16O2j64q0K89l27
4612a92J43L3r7n4KJ26J51j31K7K8j38RK49l78N5q6L37j05J48o6o2o4p4M81m17
4637g5p8j3j15N47l95J54jo3P7k22L06l86N29k43Q0l9k61R5j8J84j09K18l67Q1
4661a14k1o8Q3J72j4j45J35r0R5J87m87K77J68k02R9l87L11k16L11K7j86J32R8
4684A65l08J75J32j99j70K07P1J27k71K46p8k42L41l11k62M14k46J76j28K9K18
4705H6l01J56M6J31j39J84p9n3l6J00l47L16l63K53Q4n4j29K45n8j29K5p6N9Q6
4729Gk05M03r1O1k66R3K25k33q0K38qN4l66K39J30j36q0K7k2J82k03M24l28j62
$$ plain form
4753 -97 -20 62 96 -361 -232 24 -209 120 45 -8 166 160 264 133 -156 209 235 277 -7 95 12 51 50 72 51
4778 51 -135 -189 -55 -10 -262 87 269 103 18 54 -245 10 218 -126 -209 105 168 -59 -96 93 164 -84 19
4801 19 -159 -30 240 -91 -38 -390 -99 -3 -14 -95 -58 -33 42 27 37 227 224 244 285 138 56 -53 -30 -238 -239 47
4827 47 -126 -67 -186 -141 -82 10 -185 143 16 -22 -277 -271 -149 -152 301 -145 152 85 -286 19 25 137 -49 60
4851 60 271 284 136 0 44 15 -40 229 -250 97 -125 299 165 314 -97 -23 -109 -135 151 -229 24 12 -133
4874 -133 109 147 -203 -162 -32 51 -128 8 -63 -185 142 44 -76 -287 111 -47 -179 21 -384 75 -197 -218
4896 -218 -154 134 -80 15 -35 -311 38 -237 163 -82 -143 -276 -247 215 119 44 -234 -92 286 -234 -220 52 -331
4919 -331 -49 167 -33 -137 123 141 328 -184 -199 -96 -179 -27 -152 102 82 22 44 96 -36 -12 -115 142 -175
$$ packed form
4753i7P7Q2L4m57J29K56k33L29p5n3J74oJ04j31k89L65K6M2k84J02q3L9jK2k1
4778E1j86n4J34M5k52L49J82j66q5L6k99K55K08l44q3L14O3k27l7J89P1k48J03
4801A9j78J29K70l31N3l52K91R6j1q1L7K5P5j5J0J90lK0M1j47q2j09K3k08jK86
4827D7j73N9j19M5N9R2j95L28j27l8k55OJ22lM53m46K97o7l71L05OJ12j86J09
4851F0K11J3j48j36M4k9n5K69m79L47k22M24j34J49m11P4q6k6K86l80K53j2j45
4874a33K42L8l50M1J30Q3j79J36p1j22L27r8j20k11L98j58j32K00m05M59k72k1
4896b18O4K88k14R5n0k76L49k75M00k45o1j33K9M62r6p5k78J42L78n20J4K72l83
4919c31K82K16k00j04K60J8J87n12j5J03q3J52j25K54k0o0K2N2j32K4j03K57l17
$$ plain form
4942 -175 70 -81 -6 -13 -136 -125 40 -37 -215 -92 73 166 -42 114 39 284 -74 405 -74 17 -143 76 308
4965 308 -90 -108 152 83 -58 -65 153 191 -197 47 -37 -301 160 203 109 -217 -71 -143 -28 240 271 50 -75
4988 -75 -109 -388 97 113 23 -317 123 14 -152 100 -130 173 -41 -51 -78 -188 277 53 -46 272 8 73 316
5011 316 7 134 -25 -278 -81 56 8 30 -206 -179 13 23 -174 -324 7 114 32 93 -75 25 -72 39
5033 39 124 -187 -114 -193 -128 -93 -314 33 -80 94 126 -31 -135 63 -3 56 14 -10 40 -6 -134 -41 -191 38 -12
5058 -12 183 168 11 -44 -84 -551 93 134 23 -103 47 74 -292 -178 30 -254 -174 -10 107 -93 30 -316
5080 -316 -110 170 -187 -141 105 192 -50 -12 111 -30 46 24 221 -231 -49 -27 -78 -159 -5 12 -246 -47 -93
5103 -93 263 201 -194 -167 -1 -67 -89 91 51 186 -371 -113 -355 -30 -151 3 23 -83 156 -171 -176 -147 -9
$$ packed form
4942a75K45j51P5pj23J1J65p7j78J23J65R3k08J56p5K45l58M79m79R1j60K19K32
4965C08l98j8K60o9j41pK18L8l88K44q4k64M61M3r4l26J46p2J15K68L1k21j25
4988g5l4k79M85J6r0l40M40j09j66K52k30L03k14j0k7j10M65k24r9L18k64O5K43
5011C16l09J27j59k53J97J37m8K2k36K7J92J0j97j50L31J07q2O1j68J00r7J11
5033C9Q5l11P3p9O5L5k21L47j13J74L2j57j04J98o6N9m2k4N0m6j28R3j50K29n0
5058a2J95j5j57n5m0m67O44M1j11j26J50K7l66J14K08k84Q0J64J17k00J23l46
5080c16K06K80l57M6K46Q7k42L8J23j41P6k2J97m52J82K2n1q1J54J7k58J99m6
5103i3L56o2l95K7J66o6k2J80m0J35n57K58k42L25j21J54K0j06K39l27nK9J38
$$ plain form
5126 -9 52 15 125 -50 59 196 -104 -209 90 -223 -336 109 203 -8 -339 -158 -76 214 -96 330 0 15
5148 15 -151 64 -43 126 235 -15 309 -64 148 271 122 -59 -54 -127 15 53 -255 123 62 138 225 -38 187
5171 187 -38 147 211 34 -231 10 -121 -112 151 -160 -2 127 92 -207 141 78 15 250 95 -73 37 31 25
5194 25 -23 41 210 -49 -175 98 -63 -160 -211 -76 80 -3 -11 134 -179 177 -301 -124 95 97 -330 -221 27
5217 27 -82 228 44 -149 9 231 112 -106 12 -29 116 -6 -174 -156 29 62 -97 34 -34 -60 -170 -188
5239 -188 -131 289 -115 110 81 -52 -151 -71 58 -266 -86 185 7 -41 -39 -239 183 16 181 -227 177 -34
5261 -34 -170 -193 300 -38 -123 42 4 -360 105 -160 165 455 84 281 -131 380 100 147 62 198 15 86
5283 86 389 -54 -20 136 -151 -191 -155 -271 -17 -131 123 33 61 129 270 50 -83 -198 -44 190 -257 -134
$$ packed form
5126iO1l7J10j75J09J37l00j05K99l13j13M45R4k11l31J81Q2K90l10M26l30J5
5148A5j66K15j07J69J09k50L24l73K12J23j49j81Np3J42L8l08L78o1P6Q7k63K25
5171A87k25J85O4j77k65K41j31RK63l11J58J29l5k99L48o3o3K35j55j68J10oo
5194B5m8O4J69k59j26K73j61r7n1J35J56q3qJ45l13L56m78J77K19Km27J09K48
5217B7j09L10j84j93J58K22j19k18J18m1J45j22j68J8J85L3j59J31o8k6j10j8
5239a88N7M20m04K25k9j33r9Q0J29l24J80K71j78m8Kk00M22j67J65m08M04k11
5261c4j36k3M93l38q5J65l8l64M65k65L25K90l71J97m12N11k80M7q5J36j83P1
5283H6L03m43L4J56k87m0L6j16K54j14K54r0K8O8J41k20j33j15J54K34m47J23
$$ plain form
5305 -134 -228 93 5 12 131 2 177 109 21 -51 51 -157 197 21 -204 34 -83 154 95 -6 192 -188 -230
5328 -230 -71 114 -148 -143 188 -164 191 -4 -151 182 413 -139 1 11 -215 197 24 176 -190 37 -175
5349 -175 -80 126 -120 55 68 -71 133 257 61 117 26 350 9 -168 -180 -20 -118 216 -107 -155 223 324
5371 324 -87 -31 59 66 333 121 -29 128 -164 -64 88 101 -202 -129 -125 156 67 -202 129 89 -62 -2 8 177
5395 177 -22 -56 116 18 108 67 26 29 -23 134 108 -31 -155 -286 -66 149 149 -229 -182 -31 95 -140 -304 -40
5419 -40 -79 353 -94 -176 -106 5 87 355 188 -145 199 49 -64 -63 20 -10 -110 -94 82 -2 169 51 68 -249
5443 -249 147 -102 -240 -267 -26 -45 -71 -79 -16 -131 -132 108 -53 81 163 27 21 -62 -107 137 79 -273 89 6 295
5468 295 61 -211 55 262 -40 -34 -137 -24 166 -27 -110 8 -279 98 78 -144 16 261 -171 -108 -91 -81
$$ packed form
5305a34r4L21q8PJ19j29J75o8q8p2J02k08L54j76k25K38j17K37n9j01J98l80m2
5328b30J59J85k62NL31l52L55j95j47L33K31n52J40J0k26M12j73J52l66K27k12
5349a75R5K06k46J75J3j39K04J24j96N6r1L24l41j77j2J60r8L34l23m8L78J01
5371C24m11N6R0PK67k12j50J57k92J00J52J3l03P3MK81q9k69L31m0j51O0J0J69
5395A77j99l4J72r8R0m1m1Ln2J57k6j39j24j31K20K15%l78M7J51J26k35j64K64
5419d0l9M32m47q2P0J11Q2K68j67l33L44j50j13JQ3l0j00J6J76q4J71j18J7l17
5443b49L96k49j38k7K41j9k6qO3j15jK40j61J34Q2j36oq3m5K44n8l52L62q3K89
5468B95k34k72K66K07l02Oj03J13J90j93q3J18k87L77k0k22J60K45m32O3J7J0
$$ plain form
5490 -81 -70 44 78 -273 213 -198 133 48 323 -131 -164 173 -30 255 -176 201 105 1 -146 -10 257 256 168
5513 168 -54 -120 26 62 -22 121 -8 26 -57 80 21 143 -185 205 82 69 -103 -207 224 344 25 -191
5535 -191 233 182 -63 22 -90 9 -22 202 -14 -138 157 178 -108 105 170 -3 3 -236 -156 -156 335 -184 -122 122
5559 122 97 -229 -213 -241 263 238 26 4 90 232 -185 -37 144 -140 -188 164 -224 -190 -201 136 -179 -246 -21
5582 -21 -66 10 45 -59 318 67 -294 -36 100 85 42 -57 62 192 -6 21 34 -253 -64 -341 -274 93 237
5605 237 -2 10 54 169 -123 -106 1 32 4 -238 -170 23 140 19 259 143 213 -351 -219 -108 -81 -7 226
5628 226 30 -47 -389 14 -162 51 111 -55 -324 47 96 -64 64 -72 134 -101 -153 212 130 117 176 77 -223
5651 -223 186 118 142 107 -41 17 116 87 52 46 206 252 113 15 13 52 141 51 -98 -165 74 44 -142 -8 -21 74 -183
$$ packed form
5490h1J1J14L4l51M86m11L31q5K75m54l3L37k03K85m31L77r6j04j47J36K67jq8
5513A68k22o6J46L6q4J43j29L4q3J37n9J22l28L90j23j3j72j04M31J20l19k16
5535a91M24n1k45Q5j12R9l1K24k16j24K95K1k86K13O5j73Ok39Q0%M91n19O2K44
5559A22k5l26J6k8N04k5k12k2Q6J42m17J48J81k84m8L52l88L4j1L37l15o7K25
5582b1m5P6L5j04L77k51l61K58J36j5m3r9J19J30j98K7J3k87J89k77O7L67J44
5605B37k39J2M4J15k92J7J07L1k8k42O8J93J17j21K40j16P0n64J32J11K7P4K33
5628B26j96p7l42M03j76K13O0j66k69L71M9j60J28j36K06k35n2L65q2j3N9r9l00
5651b23M09o8K4l5j48N8R9k9l5oJ60M6j39r8kL9Q9r0j49o7K39l0j86J34j3R5k57
$$ plain form
5678 -183 -16 341 160 -249 57 6 84 -67 -341 103 327 -138 175 0 -11 -155 97 280 -63 -11 57 287
5700 287 21 -111 -48 34 26 -123 171 155 -232 -121 125 221 -76 -146 19 -119 -210 -118 134 -329 72 -178 -277
5723 -277 -191 -326 67 268 397 -166 -345 142 -164 -68 170 -2 86 -213 319 -119 93 62 247 -74 -141 195
5745 195 167 223 24 -34 -24 -145 -249 240 87 -342 -97 -53 65 -138 -1 -131 -105 -77 143 -62 324 127
5767 127 -149 124 206 90 -153 255 178 261 -126 73 -79 188 -100 125 284 5 141 -2 76 -149 -30
5788 -30 114 144 103 143 70 -185 67 136 329 -70 -130 -74 245 177 -21 -94 145 -185 -77 151 143 -79 -276 63
5812 63 -152 312 -149 135 -32 -217 49 -28 248 -20 -132 -17 357 126 174 179 -81 400 -165 202 -83 -130
5834 -130 195 -274 -228 3 47 178 -158 221 320 35 -67 54 32 -131 -81 -93 125 208 14 -43 145 -161 -252
$$ packed form
5678a83J67L57j81m09L06n1P8j51k74M44K24m65L13j75j1j44K52J83l43N2O8K30
5700B87k66j32O3Q2qj49K94j6l87J11K46R6k97p0J65j38r1R2K52m63M01k50r9
5723b77Q6j35L93K01J29n63j79M87l06R6K38j72Q8k99N32m38K12l1J85l21o7L36
5745A95k8N6j99n8J0j21j04M89j53m29K45M4J18k03J37j30K6K8K20k05L86j97
5767A27k76K73Q2j16k43M08p7Q3l87J99j52K67k88K25J59k79J36j43P8k25J19
5788c0J44L0m1M0p3k55K52O9J93l99o0N6L19o8j98p3K39l30J08K28qk22j97L39
5812F3k15M64m61K84j67j85K66p7K76k68j12J15L74k31M8Nk60M81n65L67k85m7
5834a30L25m69M6K31M4J31l36L79R9k85j02J21k2j63N0j2K18Q3j94n7J88l06r1
$$ plain form
5857 -252 -346 284 4 -252 -244 249 60 -201 96 346 13 51 77 -186 43 9 237 318 15 -7 295 -54 -88
5880 -88 56 29 -78 237 19 46 212 -96 136 28 -52 32 -260 -145 -230 -201 -101 36 225 -248 78 -260
5902 -260 344 -67 220 95 93 -139 433 74 -180 -87 -16 24 92 -24 145 -19 -19 153 24 -408 179 -104 391
5925 391 27 156 -100 -226 -118 -30 -198 -162 -135 114 125 -6 51 7 267 208 -31 -102 -146 -116 -220 -132 54 79
5949 79 19 -55 -102 209 80 14 -151 -117 -204 12 234 53 -175 249 -195 105 -121 91 347 -36 67 -164
5971 -164 56 198 226 178 -145 -166 84 -131 168 -360 163 1 237 209 -2 -92 -105 23 -109 -52 -199 25
5993 25 138 -17 191 66 -50 77 -122 -310 -358 55 135 -187 -206 116 -314 212 6 -104 217 -213 -56
6014 -56 56 -68 151 -54 -219 -41 22 124 121 19 132 -93 -160 -144 -56 268 -56 -279 -194 289 54 -101 304
$$ packed form
5857b52r4O30k80k56QM93j89k61K97K50l33L8K6k63K29l4K28Q1l03k2L02l49l4
5880h8J44k7j07L15k18K7J66l08K32j08q0Q4k92J15q5K9J00J37J89m73L26l38
5902b60O04m11K87j25kk32N72l59k54R3P1M0O8j16J69j64%J72j29m32N87k83M95
5925C91l64J29k56j26J08Q8j68L6K7K49J1j31N7m4K60n9k39p1m4L0j04Q8J86K5
5949G9o0p4m7L11j29o6j65L4q7K16K22j81k28M24m44L00k26K12K56l83J03k31
5971a64K20J42K8m8l23k1K50k15K99n28N23j62K36k8k11r0j3J28j32N7j47K24
5993B5J13j55K08j25j16J27j99j88m8M13Q0l22j9L22m30N26k06j10L21m30J57
6014e6J12j24K19k05j65J78O3J02lj02J13k25o7J6Q8L24l24k23Q5M83k35j55M05
$$ plain form
6037 304 236 -116 -121 140 53 -50 72 275 -70 -59 3 -72 18 9 -118 20 68 -358 -181 -335 -76 57 -101 -82
6061 -82 285 -129 87 -117 -116 301 239 189 -136 -96 -46 14 -314 -112 203 220 28 -175 94 -91 -53 -156 -174 231
6085 231 35 -19 256 -13 -44 -321 -65 203 -65 98 -295 -101 284 18 -193 -103 62 44 -194 -151 6 -47
6107 -47 -34 -304 21 -233 177 -78 -11 108 124 295 -50 307 11 210 -39 392 236 -173 -65 -77 130 -64
6129 -64 181 -197 -199 8 100 282 211 -169 287 -112 102 165 -30 71 -422 9 100 3 302 97 -134 132 63
6152 63 155 131 -13 -33 -126 30 -17 -239 70 -48 -192 36 78 -206 157 84 40 -118 0 -127 80 29 -192
6175 -192 136 212 83 -79 -233 73 323 -56 8 -126 89 113 27 -394 -345 -155 86 8 -136 -1 -160 64
6197 64 -195 59 -20 -110 362 152 35 150 -119 104 157 39 121 -135 -59 99 32 34 -10 -8 -249 -31 -135 331
$$ packed form
6037C04o8l52nK61q7j03J22K03l45J1O2p5R0rj27J38M8m26J77j54K59J33j58J9
6061h2L67m14K16k04JM17o2n0l25M0N0O0l28K02L15J7j92k03K69j85L8j03j8M05
6085B31j96n4K75k69l1k77K56K68k68J63l93J94L85k66k11R0J65j8k38M3J57n3
6107d7J3k70L25k54M10k55O7J19J6J71l45L57k96J99k49M31j56m09J08j2K07j94
6129f4K45l78kK07R2J82p1l80M56l99K14O3j95J01m93M31R1r7K99k05k31K66o9
6152F3R2k4j44k0r3J56m7k22L09j18j44K28M2k84L63p3m4j58J18j27K07n1k21
6175a92L28P6j29j62j54L06K50l79O4j34K15K4q6m21M9J90K41p8j44J35j59K24
6197F4k59K54p9r0M72k10j17J15k69K23N3j18Q2k56P6J58o7Km4Kk41K18j04M66
$$ plain form
6221 331 -146 46 31 31 -58 -99 0 295 148 111 138 121 -157 -114 122 -20 21 -6 -8 120 77 26 96 20 -191 -216
6247 -216 10 129 15 -192 -192 -141 -76 -219 -81 -205 75 114 19 19 -65 -28 262 254 -27 -93 182 -139 84 -258
6271 -258 -229 -75 -33 233 133 196 -107 257 -81 20 134 92 5 294 -35 10 -102 -193 124 106 -43 24 84
6294 84 -16 2 -108 -60 -70 73 -22 84 195 61 122 -283 225 -107 31 -8 -91 126 -5 171 -42 -119 -201
6317 -201 119 -312 175 20 124 -60 110 -35 -57 0 -113 342 74 -99 -42 149 166 -86 -6 101 17 92
6339 92 107 137 68 -19 -59 29 -150 84 -9 -161 -16 -341 -396 132 0 -97 -35 -260 -399 -219 172 -87 -41 -286
6363 -286 -215 89 38 174 -179 177 -85 -6 23 201 100 -224 130 -123 35 -199 284 113 -241 -24 259
6384 259 -173 -132 -204 -120 120 -174 -63 54 20 0 -148 62 -126 126 -92 -42 209 -195 -335 60 219 202
$$ packed form
6221C31m77J92j5%q9m1R9K95j47l7K7j7k78M3K36j42M1k7kJ28m3n1P0p6k11k5
6247b16K26J19j14k07%N1O5j43J38j24K80L9r5%q4L7K90qk81o6K75l21K23l42
6271b58K9J54M2K66j00O3l03L64l38J01J14m2q7K89l29M5j12r1L17j8j49O7O0
6294H4j00J8j10M8j0J43r5J06J11j34O1m05N08l32J38l9q3K17j31J76k13p7q2
6317b01L20m31M87j55J04j84J70j45k2N7j13M55k68j73N7J91J7k52Q0J07q4P5
6339I2J5L0o9q7m0Q8j79K34r3j52J45l25n5N28j32r7O2k25j39J80L91k59M6k45
6363b86P1L04n1J36l53L56k62P9K9J78j01l24L54k53J58k34M83j71l54K17K83
6384B59m32M1p2Q4K40k94J11J17l4k0j48K10j88K52k18N0K51m04j40L95J59j7
$$ plain form
6406 202 -287 11 -74 -123 169 -76 -19 101 36 -44 -29 149 106 153 147 -190 68 -63 94 115 45 -39 -208 -65
6430 -65 245 -100 -108 -169 -58 -26 -172 131 295 220 -146 -73 466 -75 -154 73 -19 -138 25 -84 30 185 15
6453 15 79 110 52 -25 -121 -189 -131 153 -216 -489 329 -203 183 89 -50 -259 12 -208 -21 350 -210 -109 -137
6476 -137 28 -214 21 47 -262 78 400 -117 52 -246 -109 -118 87 49 216 -370 -13 -80 241 -114 -2 136
6498 136 -244 267 -317 108 186 12 8 -48 -117 170 114 -95 -108 162 -125 104 110 64 -82 -74 54 71 140 -8 -212
6523 -212 115 -34 130 20 -210 -81 244 -19 -19 116 45 289 -150 -180 -42 -4 108 75 34 113 5 6 -107
6546 -107 -25 -37 -16 -200 428 -67 -208 37 -86 3 -59 -44 285 -241 21 149 -54 128 30 -224 -236 40 -304
6569 -304 -38 -225 -180 -9 -228 88 315 210 97 -41 -138 -256 143 -40 -206 -16 -217 294 -51 119 244
$$ packed form
6406B02m89K98q5m9K92k45N7J20o5q0J5J78m3M7ol37K58j31J57K1p0q4j69J43
6430f5L10l45qo1J11L2j46L03J64p5l66P3N39n41p9K27r2j19J63j09J14J55j70
6453A5O4L1n8p7r6o8N8K84l69k73Q18n32L86r4j39k09K71k20J87L71n60J01k8
6476a37J65k42K35K6l09L40L22n17J69k98J37rK05l8J67n86L57o7L21l55J12J38
6498A36l80N11n84M25P8j74mn6o9K87n6k09j3K70k87K29Om6j46QJ28J7O9j48k04
6523b12L27j49J64j10k30J29L25k63%J35p1K44m39l0J38L8J12l3m1P9j08Jj13
6546a07Q2j2K1j84O28m95j41K45j23Q9o2J5L29n26K62J28k03J82r8k54j2K76l44
6569c04K66j87M5J71k19L16K27j05j13j38r7j18L99j83j66J90k01N11l45J70J25
$$ plain form
6590 244 -286 20 13 160 -93 -87 -174 254 -141 -94 -2 -29 -139 -168 -42 310 124 -148 53 40 64 -22 175 206
6614 206 -118 -135 130 -241 -147 10 36 -101 -145 -228 225 -10 -265 187 202 161 -154 -62 -27 -35 71 224 -84 -316
6638 -316 27 -12 86 52 -97 209 -182 -29 -71 -165 37 15 -23 46 -172 -64 349 111 18 -382 -20 -44 41 95
6662 95 43 -146 129 69 -198 94 -106 180 -129 149 -40 191 101 329 30 -24 487 -115 -1 -178 163 27
6684 27 72 -334 79 232 -160 -61 23 -79 54 -86 -113 241 -113 -42 84 -10 -233 -59 146 41 102 -208 -276
6707 -276 -71 195 150 -147 104 -64 -229 -66 72 -27 134 248 69 112 -385 -76 -116 10 -130 179 -283
6728 -283 256 13 -175 50 267 210 -93 229 -112 -71 -94 -240 183 -230 -183 110 243 -20 135 125 192 19
6750 19 -28 434 -88 256 -333 13 -44 -31 -33 235 33 261 111 -132 -305 225 -184 -216 179 -153 -70 85 -114
$$ packed form
6590B44n30L06pJ47k53Oq7M28l95M7R2k7j10k9J26L52j86k72K01j3K4q6J97L1
6614B06l24j7K65l71R4J57K6j37m4q3M53k35k55M52J5m1l15R2L5qJ06J53l08k32
6638c16L43l9R8l4j49L06l91J53m2r4K02k2l8O9k18J08M13k38r3m00L62k4Q5N4
6662I5n2j89K75o0k67K92k00K86l09K78j89K31r0K28k99n4N11o02J14j77L41j36
6684B7M5m06M13J53l92R9Q4j02J33j40k7L54l54P1J26r4k23J74K05j05O1l10o8
6707b76K05K66m5k97K51j68j65J63J38r9J61J14j79M3m97L09m0J26j40L09m62
6728b83N39k43j88K25K17n7l03L22l41M1k3j46M23m13M7K93J33k63J55j0O7j73
6750A9m7M62n22L44n89L46n7J3kK68k02K28j50k43j73N30m09l2L95l32Q3J55j99
$$ plain form
6773 -114 -188 332 253 117 -45 -185 -80 19 -144 126 -152 191 -5 -3 -55 -311 57 -106 -52 70 -38 199
6795 199 -87 -202 -137 -72 -272 -81 -29 -190 -97 81 242 81 172 165 -29 283 -38 104 136 268 -168 -285 -79
6818 -79 -80 68 54 -6 385 125 -93 -196 -76 -120 185 162 3 -135 -142 -158 60 -264 -100 261 -7 -21 -261 140
6842 140 92 186 96 -35 -33 -65 -190 101 119 -37 138 -11 -64 273 40 8 -194 78 332 -64 -198 180 -75
6865 -75 -283 -69 -127 78 6 -165 -221 81 -57 -4 57 -24 -76 73 13 -185 -28 -173 41 23 107 -30 -225 178
6889 178 176 252 71 -66 -172 -245 122 -97 -61 25 74 116 -87 -295 -54 -18 -73 92 302 43 -65 298 143
6912 143 -44 127 45 211 -123 -1 -115 -121 -51 218 -133 76 201 -27 -140 96 63 -104 82 -17 224 24
6934 24 387 -129 85 -63 140 138 209 -99 108 170 67 -58 81 181 -6 -165 138 242 -138 -446 8 -200
$$ packed form
6773a14p4N20p9j36j62j40J05R9j63K70k78L43j96Kn2k56L68j63N4J22j08K37
6795A99k86j15O5O5k00J91N2j61R3J78J61j61R1pj94L12l21J42L2J32m36j17K06
6818g9jJ48j4o0L91k60k18j03J20m4L05k3j59j38pj6K18l24J64L61k68j4k40M01
6842A40m8R4r0j31Kl2j25K91J8j56J75j49n3L37k33l2k02K72K54l96j34L78k55
6865g5k08K14n8K05p2j71n6L02j38N3O1q1n2J49o0j98J57j45K14j8Q4j37j95M03
6889A78kP6j81j37j06p3L67k19L6Q6M9M2k03k08K41L6n5J65K10k59j08L63j55
6912A43j87J71q2J66l34J22j14oP0K69l51K09J25k28j13K36l3j67J86r9K41k00
6934B4L63n16K14j48K03kP1l08K07O2j03j25J39J00j87j59L03J04l80l08M54k08
$$ plain form
6956 -200 114 102 -67 114 239 418 -26 -55 199 341 16 67 109 70 -42 -104 -240 220 -308 16 -11 136
6978 136 -13 86 -92 51 349 -278 -41 7 187 -195 66 41 88 37 53 134 95 160 -98 66 -113 -292 -188
7001 -188 -36 -91 35 -117 -177 124 -27 31 49 79 -317 67 263 -175 60 12 -4 -193 -90 -143 102 -131 8
7024 8 113 116 283 -149 161 37 71 -41 59 232 136 230 199 -36 -6 247 162 -44 108 -41 -95 -76 -214 -281
7048 -281 -263 16 -142 -60 -5 158 -108 16 -222 -13 215 -253 189 28 124 74 -207 91 -196 28 -140 -172
7070 -172 15 -155 -54 -180 317 -196 40 13 56 -13 -55 -112 61 -88 -40 138 29 1 191 -130 -248 62
7092 62 42 68 82 -103 -89 246 70 160 -226 -42 -48 51 192 53 -324 185 -123 -231 -149 38 151 8 -215
7115 -215 -135 118 92 -166 25 -131 124 83 190 -42 -233 133 275 -277 -215 -140 -184 -144 296 137 136 -130 32
$$ packed form
6956b00L14j2j69J81J25J79m44k9K54J42l25N1M2l9j12o2j36M60n28L24k7J47
6978A36j49R9j78J43K98o27K37M8J80l82K61k5M7n1J6Q1l9O5k58J64j79j79J04
7001a88J52n5J26j52o0L01j51N8J8L0l96L84J96m38K35m8j6j89J03n3K45k33J39
7024HJ05LJ67m32L10j24L4j12J00J73r6R4l1k35L0K53q5k06J52j49n4J9j38o7
7048b81J8K79j58Q2N5J63k66J24k38K09K28m68M42j61R6n0k81K98k87K24j68l2
7070a72J87j70J01j26M97n13K36k7M3o9m2n7J73j49M8J78j09k8J90l21j18L10
7092F2k0K6J4j85J4L35j76R0l86J84oR9J41j39l77N09l08j08Q2J87J13j43k23
7115b15Q0K53k6k58J91j56K55m1J07k32j91L66J42n52O2P5m4M0M40j59jk66J62
$$ plain form
7138 32 -32 -160 232 299 87 295 107 -107 347 -130 -25 -86 -126 5 229 15 191 -132 29 -77 -31 267
7160 267 156 66 67 -10 152 -19 -466 190 208 132 -37 -141 154 -3 -154 -206 -34 -81 -302 49 6 -75 -155 147
7184 147 74 13 25 141 -45 177 23 135 53 -73 215 67 3 106 -315 -135 -60 93 150 320 -77 -121 -75
7207 -75 179 142 147 181 -15 147 -31 -280 70 -154 42 63 -257 -30 -61 12 32 -92 -31 -83 157 27 -58 -160
7231 -160 247 79 186 261 210 113 -34 -18 150 -257 -125 274 -48 -136 -393 271 74 23 123 156 -20 222
7253 222 107 -140 -167 -176 240 351 -42 85 -216 84 -270 -287 153 -108 -8 132 -294 167 362 242 -120
7274 -120 23 -270 71 52 155 -26 -214 -92 -16 -23 257 -33 -95 -93 -8 -147 -9 -36 -267 131 -224 -90 -110
7297 -110 -67 -359 -125 -210 149 -134 -70 -204 -24 -54 -75 40 0 -63 106 -20 27 -199 184 -3 79 -165 153
$$ packed form
7138C2o4j28L92O7k12K08j88k14M54m77J05o1m0J31K24k14J76l23J61j06M6K98
7160B67j11r0Jp7J62j71m47O56J8p6j69j04K95j57j51n2J72m7k21L51m3q1q0L02
7184A47p3o1J2J16j86K22j54J12q2j26K88j48o4J03m21J80P5J53N7J70l97m4M6
7207g5K54l7NL4j96J62j78k49L50k24J96K1l20K27l1P3K0j24O1n2K40j30q5j02
7231a60M07j68J07P5n1r7j47J6J68m07J32L99l22q8k57O64j97n1J00L3j76K42
7253B22j15k47k7rM16J11l93J27l01L00l54j7M40k61J00J40m26M61J95j20l62
7274a20J43k93L41j9J03j81j88J22P6pK80k90o2KQ5j39J38k7k31L98l55J34k0
7297a10M3k92K34q5L59k83O4j34J80l0k1J15m0o3J69j26M7k26L83j87Q2k44L18
$$ plain form
7320 153 125 -54 91 -32 -5 10 -76 -152 -192 -173 -111 -187 -284 203 82 -159 454 -30 -14 106 123 -270 113 29
7344 29 0 47 -267 358 99 36 -214 -83 207 -65 139 120 -243 61 -189 13 102 90 -39 -188 118 154 150
7367 150 53 229 -80 50 -44 38 10 69 -261 82 -71 -5 24 193 11 12 290 -106 173 126 22 -239 -23
7390 -23 105 -99 62 8 -133 -198 -170 -90 -160 -78 -6 47 5 274 142 -195 -23 53 -113 203 28 -87 -54 28
7414 28 137 435 -195 198 -325 93 105 -22 -132 43 -173 35 7 205 220 -126 -38 -75 -322 -206 -136 -111 67
7437 67 11 268 32 74 265 0 252 150 -90 -192 4 -33 83 125 278 315 75 -449 -31 94 -265 6
7459 6 325 250 -155 -69 -30 -8 -79 -56 -3 -171 2 117 -32 68 -279 -87 -46 -340 45 -31 35 -63 -22 -198 21
7484 21 -262 -161 151 -60 -97 249 33 99 102 -3 41 50 -67 -38 191 -5 -96 -201 -24 -49 -96 -94 19 -16 -45
$$ packed form
7320A53k8j79J45j23K7J5q6p6m0J9O2p6r7M87j21k41O13m84J6J20J7l93L83q4
7344B9k9M7l14O25k59o3k50J31K90k72K04j9l63L04k50K02Q9j2j29j49L06L6m
7367A50r7J76l09J30r4Q2k8N9l30L43j53O6K9J69j82JK78l96K79m7j04k61K16
7390b3J28k04J61n4j41o5K8Q0p0Q2P2N3m2K69j32l37J72P6j66L16j75j15L3Q2
7414B8J09K98o30L93n23M18J2j27j10J75k16K08k8J98J5l46Q8l7k47J16P0K5J78
7437F7n6K57k36M2J91k65K52j02k40j02J96l7J16M2J53L7k40n24M18J25l59K71
7459FL19p5m05Q6L9K2p1K3N3j68J73J15j49J00l47J92M1k94L85p6O6r8M1j76K19
7484B1k83J01L12k11l7L46k16O6Lj05M4Rj17K9K29j96r1j05J77k5m7KJ13l5k9
$$ plain form
7509 -45 -193 -121 132 -89 45 -27 136 -140 39 195 96 -78 -108 -160 69 -109 113 -132 -1 -296 -233 65
7531 65 220 -28 -81 -164 129 189 -411 -20 27 -10 -151 -286 -10 -140 -233 -151 17 -250 311 -179 68 -113 267
7554 267 -76 32 -27 -10 0 -179 -149 41 84 -36 -48 -123 45 -13 33 -81 163 -5 -238 38 -10 60 344 22
7578 22 -104 31 123 -260 -23 263 144 -104 -271 -183 -10 -274 142 -104 79 -134 -164 -16 37 126 -217 65
7600 65 -178 -138 -105 -168 -113 -97 25 232 -135 351 68 34 -212 -106 4 -37 124 -261 65 -77 277 132 -98
7623 -98 111 -87 116 -11 -103 221 -59 179 66 -33 -301 309 -126 62 116 -150 230 -130 144 45 -34 -26 -221
7646 -221 -202 -170 -5 -108 82 -143 156 -177 -72 -35 94 49 139 -105 -1 5 -200 -118 21 96 -55 -85 43
7669 43 49 219 256 69 125 31 -80 183 111 -133 219 78 136 -107 71 -206 47 157 -99 -90 86 -98 -222
$$ packed form
7509d5j48P2K53k21J34p2J63k76J79J56r9j74l0n2K29j78K22k45J31k95O3K98
7531F5J55k48n3q3K93O0o00L91M7l7j41j35K76j30r3Q2J68k67N61m90K47j81L80
7554B67l43J08n9J7J0j79L0J90M3j20j2p5J68n8M6j14K44j68k33K76m8P0K84l22
7578B2j26J35R2l83K37K86j19k48j67Q8J73k64M16k46J83k13l0J48N3Q9l43K82
7600F5k43M0L3o3N5J6J22K07l67M86k83l4k46J06J10m1J61l85L26j42L54j45k30
7623i8K09j98K03j27r2L24k80K38j13r9k68O10m35J88N4k66L80l60K74r9p9Qj95
7646b21J9L2J65j03J90k25K99l33J05L7J29m5R0k44J04Ok05Q2J39P5j51l0J28
7669D3OJ70L7j87N6r4j11K63p2k44L52j41N8k43J78k77K53J10k56RJ76j84j24
$$ plain form
7692 -222 -25 -61 93 -329 -216 43 -22 -119 -53 61 -124 150 5 31 -143 -165 -94 -40 162 -17 131 -200 -25
7715 -25 -144 184 -182 -30 -36 97 23 173 -333 -5 -192 -17 -113 -175 -62 73 -275 -99 -9 189 -242 -211 -37
7738 -37 133 129 112 37 42 0 51 -251 -92 -248 -43 -30 54 166 -59 89 -67 90 72 166 237 26 -101 -164 -246
7763 -246 153 188 134 -90 205 14 -48 395 102 -171 -77 -91 -62 -51 1 -3 -113 -59 -22 237 227 -87 -87 -69 -182
7788 -182 233 212 -16 8 -122 -260 100 108 70 -285 346 38 77 235 59 48 -55 91 -124 350 144 -40
7810 -40 -28 265 163 19 7 -149 87 169 -142 214 -111 -161 73 -3 138 -141 -226 -14 -70 124 -15 -89 42
7833 42 100 -80 -60 -46 -187 141 40 -286 117 -119 -162 -199 138 -57 -45 118 13 10 75 -120 -273 92 -108
7856 -108 116 -354 -258 -38 129 34 25 -216 43 -225 62 -113 187 -15 -54 -72 185 -82 -289 159 -26 112
$$ packed form
7692b22J97l6J54m22J13K59o5r7O6J14j85K74j45K6j74k2P1N4K02j79J48l31J75
7715b5j19L28l66J52oJ33p4J50n06L28j87J75r6o2J13J35l48J76R0J98m31L1J74
7738c7J70mj7p5Nm2N1l02J59j56K05J3Q4J12k25J48j56J57j8R4P1k11j27o3q2
7763b46L99L5n4k24K95j91o2M43k93k73R4j4K9J1N2mj10N4L7K59j0l14%J8j13
7788a82M15k1k28K4j30j38L60Ql8l55O31l08L9J58j76j1j03J46k15M74k06j84
7810d0J2K93j02j44j2j56K36Q2l11L56l25n0K34p6J41k79q5K12n6J94j39p4J31
7833D2N8j80K0J4j41L28j01l26M03k36m3l7L37j95J2J63j05lO5j95j53L65k00
7856a08K24m70R6K20J67r5rk41K59k68K87j75L00k02l9j8K57k67k07M48j85J38
$$ plain form
7878 112 25 308 -11 22 76 153 -15 94 -77 213 35 -185 -115 -43 21 -142 103 21 181 -117 156 -127 265
7901 265 85 -91 204 -6 -33 98 37 -31 208 -88 -145 -32 -141 -223 98 1 61 -14 -139 -34 17 -156 124
7924 124 262 -98 -176 32 91 -157 -286 -224 337 59 -125 51 93 -79 12 -135 141 -73 92 -39 24 13
7946 13 44 229 -4 90 -14 -96 -232 -127 -20 215 -198 75 201 -187 5 -107 -30 105 112 210 -107 -295 -197
7969 -197 105 15 -148 -141 47 116 21 86 296 -83 169 -80 151 372 -298 136 145 -269 135 78 89 87 -329 -105
7993 -105 40 114 81 80 193 123 86 -100 38 30 -450 -51 -13 -56 286 -29 210 184 416 181 -298 72 124 -272
8017 -272 56 -54 94 44 -10 185 67 -58 -128 118 -250 259 -42 -134 50 164 -245 286 37 88 -22 11
8039 11 -334 -202 36 -63 86 216 115 9 55 35 -141 -28 307 -85 291 -410 -165 -200 -278 124 -163 74
$$ packed form
7878A12q7K83l19L3N4P7j68J09j71K90j78k20P0P2O4j63K45q2J60k98K73k83L92
7901B65j80j76K95k10k7J31o1o8K39k96n7J13j09q2L21r7O0p5j25J05N1j73K80
7924A24J38l60p8K08N9k48j29O2N61k78j84J76M2j72R1j47K76k14J65j31O3j1
7946A3L1J85k33R4j04q2j36J05J07K35m13K73J26l88J92j12P7J35PR8l17j88R8
7969a97L02r0j63PJ88O9r5O5K10l79K52k49K31K21o70M34Rm14M04n7J1km16K24
7993a05J45P4l3jJ13p0l7j86J38qm80L99L8m3L42l15K39k6K32k35m79L70N2l96
8017b72L28j10J48n0n4J95j18j25p0K46l68N09l01r2J84J14m09N31k49N1j10L3
8039A1l45J32K38r9J49J30j01j06M6k0j76J13L35l92L76p01K45l5p8M02k87K37
$$ plain form
8061 74 -85 226 12 -56 279 171 122 78 22 116 59 59 19 188 252 -118 -35 124 -75 -137 -258 -178 -178 19 82 211
8087 211 -381 -55 -81 176 60 -239 -188 -307 0 -161 47 229 36 -103 27 -246 -63 59 -59 -36 -18
8108 -18 365 -139 -108 -46 89 113 -240 126 46 132 98 -179 -20 -226 -33 124 -109 -9 -314 -118 -110 -67 -92 -70
8132 -70 -34 -72 203 -102 251 -49 141 -182 135 -58 -6 103 -173 -190 -316 3 12 114 -7 93 243 -93
8154 -93 51 -78 9 -150 -19 -181 44 -91 15 -53 -220 89 -112 -268 -164 -59 -72 14 270 -83 50 39
8176 39 126 6 -57 -27 -160 242 -347 62 -303 -55 -11 -195 -6 92 -11
$$ packed form
8061G4j59L11k14o8L35j08m9m4n6R4n7%m0J69O4l70Q3J59j99o2j21Q0%J97O3J29
8087B11n92L26k6K57j16k99N1j19L07j61K08J82j93j39J30k73J83J22j18K3J8
8108a8L83n04L1O2J35K4l53L66q0Q6l4k77J59k06J93J57k33J00l05J96QM3k5K2
8132g0L6l8K75l05L53l00J90l23L17j93N2J09k76j7j26L19RJ02j21J00J50l36
8154i3J44j29Q7j59J31j62K25j35J06o8j67L09k01j56J04J05j3Q6K56l53J33j1
8176C9Q7j20o3L0j33M02n89M09l65K48M4j84J89R8j03
8191a1
$$ Imaginary data points
##PAGE= N=2
##DATA TABLE= (X++(I..I)), XYDATA
$$ plain form
0 0 0 0 0 0 0 0 0 0 3 -8 8 -8 8 -16 16 -17 24 -25 32 -40 44 -51 59 -68 81 -90 103 -117 133 -150 169 -189
32 -189 213 -238 265 -296 330 -366 406 -449 498 -550 608 -674 748 -830 922 -1027 1149 -1290
50 -1290 1457 -1657 1905 -2218 2631 -3194 4030 -5384 7959 -14651 69581 136042 -6885 -66579
64 -66579 -39665 22248 24985 20187 9308 -11246 -40144 -22903 16622 32971 8132 -12094 -15319
77 -15319 -4644 8611 20074 8585 -11790 -10791 13428 18835 -2086 -18981 -16328 -13566 -9392
90 -9392 3307 4595 -25770 -44926 -12931 29285 16099 -30069 -38815 -7188 9779 1549 -41
103 -41 7402 -995 -16139 -7714 13843 15820 -1685 -12812 -11370 -6037 -896 342 -6839 -10988 -926
118 -926 7232 -3861 -12608 4561 22576 8464 -12367 -499 23663 16122 -6960 -1982 17431
$$ packed form
0@%%%%%%%%Lj1J6j6J6k4L2l3M1m9N7p2Q4r5J10j27J49j71J93k20K50k83L19l58
32a89M02m51N03n61O26o96P72q55R47j048J158j282J422j578J752j949K176k439
50a290K747l114L562m123M849n825P224r414J3343k2610Q4232O6461j42927n9694
64f6579K6914O1913K737m798j0879k0554k8898J7241L9525J6349k4839k0226l225
77a5319J0675J3255J1463j1489k0375R99K4219N407k0921j6895K653K762M174
90i392J2699J288l0365j9156L1995M2216j3186m6168q746L1627J6967q230j590
103d1P443q397j5144Q425K1557J977j7505j1127J442N333N141J238p181m149J0062
118i26Q158j1093q747J7169J8015j4112k0831J1868K4162p541k3082M978J9413
$$ plain form
131 17431 10045 -11829 -7766 14405 16050 -1814 -9853 -6492 -5513 449 14428 14746 -8114 -20849
145 -20849 -3746 15885 10610 -3415 -5181 -1333 -226 1072 664 -7031 -10101 633 5641 -10227
159 -10227 -22038 -7384 7510 -6136 -21308 -7561 9703 -2816 -23573 -15660 6906 8573
171 8573 -5783 -12676 -12014 -11774 -3674 9798 4774 -16655 -22501 -4493 6459 -1032 -5711 -878
185 -878 -3033 -11608 -6225 6344 5142 -3393 -815 4644 -3269 -8979 5457 17300 3507 -12544
199 -12544 -2564 13495 6694 -6399 76 10587 5442 -2739 3208 8533 784 -2033 8970 12718
213 12718 -408 -6862 4499 13129 5345 -1555 559 2953 726 2873 5780 511 -4644 1137
227 1137 6365 -977 -6344 2608 9580 -623 -10884 -3317 7106 3464 -4632 -3748 -1427 -4103 -1970
$$ packed form
131A7431p386k1874M063K2171J645j7864q039L361R79N962J3979L18k2860j2735
145b0849J7103J9631n275j4025j766L848J107J298m08p695l070J0734N008j5868
159a0227j1811J4654J4894j3646j5172J3747J7264j2519k0757P913K2566J667
171H573j4356o893O62K40Q100J3472n024k1429n846J8008J0952p491m679M833
185h78k155q575N383J2569j202q535K578N459p913n710J4436J1843j3793j6051
199a2544R980J6059o801j3093O475J0511n145q181N947N325p749k817J1003L748
213A2718j3126o454J1361Q630p784o900K114K394k227K147K907n269n155N781
227A137N228p342n367Q952O972j0203j0261P567J0423l642q096Q84K321k676K133
$$ plain form
242 -1970 4425 727 -9900 -8474 4324 5104 -7082 -9263 1146 4062 -3928 -6035 -668 484
256 484 -1349 770 1872 -4828 -7008 2700 7895 -2091 -9129 772 8886 379 -7740 -92 8467
271 8467 3388 -4022 -996 3582 1853 2216 7349 3929 -4812 -2410 8657 9908 -1068 -4386 2757
286 2757 6673 2448 582 3111 2776 1077 3385 3901 -1231 -2117 5381 6839 -1946 -5683 2845 7757
302 7757 686 -4967 -445 3343 -85 -2076 564 -598 -4612 -879 5159 446 -8444 -5305 4424
317 4424 3212 -5842 -6088 1233 1163 -4061 -3524 -325 -1597 -2953 461 947 -5752 -7124 1676 6071
333 6071 -2994 -8692 -1720 4736 813 -4800 -1500 2454 272 -1957 88 368 -1472 249 4302
348 4302 2104 -4437 -2728 4934 5527 -1027 -2873 1262 3775 1548 393 1139 1144 2030 3826 2350 -1782
$$ packed form
242a970O395l698j0627J426J2798P80j2186k181J0409K916p990k107N367J152
256D84j833K119J102o700k180R708N195r986p038R901Q114q507q119P648Q559
271H467n079p410L026M578j729L63N133l420q741K402J1067J251j0976l318P143
286B757L916m225j866K529l35j699K308N16n132q86P498J458q785l737Q528M912
302G757p071n653M522L788l428j991K640j162m014L733O038m713q890L139R729
317D424j212r054k46P321p0n224N37L199j272j356L414M86o699j372Q800M395
333F071r065n698O972O456l923n613L300L954k182k229K045K80j840J721M053
348D302k198o541J709P662N93o554j846M135K513k227j155P46NQ86J796j476m132
$$ plain form
365 -1782 -911 4632 5371 -57 -3151 916 4489 2359 -25 28 376 -37 1548 2205 -874 -2957 1517
382 1517 3992 89 -4784 -1732 3917 1902 -3133 -2988 366 972 -551 -361 -565 -2658 -1565 1550
398 1550 1091 -3361 -4707 709 2649 -2122 -5087 -1751 1903 681 -2695 -2313 -875 -276 -46 282
414 282 -1432 -2433 159 2297 622 -2521 -1171 1898 2518 -345 -2160 -1018 1205 2149 1145 -1381
430 -1381 -1243 1257 3576 1677 -1119 -428 2156 2557 241 -65 944 1968 1673 1743 462 -271 352
447 352 2843 1974 -1990 -2410 1368 3220 160 -2471 -1499 1770 1699 -736 -1879 -959 321 467 735
464 735 -380 -1476 -802 1086 818 -1351 -2936 -898 1218 -144 -2968 -2626 322 1512 -1175 -2613
480 -2613 -1629 243 98 -893 -1212 -954 -485 -115 533 -398 -1738 -569 2010 727 -2329 -2752 1211 2784
$$ packed form
365a782Q71N543P39n428l094M067L573k130k384N3L48m13J585O57l079k083M474
382A517K475l903m873L052N649k015n035J45L354O06j523J90k04k093J093L115
398A550m59m452j346N416J940m771k965L336L654j222l376L82J438N99K30L28
414B82j714j001K592K138j675l143J350L069O20k863j815J142K223R44j004k526
430a381J38K500K319j899k796O91K584M01k316l06J009J024k95P0j281p33O23
447C52K491q69l964m20L778J852l060k631R72L269p1k435j143R20J280J46K68
464G35j115j096O74J888k68k169j585K038K116j362k824L42K948J190k687j438
480b613R84J872j45r91l19K58M69L70O48r31j340J169K579j283l056m23L963J573
$$ plain form
498 2784 -6 -2820 -1407 1063 1062 116 114 48 -223 875 2126 821 -663 -128 2010 1817 -497 -710
516 -710 1840 2822 448 -985 -417 932 1036 1101 143 -921 -201 1814 1481 -701 -1131 1240 1891 158
534 158 -1477 -286 392 969 1261 127 -1456 -1894 583 2599 -802 -2899 -915 1685 42 -2508
550 -2508 -550 1761 50 -2201 -733 430 -900 -916 1381 888 -2240 -2277 1879 2448 -2184 -3656 558
567 558 2577 -1073 -2467 140 829 -824 -799 1233 359 -1863 -416 2245 298 -2131 -423 2600
583 2600 654 -2166 -1027 1734 1331 -349 15 85 -1006 -691 1475 1345 -1277 -845 1855 1174 -1462
600 -1462 -884 2269 1515 -1395 -1057 1293 835 -921 769 2096 -1447 -3259 646 3419 -437 -3502
616 -3502 41 2323 -688 -2768 696 2161 -1249 -2626 1323 2200 -1585 -2022 2020 1945 -2918 -2386
$$ packed form
498B784k790k814J413K470jr46ko6k71J098J251j305j484N35K138j93k314k13
516g10K550R82k374j433N68J349J04O5r58j064P20K015l33k182m30K371O51j733
534A58j635J191O78N77K92j134j583m38K477K016l401k097J984K600j643k550
550b508J958K311j711k251J468J163j330j6K297m93l128l7M156N69m632j472M214
567E58K019l650j394K607O89j653K5K032q74k222J447K661j947k429J708L023
583B600j946k820J139K761m03j680L64P0j091L15K166j30k622M32K700o81k636
600a462N78L153p54k910L38K350m58j756J690J327l543j812L905K773l856l065
616c502L543K282l011k080L464J465l410j377L949Q77l785m37M042p5m863N32
$$ plain form
632 -2386 2774 2222 -3318 -3167 2101 2132 -1921 -1759 1214 88 -2527 -97 3011 -223 -3601 232
648 232 3876 780 -2852 -262 2623 233 -1674 941 2127 -927 -1752 1582 2427 -1117 -1187 1734
664 1734 866 -2700 -771 4010 1974 -2850 -1548 2849 2433 -401 628 1955 -724 -2391 2230 4341
680 4341 -531 -4017 532 3508 -811 -2763 1605 2799 -2200 -3214 1851 3119 -1655 -2275 2218
695 2218 2092 -2143 -1253 3286 1739 -3622 -2104 3777 2039 -3137 -2245 2596 969 -3148 -1022 2145
711 2145 -873 -3593 246 3150 -967 -3728 199 2888 -638 -2772 1464 2670 -1516 -2394 1822
726 1822 2115 -2006 -1802 2287 987 -3165 -1198 2898 706 -2937 -302 3559 610 -2973 185 3322
742 3322 274 -2369 1580 3603 -1316 -2613 2551 3764 -1863 -3291 2291 3578 -1941 -2634 2508
$$ packed form
632b386N160n52n540J51N268L1m053J62K973j126k615K430L108l234l378L833
648B32L644l096l632K590K885k390j907K615J186l054q25L334Q45l544p0K921
664A734q68l566J929M781k036m824J302M397m16k834J029J327k679j667M621K111
680D341m872l486M549K976m319j952M368J194m999j014N065J268m774o20M493
695B218j26m235Q90M539j547n361J518N881j738n176Q92M841j627m117K126L167
711B145l018k720L839K904m117k761L927K689l526k134M236J206m186q78M216
726A822K93m121K04M089j300m152J967M096k192l643K635L861k949l583L158L137
742C322l048k643L949K023m919j297N164J213n627j428N582J287n519o93N142
$$ plain form
757 2508 2596 -2394 -2042 3486 2291 -3284 -1231 4184 1773 -3757 -1200 4045 1355 -3719 -1043 3246
773 3246 406 -3860 -622 3194 -548 -3703 -107 2653 -1352 -3192 1234 2373 -2623 -3674 1934
788 1934 3211 -2039 -3321 1349 1110 -2676 -1220 2618 404 -3848 -1559 2665 600 -3170 -409
803 -409 2831 -998 -4215 313 3612 -596 -3535 438 2913 -1420 -2603 2310 3260 -2227 -3108 2380
819 2380 2780 -2198 -2084 3285 2649 -3412 -2102 3483 2294 -2543 -978 3971 1374 -3654 -599 4672
835 4672 1735 -3254 -309 3653 -305 -3034 425 4377 -303 -3631 429 3116 -838 -2475 1533
850 1533 2597 -2384 -2875 1936 2623 -2152 -2087 2054 964 -3076 -1237 2988 749 -3630 -916 2737
866 2737 -235 -3376 -49 2926 -1039 -4055 387 3206 -1181 -3180 948 2172 -2571 -2877 2047
$$ packed form
757B508Q8m990L52N528j195n575K053N415k411n530K557N245k690n074K676M289
773C246k840m266L238L816l742l155L596K760m005j840M426J139m996j051N608
788A934J277n250j282M670k39l786J456L838k214m252K289M224k065l770K761
803d09L240l829l217M528L299m208k939L973K475m333j183M913R50n487q81N488
819B380M00m978J14N369o36o061J310N585j189m837J565M949k597n028L055N271
835D672k937m989K945L962l958k729L459L952m680l328M060K687l954j637M008
850A533J064m981m91M811O87m775O5M141j090m040J839M225k239m379K714L653
866B737k972l141L327K975l965l016M442K819m387j999M128J224m743l06M924
$$ plain form
881 2047 2595 -2894 -3010 2284 2037 -2882 -2070 3326 1694 -3542 -1895 3169 1423 -3358 -783 3840
897 3840 774 -3695 -263 3879 588 -3139 15 3329 -364 -3089 1391 4042 -329 -2928 1153
912 1153 2949 -1123 -1929 2177 2755 -1746 -2251 2150 1999 -1829 -1168 2667 954 -2925 -931 2823
928 2823 1113 -2890 -449 2854 -445 -2945 416 2932 -782 -2881 664 2196 -1462 -2638 1264
943 1264 2306 -2319 -2834 1861 2082 -2667 -2176 2299 1368 -3145 -2275 2776 1201 -2866 -1096 2823
959 2823 667 -3112 -931 3219 441 -3261 -328 3157 -300 -3227 383 3390 -294 -2918 567
974 567 2589 -919 -2297 1747 2635 -1501 -2164 1505 2300 -1518 -1457 2333 1635 -2049 -809 2593 1539
991 1539 -1856 -475 2242 412 -1927 330 2399 -555 -2428 510 2524 -619 -1809 1501 2301
$$ packed form
881B047N48n489j16N294k47m919Q12N396j632n236J647N064j746m781K575M623
897C840l066m469L432M142l291l727L154L314l693k725M480K651m371k599M081
912A153J796m072q06M106N78m501n05M401j51l828O61L835j713l879J994L754
928B823j710m003K441L303l299k500L361K516l714k099L545J532l658j176L902
943A264J042m625n15M695K21m749M91M475r31m513Q70N051j575m067J770L919
959B823k156l779K181M150k778l702K933L485l457k927L610L007l684k624L485
974E67K022l508j378M044Q88m136o63L669P95l818O1L790o98l684J240L402j054
991A539l395J381K717j830k339K257K069k954j873K938K014l143j190L310Q00
$$ plain form
1006 2301 -1364 -2262 1673 1891 -1804 -1646 1544 1244 -2550 -1379 2235 1218 -2637 -1632 2024 264
1022 264 -2805 -568 2587 299 -3121 -475 2058 -40 -3011 31 2189 -912 -3116 791 2525
1037 2525 -1195 -2338 742 1970 -1397 -2451 1322 1778 -1672 -2305 1762 1614 -1869 -869 1826 1173
1053 1173 -1647 -559 1983 1029 -1329 -275 2185 395 -1311 461 2159 -188 -1831 445 1924
1068 1924 -540 -1341 1084 1439 -1101 -1438 1575 1589 -1366 -1067 1784 1150 -1494 -522 2432 628 -2107
1085 -2107 -804 1914 374 -2125 -335 2277 -265 -2511 -22 2169 -409 -2379 258 1677 -664
1100 -664 -2415 444 2004 -1069 -1929 521 1480 -1263 -1506 1012 1316 -1443 -1346 1034 803 -1111 -946
1117 -946 1248 297 -1519 -297 1130 313 -1253 -206 1138 125 -1189 661 1327 -256 -786 117
$$ packed form
1006B301l665q98L935K18l695J58L190l00l794J171L614j017l855J005L656j760
1022B64l069K237L155k288l420K646K533k098k971L042K158l101k204L907J734
1037B525l720j143L080J228l367j054L773M56l450o33M067j48l483J000K695o53
1053A173k820J088K542r54k358J054K460j790j706J772J698k347j643K276J479
1068A924k464q01K425L55k540l37L013J4k955K99K851o34k644R72K954j804k735
1085b107J303K718j540k499J790K612k542k246K489K191k578j970K637J419k341
1100f64j751K859J560l073q60K450R59k743k43K518L04k759R7K380k31j914J65
1117i46K194r51j816J222J427q17j566J047J344j013j314J850O66j583n30R03
$$ plain form
1133 117 1234 -601 -720 898 829 -792 -633 1614 712 -1265 -555 1176 262 -808 -69 1556 103
1150 103 -1549 -176 1805 125 -1346 63 1494 -683 -1340 706 1695 -423 -1318 157 1505 -809
1166 -809 -1409 909 971 -851 -1248 764 1059 -712 -1021 1084 762 -923 -1065 767 1010 -1243 -852 655
1184 655 170 -872 -349 367 -398 -876 -157 956 104 -590 59 746 -202 -409 514 293 -423 -571 523
1203 523 200 -619 37 362 228 -679 -28 1247 51 -903 9 924 305 -591 -38 952 -55 -595 339
1222 339 743 -55 -975 494 1030 -196 -775 208 674 -485 -528 322 768 -114 -478 391 664 -67 -200
1241 -200 436 164 -376 -326 375 433 -473 -683 -49 -26 -397 -44 165 156 69 -49 45 -138 -83 -88 -139 -151 96 -175
1265 -175 -49 -405 378 220 -434 -124 -209 -546 -594 -153 212 411 -456 -437 151 413 253 -143 188 196 -322 -275
$$ packed form
1133A17J117j835j19J618o9j621J59K247r02j977P10J731r14j070P39J625j453
1150A03j652J373J981j680j471J409J431k177o57K046R89k118q95J475J348k314
1166h09o00K318O2j822l97K012K95j771l09K105l22j685j42J832K43k253L91J507
1184F55m85j042N23P16p65m78P19J113q52o94O49O87r48k07R23k21p16j48J094
1203E23l23q19O56L25j34r07O51J275j196r54R12R15o19q96N53R90j007n40R34
1222C39M04p98r20J469N36j226n79R83M66j159m3Q50M46q82l64Q69K73p31j33
1241b00O36k72n40N0P01N8r06k10O34K3l71L53K09rq7j18R4j83N5nn1j2K47k71
1265a75J26l56P83j58o54L10q5l37m8M41L65J99q67J9N88K62j60l96L31Qn18M7
$$ plain form
1287 -275 252 443 233 -195 703 14 74 -91 199 385 56 37 -233 60 119 -220 143 294 113 -542 -257
1308 -257 572 203 134 -7 -27 363 -164 -66 503 -9 -486 -350 510 741 -641 -642 -188 413 -236 -479 337
1329 337 263 -295 -451 409 282 -428 -536 132 246 -623 -329 424 43 -676 -150 654 239 -620 -453 267
1349 267 44 -320 60 213 -439 -245 48 704 -51 -451 243 296 12 -350 246 215 -444 -395 357 -170 -499
1370 -499 -250 628 -75 -660 257 530 203 -850 263 562 -253 -831 197 880 -408 -739 289 584
1388 584 -1076 -674 1051 627 -481 -1012 795 929 -714 -432 896 796 -714 -415 766 576 -926
1405 -926 -326 947 133 -943 -341 896 -82 -1093 121 747 -265 -817 -189 558 -132 -958 274 560
1423 560 -636 -620 614 977 -551 -421 492 338 -667 -403 612 217 -950 -210 722 145 -945 502
$$ packed form
1287b75N27J91k10m28Q98o89O0j65K90J86l29j9k70K93N9l39L63J51j81o55K85
1308b57Q29l69o9j41k0L90n27R8N69n12m77J36Q60K31j382jM54O01o49k43Q16
1329C37p4n58j56Q60j27p10j08O68J14q69K94P53l81p19N26Q04m15q59J67P20
1349B67k23l64L80J53o52J94K93O56p55m00O94N3k84l62N96l1o59M9P52n27l29
1370d99K49Q78p03n85R17K73l27j053J113K99q15n78J028O83j288l31J028K95
1388E84j660M02J725m24j108n31J807J34j643K82J328j00j510K99J181j90j502
1405i26O00J273q14j076O02J237r78j011J214O26j012n52O28P47o90q26J232K86
1423E60j196J6J234L63j528J30R13j54j005K64J015l95j167P40R32n77j090J447
$$ plain form
1441 502 1080 -125 -1041 517 719 -333 -876 492 1038 -499 -1050 875 932 -684 -576 806 839 -1025
1459 -1025 -1017 1255 1034 -1013 -868 1136 766 -1530 -352 1357 381 -953 -357 1392 297 -1211 151
1476 151 1277 157 -1412 147 1088 -355 -1514 291 1155 -412 -1010 318 891 -990 -1114 919
1492 919 796 -1148 -532 824 338 -1307 -592 963 17 -1172 13 829 -31 -1293 306 1060 -571
1509 -571 -1442 825 1163 -646 -1147 814 1208 -796 -1343 929 1373 -902 -1032 1386 953 -1305 -686
1526 -686 1381 754 -1409 -557 1550 783 -1426 -292 1686 247 -1147 91 1713 160 -1439 365
1542 365 1432 -265 -1482 598 1269 -393 -1574 409 1369 -524 -988 1024 965 -1131 -910 844 942
1559 942 -1041 -606 1386 454 -1342 -418 1328 180 -1451 -102 1237 -14 -1382 326 1262 -704
$$ packed form
1441E02N78j205r16J558K02j052n43J368N46j537n51J925N7j616J08J382L3j864
1459a025QK272k21k047J45K004l70k296J178J709r76j334N96J749j095j508J362
1476A51J126j120j569J559R41j443j159J805Q64j567n98J328N73j881j24K033
1492I19j23j944O16J356m86j645P15J555r46j189J185Q16q60j262J599P54j631
1509e71q71K267L38j809n01J961L94k004n47K272M44k275j30K418m33k258O19
1526f86K067o27k163Q52K107p67k209J134J978j439j394J238J622j553j599J804
1542C65J067j697j217K080O71j662j181J983R60j893m64K012n9k096K21J754R8
1559I42j983M35J992r32j796R24J746j148j631J349J339j251j368J708R36j966
$$ plain form
1575 -704 -1218 584 956 -1033 -1488 846 1038 -1183 -1503 1047 928 -1594 -846 1514 763 -1389 -835
1592 -835 1450 607 -1519 -303 1490 341 -1791 -258 1879 55 -1452 54 1950 -55 -1444
1607 -1444 445 1742 -122 -1651 707 1510 -996 -1035 742 1259 -705 -1007 968 1022 -1142 -572 1303
1624 1303 713 -1302 -424 1229 505 -1613 128 1543 20 -1440 254 1498 -376 -1749 382 1238
1640 1238 -878 -1172 814 1328 -1196 -1476 956 1100 -1331 -1068 1478 745 -1559 -1211 1459 926 -1502
1657 -1502 -533 1520 157 -1611 -46 1673 319 -1874 -97 2017 -51 -1554 526 1646 -165
1672 -165 -1639 517 1666 -446 -1494 491 1410 -960 -1127 1183 1269 -653 -828 1313 821 -1175 -304
1689 -304 1363 1049 -1339 -545 1359 342 -1154 -3 1379 13 -1144 350 1728 -160 -1427 555
$$ packed form
1575g04n14J802L72j989m55K334J92k221l20K550j19k522P48K360p51k152N54
1592h35K285q43k126J216J793j149k132J533K137j824j507J506J896k005j389
1607a444J889J297j864j529K358Q03k506l9J777N17j964l02J975N4k164N70J875
1624A303n90k015Q78J653p24k118J741J415j523j460J694J244j874j373K131Q56
1640A238k116k94J986N14k524k80K432J44k431K63K546p33k304L48K670n33k428
1657a502R69K053j363j768J565J719j354k193J777K114k068j503K080J120j811
1672a65j474K156J149k112j048J985R19k370j67K310Q6j922j75K141m92j996Q71
1689c04J667l14k388P94J904j017j496J151J382j366j157J494J378j888j267J982
$$ plain form
1705 555 1341 -899 -1158 1038 1341 -1219 -1244 1192 1017 -1161 -940 1190 1152 -1888 -773 1343 88
1722 88 -1505 -453 1576 -27 -1734 -417 1693 -59 -1794 -9 1758 -313 -1595 370 1499
1737 1499 -527 -1693 598 1628 -660 -1097 930 1014 -1128 -996 914 986 -1398 -718 1260 854 -1226
1754 -1226 -632 1467 468 -1046 -405 1353 -20 -1219 91 1262 -223 -993 531 1280 -421 -888
1770 -888 874 1119 -801 -868 1061 965 -906 -896 1168 654 -1297 -621 1322 429 -1386 -497 1372 296
1788 296 -1920 -374 1232 160 -1572 50 1450 -336 -1725 260 1011 -436 -1311 419 1136 -828
1804 -828 -1233 611 996 -827 -1033 633 907 -1270 -1119 1090 399 -993 -453 1121 238 -1139 -353
1821 -353 770 292 -1067 53 978 -282 -1251 349 1069 -251 -875 505 1036 -642 -692 786 1023
$$ packed form
1705E55P86k240k59K196L03k560k5K436j75k178K21K130l8l040J115K116j255
1722H8j593J052K029j603j707J317K110j752j735J785J767k071j282J965J129
1737A499k026j166K291J030k288m37K027Q4k142J32J910P2k384O80J978m06k080
1754a226N94K099r99j514O41J758j373j199J310J171j485p70J524P49j701m67
1770h88J762K45j920o7J929r6j871J0K064n14j951O76J943q93j815Q89J869j076
1788B96k216J546J606j072j732J622J400j786j389J985P51j447q75J730P17j964
1804h28m05J844L85j823k06J666K74k177J51K209o91j392N40J574q83j377P86
1821c53J123m78j359J120R25j260r69J600P20j320o24J380N31j678n0J478K37
$$ plain form
1838 1023 -460 -555 961 671 -754 -275 1217 690 -957 -23 1413 292 -840 -199 891 115 -1088
1855 -1088 48 1506 -27 -1112 386 1179 -354 -1148 481 1302 -314 -1233 389 986 -648 -932
1871 -932 528 1118 -915 -998 466 439 -791 -768 774 629 -638 -420 984 101 -1090 -143 916 -125
1889 -125 -899 -267 633 -199 -831 234 831 -5 -785 261 418 -419 -665 450 496 -931 -745 752 241
1908 241 -543 -196 895 364 -849 9 798 116 -999 195 1314 -82 -931 135 1145 -123 -751
1925 -751 351 1062 -174 -880 699 873 -562 -444 807 883 -886 -759 404 592 -680 -633 826 379
1943 379 -838 -468 901 421 -777 -357 300 269 -1036 72 547 -116 -689 -226 774 -128 -655 -68
1961 -68 620 -564 -614 165 283 -425 -149 315 383 -763 -166 479 82 -387 -85 645 -10 -586 -262 834
$$ packed form
1838A023j483r5J516k90j425M79J492n27j647R34J436j121j132O41J090p76j203
1855a088J136J458j533j085J498P93j533p94J629Q21j616r19J622N97j634k84
1871i32J460N90k033q3J464k7j230K3J542j45j267K18J404q83j191R47J059j041
1889a25p74O32R00q32o32J065N97q36p80J046J57q37k46J115M6j427J86J497n11
1908B41p84L47J091n31j213Q58P89o82j115J194J119j396q49J066J010j268o28
1925g51J102P11j236p06J579J74j435J18J251P6j769J27J163J88j272M7J459m47
1943C79j217L70J369m80j198M20O57l1j305J108M75o63n73M63J000r02n27N87
1961f8O88j184n0P79J18p08K76M64O8j146N97O45l97m69L02P30o55n76L24J096
$$ plain form
1981 834 -50 -608 85 951 111 -559 56 696 -367 -487 347 577 -332 -373 271 556 -262 -239 533 719
2001 719 -389 -280 759 321 -320 -367 674 611 -604 -274 514 237 -385 -202 470 152 -281 -16 84
2020 84 178 -365 58 227 -145 -432 -101 41 -79 50 241 172 -268 -340 -60 97 -175 -30 317 42 -567
2041 -567 244 549 66 -294 112 266 -25 -331 -7 348 48 -318 535 522 -419 -45 330 284 -32 -137 56
2062 56 346 -273 27 472 159 59 -52 142 -9 -308 -49 215 -84 -135 6 254 9 -44 -191 336 83
2083 83 87 -151 93 -163 -14 15 397 -58 -214 21 132 -31 -3 7 -89 17 -30 -190 12 -284 -110 -78 -241
2106 -241 -8 17 38 -159 -116 -190 -127 17 -76 -71 15 -90 95 -72 120 -210 -61 60 71 -240 165 104 128 74
2130 74 -289 -27 239 136 27 62 -102 -110 30 -221 199 283 -64 92 506 136 -106 -43 222 172 99 -77 135
$$ packed form
1981H34q84n58O93Q66q40o70O15O40j063j20Q34K30r09m1O44K85q18K3P72J86
2001G19j108J09J039m38o41m7J041o3j215L30P88k77o22J83O72l18m33K65J00
2020H4R4n43M23J69l72k87L31J42j20J29J91o9m40p2K80J57k72J45L47k75o09
2041e67Q11L05m83l60M06J54k91l06L24L55l00l66Q53j3r41L74L75m6l16j05J93
2062E6K90o19L00M45l13j00j11J94j51k99K59K64k99n1J41K48k45n3j47N27k53
2083H3Mk38K44k56J49K9L82m55j56K35J11j63K8J0r6J06m7j60K02k96J74L2j63
2106b41K33K5K1j97M3p4O3J44r3NQ6j05J85j67J92l30J49J21J1l11M05o1K4n4
2130G4l63K62K66j03j09L5j64qJ40k51M20Q4l47J56M14l70k42O3K65n0p3j76K12
$$ plain form
2153 135 317 -192 -442 247 151 -104 136 169 182 -361 -169 313 -42 -439 -1 547 -84 -167 -206 368 -121 -241
2175 -241 365 177 37 -502 -14 -66 209 -443 168 421 -251 -201 -171 321 -397 -120 -144 302 -133 -428 239
2196 239 56 -101 -31 238 -30 -258 0 410 -15 -200 83 537 -219 -495 134 361 -43 -277 406 -41
2216 -41 -193 -40 432 754 -391 -251 469 704 -564 -211 486 332 -288 -187 389 436 -637 -323 441 89
2236 89 -634 -192 744 87 -677 -302 421 60 -421 -156 91 -119 -454 407 352 -402 -432 287 683 -310 -673
2257 -673 512 480 -424 -107 70 177 -611 -45 192 10 -548 -87 533 -443 -660 -122 402 48 -551 244
2277 244 398 -261 -197 16 368 -320 -157 689 392 -476 -483 750 527 -826 -517 612 435 -568 -77 867
2297 867 639 -560 -104 683 55 -751 45 930 -128 -671 -32 880 127 -831 58 810 -113 -520 357
$$ packed form
2153A35J82n09k50O89r6k55K40L3J3n43J92M82l55l97M38N48o31q3l9N74m89j20
2175b41O06j88j40n39M88n2K75o52O11K53o72N0L0M92p18K77k4M46m35k95O67
2196B39j83j57P0K69k68k28K58M10m25j85K83M54p56k76O29K27m04k34O83m47
2216d1j52J53M72L22j145J40P20K35j268L53O97j54o20J01N76M7j073L14P64l52
2236H9p23M42R36o57p64L75P23l61m81K65K47k10l35Q61n5p54l0P19L96r93l63
2257f73J185l2r04L17J77J07p88N66K37j82n58M61O20r76k17N38N24l54n99P95
2277B44J54o59O4K13L52o88J63Q46k97q68pJ233k23j353L09J129j77j003M91R44
2297H67k28j199M56P87o28q06P96Q85j058n43O39R12p53r58Q89P52r23m07Q77
$$ plain form
2316 357 394 -682 -365 678 373 -628 -644 367 540 -469 -417 117 326 -562 -242 377 -167 -280 341
2335 341 296 -256 -699 333 872 -432 -653 396 309 -75 -658 336 376 -515 -345 635 436 -795 -264 589
2355 589 245 -770 -360 771 277 -813 -464 686 -261 -719 102 929 -230 -904 245 672 -131 -848
2373 -848 591 900 -163 -1193 333 947 -292 -315 191 494 -338 -386 615 94 -410 -135 1005 347
2391 347 -1097 -220 676 151 -504 -265 710 76 -668 72 653 -384 -564 181 523 -674 -625 663 892
2410 892 -306 -547 410 771 -333 -329 273 266 -338 -384 786 143 -906 -165 1094 211 -1088 -432 684
2429 684 232 -454 -55 805 -417 -681 174 918 -368 -466 427 894 -484 -714 200 374 -295 -984 301
2448 301 470 -253 -431 420 155 -647 -302 489 267 -837 -72 1025 297 -974 -218 623 -184 -666 104
$$ packed form
2316C57L7j076L17J043l05j001j6J011J73j009N2N34K09q88L20O19n44j13O21
2335C41m5n52m43J032N39j304k21J049q7l84n83R94M0q91J70R80j99j231N31Q53
2355E89l44j015M10J131m94j090L49J150r47m58Q21Q27j159o74J149M27q03p17
2373h48J439L09j063j030J526O14j239k3N06L03q32m8J001n21n04K75J140o58
2391C47j444Q77Q96n25o55K39R75o34p44P40N81j037j80P45L42j197M9J288K29
2410H92j198k41R57L61j104MO02po04m6J170o43j049P41J259q83j299O56J116
2429F84m52o86L99Q60j222k64Q55P44j286r8Q93M67j378k30R14J74o69o89J285
2448C01J69p23j78Q51k65q02L45P91k22j104P65J097p28j271P56Q41q07m82P70
$$ plain form
2467 104 864 154 -396 490 496 -677 -443 666 769 -475 -596 561 290 -502 -439 721 247 -759 -239
2486 -239 505 -63 -863 -314 1020 -177 -1204 213 1034 -123 -802 -173 708 102 -672 76 1049 -549
2504 -549 -792 530 459 -441 -596 866 931 -743 -562 383 661 -224 -367 605 158 -648 290 730 187 -521
2524 -521 60 878 -52 -847 78 859 184 -1121 -86 634 201 -576 345 541 -701 -483 664 212 -752
2543 -752 -214 639 420 -852 -693 517 154 -743 -142 494 258 -745 485 770 -75 -728 150 874 128
2562 128 -1164 248 941 -198 -606 -7 520 -149 -861 291 729 -819 -488 764 547 -790 -303 415
2580 415 717 -1015 -769 665 501 -462 -237 158 420 -301 29 506 -251 -764 111 817 -41 -728 220
2599 220 804 -357 -516 96 349 -317 -487 660 278 -505 -147 627 186 -729 -230 553 190 -667 -102
$$ packed form
2467A04P60p10n50Q86Oj173K34J109J03j244j21J157k71p92O3J160m74j006N20
2486b39P44n68q00N49J334j197j027J417Q21j157o79O29Q81o06p74P48R73j598
2504e49k43J322p1r00j55J462O5j674J81R45K78q85j43R72m47q06R38M40n43p08
2524e21N81Q18r30p95R25P81o75j305J035P20m33p77R21J96j242K18J147m52r64
2543g52N38Q53k19j272J59J210l63q97O01O36k36j003J230K85q45o53Q78P24p46
2562A28j292J412O93j139m08N99N27o69p12J152M38j548L31J252k17j337M87P18
2580D15L02j732K46J434j64r63K25L95K62p21L30M77p57n13Q75P06q58o87R48
2599B20N84j161j59O12K53o66j70J147l82p83L58P74m41r15M99P83l63q57N65
$$ plain form
2618 -102 653 378 -719 241 587 -524 -571 352 672 -326 -720 492 762 -194 -633 350 442 -279 -446 155
2638 155 576 -582 -385 441 282 -769 -461 590 197 -787 -429 647 533 -614 -188 476 229 -273
2656 -273 3 568 -167 -271 190 471 -459 -542 649 476 -266 -365 102 173 -140 -69 430 33 -610 -110 349
2677 349 -129 -905 -84 571 113 -762 68 495 164 -307 145 364 219 -340 521 632 -625 -484 398 361
2697 361 -629 -703 215 661 -511 -439 175 130 180 -208 462 244 -470 -63 524 174 -450 -205 1009 -126
2717 -126 -457 -224 324 41 -538 123 465 43 -139 -194 167 -344 -411 318 -99 -609 -354 542 70 -16 -438
2738 -438 470 -58 -434 -49 263 93 -361 -106 311 -25 -310 196 738 -262 -433 -96 495 161 -350 -219
2758 -219 142 -150 -117 362 61 -451 -495 488 334 -386 -344 100 394 -454 -227 -49 120 -135 -18 538 -254
$$ packed form
2618a02P55k75j097R60L46j111m7R23L20r98l94J212K70r56m39R83R2p21j67O01
2638A55M21j158J97Q26j59j051L08J051l93r84L58J076j14j147M26O64k47n02
2656b73K76N65p35j04M61K81r30q3J191j73p42r9M67P1l13P1M99l97o43N00M59
2677C49m78p76Q21O55m58q75Q30M27l31m71M52K19j45n59Q61J11j257J41Q82l7
2697C61r90p4R18M46j172P2O14m5N0l88O70k18p14M07N87l50o24K45J214j135
2717a26l31K33N48k83n79O61L42m22j82n5L61n11o7P29m17n10K55Q96m72q6m22
2738d38R08n28l76L85L12j70m54K55M17l36k85N06N42j000j71L37N91l34n11J31
2758b19L61k92L3M79l01n12m4R83j54p20M2M44K94q48K27J78J69k55J17N56p92
$$ plain form
2779 -254 -606 25 361 -152 -314 -93 662 83 -289 -312 170 128 118 203 172 -350 -93 301 -120 115 66 357
2801 357 312 -541 -334 37 255 -221 -67 123 -153 185 -47 -4 -178 -310 211 27 -101 -353 92 330 370
2822 370 -363 -179 241 -57 -170 34 115 -187 65 279 -52 -4 -226 338 354 -298 -113 76 178 210 -88
2843 -88 -120 -149 -163 130 75 32 -58 122 37 -129 -237 -57 36 68 -284 -348 -8 -78 199 178 -84 217 -90 269
2867 269 107 -380 -198 195 23 1 -56 313 189 -133 63 147 -259 161 96 258 -181 -30 33 454 -259 4
2889 4 -34 335 -162 -101 265 -138 154 36 142 -211 -210 42 30 10 -271 -61 75 243 -300 -46 152 261 -141
2912 -141 113 -279 -249 88 262 -127 145 -145 200 200 -82 -34 395 -54 282 173 -15 -149 128 81 -28 6
2934 6 -214 -353 -81 -336 -15 -96 85 -34 192 -158 -226 -115 7 416 -75 -154 325 26 69 62 7 18 160
$$ packed form
2779b54l52O31L36n13j62K21P55n79l72k3M82m2j0Q5l1n22K57L94m21K35m9K91
2801C57m5q53K07L71K18m76J54J90k76L38k32M3j74j32N21j84j28k52M45K38M0
2822C70p33J84M20k98j13K04Q1l02K52K14l31M8k22N64J6o52J85J89J02L2k98
2843h8l2k9j4K93n5m3r0J80q5j66j08J80R3L2l52o4L40p0K77k1k62L01l07L59
2867B69j62m87J82L93j72k2n7L69j24l22J96Q4m06M20o5J62m39J51O3M21p13K63
2889Dl8L69m97O1L66m03K92j18J06l53JK52j2k0k81K10J36J68n43K54J98J09m02
2912a41K54l92L0L37J74l89K72k90L45%k82M8M29m49L36j09j88j34K77m7j09L4
2934Fk20j39K72k55L21q1J81j19K26l50o8J11J22M09m91p9M79k99M3pn5J1J42
$$ plain form
2957 160 228 -270 299 -40 281 -50 146 215 188 24 -135 97 -171 -55 152 237 -144 -181 -107 259 129 -85
2979 -85 -301 48 231 90 -227 179 285 -75 122 401 113 -187 -85 171 102 -361 -126 401 237 -136 8
3000 8 265 214 -428 60 232 90 -283 118 145 -65 -172 302 163 -145 -310 199 36 -197 -202 66 -150 201
3022 201 -148 -18 70 197 -170 126 142 -216 136 257 192 -303 -41 53 100 -79 -73 -47 255 -66 10 145 -137
3045 -137 -242 189 90 -299 103 3 306 -39 -82 -4 -22 -201 281 291 -177 -103 -53 521 151 -429 5 521
3067 521 -163 -209 70 210 -51 -285 -259 108 -67 -11 133 372 -225 -255 232 370 -405 -266 -53 203 -128
3088 -128 -137 -5 138 -48 -161 59 116 -266 202 492 190 -493 200 413 -66 -57 112 177 14 -46 -178 303
3110 303 -49 -137 196 299 -150 -156 240 131 -163 -174 207 148 -295 -387 236 175 -247 -195 275 2 -356 -324 446
$$ packed form
2957A60O8m98N69l39L21l31J96O9k7j64j59K32k68J16K07Q5l81l7P4L66j30k14
2979h5k16L49J83j41l17M06J06l60J97K79k88l00J02K56o9m63K35N27j64l73J44
3000HK57n1o42M88J72j42l73M01K7k10j07M74j39l08j65N09j63k33nK68k16L51
3022B01l49J30Q8J27l67K96J6l58L52J21o5m95K62R4M7j79OK6L02l21P6J35k82
3045a37j05M31r9l89M02j00L03l45m3P8j8j79M82J0m68P4N0N74l70n80M34N16
3067E21o84m6K79J40k61k34K6L67j75N6J44K39n97l0M87J38p75J39K13K56l31
3088a28rJ32J43j86j13K20N7l82M68K90l02o83O93K13m79RJ69O5j63o0j32M81
3110C03l52q8L33J03m49oL96j09k94j1L81n9m43r2O23o1m22N2M70k73l58L2P70
$$ plain form
3133 446 23 -453 223 377 -212 -415 -35 147 -180 11 159 -32 -172 -215 401 487 -476 -278 292 425 -308
3154 -308 -315 665 385 -97 -368 383 -229 -356 151 38 -143 -258 -144 168 -178 -153 -118 137 -124 -89 188 55
3176 55 -393 -344 352 48 -395 -428 251 -51 -352 -245 348 103 -84 -248 296 -114 -307 -261 163 -123 -178 -134
3198 -134 381 -75 -315 179 496 -236 -211 91 373 -124 -419 289 334 -132 -217 364 422 -367 -363 304 47 -20
3220 -20 -103 446 50 -116 -190 407 347 -176 -66 365 -191 -597 -153 400 -344 -369 203 477 -155 -186 394 88
3242 88 -426 -92 214 266 -414 -43 484 -25 -324 -169 359 277 -191 -228 254 15 -70 -257 260 -368 -347 108
3264 108 665 -114 -664 218 402 -128 -495 162 58 -522 -101 394 340 -353 -302 419 298 -351 -74 314 142
3285 142 -639 36 398 -214 -159 117 417 125 -25 293 221 39 -46 32 361 -225 -258 -2 238 -6 -128 70
$$ packed form
3133D46m23m76O76J54n89k03L80J82l27J91J48j91j40m3O16Q6r63J98N70J33p33
3154c08pR80k80m82k71P51o12j27N07j13j81j15J14L12l46K5L5K55k61L5K77j33
3176E5m48M9O96l04m43l3O79l02l01J07N93k45j87j64N44m10j93M6M24k86n5M4
3198a34N15m56k40M94L17p32K5L02K82m97k95P08M5m66q5N81N8p89MO67k57o7
3220b0q3N49l96j66p4N97o0n23J10M31n56m06M44N53p44k5N72K74o32l1N80l06
3242H8n14L34L06N2o80L71N27n09k99J55N28q2m68l7M82k39q5j87N17o28K1M55
3264A08N57p79n50Q82J84n30l67O57j04n80M21M95n4o93N1P21j21o49K77L88j72
3285A42p81O75L62o12N5K76L00k92j50L18p2j82q5P8L29n86l3K56K40k44j22J98
$$ plain form
3307 70 330 -263 -116 303 369 -497 -77 345 76 -425 -86 574 -460 -397 -100 546 24 -551 152 398 -281
3328 -281 -311 166 278 -510 -434 -51 532 -243 -462 169 275 -359 -232 -1 58 -209 -164 408 351 -310 -302 88
3350 88 29 -126 -70 103 64 6 -24 372 279 -510 185 168 -335 -113 23 360 31 -336 275 304 -138 133 82
3373 82 321 -294 -132 529 158 -301 -292 273 220 -520 -60 435 151 -417 168 352 -171 -512 -126 364 -271
3394 -271 -429 164 201 -133 -294 679 -5 -142 -135 150 93 -379 -289 137 157 -533 -122 191 262 -205 -364 235
3416 235 59 -396 -17 208 216 -403 94 275 142 -237 -133 292 -96 -279 17 318 -201 71 260 445 -169
3437 -169 -127 518 397 -60 -99 302 95 -301 4 232 -107 -195 -16 245 -1 -549 -109 419 -112 -168 147
3458 147 358 31 -494 224 88 -126 -421 -9 276 -202 -424 39 424 -217 -67 304 207 -305 -90 392
$$ packed form
3307G0K60n93J47M19O6q66M20M22k69n01L39O60j034O3K97O46n22n75P03K46o79
3328b81l0M77J12p88P6L83N83p75k19O31J06o34J27K31N9k67M5N72n7o61QL90
3350H8n9j55N6J73l9n8l0L96r3p89O95j7n03K22J36L37l29l67O11K9m42K71n1
3373H2K39o15J62O61l71m59RN65n3p40M60M95k84n68N85J84n23l41L86M90o35
3394b71j58N93L7l34j61R73o84j37PK85n7m72R0M26K0o90M11L13P1m67j59N99
3416B35j76m55L79K25Qo19M97J81j33l79J04M25l88j83K96L01n19K72J89J85o14
3437a69M2O45j21m57l9M01k07l96L05K28l39q8J79K61k46n48M40N28n31n6L15
3458A47K11l27n25P18j36k14k95M12K85m78k22M63L85o41J50L71r7n12K15M82
$$ plain form
3478 392 -27 -170 -285 206 179 -287 10 248 268 -149 79 388 -430 -372 -195 -102 -296 -247 305 439 -95 5
3500 5 28 -220 -221 -182 113 61 157 43 623 127 -134 21 59 79 -2 -5 201 -208 5 133 202 20 -403 254 359
3525 359 -228 -302 285 179 -81 -207 219 266 -48 -196 -8 156 -162 80 276 118 -387 -66 98 -8 -330
3546 -330 -130 286 2 42 66 159 -256 -278 253 134 -89 -270 -86 360 177 -62 197 181 -112 284 345 10
3568 10 -8 22 303 130 -128 110 173 -197 -363 110 168 -205 -160 31 -13 55 -462 209 364 -151 -96 -60 361
3591 361 66 -235 364 292 -208 -132 -97 -175 -120 217 -37 338 -207 -167 318 11 -117 435 400 270 -36 -257
3613 -257 468 195 -215 50 281 -115 -247 181 -65 -197 -84 -18 80 -231 -55 94 342 -142 -191 -61 5
3634 5 14 -41 20 -21 -113 116 23 110 52 278 70 -279 -166 -1 167 62 -281 101 14 -44 -84 137 257 -277 58
$$ packed form
3478C92m19j43j15M91k7m66K97K38K0m17K28L09q18N8J77R3j94M9N52J34n34J00
3500EK3k48jL9K95n2R6j14N80m96k61J55L8K0q1lK06m09K13J28O9j82m23O57J05
3525C59n87p4N87j06k60j26M26M7l14j48J88J64l18K42J96j58n05L21J64j06l22
3546c30K00M16k84M0K4R3m15k2N31j19k23j81J84M46j83k39K59j6k93L96O1l35
3568A0j8L0K81j73k58K38O3l70j66M73N8l73M5J91m4O8n17O71J55n15N5L6M21
3591C61k95l01N99p2n00P6L5p8N5L37k54L75n45M0M85l07j28N52l5j30l06k21
3613b57P25k73m10K65K31l96j32M28k46j32J13O6R8l11J76J49K48m84m9J30O6
3634ERn5O1m1r2K29r3Q7n8K26k08l49J13J65J68j05l43L82q7n8m0K21J20n34L35
$$ plain form
3659 58 44 -196 -194 -119 304 276 105 -329 -214 26 -279 60 77 -153 -72 19 159 46 -39 273 370 -11 -266 9
3683 9 0 295 51 126 106 49 30 -65 296 -198 158 58 75 167 -353 42 46 213 -424 94 -99 153 -324 126
3707 126 228 -141 -25 86 -60 -188 -64 -155 57 82 -4 -66 -425 80 -224 -46 -40 -112 22 193 -277 -5
3729 -5 10 -33 1 -261 160 -187 9 -39 125 82 29 -119 -15 -36 56 -62 50 -208 143 -201 -18 37 144 81
3753 81 119 -145 72 38 -124 66 -113 205 85 181 122 -77 89 -85 -64 -43 -39 22 -92 -128 180 3 -48 81
3777 81 -306 -30 297 164 10 -33 7 -134 -53 -145 15 4 221 -43 33 142 -417 -113 -149 14 -167 -242 -104
3800 -104 18 97 15 19 134 49 -5 247 0 118 5 14 21 95 40 -140 141 -91 208 -239 92 94 -239 -1 -107
3825 -107 117 -159 142 275 -57 -156 -288 189 -131 -184 74 192 283 -249 302 102 -38 -278 133 -191 200
$$ packed form
3659E8j4k40KP5M23k8j71m34J15K40l05L39J7k30Q1R1J40j13q5L12R7l81k55K75
3683IrK95k44P5k0n7j9r5L61m94L56j00J7R2n20L95MJ67o37N18j93K52m77M50
3707A26J02l69J16J11j46j28J24r1K12K5q6o2l59N05l04J78Op2J34J71m70K72
3729eJ5m3L4k62M21l47J96m8J64m3n3j48J04k1R2j18J12k58L51l44J83N5J07o3
3753H1L8k64K17l4j62J90j79L18j20R6n9j99J66j74K1K1MO1j14l6L08j77n1J29
3777H1l87K76L27j33j54m3M0j41Q1r2J60j1K17k64P6J09n59L04l6J63j81p5J38
3800a04J22P9q2MJ15q5n4K52k47J18j13RPP4n5j80K81k32K99m47L31Kl33K38j06
3825a07K24k76L01J33l32r9j32M77l20n3K58J18R1n32N51k00j40k40M11l24L91
$$ plain form
3846 200 -201 -115 132 -154 5 -204 -31 -105 -84 222 42 -88 -1 13 -35 -36 132 114 216 -184 75 98 -93
3869 -93 282 125 62 -29 39 237 395 -110 -52 -166 -46 81 82 79 0 13 -206 524 158 -8 -111 95 56 66
3893 66 122 174 -384 -181 222 49 -86 -95 -392 234 31 -136 -23 100 -241 -196 -144 24 93 -106 -168 -96 158
3916 158 -57 -69 134 -229 25 89 131 -88 -128 134 -103 153 155 1 -309 -236 300 1 4 -10 30 147 -357 -204
3940 -204 208 211 -38 -342 23 81 74 44 268 116 -145 170 23 60 -135 153 -37 108 -248 -140 133 110 -107
3963 -107 28 244 -54 -295 129 275 -138 -1 -50 65 1 -102 -17 192 -132 -77 193 92 -12 -171 105
3984 105 273 -132 -135 381 -108 -291 -233 253 -6 -375 82 257 120 115 141 30 176 -259 -326 140 10 -71 34
4007 34 -60 -224 -178 15 78 -262 142 235 46 -269 -189 102 46 -190 -214 92 320 -168 -82 396 175 -230 92
$$ packed form
3846B00m01Q6K47k86J59k09J73p4K1L06j80j30Q7J4m8jJ68j8J02m00K59K3j91
3869i3L75j57o3r1O8J98J58n05N8j14J20J27Jlp9J3k19P30l66j66j03K06l9J0
3893F6N6N2n58K03M03j73j35rk97O26k03j67J13J23l41M5N2J68O9j99o2P2K54
3916A58k15j2K03l63K54O4M2k19m0K62k37K56Kj54l10P3N36k99Lj4M0J17n04J53
3940b04M12Lk49l04L65N8pl0K24j52k61L15j47L7j95K88j90J45l56J08K73k3k17
3963a07J35K16k98k41M24J46m13J37m9J15o4j03Q5K09l24N5K70j01j04j59K76
3984A05J68m05lN16m89j83N8M86k59l69M57J75j37nK6j11J46m35o7M66j30q1J05
4007C4r4j64M6J93O3l40M04R3j89l15Q0K91n6k36k4L06K28m88Q6M78k21m05L22
$$ plain form
4030 92 217 -189 -81 1 223 -43 -88 232 353 -72 -19 103 216 103 -280 198 98 -402 -108 327 -13
4051 -13 -81 130 137 -255 -36 64 271 112 -286 -217 -61 153 66 -216 -235 -212 -495 16 362 -289 -190 320 -20
4074 -20 -269 51 -12 117 -29 -268 382 108 -233 -54 -1 -193 -136 93 186 -113 -8 -246 182 -208 -343 230
4096 230 145 -51 -39 -106 283 41 -457 94 -64 -378 -50 -149 153 30 -446 -85 -84 -106 129 140 27 -278 -11
4119 -11 397 259 -86 -4 218 210 -126 13 72 -305 -235 -229 3 292 -147 103 48 27 78 231 -73 -247 -75 124
4143 124 70 -35 -292 287 306 -227 68 290 -279 -267 15 13 -262 -219 -24 76 112 -266 -141 170 -76 -164 134
4166 134 29 112 -431 221 470 -180 -42 141 -77 6 -197 128 207 -32 236 -22 -25 24 60 -18 42 -218 36
4189 36 76 -200 -155 -51 297 -193 -184 317 -9 -101 -167 41 94 -14 21 -138 -125 -412 4 39 -126 -369 -36 48
$$ packed form
4030I2J25m06J08Q2K22k66m5L20J21m25N3J22J13j13l83M78j00n00K94M35l40
4051a3o8K11Pl92K19J00K07j59l98O9J56K14q7k82j9K3k83N11L46o51R9N10l40
4074b0k49L20o3J29j46k39O50k74l41J79N3j92N7K29R3k99J05k38M28l90j35N73
4096B30q5j96J2o7L89k42m98N51j58l14L28r9L02j23m76L61Jk2K35J1j13l05K67
4119a1M08j38l45Q2K22ql36J39N9l77P0OK32K89m39K50n5k1N1J53l04j74J72J99
4143A24n4j05k57N79J9n33K95K22n69J2K82kk75M3J95J00L6l78J25L11k46q8K98
4166A34j05Q3n43O52K49o50J38J83k18Q3k03L25P9k39K68k58lM9L6p8O0k60K54
4189C6M0k76M5J04L48m90RN01l26r2o6K08N3j08L5j59J3k87M16L5j65k43L33Q4
$$ plain form
4213 48 230 -359 -160 291 143 -33 -6 -41 195 -43 37 271 -65 -285 -117 29 50 -124 276 -221 16 -1
4235 -1 347 -58 -93 -57 -162 99 -302 -39 317 -118 -47 -84 297 -42 -130 -30 2 123 34 30 199 77 55 -54
4259 -54 286 84 -347 240 90 128 4 -72 109 -110 44 34 -142 -306 -23 327 -86 -337 -6 304 -75
4280 -75 -94 -41 107 -115 -272 2 -32 -113 -265 -252 -107 109 165 135 93 19 -380 -76 41 -3 -45 180 146 -272
4304 -272 -58 328 485 -49 -201 -36 54 -74 -97 317 97 -76 10 -145 -348 -156 123 200 -59 -127 -379 144
4326 144 -257 -162 -174 -37 -124 -381 128 -34 -209 63 16 -224 -389 180 274 164 87 -157 492 23 42 144
4348 144 232 1 -244 206 237 214 57 272 129 -159 -208 11 26 62 -423 -28 -14 40 -170 419 -138 -278 47
4371 47 132 147 -191 126 177 -397 -248 221 85 49 -349 10 20 99 -14 226 101 38 -4 89 -98 -136 17 -305
$$ packed form
4213D8J82n89J99M51j48j76K7l5K36k38Q0K34l36k20J68J46K1j74M00m97K37j7
4235aL48m05l5L6j05K61m01K63L56m35P1l7L81l39q8J00L2J21q9mJ69j22k2j09
4259e4L40k02m31N87j50L8j24p6J81k19J54j0j76j64K83L50m13k51L31L10l79
4280g5j9N3J48k22j57K74l4q1j52J3J45K16N6l0m2p4l99L04J17m4m2K25l4m18
4304b72K14L86J57n34j52J65R0j28k3M14k20j73Q6j55k03J92K79P7k59o8k52N23
4326A44m01R5j2J37q7k57N09j62j75K72m7k40j65N69R4j10p7k44O49m69J9J02
4348A44Q8k31k45M50L1k3j57K15j43k88m9K19J5L6m85L95J4N4k10N89n57j40L25
4371D7Q5J5l38L17N1n74J49M69j36l6l98L59J0P9j13K40j25o3m2R3j87l8J53l22
$$ plain form
4395 -305 140 -90 -367 -254 355 -45 138 -42 -256 -61 11 173 -176 -208 8 -69 -38 -435 -240 36 -97
4416 -97 -188 37 44 -98 -356 160 237 -28 -149 61 -7 0 -99 213 -224 -184 -59 9 31 -253 136 -78 214 -310
4440 -310 -150 -8 -52 -44 82 56 173 -235 -123 207 -63 -53 -123 413 158 231 337 -81 9 437 -142 -159 -93
4463 -93 -60 106 -65 -170 -218 -60 -24 -168 -63 -79 88 -93 78 -72 113 -170 169 -116 -297 -42 -73 165
4485 165 -219 365 177 99 33 109 -61 170 -14 -225 137 75 154 -69 -25 -162 -40 -7 366 -121 45 121 -67
4508 -67 16 -293 -7 8 -231 177 -134 49 54 -95 -122 -146 3 -124 78 4 -44 -282 -356 -71 -298 -269 -258 -67
4532 -67 83 44 -25 -76 305 -180 44 91 92 197 -108 -9 -137 -5 5 42 71 -25 -172 37 -192 -31 356 -74
4556 -74 46 -22 168 97 -62 -12 234 -287 257 -73 -41 192 -85 36 -47 -190 -382 -33 134 146 -218 -32
$$ packed form
4395c05M45k30k77J13O09m00J83j80k14J95P2J62l49l2K16p7L1l97J95K76j33
4416i7r1K25Pj42k58N16P7k65j21K10o8Pr9L12m37M0J25O8K2k84L89k14K92n24
4440c10J60J42m4QJ26k6J17m08J12L30k70J0p0N36k55P3J06m18R0M28n79j7O6
4463i3L3J66j71j05m8J58L6j44J05j6J67j81J71j50J85k83L39k85j81K55l1K38
4485A65l84N84j88p8o6P6j70K31j84k11L62o2P9k23M4j37J22L3L73m87J66P6j88
4508f7Q3l09K86J5k39M08l11J83Nj49k7k4J49j27K02p4m8k38p4K85k27K9J1J91
4532f7J50l9o9n1L81m85K24M7JJ05l05R9j28J32J0L7K9r6j47K09k29J61L87m30
4556g4J20o8J90p1j59N0K46n21N44l30L2K33k77J21q3j43j92L49J67J2l64J86
$$ plain form
4578 -32 -82 -130 208 -151 -82 -307 -228 158 2 -133 -161 384 172 -13 92 51 296 -43 -8 -31 -159 -100 85
4601 85 63 224 173 160 -6 249 102 -66 173 -35 -142 -77 42 65 118 191 47 -108 -78 -244 89 262 12
4624 12 -78 -118 21 107 -216 117 305 -147 6 44 -81 67 43 139 -149 -227 -2 121 59 69 175 -45 -111 -325
4648 -325 192 105 -71 156 -160 -24 -9 210 -155 10 14 -127 26 73 -304 -186 136 220 -110 100 135 -74
4670 -74 10 -218 99 -374 32 -21 127 110 -204 -100 -85 -8 25 148 -84 -88 -224 224 86 64 108 12 11 -309 -201
4695 -201 -79 172 -53 -31 24 258 92 175 117 83 -65 141 -70 -102 -92 19 73 -201 -100 136 -239 90 -159
4718 -159 -149 -106 -104 -238 -22 307 -90 16 128 -113 20 90 0 82 -309 -250 186 -28 -60 66 256 139 -261
4741 -261 143 23 -125 -112 -105 99 -328 -210 -171 106 132 -95 113 -90 -169 -266 -258 278 26 -56 70 68 -113 179
$$ packed form
4578c2n0m8L38l59O9k25P9L86j56j35k8N45k12j85J05m1K45l39L5k3j28N9J85
4601H5k2J61n1j3j66K55j47j68K39k08j07O5J19K3N3P3j44j55L0j66L33J73k50
4624A2r0m0J39Q6l23L33J88m52J53L8j25J48k4R6k88p8K25J23o2J0J06k20o6k14
4648c25N17q7j76K27l16J36J5K19l65J65Mj41J53M7l77J18L22Q4l30K10L5k09
4670g4Q4k28L17m73M06n3J48j7l14J04J5P7L3J23k32mj36M48j38k2M4r6jl20J08
4695b01J22K51k25K2N5K34j66Q3n8l4j48K06k11l2J0J11N4k74J01K36l75L29k49
4718a59J0M3Kj34K16L29l97J06J12k41J33P0r0Q2l91N9M36k14l2J26J90j17m00
4741b61M04j20j48J3PK04m27J18L9K77K6k27K08k03p9r7QN36k52q2J26kj81K92
$$ plain form
4765 179 204 -60 -68 220 239 272 -121 371 149 -124 -258 17 -3 -67 -23 153 156 -233 215 174 -25 -141 209 137
4789 137 256 -198 226 -52 -69 -464 147 337 -299 223 380 196 -144 -322 -91 -99 -37 -506 26 279 34
4810 34 -143 53 -107 -127 -15 215 67 -5 12 64 -30 -7 -166 14 112 -180 -59 315 286 -45 -97 33 13 -254
4834 -254 -41 112 -161 -42 42 207 -31 84 167 220 -28 -117 -155 148 -256 -327 34 136 68 -83 114 17 -184
4857 -184 124 363 138 -169 -40 50 288 -321 -23 113 53 -151 34 49 -277 -175 71 181 -105 297 -1
4878 -1 241 69 -91 -20 -124 -2 145 218 -2 -139 17 213 134 -271 -240 -41 -103 6 -155 198 -133 -275
4900 -275 72 102 -8 81 49 99 40 -138 -14 67 175 -227 139 131 -2 182 367 -217 -231 -50 254 -91 -243
4923 -243 -111 113 -112 -146 88 115 -148 -311 -299 116 124 -274 -167 123 -186 332 551 -87 -85 -88 -92 356 -71 269
$$ packed form
4765A79K5k64qK88J9L3l93M92k22k73j34K75k0o4M4J76Ll89M48m1j99j16L50p2
4789A37J19m54M24k78j7l95O11J90o36N22J57j84l40j78K31qO2m69N32K53k45
4810C4j77J96j60k0J12K30j48p2J7N2r4K3j59J80R8k92J21L74k9l31n2J30k0k67
4834b54K13J53k73J19Q4J65k38J15Q3N3k48q9l8L03m04p1L61J02o8j51J97r7k01
4857a84L08K39k25l07J29R0K38o09K98J36o0k04J85J5l26J02K46J10k86M02k98
4878aK42j72j60P1j04J22J47P3k20j37J56J96p9m05L1J99o2J09j61L53l31j42
4900b75L47L0j10Q9l2N0n9j78J24Q1J08m02L66qj33J84J85n84j4J81L04l45j52
4923b43J32K24k25l4K34K7k63j63J2M15Ql98J07K90l09N18K19o38KlmM48m27L40
$$ plain form
4947 269 -103 -81 135 -202 211 110 -192 -313 17 286 102 51 -75 -194 -90 13 -17 139 93 -133 69
4968 69 80 66 -244 126 -204 -66 155 -93 -318 110 39 -6 4 -129 74 -251 -220 -31 5 -11 -205 -70 64
4991 64 -102 -151 93 -10 -111 96 232 121 60 -155 299 30 -202 67 -176 -1 -60 119 -92 -6 191 -29
5013 -29 420 279 -149 -162 281 327 -5 84 27 -111 69 -27 -124 76 -134 93 296 -216 -42 240 309 24 -286
5036 -286 294 173 31 -37 29 69 -440 -150 347 -138 -33 43 -163 -31 66 172 204 147 -267 -169 -102 -102 -16 129
5060 129 230 274 -52 -46 237 -212 -239 135 54 102 -124 147 -107 58 59 211 213 -229 -264 173 205 57 -274 -22
5084 -22 5 20 135 -66 220 -136 -146 171 -5 75 154 -29 36 -69 -25 -350 -69 -290 -164 80 0 72 108 135
5108 135 -225 156 585 -217 162 -8 28 -153 -25 114 -15 175 -100 -104 27 -11 127 145 31 119 397 -96
$$ packed form
4947B69l72K2K16l37M13j01l02j21L30K69j84n1j26j19J04J03l0J56m6k26K02
4968F9J1j4l10L70l30J38K21k48k25M28p1m5J0j33K03l25L1J89L6j6j94J35J34
4991F4j66m9K44j03j01K07J36j11o1k15M54k69k32K69k43J75n9J79k11Q6J97k20
5013b9M49j41m28j3M43M6l32Q9n7j38J80r6r7K00k10K27K03n12J74K82O9k85l10
5036b86N80j21j42o8O6M0n09K90M97m85J05P6k06J32R7J06L2n7m14R8O7%Q6J45
5060A29J01M4l26OK83m49k7L74q1M8k26K71k54J65JJ52Km42l5M37L2j48l31K52
5084b2K7J5J15k01K86l56j0L17j76Q0P9j83O5j05M4l25K81k21J26K44q0P2L6K7
5108A35l60L81M29q02L79j70L6j81J28J39j29J90k75mJ31l8J38J8j14Q8K78m93
$$ plain form
5130 -96 185 63 -55 65 -5 -91 255 167 101 215 -183 229 132 -180 288 -56 217 -273 -47 28 145 27
5152 27 7 -4 92 -60 -97 -30 -156 -126 141 159 81 -23 20 -202 -177 227 105 71 -154 70 8 -81 -295 11 255
5177 255 108 -72 -210 52 61 46 133 128 263 -237 -62 116 118 -57 137 44 -41 -61 -11 210 -142 112 151 194 141
5202 141 -137 183 -187 -47 11 56 318 51 157 69 -118 54 -63 21 -183 -390 0 -61 -17 -130 22 50
5224 50 -130 41 -276 -54 -65 -3 -46 101 -79 116 195 -126 0 -207 -129 25 161 -139 0 -33 -75 8 -121
5247 -121 -271 -114 -283 -69 48 14 5 24 140 -163 -87 -178 55 203 -236 -35 -71 -15 256 -366 98 35 -31
5270 -31 165 -47 42 41 -69 157 -54 73 -322 -56 312 -8 -59 -83 84 164 27 197 89 -134 9 -32 -68
5293 -68 -104 42 -1 -156 224 -148 -66 -27 -49 -278 -43 208 200 -132 84 8 -223 72 139 -53 -59 148 -21 -30 101
$$ packed form
5130i6K81j22j18J20p0q6L46q8o6J14l98M12r7l12M68l44K73m90K26P5J17j18
5152B7k0j1R6j52l7O7j26L0K67J8p8j04M3k22K5M04j22l4k25K24o2q9k14L06K44
5177B55j47j80j38K62Rj5Q7nJ35n00J75J78Kj75J94r3q5k0N0K21l52K54L9M3n3
5202A41k78L20l70J40N8M5K62k67J06q8j87J72j17Q4k04k07L90o1M4j13J52K8
5224E0j80J71l17K22j1O2m3J47j80J95P9l21J26k07P8J54J36l00J39l3m2Q3j29
5247a21j50J57j69K14J17l4rJ9J16l03P6r1K33J48m39K01l6N6K71o22M64o3o6
5270c1J96k12Q9jj10K26k11J27l95K66L68l20n1k4J67Q0j37J70j08k23J43m1l6
5293f8l6J46m3j55L80l72Q2L9k2k29K35K51ql32K16p6k31K95O7j92oK07j69rJ31
$$ plain form
5318 101 68 -325 192 2 68 109 195 -181 173 -14 -262 291 -52 181 -148 91 -5 12 113 350 31 331
5340 331 -79 -61 218 270 131 51 224 431 -29 -20 146 -146 99 -107 22 51 16 -94 -243 3 66 283 -315
5363 -315 68 118 -272 360 80 -288 -137 149 -60 25 45 167 -232 -189 41 31 -124 -82 -137 -218 24 240 116
5386 116 -222 -15 -248 365 123 -177 265 77 -188 -94 51 -106 -112 268 -33 -19 -192 -164 137 -79 -110 -100
5408 -100 49 -26 266 -165 105 -53 78 -161 -137 214 -118 164 22 78 210 -85 250 -82 9 52 -226 -24
5430 -24 11 -97 -94 88 50 20 -8 265 262 -34 91 47 -34 -225 -84 -587 -238 294 31 -205 -12 -75 -289 84
5454 84 -67 -143 7 -4 28 29 -100 -56 -39 -312 229 209 64 100 -354 139 73 -16 168 -94 -48 -145 42 16 -439
5479 -439 47 7 65 329 80 163 78 -107 6 323 -161 194 93 33 146 -20 -81 176 30 -100 130 33
$$ packed form
5318A01l3l93N17j90O6M1Q6l76L54j87k48N53l43K33l29K39r6J7J01K37l19L00
5340C31m10J8K79N2j39q0J73K07m60RJ66k92K45k06J29K9l5j10j49K46O3K17n98
5363c15L83N0l90O32k80l68J51K86k09Q5K0J22l99M3K30j0j55M2n5q1K42K16j24
5386A16l38K07k33O13k42l00M42j88k65R4J45j57oL80l01J4j73K8L01k16l1J0
5408a00J49p5K92m31K70j58J31k39K4L51l32K82j42N6J32k95L35l32R1M3k78K02
5430b4L5j08LJ82l8l0k8K73lk96J25m4q1j91J41n03L49N32k63k36J93o3k14L73
5454H4j51p6J50j1L2Jj29M4J7k73N41k0j45L6m54M93o6q9J84k62M6r7J87k6m55
5479d39M86m0N8K64k49Q3q5j85J13L17m84L55j01o0J13j66o1K57j46j30K30r7
$$ plain form
5501 33 -163 24 -229 289 -73 192 -64 122 -34 -127 146 95 255 -1 32 41 -380 -168 243 -291 -166 -19
5523 -19 93 -352 -8 -107 -90 -97 214 114 -256 -4 198 114 -159 -301 -131 72 293 -132 45 111 -111 -202 93
5546 93 153 -45 94 41 6 58 -212 -241 37 -69 -61 75 65 -6 -285 -44 -143 -209 -219 -70 126 165 90 36 87 -214
5572 -214 -93 -10 65 -50 12 -48 113 361 70 -82 74 -66 188 88 -78 91 -19 169 -83 -101 -1 210
5594 210 -42 -13 -97 -140 -234 -48 124 139 107 118 -96 -24 17 -237 118 -81 -89 -8 -195 16 -298 38 -159 -167 65
5619 65 -111 118 151 -34 249 165 73 -141 3 26 140 -95 47 99 112 3 275 87 -14 -61 92 62 -159
5642 -159 43 -130 -32 -54 329 171 242 203 79 -4 -11 -111 -3 99 -162 -138 41 -214 -247 -193 -113 114 -123 -249
5666 -249 -40 123 358 163 -3 -46 79 98 16 81 -114 0 142 -17 -235 -135 -73 26 117 323 191 159 86
$$ packed form
5501C3j96J87k53N18l62K65k56J86j56r3K73n1J60k56L3Rm21K12M11n34J25J47
5523a9J12m45L44r9J7pL11j00l70K52K02q4k73j42J70K03K21m25J77O6k22r1K95
5546I3O0j98J39n3l5N2k70k9K78j06QJ36j0p1k79K41r9o6j0J49J96L9p5n4N1l01
5572b14J21Q3P5j15O2o0J61K48k91j52J56j40K54j00j66J69j10J88k52j8J00K11
5594B10k52K9q4m3r4J86J72J5l2J1k14P2M1k54L55j99qQ1j87K11l14L36j97qK32
5619F5j76K29L3j85K83q4r2k14J44K3J14k35J42N2J3j09K72j88j01m7J53l0k21
5642a59K02j73R8k2L83j58P1l9j24q3pj00J08J02k61K4J79k55l3N4Q0K27k37j26
5666b49K09J63K35j95j66m3J25J9q2O5j95J14J42j59k18J00O2R9R1K06j32l2p3
$$ plain form
5689 86 -148 -37 213 136 13 98 119 -160 3 -100 -137 106 213 61 45 -9 111 180 -128 -202 -64 -200 -13
$$ packed form
5689H6k34J11K50p7j23Q5K1k79J63j03l7K43J07j52j6n4J20O9l08p4J38j36J87
$$ [...]
8191h1
##END NTUPLES=NMR FID
##END=
