##TITLE=1H_Pr T-1
 CDCl3, 8 sc, 
 26.08.2021
##JCAMPDX= 6.0         $$ Bruker NMR JCAMP-DX V2.0
##DATA TYPE= NMR FID
##DATA CLASS= NTUPLES
##ORIGIN= UXNMR, Bruker Analytische Messtechnik GmbH
##OWNER= root
$$ XWIN-NMR		Version 3.5
$$ Thu Aug 26 12:15:36 2021 Russian Standard Time (UT+4h)  she@DPX200
##.OBSERVE FREQUENCY= 200.131506
##.OBSERVE NUCLEUS= ^1H
##.DELAY= (6, 6)
##.ACQUISITION MODE= SIMULTANEOUS
##.ACQUISITION SCHEME= undefined
##.AVERAGES= 8
##.DIGITISER RES= 18
##SPECTROMETER/DATA SYSTEM= spect
##.PULSE SEQUENCE= zg30
##.SOLVENT NAME= CDCl3
##.SHIFT REFERENCE= (INTERNAL, CDCl3, 0, 15.7039)
##AUDIT TRAIL= $$ (NUMBER, WHEN, WHO, WHERE, WHAT)
$$ ##TITLE= Audit trail, XWIN-NMR		Version 3.5
$$ ##JCAMPDX= 5.01
$$ ##ORIGIN= Bruker BioSpin GmbH
$$ ##OWNER= she
$$ F:/spectra/data/she/nmr/H-F/1/audita.txt
$$ ##AUDIT TRAIL=  $$ (NUMBER, WHEN, WHO, WHERE, WHAT)
(   1,<2021-08-26 12:14:36.75 +0400>,<she>,<DPX200>,
      <created by zg, POWCHK disabled, PULCHK disabled
       configuration hash MD5:
       00 E9 B6 7A A2 85 ED C7 34 08 36 98 17 FE 4E 26
       data hash MD5: 16K
       62 CC D7 D6 D1 EE C1 7F 7E 26 A6 3F BA AC 1A 9D>)
$$ ##END=
$$ 
$$ hash MD5
$$ B2 B6 67 2F 7D 36 73 9C 61 1B E2 E3 B7 5F 8B B2
##$RELAX= 
##$RELAX= 
##$RELAX= 
##$RELAX= 
##$RELAX= 
##$RELAX= 
$$ Bruker specific parameters
$$ --------------------------
##$DU= <F:/spectra>
##$EXPNO= 1
##$NAME= <H-F>
##$PROCNO= 1
##$TYPE= <nmr>
##$USER= <she>
##$AMP= (0..31)
100 100 100 100 100 100 100 100 100 100 100 100 100 100 100 100 100 100 
100 100 100 100 100 100 100 100 100 100 100 100 100 100 
##$AQSEQ= 0
##$AQ_mod= 1
##$AUNM= <au_zg>
##$AUTOPOS= <>
##$BF1= 200.13
##$BF2= 200.13
##$BF3= 200.13
##$BF4= 200.13
##$BF5= 200.13
##$BF6= 200.13
##$BF7= 200.13
##$BF8= 200.13
##$BYTORDA= 1
##$CFDGTYP= 0
##$CFRGTYP= 5
##$CHEMSTR= <none>
##$CNST= (0..31)
1 1 145 1 1 1 1 1 1 1 1 1 1 1 1 1 1 1 1 1 1 1 1 1 1 1 1 1 1 1 1 1 
##$CPDPRG= <>
##$CPDPRG1= <>
##$CPDPRG2= <>
##$CPDPRG3= <>
##$CPDPRG4= <mlev>
##$CPDPRG5= <mlev>
##$CPDPRG6= <mlev>
##$CPDPRG7= <mlev>
##$CPDPRG8= <mlev>
##$CPDPRGB= <>
##$CPDPRGT= <>
##$D= (0..31)
0 1.2 0 0 0 0 0 0 0 0.06 0 0.03 0 0 0 0 0.0002 0 0 0 0 0 0 0 0 0 0 0 0 
0 0 0 
##$DATE= 1629965676
##$DBL= (0..7)
120 120 120 120 120 120 120 120 
##$DBP= (0..7)
150 150 150 150 150 150 150 150 
##$DBP07= 0
##$DBPNAM0= <>
##$DBPNAM1= <>
##$DBPNAM2= <>
##$DBPNAM3= <>
##$DBPNAM4= <>
##$DBPNAM5= <>
##$DBPNAM6= <>
##$DBPNAM7= <>
##$DBPOAL= (0..7)
0.5 0.5 0.5 0.5 0.5 0.5 0.5 0.5 
##$DBPOFFS= (0..7)
0 0 0 0 0 0 0 0 
##$DE= 6
##$DECBNUC= <off>
##$DECIM= 32
##$DECNUC= <off>
##$DECSTAT= 4
##$DIGMOD= 1
##$DIGTYP= 9
##$DL= (0..7)
0 120 120 120 120 120 120 120 
##$DP= (0..7)
150 150 150 150 150 150 150 150 
##$DP07= 0
##$DPNAME0= <>
##$DPNAME1= <>
##$DPNAME2= <>
##$DPNAME3= <>
##$DPNAME4= <>
##$DPNAME5= <>
##$DPNAME6= <>
##$DPNAME7= <>
##$DPOAL= (0..7)
0.5 0.5 0.5 0.5 0.5 0.5 0.5 0.5 
##$DPOFFS= (0..7)
0 0 0 0 0 0 0 0 
##$DQDMODE= 0
##$DR= 18
##$DS= 0
##$DSLIST= <SSSSSSSSSSSSSSS>
$$ [...]
##$SUBNAM2= <"">
##$SUBNAM3= <"">
##$SUBNAM4= <"">
##$SUBNAM5= <"">
##$SUBNAM6= <"">
##$SUBNAM7= <"">
##$SUBNAM8= <"">
##$SUBNAM9= <"">
##$SW= 20.0188882624521
##$SWIBOX= (0..15)
0 0 2 0 0 0 0 0 0 0 0 0 0 0 0 0 
##$SW_h= 4006.41025641026
##$TD= 16384
##$TD0= 1
##$TE= 0
##$TE2= 300
##$TE3= 300
##$TEG= 300
##$TL= (0..7)
0 120 120 120 120 120 120 120 
##$TP= (0..7)
150 150 150 150 150 150 150 150 
##$TP07= 0
##$TPNAME0= <>
##$TPNAME1= <>
##$TPNAME2= <>
##$TPNAME3= <>
##$TPNAME4= <>
##$TPNAME5= <>
##$TPNAME6= <>
##$TPNAME7= <>
##$TPOAL= (0..7)
0.5 0.5 0.5 0.5 0.5 0.5 0.5 0.5 
##$TPOFFS= (0..7)
0 0 0 0 0 0 0 0 
##$TUNHIN= 0
##$TUNHOUT= 0
##$TUNXOUT= 0
##$USERA1= <user>
##$USERA2= <user>
##$USERA3= <user>
##$USERA4= <user>
##$USERA5= <user>
##$V9= 5
##$VALIST= <valist>
##$VCLIST= <CCCCCCCCCCCCCCC>
##$VD= 0
##$VDLIST= <DDDDDDDDDDDDDDD>
##$VPLIST= <PPPPPPPPPPPPPPP>
##$VTLIST= <TTTTTTTTTTTTTTT>
##$WBST= 1024
##$WBSW= 4
##$XGAIN= (0..3)
0 0 0 0 
##$XL= 0
##$YL= 0
##$YMAX_a= 312859
##$YMIN_a= -390748
##$ZGOPTNS= <>
##$ZL1= 120
##$ZL2= 120
##$ZL3= 120
##$ZL4= 120
##$ABSF1= 10
##$ABSF2= 0
##$ABSG= 5
##$ABSL= 3
##$ALPHA= 0
##$AQORDER= 0
##$ASSFAC= 0
##$ASSFACI= 0
##$ASSFACX= 0
##$ASSWID= 0
##$AUNMP= <proc_1d>
##$AZFE= 0.1
##$AZFW= 0.1
##$BCFW= 1
##$BC_mod= 2
##$BYTORDP= 1
##$COROFFS= 0
##$CY= 11.3945322036743
##$DATMOD= 1
##$DC= 2
##$DFILT= <>
##$DTYPP= 0
##$F1P= 2.36226072786647
##$F2P= -0.459571619588291
##$FCOR= 0.5
##$FTSIZE= 0
##$FT_mod= 4
##$GAMMA= 1
##$GB= 0.15
##$INTBC= 1
##$INTSCL= 1
##$ISEN= 128
##$LB= 0.24
##$LEV0= 0
##$LPBIN= 0
##$MAXI= 10000
##$MC2= 0
##$MEAN= 0
##$ME_mod= 0
##$MI= 1.114404
##$NCOEF= 0
##$NC_proc= 0
##$NLEV= 6
##$NOISF1= 3.799351
##$NOISF2= 2.8
##$NSP= 1
##$NTH_PI= 0
##$NZP= 0
##$OFFSET= 15.70392
##$PC= 1
##$PHC0= -13357.03
##$PHC1= 12.60099
##$PH_mod= 1
##$PKNL= yes
##$PPARMOD= 0
##$PSCAL= 0
##$PSIGN= 0
##$REVERSE= no
##$SF= 200.130013532006
##$SI= 16384
##$SIGF1= 3
##$SIGF2= 2
##$SINO= 400
##$SIOLD= 16384
##$SREGLST= <1H.CDCl3>
##$SSB= 0
##$STSI= 0
##$STSR= 0
##$SW_p= 3612.71676300578
##$SYMM= 0
##$S_DEV= 0
##$TDeff= 0
##$TDoff= 0
##$TI= <>
##$TILT= no
##$TM1= 0
##$TM2= 0
##$TOPLEV= 0
##$USERP1= <user>
##$USERP2= <user>
##$USERP3= <user>
##$USERP4= <user>
##$USERP5= <user>
##$WDW= 1
##$XDIM= 8192
##$YMAX_p= 0
##$YMIN_p= 0
$$ End of Bruker specific parameters
$$ ---------------------------------
##NTUPLES= NMR FID
##VAR_NAME=  TIME,          FID/REAL,        FID/IMAG
##SYMBOL=    X,             R,               I
##VAR_TYPE=  INDEPENDENT,   DEPENDENT,       DEPENDENT
##VAR_FORM=  AFFN,          ASDF,            ASDF
##VAR_DIM=   8192,          8192,            8192
##UNITS=     SECONDS,       ARBITRARY UNITS, ARBITRARY UNITS
##FACTOR=    0.0002496,     1,               1
##FIRST=     0,             0,               0
##LAST=      2.0444736,     0,               0
##MIN=       0,             -390748,         0
##MAX=       2.0444736,     312859,          0
$$ Real data points
##PAGE= N=1
##DATA TABLE= (X++(R..R)), XYDATA
0 0 0 0 0 0 0 0 0 0 0 0 -8 8 -8 8 -16 16 -17 24 -32 35 -40 49 -64 72 -85 97 -114 134 -152 176 -201 232 -262
33 -262 297 -335 377 -423 475 -532 591 -661 735 -816 904 -1000 1102 -1219 1343 -1480 1631
50 1631 -1795 1979 -2181 2404 -2658 2941 -3261 3631 -4060 4564 -5165 5898 -6820 8015 -9627
65 -9627 11941 -15557 22016 -37083 149470 -103442 -378567 144072 266113 -96709 -190048
76 -190048 122591 110376 -103093 -84223 80901 69072 -495 -65711 -78667 35376 152991
87 152991 -2444 -177578 -29201 161296 17936 -121058 11162 84239 -56241 -69973
97 -69973 64770 56748 -51577 -40035 -312 -7093 36634 50365 -65634 -91180 54421 87055
109 87055 -45926 -62955 30663 10753 -40302 18910 38641 -32667 -33431 13943 -4897 -1128
121 -1128 48829 -8745 -93499 2560 104814 -3578 -87991 16367 49569 -45656 -11413 79134
133 79134 -15321 -96210 36375 88168 -53882 -51082 84827 14271 -113760 19019 142598
144 142598 -27335 -138085 34201 116871 -30624 -69746 43150 37536 -46453 -9344 50120
155 50120 8453 -24397 -4219 -5541 9001 46151 1428 -63386 -3002 69219 1653 -52012
167 -52012 21137 37480 -45369 -22578 66060 18381 -67594 -12231 54359 -778 -32475 19280
179 19280 12258 -37084 -5945 39562 4081 -30450 -8445 4635 817 14649 2530 -32255
191 -32255 -9422 27471 -3628 -24334 17681 11956 -44096 -13218 54397 5433 -60119 -1297
203 -1297 44726 -19293 -33697 36247 17992 -58049 -15747 61374 8477 -56436 -3977 37458
215 37458 -8118 -22688 16800 11463 -20708 -7371 11897 4051 6587 2859 -25528 -9788 41056
228 41056 19361 -43171 -17498 43912 12075 -36578 4562 37102 -11223 -31016 16606 29739
240 29739 -5864 -13814 -137 -20 13245 21952 -14215 -28212 20204 33424 -19199 -24347 28449
253 28449 20556 -32248 -13389 37964 16277 -30420 -16542 19500 18379 -2851 -14245 -9534 10716
266 10716 16696 -11531 -18752 17330 16692 -28433 -18806 35101 18366 -41533 -20837 36168 13238
279 13238 -31535 -7987 20515 -5126 -19679 7650 13972 -12024 -14292 2627 4924 931 -2522
292 -2522 -9356 -6240 6931 3303 -9961 -1199 7246 -10490 -12207 16065 12542 -22118 -14701 20242
306 20242 10044 -20165 -3954 18861 -4289 -19473 8901 19730 -7503 -16596 4709 12820
318 12820 1034 -3827 -2451 401 6603 2864 -5352 2476 11122 -3852 -13082 10079 21130 -7295
332 -7295 -19685 9920 20521 -4975 -11798 8019 10097 -6344 -3909 9516 5951 -3708 -4204 -39
346 -39 6815 8630 -4263 -11639 3706 14832 -2407 -13257 5561 11252 -8880 -9900 10929 9820
360 9820 -12083 -11425 8520 8886 -6144 -7847 -99 2997 -430 -4013 -2811 1972 -183 -7497 -4361
375 -4361 7862 3525 -13638 -8238 10909 5106 -12487 -6489 8895 628 -11915 -816 9557
388 9557 -2425 -11660 -1662 8017 1827 -7354 -4746 2984 3663 -1547 -4509 1679 4309 -3490 -5182
403 -5182 5091 7488 -4821 -8309 5434 9305 -3617 -5120 5495 4781 -4472 -1167 8331 3524
417 3524 -6669 -1071 8907 5314 -3796 -3019 5425 6092 -2601 -3404 6274 7149 -4574 -7074 8079
432 8079 12300 -5715 -12025 6355 14775 -3078 -13192 3567 13887 -2721 -12664 2949 13077
445 13077 -948 -13468 -1389 12728 4288 -11534 -7883 8181 8492 -6936 -10715 4148 9084
458 9084 -4974 -11726 1891 10661 -3701 -13696 -415 10602 -49 -12397 -4057 8076 1205
471 1205 -8671 -2838 4776 -957 -6765 -815 4729 -1802 -5882 391 3283 -2553 -3735 2400 2396 -4758
487 -4758 -3669 5149 4544 -5043 -5581 3988 7108 -1467 -6992 -334 8044 3941 -7117 -5406 10222
502 10222 9291 -9922 -10773 12532 17132 -10168 -18193 12118 22857 -8147 -21367 8763 24219
515 24219 -5206 -21103 6215 21965 -2163 -18141 1522 17896 3414 -13173 -4964 10335
527 10335 9077 -4159 -9595 1668 11802 1940 -11949 -3993 12774 6238 -13531 -7632 13036
540 13036 8950 -12677 -10437 9993 8753 -8901 -8475 5517 4363 -5583 -4117 2231 -187 -3327
554 -3327 508 50 -4895 -536 4452 -2683 -8988 747 8440 -3649 -11572 2126 8772 -3830 -8962
569 -8962 2597 4887 -4258 -3632 3734 -860 -4437 3601 3052 -7437 -2637 10685 1979 -14001 -796
584 -796 16536 687 -16742 806 17138 -353 -14068 2283 13625 -1311 -8493 2992 6732
597 6732 -2 -764 1349 -778 1390 6960 134 -8395 2393 12783 -135 -11948 1550 14595
611 14595 710 -12649 708 13564 1994 -10422 -2370 9989 4733 -6738 -4919 4041 6193
624 6193 -389 -6561 -2337 6027 5228 -5661 -8653 4917 10391 -5198 -13766 3653 14614 -4738
638 -4738 -17418 2773 16208 -4470 -17470 2985 14080 -5297 -13993 3709 9425 -6437 -8251
651 -8251 4738 3268 -5991 -2352 3703 -1889 -4374 2735 1975 -5447 -2090 4497 -483 -4155 840
666 840 2132 -2562 -628 3481 -1596 -3972 4336 4243 -5984 -3532 8014 4735 -8543 -3780 10230
681 10230 5517 -8385 -4930 8900 7244 -6112 -6180 6135 8624 -2484 -7252 2477 10317 940
695 940 -8538 -935 9701 4413 -7310 -4570 7966 7660 -4808 -7521 4392 9974 -1866 -10216
709 -10216 1362 12090 568 -12218 -1435 12981 2433 -12731 -2805 11882 2247 -10912
721 -10912 -2376 8830 1161 -8467 -1460 5556 216 -4706 -1820 1636 291 -1808 -1832 -1078 518
736 518 -363 -2684 -1313 1031 -952 -2799 -118 1460 -2107 -2925 1241 980 -3545 -1604 2765 18
752 18 -4297 -793 3631 -166 -3804 -68 3077 4 -2585 -306 2248 1295 -1479 -929 1821 2231
768 2231 -748 -2068 1903 3484 -722 -2352 1734 3381 17 -1607 1465 2952 236 -838 1267
783 1267 1990 1345 -477 -240 1635 2133 -87 -1484 1626 3272 -825 -2223 1986 3279 -1135 -2753
799 -2753 2250 3218 -1885 -2412 1708 2404 -1245 -2324 574 2102 -1053 -2436 -47 1782 188 -2970
815 -2970 -1073 2153 163 -3462 -1442 2230 497 -3550 -2030 2384 -466 -3801 -1061 2010 -438
830 -438 -3262 -832 1991 -789 -3049 -377 888 -699 -2204 -527 1509 -138 -2762 -523 2050
845 2050 618 -2572 -1254 2705 652 -2820 -832 2814 973 -2579 -976 3138 1464 -2159 -853
860 -853 2677 1493 -1233 -1026 2217 2273 -404 -1067 974 2607 543 -1672 942 3157 294 -1847
876 -1847 467 3104 1100 -1494 515 2475 853 -1083 -118 1711 854 -877 -181 954 937 -163
892 -163 -971 286 1297 -206 -1439 26 1489 -272 -2237 -63 1137 -886 -1960 263 857 -911
908 -911 -1768 -193 255 -979 -1388 -738 -223 -665 -1326 -989 -389 -179 -1042 -1222 -142 -91 -1465 -960 699
927 699 -441 -1713 -728 1237 -658 -1995 586 1550 -1112 -1659 979 1156 -1025 -1501 1037 1530 -454
944 -454 -1116 379 1889 636 -1208 -229 2508 1589 -1400 -836 2450 2254 -1621 -1121 2705 2197 -1471
961 -1471 -1093 2583 1844 -809 -546 1566 1280 733 -480 -128 1246 1486 -366 -855 1235 2037 -887
978 -887 -1046 1346 1400 -1250 -621 1040 486 -1338 329 795 -684 -899 687 -207 -1433 -346 972
995 972 -120 -1636 -196 222 -363 -819 -1214 -603 743 -171 -2384 -1357 1624 354 -3457 -1265 2681
1012 2681 -200 -3559 -644 2347 -206 -2669 -476 683 -412 -598 -777 -1276 618 1549 -1386 -2486
1028 -2486 1434 2747 -2044 -2638 3018 2393 -2484 -1377 3203 1128 -2095 235 2068 -556 -886 2023
1044 2023 791 -1597 777 3052 -124 -1847 1469 2880 -728 -1152 1403 1971 430 -558 30 1336
1060 1336 2033 -311 -1744 612 2828 -184 -2479 452 2953 515 -2177 -749 2211 1411 -1473
1075 -1473 -2266 829 3606 -281 -4647 -195 5032 -409 -6313 -286 5926 -964 -6562 619 5240
1090 5240 -2048 -5139 1539 2663 -2320 -2164 1491 -260 -1754 983 -63 -3105 -102 3032 -1944
1105 -1944 -4098 2456 3215 -3865 -3173 3922 1317 -4609 -563 3869 -747 -3705 1997 2430 -2877 -1718
1121 -1718 3269 1219 -3174 -166 3261 413 -2285 356 2487 463 -1069 -337 1670 1625 -455 -1480
1137 -1480 719 2889 276 -1857 880 2869 288 -1200 371 1589 1077 177 -983 -61 2645 1629
1153 1629 -2995 -1699 4694 1928 -5225 -1194 5955 1056 -5639 -148 5674 -891 -4834 1749 3280
1168 3280 -2582 -2385 2756 159 -2909 842 1676 -3168 -1347 3281 -242 -4438 517 3563 -2819
1183 -2819 -3688 2617 1952 -3910 -1374 2626 -642 -3268 869 1567 -2603 -1420 2173 49 -2940 337
1199 337 2016 -1531 -1811 947 797 -1329 -526 629 -320 -268 515 -785 -270 1125 249 -1306 612
1216 612 1718 -786 -1273 1960 1137 -1257 540 2089 -444 -969 2275 1186 -1748 316 2744 -846
1232 -846 -1734 2311 1946 -2235 -310 3142 245 -2263 1609 2469 -2120 -796 3077 262 -2957 1086
1248 1086 2907 -1811 -2080 2650 1752 -2903 -373 2564 -458 -2027 910 1222 -2079 -398 1358 -1122
1264 -1122 -1793 1400 402 -2777 -402 2123 -1509 -2721 1211 1358 -2493 -1953 1994 -9 -2592 -405
1280 -405 1352 -1401 -1239 675 -26 -1140 337 296 -1663 -155 1341 -916 -2082 1702 1079 -2179
1296 -2179 -815 2541 85 -2392 558 2533 -964 -1837 1829 1233 -1280 -56 1465 -135 -422 1056
1312 1056 215 -673 1372 1767 -1208 -451 2611 558 -2050 652 2902 -772 -1669 1950 1770 -1782
1328 -1782 -170 2278 9 -1440 1301 1241 -1187 -43 1724 -197 -1410 1411 1032 -1389 -257 1894
1344 1894 -694 -1672 913 1508 -1919 -798 2245 -86 -2010 255 1783 -1225 -1810 1171 386 -1482
1360 -1482 -410 808 -843 -765 641 -580 -1574 165 637 -1659 -1146 1179 -243 -2482 231 1513
1376 1513 -1162 -1993 936 1155 -1665 -775 1468 -145 -1097 553 631 -936 0 774 -289 -737 1291
1393 1291 543 -1236 233 1450 -286 -993 1628 1524 -1445 -65 2084 34 -1230 947 1566 -564
1409 -564 -493 1657 848 -781 328 1270 -209 0 1039 138 -405 998 865 -852 -244 1803 123
1426 123 -1570 584 1901 -981 -1153 1571 1054 -1367 -605 1505 -147 -804 385 478 -772 -229 267
1443 267 -801 -1016 346 89 -1426 -177 941 -882 -1691 740 594 -1440 -875 974 46 -1480 -297
1460 -297 682 -744 -804 168 130 -657 20 97 -576 27 251 -337 -407 799 359 -1117 -345 1220 74 -1111
1480 -1111 244 1161 -513 -892 1332 710 -613 -137 537 76 -305 718 524 -119 548 690 -307 -230
1498 -230 1141 459 -655 675 1025 -454 -427 1110 724 -648 58 1400 382 -835 -27 1202 78
1515 78 -467 268 725 134 -169 222 309 47 118 -301 -245 596 202 -691 -122 521 -21 -895 -148 448 -199
1536 -199 -647 117 -125 -270 -316 -292 -247 -190 -120 -611 -444 161 -32 -824 -296 339 -322 -811 -11 416 -572 -627
1558 -627 225 394 -588 -207 496 -107 -667 128 764 106 -373 -106 413 -97 -321 381 652 -29 -273 188
1578 188 245 246 526 387 168 503 369 90 -38 586 425 -228 48 627 697 -508 -395 805 840 -247 -411
1599 -411 578 686 -330 -137 651 526 -549 -33 561 58 -282 -230 263 -417 -437 212 -95 -351 -50 259
1619 259 -2 -658 -274 303 -262 -745 -387 105 -401 -362 0 -56 -829 -564 -64 -318 -729 79 -129 -741 -540
1640 -540 425 12 -1092 -389 531 -341 -1170 -127 859 -671 -1119 241 677 -733 -714 660 218 -539
1658 -539 -398 1001 160 -392 334 445 -395 -40 657 408 -635 372 775 55 -215 729 738 -57 -59 792
1678 792 506 -119 250 978 399 -352 317 590 100 -558 503 611 -488 -163 685 452 -303 -432 604
1697 604 360 -650 -162 680 67 -587 -127 194 -147 -380 57 355 -380 -153 238 -555 -286 182 195 -731
1717 -731 -422 460 -427 -932 -300 520 -257 -1114 -279 428 -813 -1071 265 219 -891 -951 567 -18 -859
1736 -859 -79 352 -111 -443 108 -32 -268 -82 126 -139 -339 282 356 -56 -71 492 96 -226 110 948 86
1757 86 -449 608 378 28 -115 480 581 133 -154 558 500 -32 61 483 479 -99 74 590 437 -275 -125
1778 -125 306 -26 -307 -7 530 394 -357 90 84 -88 -57 299 -124 -107 -80 94 -362 -252 527 -217 -645 -222
1800 -222 433 -400 -715 182 168 -906 -530 531 -50 -601 -389 302 -331 -539 -95 255 -322 -399 30 -85
1820 -85 -129 112 -231 -374 -39 94 -251 -281 180 36 -233 -71 250 -222 -360 217 416 -87 167 128 -36
1841 -36 -82 180 97 182 79 34 142 206 507 -101 -437 393 559 130 -182 635 164 -250 55 735 363 -50
1863 -50 248 412 -152 -268 288 510 -148 39 320 56 201 229 52 -274 105 356 -200 -245 422 425 -400 -198
1885 -198 301 -164 -714 92 444 -182 -365 139 -44 -567 -637 -108 -471 -247 -272 -259 -147 -96 -434 -397 -104 -183
1907 -183 -391 -140 -269 -39 -239 -41 191 -136 -485 -37 156 -435 -213 210 -22 44 20 -114 -45 141 239
1928 239 -254 -131 263 392 135 149 453 219 -206 162 528 13 -331 398 413 85 -38 652 339 63 282
1949 282 280 218 88 -49 390 14 -10 425 48 89 220 -23 78 250 239 -53 -301 65 -192 149 -73 79
1971 79 183 -172 18 24 -99 66 -125 -64 -232 -41 -40 -308 -106 -198 -364 -277 57 -206 -594 -102 1 -369 -288
1994 -288 -344 -45 -392 -638 -4 13 -374 -89 -19 -122 -324 -244 -142 -80 -21 4 -34 -117 -49 69 -156 -52 65
2017 65 181 -379 24 336 -50 -105 128 245 285 -201 17 417 66 184 333 370 -2 -222 15 343 -60
2038 -60 146 129 387 135 -93 303 373 -225 -266 156 339 106 -60 325 216 151 -38 168 -38 -124 322 209
2060 209 -188 109 14 -104 -349 104 81 -291 -254 141 -139 -674 93 246 -279 -628 136 35 -362 -173 44
2081 44 -93 -416 -120 174 278 -249 -129 203 -22 -389 -247 8 138 -184 -202 73 -25 -307 117 -88 189
2102 189 274 -175 44 -103 73 -74 85 -312 297 224 -355 52 534 78 -188 447 661 -69 -11 223 232 -297
2124 -297 153 511 110 -198 191 100 195 -18 -7 405 -48 12 195 192 119 79 161 -48 -11 209 48 29 -114 185
2148 185 36 -230 245 59 59 -502 -27 -64 55 -328 -305 -89 -193 9 165 269 -342 -185 89 175 -423 30
2170 30 128 -82 -455 -237 -31 -439 -240 -60 -230 -289 -375 -292 -121 -389 -171 70 14 -316 120 236 -25 -147
2192 -147 -109 39 -224 -39 230 -46 -133 99 340 -90 -285 283 465 -161 -148 322 280 23 323 202 153 -177
2214 -177 -3 407 331 -255 156 424 -219 132 78 180 -65 267 173 207 -50 288 58 5 33 274 55 -411
2236 -411 109 431 -170 -106 276 -37 -265 -386 169 -116 -83 -32 207 -128 -420 -145 -79 -26 -466 28 -24 -193
2258 -193 -475 -423 106 -275 -158 2 -274 -305 -249 6 -78 -373 -103 65 -308 -79 113 -9 -63 -270 247 -97
2280 -97 -280 -52 285 122 -221 -104 286 -374 3 368 421 -89 72 172 -224 -285 251 376 -286 -40 338
2301 338 207 -194 157 275 43 195 174 171 289 333 230 -25 252 53 -96 89 191 -92 -120 265 396 110
2323 110 -239 12 36 8 -128 -85 -67 -132 555 -95 -409 -67 162 -175 -230 114 18 -222 -83 169 -174 -426
2345 -426 204 178 -560 -248 371 -218 -527 -260 65 -387 -154 193 -49 -293 226 36 -360 -271 97 -126 -150
2366 -150 28 312 -188 -106 373 0 -43 30 369 -138 -142 365 -42 -146 2 261 -23 -164 80 196 -18 -34
2388 -34 159 73 -18 316 176 -86 183 371 -14 -160 484 87 -154 224 604 -131 -42 512 143 -169 -64
2409 -64 435 -427 -109 468 417 -261 -74 -12 -246 -494 280 306 -268 -245 401 -85 -504 76 334 -252 -376 225
2431 225 202 -519 -104 203 -219 -287 -224 100 -586 -221 161 -189 -272 58 205 -378 -68 130 -140 -261 155
2452 155 46 -261 -43 -64 -178 -146 3 -49 -184 85 119 -205 -201 168 101 -39 -142 303 -186 -301 147 183 -205
2475 -205 -125 329 212 -352 432 520 -118 102 140 316 -340 353 545 24 131 380 222 -8 110 47 -9 -174
2497 -174 95 190 -311 145 272 -79 72 20 -69 -90 67 162 -202 -422 118 81 -130 -214 99 -171 -148 76 -18
2520 -18 -381 106 201 -274 -72 -12 109 -452 -16 281 -334 -144 27 46 -220 -176 318 -347 -374 -47 122 -315
2542 -315 -128 316 -159 57 165 395 -134 -250 194 246 -160 41 184 -217 137 342 -245 -273 -58 15 166
2563 166 -200 275 172 -68 210 364 5 54 276 194 -151 129 494 -176 -43 -42 108 -152 141 153 53 74
2585 74 111 -1 -32 113 182 -124 30 21 75 -240 65 186 -114 -227 9 275 184 -151 185 62 -446 -123 -19
2608 -19 -259 -339 259 71 -197 168 132 -287 -277 183 -238 -517 -251 96 -186 -331 316 -112 -12 65 218 -213
2630 -213 49 18 89 -167 -51 -58 14 -79 -83 142 96 144 -154 178 -53 516 36 102 157 222 -119 -37 484 -90 -111
2655 -111 332 195 10 -39 328 354 111 151 540 111 -141 226 293 -112 185 359 -72 -107 390 -1 -21 105
2677 105 233 -125 -161 59 283 -69 -409 101 -53 -281 -73 185 -30 -66 12 28 -198 -194 79 -144 -45 132
2699 132 -163 -136 -11 136 -144 29 -175 118 -49 -160 -74 7 -1 5 -84 -268 238 10 -78 6 -109 -192 -509 48
2723 48 213 -80 62 283 199 99 161 109 -274 -162 116 180 -127 -61 201 -56 -290 141 124 -270 -74 19 150
2746 150 -31 133 159 425 151 241 141 -8 294 188 -15 -113 248 190 -92 -92 242 168 244 -83 144 -36 92
2769 92 -43 261 -90 -58 9 -68 17 226 61 -38 7 -107 -82 183 -101 -215 23 -155 56 10 -85 53 -62
2792 -62 -355 2 -183 -74 184 -146 -335 85 -185 -183 -148 -112 -231 62 -111 165 -149 -166 -133 27 -242 -83
2814 -83 -311 14 -75 -146 137 -93 7 -57 -62 -34 175 37 43 -66 32 -158 101 -75 -40 -278 246 187 228 32
2838 32 39 186 1 53 75 -97 49 50 119 91 27 157 170 208 -66 -75 74 189 162 -104 -188 -48 -168 -137 345 371
2864 371 -342 195 88 -185 -94 213 68 -162 -209 46 262 -105 147 -336 -130 168 125 59 -230 -140 104 -86
2886 -86 -111 -68 -138 -231 -56 -106 -158 -368 -320 27 -212 3 155 97 -50 30 -156 9 -163 309 -3 -81 -224 -40
2910 -40 -200 21 342 54 40 -157 92 164 48 -46 -243 119 -7 -203 77 6 -108 -288 91 292 213 -49
2932 -49 -137 70 269 -35 181 -248 -83 179 234 -62 -30 86 92 -28 16 77 42 -434 -123 255 -73 -201 99
2955 99 -10 -215 68 312 -62 -51 -66 124 -249 -169 -23 -209 -421 176 55 104 -112 -49 -259 -251 -90 61 -287
2978 -287 -30 -57 16 -211 -75 197 -105 -29 -36 19 -31 60 -233 94 -87 29 -156 214 317 64 -65 175 -160
3001 -160 -2 -141 145 189 3 116 21 -265 -216 380 185 21 -2 277 126 200 -53 196 35 -16 27 5 208
3024 208 -22 203 218 -542 216 77 -217 -107 -157 -229 154 -148 218 -61 -157 273 169 -60 178 -106 149
3045 149 111 -57 12 -143 64 116 -263 -234 68 -109 57 -212 -14 -180 -64 -64 -149 -273 -30 -75 15 -194 23
3068 23 13 -167 61 -173 -195 -104 156 -596 29 92 41 -333 -15 124 -51 -279 32 38 -242 5 39 104 -61
3091 -61 -67 57 26 -326 -61 304 -121 55 94 58 -39 74 183 194 190 -96 160 -45 -218 59 294 -208 -39
3114 -39 268 167 -205 -77 167 -125 -147 141 61 -161 296 144 85 55 17 221 18 -4 -153 13 185 -134
3136 -134 -138 -109 -64 5 6 -233 -43 30 113 -24 -11 107 -28 100 -239 132 -88 -293 -76 -94 67 -277 -254 347
3160 347 -89 -91 279 225 -89 -332 330 110 -265 39 103 21 39 113 130 143 -107 61 23 -280 80 34 5 -66
3184 -66 116 62 -83 -82 -36 -101 -214 65 -111 82 98 100 118 154 -119 204 -94 73 27 -111 232 207 80 132 136
3209 136 106 -97 308 122 -86 -97 316 93 -77 149 39 120 -261 -149 -119 10 109 -139 47 153 107 16
3231 16 -298 76 32 158 -272 34 219 -94 -366 11 116 -96 -245 -180 35 -336 -339 -89 -1 340 167 -73
3253 -73 -268 -87 -58 -43 -260 14 167 -16 -111 -19 76 60 -89 -276 24 0 230 33 26 -25 72 39 198 37
3277 37 242 -139 94 -76 99 79 -1 -67 -225 37 -265 173 1 -134 90 485 -21 69 -184 251 101 84
3299 84 359 213 -40 -186 215 298 -201 -15 138 78 -105 240 213 -109 -197 77 -191 -54 92 -1 209 -137
3321 -137 131 -124 159 -227 94 197 -142 -98 411 196 -88 -2 355 -69 95 -82 -26 69 -83 107 39 -344
3343 -344 5 14 63 -22 -73 84 -77 33 -52 -147 -224 -71 187 60 -18 36 -21 -17 -79 -65 85 -135 28 161 -100
3368 -100 -20 -194 142 -71 72 24 88 -237 133 -231 53 91 241 3 261 297 -113 18 -221 -5 11 58
3390 58 -115 109 73 -67 139 -37 -167 39 -172 6 148 8 73 -225 -290 4 102 49 143 -47 -112 -105 -16 -315
3414 -315 -154 -148 151 -208 64 -58 -276 -7 124 -36 -116 176 -10 -342 -21 -5 -75 -72 16 -270 -208 5 -99
3437 -99 -93 -149 199 140 -148 -227 186 38 -273 -171 -77 -331 33 -63 214 4 154 -167 7 -123 -191 -30 -92
3460 -92 -35 9 -178 94 -33 -81 74 2 166 -43 43 29 41 60 -36 182 -54 -94 285 -136 156 48 2 -46
3484 -46 -286 -95 -239 175 136 -73 -249 -413 -45 -36 107 -444 139 195 -89 -23 -144 -76 -168 36 -117 213 -37
3507 -37 123 -45 -36 -16 -61 35 -144 -10 -82 -130 70 -231 -274 -263 134 -67 -92 -41 148 -30 -46 174 180 -166 30
3532 30 -4 -38 238 5 -19 -33 46 -1 -23 -26 -123 -130 -56 59 -47 25 193 84 62 -73 52 -142 -349 20 -52 94
3558 94 144 122 -56 -268 57 59 26 98 389 108 43 -163 106 177 168 -65 59 193 -152 134 -50 -16 -96 259
3582 259 -24 -209 34 279 91 187 -189 -103 -50 177 122 -128 -201 230 43 -129 -120 -7 149 -81 -149 118 -26
3605 -26 -24 -235 -175 218 128 86 17 128 -168 106 78 342 154 77 299 -22 67 -90 3 85 260 47 -143 46
3629 46 161 157 121 177 61 37 32 -70 143 -141 40 174 -43 268 -124 125 3 -233 -101 -149 268 230 -114
3652 -114 393 -61 116 12 66 -2 98 -55 -322 -222 79 149 -143 140 9 61 46 -79 80 330 -24 -148
3674 -148 13 -74 -47 -175 -348 122 -199 149 -128 -17 14 -216 -15 189 108 -51 93 -41 4 214 144 -222
3696 -222 -256 -66 208 -119 -4 -181 132 -357 -201 175 -214 -201 -162 105 76 -7 26 -116 -23 169 172 61 -16
3719 -16 -63 -22 55 -60 40 57 100 234 -83 141 -14 98 -19 -147 73 -192 -133 -3 33 -2 -16 95 -22
3742 -22 4 166 -22 -2 119 177 -192 51 138 -73 154 59 247 -39 136 54 -194 -145 -223 100 222 11 39
3765 39 -260 -8 -4 78 -261 78 39 -61 324 -227 -34 41 -263 143 171 -275 -263 -114 -40 29 166 15 -61 -242
3789 -242 422 -7 5 -27 185 195 58 136 170 -317 -47 31 -36 53 -52 146 -261 -97 -37 163 233 -3 112
3812 112 303 -150 55 -128 91 163 -123 87 -188 -69 -168 22 184 -46 -28 181 228 -105 111 179 183 27
3834 27 -282 -145 12 177 186 242 13 -121 331 17 153 23 -152 -186 -117 224 174 -7 -63 -33 -139 -40 -58 36
3858 36 -122 -163 209 19 196 -111 -54 246 -126 56 -249 91 83 -39 108 -49 104 -166 -229 -80 -21 -68 -31
3881 -31 -9 344 -51 -296 31 102 -207 51 -180 42 -117 -28 -44 99 298 53 3 -77 70 62 177 69 -29
3904 -29 -216 176 14 73 62 43 -30 28 41 -78 22 -105 -187 255 37 231 -140 -3 126 35 56 -79 -161 210
3928 210 -109 -87 -123 -88 148 131 103 54 193 -200 217 -41 2 13 -147 25 -109 60 110 -16 -181 122 76
3951 76 63 250 146 -33 145 121 94 33 -87 -82 75 111 124 -169 26 -101 -29 -7 -154 69 -95 71 -47 -33
3975 -33 -54 98 286 -122 190 129 -206 10 2 -60 -153 239 -173 -118 95 187 58 152 -20 -136 0 291 -148
3998 -148 -190 -128 -172 144 -95 -25 73 66 204 236 94 94 -159 -19 -20 32 -54 104 205 358 -27 134 184 -9 -101
4023 -101 -35 -24 -67 188 57 62 94 -52 -175 144 -5 -108 121 48 -145 75 -114 -167 140 168 -28 -319 -19
4046 -19 51 -7 -27 348 -265 -159 211 -26 -31 -164 23 -72 -49 53 117 -75 177 -131 170 61 -253 186 -12
4069 -12 79 -73 90 -13 155 190 56 15 146 -16 -230 -72 69 -6 2 -161 -222 47 139 -195 39 93 26 169
4093 169 -44 81 -23 -28 23 -21 11 -6 -131 140 15 311 217 67 91 -55 41 114 113 -261 185 -111 -89 -201
4117 -201 -148 260 274 77 75 103 137 -19 -91 -69 -239 148 -118 86 -106 -114 -66 46 -185 -35 156 -251 187 179
4141 179 202 -18 -243 240 -18 -26 -133 111 -124 -130 -45 154 124 89 -535 -85 16 -221 51 165 10 236 -25
4164 -25 83 -29 12 -22 -243 -119 -35 218 79 -85 329 -230 93 254 -23 94 -214 5 142 59 20 -18
4186 -18 -25 -26 9 -101 324 -28 33 -76 87 -241 -107 319 228 -109 -231 154 -130 -121 -19 161 -11 -15 -40 2 -116
4211 -116 134 -4 -80 -3 127 -263 -144 330 19 47 -142 -38 -79 2 148 49 -5 -50 -55 1 -167 297 91 194
4235 194 143 253 170 22 -179 -127 -343 -269 -172 30 -100 26 170 66 90 89 352 -211 4 -321 -310 120 132
4258 132 -51 -283 212 -195 -104 -161 -159 -133 -107 -136 65 -221 -173 40 -184 132 132 276 206 -23 -2 -336 -262 33
4282 33 -56 -28 -45 9 149 -237 -10 -104 192 -47 19 -169 -124 170 -89 85 12 175 -90 132 -29 -66 317
4305 317 29 -44 205 99 189 -12 -204 -63 10 71 2 -48 79 90 -10 55 -4 -8 -45 9 -71 -53 147 143 52 70
4331 70 104 -25 137 131 161 100 312 -203 265 -161 -289 57 68 0 -99 -7 -169 -134 -81 40 57 38 97 -8 -47
4356 -47 194 42 118 230 198 290 -262 292 65 164 -82 -27 249 1 259 239 -190 -158 -17 39 20 -33 -70 -204
4380 -204 81 -110 -84 77 143 171 146 143 -216 -78 -12 134 16 -285 148 -64 -138 -178 19 -65 186 -196 75
4403 75 -54 -171 64 190 30 -134 -7 115 -123 -75 -235 22 -202 -39 -93 18 -93 -245 289 -11 271
4424 271 -77 9 55 -194 298 -117 -202 103 -44 -455 124 17 -199 -55 -96 128 -189 243 115 163 -123 -107
4446 -107 97 45 -33 100 -111 13 147 64 -126 142 -27 -194 14 239 56 -285 52 22 124 85 67 -32
4468 -32 -264 263 142 99 134 56 -142 38 25 -102 -40 -244 -21 -12 147 129 161 -59 -50 279 -27 -87 -181 -261 -250
4493 -250 -179 227 -96 82 172 -137 7 306 4 -49 156 187 -93 31 171 -141 -26 -8 89 -96 -81 -131 -101
4516 -101 177 -341 -294 -144 246 11 -79 -144 -106 73 -112 -202 87 -40 146 -101 -28 1 -41 14 -211 24 161
4539 161 -189 109 -55 -240 94 -17 20 148 111 35 -24 150 -14 -69 -43 71 96 203 -115 -77 46 49 -38 251
4563 251 -54 -318 -56 190 54 62 86 -138 66 88 -144 99 213 -73 -49 -126 116 124 -59 -53 -149 -46 -49 47 169
4588 169 -189 30 -26 -266 -317 -39 13 -43 7 -53 -57 -102 -25 -213 76 121 164 -132 -209 -43 -85 65 53 -108 -165
4613 -165 -186 -89 172 45 -23 -145 -20 132 6 44 -161 5 108 12 -20 22 227 76 45 -202 115 21 67
4636 67 -188 -415 -104 -98 102 15 48 -98 24 241 -266 67 -173 156 -61 -158 62 75 130 -309 167 26 79
4659 79 -46 -36 201 -8 35 -118 -137 175 8 50 -115 25 309 -166 163 349 -332 -137 -101 217 281 -69
4681 -69 51 -43 -80 18 22 181 -123 -13 189 23 113 -79 11 -60 162 181 53 -85 -155 -7 -204 -170 -109 40
4705 40 -36 34 -77 44 32 30 -261 -169 110 -18 153 340 -135 -69 113 -268 -171 16 -42 20 -35 -4 79 -47 -306
4730 -306 67 291 14 120 230 -89 -66 -213 -73 0 40 56 -64 43 -61 -25 -155 -274 -234 160 217 137 32
4753 32 -192 103 -35 314 362 -246 -205 -10 16 113 43 5 51 -162 -103 88 115 108 107 -53 -68 113 242 -286 -187
4778 -187 139 -94 -128 234 80 -153 89 -16 30 -20 -25 -44 4 50 -42 -141 -5 56 -91 32 50 -173 148 40
4802 40 -237 43 -147 134 25 -113 -41 9 150 -136 29 -70 116 33 -299 117 -120 -3 -135 -146 158 130
4824 130 43 109 -36 423 16 -38 -199 162 -16 83 -58 197 -251 -135 76 135 164 -118 120 128 47 -128 -131 65
4848 65 182 -163 -185 314 129 103 -159 97 -6 39 68 84 -63 -97 -139 202 -160 -156 23 -118 -75 21 32 60 155
4873 155 -152 52 39 167 -52 -31 -199 -16 -175 209 -153 99 -19 74 -7 -8 228 148 76 -14 -107 -116 276 -67
4897 -67 -74 -130 -162 216 -35 -91 89 -49 -16 -195 -210 115 185 98 107 -6 -31 -35 -74 327 120 169 -21 -30 -122 136 162
4924 162 -50 -58 -149 31 179 -55 341 222 169 -19 -164 86 9 -220 -26 -50 183 -140 89 -146 -7 108
4946 108 -133 127 333 -53 40 -253 -81 190 130 88 -3 -188 148 -228 82 1 44 -32 76 -194 -65 -138 1
4969 1 -16 -155 -88 -286 195 54 85 64 140 126 84 89 123 43 -26 21 -110 45 -64 -73 -325 -216 -83 -209 -66 8
4995 8 31 26 -104 -6 303 280 -117 -56 145 -133 -30 120 65 65 75 177 30 13 18 205 35 -32 226 2 -249
5020 -249 68 -129 415 -82 -145 -43 389 -248 233 -89 -12 -67 -44 157 86 111 -65 -27 157 84 -155 -41 -16
5043 -16 170 -14 -71 74 19 8 74 10 -84 91 162 -98 222 -76 139 -31 22 -43 -19 61 -2 220 -144 -171 50
5068 50 71 -25 81 -38 148 300 2 69 -171 -88 -204 -158 102 41 -83 -175 -65 139 -140 76 248 -124 -98
5091 -98 121 -330 -130 -125 96 225 306 48 -81 195 -238 52 69 -63 143 63 296 88 36 268 -56 -224
5113 -224 156 171 -115 -39 150 288 -173 -132 115 -22 113 -66 -386 -29 -17 18 -125 -157 65 -13 17 -145 -202
5136 -202 -167 87 -234 -133 -90 -106 41 15 -236 -78 -108 -82 -48 19 -62 91 -27 208 133 -93 -495 4 39 -135
5160 -135 99 -115 140 -86 295 -108 141 255 143 59 -95 16 -22 257 -20 -185 134 141 -95 -253 86
5181 86 -42 194 -234 62 -80 -86 -68 -201 251 -153 94 223 -14 40 4 287 -20 6 -57 -140 -3 -92 154
5204 154 -19 -268 -153 95 165 175 84 157 -95 -29 -63 -66 -26 -134 -101 148 247 47 219 176 126 -33 -108 8 -52
5229 -52 -63 158 -161 -205 131 153 179 -6 -8 38 -57 35 -148 -39 41 175 -96 -9 -48 -62 -215 160 -109 -328 70
5254 70 -186 -157 -112 253 -33 -71 -147 62 -165 -54 -31 4 -184 -40 -28 -104 144 -70 91 88 203 81 160 -74
5278 -74 -98 6 117 70 -57 222 -94 -41 -85 -205 231 5 204 63 -50 -20 38 240 220 4 6 -260 373
5301 373 -77 41 57 -167 194 -56 253 -23 -85 -73 78 -126 -169 -248 70 -114 -141 -42 -177 97 89 103 -1
5324 -1 97 -98 -84 27 -109 -67 15 -110 13 -84 -299 96 235 70 -275 98 60 10 -260 199 40 -134 1
5347 1 79 -104 -136 146 -57 -9 -8 -140 184 39 -152 98 256 75 -74 255 -50 -137 -103 -41 44 37 -61 -19 -48
5372 -48 83 182 39 3 35 -106 92 237 154 -145 210 91 164 36 -168 -281 47 -111 -182 16 -14 65 114
5395 114 -101 -111 144 -83 241 -243 139 63 39 210 -244 -121 -34 -49 -427 12 81 -225 131 -19 168 -62
5417 -62 80 125 -161 118 -54 -196 -7 -21 -323 129 19 -117 69 45 -69 249 21 41 -2 23 85 222 166
5440 166 93 -1 -229 218 -33 -103 89 197 15 -72 57 -45 5 -218 -62 14 125 -243 15 -285 -182 224
5462 224 30 -84 98 161 -111 135 -40 19 -94 259 -15 136 83 69 -205 -23 -48 33 194 -95 254 -107
5484 -107 137 36 4 15 -42 240 25 -316 154 41 360 157 -28 133 -137 -10 72 -28 -84 204 42 64
5506 64 163 22 -34 111 -142 197 -296 43 -224 23 83 -63 -128 -12 -2 82 -55 -9 96 -18 -318 -88 -129
5529 -129 84 36 256 163 -13 231 236 -153 62 110 49 235 159 57 37 142 -249 60 -296 -125 -97 -100 168 79
5553 79 127 20 7 47 -31 -124 -218 -105 146 263 67 -44 -2 -122 -7 207 -73 88 -60 -14 262 -75 -67 224
5577 224 -120 66 241 116 45 154 -98 -11 -119 -114 34 279 4 -134 -82 79 -36 -2 101 -159 56 -285
5599 -285 -98 20 227 127 -278 -13 -65 64 -242 234 -15 63 205 108 113 -240 -137 91 98 -104 -220 134
5621 134 -127 80 40 220 78 -335 -162 347 44 101 214 -221 -84 -6 5 -87 31 -360 245 268 -128 131
5643 131 4 -172 271 -334 132 -37 -7 262 19 79 173 42 17 -180 -69 2 -311 154 66 102 -54 -72 -122
5666 -122 252 -53 -124 -216 179 -27 -16 222 251 -263 -247 30 -17 -111 -62 -165 -140 -61 -184 92 -200 82 -235
5689 -235 -9 43 -105 -36 -52 -18 29 186 -239 -241 95 -155 91 -168 55 200 57 -65 85 51 86 123 -19
5712 -19 -185 -25 58 -2 -96 -154 -58 -131 -173 233 -75 56 138 -22 39 -255 57 140 -55 -139 66 101 108 34 193
5737 193 124 22 -179 81 86 -134 157 -68 -34 55 114 183 12 1 3 59 -105 -148 -110 -61 -217 94 116 1 82
5762 82 125 -355 194 22 115 34 -224 -157 50 95 100 -61 -17 -233 -201 -63 -200 65 159 4 293 107 214 -132
5786 -132 -79 -95 -50 267 -23 -456 -35 239 -42 34 -202 215 65 -186 176 -226 402 106 175 -135 -69 283
5808 283 -109 62 -31 106 -157 -120 256 -85 -97 60 112 216 -225 57 -148 -159 81 -114 160 -38 -10 142
5830 142 53 -165 120 120 -102 11 -49 -48 -24 -90 -58 291 -156 7 73 -218 59 -64 -135 89 -166 176 137 31
5854 31 148 123 9 -242 -176 7 -101 -154 -51 -305 -50 -352 117 -161 26 -116 -382 291 60 88 -130 14
5876 14 -23 -212 143 76 176 -43 172 89 129 113 -32 223 -17 17 44 181 -227 -369 54 224 -121 -35 -37 30
5900 30 320 -61 424 97 -29 26 -181 78 38 32 0 52 -111 -224 -107 69 73 197 -101 -121 283 -66 -20 1
5924 1 -9 132 -57 53 22 201 -75 -54 -74 -51 10 39 -46 -16 121 272 194 -92 -33 142 -71 -122 41 -54 -108
5949 -108 326 179 98 -18 -76 -187 -168 118 -38 -101 -69 98 208 -13 -130 150 69 39 5 -82 -132 -44 -116 -122 -206
5974 -206 -83 100 23 166 50 85 412 43 227 -107 78 -65 -167 79 119 23 -163 -113 150 88 13 70 132
5997 132 -1 60 125 -171 132 -188 82 -136 -179 -22 -68 -103 51 -32 152 29 28 71 109 82 104 73 -135 -8
6021 -8 -17 -298 90 -12 210 19 13 104 84 -8 1 133 59 -82 -122 -35 10 111 340 -239 7 -43 -155 23 222
6046 222 -151 81 90 -68 -91 -3 165 33 -182 181 207 63 105 72 178 -54 33 -25 -119 22 -45 114 -94 -137
6070 -137 66 55 30 -57 13 168 96 -75 -164 -55 36 92 2 14 57 -89 12 195 229 160 -106 -81 72 -28 -134
6095 -134 94 59 -169 119 -124 22 -143 199 21 79 116 -15 100 172 132 -158 -179 -114 -224 75 43 277 -160
6118 -160 -125 8 -72 -146 78 -176 -256 -48 25 77 -181 36 16 -212 -53 -239 -75 263 316 224 -170 49 89
6141 89 -171 -114 -79 285 87 -250 -94 -163 65 -193 -340 27 15 26 115 -141 183 5 -8 74 79 8 -192 169
6165 169 -94 29 -28 -64 233 -81 295 -68 9 -27 -176 0 301 -128 -100 -58 -50 78 -81 -143 27 60 57 -65
6189 -65 13 40 149 176 59 47 12 95 166 -36 75 150 -85 161 -76 -125 -121 -185 46 -136 -104 -267 -450 59 -139
6214 -139 -327 102 -65 -191 14 92 -234 -32 -71 47 -32 -191 -202 235 86 -222 62 -82 2 -174 -194 108
6236 108 38 -96 101 -183 -105 -116 51 200 -33 53 -42 50 165 -13 -112 -125 202 64 147 -104 -1 68 -18 59
6260 59 180 135 166 212 -93 51 -159 158 -98 60 159 211 100 -141 7 -3 78 137 114 0 -117 181 -150
6283 -150 -21 196 265 150 -111 -91 162 -31 158 -101 -82 87 77 83 202 40 98 -190 -176 281 -61 17 -64
6306 -64 8 -79 -83 -160 -191 206 67 32 9 -119 128 176 -23 35 3 -93 -68 -92 0 18 77 -19 -284 -111 137 -85
6332 -85 -90 -73 -38 -143 -196 -121 -99 326 -84 157 180 90 11 21 -215 73 -29 -40 -132 -349 0 -65 -59 70 79 168 23
6359 23 -118 22 37 215 -83 186 -149 -56 162 -88 46 8 121 -202 -61 -84 326 61 -4 -285 -243 -82
6381 -82 -99 -218 64 319 194 83 3 233 42 -20 163 -53 -90 -250 32 -95 -268 -3 -36 -83 88 87 -208
6404 -208 -110 6 -86 34 -7 -198 -61 70 -38 -62 -56 -217 -134 -3 -20 205 116 -80 -17 -78 -129 26 -61 -81 56
6429 56 -389 352 -142 136 -58 48 -84 95 -96 -28 40 93 106 91 62 64 -144 164 11 60 14 87 -17 127
6453 127 -29 29 -102 -180 172 4 -134 -33 -82 -172 172 -85 -39 110 -42 -5 -78 208 -17 -68 -6 -38 104
6476 104 -52 -132 61 22 219 -4 -83 172 -55 -263 35 236 204 -374 -61 -21 -141 42 -42 -95 -353 165
6498 165 -54 -40 -190 -77 -215 111 -85 179 110 -303 124 -113 -79 92 -118 -48 101 -302 102 74 -185 101
6520 101 -245 4 -74 109 157 -265 113 66 24 224 -257 -196 -182 -243 340 159 97 47 136 172 55 -48 -56 -43 34
6545 34 -260 -25 -82 -65 -142 111 -227 55 -80 -16 70 -171 -10 192 -17 -143 -66 -207 237 -93 -8 -52 207
6568 207 56 -12 208 90 98 -155 -117 -145 181 238 31 -133 234 93 45 -167 111 5 -91 -141 -67 21 226 8
6592 8 99 -91 142 17 108 -6 136 203 -104 9 -29 -68 68 4 -98 80 46 -100 176 -236 -317 37 -159
6615 -159 -212 -187 -77 -27 202 369 59 264 -167 83 -19 -80 -150 -8 182 -205 -122 175 41 -203 13 -13
6637 -13 103 132 52 -63 155 14 31 179 -251 -80 6 259 60 29 -126 -142 -97 4 -19 103 -148 -147 -114 -33
6661 -33 85 -126 -13 13 89 -198 76 3 -264 -103 128 -99 -23 18 -77 -66 -41 -277 -191 -82 5 -50 -64 34 -55
6686 -55 223 32 123 55 28 185 223 -2 75 58 97 117 210 3 202 2 -16 -71 109 -67 208 93 -112 227
6710 227 -80 37 42 -202 -150 11 -45 45 -191 -142 241 64 -33 10 139 -93 127 -108 -53 -58 -32 107 191 22
6734 22 -19 169 -356 203 -6 39 -71 -146 95 -13 -36 98 -40 114 4 -43 60 -55 -145 -79 138 184 -208
6757 -208 26 -140 -302 184 -295 -119 162 221 -332 178 81 -69 -235 -42 92 -39 -117 -171 -193 -36 -108 -84
6779 -84 -27 -38 -132 22 288 106 -83 -334 184 -107 129 213 138 98 20 -169 124 72 59 -239 -35 227 -307
6802 -307 -272 133 -115 -68 89 -90 115 44 -154 174 69 -80 104 -138 93 68 172 178 -8 -14 -47 15 -86
6825 -86 57 183 -180 110 -147 212 -148 217 -69 143 333 69 67 -18 34 43 354 -63 284 179 -129 29
6847 29 334 41 -91 -73 -72 135 -28 -190 154 -11 -80 -124 31 99 79 51 -15 -49 -55 -67 3 115 -190 -321 -249
6872 -249 -63 91 -89 230 3 -47 51 -97 -116 190 -169 24 -44 298 -29 45 324 151 147 133 22 -37 -86
6895 -86 71 -53 -177 79 231 -82 142 54 -205 30 51 117 59 204 -154 -80 -202 34 50 379 85 113 148
6918 148 27 60 83 -10 164 -3 74 -1 -27 -72 78 78 44 197 35 -203 42 -37 41 -67 -200 163 -69 64
6942 64 -264 102 -123 -224 -94 -105 79 185 -150 -32 103 183 120 187 -201 139 -127 -208 95 88 219 163 -37
6965 -37 325 25 -183 -140 31 -51 12 -50 -21 153 231 225 140 140 -14 -230 -239 -23 144 66 206 -116 -166 -136 -79 -211
6991 -211 -53 -127 -232 -45 -91 -30 -76 -286 212 -23 9 11 -265 108 -203 105 100 199 200 186 -271 -75 113 -25
7015 -25 -7 52 37 -27 -159 -39 -29 -102 -222 -81 -90 86 -42 -124 21 -131 23 32 -80 -177 -184 -55 165 -1 -157
7040 -157 57 -61 -275 -282 -103 -61 -199 -219 46 -138 151 71 -99 -202 83 33 -133 98 197 -112 -148 193 184
7063 184 -153 -242 39 -15 184 -197 48 142 11 62 -33 73 63 52 -147 -34 -45 -28 2 -110 -13 -121 227 -1
7087 -1 40 5 4 209 72 -6 -57 114 159 277 62 170 137 80 -37 253 134 54 93 -8 4 9 -49 -89 -149 -256
7113 -256 42 174 -136 -47 -219 -111 174 -238 -208 106 -80 147 -192 79 -245 -237 151 162 51 -213 -157 -143
7135 -143 -104 80 9 79 23 73 -152 54 19 34 -2 -372 -126 -123 201 -12 -78 -45 169 -227 -130 -41 42 -152 207
7160 207 246 208 -35 85 -92 117 11 -114 -2 128 -45 -191 -119 118 24 4 -202 -86 -162 169 -95 -112
7182 -112 -91 63 -119 -90 -30 70 256 246 -5 13 23 2 29 130 -193 -70 -71 96 -124 -193 -100 275 -63 -22
7206 -22 -142 -27 107 -104 206 -70 -139 -29 31 -112 -9 -121 -207 -72 -35 220 131 44 193 16 -107 151
7228 151 23 -3 81 -67 -99 57 -27 -241 66 -156 -111 -49 217 -142 -160 -100 125 -124 -106 162 -78 -33 -143
7251 -143 -185 217 -92 252 55 -3 -202 -79 49 29 -104 61 137 -129 233 36 -294 -220 -100 -95 -45 131 299
7274 299 128 -226 126 1 -280 -311 288 -69 240 -97 -168 -81 -16 -164 -120 258 66 -145 -248 115 -146 -34
7296 -34 97 216 42 64 43 232 -178 38 -29 41 -238 -100 -38 -132 -194 -37 -56 -91 -15 2 152 265 18 -152
7320 -152 -219 72 72 151 26 -37 274 -83 -176 -227 54 -32 -167 -119 -91 19 242 188 -57 -125 -96 -44 151 2 412
7345 412 26 -12 7 -212 -35 179 -275 38 -137 -24 -217 -29 93 -20 -92 101 -117 130 88 -71 -79 259
7367 259 -31 117 205 10 13 -107 -26 139 -116 -165 82 22 -127 -237 136 -158 -232 27 -354 -28 -106 5 -60
7390 -60 0 65 26 32 -38 -100 91 154 -55 45 -42 -163 -140 9 30 -121 17 15 -221 -151 -3 55 -156 -11 -188
7415 -188 -111 131 65 -58 -275 6 88 248 -165 -17 158 48 148 -220 -83 -34 65 114 147 -81 194 92
7437 92 399 -92 -40 -154 -19 -169 -86 10 374 8 -280 170 3 -260 -134 -121 -5 -199 -7 90 -204 -17
7459 -17 148 117 68 -49 -217 72 -140 -46 -25 119 232 118 294 -21 278 154 -90 24 -288 81 -61 -279
7481 -279 338 -161 63 36 -104 39 24 56 -45 -65 -37 72 -214 -72 -169 -203 22 153 88 -151 -105 14 -276
7504 -276 -153 149 -152 68 137 85 120 -45 -328 -213 60 106 235 126 160 180 2 -4 35 -177 199 -190 -59
7527 -59 195 -68 -48 230 109 -30 -134 -103 130 222 -25 82 -280 -57 -82 45 -140 68 -23 -94 82 -152
7549 -152 18 4 -207 -176 -99 121 198 149 43 -128 0 81 83 117 -91 -189 61 130 -36 52 420 -73 -186 -43
7573 -43 -98 35 25 101 137 -283 -119 73 210 -198 61 99 169 38 -97 79 282 -192 -126 277 98 34 -101
7596 -101 -129 9 39 8 -233 132 36 209 -12 -217 -125 -230 -119 176 -29 -125 -17 -129 -106 486 107 -174
7618 -174 -334 133 12 -89 100 278 125 -155 69 98 -361 -240 8 41 38 -222 -138 -149 164 20 -100 26
7640 26 113 52 151 -17 73 125 298 77 -24 -329 33 -184 98 57 -12 202 -55 -98 -47 150 91 86 7 -5 -104
7665 -104 435 292 285 108 97 -217 245 163 -139 20 84 -76 80 297 -141 2 -174 7 81 34 -72 -239
7687 -239 302 207 -162 32 -32 164 183 -118 -122 136 -231 -140 214 52 -45 127 61 214 28 212 197 -160 84
7710 84 -10 184 234 71 111 129 170 26 -50 128 -66 -116 -35 66 125 24 -47 36 30 161 -65 -71 95 13 -9 -95
7736 -95 -136 65 110 -38 -28 36 -120 -351 112 32 2 -130 98 24 92 -43 157 38 -48 -185 -154 -92 227 92
7760 92 -75 -69 -74 -73 142 29 -194 -90 188 230 92 30 107 -24 -96 -297 -141 45 170 80 -151 -102 -172 209 31
7785 31 -84 -93 323 73 -121 33 353 -263 -110 1 -37 226 58 -235 -224 -84 97 80 56 -357 29 45 98
7808 98 -14 -278 -324 46 173 -252 -61 101 -116 120 32 -14 -232 58 -68 -258 -87 -131 -60 185 -94 13
7830 13 47 -81 -84 148 -27 -42 36 -162 -22 -118 -30 16 64 -112 17 -35 -314 61 22 -88 -156 34 30 -223 -5
7855 -5 125 200 77 210 96 76 35 -1 121 -101 97 26 178 258 325 -41 -107 165 -244 35 -149 298 39
7878 39 -195 -67 -151 -180 191 24 109 12 54 163 -79 -52 37 -136 -20 26 244 41 99 202 -226 -39 -129 167
7902 167 27 7 62 -97 244 135 -80 -28 64 -20 45 -126 -38 230 -90 -189 85 -95 -124 267 -55 -24 13 1
7926 1 125 216 -4 -2 -6 157 277 64 58 70 -128 40 80 -95 -208 151 -157 -59 -34 -219 11 232 73 -37
7950 -37 114 68 -7 302 -335 -137 -241 -235 74 121 20 -26 -261 -190 120 -48 -48 -147 -196 -69 -43 -190 127 147 122
7975 122 60 -293 226 19 -32 -189 -83 127 -159 22 -252 -157 -55 74 -80 12 14 29 -102 95 337 71
7997 71 -9 -32 -24 -112 327 -12 113 -168 1 189 -261 -28 -10 109 -85 170 -115 39 -64 -93 -168 177 236
8020 236 -158 -28 114 61 -99 -142 153 97 -42 -160 -7 159 23 161 -63 103 6 149 199 -71 7 -56
8042 -56 106 -54 185 57 206 -12 87 147 -205 32 -76 -123 -25 94 247 -168 34 -203 -71 145 235 105
8064 105 -42 95 -67 148 -271 90 244 -182 -163 113 41 126 369 -20 26 -93 -149 -67 -83 97 -22 23 -85
8087 -85 70 56 75 6 113 -137 119 -24 255 278 257 -1 -31 39 -236 -167 -37 52 -93 4 -137 118 -87 27
8111 27 -24 -41 -77 -158 148 -4 -166 80 -164 -43 250 -60 -4 -48 3 71 122 -371 91 162 -44 25 43 -239
8135 -239 194 113 -74 -31 -78 -123 272 19 -77 244 -343 127 -50 23 261 -111 -121 -416 -61 -65 -55 -89 -113 -163
8159 -163 240 244 -80 146 -82 158 150 27 7 41 -11 -281 -91 -28 224 495 10 -36 126 15 -128 141 -68
8182 -68 -53 210 -83 -48 -4 -68 263 190 306
8191C06
$$ Imaginary data points
##PAGE= N=2
##DATA TABLE= (X++(I..I)), XYDATA
0 0 0 0 0 0 0 0 0 0 0 0 0 0 5 -8 8 -8 8 -16 16 -16 24 -29 32 -40 46 -54 61 -70 80 -93 104 -118 134 -150
34 -150 172 -190 214 -239 269 -299 331 -370 410 -451 499 -551 607 -669 736 -812 892 -985
52 -985 1087 -1200 1327 -1473 1638 -1831 2057 -2327 2655 -3066 3596 -4305 5304 -6820 9378
67 9378 -14462 28352 -143244 -390748 141700 312859 -111814 -235501 110543 138817 -115244
78 -115244 -99241 96111 69684 -46154 -73806 -41183 47845 117894 -23542 -173647 -20896
89 -20896 171716 24281 -144829 -9711 98120 -38305 -77086 61923 61837 -64437 -52385
100 -52385 25142 17212 19117 28794 -55432 -74374 61975 93757 -49843 -77536 37034 38117
112 38117 -33516 7910 41427 -27689 -36911 26962 19073 -4427 28473 -3267 -71012 8526
124 8526 105897 975 -97044 10578 72805 -26581 -26754 66105 -705 -87968 29111 98602
136 98602 -41827 -69121 70860 34569 -97286 6900 132057 -23589 -142328 32787
146 32787 131399 -31034 -92941 37306 52478 -44919 -21044 49749 6960 -40059 -6382 9968
158 9968 6588 25630 -5452 -58680 -4472 67314 2372 -63603 6262 42395 -35416 -31267 55514
171 55514 17638 -71698 -18106 60115 4732 -45884 7014 19225 -31461 -9930 38233 2184
183 2184 -38712 -8520 16579 3561 4264 -474 -26482 -8344 30577 3563 -27045 9193 17186
196 17186 -31283 -12502 50642 9706 -58541 -3780 54242 -7204 -38395 28726 26666 -46443
208 -46443 -15313 62747 13823 -58879 -4726 49737 144 -27651 14788 18260 -17768 -6873
220 -6873 19879 7692 -1353 1121 -14345 -4306 36217 16942 -41498 -17786 45714 17306 -38729
233 -38729 -2615 37738 -7740 -33013 16034 31574 -11802 -22574 3054 7509 6943 11247 -14486
246 -14486 -26627 16671 31367 -20178 -30254 22113 21055 -31765 -18102 34182 12570 -36657
258 -36657 -18080 23612 16128 -12892 -18382 -5827 10067 12185 -12617 -20274 11817 15933 -24549
271 -24549 -18717 30892 16923 -40477 -21327 38299 16443 -35377 -11992 24473 501 -20488
283 -20488 6367 16095 -10817 -14700 7992 10005 -491 -3238 -5231 -1893 9277 5781 -7465
296 -7465 -1702 9604 -3087 -8510 14706 13879 -18061 -12213 22895 14528 -18608 -5713 21164
309 21164 1134 -17430 9005 21156 -7224 -16898 7838 16667 -360 -6967 -387 3136 5844
322 5844 3024 -4669 277 9028 -2662 -11052 7675 17485 -8262 -20675 8693 20564 -7296
335 -7296 -16475 5792 10173 -7856 -7232 7646 3596 -7766 -5788 1079 4246 3184 -7111 -11901
349 -11901 2697 12133 -4425 -15829 2174 10644 -8872 -11729 8859 8138 -13218 -11903 9253
362 9253 8761 -8641 -9559 1888 4150 -854 -4004 -1918 1870 158 -5269 -2491 7452 3766 -11596
377 -11596 -6238 12671 7133 -11599 -5712 10795 4073 -9628 205 11649 -155 -10022 1556
390 1556 11128 2925 -6654 -2199 6269 5529 -954 -2618 3213 5573 -1080 -2913 6117 7401 -3772
405 -3772 -6465 6472 10192 -3380 -6460 5506 6047 -3739 -2030 7050 3016 -7014 -1893 8339
419 8339 3376 -5890 -3838 4670 4293 -3972 -4568 4119 4538 -5945 -7076 6142 8835 -7585 -13033
434 -13033 5121 12511 -5195 -15244 1827 12696 -4332 -14603 1873 11843 -3276 -14983
446 -14983 -1266 12233 1555 -13743 -7389 8621 7283 -8531 -11070 4561 9364 -5354 -11113
459 -11113 2984 10212 -3489 -12924 1077 12057 -112 -11915 -2301 10352 2819 -8264 -1718
472 -1718 7272 1610 -5104 578 6236 -102 -4622 1834 5457 -347 -2254 3276 4097 -2505 -2003 6639
488 6639 4935 -4125 -3628 6005 7636 -1263 -6105 1624 8856 2989 -6716 -3652 10147 8138 -9324
503 -9324 -9376 11941 14624 -10571 -17039 11265 21459 -9603 -22268 8503 23039 -7083 -23002
516 -23002 5632 21487 -4790 -20853 1118 17683 366 -16238 -5199 10806 5933 -8083
528 -8083 -10591 2177 9921 -967 -12841 -4059 11417 4192 -14744 -8276 12235 7042 -13993
541 -13993 -10510 10305 8817 -10861 -9717 6598 5522 -5985 -4896 3488 1382 -3386 -131 1473
555 1473 -2807 -463 4573 -1147 -6531 2385 9205 -1986 -9820 3226 11021 -2442 -8241 4100
569 4100 7968 -2498 -3560 4849 2325 -3448 3193 4805 -4466 -1558 10383 3130 -11511 -316
583 -316 16467 1760 -15817 1222 18005 574 -15260 2172 14474 -1148 -10370 2761 8350
596 8350 -1214 -3289 1092 545 188 4132 -657 -7756 855 10473 -1430 -12574 392 12942 -1088
611 -1088 -14279 -397 12534 -9 -12581 -2747 9635 2483 -9374 -5667 4566 4605 -3269 -7351
625 -7351 -1843 5425 2779 -6869 -7371 4288 8495 -5929 -12910 3849 13162 -4905 -16890 2973
639 2973 16763 -3883 -17435 3236 15600 -4206 -14054 4627 11779 -5009 -8938 5704 5991
652 5991 -5138 -2446 5202 629 -3516 2999 3909 -3779 -1099 5816 1387 -3442 1446 4147 -1106
667 -1106 -779 3421 394 -2723 3738 5157 -4033 -3353 7670 5081 -7381 -3490 10043 5601 -9195
682 -9195 -4487 9332 6323 -6980 -6452 6661 7546 -4057 -7679 2619 8693 -760 -9527 -1196
696 -1196 9093 2574 -9248 -5252 7360 5663 -7261 -8222 4218 8033 -3749 -10949 628 10377
710 10377 -1116 -12922 -2064 12047 778 -13726 -3376 11472 1420 -12371 -3184 9410
722 9410 1313 -9595 -1868 6252 -69 -5918 -1312 2723 747 -1961 -1441 -27 1236 206 -1623
737 -1623 -1029 1803 512 -1947 493 2113 -669 -1626 1895 2310 -2171 -644 3643 1310 -2523 341
753 341 4591 872 -2957 646 4455 527 -2042 691 3062 1553 -1032 -274 2548 2079 -621 -1599
769 -1599 1867 3378 -758 -2502 1684 3273 -714 -2343 1290 2661 -706 -1654 547 1356 106 -1200
785 -1200 -959 809 829 -1313 -2099 420 1802 -1430 -3349 818 2111 -2189 -3381 905 2329 -2463
801 -2463 -3476 1086 1785 -2621 -3126 300 1516 -1526 -2977 -267 1437 -304 -2760 -804 1730 438
817 438 -3045 -1309 2195 920 -3071 -1476 2781 683 -3165 -610 2643 109 -2460 -8 2794
832 2794 342 -1925 615 2179 345 -1240 269 2381 651 -1538 452 2735 1141 -1511 -222
847 -222 3573 1706 -2317 -50 3611 1451 -2224 -294 3556 1713 -2141 -636 2914 1749 -1598
862 -1598 -1188 1862 2046 -1109 -1353 1107 2048 -370 -2033 285 2247 -73 -2433 -471 2193 352
878 352 -2710 -455 1771 -131 -2515 -967 1115 44 -2068 -1216 283 173 -1316 -1631 -510 396
894 396 -766 -2215 -556 677 -539 -2431 -471 878 -941 -2106 83 947 -758 -1836 10 583
910 583 -489 -832 -83 337 -237 -635 -83 679 149 -326 -160 521 958 -225 -204 1411 658 -498 255
929 255 1938 341 -879 739 1999 -534 -1059 1628 1899 -343 -1094 1432 1956 -112 -797 833 1660
946 1660 866 -910 -436 2174 1224 -1517 -1054 2400 1965 -2010 -1471 2741 1457 -1831 -1351 1896 1440
963 1440 -1875 -1370 1118 533 -478 -892 -476 432 525 -1297 -1696 267 1158 -1038 -2312 599 748 -1949
981 -1949 -1545 666 -28 -1756 -721 193 -1091 -1225 185 -308 -1884 -599 640 -478 -1651 -649
997 -649 547 -613 -888 -723 27 412 -70 -1744 -502 2266 448 -2521 -883 3161 577 -2959 -52
1014 -52 2962 403 -2123 228 2115 201 -285 591 5 1098 1826 -411 -1202 2092 3138 -1312 -2200
1031 -2200 2863 3065 -2386 -1241 3436 1531 -2027 87 2825 -59 -1416 1875 1286 -1696 230
1046 230 2394 -268 -1918 872 2705 -1024 -2098 920 1430 -466 -1735 -210 798 452 -965 -1763
1062 -1763 231 1903 -989 -3191 -185 2415 -642 -2956 -651 1875 452 -2204 -2296 638 2306
1077 2306 -1089 -4443 -450 4548 -427 -6144 -440 6015 -714 -6889 422 5651 -1989 -5583 1697
1092 1697 3775 -2203 -2708 2118 906 -1709 713 1149 -1877 258 3339 -1023 -3371 2550 3746
1107 3746 -2811 -2716 4402 2753 -3724 -869 4626 173 -3426 2225 3659 -2003 -1505 3766 1767 -3050
1123 -3050 -56 3801 926 -2708 522 2943 295 -1257 -181 1788 1365 -666 -1383 927 2157
1138 2157 -222 -2087 338 2736 -609 -2126 317 1298 182 -749 -1096 -418 1501 526 -3200 -1948
1154 -1948 3567 1669 -5193 -1820 5099 679 -6358 -921 5403 -832 -5970 1184 3753 -2499 -3238
1169 -3238 1868 1042 -3198 77 2238 -2481 -1755 2936 25 -3951 347 3670 -1757 -3952 2483
1184 2483 2595 -3248 -1712 3426 224 -3220 859 2439 -1303 -1547 2921 800 -2340 378 2921
1199 2921 -616 -1179 1712 1854 -789 -271 1548 459 -70 943 279 45 1507 510 -711 498 2124
1216 2124 -141 -1339 1521 1696 -1128 173 1918 -304 -1344 1221 1347 -1771 49 2328 -759
1231 -759 -2421 1566 1906 -2349 -1206 2465 252 -3221 602 2051 -2042 -2002 2352 239 -3383 -6
1247 -6 2630 -1644 -2993 2097 1198 -3122 -1329 2465 -578 -3037 284 1654 -1717 -1346 1332 -955
1263 -955 -1894 1142 742 -2226 -716 2282 -602 -2887 1344 2288 -1996 -1937 2432 811 -2442 -117
1279 -117 2131 -294 -1500 1093 1105 -1137 658 1079 -735 179 1654 -117 -1370 1753 2071 -1711
1295 -1711 -814 2873 1071 -2266 465 2883 -310 -1630 1611 2030 -1013 -192 1981 364 -838 1171
1311 1171 412 -1008 538 1691 -1245 -1043 2055 682 -2310 52 2352 -782 -2134 1322 1867 -2011
1327 -2011 -1323 2035 -50 -2172 257 1239 -1676 -979 1029 -540 -1864 455 911 -2059 -1124 1536
1343 1536 -616 -2171 401 1307 -1814 -1625 1653 -21 -2602 -155 1718 -934 -1754 906 811 -1542
1359 -1542 -717 774 -210 -1173 647 204 -812 382 978 -940 -940 1887 472 -1929 352 2462 -544
1376 -544 -1551 1455 1781 -1151 -577 1860 656 -926 621 1268 -337 96 1044 236 -930 1211 760
1393 760 -1108 214 1852 -365 -976 1348 1587 -1134 -847 2101 502 -1622 391 1784 -635 -1439
1409 -1439 1210 907 -1320 -507 952 -339 -808 482 -334 -1073 262 567 -1180 -787 1190 -42 -1935
1426 -1935 -79 1202 -1116 -1726 818 781 -1699 -1344 1056 -352 -1603 -250 571 -660 -620 -38 -451
1443 -451 -1128 280 472 -1043 -166 1115 -512 -1252 654 829 -853 -748 1515 297 -993 81 1160
1460 1160 -510 -651 492 489 -24 3 515 145 391 1051 -116 -287 1186 1010 -604 148 1628 546
1478 546 -773 578 1473 42 -588 1058 575 -286 -148 922 153 -340 455 387 -142 203 712 -82 -327
1497 -327 591 404 -710 -88 1069 -515 -1073 590 749 -996 -821 928 159 -1446 -144 599 -315
1514 -315 -1079 -102 127 -436 -784 -105 -146 -333 -323 -500 -465 179 -321 -1064 -145 240 -90 -876 -294 369 -483
1535 -483 -795 29 181 -304 -532 -334 104 9 -320 160 -364 246 131 -188 328 376 -35 -513 456 935 -43
1556 -43 -310 610 919 -257 141 807 353 -139 76 1023 -33 -266 594 782 77 39 507 552 -117 -13
1576 -13 314 443 123 238 94 -215 209 287 -349 133 314 273 -603 -274 286 399 -580 -447 308 754 -714
1597 -714 -831 497 197 -533 -711 557 179 -961 -636 197 65 -573 -569 5 -56 -859 -310 -57 -236 -430
1617 -430 -15 -187 -701 -597 256 -253 -271 128 127 -308 -631 455 31 -670 72 343 -360 -561 162 447 -148
1638 -148 -249 713 391 -616 -128 1071 313 -581 419 1108 -138 -1007 821 1196 -169 -571 618 994
1656 994 -345 -9 771 232 -343 289 634 -255 -177 700 277 -385 181 674 117 -411 618 443 -195 -337
1676 -337 574 238 -817 -95 471 257 -786 -56 482 -395 -593 144 385 -758 -417 176 378 -512 -466
1695 -466 -45 266 -974 -754 380 -227 -1035 -266 525 -302 -448 -397 -22 -478 -407 303 -280 -586 -22 183
1715 183 -638 -645 499 275 -914 91 715 158 -791 326 990 -277 -1108 605 891 -405 -467 503 467
1734 467 -414 3 694 110 -342 524 331 219 28 754 382 -351 241 390 -63 158 656 332 -118 204
1754 204 405 -135 -72 624 586 -149 -151 272 523 146 -247 369 492 8 -352 262 315 -234 -593 147 106 -497
1776 -497 -336 233 72 -614 -294 49 -195 -450 -197 -124 -388 -349 -207 -123 -476 -375 49 -353 -569 76 -219
1797 -219 -495 -217 259 -253 -665 281 337 -727 -255 566 233 -735 6 457 -139 -198 182 176 -344 -256 99
1818 99 106 -59 124 218 -174 205 508 239 44 268 339 138 402 480 117 -181 127 399 -39 -100 288 224 126
1841 126 144 158 -6 218 211 -188 272 337 128 -14 412 535 -308 -67 404 -14 -430 -268 345 34 -364 -5
1863 -5 276 -144 -525 78 312 -296 -265 -45 -187 -375 96 -267 -537 -158 -10 -274 -725 58 -67 -748 -254
1884 -254 185 -297 -721 -262 131 70 -575 10 45 -314 -137 -131 -240 5 20 157 -213 91 283 -56 103 326
1906 326 -104 143 206 293 -171 -368 167 281 -1 166 329 47 73 178 320 84 218 344 69 212 518
1927 518 253 -123 658 263 135 84 558 224 -205 65 623 32 -14 442 608 -256 -238 559 233 -416 -82
1948 -82 183 228 -405 -197 223 -23 -41 -29 -89 -288 45 -192 -250 -23 -6 -69 -392 -48 5 -577 -98 -299 -408
1971 -408 -543 -269 -177 -181 -432 -182 -266 -220 -178 -141 -337 -136 -23 -449 -266 169 174 -520 99 571 -81 -460 51
1994 51 143 26 -326 177 7 -3 -61 330 354 -42 105 286 326 173 194 -1 -34 179 149 103 289 330 323 78
2018 78 148 432 -40 -58 110 280 285 -249 115 222 144 -70 -163 280 68 -95 18 146 -218 -241 276 -93 -113
2041 -113 -61 -43 -119 -478 -129 64 17 -364 -237 -106 -294 -288 -1 196 -331 -460 -109 9 -201 -82 -159 -163 -362
2064 -362 15 -72 -426 9 271 -60 -644 -65 304 -220 -297 216 279 -429 -472 230 375 -277 -221 320 -8 106
2086 106 -22 52 156 182 27 84 16 -213 312 321 23 245 4 14 261 -27 74 168 207 338 407 -59 -200
2109 -200 430 121 60 148 300 -57 -385 -29 417 221 -97 43 144 -53 -5 169 336 -325 -178 215 207 -448
2131 -448 -209 326 43 -576 -233 -34 -537 -495 94 -247 -520 -250 -270 -430 -378 36 -113 -198 -293 25 -189 -311
2153 -311 -45 80 91 -272 -180 -120 -572 -393 133 -189 -507 -511 260 -192 -350 -155 148 131 -219 200 47 -20
2175 -20 -162 -21 96 89 -306 342 242 -75 15 259 227 54 618 487 78 380 264 394 53 217 261 310
2197 310 166 293 297 126 -172 23 458 -82 -49 275 132 -181 -59 400 -46 16 104 365 -51 -363 -59 226
2219 226 -133 -254 159 240 -335 -89 137 -107 -358 240 27 -409 -146 -69 -223 -483 32 -189 -208 -180 192
2240 192 121 -284 -217 27 -154 -329 -33 -59 -353 -10 -106 -196 -262 -305 0 269 -89 -527 84 139 68 -190 -89
2263 -89 112 -176 -97 -29 64 -55 -119 93 30 91 67 341 268 -84 229 358 4 224 467 130 121 486 436 13
2287 13 -435 768 596 -308 226 618 -23 41 314 329 -318 2 363 -75 -171 -14 176 112 291 158 -162
2308 -162 -227 113 236 -258 29 19 -58 -109 197 -24 -492 54 -101 -161 -296 -57 -340 -236 -264 6 13 -231 -269
2331 -269 -188 -260 -159 -106 -292 -276 155 44 -369 43 221 -148 -456 228 35 -560 -186 115 -120 -47 259 202
2353 202 -57 -185 330 5 -81 204 376 -438 -88 458 353 149 103 197 250 -78 71 312 -299 -107 432
2374 432 244 67 297 359 -140 -180 113 -42 30 106 -4 -148 21 176 287 82 16 164 -204 -82 20 -166
2396 -166 -206 263 -12 -120 -170 68 -200 -198 -71 39 10 -104 238 -122 -239 212 250 -568 -118 -3 90 -381
2418 -381 248 -38 -404 -365 372 30 -427 -33 312 -40 -462 -85 91 -335 -265 474 42 -242 -43 85 -416
2439 -416 -414 -19 -125 -24 187 119 -302 -2 -122 -191 -61 226 261 160 63 384 283 8 343 191 68 -25
2461 -25 223 -57 27 340 397 -63 99 530 185 -169 217 504 -205 2 671 -69 -376 -119 128 -252 -126
2482 -126 287 328 -320 63 473 -51 1 250 104 -278 137 -138 -11 -478 416 154 -208 6 410 -106 -56
2503 -56 359 43 85 -175 170 -344 -405 196 252 33 -38 120 -36 -139 190 -58 -220 -146 -45 -118 -357 179
2525 179 -98 -183 -221 312 -54 -402 210 203 -189 135 317 -11 -31 180 -111 -84 -219 113 108 -417 177 82 -99
2548 -99 22 283 -112 166 313 353 -21 -216 64 57 -258 10 603 267 -36 332 135 -35 283 -8 -120
2569 -120 -174 171 0 -298 -22 261 -93 -228 40 -159 -103 71 114 -248 -329 168 -191 101 -154 219 -105
2590 -105 -187 -81 181 -33 151 85 -480 -227 347 142 -218 -104 234 266 -216 37 122 -184 -276 165 -18 -287
2612 -287 -206 47 -82 -232 -157 -84 -39 125 -219 -72 -12 36 -128 -140 22 182 -148 -56 488 72 -87 19 215
2635 215 -151 5 152 -153 101 34 241 332 -141 32 92 77 300 269 195 -92 200 47 196 84 202 95
2657 95 -158 295 73 -94 -209 302 -156 -394 133 -97 -311 -240 173 -150 -483 -59 316 -196 -410 220 -93
2678 -93 -366 -47 155 -1 -59 228 198 -357 -216 182 -61 -38 -212 76 21 -150 -41 -42 115 32 -139 80 -116
2701 -116 -148 -170 -143 -105 20 270 -130 59 -160 -76 -70 -87 145 -40 109 63 118 66 -82 -130 63 345 -224 -44
2725 -44 -20 -89 37 -24 28 -137 -103 228 157 38 196 387 14 113 191 73 121 127 329 -10 -110 61 106 141 -64
2750 -64 51 33 -38 128 88 130 -204 -100 -103 -86 -61 113 42 75 -126 -266 -42 -262 -229 -9 -297 -166 170 -275
2774 -275 -100 -54 -64 -194 140 -128 -178 14 -20 -258 171 -6 80 164 -172 -244 -123 63 -101 -109 -180 -95 383 -161
2798 -161 176 -22 79 -186 197 269 -99 70 -122 132 -106 86 211 -11 -45 198 -108 104 -38 123 70
2819 70 -204 -141 73 387 285 -184 56 -61 26 145 -105 203 170 109 253 -3 115 198 170 127 -31 -162 137
2842 137 7 -61 216 -196 238 -145 202 2 31 -33 -92 153 3 -122 -192 -217 51 318 -153 -59 -270 -35
2864 -35 -22 -318 -55 -56 82 -167 -137 -86 171 -186 -196 4 -3 19 -223 186 -112 -233 13 -52 -323 -303 83 176
2888 176 -142 -128 -304 -11 66 0 54 125 247 159 147 72 282 -15 -94 63 71 148 164 2 -8 129 -184 178 324
2913 324 -28 167 -62 -64 68 89 156 123 331 103 -316 138 120 -108 81 256 -35 -41 126 62 182 -20 123
2936 123 -145 83 -91 93 -25 -19 170 -425 -180 -88 86 -263 -203 -78 -24 -157 -94 -139 -264 -174 -131 16 -21
2959 -21 3 -247 -84 -28 -128 -244 110 -470 -248 71 -1 -195 -214 105 -45 -36 134 -174 133 -235 168 79 -278
2982 -278 155 -24 -207 192 53 -512 181 -92 -76 -49 -1 31 240 215 210 -106 268 -184 -24 105 -77 372
3004 372 182 -31 160 -3 -230 348 309 4 53 339 172 -7 75 73 15 -91 202 307 -89 -9 99 -251
3026 -251 -262 153 -40 -116 31 33 -91 -99 148 -92 -444 -221 162 -183 -7 -299 -165 -13 -65 -182 -57 -122 -213
3049 -213 52 92 -101 -65 -168 -312 -40 166 -35 -394 -9 -270 49 130 91 6 -7 -43 -71 -102 105 104 49 305
3073 305 445 -252 35 -17 -70 -179 133 187 96 58 -79 119 14 144 194 438 -97 274 230 77 -67 -32 82
3096 82 -170 -515 184 57 -80 154 39 -75 9 69 169 -59 43 -79 -94 -219 19 -64 84 67 14 -252
3118 -252 -169 -105 -43 43 -226 152 -169 -99 20 -283 45 185 -109 -178 -65 216 -118 44 -71 -14 -198 -347
3140 -347 207 -140 -271 -29 12 -288 112 34 212 -17 4 237 124 -237 328 143 -286 -71 13 -282 -245 -12
3162 -12 200 256 -114 235 104 -213 -190 117 -22 -175 71 90 199 100 374 173 -257 -66 124 193 43 -73
3184 -73 24 121 8 148 255 206 139 28 -62 -350 -200 -31 -3 59 212 -30 214 -81 48 -200 -187 57 36
3207 36 230 20 7 119 63 152 -74 97 147 -46 -21 -10 -299 -179 -292 26 -243 -365 373 -346 -321 256 57
3230 57 -142 -108 50 -309 -252 0 -77 -198 -220 -187 -267 49 -137 225 206 -90 46 -64 -150 -118 15 -5 -297 -159
3254 -159 200 89 82 -56 0 137 59 -137 233 -39 -50 39 -87 24 26 14 74 3 -52 -14 -43 78 119 377 91
3279 91 83 78 0 7 216 167 19 -190 -191 4 74 -134 -136 159 357 32 332 123 173 8 92 107 -168 -59 -116 184
3305 184 -111 97 22 36 -60 22 -139 -179 -312 -87 -81 -245 34 -131 104 39 -34 8 -136 -106 -23 -120 -204 42 -3
3330 -3 -26 -45 -10 -21 218 -174 116 8 -256 222 -7 -130 2 -181 -137 155 -45 124 278 190 -81 285 290
3353 290 57 310 154 48 211 147 -30 57 132 -221 173 173 406 104 -155 -266 114 135 177 109 -89 -10 167
3376 167 -177 30 118 126 106 -107 42 -65 -200 23 -229 -92 205 161 -83 59 11 -257 -192 29 70 -155 135
3399 135 -392 -262 68 -61 31 -205 -104 -140 85 -45 -15 98 64 -163 -196 177 -38 50 11 -168 108 -119
3421 -119 32 91 -304 -124 217 -144 -98 227 58 81 -65 -37 52 -56 -132 334 -138 117 -175 3 29 -94
3443 -94 77 70 -107 -90 1 49 43 -107 -10 -1 182 15 47 151 140 -19 137 64 204 98 300 60 63 -214 -92
3468 -92 99 -32 33 48 22 -33 43 88 -71 75 123 232 -19 42 20 -33 49 -102 -352 130 -237 36 -82 24
3492 24 -193 -219 169 110 87 -301 -294 77 -381 -103 -328 -7 176 69 52 71 -108 53 -181 -144 -125 209 12
3515 12 85 -175 19 154 34 192 49 -132 27 -64 94 -167 85 -26 158 -62 218 99 -56 181 -169
3536 -169 83 68 -62 -37 77 -20 -20 -67 -209 19 102 -35 258 55 57 330 -95 36 16 43 -175 -135 55 -74
3560 -74 -105 -32 174 -58 -75 -171 -18 -82 -307 -13 -58 -292 2 86 96 -119 -151 82 -104 -6 42 -203 -56 -90
3584 -90 -150 -187 -212 -339 174 142 21 88 -178 -75 -21 180 37 -31 140 0 -49 -50 1 -205 -205 -30 58 -25 -7 111
3610 111 -300 -263 234 32 86 -147 65 28 136 89 4 -59 218 -37 -125 50 -77 55 -96 -93 -127 220 103
3633 103 -103 11 128 240 93 144 -45 121 -93 33 65 -52 0 225 278 59 -40 -12 -275 -328 29 67 -52
3656 -52 2 32 -154 -92 -438 96 -131 77 100 5 33 -21 -206 -238 -9 -296 -93 -95 -67 79 194 -107 -69 -83 -109
3681 -109 -20 -51 185 -47 108 190 -138 -28 66 138 -305 -254 -2 -233 26 194 -180 -235 -295 258 73 -108 111
3704 111 61 44 -7 85 -114 -16 -55 64 -81 -98 -16 -81 -161 -13 135 -108 66 139 -67 -108 128 132 97 -10 -228
3729 -228 214 24 2 271 92 -146 -214 7 83 -80 37 11 -98 -141 339 32 389 144 -63 81 2 82
3751 82 -136 64 72 -134 -53 324 -211 121 31 94 96 67 90 55 -35 -207 54 12 -96 -204 19 -76 37 -109 56
3776 56 54 59 94 16 58 72 -219 -156 143 -220 -220 28 -122 -146 -95 -284 99 -99 115 -160 -39 -301 -29 -218 -228
3801 -228 -33 225 -65 -179 -40 21 126 54 5 166 -94 149 33 163 70 -24 -131 541 146 -31 17 -72
3823 -72 256 92 -100 316 109 -581 116 214 52 -164 134 61 -119 -151 321 277 -102 55 -18 100 -146 -128
3845 -128 75 -85 133 -38 78 158 -31 14 -47 -181 -158 -86 -45 7 -80 -192 102 -120 7 228 -142 50 -154
3868 -154 -39 224 -75 254 29 -61 -19 35 16 -162 -111 -99 343 144 -26 -73 47 15 21 262 37 -76 195
3891 195 -138 23 102 10 249 431 38 26 -106 -179 8 -46 26 110 -30 49 -60 -200 -88 56 -6 -136 24
3914 24 80 -60 135 -142 -77 6 -225 -44 -237 22 139 -4 116 273 -36 95 -3 -95 91 103 25 -96 99
3937 99 -186 -107 196 -4 -174 25 -109 334 233 87 -107 -63 -178 -44 98 -94 -63 -267 -55 -274 190
3958 190 45 -57 -70 -129 233 59 -117 -167 5 -78 76 38 -176 -119 -72 -13 111 180 -100 -51 19 139 59 -113
3982 -113 -189 205 97 56 125 97 206 1 19 71 151 -44 64 -22 81 -9 116 -30 194 -68 295 71 -151
4005 -151 346 -117 -58 -92 -210 -62 234 18 26 -186 185 -121 117 -73 -72 159 103 63 99 91 2 361 237 -91
4029 -91 -18 -47 -47 183 62 56 -7 110 -117 305 -94 -25 -156 -115 90 -101 -99 -167 -132 -270 274 -75 -136 112 -56
4054 -56 -7 47 -74 147 -8 -30 138 333 -69 87 82 164 124 -299 31 -12 296 -54 36 -207 -115 -120 -239 -23
4078 -23 -34 64 49 169 -179 138 -113 -40 -21 -61 -14 231 132 192 261 100 -267 -37 337 -156 117 -27 251 143
4102 143 29 260 135 114 71 -19 -76 52 -64 -93 55 -19 -48 -35 198 -139 -102 -39 272 -100 -55 -113 -92 182
4126 182 83 -259 163 -90 -186 -140 -159 -11 20 26 78 39 -190 -73 -22 4 61 -245 -155 -3 -213 182 225 2 88
4151 88 -115 113 162 50 80 -175 138 -156 291 -133 97 185 -173 141 -96 260 -118 60 -11 12 32 36 72
4174 72 -102 31 24 73 -177 78 -177 -118 -89 214 -254 -66 51 -2 -6 106 110 -76 237 162 16 4 -19 109 -103
4199 -103 -48 -4 -82 128 -220 339 -236 11 -99 104 -40 -19 70 -21 -111 -151 -72 -33 113 158 -15 -63 -113 -27 146
4224 146 -76 -2 166 -19 -37 190 -85 -97 5 -178 167 -46 -143 151 116 284 28 -46 83 37 126 205 115
4247 115 -93 70 112 25 151 249 285 9 96 28 94 -54 -12 19 -252 152 -68 -140 199 149 92 41 -211 278
4271 278 132 259 8 135 146 147 33 284 -78 -29 306 -161 -27 -99 -53 -9 11 176 -57 -446 -57 84 -16
4294 -16 -94 -49 142 348 38 -269 67 262 -141 15 36 126 139 -146 -291 -249 348 219 -108 13 -220 -46
4316 -46 105 17 -89 140 -23 -92 110 233 -47 -258 -259 -196 -5 -175 -17 196 130 -7 -28 -120 36 -42 247
4339 247 -128 134 287 -36 -430 -46 -27 23 -9 -149 -81 110 -192 184 -151 -77 183 137 -33 -160 61 -41
4361 -41 155 270 -3 -59 138 -59 82 -278 -120 41 416 332 50 -203 -175 111 15 152 -152 -63 -123 -16
4383 -16 34 40 138 -19 -96 46 -177 143 -256 -26 102 117 -87 26 -22 -20 -60 14 -14 -61 -71 -9 -53 7 41 -198
4409 -198 -137 -138 -67 259 161 -24 -66 -27 -42 -49 187 -25 -2 -124 -104 85 25 -85 217 -86 -164 289 64 95 -121
4434 -121 74 -80 64 145 50 140 -106 -90 -83 -101 -230 -9 137 -6 92 107 -26 74 -189 34 30 -149 -78 -196
4458 -196 -72 -11 88 148 44 49 -33 -208 -225 -15 -67 284 14 -128 -99 165 -72 -66 -39 37 2 -5 78 -57 60 -308
4484 -308 80 -257 210 118 -37 84 -51 -206 -82 -22 20 -277 238 -195 11 -209 -93 -207 351 142 -194
4505 -194 335 -53 74 84 -65 -125 -85 64 36 -505 66 -53 -95 187 -123 -224 -41 133 137 -182 30 116 220
4528 220 -185 -176 142 45 126 70 26 65 -34 -149 50 -79 -213 -167 107 135 74 -91 -252 -36 46 376 186 284
4552 284 142 -88 -316 163 153 -261 186 -124 21 -118 33 -102 124 -91 -280 296 -87 42 -14 -86 -16
4573 -16 267 -176 79 271 18 -95 -265 -16 -91 196 47 -124 186 63 -277 -14 19 -77 -29 -24 165 193 92
4596 92 -180 144 -157 -163 -46 20 19 19 275 -6 -50 9 217 84 -61 146 -73 -88 83 -21 -48 -232 -194 -92
4620 -92 -223 16 -149 -129 -152 145 -126 141 64 105 235 193 15 -38 33 -149 -8 -61 2 174 32 166 58
4643 58 130 19 -157 -59 52 24 40 -266 -182 -76 -130 -335 -74 142 -39 -3 -71 56 -113 -58 -174 -18 -191
4666 -191 -249 -63 11 -85 -125 90 -215 88 -103 -110 -101 -53 70 -46 -158 -31 213 53 162 102 -49 36 48 -126
4690 -126 373 88 59 -257 251 -2 21 229 36 12 63 168 122 -94 -142 30 194 200 84 -109 253 127 -196
4713 -196 303 -50 -39 -134 -319 -28 -97 202 261 -173 22 80 9 0 178 -319 -51 78 -80 34 103 119 105 -68
4737 -68 15 58 -177 -51 82 -168 125 -56 58 41 163 -120 111 -130 -337 134 86 -73 94 -96 -64 -106
4759 -106 -108 -26 80 -48 -111 -125 -75 136 -16 162 -54 -16 -400 -122 -69 159 84 -6 -35 159 -14 -49 135 -33
4783 -33 25 105 -13 -198 -14 176 -41 111 -103 -111 -67 -25 85 -236 -67 58 186 44 -86 -2 9 86 291
4806 291 60 -31 41 -25 16 -77 -132 -184 -53 41 -110 32 17 103 -142 19 -41 -133 160 -8 24 -29 104 166 -34
4831 -34 -152 -78 -309 -1 -119 -133 -16 -103 -229 102 200 130 228 113 -36 -237 87 -121 60 -258 83 -197
4853 -197 144 -35 -114 -198 21 -192 -27 3 -24 -158 -308 -136 -2 -194 -80 172 -185 -196 56 -50 54 200
4875 200 -157 128 -201 -78 108 -180 -63 52 -83 -7 -29 -5 106 122 8 82 -7 -76 25 166 49 20 10
4898 10 62 85 146 -11 115 -147 185 167 -186 -70 96 -111 -189 -85 46 -51 188 132 -231 -23 395 101 -48
4921 -48 220 47 134 -51 -81 55 214 339 98 -132 1 -99 172 186 272 -7 -153 -29 156 -185 -215 -140
4943 -140 -39 -60 73 -156 37 -57 -31 240 110 130 178 316 63 -35 -27 -130 -153 -144 -322 116 22 64 -53 -3 -53
4968 -53 -52 238 62 76 -237 -106 -44 -91 -58 45 110 5 -32 72 64 227 20 -60 -80 -90 109 -163 113 36 -14
4993 -14 204 151 -24 123 -105 -11 62 -115 -12 -99 -127 134 -84 -78 -266 171 -130 23 -42 -57 -19 -7 -163 -175
5017 -175 1 -167 -117 -121 116 3 44 -227 -101 33 -140 25 -125 -64 194 11 124 -35 -113 44 -27 -125 104
5040 104 41 170 -193 70 -96 -68 -141 103 54 -241 -27 -137 18 -21 -222 -78 -120 -25 120 40 256 7 -140
5063 -140 73 87 125 -112 255 39 195 46 -43 -175 -63 -27 50 -49 -34 -88 51 -85 55 143 18 233 88
5086 88 -176 28 -224 -147 -126 106 32 71 -132 -182 -4 -97 -18 136 60 2 100 10 -69 57 -11 44 32 34 -143 -7
5112 -7 -92 177 -239 -191 112 -15 -72 -118 -139 201 -55 213 7 -85 178 17 109 -52 4 181 25 -106 -8 94
5136 94 187 -103 -327 129 -193 -141 112 0 75 -214 281 95 -14 128 -9 16 -62 156 -203 170 -96 -155
5158 -155 -64 62 -117 26 174 25 -263 -279 -104 11 302 75 -133 -44 37 70 111 295 76 -143 -32 4
5180 4 -135 237 155 -80 150 128 290 -47 -38 -27 -120 -189 84 -81 -145 -271 -281 -50 -245 61 2 -113 34 -11
5204 -11 -95 -159 35 147 -336 -113 -88 71 63 -131 -191 -112 -202 -109 59 -185 112 -172 -306 -47 68 -22 -82 -41
5228 -41 106 177 -9 108 -14 -193 65 39 46 -3 56 -185 34 188 -47 -84 -35 -122 65 128 -78 -148 178 -87
5252 -87 132 8 -61 56 157 206 -1 -36 -49 -141 -23 182 -108 84 -15 -114 -177 -103 -43 -65 -78 46 -280 212
5276 212 114 0 69 24 37 97 -111 122 11 -55 273 -160 -162 -32 -89 99 0 -147 178 340 -398 187 -104
5299 -104 73 -45 -327 237 -179 -112 11 152 -251 -240 -167 -182 -24 -99 -127 -10 225 -41 262 126 146 -145
5321 -145 -193 65 30 -158 263 21 -126 221 -152 -4 -123 174 -195 -163 -105 -183 -82 -65 169 68 -45 124
5343 124 21 24 144 182 -152 306 23 -191 70 147 -74 80 -278 133 -80 27 147 -124 -54 66 6 62
5365 62 -39 99 99 -24 132 -64 -232 -28 86 -9 -62 19 -56 -98 135 -48 -29 -163 61 84 115 -345 196 -262
5389 -262 114 -140 -27 -119 -230 -171 -164 158 293 213 23 -10 -60 160 170 95 28 195 -179 -345 106 86 19 50
5413 50 207 1 35 161 -84 75 3 100 108 -34 97 -90 -93 -57 -305 117 -13 -70 29 -41 94 -74 55 95
5437 95 115 -79 124 25 122 109 40 -25 243 85 -57 12 -181 -35 12 93 1 115 21 115 3 -138 27 -107
5461 -107 32 -3 32 -25 207 16 15 -150 -193 -143 -11 -18 -13 -24 -47 -233 143 88 -168 -75 -76 -119 -137 134 -200 -135 -94
5488 -94 3 -137 -36 -61 29 208 5 -114 131 29 -220 -17 168 -51 -18 -67 79 -17 8 110 228 59 174
5511 174 -88 -102 -268 257 48 -157 186 -272 -93 42 37 76 -90 -138 15 84 -76 131 -170 131 -95 148
5533 148 -12 -91 -105 85 -8 -53 -42 -194 189 -213 -274 -207 16 -109 107 -136 -125 -19 148 -43 232 -61 -177
5556 -177 239 -1 -291 15 -63 -3 235 -113 84 -108 127 -164 -191 -56 -104 -143 -25 -172 158 85 -74 143
5578 143 72 -48 -9 -229 -99 -165 221 -89 34 0 -143 62 -155 -37 -89 -151 -32 132 163 -15 -61 -113 100
5601 100 275 -143 -137 -392 202 209 79 15 174 168 -87 189 -34 -1 163 1 -256 -9 148 -57 179 44 -19
5624 -19 207 74 20 -16 42 117 4 -81 -56 212 -110 -73 155 -60 -20 -61 81 -77 -77 -134 -159 99 25 -16 117
5649 117 136 21 85 197 -223 -24 -43 -122 9 7 26 206 -85 -21 -339 120 -173 176 110 67 21 -63 171 -309
5673 -309 19 109 157 -35 -78 275 -49 -258 -262 -81 227 0 -146 -283 -93 135 91 133 -83 39 -168 88
5695 88 357 40 22 -92 86 52 -261 -14 -40 235 -12 86 153 79 98 -112 213 29 81 -137 3 182 37
5718 37 50 -28 -157 25 -232 145 125 20 149 -30 242 9 -33 167 -173 -148 -132 -295 224 233 -6 181 52
5741 52 77 -13 -120 -4 -54 71 -214 232 -2 173 173 86 164 -256 -55 115 -134 -22 19 52 53 26 -292 -130
5765 -130 -110 90 65 -51 286 -48 11 -160 130 -37 158 -171 -109 -5 -105 171 29 9 -70 -281 160 -321
5787 -321 15 -22 -82 -60 50 -117 -15 -223 134 116 149 230 -145 -174 28 -80 145 -2 -68 -194 43 -16 -89
5810 -89 -18 245 -409 -66 51 66 69 38 -33 -302 -277 -24 43 -275 164 -182 128 76 -158 85 245 75 15 -136
5834 -136 -113 6 297 24 128 -104 -114 -81 232 -75 389 -94 -359 162 103 -72 -271 145 380 -236 125
5855 125 53 14 45 -120 -13 -52 203 12 84 43 51 143 77 -118 89 120 -32 91 46 26 -49 194 -95 39 350
5880 350 -88 -83 -42 -217 -1 199 238 -82 82 -52 39 -53 137 -51 16 -264 -27 -107 70 -283 -120 -19 -254
5903 -254 36 278 210 -6 -44 -263 188 -62 101 -266 -72 66 126 -10 -212 198 250 -91 -135 98 -27 45
5925 45 63 -205 69 30 181 145 -103 -81 96 -198 22 121 31 281 -38 74 -315 -123 180 -165 60 -167
5947 -167 -191 104 6 -324 -4 10 238 -41 156 -27 59 -152 -1 -244 -26 -354 43 -165 -98 23 -22 -157
5969 -157 -54 28 -167 -81 137 93 -213 55 151 245 -170 207 -267 61 199 -8 125 300 60 207 159 46
5991 46 -31 204 62 -171 -56 104 -128 53 123 -267 -43 12 125 24 -236 -250 -219 -99 12 210 1 -35
6013 -35 30 118 139 -150 -209 -15 -24 -86 81 124 -111 316 182 -177 -9 16 -34 121 -136 -63 125 -133 -143 -27
6037 -27 -131 -26 -176 -46 94 81 105 78 -36 127 57 133 127 -130 -60 -37 115 109 -18 -154 -186 -185 83 2 -180
6062 -180 -13 33 149 96 22 -35 -112 10 74 30 -149 138 -67 128 66 279 -39 120 42 119 116 141 354 -49
6086 -49 -124 82 -227 13 -203 -221 -78 -160 -138 218 120 -222 98 65 20 163 19 -90 -67 -97 -112 75 49 118
6110 118 96 217 -31 30 -87 -82 58 -197 279 34 11 -278 16 0 79 -46 -32 -7 120 -96 70 91 -208
6133 -208 5 110 109 -71 -163 284 -128 -110 -16 -139 -42 -178 213 204 -12 239 -151 79 78 30 -142 109 -43 136
6157 136 188 -89 -123 174 -58 11 -173 -15 50 -256 -156 85 246 -154 -76 12 76 51 -97 -183 -124 138 -88
6180 -88 -76 256 -127 -100 47 14 -89 171 69 -91 -156 86 -60 -27 311 -87 -70 94 -281 263 264 -101 -27
6203 -27 -4 -21 47 -8 66 181 35 -125 -89 -92 -122 219 -143 -80 -218 -74 -9 -67 -19 117 222 -48 124 147 -105
6228 -105 3 179 -86 307 19 252 185 -183 -30 50 -111 -140 175 15 -57 -189 -403 131 -78 136 28
6249 28 -27 -62 166 32 176 -63 139 -23 -23 31 -359 25 -147 61 38 -23 -116 164 -41 -32 -51 -285 44 41 -214
6274 -214 53 -12 114 -143 74 -53 -31 199 283 316 35 -6 -43 12 221 0 232 -105 65 -86 -115 54 104
6297 104 121 68 -108 27 93 310 -74 -200 62 -7 7 -293 171 -24 152 378 246 115 188 -118 250 104
6319 104 141 -14 12 301 -182 264 -12 -87 -142 16 63 -178 -177 -220 33 35 22 -1 55 10 91 -81 193 129 163 -46
6345 -46 42 253 -139 231 -42 -148 -8 142 168 173 -151 68 -120 59 9 -184 101 322 163 200 -44 -29 63
6368 63 -47 -26 -17 -132 -292 53 13 -10 42 -232 103 -243 -52 -145 -113 224 27 203 -419 -11 -10 17 137 168
6392 168 -213 -85 3 19 -318 -86 -124 102 166 -240 9 16 253 -84 -19 -30 -147 93 112 -157 44 101 306
6415 306 130 -245 262 137 -8 24 -210 -35 184 175 -81 32 20 174 109 -223 -31 150 88 50 -44 31 165
6438 165 78 -231 176 270 91 104 -169 190 -115 25 -202 -192 150 -209 216 -45 -97 115 -159 81 48 -23
6460 -23 133 -93 216 87 -79 -159 211 19 -85 -56 -127 -165 13 295 -71 -94 -282 -23 24 224 -37 60 145
6483 145 -42 132 -6 -34 -70 -21 38 -199 2 -45 -106 -39 -319 52 17 -156 -278 17 280 -57 -94 106 65
6506 65 -87 -73 93 -450 -151 93 150 80 -40 -174 -64 45 -118 -11 177 49 104 81 -232 77 -78 -145
6528 -145 93 -110 -96 -157 -195 -91 -42 -348 -82 -141 -22 -26 -75 63 90 -191 -289 -62 143 9 -205 23 148
6551 148 81 40 -16 2 454 24 -5 -161 -117 136 -44 160 188 76 54 -58 153 26 295 -220 8 129 -17
6574 -17 94 68 -194 -97 -128 61 125 83 10 -146 -85 135 201 -169 36 136 180 33 -34 -24 -234 -218 61 74 135
6599 135 -8 -132 270 -263 -167 -124 46 164 45 -183 24 -206 131 57 17 -18 -310 -153 -75 -77 -26 -25 -226 101
6623 101 -212 191 -8 -28 -147 30 -30 119 327 -78 202 55 -58 87 95 -54 39 -30 -23 -73 225 -135 -4
6646 -4 81 -131 -183 -291 -11 -98 -80 -71 -72 -26 -187 70 66 -97 323 38 -24 -219 88 164 -303 -31 -226 187 24
6671 24 -7 -148 72 148 149 22 112 -103 48 242 -59 118 90 191 60 -93 155 124 -304 -37 -90 115 -41
6694 -41 -232 7 -202 -31 -34 -21 -174 -158 190 32 -253 81 -154 191 74 -14 -255 74 181 -15 70 70 -123
6717 -123 -19 -39 38 144 2 91 111 117 -55 162 -68 -140 -7 46 138 92 43 291 8 129 -132 -378 -27 379
6741 379 174 144 22 96 -108 -47 140 86 -134 158 -18 157 297 -168 139 -34 -95 -27 -26 -52 62 -5 45 109
6765 109 -46 35 13 -130 58 -117 36 -358 -4 -47 223 23 70 -5 291 -39 -83 69 -3 198 52 -205
6787 -205 -7 30 33 168 -40 -159 68 302 323 107 -92 90 -207 57 -76 95 89 -190 55 -153 -40 57
6809 57 -256 79 -9 211 26 -2 -188 137 129 -137 95 245 -95 -173 40 -77 -49 57 -134 89 119 -83 123
6832 123 43 -3 245 12 -95 204 108 51 -137 -164 -59 -35 283 40 73 10 91 109 -97 261 95 256 231 -81
6856 -81 10 -55 82 68 -226 -118 14 146 62 56 226 30 -155 36 -7 173 -95 83 -149 -72 172 1 52
6879 52 -87 -25 28 -55 52 131 -80 -194 -75 191 -171 140 194 13 141 147 -24 130 59 -142 8 -115 93
6902 93 -178 106 19 171 50 25 -110 30 -150 -293 -65 100 110 194 205 87 113 -10 269 -10 -98 128 208
6925 208 -63 -99 1 -303 -280 -90 159 45 -247 -154 -167 -40 94 -204 271 -15 33 115 -208 -106 7 275
6947 275 367 -15 66 134 -123 115 -22 -40 -9 106 244 204 -47 173 177 -335 -50 64 117 -37 -181 8 -149
6970 -149 210 -71 -65 3 83 -152 306 9 27 33 -89 -71 72 28 -31 -125 188 -148 -290 72 160 104 15 -28 -23 -179
6996 -179 132 -102 -87 136 -18 63 296 104 41 365 107 -93 -88 -81 153 39 -37 27 21 -212 -67 95 43 -321
7020 -321 272 224 6 -41 -99 92 120 -174 -11 95 260 -12 112 128 27 235 61 139 -257 245 -50 84
7042 84 75 134 -131 23 187 -11 105 -216 162 174 143 -61 12 42 112 6 87 -112 -211 27 -77 -74 148 -7
7066 -7 43 -25 288 267 -63 -6 36 -179 167 -4 -193 131 -203 170 -149 41 59 -166 123 168 -64 109 -54
7089 -54 105 2 15 65 -160 8 -163 0 86 -133 141 -95 -147 -62 -226 -22 59 138 -15 241 -27 81 -3
7112 -3 266 19 69 -10 -19 52 167 175 -53 -53 110 80 123 42 -215 196 -83 -45 173 14 44 30 68 -23 120 224
7138 224 -181 137 -221 223 -46 54 -190 103 537 -74 97 74 15 126 16 32 1 -11 217 -64 2 -17
7160 -17 -276 98 49 32 33 -136 101 55 334 -110 75 -115 -87 -75 -146 -312 6 -4 -22 161 132 156 -94 151
7184 151 -18 127 -34 -90 42 91 298 217 11 0 -16 196 123 -155 -22 -114 -47 -190 -49 20 -46 61 -13 4
7208 4 -96 -216 40 -17 34 -117 -200 85 316 154 80 -99 -19 -58 -77 152 -145 9 -1 107 -2 -32 -54 242
7232 242 36 60 182 217 -92 -175 -264 -191 39 66 -146 227 -104 -83 82 3 -11 -110 18 -182 144 -269 184
7255 184 -17 -244 158 102 256 -154 -285 41 -96 -115 257 -12 -52 73 -136 151 95 -107 70 -49 -196
7276 -196 -81 -230 -21 -64 -200 10 -2 69 166 67 -316 -253 166 -71 30 -108 142 26 -112 -25 78 148 -104
7299 -104 103 -89 96 -229 85 253 191 -148 -11 61 -264 211 -230 -65 -295 -33 70 215 -105 14 52
7320 52 98 -71 -35 -151 307 19 -52 34 -194 -89 -39 -223 -116 54 178 -12 -90 187 49 90 -49 -272 -39
7343 -39 132 141 1 -96 -83 -52 108 269 -288 153 -100 -81 352 173 226 -119 -77 -26 31 31 136 -106 240 22
7367 22 -20 -280 -173 38 -52 96 -81 201 78 -196 103 150 -167 212 80 -104 20 -174 0 105 -83
7388 -83 -83 -140 114 214 45 50 -93 -201 2 188 -5 -208 -62 -128 16 118 -101 186 36 146 -46 186
7410 186 -42 -111 -121 -102 204 -22 -36 18 -84 207 183 104 -15 -62 -76 19 17 -62 -109 -31 56 -11 -39 -128 -7 14 -84
7437 -84 10 -90 -72 0 -85 10 -149 -80 48 -66 -147 -123 -130 -234 -19 -152 -53 -58 67 74 -55 -131 -35 32 -61 12 32
7464 32 191 -21 41 -124 53 66 25 -104 -126 -138 -156 -80 48 -223 -40 -214 -25 -45 130 55 41 -40 -77 -106 -172
7489 -172 -78 -45 189 147 -129 -89 66 42 -91 36 100 17 -149 -102 -184 -143 -45 116 -131 5 -87 -95 -72 -129 191
7514 191 35 -27 248 128 6 88 -71 -215 28 -200 76 179 336 -41 -159 37 208 140 -98 -45 14 9
7536 9 74 43 50 -122 -107 -37 259 -119 -155 -189 -82 -51 -179 -230 -122 -69 -57 46 -21 240 95 36 53 -42 165 76
7562 76 125 192 36 -29 -23 220 215 -60 168 -103 232 82 -175 133 -189 57 -157 -275 -50 66 151 -185 -235
7585 -235 115 -161 -29 38 215 -108 -98 -60 97 -156 -322 43 250 -77 249 -70 38 -1 93 91 -49 -38 -161
7608 -161 402 226 163 -24 173 131 -178 46 -195 -359 -59 -114 -83 93 -57 -160 -48 23 -205 -3 -163 -114
7630 -114 64 -9 -114 -193 -39 -163 -330 -212 16 -53 27 -15 110 85 206 118 215 59 361 173 -45 -91 162
7653 162 68 -92 12 -62 270 188 -71 61 -14 74 78 -179 -112 3 -111 39 -98 138 -73 126 -87 54 -81
7676 -81 82 51 -73 -14 40 -249 16 -65 281 57 -25 38 -333 125 -129 217 -262 61 120 -352 92 172 51
7699 51 62 -78 -6 -113 174 7 74 -10 218 71 -8 117 -9 54 -38 -185 130 -285 47 43 -167 -135 -30 -53
7723 -53 270 -35 -13 37 191 -45 -45 -116 -40 -63 -299 -110 11 103 -156 29 73 -113 143 -257 -64 -147 -78 262
7747 262 137 143 107 64 83 -116 153 69 -38 -41 57 159 132 -160 12 86 88 -104 145 -105 54 48 -76 54 -11
7772 -11 189 164 27 -55 201 19 153 19 -242 21 -175 121 0 -63 35 -130 -80 65 123 91 -23 98 259
7795 259 105 -48 -20 10 -173 -124 -17 -33 -20 66 152 205 57 13 -28 46 -14 75 137 -29 -195 -5 130 23 224
7820 224 34 -299 93 183 197 109 267 -85 143 -109 160 -192 193 56 139 26 -139 251 -134 458 -94
7841 -94 -135 249 111 146 -226 121 -160 153 283 -54 10 -73 -79 -106 5 128 -23 188 -185 -291 45 -125 -138
7864 -138 130 170 145 34 16 -57 46 37 -107 -78 -180 35 36 112 -123 -209 103 -4 43 -113 -29 254 52 16 -65
7889 -65 -48 223 -12 -150 9 71 -19 139 -230 -17 -21 -198 -13 -17 -185 -47 287 -30 12 -226 -193 -104 92 47
7913 47 -33 -126 -67 35 -57 151 -16 206 126 -9 -190 164 -65 -96 -26 -16 173 204 4 199 62 -315 -81
7936 -81 20 65 150 -91 5 -198 266 30 -7 48 160 -5 47 -235 -227 -104 181 236 -236 -89 -32 -14 -352 -153
7960 -153 54 -41 2 299 -14 77 -128 -45 43 171 -87 -214 40 -23 112 40 -29 48 118 -311 -213 67 198 25
7984 25 51 214 29 -73 24 -123 220 35 -64 144 -48 -133 -156 -33 312 20 132 -127 95 166 72 202 -256
8007 -256 -39 223 -209 -80 -117 -71 -34 71 -161 -25 -25 22 215 23 40 135 -267 166 -138 -220 129 -16 143
8030 143 56 -32 159 110 6 -60 -63 -142 -181 -383 -297 -234 94 183 105 39 111 -126 10 9 -143 -27 90 -6 -52 0
8056 0 224 306 -152 144 -52 -308 -93 56 41 60 166 -121 126 105 80 311 -5 -15 -146 34 -164 -200 -102
8079 -102 98 294 31 4 -176 99 -159 -187 190 -159 -120 65 217 -428 -112 -179 30 133 -40 167 -88
8100 -88 31 29 -158 -48 -80 70 -11 221 -48 -110 172 -52 -66 220 273 222 -5 147 162 188 -223 0 -32 -53
8124 -53 451 -47 21 149 -95 -63 58 -242 36 -38 -219 20 -253 157 27 -127 121 -105 -16 -54 -409 124
8146 124 65 -87 22 99 -123 8 81 21 75 93 -48 198 23 25 -51 1 313 -105 43 -83 -4 102 -124 65
8170 65 241 -62 -63 16 -137 96 205 -18 41 -130 210 223 52 -60 14 169 -151 244 126 -226 189
8191A89
##END NTUPLES=NMR FID
##END=
