##TITLE=1H_Pr SucEt2
 CD3OD, 8 sc, 
 11.06.2021
##JCAMPDX= 6.0         $$ Bruker NMR JCAMP-DX V2.0
##DATA TYPE= NMR FID
##DATA CLASS= NTUPLES
##ORIGIN= UXNMR, Bruker Analytische Messtechnik GmbH
##OWNER= root
$$ XWIN-NMR		Version 3.5
$$ Fri Jun 11 13:13:01 2021 Russian Standard Time (UT+4h)  she@DPX200
##.OBSERVE FREQUENCY= 200.131506
##.OBSERVE NUCLEUS= ^1H
##.DELAY= (6, 6)
##.ACQUISITION MODE= SIMULTANEOUS
##.ACQUISITION SCHEME= undefined
##.AVERAGES= 8
##.DIGITISER RES= 18
##SPECTROMETER/DATA SYSTEM= spect
##.PULSE SEQUENCE= zg30
##.SOLVENT NAME= MeOD
##.SHIFT REFERENCE= (INTERNAL, MeOD, 0, 15.7039)
##AUDIT TRAIL= $$ (NUMBER, WHEN, WHO, WHERE, WHAT)
$$ ##TITLE= Audit trail, XWIN-NMR		Version 3.5
$$ ##JCAMPDX= 5.01
$$ ##ORIGIN= Bruker BioSpin GmbH
$$ ##OWNER= she
$$ F:/spectra/data/she/nmr/H-F/1/audita.txt
$$ ##AUDIT TRAIL=  $$ (NUMBER, WHEN, WHO, WHERE, WHAT)
(   1,<2021-06-11 13:11:28.68 +0400>,<she>,<DPX200>,
      <created by zg, POWCHK disabled, PULCHK disabled
       configuration hash MD5:
       00 E9 B6 7A A2 85 ED C7 34 08 36 98 17 FE 4E 26
       data hash MD5: 16K
       94 7C 0C F0 04 01 5E F3 30 9B 42 89 14 63 B1 70>)
$$ ##END=
$$ 
$$ hash MD5
$$ BC F1 C1 62 7B C1 DE 32 CF A1 20 F6 EF BC 0A 02
##$RELAX= 
##$RELAX= 
##$RELAX= 
##$RELAX= 
##$RELAX= 
##$RELAX= 
$$ Bruker specific parameters
$$ --------------------------
##$DU= <F:/spectra>
##$EXPNO= 1
##$NAME= <H-F>
##$PROCNO= 1
##$TYPE= <nmr>
##$USER= <she>
##$AMP= (0..31)
100 100 100 100 100 100 100 100 100 100 100 100 100 100 100 100 100 100 
100 100 100 100 100 100 100 100 100 100 100 100 100 100 
##$AQSEQ= 0
##$AQ_mod= 1
##$AUNM= <au_zg>
##$AUTOPOS= <>
##$BF1= 200.13
##$BF2= 200.13
##$BF3= 200.13
##$BF4= 200.13
##$BF5= 200.13
##$BF6= 200.13
##$BF7= 200.13
##$BF8= 200.13
##$BYTORDA= 1
##$CFDGTYP= 0
##$CFRGTYP= 5
##$CHEMSTR= <none>
##$CNST= (0..31)
1 1 145 1 1 1 1 1 1 1 1 1 1 1 1 1 1 1 1 1 1 1 1 1 1 1 1 1 1 1 1 1 
##$CPDPRG= <>
##$CPDPRG1= <>
##$CPDPRG2= <>
##$CPDPRG3= <>
##$CPDPRG4= <mlev>
##$CPDPRG5= <mlev>
##$CPDPRG6= <mlev>
##$CPDPRG7= <mlev>
##$CPDPRG8= <mlev>
##$CPDPRGB= <>
##$CPDPRGT= <>
##$D= (0..31)
0 1.2 0 0 0 0 0 0 0 0.06 0 0.03 0 0 0 0 0.0002 0 0 0 0 0 0 0 0 0 0 0 0 
0 0 0 
##$DATE= 1623402688
##$DBL= (0..7)
120 120 120 120 120 120 120 120 
##$DBP= (0..7)
150 150 150 150 150 150 150 150 
##$DBP07= 0
##$DBPNAM0= <>
##$DBPNAM1= <>
##$DBPNAM2= <>
##$DBPNAM3= <>
##$DBPNAM4= <>
##$DBPNAM5= <>
##$DBPNAM6= <>
##$DBPNAM7= <>
##$DBPOAL= (0..7)
0.5 0.5 0.5 0.5 0.5 0.5 0.5 0.5 
##$DBPOFFS= (0..7)
0 0 0 0 0 0 0 0 
##$DE= 6
##$DECBNUC= <off>
##$DECIM= 32
##$DECNUC= <off>
##$DECSTAT= 4
##$DIGMOD= 1
##$DIGTYP= 9
##$DL= (0..7)
0 120 120 120 120 120 120 120 
##$DP= (0..7)
150 150 150 150 150 150 150 150 
##$DP07= 0
##$DPNAME0= <>
##$DPNAME1= <>
##$DPNAME2= <>
##$DPNAME3= <>
##$DPNAME4= <>
##$DPNAME5= <>
##$DPNAME6= <>
##$DPNAME7= <>
##$DPOAL= (0..7)
0.5 0.5 0.5 0.5 0.5 0.5 0.5 0.5 
##$DPOFFS= (0..7)
0 0 0 0 0 0 0 0 
##$DQDMODE= 0
##$DR= 18
##$DS= 0
##$DSLIST= <SSSSSSSSSSSSSSS>
$$ [...]
##$SUBNAM2= <"">
##$SUBNAM3= <"">
##$SUBNAM4= <"">
##$SUBNAM5= <"">
##$SUBNAM6= <"">
##$SUBNAM7= <"">
##$SUBNAM8= <"">
##$SUBNAM9= <"">
##$SW= 20.0188882624521
##$SWIBOX= (0..15)
0 0 2 0 0 0 0 0 0 0 0 0 0 0 0 0 
##$SW_h= 4006.41025641026
##$TD= 16384
##$TD0= 1
##$TE= 0
##$TE2= 300
##$TE3= 300
##$TEG= 300
##$TL= (0..7)
0 120 120 120 120 120 120 120 
##$TP= (0..7)
150 150 150 150 150 150 150 150 
##$TP07= 0
##$TPNAME0= <>
##$TPNAME1= <>
##$TPNAME2= <>
##$TPNAME3= <>
##$TPNAME4= <>
##$TPNAME5= <>
##$TPNAME6= <>
##$TPNAME7= <>
##$TPOAL= (0..7)
0.5 0.5 0.5 0.5 0.5 0.5 0.5 0.5 
##$TPOFFS= (0..7)
0 0 0 0 0 0 0 0 
##$TUNHIN= 0
##$TUNHOUT= 0
##$TUNXOUT= 0
##$USERA1= <user>
##$USERA2= <user>
##$USERA3= <user>
##$USERA4= <user>
##$USERA5= <user>
##$V9= 5
##$VALIST= <valist>
##$VCLIST= <CCCCCCCCCCCCCCC>
##$VD= 0
##$VDLIST= <DDDDDDDDDDDDDDD>
##$VPLIST= <PPPPPPPPPPPPPPP>
##$VTLIST= <TTTTTTTTTTTTTTT>
##$WBST= 1024
##$WBSW= 4
##$XGAIN= (0..3)
0 0 0 0 
##$XL= 0
##$YL= 0
##$YMAX_a= 302243
##$YMIN_a= -313203
##$ZGOPTNS= <>
##$ZL1= 120
##$ZL2= 120
##$ZL3= 120
##$ZL4= 120
##$ABSF1= 10
##$ABSF2= 0
##$ABSG= 5
##$ABSL= 3
##$ALPHA= 0
##$AQORDER= 0
##$ASSFAC= 0
##$ASSFACI= 0
##$ASSFACX= 0
##$ASSWID= 0
##$AUNMP= <proc_1d>
##$AZFE= 0.1
##$AZFW= 0.1
##$BCFW= 1
##$BC_mod= 2
##$BYTORDP= 1
##$COROFFS= 0
##$CY= 11.3945322036743
##$DATMOD= 1
##$DC= 2
##$DFILT= <>
##$DTYPP= 0
##$F1P= 15.9154993809931
##$F2P= -4.1035820241983
##$FCOR= 0.5
##$FTSIZE= 0
##$FT_mod= 4
##$GAMMA= 1
##$GB= 0.15
##$INTBC= 1
##$INTSCL= 1
##$ISEN= 128
##$LB= 0.24
##$LEV0= 0
##$LPBIN= 0
##$MAXI= 10000
##$MC2= 0
##$MEAN= 0
##$ME_mod= 0
##$MI= 1.114404
##$NCOEF= 0
##$NC_proc= 0
##$NLEV= 6
##$NOISF1= 3.799351
##$NOISF2= 2.8
##$NSP= 1
##$NTH_PI= 0
##$NZP= 0
##$OFFSET= 15.70392
##$PC= 1
##$PHC0= -11646.35
##$PHC1= 16.60101
##$PH_mod= 1
##$PKNL= yes
##$PPARMOD= 0
##$PSCAL= 0
##$PSIGN= 0
##$REVERSE= no
##$SF= 200.130013532006
##$SI= 16384
##$SIGF1= 3
##$SIGF2= 2
##$SINO= 400
##$SIOLD= 16384
##$SREGLST= <1H.CDCl3>
##$SSB= 0
##$STSI= 0
##$STSR= 0
##$SW_p= 3612.71676300578
##$SYMM= 0
##$S_DEV= 0
##$TDeff= 0
##$TDoff= 0
##$TI= <>
##$TILT= no
##$TM1= 0
##$TM2= 0
##$TOPLEV= 0
##$USERP1= <user>
##$USERP2= <user>
##$USERP3= <user>
##$USERP4= <user>
##$USERP5= <user>
##$WDW= 1
##$XDIM= 8192
##$YMAX_p= 0
##$YMIN_p= 0
$$ End of Bruker specific parameters
$$ ---------------------------------
##NTUPLES= NMR FID
##VAR_NAME=  TIME,          FID/REAL,        FID/IMAG
##SYMBOL=    X,             R,               I
##VAR_TYPE=  INDEPENDENT,   DEPENDENT,       DEPENDENT
##VAR_FORM=  AFFN,          ASDF,            ASDF
##VAR_DIM=   8192,          8192,            8192
##UNITS=     SECONDS,       ARBITRARY UNITS, ARBITRARY UNITS
##FACTOR=    0.0002496,     1,               1
##FIRST=     0,             0,               0
##LAST=      2.0444736,     0,               0
##MIN=       0,             -313203,         0
##MAX=       2.0444736,     302243,          0
$$ Real data points
##PAGE= N=1
##DATA TABLE= (X++(R..R)), XYDATA
0 0 0 0 0 0 0 0 0 0 0 0 0 0 0 -8 8 -8 8 -8 16 -16 16 -23 24 -29 32 -40 45 -48 56 -65 76 -85 96 -110 124 -139
36 -139 156 -173 195 -214 238 -265 293 -324 357 -394 434 -480 529 -582 639 -707 778 -861 953
55 953 -1057 1177 -1316 1480 -1678 1916 -2218 2604 -3127 3869 -5000 6911 -10741 21251 -107541
70 -107541 -313203 52219 128218 -66910 -23522 71869 19392 9990 -29338 -22349 126126 25049
82 25049 -280602 -90547 265999 71275 -141084 57329 82964 -91411 -59053 30755 39289
93 39289 26604 -103288 -123177 164901 214187 -135183 -146664 120047 2518 -152446 46566
104 46566 126003 -18475 -69740 -43267 53149 152088 -23343 -210868 -301 150790 -74190
115 -74190 -77534 168762 57124 -159365 -46210 85056 62413 -5486 -117027 -71020 134381
126 134381 75576 -117819 19538 140651 -103919 -164195 105427 126559 -58052 -77236 -17083
137 -17083 55095 87349 -45137 -84121 76454 28096 -155754 -1769 198060 2845 -160060
148 -160060 -351 88637 18056 -24061 -50769 -1537 61536 -44779 -70872 120679 99275
159 99275 -147888 -103207 123508 65544 -81007 -28476 30407 17212 -1659 -37836 22938
170 22938 94685 -55593 -148455 59522 148560 -54997 -104734 56812 56571 -46769 -26307
181 -26307 26079 37724 -5967 -92453 -16804 137991 29779 -135720 -13587 108461 -17028
192 -17028 -82305 34269 60356 -27397 -54590 -8522 70328 58632 -86470 -81148 91093 59849
204 59849 -93652 -26400 93982 7441 -85527 -7105 69845 29897 -49481 -67171 32903
215 32903 88029 -37805 -80516 61321 63353 -78126 -52109 76244 48749 -60152 -53068
226 -53068 32067 61731 -4472 -70563 1014 81013 -21471 -89278 39753 87731 -40688
237 -40688 -79203 28226 70330 -9160 -60590 -8696 56157 17140 -68092 -15416 87866 8943
249 8943 -94787 -3783 85412 5735 -71219 -13591 58754 20775 -51662 -27874 54858 39381
261 39381 -65783 -48403 73534 46184 -70944 -39307 59606 37582 -48027 -39838 42403 43932
273 43932 -40492 -53044 38352 64068 -38842 -68002 42019 62735 -40528 -56156 32551
284 32551 54904 -25431 -58657 21168 63092 -14860 -66374 8229 69748 -7254 -71014 9545
296 9545 66768 -7583 -61204 965 60844 5609 -63256 -10007 62574 14195 -61173 -18780
308 -18780 63133 20985 -64318 -20636 60376 22632 -55422 -29057 53896 34309 -53304 -35589
320 -35589 50157 37449 -46554 -41976 45373 44295 -44662 -43384 40689 44534 -35313 -48959 32950
333 32950 51734 -32249 -51324 28512 52271 -22854 -55737 20291 57671 -19069 -56632 14566
345 14566 56288 -8798 -58495 6384 59548 -5336 -57258 1231 55583 4019 -57022 -6309
357 -6309 57678 7344 -54930 -11061 52839 16420 -53915 -19149 53872 20131 -50603 -23346
369 -23346 47798 28110 -47731 -30343 46276 30729 -41707 -33846 37800 38833 -37455 -40923 37227
382 37227 40471 -34330 -41852 31278 44618 -29841 -44869 27142 43602 -21151 -45675 16037
394 16037 50438 -15496 -52825 15814 52091 -12949 -51339 8999 50679 -6407 -47667 2997
406 2997 44506 3551 -46141 -9033 51849 10034 -54835 -9421 52365 10459 -48078 -11999
418 -11999 44445 12866 -40436 -16661 37521 25561 -39467 -33873 44069 35128 -44976 -30619
430 -30619 40738 26220 -35752 -24564 31773 26515 -26358 -33923 20208 45061 -18666 -51627
442 -51627 22815 48001 -27424 -38934 27836 33680 -23389 -34494 14378 38411 -1688 -43804
454 -43804 -8328 50047 6979 -53469 4893 51135 -15140 -45433 13668 40337 -1619 -35656
466 -35656 -13269 31114 24553 -31951 -27182 41826 19780 -54009 -8780 56670 5039 -45898
478 -45898 -11470 28582 21266 -14629 -28235 11644 33520 -22770 -38709 41512 40333 -52295
490 -52295 -35162 43673 25971 -21741 -18939 3293 18502 1205 -28156 5978 46638 -16883
502 -16883 -63157 24573 62413 -24390 -41427 16260 16315 -5834 -7185 -1811 19962 8064 -44581
515 -44581 -15132 64378 17923 -66296 -9301 48566 -7074 -23798 16172 10753 -7165 -16719
527 -16719 -16826 31604 41899 -41630 -51971 43464 38567 -41556 -9087 38105 -13544 -31304 8850
540 8850 21016 20501 -9916 -51185 2873 61928 -6536 -49691 23933 27308 -45093 -10570 49689
553 49689 9155 -27179 -21700 -8980 36615 31697 -43613 -24916 43964 -4843 -44981 35193
565 35193 46633 -43502 -40102 21831 23250 15095 -7458 -39707 7496 36333 -26997 -14219 54657
578 54657 -4806 -70997 8939 60266 -1477 -24777 -9190 -10827 18232 18044 -25089 8947 31299
591 31299 -46952 -37018 66110 37133 -54257 -24403 22707 2832 6270 9000 -14798 4838
603 4838 1146 -38897 19720 67845 -29702 -69087 25402 40936 -17284 -3203 13099 -16819
615 -16819 -8818 3081 -2322 35040 16464 -67463 -22252 69649 11957 -44210 10247 14736 -29144
628 -29144 -1715 26748 7599 2474 -22210 -40594 34508 57769 -38785 -39574 36905 1766 -34673
641 -34673 25323 32581 -22152 -24358 -6973 7654 40932 6785 -56825 -3244 45996 -19906
653 -19906 -20676 45343 2823 -51842 -3508 31860 14969 3224 -24513 -29785 28900 28160 -32739
666 -32739 1101 38103 -34078 -40628 43646 35116 -23866 -20910 -7148 4802 27142 175 -26973
679 -26973 15250 12919 -43408 2589 61627 -9068 -52788 4779 22689 3460 5489 -8974
691 -8974 -12299 13267 -4990 -21536 32925 30773 -51127 -31041 46230 18007 -23176 -603 716
704 716 -7176 5905 -2318 1929 24951 -12783 -46777 18749 51526 -20031 -33796 18590 6838
717 6838 -15138 7441 9440 1174 -1522 -23375 -7802 41687 13477 -45445 -8364 35357 -6893
730 -6893 -19736 19962 9328 -17522 -9585 -546 16975 21151 -23358 -30612 25575 24208 -27026
743 -27026 -7269 29102 -7880 -27726 9522 19752 4090 -9255 -21855 3357 30526 -5718
755 -5718 -27410 15307 19157 -26642 -12381 30982 9400 -22320 -10427 5054 14792 7695 -20069
768 -20069 -7124 23902 -3574 -26352 14426 27847 -18319 -25741 13775 18329 -3349 -10538 -6837
781 -6837 9848 10354 -17345 -6815 26822 1867 -31589 -92 29424 557 -21455 -1249 11808
794 11808 3592 -7074 -8615 11055 13990 -19486 -16311 24615 15419 -23124 -12702 18166 8994
807 8994 -13265 -6557 9287 8983 -7415 -16351 8769 22978 -11699 -23593 12834 19536 -11648
820 -11648 -15195 10195 12863 -8429 -12973 4761 15939 -407 -20740 -969 23458 -1074 -21860
833 -21860 3171 18646 -3168 -16961 1619 16678 913 -16179 -4749 16271 8302 -17984
845 -17984 -8730 19636 6369 -18967 -5031 17127 6294 -15867 -8250 14827 9545 -13109 -11373
858 -11373 12037 13494 -13126 -13930 14252 12661 -13185 -12295 10821 13644 -9406 -14649 8604 14690
872 14690 -7100 -15310 5610 17073 -5752 -17727 6080 16654 -4804 -16074 2555 16927
884 16927 -1661 -17416 1443 16655 -59 -16490 -1726 17354 2232 -17529 -2107 16237
896 16237 3371 -15407 -5306 15904 5987 -15889 -5968 14619 7187 -13575 -9022 13935 9585
909 9585 -13899 -9427 12473 10482 -11299 -12073 11448 12526 -11287 -12115 9673 12895 -8380 -14227
923 -14227 8409 14525 -8194 -13851 6413 14142 -4824 -15398 4546 15616 -4266 -15031 2679
936 2679 15332 -1366 -16275 1286 15858 -836 -14476 -1061 14190 3026 -15369 -3508
948 -3508 15790 3662 -15170 -4894 15068 5770 -15232 -5395 14036 5366 -11790 -7296 11280
961 11280 9694 -12291 -10660 12708 10662 -11781 -10937 11228 10693 -10925 -9430 9340 9380 -6630
975 -6630 -11910 5144 15115 -5472 -16050 6035 15086 -6036 -14020 6230 13062 -6034 -11922
988 -11922 3423 11970 984 -14301 -3564 16708 2550 -17033 -57 16049 -1625 -15164
1000 -15164 1682 13925 316 -11297 -4824 9330 9533 -10380 -10771 13875 8069 -16473 -5002
1013 -5002 16629 4400 -14310 -5546 9685 7292 -4357 -10008 2454 13295 -6293 -15179 12649
1026 12649 14444 -15476 -12558 12682 10367 -6901 -7862 1304 6649 1819 -9798 -1058 16725 -3046
1040 -3046 -21977 6703 20977 -6621 -14424 3681 7191 -789 -3579 -1689 6112 4954 -13893
1053 -13893 -8247 22026 8372 -23585 -4436 17092 -459 -8433 3031 4137 -860 -5090 -6552
1066 -6552 8760 16102 -12582 -20968 15173 15898 -15202 -4643 12776 -3379 -9446 1750 5970
1079 5970 7577 -1766 -18128 -1693 23656 197 -21054 7439 12409 -15411 -4534 16197 3363
1092 3363 -7849 -7978 -4424 13078 13179 -15558 -12500 16898 2010 -18311 10806 18006 -15312
1105 -15312 -14285 7142 8082 6888 -2731 -16115 1954 15871 -8199 -9157 19357 1897 -27094
1118 -27094 1704 23099 -81 -8519 -4555 -5434 8804 8440 -11205 998 13873 -15185 -17151
1131 -17151 24157 17179 -21548 -10623 8970 1087 4276 3205 -8737 2587 3355 -15558 4610
1144 4610 27295 -8614 -29359 8302 18619 -6480 -1736 4197 -8128 -756 2639 -4135 13136
1157 13136 9259 -26569 -11996 28193 8630 -19203 1263 7300 -10902 -77 10458 871
1169 871 2497 -7244 -18902 12915 26301 -14224 -19626 13508 4333 -13737 8391 13557 -9386
1182 -9386 -9003 -2481 514 18348 5762 -26171 -4035 21650 -5525 -11023 16862 3666 -21334
1195 -21334 -2653 13473 5748 3205 -9642 -16668 12893 16267 -15248 -2697 17242 -12215 -18609
1208 -18609 17152 16760 -9736 -9518 -3697 250 14330 2860 -15967 5054 9424 -18557 -1547
1221 -1547 27134 -1440 -23779 -543 10606 3024 3458 -4517 -8832 7192 1582 -12351 12664
1234 12664 16919 -22201 -16728 19979 10873 -9366 -2298 -514 -3255 4245 138 -2245 11493 -2245
1248 -2245 -23848 5974 26572 -7297 -17380 6307 3880 -5008 3578 3192 -760 877 -9316
1261 -9316 -7262 19643 10936 -23229 -7524 18184 -1112 -9187 8017 3728 -7251 -3868 -1049
1274 -1049 6759 12121 -8915 -18791 10594 16039 -12570 -5890 13691 -3304 -12461 4075 8488
1287 8488 3129 -3177 -11826 -1217 16497 1452 -16032 4219 11989 -12041 -7469 15056 5163
1300 5163 -9863 -6087 452 8293 6427 -9926 -7053 11614 2067 -14220 4755 15913 -8677
1313 -8677 -14042 6325 8879 498 -4463 -6264 3764 7692 -7144 -6045 12673 3962 -16973 -2409
1327 -2409 16478 1510 -10590 -1844 3595 3766 -1013 -6460 3843 8761 -8669 -10691 11719 11227
1341 11227 -11817 -8966 9211 5044 -5210 -2969 1965 5080 -1562 -9728 2952 13290 -4019
1354 -4019 -14135 4244 12338 -4531 -8870 4539 5775 -2884 -5644 -172 8620 2427 -12011 -3011
1368 -3011 13066 2231 -11936 -855 10523 -614 -9042 673 7767 1742 -7271 -5358 8277
1381 8277 7359 -9482 -6747 9740 5225 -9439 -4246 9062 4015 -8002 -4684 6057 6527 -4440
1395 -4440 -8642 4696 9407 -5909 -8694 6382 8029 -5975 -8060 5185 8194 -3933 -7982
1408 -7982 2140 8552 -967 -9840 1327 10443 -2154 -10059 1945 9631 -992 -9474 230 9131
1422 9131 372 -8505 -1529 8626 2617 -9538 -2691 9903 2391 -9178 -2879 8440 3809 -8403
1436 -8403 -4211 8137 4391 -7316 -5212 7130 6263 -7449 -6427 7461 6154 -6543 -6550 5765
1450 5765 7291 -5765 -7500 5496 7308 -4603 -7784 3903 8561 -3898 -8581 3705 8312
1463 8312 -2819 -8516 1943 9107 -1790 -9041 1545 8644 -543 -8780 -262 9338 366 -9210
1477 -9210 -594 8694 1440 -8628 -2270 8918 2379 -8723 -2571 8074 3436 -8000 -4217 8286
1491 8286 4249 -7924 -4234 7069 4969 -6663 -5813 6740 5982 -6406 -6130 5658 6892 -5385
1505 -5385 -7393 5640 7047 -5063 -6792 3932 7318 -3260 -8149 3186 8404 -2698 -8498
1518 -8498 2050 8929 -1866 -8940 2249 8244 -1658 -7634 269 7974 908 -8687 -1313 8863
1532 8863 1570 -8732 -1738 8903 1428 -8837 -1046 7833 1878 -6651 -3849 6471 5249 -6979
1546 -6979 -5474 7297 5162 -7662 -5027 8026 4611 -7483 -4477 5500 5145 -3487 -6656 2944
1560 2944 7811 -4086 -8066 5326 8035 -5810 -7969 5451 7175 -3757 -5816 1234 5597 589
1574 589 -7249 -376 9415 -1017 -10649 1840 10491 -1627 -8855 1058 6325 -61 -4387 -1697
1588 -1697 4993 3530 -8045 -4384 10837 4164 -11106 -3114 9075 1841 -6323 -692 4350 1245
1602 1245 -3626 -4368 4659 8401 -6583 -10032 7786 8196 -7355 -4611 6409 1966 -5349 -1836
1616 -1836 3753 4719 -1317 -9146 -101 12016 -912 -11173 3725 7693 -6143 -4824 6317 4187
1630 4187 -3578 -5248 -1304 6788 5570 -8562 -5757 9947 1454 -10191 3631 9401 -5196 -7811
1644 -7811 2247 5552 3051 -3030 -7280 2352 8398 -5209 -6153 10234 2488 -13108 -411 11097
1658 11097 1177 -5331 -3272 -298 4935 2298 -6229 672 8143 -6837 -9618 11416 9055 -10448
1672 -10448 -6006 4933 2369 824 -580 -2949 2559 1545 -7926 1316 13730 -3518 -15232 4306
1686 4306 10272 -3385 -2702 1702 -1643 10 -341 -2054 6689 4629 -12725 -6242 14626 4578
1700 4578 -11160 424 5129 -4561 -940 3863 1162 1787 -4121 -8962 6569 12973 -7483 -10777
1714 -10777 7854 3596 -7991 3187 7048 -3965 -4394 -1874 850 9460 1826 -13260 -1545
1727 -1545 11647 -2612 -7202 8405 3130 -11044 -1656 7154 3032 1103 -5641 -7501 7352 7587
1741 7587 -8276 -1891 9219 -5207 -10286 8537 9235 -5694 -5266 -1387 811 7342 337 -8364
1755 -8364 3226 4996 -9460 -1151 14021 -429 -13299 54 6746 1099 1232 -2619 -4457 4485
1769 4485 569 -6648 6896 8449 -11776 -8741 11018 6113 -6026 -1415 486 -1955 2514 94
1783 94 -1618 6340 -1504 -12641 3771 14058 -4098 -9795 3576 2928 -3304 1728 2330 -1011 304
1798 304 -4680 -3812 10903 5300 -12944 -3695 9982 -380 -5336 4314 2339 -4826 -2000 603
1812 603 3202 6049 -4961 -10357 6416 8770 -7155 -2975 7368 -2061 -7039 2790 5339 669
1826 669 -2076 -5716 -1011 9287 942 -9284 2760 6360 -7159 -3283 8842 2269 -6277 -2965
1840 -2965 1192 3921 3490 -4862 -4518 6279 1283 -7957 3568 8533 -6076 -7413 4264 4884 -336
1855 -336 -2263 -2954 1200 4150 -2905 -3475 6816 1921 -10072 -363 9671 -120 -5917 -513 1895
1870 1895 1410 -221 -2472 1364 4097 -4360 -5932 7146 6255 -7684 -4428 5610 1829 -2672 -623
1885 -623 1013 1650 -994 -4218 1653 7054 -2188 -8370 2921 7020 -3483 -3917 3220 1788 -1966
1900 -1966 -2038 406 4142 911 -6221 -1777 7199 1452 -6976 124 5755 -1802 -4126 1789 3351
1915 3351 157 -3604 -2495 4253 3764 -4723 -3677 5095 2622 -5558 -1154 5466 461 -4324 -1326
1930 -1326 2845 3100 -2071 -4394 2243 4606 -2924 -4315 3724 4040 -4283 -3574 3847 3076 -2326 -3284
1946 -3284 779 4041 -450 -4688 1021 4995 -1515 -5136 1707 5113 -1700 -4559 1147 3725 -12
1961 -12 -3520 -806 4134 974 -4800 -701 4937 765 -4836 -982 4636 944 -4141 -1115 3455
1976 3455 1725 -3282 -2422 3852 2699 -4102 -2618 3877 2674 -3565 -2823 3435 2692 -3181 -2671 2533
1992 2533 3143 -2272 -3703 2403 3833 -2438 -3626 2106 3665 -1788 -3904 1683 3850 -1552 -3679
2007 -3679 940 3949 -542 -4316 535 4290 -476 -4052 107 4036 176 -4253 -231 4073 351
2022 351 -3775 -774 3778 1199 -4009 -1186 3877 1253 -3526 -1613 3473 1992 -3626 -1935 3341
2037 3341 2020 -2919 -2474 2839 2761 -2943 -2767 2817 2719 -2330 -2961 2223 3250 -2296 -3171 2023 3203
2054 3203 -1581 -3511 1408 3828 -1592 -3663 1435 3440 -938 -3542 658 3709 -541 -3589 183
2069 183 3522 296 -3779 -391 3949 97 -3664 -158 3333 707 -3251 -1123 3292 1349 -3188
2084 -3188 -1634 3115 1962 -3483 -1931 3775 1522 -3340 -1528 2588 2029 -2193 -2455 2088 2648 -2066
2100 -2066 -2853 2228 3224 -2666 -3092 2769 2496 -2054 -2190 1024 2434 -555 -2999 678 3468 -770
2116 -770 -4083 904 4331 -1130 -3809 1184 2663 -597 -1926 -241 2300 781 -3273 -1012 4099
2131 4099 1106 -4285 -958 4033 207 -3115 410 2018 55 -1580 -1486 2181 2830 -2858 -3319 3123
2147 3123 2980 -3187 -1890 3241 532 -2780 -90 1751 1353 -703 -3349 426 4460 -881 -4145
2162 -4145 1870 3033 -2928 -2110 3411 1529 -2389 -1462 34 2312 1946 -3349 -1850 3939 229 -4001
2178 -4001 1733 3908 -2513 -3433 1842 2216 202 -799 -2381 653 3196 -2105 -2149 4284 508 -5443
2194 -5443 258 4998 -150 -2876 -277 154 1014 1344 -2072 -1 3229 -3025 -3588 5080 3212 -4755
2210 -4755 -2081 2706 340 -288 866 -1070 -68 875 -2833 490 5808 -2002 -6382 2513 4208
2225 4208 -2124 -916 1550 -1214 -972 912 -290 1880 1958 -5126 -2641 6439 1487 -4938 928 2096
2241 2096 -2870 -193 2955 118 -635 -1044 -3150 2147 5626 -3077 -4737 3686 1109 -3812 2416
2256 2416 3314 -2927 -2197 375 394 3019 1390 -5190 -1390 5073 -1028 -2997 4474 593 -5905 304
2272 304 4010 306 -45 -1378 -3351 2110 3894 -2860 -1212 3962 -2828 -4614 5133 3815 -3750
2287 -3750 -1624 126 -604 2913 1432 -3475 141 2167 -3706 -389 6674 -906 -6671 1170 3100
2302 3100 -744 1246 -30 -3036 850 1221 -2052 2470 3575 -5437 -4144 5698 2451 -3396 660
2317 660 125 -2635 1629 1694 -1107 1703 -502 -5174 1545 6625 -2017 -4640 2368 557 -2407 2503
2333 2503 1754 -2228 -162 -1118 -1572 4565 2597 -5707 -1962 4468 -531 -2110 3393 254 -4094 365
2349 365 1509 358 2549 -1584 -4807 2320 4198 -2757 -1088 3315 -1999 -3633 3098 2643 -1442
2364 -1442 -486 -1827 -1408 4105 1357 -4009 757 2407 -3383 -833 4989 166 -4047 -104 884 338
2380 338 2282 -1032 -2987 2026 880 -3076 2111 3620 -3570 -3396 2977 1925 -887 169 -1153
2395 -1153 -1315 2251 67 -1789 2647 472 -4719 499 4659 -734 -2695 623 160 -664 1331 -28
2411 -28 -768 1353 -1479 -2576 3575 2681 -3857 -1636 2604 44 -1071 1216 134 -1040 187 -690
2427 -690 26 3084 -695 -4065 1423 3003 -1848 -991 1887 -400 -1570 465 838 634 532 -2165
2443 -2165 -1421 3209 1012 -3176 419 2099 -1640 -1124 1800 742 -836 -785 -704 858 1919 -1228
2459 -1228 -2076 1961 976 -2561 500 2419 -1030 -1746 320 997 770 -319 -1467 102 1862 -691
2475 -691 -1808 1831 1380 -2522 -711 2080 425 -926 -601 42 919 219 -1183 6 1670 -643
2491 -643 -2244 1292 2074 -1445 -1370 831 764 -11 -666 -317 1096 389 -1473 -337 1955 281 -2245
2508 -2245 23 1943 -250 -1128 111 670 364 -849 -600 1200 790 -1466 -961 1578 975 -1691 -669
2525 -669 1471 295 -987 -416 621 932 -738 -1263 808 1228 -752 -1354 859 1311 -943 -1028 918
2542 918 776 -598 -980 321 1352 -319 -1463 409 1364 -250 -1421 220 1486 -300 -1299 286
2558 286 1085 85 -1079 -365 1367 282 -1308 -227 1137 372 -1220 -477 1332 315 -1245 -318
2574 -318 993 567 -942 -766 1140 834 -1069 -765 874 953 -885 -1000 996 919 -904 -826 535 920
2592 920 -511 -1031 663 1123 -571 -974 387 1163 -409 -1249 494 1144 -319 -1060 59 1238 67
2609 67 -1281 99 1226 -63 -1116 -181 1185 246 -1250 -155 1093 253 -919 -547 1032 589 -1215
2626 -1215 -384 1154 389 -1010 -550 1046 681 -943 -636 750 728 -583 -1047 719 1100 -954 -905 798
2644 798 816 -604 -847 403 922 -387 -787 194 1037 -75 -1323 300 1442 -469 -1176 472 907
2661 907 -162 -846 -14 831 171 -918 -404 1181 621 -1467 -369 1492 -18 -996 152 611 134
2678 134 -589 -424 713 796 -736 -1141 939 1266 -1235 -802 1335 157 -957 6 518 488 -216 -1116
2696 -1116 70 1452 -100 -1527 378 1283 -1091 -798 1318 385 -770 -381 -94 793 684 -1061 -741
2713 -741 1299 358 -1538 407 1648 -986 -1312 834 579 97 -91 -966 178 1252 -603 -991 1367
2730 1367 491 -2045 -157 2085 -189 -1121 190 -132 286 753 -826 -266 1224 -916 -1464 1697 1624
2747 1624 -1858 -1073 1260 48 -165 630 -677 -182 670 -1070 -86 2212 -488 -2588 666 1919
2763 1919 -872 -513 897 -699 -499 759 -275 470 1193 -1985 -1369 2568 911 -2001 46 1008
2779 1008 -1128 -128 1463 -216 -354 45 -1538 511 2691 -1104 -2268 1365 730 -1575 855 1543
2795 1543 -1285 -1039 528 -108 1031 1146 -2353 -1117 2471 -131 -1503 1720 424 -2455 -42 1862
2811 1862 28 -64 -154 -1828 521 2350 -1061 -1070 1852 -947 -2235 2084 1925 -1567 -892 222 -500
2828 -500 1188 1163 -1843 -420 1557 -1526 -655 3111 -169 -3103 417 1408 -289 619 156 -1762 188
2845 188 1224 -1120 572 2106 -2410 -2360 2722 1371 -1575 264 -21 -1337 892 1142 -858 449
2861 449 404 -2530 45 3593 -540 -2606 971 319 -1128 1279 874 -1374 -123 -118 -1036 1789 2002
2878 2002 -2691 -1678 2386 168 -1243 1640 107 -2031 300 754 -99 1344 -196 -2809 514
2893 514 2695 -1017 -1097 1769 -827 -1933 1657 1246 -704 -6 -902 -1197 2130 1319 -2189 -294 1585
2910 1585 -1439 -814 2691 225 -2178 46 206 18 1630 -351 -2050 828 1089 -1514 528 2180
2926 2180 -1598 -2149 1549 1006 -446 468 -832 -1094 1487 389 -1216 1109 760 -2497 -349 2705
2942 2705 33 -1681 289 -123 -400 1249 -52 -1016 834 -351 -1687 1597 1916 -1854 -1388 1414
2958 1414 204 -560 837 -235 -837 570 -439 -408 1913 7 -2487 319 1983 -617 -743 883
2974 883 -248 -838 579 212 79 769 -1144 -1330 1831 1079 -1684 -199 1122 -708 -610 1040 380
2991 380 -575 -138 -624 100 1619 -467 -1710 927 881 -1280 -29 1314 -359 -1020 187 434 364 327
3009 327 -985 -539 1458 29 -1241 874 889 -1314 -593 1101 428 -471 -340 -340 315 686 -658 -597 1149
3028 1149 -18 -1443 571 1300 -542 -807 215 405 235 -118 -478 244 660 -749 -638 1310 443
3045 443 -1422 -146 1071 65 -497 -143 211 339 -202 -513 396 871 -663 -1031 898 867 -861 -432
3063 -432 571 299 -250 -345 159 530 -140 -842 105 1115 -180 -1173 343 914 -390 -573 282 462 -65
3082 -65 -606 0 758 247 -818 -325 926 221 -990 -30 829 -92 -624 -134 578 351 -628 -414 646
3101 646 500 -573 -583 627 528 -772 -373 671 337 -402 -521 369 640 -418 -720 383 631 -306 -719
3120 -719 441 829 -432 -646 341 627 -221 -616 133 770 -174 -704 88 708 38 -762 -13 816 -65
3139 -65 -665 20 626 181 -735 -199 784 217 -715 -244 717 361 -729 -359 780 279 -640 -312 507 490
3159 490 -563 -501 596 485 -506 -509 501 586 -418 -558 541 488 -404 -543 210 688 -263 -730 340 729
3179 729 -224 -650 199 781 -187 -748 200 598 -39 -601 -134 768 23 -786 -30 712 -3 -697 -112 718
3199 718 116 -660 -151 559 291 -522 -404 705 456 -814 -320 650 319 -565 -394 512 332 -430 -356 351
3219 351 608 -319 -775 500 792 -543 -555 478 391 -337 -416 301 461 -122 -588 14 838 97 -926 141
3239 141 811 -374 -541 303 537 -166 -475 -93 508 345 -576 -488 793 360 -977 -44 911 -196 -749
3258 -749 143 428 191 -351 -436 237 667 -289 -712 730 623 -1008 -312 983 183 -518 -128 73 383
3277 383 186 -473 -65 775 -256 -1026 619 1064 -873 -678 583 214 -119 -48 -268 212 258 -689 -176
3296 -176 1170 -17 -1361 229 1221 -360 -456 346 -111 -43 185 -299 391 578 -895 -772 1169 660
3314 660 -1147 -180 802 -413 -219 545 -76 98 -15 -819 310 1310 -554 -1250 691 693 -851 89
3332 89 939 -543 -524 180 -107 602 496 -1239 -406 1314 9 -1011 707 525 -1132 -194 935 -7
3350 -7 1 -172 -951 447 1187 -771 -562 1102 -326 -1294 858 1132 -773 -578 185 -179 549 585 -1032
3369 -1032 -93 956 -822 -474 1619 86 -1688 22 957 -183 94 203 -831 212 713 -750
3385 -750 269 1298 -1157 -1352 1340 860 -783 -62 240 -628 222 626 -510 305 323 -1480 11 1978
3403 1978 -362 -1470 527 366 -654 551 600 -653 -58 84 -696 922 1241 -1535 -840 1373 64
3420 64 -776 783 152 -1065 66 499 -84 655 -31 -1601 275 1595 -744 -694 1117 -409 -1161 883
3438 883 760 -410 -84 -370 -631 1042 963 -1292 -191 1065 -864 -552 1525 169 -1263 12 240
3455 240 33 769 -103 -1249 440 755 -965 210 1424 -983 -1254 1020 556 -327 214 -428 -607 757
3473 757 320 -719 553 516 -1488 -245 1715 -118 -1031 346 -44 -239 738 -41 -566 424 -156 -996
3491 -996 848 1244 -1175 -909 1003 74 -435 630 -154 -534 326 -186 -198 1056 14 -1512 215 1302
3509 1302 -458 -570 749 -301 -611 517 181 -27 398 -653 -808 1082 747 -1062 -151 809 -587
3526 -587 -479 853 146 -527 1 -370 88 1016 -290 -1011 535 573 -796 29 967 -377 -788 383
3544 383 214 80 335 -637 -355 820 17 -650 576 567 -914 -308 890 115 -413 42 -239 84 569
3563 569 -375 -298 619 -161 -871 459 866 -511 -594 305 155 -81 141 -233 -49 447 -459 -339 880 141
3583 141 -941 -1 737 -81 -325 155 19 -72 99 -218 121 557 -478 -616 675 400 -511 -267 402
3602 402 27 -212 27 85 128 -42 -430 46 740 -235 -662 334 403 -375 -228 255 109 -241 -196 53 330
3623 330 189 -448 -198 583 -35 -564 204 454 -188 -383 102 280 2 -241 -132 268 289 -384 -341 530 123
3644 123 -518 -55 456 80 -264 -116 278 189 -225 -281 192 365 -293 -417 384 261 -394 -191 297 274 -192
3665 -192 -239 139 272 -160 -333 54 441 -151 -480 252 385 -238 -288 73 331 -35 -361 41 306 -16 -338
3686 -338 -61 463 85 -458 -19 342 -13 -265 -65 322 79 -324 -80 329 142 -312 -228 346 148 -389
3706 -389 -153 319 162 -212 -248 223 214 -278 -232 227 237 -149 -315 251 311 -286 -237 208 233 -113 -295 141 359
3729 359 -169 -298 91 357 -62 -366 98 348 -140 -315 50 209 -11 -287 -80 338 4 -412 -61 370
3749 370 71 -388 -20 341 0 -241 -70 279 233 -325 -184 274 191 -291 -167 355 188 -336 -106 263 78
3770 78 -177 -173 140 338 -179 -319 274 309 -193 -278 225 271 -243 -221 157 230 -36 -234 -53 409 12 -373 169
3793 169 387 -193 -352 131 280 -93 -210 -61 128 171 -226 -187 409 74 -575 36 402 -66 -350 36 203
3814 203 -48 -86 -80 59 260 -224 -383 457 278 -552 -168 361 31 -215 95 82 73 7 -150 5 409 -120
3836 -120 -628 311 464 -394 -159 266 -79 -209 73 55 71 125 -336 -276 547 171 -581 106 334 -374 -72
3857 -72 366 52 -186 -41 -211 115 493 -260 -515 452 179 -552 228 517 -443 -253 244 54 96 136 -429
3878 -429 -170 492 -36 -452 483 205 -787 88 605 -152 -176 32 -289 96 398 -279 -204 511 -254 -672 603
3899 603 510 -714 -170 297 -189 125 329 -369 -99 322 -409 -148 806 -53 -955 255 534 -347 74 233
3919 233 -446 -6 340 -198 180 491 -608 -539 803 353 -583 108 258 -577 129 484 -296 22 82 -630
3939 -630 101 903 -304 -676 407 180 -615 349 519 -520 -139 166 -246 428 435 -827 -361 683 -62
3958 -62 -445 558 147 -829 74 541 -137 238 105 -755 171 789 -405 -253 639 -368 -699 599 532
3977 532 -485 -22 72 -325 455 529 -651 -75 444 -564 -161 931 -108 -797 190 288 -207 326 86
3996 86 -696 102 409 -482 235 692 -736 -584 776 285 -433 226 -40 -526 290 359 -379 231 185 -931
4016 -931 53 985 -237 -608 381 -30 -373 456 274 -419 91 23 -486 583 628 -789 -379 670 -136
4035 -136 -300 570 -37 -579 152 163 -148 501 59 -862 210 732 -433 -183 535 -321 -460 511 300 -160
4055 -160 89 -166 -424 548 397 -679 11 417 -516 -173 788 -12 -476 164 3 -28 537 -46 -555 250
4075 250 264 -487 208 634 -518 -420 501 100 -126 235 -188 -282 326 82 -323 328 269 -698 -49 712 -132
4096 -132 -270 130 -157 -108 330 -47 -183 260 -119 -434 357 466 -521 -266 355 -97 -137 295 -121 -150 176
4117 176 -138 -59 450 -3 -602 81 482 -292 -104 352 -115 -161 210 -51 27 253 -248 -295 406 272 -410
4138 -410 -35 305 -216 -209 312 -9 -78 -9 -194 6 369 -111 -300 232 148 -312 -21 333 -139 -216 119 -3
4160 -3 88 137 -230 -78 290 -61 -215 205 163 -276 -134 283 28 -81 15 -93 119 153 -180 -79 274 -68
4182 -68 -257 127 288 -138 -224 119 46 -60 32 -142 46 130 -224 -51 249 6 -198 -77 137 -15 -127 31
4204 31 34 86 13 -49 138 217 -94 -160 209 125 -149 -96 134 77 -118 -87 85 69 -21 -186 40 191 -70 -176 63
4229 63 158 -64 -97 90 120 -31 -86 -43 96 84 -183 -8 200 -17 -157 -23 163 26 -173 11 154 -28
4251 -28 -103 -35 47 91 -132 -86 166 49 -164 -45 117 48 -132 -70 123 69 -65 -128 37 132 -88 -148 177 101
4275 101 -77 -66 90 134 -42 -103 82 145 12 -116 11 177 -59 -137 74 128 -46 -104 9 129 -58 -145 -1
4298 -1 72 43 -174 -58 182 36 -195 56 106 11 -116 -71 84 107 -61 -65 122 79 -88 -104 130 80 -129 -59 94
4323 94 126 -35 -99 62 129 -75 -172 54 132 -103 -164 130 89 -110 -78 24 11 21 -140 -27 203 -17 -133 10
4347 10 251 -31 -187 16 52 -76 57 -68 52 69 -86 -93 213 137 -209 -23 194 42 -119 51 53 -29 30
4370 30 -45 7 249 -95 -236 97 169 -147 -135 142 4 -183 103 54 6 126 -132 -129 261 42 -200 54 167
4393 167 -176 -64 186 -31 -86 22 -16 51 184 -126 -249 249 103 -269 119 223 -151 -163 154 8 -15 106
4415 106 -120 -108 303 -51 -246 277 80 -328 42 302 -104 -102 73 -74 -7 227 -106 -161 279 -129 -307 306
4437 306 228 -352 -92 181 -114 84 222 -170 -133 170 -157 -145 449 13 -479 226 252 -144 80 127 -212 -44
4459 -44 186 -126 14 318 -246 -327 468 201 -330 94 137 -314 107 232 -128 -57 79 -319 -14 537 -143
4480 -143 -439 265 127 -311 245 154 -323 -34 138 -151 223 322 -385 -282 460 9 -321 395 50 -467 148
4501 148 243 -110 131 96 -411 68 483 -204 -241 362 -111 -435 422 327 -384 1 24 -239 302 261 -455 -71
4523 -71 323 -229 -176 534 -61 -548 164 179 -165 283 67 -449 140 288 -260 73 415 -393 -360 477 183
4544 183 -282 193 -19 -350 284 230 -306 144 103 -492 16 567 -131 -380 176 -19 -180 412 135 -373 159
4565 159 95 -332 364 413 -487 -244 407 -3 -121 290 -56 -383 175 149 -179 394 84 -610 123 487 -234
4586 -234 -134 254 -224 -249 345 135 -136 90 -135 -337 441 347 -452 55 319 -272 -57 435 -81 -327 104
4607 104 -40 -49 386 -7 -425 207 259 -330 102 358 -341 -264 268 18 24 137 -139 -257 345 82 -318 251
4629 251 122 -461 -2 464 -106 -103 76 -100 -99 363 -59 -283 230 25 -400 276 368 -409 -152 156 2 -58
4651 -58 193 -150 -191 166 -75 -123 319 41 -465 71 318 -162 -68 163 -189 -41 154 -40 -35 187 -194 -250
4673 -250 348 221 -324 -42 214 -176 -28 163 -71 -26 13 -198 -49 318 -50 -336 123 215 -160 24 227
4694 227 -152 -68 93 -9 89 154 -212 -111 253 54 -217 84 150 -227 -77 140 -5 15 11 -181 116 174 -144
4717 -144 -118 241 70 -247 75 210 -118 -53 11 -3 113 32 -161 47 158 -122 -141 146 69 -250 8 181
4739 181 -1 -21 34 -54 132 46 -125 25 156 -78 -145 135 142 -96 -74 138 60 -63 -40 -43 136 76 -235 9
4763 9 191 8 -134 -17 144 -39 -65 8 18 -31 -48 -102 144 105 -174 -105 166 79 -95 -20 84 53 -103 -56 47
4788 47 72 -34 -168 141 145 -105 -129 65 186 -71 -130 115 148 -43 -22 10 147 24 -177 31 155 -49 -61
4811 -61 -7 122 5 -131 28 78 -15 -106 21 133 101 -125 -65 167 74 -122 0 136 48 -50 -60 84 -14 -45
4835 -45 -89 101 116 -108 -55 62 33 -115 -86 98 66 -87 -83 73 69 -41 -164 36 124 -100 -103 54 18 -10 -129
4860 -129 19 70 -8 -131 17 116 46 -128 3 151 -76 -133 26 96 -49 -70 -40 158 57 -98 -31 100 98 -150
4884 -150 -36 147 2 -133 11 63 81 -81 -80 67 72 -105 -129 61 126 -193 -136 147 65 -76 -48 8 71 -3 -130
4909 -130 25 154 -14 -155 -32 147 -34 -134 112 39 -10 -25 -70 106 45 -152 -56 162 43 -171 -32 196
4931 196 -29 -119 64 69 -35 -30 -94 76 122 -122 -126 156 93 -188 -24 105 -34 -90 33 19 49 22 -163 30 226
4956 226 -76 -184 57 103 -162 -39 156 -7 -84 21 -60 96 148 -108 -50 254 -107 -212 187 115 -189 -93
4978 -93 129 13 39 45 -167 40 201 -168 -91 318 -13 -315 70 174 -65 -50 6 -123 69 27 -110 52 199
5001 199 -268 -198 345 91 -234 16 74 -89 52 108 -53 25 91 -259 3 422 -181 -317 157 114 -181 78
5023 78 68 -158 -23 57 -108 166 200 -379 -198 384 -85 -299 222 28 -248 25 64 17 71 -62 -361 98
5045 98 373 -270 -229 308 -102 -250 245 105 -127 20 -54 -102 266 51 -371 -61 354 -295 -61 421 -30
5066 -30 -328 107 143 -7 140 -75 -279 212 222 -236 -25 285 -278 -314 375 123 -189 90 -88 -129 210 -3
5088 -3 -234 168 74 -355 -14 521 -120 -278 176 -32 -92 230 -65 -227 133 -3 -240 312 267 -441 -149 382
5110 382 28 -169 269 -105 -210 170 11 -24 247 -51 -373 189 394 -196 -146 280 -121 -174 239 20 -116
5131 -116 109 -205 -183 404 119 -349 21 206 -223 -109 334 -35 -253 116 -36 -24 336 -144 -374 286 130
5152 130 -289 70 303 -294 -212 220 34 -4 125 -255 -103 338 24 -213 186 92 -371 35 318 -24 -200
5173 -200 90 -75 15 266 -142 -230 356 -68 -247 252 235 -298 -152 242 25 -36 103 -105 -111 189 -153 -113
5195 -113 361 -68 -429 157 269 -149 -118 137 -143 -40 102 -67 14 208 -179 -221 380 111 -336 39 166
5216 166 -98 76 158 -61 -91 65 -124 26 299 -101 -275 233 181 -178 32 96 -133 -130 19 33 64 68 -225
5239 -225 -106 274 -10 -211 138 73 -210 -21 138 -40 -21 -37 -56 102 130 -97 -86 207 13 -189 167 200
5261 200 -159 -58 34 49 105 -36 -127 -5 250 -119 -98 261 71 -256 2 124 1 -23 -41 10 88 64 -119
5284 -119 70 201 -130 -162 123 152 -200 -62 40 13 82 -45 -65 69 10 -165 47 165 -44 -209 97 165
5306 165 -93 -53 27 31 -12 -58 13 131 59 -169 -86 161 68 -117 -9 106 -46 -59 -21 71 35 -113 -97 152 127
5331 127 -141 -71 152 62 -186 -55 136 -4 6 -75 1 127 -78 -110 103 147 -38 -75 75 147 -86 -97 79
5354 79 41 -4 -128 -36 158 0 -117 43 102 -36 -150 20 91 -27 -135 28 58 11 -76 -78 160 42 -160 -14
5378 -14 158 11 -100 -11 95 14 -146 -41 31 68 -74 -104 94 83 -60 -68 76 73 -65 -32 76 60 -70 -30 31
5403 31 77 -59 -101 67 119 -66 -126 19 98 -52 -116 41 100 -13 -141 -6 160 28 -130 5 140 -16 -100
5426 -100 52 100 21 -142 15 123 -3 -99 -82 121 55 -151 -13 126 -14 -154 -30 124 76 -97 -39 83
5448 83 98 -30 -131 77 82 -104 -67 123 1 -51 -58 31 77 -43 -110 33 168 -78 -196 34 108 -142 -149 39 11
5473 11 -62 -124 -20 92 23 -101 -74 143 45 -153 -18 214 -49 -77 20 27 33 -90 -85 84 100 -90 -41 123 38 -198
5499 -198 -16 130 7 -62 -61 -13 51 19 -136 9 143 -127 -183 163 129 -251 -44 136 8 -57 9 -85 41 59
5523 59 -97 43 231 -51 -240 155 166 -113 -45 52 -45 -2 19 -21 72 99 -238 -76 269 15 -221 22 106 -83
5547 -83 -45 111 -82 -23 -6 -165 143 165 -167 -206 186 48 -245 39 142 -57 -60 47 -37 102 46 -275 -23
5570 -23 251 -118 -152 165 3 -205 -9 235 -57 7 19 -174 183 129 -224 -22 213 -98 -162 239 94 -170
5592 -170 -41 69 -102 157 19 -245 71 158 -215 -44 360 -95 -285 135 124 -76 24 -20 -184 94 39
5613 39 -179 100 175 -316 -166 362 -3 -162 101 43 -117 131 82 -174 94 28 -269 105 352 -155 -186 165
5635 165 -13 -160 133 35 -137 59 -30 -140 235 113 -378 -16 306 -65 -173 159 -38 -168 108 17 -31
5656 -31 139 -85 -310 195 288 -305 -98 288 -179 -137 219 53 -124 23 -124 -94 264 45 -344 56 228
5677 228 -232 20 389 -141 -251 149 27 53 190 -142 -262 146 110 -213 161 198 -299 -128 319 26 -79
5698 -79 87 -115 -65 191 22 -218 243 43 -402 131 351 -155 -194 149 -74 -61 216 -100 -81 210 -94 -177
5720 -177 238 174 -379 -74 256 -85 -59 162 -114 -107 132 -24 -25 239 -76 -309 230 246 -209 -96 177 -145
5742 -145 -83 145 -18 0 164 -229 -81 268 103 -316 108 157 -210 -68 246 -81 -98 30 -126 52 285
5763 285 -201 -227 206 95 -193 115 145 -179 -107 139 -9 -16 98 -199 -53 223 -81 -175 207 34 -249 3
5785 3 235 -13 -83 27 -57 64 169 -202 -64 202 -90 -129 202 93 -211 -105 100 85 -69 44 -120 -20
5807 -20 61 -138 -45 246 -61 -226 90 187 -50 -47 64 28 21 77 -62 54 164 -167 -61 284 30 -201 83
5830 83 104 -111 -48 71 -46 15 -6 -92 60 227 -105 -188 173 88 -125 7 66 -84 -43 -27 -2 24 48 -109 -18
5855 -18 198 -28 -158 91 101 -132 10 21 73 52 -75 -63 72 106 -111 -62 170 32 -134 72 119 -38 -62
5878 -62 36 92 44 -49 -57 -35 61 -84 -55 138 -13 -151 46 118 38 -8 -38 31 44 -21 -37 28 113 -83 -149 106 67
5905 67 -122 -82 47 0 15 -77 12 94 11 -97 -56 145 20 -144 56 95 -34 -5 -37 73 6 -28 -40 114 16
5930 16 -36 -30 105 21 -136 12 116 26 -35 -104 7 122 -79 -84 38 25 -80 -105 75 111 -43 -8 85 13 -25 -71
5956 -71 53 107 -73 -38 -19 100 -56 -114 42 89 -76 -97 -7 64 18 -45 -13 181 41 -76 -20 140 -46 -108 23
5981 23 38 -85 -46 -28 31 145 -109 -60 58 21 -141 -56 -8 76 -139 -47 36 33 -35 -24 29 113 -20 -107 96 111 -23
6008 -23 -45 35 29 -30 -29 68 41 -15 -51 -45 72 -24 -108 56 69 -46 -83 47 57 -33 -41 -27 56 71 -26 -51 73 2 -162
6037 -162 14 110 6 -49 -24 -5 -20 -44 2 1 101 -56 -155 113 51 -142 -56 138 40 -43 28 -26 71 -6 -68 -26 79
6064 79 4 -143 44 148 -123 -22 61 -25 13 2 -64 -7 35 -79 -70 182 88 -183 45 83 -66 24 79 -38 30
6089 30 1 -14 73 111 -92 -155 145 2 -177 23 118 -157 -9 60 1 106 65 -175 -9 135 -40 -81 112 100
6113 100 -145 85 107 -91 32 9 -91 116 109 -178 -56 150 -77 -138 125 117 -204 8 46 -45 93 21 -198
6136 -198 57 134 -76 -16 216 -39 -197 80 108 -104 -11 24 -207 92 123 -108 132 196 -223 -116 226 83
6158 83 -177 69 54 -86 116 127 -133 156 46 -233 88 333 -116 -232 154 11 -97 132 49 -177 112
6179 112 106 -106 133 127 -312 -73 269 -82 -61 136 -25 -183 129 99 -69 135 27 -281 153 310 -186 -103
6201 -103 204 -125 -103 219 85 -150 14 -23 -134 219 148 -275 48 208 -250 10 219 -87 -222 65 12
6222 12 -102 160 -82 -274 123 112 -217 35 242 -218 -182 194 13 -44 75 -109 -119 211 47 -179 121 132
6244 132 -294 40 337 -136 -111 141 -73 -5 185 -50 -140 147 28 -168 183 200 -301 -63 233 -76 25
6265 25 179 -118 -77 188 20 -119 173 -6 -315 87 250 -259 -82 109 -219 -21 235 -63 -113 114 -126
6286 -126 -117 235 145 -247 29 159 -202 64 206 -134 -98 75 -77 -19 293 -109 -253 193 150 -182 86 203
6308 203 -243 -122 205 -61 7 158 -189 -76 232 32 -182 95 75 -224 -13 201 -107 -71 68 -125 38
6329 38 202 -94 -77 112 -1 -164 147 141 -197 -49 89 -61 98 133 -118 -81 190 -53 -64 154 10 -224
6351 -224 95 126 -75 23 -6 -157 31 133 -171 -49 133 -122 -127 189 127 -96 15 24 -114 7 83 -68 -13
6374 -13 93 -208 -41 174 -45 -134 100 95 -75 32 13 -122 -74 49 -61 73 111 -171 -65 183 6 -104
6396 -104 40 35 -98 -4 51 -20 16 3 -95 61 176 -102 -102 130 -26 -148 16 52 -16 -8 30 -27 1 58 -115 12
6422 12 146 -53 -105 50 15 -58 29 45 20 17 -16 -71 57 56 -98 16 84 -7 -70 152 42 6 -60 11 79 -10 -26
6449 -26 -40 -42 61 -93 -44 123 -59 -99 57 13 -14 13 -21 42 71 -12 -69 76 92 -70 -55 77 65 -63 -43 37
6475 37 27 8 9 42 24 -8 -50 -29 77 5 -38 13 33 -3 -40 26 70 44 -27 1 44 46 -45 -82 7 -5 -93 18 41 5
6505 5 -29 -78 39 40 -71 -50 36 86 -31 -32 62 94 -77 21 97 84 3 -38 -13 8 -33 -59 2 52 -22 -78 94 40 -3
6534 -3 10 -14 53 8 -76 -48 84 0 -67 -9 106 -14 -51 11 26 28 -31 -20 -10 84 -58 -78 55 50 -65 -15 74 17 -68
6563 -68 32 92 -7 1 -23 28 55 9 -151 59 42 -25 -23 58 38 -60 -44 -13 2 52 -95 -78 55 -48 -45 68 105 -75
6591 -75 -21 59 42 -9 4 3 -43 104 -97 -80 122 -28 -111 -18 71 9 -21 -1 -48 32 1 -85 85 61 -38 -84 124 12
6619 12 -79 21 34 -42 -35 6 14 40 22 -71 -57 181 -27 -101 118 54 -60 21 50 -57 57 15 -20 26 66 -140 -108
6646 -108 142 12 -118 25 37 -77 21 34 -68 6 -17 -122 30 117 -118 -63 96 -8 -146 128 88 -153 24
6669 24 -24 -30 108 -21 -165 -13 121 -73 -122 158 3 -133 60 118 -74 23 -70 -106 38 108 -160 -8 171
6692 171 -90 -105 131 25 -115 80 -36 -70 139 45 -110 39 48 -156 -43 135 -89 -124 111 12 -45 96 1
6715 1 -153 114 44 -161 147 115 -229 -31 269 -29 -130 106 15 -116 127 14 -70 111 -57 -264 146 189
6737 189 -136 -124 142 -73 -104 116 -4 -113 120 -26 -133 225 58 -281 80 198 -132 -51 159 -61 -164
6758 -164 121 -13 -32 188 -77 -247 219 180 -191 33 171 -137 -66 140 -15 -89 125 -31 -98 307 64 -193
6780 -193 190 105 -184 37 200 -145 -146 109 -33 -6 214 -101 -177 159 22 -226 161 165 -222 -14 131 -60
6802 -60 16 134 -157 -104 135 -49 -99 174 -74 -278 146 201 -158 -37 92 -104 -39 160 -54 -92 184 -92
6824 -92 -180 275 121 -322 16 156 -132 41 145 -140 -45 109 -97 -17 240 -125 -266 193 104 -214 77 111
6846 111 -145 22 109 -80 31 115 -166 -83 217 26 -204 132 72 -247 60 131 -136 0 71 -120 119 142
6868 142 -162 -132 191 12 -206 133 147 -202 -41 79 -51 84 75 -194 13 194 -89 -58 190 -15 -294 118
6890 118 137 -67 54 -26 -91 111 82 -115 34 178 -113 -123 170 129 -101 26 99 -51 126 80 -66 50 102
6913 102 -122 28 199 -119 -159 133 130 -109 48 74 -100 29 13 -70 101 86 -191 -35 177 31 -151 78
6935 78 70 -129 66 91 -36 26 14 -89 71 154 -133 -87 130 39 -98 81 31 -84 21 57 -62 129 60 -110
6959 -110 12 146 -81 -64 139 -1 -66 -33 67 -10 -6 -23 -123 117 98 -102 -35 93 -56 -110 101 60 -24 -37
6983 -37 41 12 50 21 -80 53 51 -123 37 144 -1 -111 35 57 11 -4 -13 20 68 -26 -154 69 92 -75 -21 134
7009 134 -3 -40 -34 99 50 2 42 14 97 -23 -53 44 101 -2 -96 34 90 -9 -102 30 33 -25 -53 -44 87 -4 -134
7036 -134 -14 126 -46 -64 39 91 -20 -21 16 83 -16 -50 -16 87 90 -104 -85 75 -5 -60 -46 98 57 -43 -3 63
7062 63 63 -30 -27 50 92 -60 -67 99 -12 -12 -8 34 95 -28 -69 43 63 6 -62 21 113 -44 -110 75 47 -67 -21 10 95
7091 95 -101 -101 43 105 43 -32 8 119 -43 -32 26 111 4 -23 -55 89 60 -115 -71 44 57 -116 2 137 20
7116 20 -85 -17 77 8 -45 -56 11 63 -63 -99 54 91 -90 -61 125 73 -50 -43 -28 9 20 -112 41 74 -47 -100
7142 -100 -21 141 -10 -36 23 47 -78 17 -88 66 -15 -115 51 77 39 -106 1 119 2 -54 53 22 32 0
7166 0 -93 39 75 -140 -96 89 54 -57 2 56 34 -25 -7 -30 44 60 -96 1 188 -63 -90 131 43 -126 11 93
7192 93 -1 -5 -7 14 74 106 -143 -21 158 0 -61 60 100 -83 6 64 -6 1 9 -41 70 70 -156 -44 170 -30 -131
7219 -131 94 96 -66 7 8 37 61 39 -118 34 101 -146 -89 250 -79 -150 76 19 -9 74 -28 -89 61 45 -178
7244 -178 96 218 -173 -162 179 -7 -47 37 -28 -50 18 4 -60 104 76 -127 -8 224 -47 -136 155 -15 -121
7267 -121 84 -31 -33 37 5 -126 182 158 -161 -72 122 -63 -99 201 7 -123 99 -18 -74 132 -1 -169 63
7290 63 153 -161 -60 216 -121 -217 85 55 15 166 -126 -184 202 30 -195 44 197 -158 -57 240 0 -77
7312 -77 73 -70 -55 163 -64 -172 105 70 -201 121 208 -174 -133 177 1 -49 199 -112 -79 118 -101 -134 170
7335 170 107 -252 10 254 -85 -33 129 -99 -6 179 -65 -98 194 -106 -225 248 191 -173 -21 177 -69 -48
7357 -48 165 -42 -55 102 -113 -4 321 -17 -258 115 115 -155 65 207 -44 -93 96 -87 -33 183 -117 -163
7379 -163 290 21 -254 84 119 -102 -45 181 -9 -22 101 -123 2 234 -135 -167 248 31 -276 67 148 -97
7401 -97 -80 7 -60 -9 152 -137 -59 185 -79 -138 227 58 -201 22 141 -48 71 12 -114 13 131 -101 -70
7424 -70 220 -59 -231 224 196 -114 -34 24 -28 6 108 -134 16 181 -169 -83 279 40 -211 125 70 -61 23
7447 23 17 -104 -22 40 -102 22 181 -144 -150 192 60 -169 80 79 -99 45 28 -55 99 69 -176 -28 167 -41
7471 -41 -142 155 62 -163 80 75 -55 49 -48 -53 123 37 -103 -55 171 2 -100 174 76 -150 -5 5 -53 70
7495 70 -38 -127 50 151 -120 -62 173 -42 -148 21 48 -56 23 -16 -75 89 31 -121 43 133 -82 -36 146
7518 146 72 -134 28 11 -33 83 8 -69 97 71 -97 10 128 -83 -175 98 123 -93 3 32 -2 15 -51 -63 105
7543 105 34 -137 -10 128 9 -92 51 66 -5 -20 15 -20 107 -8 -82 58 92 -87 -10 105 54 -94 7
7566 7 34 -33 -36 18 20 168 0 -93 41 129 -27 -40 90 102 -76 -34 82 2 46 -40 -55 78 21 -123 42 69 -84
7593 -84 -75 1 38 -41 -51 15 30 35 10 -82 77 19 -82 -65 116 36 -55 -5 100 52 -20 49 7 30 -47 -34 98 76 -66
7622 -66 -12 116 94 -66 9 26 19 -10 -11 7 78 6 -95 38 104 -70 -45 20 104 -5 -63 12 4 -13 -8 -19 100 29 -102
7651 -102 13 140 -53 -80 25 26 50 -85 -6 24 72 -31 -38 58 28 -116 -5 133 -4 1 -11 26 13 19 -6 23 50
7678 50 -81 -88 62 120 -78 -28 45 45 -16 -75 35 66 -13 5 26 12 -45 -79 -29 113 -118 -11 36 11 -22 44 -18 57
7706 57 -15 -67 -3 103 -19 -68 32 68 -37 -65 -5 -13 38 -32 -59 40 90 -36 -75 62 86 -104 41 80 -12 -48 9
7733 9 16 48 63 -100 51 119 -32 -51 40 89 -109 -10 116 20 26 -10 -78 16 93 -154 -4 97 -23 -47 72 105 -98
7760 -98 -41 43 -99 41 -12 -75 45 13 -164 -7 141 22 -119 23 82 -20 -40 -7 -64 5 88 -43 49 99 -82
7785 -82 -87 160 13 -77 25 37 -58 63 21 -102 87 55 -153 16 144 -69 -93 113 16 -78 54 62 -63 39
7809 39 -5 -64 124 156 -129 2 175 -159 -71 141 15 -40 34 -9 -22 90 26 -154 72 98 -162 -2 139 -125
7833 -125 -20 79 -58 -30 -4 -3 -111 139 51 -143 75 113 -166 -45 181 -64 -58 80 -42 -5 165 -40 -108 73
7857 73 3 -194 114 206 -221 -99 182 -51 -37 137 -47 -62 109 -8 -113 163 61 -255 34 168 -106 -19
7879 -19 108 -56 -87 117 -73 -58 189 -44 -170 182 133 -154 -18 145 -90 -48 121 -74 -86 62 -60 -29
7901 -29 200 15 -199 85 121 -139 4 160 -119 -34 152 -96 11 119 -144 -125 165 34 -138 76 166 -163
7923 -163 34 169 -85 3 78 -171 -24 118 -47 -114 124 43 -146 52 95 -138 -52 77 -130 78 185 -135
7945 -135 -87 139 -62 -48 214 16 -251 53 147 -106 17 121 -211 -52 215 -95 -28 178 -88 -167 120 79
7967 79 -144 12 59 -87 -4 88 -115 -52 132 -130 -94 178 -40 -168 112 67 -97 51 83 -95 -35 78 -116
7990 -116 60 119 -119 -144 142 7 -86 157 36 -74 55 74 -40 17 121 -140 41 185 -15 -79 112 -8
8012 -8 -129 65 77 -47 32 47 -103 51 115 -94 -32 112 -46 -98 90 -1 -94 47 51 -85 17 -2 -98 5 106
8037 106 -115 26 143 -79 -71 85 25 -42 1 -24 -43 104 96 -55 42 93 -99 9 158 -23 -71 91 -59 -74
8061 -74 22 2 -49 20 19 -100 27 91 -80 -78 113 56 -37 8 -7 -9 84 -8 -78 92 53 -114 3 110 -3 -18 60
8088 60 13 -62 25 -38 -65 38 -10 -62 70 85 -27 -90 118 29 -52 90 6 -22 28 -30 -7 38 25 -31 14 101 -52
8115 -52 -63 140 -11 -53 59 -5 -93 14 2 -29 42 -13 -9 -24 121 -36 -27 22 -1 4 43 29 13 67 -34 -25 20 41 -52
8144 -52 -35 99 12 -30 -32 29 10 94 -42 2 81 14 -20 90 70 -30 4 45 -37 3 47 -5 8 -16 -18 -36 45 38 -57 3
8174 3 42 -6 -70 41 27 -8 -6 -6 -32 116 7 -24 51 31 -48 8 48
8191D8
$$ Imaginary data points
##PAGE= N=2
##DATA TABLE= (X++(I..I)), XYDATA
0 0 0 0 0 0 0 0 0 0 0 0 0 -8 8 -8 8 -16 16 -17 24 -32 33 -41 49 -64 72 -81 97 -113 129 -148 169 -193 218
33 218 -249 282 -318 357 -400 448 -499 554 -617 685 -759 838 -926 1025 -1129 1244 -1371
50 -1371 1511 -1665 1834 -2023 2235 -2473 2744 -3055 3415 -3839 4343 -4963 5738 -6742 8100
65 8100 -10046 13095 -18548 31318 -124553 41459 250759 -63004 -44961 75025 24230
76 24230 -37472 -16396 -32110 64270 11475 -208883 -58545 302243 99428 -200738 -9622
87 -9622 102611 -94912 -71919 62775 43653 -3042 -60418 -67763 145568 180461 -157184 -202790
99 -202790 118554 69866 -136868 36784 149686 -36959 -94133 -6543 58459 94771 -42831
110 -42831 -196527 3316 191693 -24545 -107739 129763 63054 -178070 -51698 124461
120 124461 47648 -45826 -89111 -35819 133881 87601 -124652 -35582 123434 -71049 -158559
131 -158559 113940 151951 -85517 -98781 23491 63784 57596 -48124 -96908 52755 56773
142 56773 -114227 -8830 187037 2055 -187217 -1252 125074 5185 -53996 -35517
152 -35517 3478 59217 -12886 -63474 84844 84503 -142643 -107309 139583 87506 -103612 -44335
164 -44335 55798 19308 -10262 -22746 7028 62900 -41704 -126041 60904 156287 -56319
175 -56319 -129367 56079 79529 -53965 -37935 36642 25366 -16038 -62151 -5184 120284
186 120284 26150 -142388 -25361 122841 -1969 -94941 28353 70423 -34230 -54411 12914
197 12914 60754 34182 -79828 -75753 89736 74712 -92207 -42251 94676 14702 -90893
208 -90893 -4758 78389 15494 -60027 -48448 39620 81363 -32031 -87042 48668 71794 -71987
220 -71987 -56766 79374 49476 -69778 -49998 47308 57205 -16641 -66096 -1155 75580 -9714
232 -9714 -85928 32443 89813 -42445 -83762 35647 74674 -19153 -65482 -499 56819 14404
244 14404 -59972 -17209 78419 12340 -93744 -5794 91517 3765 -78268 -9438 64563 17601
256 17601 -54123 -23896 51876 33180 -59938 -45088 70684 48696 -73611 -42493 65920
267 65920 37686 -53365 -38528 44454 41499 -41339 -47748 39398 58878 -38036 -67369 40421
279 40421 66139 -42272 -59034 36974 54669 -28473 -56477 23275 61064 -18442 -64820 11096
291 11096 68039 -6927 -70913 8527 69521 -9344 -63653 4591 60199 2591 -62164 -7970
303 -7970 63347 12013 -61536 -16544 61834 20311 -64320 -20931 62833 21078 -57581 -25509
315 -25509 54165 32183 -53777 -35323 52009 36073 -48180 -39559 45604 43685 -45274 -43991 43091
328 43091 43353 -37858 -46602 33628 50872 -32753 -51721 30868 51446 -25519 -53898 21041 57097
341 57097 -19794 -57324 17332 56093 -11485 -57169 7139 59454 -6107 -58668 3745 56027
353 56027 1559 -56049 -5594 57793 6725 -56578 -8804 53456 13879 -53144 -18152 54361
365 54361 19539 -52529 -21295 48821 25811 -47607 -29663 47460 30494 -44242 -31817 39348
377 39348 36424 -37251 -40410 37579 40709 -36036 -40746 32584 43349 -30424 -45148 28925 44067
390 44067 -24339 -44061 18126 48052 -15292 -52124 15970 52644 -14758 -51543 10815 51160
402 51160 -7548 -49408 5122 45716 54 -44529 -6758 48879 10098 -54078 -9674 54076
414 54076 9672 -50170 -11337 46244 12354 -42558 -14126 38580 20628 -37877 -30282 41827
426 41827 35487 -45242 -33250 43272 28100 -38000 -24937 33737 24988 -29317 -29517 23089 39475
439 39475 -18566 -49443 20199 51000 -25424 -43498 28210 35525 -26153 -33473 19513 36291
451 36291 -8250 -40902 -4222 46948 9354 -52376 -1711 53005 -11083 -48385 16017 42764
463 42764 -8507 -38053 -5931 33169 19718 -30499 -27194 35911 24609 -48411 -13994 57109
475 57109 5556 -52737 -7229 37399 16485 -20604 -25206 11406 30878 -15558 -36182 32058
487 32058 40221 -48963 -38541 50464 30721 -33375 -21887 11045 17697 837 -21948 1431
499 1431 36718 -11434 -56214 21457 65677 -25570 -53844 21058 28025 -10907 -8936 1539 11140
512 11140 4880 -31852 -11575 56028 17627 -68000 -15122 59400 1265 -35838 13512 14857
524 14857 -14066 -11627 -3559 24056 30296 -37757 -49626 43272 48211 -42710 -24577 40130 -4763
537 -4763 -35178 15080 26470 3901 -15337 -37396 5563 59749 -2962 -58143 13765 38743
549 38743 -35237 -17356 50691 7798 -41509 -14290 9103 29738 23499 -41433 -32129 44086
561 44086 11698 -44062 21497 46202 -43142 -44842 36024 32504 -3539 -14150 -30447 4929
573 4929 41458 -15248 -26278 40931 3203 -65522 8811 69479 -6083 -44418 -3898 4850
585 4850 14039 19190 -21865 -7891 28218 -28632 -34399 60259 38293 -63811 -32512 39644 13860
598 13860 -6470 5631 -13614 -5622 10072 -20697 9699 55797 -26764 -72602 28757 57775
610 57775 -21089 -21533 14697 -10520 -11583 14253 4144 14588 9718 -54001 -21113 72934 19130
623 19130 -59110 -1590 28330 -21320 -5589 31506 2745 -14838 -14589 -22247 29257 53365 -37644
636 -37644 -52714 38228 21291 -35565 14858 33852 -27781 -29653 9689 16706 24873 925 -52188
649 -52188 -7919 54458 -6613 -33730 33842 9625 -51922 -978 44851 8757 -14811 -20508
661 -20508 -19044 27123 33039 -30568 -15884 35395 -19028 -40096 42816 39051 -36652 -28819 8136
674 8136 12326 19538 -113 -29426 4988 21009 -28970 -4527 55234 -7316 -60847 8022 39103
687 39103 -597 -6753 -6624 -12281 10863 6210 -16810 18881 26610 -44392 -32590 51743 25918
700 25918 -35953 -8996 10553 -5199 4869 4634 -3169 12656 -7666 -37120 16497 52049 -19822
713 -19822 -44993 19596 20094 -17107 3030 12555 -5785 -5754 -11714 -3172 33965 11669 -45489 -12493
727 -12493 41695 1448 -27564 14693 13383 -21045 -8088 9771 12903 11557 -20740 -27871 24783
740 24783 29208 -26105 -16350 28082 -1420 -29187 10831 24453 -4231 -14307 -13327 5407 27814
753 27814 -3468 -30178 9877 23334 -21260 -15325 30263 10415 -28319 -9371 14065 12291
765 12291 2638 -17544 -9173 22258 2505 -25208 9497 27312 -17511 -27418 17084 22566 -8931
778 -8931 -13956 -2232 9002 9644 -12895 -9216 22323 4092 -30002 -521 31362 223 -25921
791 -25921 -842 16442 2069 -8493 -5826 8093 11465 -15234 -15584 22821 16161 -24567 -14232
804 -14232 20771 10879 -15650 -7315 11123 6985 -7917 -12292 7714 20148 -10284 -24119 12685
817 12685 21906 -12444 -17216 10893 13746 -9457 -12575 6822 14048 -2433 -18280 -811 22658
830 22658 273 -23183 2343 20200 -3495 -17523 2546 16802 -558 -16447 -2733 16016
842 16016 6781 -16991 -8974 19052 7639 -19674 -5342 18010 5411 -16365 -7316 15369 8940
855 8940 -14043 -10416 12347 12510 -12327 -14011 13840 13386 -14085 -12242 12036 12860 -9930 -14220
869 -14220 9042 14674 -7974 -14828 6242 16132 -5509 -17633 6139 17249 -5721 -16175 3593
882 3593 16415 -1888 -17344 1571 17112 -904 -16372 -906 16805 2178 -17647 -2057
894 -2057 17043 2503 -15676 -4349 15576 5841 -16133 -5904 15347 6354 -13921 -8158 13683
907 13683 9526 -14095 -9441 13305 9804 -11652 -11276 11279 12522 -11468 -12271 10592 12361 -8842
921 -8842 -13594 8282 14622 -8535 -14105 7423 13804 -5517 -14838 4545 15690 -4592 -15300
934 -15300 3584 14916 -1854 -15806 1202 16250 -1287 -15122 93 14049 2174 -14759
946 -14759 -3353 15700 3479 -15439 -4222 14940 5520 -15206 -5671 14829 5162 -12875 -6059
959 -6059 11273 8572 -11707 -10356 12657 10679 -12288 -10757 11468 10926 -11201 -10049 10399 9138
973 9138 -7990 -10404 5633 13684 -5153 -15883 5803 15667 -6004 -14572 5984 13566 -6334
986 -6334 -12455 5082 11690 -1214 -13006 -2692 15660 3512 -17182 -1328 16570 -959 -15548
999 -15548 1868 14690 -998 -12737 -2261 10033 7427 -9434 -10709 12078 9774 -15372 -6329
1012 -6329 16903 4324 -15815 -4804 12288 6401 -6841 -8493 2734 11735 -3671 -14575 9558
1025 9558 15092 -14790 -13542 14659 11522 -9957 -9150 3905 6911 604 -7663 -1956 13021 -755
1039 -755 -19981 5229 22290 -7240 -18103 5344 10553 -2146 -4749 -420 4019 3128 -9541
1052 -9541 -6830 18411 8799 -23898 -6780 21123 1908 -12615 2294 5561 -2631 -4034 -2309
1065 -2309 6793 11445 -10789 -19614 14135 19641 -15668 -10491 14200 -319 -11090 3768 7787
1078 7787 2309 -4034 -13193 -298 21778 1808 -23403 3110 17165 -11924 -7884 17038 3031
1091 3031 -12938 -5246 1711 10830 9799 -14658 -14174 16217 8199 -17625 4838 18566 -14662
1104 -14662 -16489 12584 11202 -186 -5111 -12601 1588 17112 -4145 -12903 13548 5238 -24266
1117 -24266 521 26765 -1484 -16592 -2053 695 6982 8663 -10186 -4911 12295 -8167 -15609
1130 -15609 20850 17966 -24416 -14713 16049 5759 -1743 2146 -7889 -1559 6930 -8601 844
1143 844 22206 -7347 -29931 8830 25428 -7516 -10120 5419 -4867 -2659 7279 -1524 4700
1156 4700 6766 -20968 -11194 28947 11211 -24657 -4195 13108 -6770 -2748 12379 -462 -5217
1169 -5217 -3748 -11066 10527 24295 -14112 -24583 13909 12345 -13503 3029 14028 -10635 -11973
1182 -11973 4690 4915 10700 3329 -23830 -6045 25215 -72 -16479 11506 6583 -20387 -2436
1195 -2436 18919 3923 -5562 -7707 -11130 11374 18468 -14096 -10494 16224 -5446 -18100 16348
1208 16348 18253 -14754 -13789 3227 4688 9881 2578 -16396 -187 13381 -11755 -5131 24108
1221 24108 -798 -26999 798 17955 1934 -3078 -3863 -7681 5523 6610 -9578 5395 15030
1234 15030 -18673 -17629 22578 14451 -15128 -6598 3833 -1244 3195 2933 -3762 4944 82 -18381
1248 -18381 4382 26897 -7002 -23146 6978 10434 -5621 1104 4292 -3423 -1615 -3750 -4029
1261 -4029 14969 9789 -22594 -10141 21546 3447 -13693 5266 5663 -8707 -3154 3825 5205
1274 5205 6647 -8077 -16382 9729 18680 -11535 -11465 13328 604 -13443 4896 10837 -1172
1287 -1172 -5905 -7704 705 14821 2067 -16811 802 14284 -8301 -9653 14516 5965 -13363
1300 -13363 -5299 5248 7197 3633 -9208 -7557 10656 5093 -12798 1438 15377 -7419 -15515
1313 -15515 8278 11585 -3183 -6319 -3898 3546 7559 -5043 -7084 9792 4893 -15182 -3149
1326 -3149 17472 1877 -14065 -1472 6833 2638 -1558 -5071 1908 7679 -6281 -9765 10507
1339 10507 11180 -12173 -10448 10868 7089 -7297 -3509 3366 3486 -1403 -7240 2142 11784 -3642
1353 -3642 -14074 4196 13463 -4361 -10659 4622 7052 -3963 -5229 1427 6806 1520 -10532
1366 -10532 -2975 12860 2689 -12687 -1623 11218 112 -9775 902 8337 180 -7312 -3544
1379 -3544 7669 6731 -8938 -7333 9748 5954 -9590 -4568 9271 4024 -8698 -4244 7132
1392 7132 5515 -5060 -7604 4348 9303 -5352 -9134 6337 8246 -6287 -8008 5636 8230
1405 8230 -4680 -8004 3049 8062 -1360 -9125 963 10259 -1851 -10412 2222 9793 -1460
1418 -1460 -9477 520 9416 0 -8805 -862 8432 2187 -9002 -2723 9838 2464 -9596 -2565
1432 -2565 8758 3342 -8349 -4082 8329 4280 -7750 -4774 7110 5799 -7226 -6434 7513
1445 7513 6264 -6999 -6231 6097 6990 -5747 -7489 5715 7375 -5090 -7534 4158 8238 -3814
1459 -3814 -8701 3868 8464 -3213 -8299 2226 8860 -1876 -9152 1746 8850 -1127 -8603 77
1473 77 9055 322 -9291 -410 8913 950 -8592 -1955 8848 2346 -8898 -2357 8405 2988 -7942
1488 -7942 -3939 8143 4261 -8238 -4136 7459 4582 -6803 -5423 6728 5873 -6644 -6001 5970
1502 5970 6422 -5402 -7239 5551 7304 -5458 -6838 4486 6939 -3516 -7784 3183 8340 -3031
1516 -3031 -8457 2406 8662 -1885 -9003 2166 8638 -2075 -7760 1093 7717 436 -8416 -1168
1530 -1168 8893 1425 -8816 -1657 8745 1666 -8944 -1236 8398 1293 -7114 -2821 6495 4674
1544 4674 -6764 -5494 7201 5304 -7498 -5094 7854 4767 -7914 -4515 6680 4645 -4369
1557 -4369 -5937 2945 7400 -3428 -8024 4786 8045 -5647 -8029 5684 7672 -4812 -6455 2563
1571 2563 5481 -115 -6251 -747 8372 -297 -10233 1590 10719 -1804 -9754 1346 7650 -594
1585 -594 -5100 -741 4287 2625 -6301 -4149 9668 4334 -11376 -3661 10292 2513 -7669 -1194
1599 -1194 5172 614 -3747 -2613 3911 6490 -5646 -9693 7383 9500 -7731 -6450 6923 3052
1613 3052 -5869 -1548 4704 2923 -2528 -6858 330 10939 -59 -12090 2227 9582 -5163 -5976
1627 -5976 6589 4218 -5336 -4578 1304 6003 3665 -7674 -6344 9324 4031 -10258 1360 9952
1641 9952 -5073 -8698 4199 6754 361 -4233 -5452 2316 8315 -3336 -7599 7696 4282 -12167
1655 -12167 -1060 12746 470 -8509 -2242 2274 4221 1893 -5543 -1368 7159 -3578 -9050 9613
1669 9613 9734 -11678 -7742 8058 4096 -1763 -1130 -2458 1041 2583 -4934 -134 11125 -2517
1683 -2517 -15279 4119 13442 -3997 -6408 2571 -166 -865 1419 -930 3209 3308 -10027 -5762 14398
1698 14398 5905 -13485 -2234 8194 -2846 -2565 4915 512 -1490 -2494 -5538 5530 11724 -7210
1712 -7210 -12676 7714 7551 -7905 241 7727 -4511 -5989 1697 2684 5902 726 -11993 -2186
1726 -2186 13046 -90 -9568 5568 4910 -10486 -2017 9984 2041 -3272 -4294 -4898 6651 8409
1740 8409 -7834 -5228 8631 -1903 -9846 7586 10182 -7866 -7580 2392 2838 4784 384 -8516
1754 -8516 937 6997 -6272 -2869 12217 64 -14439 376 10583 508 -2546 -1821 -3741
1767 -3741 3565 3324 -5527 3140 7648 -9909 -8933 12106 7871 -8866 -3879 3116 -713 1471 1793
1782 1793 -2476 2771 158 -9820 2819 14154 -4207 -12531 3887 6390 -3476 -22 2973 -2169
1796 -2169 -1234 -1456 -2127 8118 4912 -12634 -4897 11913 1760 -7555 2583 3513 -5113 -1889 3266
1811 3266 2571 2753 -4053 -8848 5798 10341 -6869 -6102 7261 112 -7251 3037 6391 -1511 -3809
1826 -3809 -3204 360 7907 1517 -9723 533 8087 -5062 -4659 8498 2475 -8065 -2515 3836
1840 3836 3527 1469 -4336 -4559 5503 3353 -7150 1178 8467 -5303 -8204 5682 6266 -2416 -3493
1855 -3493 -1503 1483 3793 -1678 -4012 4740 2771 -8794 -1008 10452 3 -8035 -136 3748
1869 3748 1000 -641 -1916 499 3182 -2802 -5067 5904 6331 -7747 -5589 6935 3059 -4104
1883 -4104 -994 1544 820 -813 -2800 1261 5695 -1940 -8010 2579 8006 -3275 -5501 3529 2609
1898 2609 -2711 -1573 1220 3023 238 -5293 -1445 6848 1805 -7216 -757 6476 -1111 -4947 2122
1913 2122 3632 -1011 -3366 -1459 3917 3296 -4496 -3899 4863 3277 -5315 -1897 5621 652 -5066
1928 -5066 -676 3554 2176 -2357 -3845 2178 4579 -2588 -4431 3325 4160 -4053 -3826 4245 3278 -3193
1944 -3193 -3040 1445 3620 -437 -4441 669 4902 -1338 -5050 1628 5255 -1698 -4945 1488 4093
1959 4093 -661 -3413 -446 3675 1009 -4525 -852 4909 735 -4946 -887 4745 952 -4388 -964
1974 -964 3771 1329 -3308 -2118 3471 2654 -3984 -2661 4062 2672 -3720 -2781 3492 2770 -3265 -2650
1990 -2650 2874 2823 -2325 -3386 2274 3826 -2478 -3698 2337 3653 -1891 -3810 1669 3918 -1623
2005 -1623 -3749 1246 3709 -628 -4110 465 4352 -564 -4161 398 4005 118 -4126 -242 4181
2020 4181 211 -3935 -547 3746 1082 -3935 -1214 4034 1189 -3711 -1430 3463 1859 -3509 -1955
2035 -1955 3539 1922 -3163 -2188 2841 2688 -2833 -2817 2882 2639 -2532 -2751 2240 3198 -2236 -3199 2182
2052 2182 3112 -1773 -3278 1477 3676 -1514 -3763 1582 3455 -1180 -3400 796 3677 -593 -3715
2067 -3715 415 3540 61 -3596 -441 3896 224 -3885 -81 3488 393 -3236 -990 3289 1236
2082 1236 -3279 -1458 3120 1835 -3220 -1902 3670 1693 -3622 -1446 2998 1750 -2290 -2293 2051 2541
2098 2541 -2034 -2724 2146 2998 -2444 -3182 2793 2839 -2521 -2264 1512 2254 -694 -2734 610 3183 -751
2115 -751 -3740 795 4265 -984 -4189 1224 3259 -984 -2177 171 2012 535 -2781 -909 3699
2130 3699 1063 -4220 -1131 4247 633 -3671 213 2507 -400 -1646 -701 1755 2228 -2525 -3180 3090
2146 3090 3282 -3169 -2529 3281 1177 -3086 -139 2252 548 -1129 -2349 475 4073 -563 -4443
2161 -4443 1276 3616 -2387 -2532 3290 1656 -3140 -1398 1288 1775 1143 -2853 -2185 3696 1184 -4003
2177 -4003 815 3978 -2253 -3789 2410 2882 -937 -1363 -1378 460 2989 -1163 -2805 3241 1273 -5017
2193 -5017 11 5490 -298 -4114 -46 1457 618 949 -1561 -1009 2706 -1421 -3455 4315 3523 -5257
2209 -5257 -2711 3852 1222 -1421 375 -554 -835 1219 -1207 -302 4477 -1305 -6458 2375 5565 -2394
2225 -2394 -2521 1807 -420 -1317 1490 470 318 1153 -3565 -2515 6143 2283 -6031 -297 3537 -2068
2241 -2068 -917 3262 -15 -2012 -495 -1251 1569 4730 -2572 -5734 3425 3145 -3828 887 3542
2256 3542 -3068 -2877 1937 1384 1331 584 -4393 -1725 5439 438 -4190 2849 1715 -5563 119 5351
2272 5351 -153 -2097 -911 -1937 1811 4085 -2466 -2915 3453 -802 -4424 4342 4418 -4858 -2838 2075
2288 2075 426 1663 1283 -3493 -923 2965 -1822 -1276 5494 -362 -7198 1213 5211 -1113 -825 325
2304 325 -2647 468 2529 -1438 614 2839 -4166 -4057 5926 3538 -4789 -931 1692 -1892 1106
2319 1106 2585 -1609 -224 350 -3564 1119 6238 -1793 -6010 2177 2722 -2479 1320 2275 -2852 -1074
2335 -1074 827 -731 3026 2270 -5428 -2544 5372 862 -3346 2112 1072 -4110 284 3145 -161
2350 -161 496 -1000 -4049 2033 4912 -2611 -2830 3060 -627 -3593 2852 3407 -2552 -1690 -118 -627
2366 -627 3239 1686 -4339 -543 3256 -2059 -1484 4445 407 -4799 -101 2709 224 875 -549 -3058
2382 -3058 1537 2242 -2561 709 3444 -3088 -3627 3556 2793 -1992 -814 -190 -990 1893 975 -2163
2398 -2163 1293 1145 -3954 150 4983 -656 -3895 715 1424 -720 839 362 -1314 624 -234 -2090
2414 -2090 2638 2808 -3962 -2277 3399 819 -1788 726 492 -1291 126 376 -62 1931 -305 -3803
2430 -3803 1085 3837 -1650 -1995 1881 137 -1715 645 1262 12 -178 -1396 -1057 2792 1385 -3375
2446 -3375 -318 2699 -1103 -1518 1915 818 -1409 -749 145 827 1354 -1043 -2169 1599 1663 -2284 -173
2463 -173 2576 -890 -2150 765 1351 198 -622 -1210 87 1695 -242 -1885 1242 1646 -2268 -1020
2479 -1020 2447 523 -1546 -515 398 776 184 -980 -113 1414 -267 -1953 974 2244 -1529 -1754
2495 -1754 1276 1057 -426 -669 -254 825 371 -1225 -335 1763 337 -2239 -137 2160 -236 -1474
2511 -1474 320 811 118 -657 -459 1016 762 -1342 -894 1487 1048 -1605 -868 1602 405 -1176 -298
2528 -298 790 754 -642 -1153 806 1274 -817 -1264 796 1355 -827 -1157 1064 866 -784 -802 404 1185
2546 1185 -236 -1469 325 1416 -347 -1427 194 1456 -256 -1421 335 1191 -102 -1032 -217 1279
2562 1279 346 -1325 -225 1246 293 -1117 -442 1307 409 -1275 -303 1099 465 -945 -717 1013 797
2579 797 -1116 -734 987 862 -795 -997 900 982 -931 -809 751 887 -516 -1056 609 1114 -626
2596 -626 -1009 486 1032 -381 -1271 460 1208 -455 -1058 235 1087 37 -1314 -9 1302 -90 -1124
2613 -1124 -127 1128 256 -1206 -161 1192 187 -907 -386 944 601 -1234 -481 1196 384 -993
2629 -993 -487 966 633 -1005 -631 834 636 -608 -870 584 1121 -826 -1013 935 824 -680 -840
2646 -840 493 843 -395 -838 320 888 -131 -1192 142 1538 -482 -1349 551 978 -299 -849 66
2663 66 839 78 -864 -220 972 514 -1316 -495 1580 153 -1228 120 713 -69 -504 -264 613 597 -728
2682 -728 -981 790 1313 -1096 -1059 1269 393 -1122 55 728 207 -332 -842 145 1267 -29 -1496 129
2700 129 1475 -710 -1071 1299 583 -1106 -269 369 542 438 -894 -774 1155 574 -1368 11 1637
2717 1637 -739 -1568 1007 1052 -381 -362 -666 31 1157 -379 -1111 945 763 -1732 -270 2215 -82
2734 -82 -1705 244 421 24 588 -580 -614 1049 -404 -1446 1391 1619 -1893 -1375 1602 586 -659
2751 -659 389 -357 -585 845 -430 -405 1687 -200 -2500 625 2389 -728 -1254 934 -195 -754 929
2768 929 118 -224 783 -1344 -1387 2416 1293 -2408 -497 1538 -649 -525 1489 -130 -1045 224 -569
2785 -569 167 2257 -796 -2740 1186 1544 -1474 78 1632 -1204 -1377 1091 536 261 694 -1825 -1306
2802 -1306 2562 588 -2041 1023 968 -2237 -206 2352 14 -1112 -47 -993 281 2294 -828 -1902
2818 -1902 1551 -11 -2111 1748 2168 -2082 -1486 908 186 545 987 -1674 -1052 1793 -459 -1201 2476
2835 2476 237 -3398 330 2389 -344 -353 220 -1376 -34 1684 -567 -387 1653 -1554 -2426 2708
2851 2708 1994 -2228 -580 762 -874 557 1432 -934 -438 645 -1577 -165 3318 -360 -3350 812
2867 812 1491 -1114 708 1088 -1591 -556 711 -459 965 1667 -2372 -2025 2700 1016 -1876 824
2883 824 609 -2087 190 1556 -248 380 -53 -2223 364 2944 -699 -2023 1349 75 -1947 1508
2899 1508 1754 -1370 -673 -56 -741 1666 1412 -2256 -945 1904 -587 -1159 2223 496 -2658 -20
2915 -20 1246 -43 817 -184 -2089 550 1740 -1126 -236 1816 -1196 -2291 1726 1707 -1146 -288 -224
2932 -224 -986 1241 941 -1424 290 983 -1877 -491 2705 218 -2366 120 747 -375 877 209
2948 209 -1258 480 371 -1291 1117 1865 -1782 -1758 1683 865 -927 401 73 -1026 499 316 -561
2965 -561 1234 202 -2392 135 2399 -411 -1380 678 180 -928 548 623 -383 219 -600 -1127 1606
2982 1606 1311 -1882 -639 1421 -263 -832 941 481 -905 -215 3 104 1249 -247 -1751 722
2998 722 1389 -1105 -479 1248 -272 -1208 299 751 105 10 -718 -557 1287 378 -1426 376 1044 -1199
3016 -1199 -691 1217 488 -756 -403 75 362 546 -467 -760 917 323 -1340 390 1399 -685 -1044
3033 -1044 397 572 32 -220 -355 141 606 -476 -676 1028 566 -1435 -272 1280 64 -734 -77
3050 -77 286 218 -251 -409 256 702 -486 -1015 805 955 -905 -641 680 346 -364 -289 160 383 -89 -646
3070 -646 130 948 -58 -1104 259 1088 -418 -673 385 513 -157 -574 -30 774 119 -841 -255 862
3088 862 317 -936 -146 925 -131 -675 8 568 246 -522 -390 617 477 -583 -588 583 596 -722 -458
3107 -458 732 345 -582 -392 398 603 -406 -654 404 678 -346 -679 356 748 -462 -733 443 613
3125 613 -314 -601 183 681 -156 -746 165 690 -65 -763 -4 838 -12 -777 77 722 36 -661 -174 754
3145 754 167 -768 -188 673 328 -713 -433 794 348 -701 -304 496 387 -542 -484 602 493 -554 -474
3164 -474 432 536 -454 -595 513 556 -420 -530 245 613 -238 -677 266 717 -300 -675 205 710 -186 -704
3184 -704 178 633 -95 -597 -4 666 168 -765 -18 760 18 -747 -74 711 168 -674 -62 527 221 -452
3204 -452 -367 572 442 -757 -444 773 325 -635 -359 454 359 -478 -377 345 450 -272 -703 412 860 -538
3224 -538 -684 574 433 -436 -373 313 477 -258 -511 37 665 143 -928 38 960 -288 -725 392 504
3243 504 -254 -524 42 525 191 -559 -484 669 513 -937 -206 991 -141 -864 185 615 43 -389 -322
3262 -322 270 590 -257 -706 485 694 -948 -461 1041 114 -755 -170 278 313 151 -409 -70 680 -104
3281 -104 -907 421 1032 -846 -871 812 423 -368 -36 -149 36 358 -407 -282 949 130 -1301 110
3299 110 1371 -365 -830 398 53 -236 230 -99 77 495 -679 -664 1109 810 -1191 -500 1000 -180
3317 -180 -507 569 65 -307 71 -435 200 1163 -386 -1347 607 1020 -835 -288 954 -323 -776 473
3335 473 215 185 383 -1000 -557 1326 263 -1177 379 723 -1043 -347 1127 73 -585 -41 -566 231
3353 231 1185 -620 -1014 936 110 -1183 641 1234 -943 -937 480 102 212 464 -929 -453 1018 -380
3371 -380 -683 1298 262 -1721 -31 1345 -102 -403 173 -549 -29 918 -443 -314 1020 -754 -1402
3388 -1402 1347 1175 -1198 -449 538 -331 65 738 -398 -263 463 -927 -179 1900 -164 -1869 377
3405 377 943 -583 128 590 -650 -431 400 -270 481 1055 -1299 -1169 1545 539 -1087 381 421 -1022
3423 -1022 -13 882 -28 52 -5 -1233 110 1765 -482 -1242 928 153 -1201 698 1014 -682 -436
3440 -436 63 -284 723 839 -1245 -631 1230 -300 -828 1210 283 -1548 -26 773 -1 293 -96 -1125
3458 -1125 176 1085 -670 -301 1283 -660 -1427 1118 1040 -712 -107 -81 -505 642 556 -734 111 642
3476 642 -1046 -347 1756 32 -1445 316 427 -292 469 159 -727 219 232 -681 525 1187 -1113 -1186
3494 -1186 1133 530 -688 375 102 -707 277 273 -242 564 81 -1381 -6 1586 -259 -994 644 105
3512 105 -755 484 419 -352 174 -315 -612 895 833 -1072 -531 952 -153 -638 779 311 -764 8
3530 8 94 -2 772 -215 -1111 385 859 -591 -269 866 -248 -881 445 531 -181 93 -413 -365 836 189
3550 189 -858 276 572 -780 -387 943 222 -736 -112 83 -5 439 -223 -472 578 169 -830 301
3568 301 920 -536 -746 467 371 -246 74 -127 -145 392 -218 -406 730 187 -923 -94 794 -29 -540
3587 -540 115 141 -134 45 -86 10 414 -332 -625 602 583 -641 -273 509 103 -373 45 199 9 -50 -290
3608 -290 10 691 -98 -748 321 547 -345 -315 291 175 -270 -180 118 241 80 -425 -257 626 151 -582
3628 -582 122 419 -246 -359 187 366 -26 -341 -77 248 242 -373 -304 455 247 -544 -18 447 -34 -347 -104
3649 -104 347 155 -240 -164 161 332 -273 -323 397 275 -411 -208 390 200 -192 -286 176 255 -216 -351 61
3670 61 381 -93 -399 143 437 -203 -287 168 249 -54 -336 28 354 -38 -339 -25 335 55 -477 -41 452
3691 452 -21 -345 -28 322 112 -381 -83 350 121 -261 -203 295 231 -358 -141 377 134 -297 -178 206 227
3712 227 -295 -202 247 176 -176 -296 204 346 -293 -256 246 233 -173 -253 141 267 -214 -292 130 280 -91 -348
3734 -348 10 390 -161 -310 201 222 4 -263 -30 340 -17 -366 -11 368 80 -362 -55 357 -13 -288
3754 -288 -44 212 132 -251 -237 283 151 -338 -144 302 199 -311 -195 323 108 -272 -135 109 281 -119 -293
3775 -293 190 302 -227 -273 210 269 -258 -233 283 205 -45 -183 -101 340 30 -422 134 446 -149 -350 126 327
3797 327 -209 -226 101 100 123 -141 -219 360 179 -516 -31 439 -51 -378 31 275 -4 -144 -14 -52 214 -119
3819 -119 -366 328 344 -526 -245 437 65 -279 8 116 -98 -36 -60 -58 324 -31 -551 192 561 -363 -292 353
3841 353 9 -189 84 156 -7 10 -141 -216 488 240 -645 -30 521 -244 -238 405 28 -255 -86 -15 132 372
3863 372 -158 -572 396 455 -514 5 553 -386 -429 351 116 -32 15 -299 -192 488 52 -543 314 337 -622
3884 -622 -91 742 -54 -371 98 -81 52 389 -162 -291 365 33 -516 412 688 -690 -450 541 16 -47
3904 -47 269 -293 -218 350 -102 -170 593 21 -885 193 801 -318 -210 362 -347 -186 422 -107 -119 406 -411
3925 -411 -539 763 474 -740 -137 517 -382 -52 633 -169 -305 218 -333 -6 870 -270 -871 292 500
3944 500 -454 127 650 -528 -358 450 -44 116 416 -611 -483 761 148 -586 359 314 -787 23 776
3963 776 -157 -213 158 -508 77 828 -290 -501 413 -96 -672 498 575 -641 -349 280 -166 172 507 -601
3983 -601 -270 560 -269 -292 804 94 -982 166 609 -209 21 236 -622 16 620 -289 -23 607 -525
4002 -525 -730 766 479 -601 -75 269 -413 132 525 -370 -142 339 -565 -83 1025 -202 -837 326
4020 326 250 -363 292 308 -500 -192 196 -274 245 641 -751 -548 828 122 -437 412 135 -625 156 430
4040 430 -140 121 71 -712 28 883 -350 -470 484 -130 -515 463 378 -352 -75 -3 -282 320 419 -613 -196
4061 -196 577 -375 -298 636 10 -658 103 244 -61 224 21 -538 120 439 -376 2 652 -376 -626 573
4081 573 287 -350 53 -14 -261 306 227 -324 84 303 -521 -148 772 -80 -519 203 85 -205 302 19 -360
4102 -360 144 58 -331 236 505 -481 -420 411 97 -249 219 2 -256 206 27 -166 331 59 -536 71 581
4123 581 -262 -315 324 -14 -260 266 101 -99 134 -167 -228 408 267 -441 -122 354 -141 -197 306 52 -208
4144 -208 31 -26 -7 303 -9 -387 192 249 -275 -109 338 -90 -339 181 99 22 101 -114 -109 324 -50 -334 129
4167 129 238 -239 -143 307 32 -193 18 5 66 182 -156 -112 257 -7 -243 78 216 -134 -194 162 140 -112
4189 -112 0 -46 0 142 -114 -157 296 72 -233 -5 224 45 -133 44 31 -13 -35 -102 35 148 -124 -162 193
4212 193 179 -224 -96 108 82 -111 -31 132 56 -3 -78 40 253 -42 -225 75 163 -5 -133 100 100 -53 -123
4235 -123 107 111 -21 -152 -110 206 57 -167 5 98 0 -176 24 128 -51 -117 -21 100 78 -160 -91 172 63
4258 63 -113 -50 180 52 -105 -95 144 81 -126 -68 31 117 -75 -133 88 102 -126 -71 84 109 -70 -183 48 130
4282 130 -54 -77 -1 176 -12 -202 2 138 -77 -102 41 189 0 -147 15 110 -24 -123 -93 113 70 -157
4304 -157 -40 141 35 -132 -78 116 95 -128 -34 120 111 -154 -160 118 117 -166 -96 154 23 -62 -108 25 129 -37
4328 -37 -122 103 149 -86 -201 78 187 -101 -105 26 30 0 -53 -88 171 2 -160 3 196 -36 -195 33 125 -77
4352 -77 -48 1 -36 39 -25 -126 119 112 -199 -100 129 55 -139 -21 94 -116 -5 -28 22 174 -7 -186 98 190
4376 190 -76 -177 210 27 -141 63 76 -74 25 -51 -123 151 55 -283 15 239 -116 -113 155 61 -214 26 31
4399 31 11 123 -66 -297 200 177 -237 5 237 -163 -153 178 90 -147 45 -55 -126 221 86 -264 149 160
4421 160 -347 26 344 -10 -254 82 -41 2 239 -42 -215 194 104 -294 217 261 -379 -122 266 -15 -49
4442 -49 142 -119 -168 163 -23 -190 300 30 -482 121 405 -213 -136 205 -137 -83 262 5 -106 254 -120
4463 -120 -331 421 233 -417 -24 317 -175 -12 264 -165 -112 73 -109 -10 409 -82 -541 178 284 -333 137
4484 137 261 -415 -181 251 -33 22 233 -321 -267 490 166 -340 158 178 -400 94 424 -114 -82 82 -275
4505 -275 3 505 -103 -349 361 41 -329 304 337 -437 -134 197 -155 180 340 -387 -225 341 -117 -221
4525 -221 433 39 -638 74 385 -154 46 123 -413 -2 399 -233 -94 389 -332 -375 428 283 -398 -14 119
4546 119 -307 202 326 -318 -21 269 -396 -68 632 -53 -512 161 225 -222 217 176 -407 61 198 -258 154
4567 154 337 -469 -292 495 43 -302 232 73 -378 151 262 -194 99 131 -504 26 562 -204 -296 286 -52
4588 -52 -265 333 196 -300 4 49 -289 292 330 -526 -190 419 -76 -202 417 -43 -403 88 142 -108 228
4609 228 27 -521 179 365 -252 -65 351 -243 -333 331 195 -163 39 -37 -326 291 213 -366 77 223 -382
4630 -382 -85 491 -52 -273 175 -33 -52 204 9 -347 140 141 -312 156 377 -364 -229 333 63 -71 72
4651 72 -101 -166 102 87 -201 199 137 -443 6 466 -69 -157 93 -48 -87 204 -8 -179 95 -45 -244 278
4673 278 256 -335 -105 243 -73 -114 252 8 -125 12 -127 -30 204 -11 -358 58 238 -158 -70 238 -107
4694 -107 -94 148 -55 9 39 -124 -114 233 81 -251 50 202 -192 -142 249 59 -94 48 -132 78 200 -84
4716 -84 -149 143 91 -151 3 232 -64 -205 79 14 54 86 -163 -8 145 -95 -119 133 40 -204 -46 175 -7
4739 -7 -110 -10 0 26 72 -131 -24 133 -11 -177 90 111 -130 -138 122 -1 -33 -32 -62 37 105 -165 -8 216 -3
4764 -3 -176 46 184 -31 -192 -1 32 -42 -33 -115 28 73 -123 -130 150 54 -148 -37 162 -8 -97 8 131 27
4788 27 9 -87 105 197 -17 -91 105 78 -77 -145 19 113 -91 -55 23 66 22 -109 -65 172 -41 -138 12 49 -24
4813 -24 -103 36 92 -43 -95 -59 93 24 -153 -41 109 -6 -149 -48 99 92 -101 -68 41 61 -33 -79 67 46
4837 46 -80 -58 135 -16 -89 -54 86 97 -88 -53 142 68 -12 -103 -4 179 -87 -139 57 70 -51 -90 20 140
4861 140 18 -100 25 77 9 -125 5 78 -1 -196 43 88 3 -123 -97 118 77 -111 -37 86 73 -97 -71 119
4885 119 26 -159 -14 113 42 -57 -56 63 108 -33 -123 120 116 -110 -149 132 65 -101 -55 40 59 44 -91 25 187
4910 187 -50 -196 10 165 -49 -150 94 83 -79 -63 -41 82 60 -123 32 153 15 -204 -38 176 6
4931 6 -164 77 56 -80 82 -84 24 164 -136 -93 136 117 -189 -65 138 -23 -150 78 57 -10 46 -162 -17
4954 -17 221 -38 -205 125 145 -213 -95 176 61 -62 -40 -39 -24 86 -124 -144 189 -8 -235 140 167 -159 -118
4977 -118 179 60 4 17 -144 -2 213 -124 -143 248 -11 -274 72 237 -57 -109 78 -10 32 146 -97 -6
4999 -6 243 -166 -249 286 127 -315 -98 156 -93 -46 29 -59 -25 98 -135 -24 357 -45 -379 208 198 -223 16
5022 16 136 -120 -20 98 -10 43 111 -312 -168 388 35 -293 150 152 -174 15 205 -37 -20 -27 -185 95 289
5045 289 -216 -349 252 51 -260 199 139 -244 -64 61 -67 112 103 -279 -41 317 -110 -180 347 -16 -379
5066 -379 109 209 -169 63 13 -264 165 328 -237 -107 305 -185 -327 348 163 -328 9 48 -85 171 47
5087 47 -224 52 181 -310 -60 494 -106 -418 181 196 -157 101 62 -258 42 119 -200 190 226 -397 -219 376
5109 376 103 -276 163 42 -229 164 91 -142 151 12 -339 134 388 -145 -253 244 17 -216 215 146 -202
5130 -202 123 10 -214 330 191 -365 -110 303 -101 -217 272 -23 -322 96 112 -71 225 -87 -384 265
5150 265 281 -284 -32 278 -213 -231 249 198 -196 71 -53 -152 308 77 -298 158 211 -313 6 435 -44 -290
5172 -290 29 65 -39 177 -39 -271 173 109 -275 233 259 -359 -177 269 65 -155 16 -96 -97 122 22 -171
5194 -171 199 1 -475 60 342 -142 -159 120 -8 -84 139 -23 -67 122 -95 -197 281 148 -351 -74 253
5215 253 -28 -78 123 -5 -117 47 -112 -1 270 -67 -320 151 258 -221 -67 162 -91 -113 86 -2 1 37
5237 37 -165 -122 275 65 -309 105 175 -189 -88 188 3 -125 -59 -70 85 170 -124 -192 202 57 -228 97
5259 97 228 -154 -156 119 54 52 -19 -88 23 151 -104 -136 203 90 -276 47 235 10 -118 12 4 19 11 -93 -17
5284 -17 167 -87 -228 126 184 -183 -112 105 1 -19 0 -42 63 50 -150 22 172 -75 -273 45 172 -74
5306 -74 -94 50 67 15 -23 -53 40 71 -176 -69 165 63 -195 -61 156 -43 -102 66 53 -24 -91 -111 66 105 -158
5331 -158 -98 58 109 -179 -106 150 -22 -113 -78 58 122 -62 -156 69 74 -47 -91 64 159 -116 -140 126 20 -69
5355 -69 -72 40 128 -31 -167 13 89 -60 -166 -7 162 -8 -146 -13 24 -2 -68 -64 88 68 -197 -78 78 49
5379 49 -172 -49 135 12 -159 -48 99 21 -88 -50 114 93 -85 -85 86 79 -84 -82 136 73 -105 -79 22 65
5403 65 42 -84 13 96 -23 -88 125 31 -60 -115 17 145 -23 -5 10 104 25 -189 -17 109 -33 -111 45 85 22
5428 22 -66 22 97 -20 -33 -52 113 106 -129 -42 182 -35 -78 -31 96 3 -107 -101 92 66 -54 -130 88 157 -81 -96
5454 -96 133 29 -81 -39 18 69 -35 -119 47 13 -53 -91 19 180 -68 -127 66 9 -58 -34 -15 76 -23 -92 -27 128
5480 128 59 -205 -1 127 -61 -86 47 50 37 -30 -86 116 73 -67 -108 126 79 -193 -94 221 7 -181 41 40
5504 40 80 0 -92 -6 120 -78 -124 93 168 -216 -100 161 58 -60 -7 -23 12 27 -142 -38 135 -40 -178 123
5528 123 249 -113 -203 110 25 -67 6 -47 37 97 -188 -118 215 38 -237 -20 174 -38 -103 71 -47 14 55 -108
5552 -108 21 140 -142 -173 194 136 -155 14 219 -95 -66 149 -54 34 28 -176 -37 197 -138 -170 129 45 -230
5575 -230 -42 173 -44 -58 53 -72 95 199 -202 -159 230 -17 -205 209 108 -289 -83 117 16 64 108
5596 108 -177 -26 237 -101 -78 345 -60 -304 118 214 -69 -48 52 -99 83 170 -149 -5 227 -213 -180 321
5618 321 48 -267 28 119 -87 55 67 -103 2 45 -209 32 374 -213 -310 194 84 -123 64 13 -156 63
5640 63 84 -103 139 157 -343 -56 451 -29 -217 174 34 -240 67 127 -64 85 -56 -286 112 310 -246
5661 -246 -228 300 -104 -237 285 100 -195 -40 -11 -81 174 98 -259 -17 248 -193 -137 341 -56 -290 129 154
5683 154 -68 55 -60 -248 162 133 -210 34 262 -246 -238 362 139 -236 -17 24 -98 264 36 -232 95
5704 95 100 -329 32 389 -179 -287 202 50 -84 191 -40 -124 126 -4 -173 231 163 -342 -186 283 17 -125
5726 -125 137 4 -165 114 80 -95 190 -24 -343 141 253 -203 -150 225 -67 -168 137 37 -91 54 -119
5747 -119 -71 273 69 -351 41 197 -126 -60 194 -44 -201 60 -30 9 185 -131 -219 180 124 -153 3 231
5769 231 -152 -189 121 75 -77 60 -91 21 203 24 -220 110 136 -251 -11 267 -61 -131 85 24 37 122
5791 122 -93 -117 187 -17 -173 156 167 -211 -76 132 25 -55 1 -93 -17 103 -115 -75 202 1 -239 67
5813 67 183 -91 -81 73 -17 -81 65 -30 41 120 -108 -155 202 88 -237 -4 130 -16 -95 7 22 -11 16 -62
5837 -62 43 137 -94 -165 97 170 -143 -43 159 -7 -67 2 -18 21 19 -77 -38 191 19 -253 19 104 -127 -12
5861 -12 92 -35 -45 -62 -27 47 93 -90 -143 127 7 -171 64 109 -37 -15 -12 73 -8 -49 -85 58 59 -42 -135 94
5887 94 57 -158 44 83 43 -49 -63 28 56 -28 -63 34 88 -60 -167 79 111 -123 -67 56 79 -18 -48 -28 82 -25
5913 -25 -114 79 155 13 -158 62 125 -51 -40 -16 43 27 -86 -32 103 4 -130 -43 132 86 -93 12 80 -47
5937 -47 -34 -47 19 123 -24 -82 38 63 -44 -81 72 80 -123 -63 71 -45 -45 -58 -6 118 12 -110 39 68 -55
5962 -55 -91 51 112 -90 -69 63 66 -2 -73 -49 61 -18 -89 39 44 17 -79 41 73 -35 -74 -26 34 48 -20 -76 81
5989 81 76 -130 -34 91 81 -85 -10 76 -43 -83 46 47 26 2 -38 58 110 -112 -79 37 115 -71 -30 112 23 -8 -62
6016 -62 -42 79 32 -158 47 110 -23 -66 3 139 10 -115 -10 43 36 -29 -64 73 36 -120 -40 115 -37 -61 -31
6041 -31 1 60 -32 13 3 9 -26 -142 54 146 -112 -39 122 2 -27 -37 39 -11 -29 -13 -64 97 -20 -151 126 166
6067 166 -124 -60 54 -7 -1 -4 6 39 20 -74 -34 120 72 -224 -11 173 -78 -9 87 22 -36 -20 -1 8 112 -94 -211
6094 -211 104 99 -154 -6 113 -105 -20 118 -22 -35 18 -102 -20 155 -64 -174 128 137 -155 40 197 -46 -65
6117 -65 94 -95 18 140 -126 -124 165 -6 -141 138 156 -215 -25 149 4 2 6 -120 -52 161 -83 -76 156 -4
6141 -4 -269 56 190 -129 -49 76 -141 71 147 -119 -46 185 -162 -155 263 65 -239 28 114 -142 88 137 -190
6164 -190 42 157 -140 26 292 -145 -267 128 120 -128 -8 132 -154 -5 125 -131 67 173 -307 -66 305
6185 305 -11 -170 83 23 -195 79 140 -204 8 43 -265 62 260 -165 -136 232 -24 -143 209 91 -232
6206 -232 35 101 -101 129 132 -283 -26 285 -113 -190 236 -28 -280 170 94 -60 58 16 -207 64 267 -202
6228 -202 -84 200 -178 -115 235 38 -163 26 -60 -135 184 125 -230 29 165 -232 5 314 -177 -241 147 19
6250 19 -43 129 -33 -201 100 132 -164 67 172 -238 -137 285 -38 -156 166 -56 -157 151 0 -164 135
6271 135 49 -241 -6 326 -165 -116 197 -104 -138 221 -17 -188 57 -11 -196 183 170 -294 -81 253 -108 -119
6293 -119 213 -25 -190 161 5 -37 156 -49 -258 93 229 -117 -47 132 -140 -160 177 -27 -61 87 -114
6314 -114 -130 271 66 -237 32 157 -171 -25 241 -11 -130 105 -34 -24 178 -37 -218 147 81 -188 62
6335 62 151 -191 -117 117 -43 -52 57 -94 -102 128 -59 -116 129 35 -172 44 175 -51 -82 77 -48 -62 144 -64
6359 -64 -94 184 -50 -93 118 95 -173 -33 82 -17 14 72 -78 0 118 -57 -50 146 -77 -117 21 86 -94 -35
6383 -35 15 -29 -52 79 -25 -35 128 -125 -113 191 23 -136 34 45 -55 -20 75 0 -22 26 -11 41 155 -74 -95
6408 -95 64 30 -81 48 36 -12 -37 20 22 -9 52 -22 -131 88 9 -78 41 66 -55 -17 25 -28 -21 -7 -52 32 83 -69
6436 -69 -55 105 18 -117 83 114 -27 -11 -40 23 28 -6 -29 -1 96 -6 -37 140 -26 -68 -20 58 -21 -40 -34 28 44 5
6464 5 -4 -5 62 -17 -51 27 52 -137 -1 9 6 32 -57 -25 53 12 -35 42 115 79 -120 87 80 -31 -29 23 21 28 -20 -41 76
6495 76 25 -45 -16 105 61 -97 4 72 -4 -9 2 -33 17 -6 -21 38 14 -49 -85 59 88 -31 -64 71 12 -2 27 48
6523 48 28 -43 -96 30 86 0 -60 87 90 -25 -26 27 48 26 -43 -52 125 26 -90 -15 7 0 -93 8 134 -48 -33 -36 -4
6552 -4 67 -12 -77 30 51 -45 -7 3 13 -59 -32 9 -30 0 24 20 55 26 -58 34 37 -88 -17 21 41 -35 -23 56 65 53 -77
6583 -77 -87 79 45 -90 23 118 -60 -23 16 35 19 5 -49 7 46 25 -98 116 79 -121 40 61 -47 -111 52
6608 52 31 -71 4 -38 -7 72 -60 -69 64 92 -159 -11 111 -44 -60 6 -26 -7 -1 -42 10 117 -26 -112 72 130
6634 130 -114 20 77 -15 -3 26 -42 -14 52 -53 -72 156 74 -173 34 95 -84 -6 33 -57 -20 38 -38 6 106 -85
6660 -85 -122 108 29 -166 96 23 -156 -55 70 -17 50 69 -96 -4 148 -62 -109 154 28 -201 86 167 -98
6683 -98 55 49 -125 95 124 -141 -63 183 -39 -120 143 57 -161 11 24 -90 71 30 -184 40 120 -175 -94 157
6707 157 -42 -289 66 162 -34 57 54 -186 53 102 -151 101 146 -166 -112 259 66 -198 111 73 -131 81 121
6730 121 -86 48 30 -215 82 230 -163 -129 247 28 -135 88 55 -124 80 25 -85 119 140 -279 -52 257
6752 257 -53 -104 175 -28 -207 77 41 -102 128 -21 -218 118 195 -210 -28 209 -124 -126 199 79 -106 6
6774 6 -1 -122 147 72 -267 25 159 -203 20 206 -64 -151 141 85 -44 177 -46 -236 180 155 -209 132 134
6797 134 -312 -92 207 -9 -36 73 -113 -135 123 25 -186 80 29 -256 49 319 -193 -167 163 -48 -11 121
6819 121 -57 -113 139 -19 -175 211 151 -320 -46 236 -97 -16 128 -153 -42 145 32 -94 176 -36 -286
6840 -286 155 194 -213 -46 192 -136 -94 163 -7 -15 37 -91 -113 238 77 -243 44 147 -182 0 179 -177
6862 -177 -114 123 -84 45 119 -126 -129 88 90 -193 85 168 -197 -120 120 7 18 88 -117 -18 188 -32 -90 110
6886 110 48 -231 6 186 -165 -55 70 -142 64 138 -116 -17 150 -66 -143 204 138 -229 -56 123 -41 -65
6908 -65 96 -95 -21 148 -143 3 241 -21 -146 45 131 -104 -10 105 -63 15 52 -133 -19 90 -133 -57
6930 -57 231 34 -184 10 65 -53 -26 76 -18 -9 48 -117 46 159 -147 -127 99 -18 -133 -5 137 -67 -106
6953 -106 37 -13 -17 38 -177 22 183 -13 -58 120 21 -117 -56 71 -18 21 5 -59 24 82 -78 -27 143 -34 -139
6978 -139 30 61 15 -13 59 25 -2 21 -39 53 58 -131 -85 89 -21 -80 -31 70 -33 -27 15 1 -3 6 13 20 105 -145 -60
7007 -60 108 59 -98 -9 46 67 -20 -34 -5 53 -56 -69 59 155 9 -115 50 2 -66 -63 29 13 -17 -76 -15 26 -10
7034 -10 -107 -35 106 -36 -123 31 10 -48 -91 4 77 -1 27 -50 106 61 -85 -51 125 56 -87 -6 61 38 -46 -30 63
7061 63 19 -18 -80 41 94 -39 -42 69 64 -23 -2 53 67 15 -10 13 49 -46 -58 -63 60 -46 -140 15 42 -45 -62 47
7089 47 75 7 -98 -72 113 25 -101 -2 75 -10 -118 -8 32 14 -9 3 96 39 -27 -10 86 52 -82 -67 84 46 -61
7116 -61 -13 79 25 -15 -35 28 75 -69 -72 32 54 -60 -78 79 48 -106 -44 31 34 -27 -75 -34 92 -39 -99 71 46
7143 46 -100 -102 22 75 -55 21 -6 84 57 -87 -17 143 47 -133 7 142 24 -78 25 69 24 8 -41 58 108
7168 108 -76 -72 154 29 -154 10 63 12 -73 34 16 -14 2 -71 -13 108 -76 -159 59 149 -128 -47 111 67 -68
7193 -68 -3 0 37 65 -65 -56 115 -55 -127 95 69 -80 -43 89 90 -20 -39 -50 -16 77 -137 -123 156 -20 -216 40
7219 40 82 -36 -7 59 3 21 39 -102 -21 116 -74 -114 238 45 -240 40 88 -47 78 2 -55 2 8 -134 11
7244 11 149 -124 -182 153 33 -149 9 -8 -63 -8 -34 -96 107 75 -207 -65 225 2 -199 155 17 -102 89
7267 89 36 -74 45 -22 -69 72 151 -179 -196 183 12 -212 170 43 -118 1 22 -35 120 -4 -263 41 221
7290 221 -159 -127 184 -39 -153 125 131 -150 68 -86 -128 193 51 -210 7 185 -120 -142 234 31 -190 62
7312 62 21 -107 96 -45 -205 101 12 -241 13 249 -96 -216 197 60 -50 76 -75 -124 117 47 -174 127
7334 127 115 -255 -18 252 -31 -135 102 -50 -124 139 16 -96 137 14 -228 150 219 -198 -150 179 -43
7355 -43 -116 111 -22 -151 114 -84 -174 260 33 -277 70 180 -136 -110 162 -59 -147 74 57 -40 147 -85
7377 -85 -197 169 171 -247 43 210 -186 -55 168 9 -51 70 -75 -67 199 -102 -254 142 70 -188 59 173
7399 173 -150 -165 123 -10 -56 97 -91 -95 188 31 -194 157 127 -256 -45 192 -61 -54 25 -43 4 127 -78
7422 -78 -129 169 -4 -281 145 213 -143 -84 78 -31 24 92 -77 -58 163 -77 -140 265 46 -256 70 159 -69
7445 -69 -28 47 -41 1 16 -77 13 137 -166 -202 179 173 -178 10 141 -86 8 109 -15 -39 77 -159 -94 241 5
7470 5 -221 103 84 -168 -21 85 -65 -35 28 -30 52 102 -118 -35 155 23 -165 129 144 -158 -4 59 -50 50
7494 50 -7 -127 25 70 -89 -131 100 2 -205 31 86 -115 -67 25 -51 49 46 -139 24 97 -55 -125 148 109 -185
7519 -185 43 43 -67 -2 8 -62 94 -24 -141 -11 127 -69 -99 43 86 -111 -52 39 -52 41 -14 -91 52 47 -138
7544 -138 -57 147 -32 -135 -21 135 -97 -13 77 -69 50 -58 -146 69 60 -141 -46 86 49 -146 -36 88 -46
7567 -46 -39 -28 -2 69 24 -142 43 132 -65 -55 61 116 -83 -19 116 -29 -19 -17 31 110 46 -107 14 71 -62 -48
7593 -48 28 48 -28 -74 -1 -25 -5 -28 -88 97 57 -135 -24 139 18 -105 -48 76 23 -47 31 -10 65 -55 -66 66
7619 66 92 -132 -94 113 15 18 -53 64 26 8 -47 2 48 9 -97 -8 104 -79 -56 42 16 -8 -34 52 78 -41 -57
7646 -57 -18 46 -7 -130 -25 73 -41 -84 31 53 -6 -58 -79 65 20 -15 -77 23 57 -110 -55 130 34 -44 9 64
7672 64 55 -1 -18 44 7 -32 -92 47 81 -78 -39 101 60 -50 15 -27 7 16 -73 11 50 -35 -140 -39 58 -35 -112 44
7700 44 -38 -32 21 -24 33 24 -89 -36 79 66 -87 3 109 -8 -66 37 -28 24 32 -76 37 60 -99 -34 42 40 -70
7727 -70 -37 118 -29 -62 51 -59 42 13 -43 -19 72 -30 -75 77 83 -93 21 40 -7 -92 27 -37 19 7 -115
7752 -115 -45 69 -38 -131 39 55 -79 -84 38 -47 -8 -14 -80 -14 80 -104 -57 145 19 -106 -9 78 -45 -26 -19 9
7778 9 6 84 -71 -17 157 -70 -40 97 39 -119 48 89 -101 40 17 -31 41 33 -158 19 155 -80 -109 128 19
7803 19 -84 88 61 -111 -21 -19 -99 55 122 -194 -94 168 -23 -62 109 -56 -93 56 51 6 10 26 -123 59 170
7828 170 -172 -125 172 -79 -121 145 -3 -65 44 -10 -102 102 79 -195 -21 117 -125 -56 197 -33 -133 74
7850 74 41 -51 96 -1 -126 -11 128 -166 73 220 -157 -177 150 -29 -95 119 -68 -108 74 15 -82 148 156 -193
7874 -193 -28 229 -112 -105 138 -30 -114 149 10 -145 74 -32 -116 62 143 -274 -119 188 -125 -57 165 -4
7896 -4 -180 172 -2 -127 176 58 -185 23 192 -169 -97 159 -65 -114 152 9 -115 62 -23 -82 164 49
7918 49 -167 27 163 -157 -73 161 -53 -41 111 -56 -44 182 -45 -196 141 37 -133 -30 164 -98 -127 119
7940 119 -79 -23 80 -85 -105 211 9 -179 130 68 -187 21 191 -72 -31 70 -84 -62 162 -66 -131 171
7962 171 -86 -167 91 111 -135 -77 128 -67 11 140 -54 -52 155 -68 -197 222 6 -222 63 65 -137 -10 124
7985 124 -124 -60 65 -59 -1 181 -74 -153 159 58 -128 51 69 -128 4 102 -69 -41 84 -68 -14 204
8007 204 -40 -136 104 12 -133 86 51 -110 -25 57 -72 29 137 -82 -150 140 -15 -126 132 55 -165 -60
8029 -60 69 -28 21 6 -51 -2 113 -15 -69 141 7 -137 68 67 -94 -28 20 -57 40 119 -65 36 125 -39 -90
8054 -90 208 32 -124 45 101 -36 51 28 -74 -15 72 -22 -73 161 -28 -130 72 72 -136 60 25 -111 -44 67
8078 67 -80 -8 85 -126 -85 113 -12 -99 49 37 -14 19 11 -70 64 53 -30 21 67 -68 -77 97 21 -93 -36 -3 -25
8105 -25 59 -31 -29 34 20 -81 22 29 -46 -77 113 28 -54 8 53 -82 -4 24 -42 91 -11 -57 14 32 -22 -22 75 34 -80
8134 -80 -14 21 -3 25 -14 -74 29 21 -79 -49 72 51 -53 34 -5 -8 -5 -7 -39 17 -21 -101 -1 26 -43 -51 40 35 -44 2 -3
8165 -3 -11 19 50 -52 49 1 -61 7 65 -14 -44 22 25 -31 -10 13 -18 40 8 -20 16 3 -19 18 17 -19
8191a9
##END NTUPLES=NMR FID
##END=
