##TITLE=1H_Pr SucEt
 CD3OD, 8 sc, 
 11.06.2021
##JCAMPDX= 6.0         $$ Bruker NMR JCAMP-DX V2.0
##DATA TYPE= NMR FID
##DATA CLASS= NTUPLES
##ORIGIN= UXNMR, Bruker Analytische Messtechnik GmbH
##OWNER= root
$$ XWIN-NMR		Version 3.5
$$ Fri Jun 11 09:56:20 2021 Russian Standard Time (UT+4h)  she@DPX200
##.OBSERVE FREQUENCY= 200.131506
##.OBSERVE NUCLEUS= ^1H
##.DELAY= (6, 6)
##.ACQUISITION MODE= SIMULTANEOUS
##.ACQUISITION SCHEME= undefined
##.AVERAGES= 8
##.DIGITISER RES= 18
##SPECTROMETER/DATA SYSTEM= spect
##.PULSE SEQUENCE= zg30
##.SOLVENT NAME= MeOD
##.SHIFT REFERENCE= (INTERNAL, MeOD, 0, 15.7039)
##AUDIT TRAIL= $$ (NUMBER, WHEN, WHO, WHERE, WHAT)
$$ ##TITLE= Audit trail, XWIN-NMR		Version 3.5
$$ ##JCAMPDX= 5.01
$$ ##ORIGIN= Bruker BioSpin GmbH
$$ ##OWNER= she
$$ F:/spectra/data/she/nmr/H-F/1/audita.txt
$$ ##AUDIT TRAIL=  $$ (NUMBER, WHEN, WHO, WHERE, WHAT)
(   1,<2021-06-11 09:54:49.98 +0400>,<she>,<DPX200>,
      <created by zg, POWCHK disabled, PULCHK disabled
       configuration hash MD5:
       00 E9 B6 7A A2 85 ED C7 34 08 36 98 17 FE 4E 26
       data hash MD5: 16K
       6E C2 9C 1C 03 2F 68 24 CC B4 D2 F0 40 0B 29 9B>)
$$ ##END=
$$ 
$$ hash MD5
$$ 82 57 AD 79 4B 28 D4 2B 3B F5 57 A3 B7 BA 54 64
##$RELAX= 
##$RELAX= 
##$RELAX= 
##$RELAX= 
##$RELAX= 
##$RELAX= 
$$ Bruker specific parameters
$$ --------------------------
##$DU= <F:/spectra>
##$EXPNO= 1
##$NAME= <H-F>
##$PROCNO= 1
##$TYPE= <nmr>
##$USER= <she>
##$AMP= (0..31)
100 100 100 100 100 100 100 100 100 100 100 100 100 100 100 100 100 100 
100 100 100 100 100 100 100 100 100 100 100 100 100 100 
##$AQSEQ= 0
##$AQ_mod= 1
##$AUNM= <au_zg>
##$AUTOPOS= <>
##$BF1= 200.13
##$BF2= 200.13
##$BF3= 200.13
##$BF4= 200.13
##$BF5= 200.13
##$BF6= 200.13
##$BF7= 200.13
##$BF8= 200.13
##$BYTORDA= 1
##$CFDGTYP= 0
##$CFRGTYP= 5
##$CHEMSTR= <none>
##$CNST= (0..31)
1 1 145 1 1 1 1 1 1 1 1 1 1 1 1 1 1 1 1 1 1 1 1 1 1 1 1 1 1 1 1 1 
##$CPDPRG= <>
##$CPDPRG1= <>
##$CPDPRG2= <>
##$CPDPRG3= <>
##$CPDPRG4= <mlev>
##$CPDPRG5= <mlev>
##$CPDPRG6= <mlev>
##$CPDPRG7= <mlev>
##$CPDPRG8= <mlev>
##$CPDPRGB= <>
##$CPDPRGT= <>
##$D= (0..31)
0 1.2 0 0 0 0 0 0 0 0.06 0 0.03 0 0 0 0 0.0002 0 0 0 0 0 0 0 0 0 0 0 0 
0 0 0 
##$DATE= 1623390889
##$DBL= (0..7)
120 120 120 120 120 120 120 120 
##$DBP= (0..7)
150 150 150 150 150 150 150 150 
##$DBP07= 0
##$DBPNAM0= <>
##$DBPNAM1= <>
##$DBPNAM2= <>
##$DBPNAM3= <>
##$DBPNAM4= <>
##$DBPNAM5= <>
##$DBPNAM6= <>
##$DBPNAM7= <>
##$DBPOAL= (0..7)
0.5 0.5 0.5 0.5 0.5 0.5 0.5 0.5 
##$DBPOFFS= (0..7)
0 0 0 0 0 0 0 0 
##$DE= 6
##$DECBNUC= <off>
##$DECIM= 32
##$DECNUC= <off>
##$DECSTAT= 4
##$DIGMOD= 1
##$DIGTYP= 9
##$DL= (0..7)
0 120 120 120 120 120 120 120 
##$DP= (0..7)
150 150 150 150 150 150 150 150 
##$DP07= 0
##$DPNAME0= <>
##$DPNAME1= <>
##$DPNAME2= <>
##$DPNAME3= <>
##$DPNAME4= <>
##$DPNAME5= <>
##$DPNAME6= <>
##$DPNAME7= <>
##$DPOAL= (0..7)
0.5 0.5 0.5 0.5 0.5 0.5 0.5 0.5 
##$DPOFFS= (0..7)
0 0 0 0 0 0 0 0 
##$DQDMODE= 0
##$DR= 18
##$DS= 0
##$DSLIST= <SSSSSSSSSSSSSSS>
$$ [...]
##$SUBNAM2= <"">
##$SUBNAM3= <"">
##$SUBNAM4= <"">
##$SUBNAM5= <"">
##$SUBNAM6= <"">
##$SUBNAM7= <"">
##$SUBNAM8= <"">
##$SUBNAM9= <"">
##$SW= 20.0188882624521
##$SWIBOX= (0..15)
0 0 2 0 0 0 0 0 0 0 0 0 0 0 0 0 
##$SW_h= 4006.41025641026
##$TD= 16384
##$TD0= 1
##$TE= 0
##$TE2= 300
##$TE3= 300
##$TEG= 300
##$TL= (0..7)
0 120 120 120 120 120 120 120 
##$TP= (0..7)
150 150 150 150 150 150 150 150 
##$TP07= 0
##$TPNAME0= <>
##$TPNAME1= <>
##$TPNAME2= <>
##$TPNAME3= <>
##$TPNAME4= <>
##$TPNAME5= <>
##$TPNAME6= <>
##$TPNAME7= <>
##$TPOAL= (0..7)
0.5 0.5 0.5 0.5 0.5 0.5 0.5 0.5 
##$TPOFFS= (0..7)
0 0 0 0 0 0 0 0 
##$TUNHIN= 0
##$TUNHOUT= 0
##$TUNXOUT= 0
##$USERA1= <user>
##$USERA2= <user>
##$USERA3= <user>
##$USERA4= <user>
##$USERA5= <user>
##$V9= 5
##$VALIST= <valist>
##$VCLIST= <CCCCCCCCCCCCCCC>
##$VD= 0
##$VDLIST= <DDDDDDDDDDDDDDD>
##$VPLIST= <PPPPPPPPPPPPPPP>
##$VTLIST= <TTTTTTTTTTTTTTT>
##$WBST= 1024
##$WBSW= 4
##$XGAIN= (0..3)
0 0 0 0 
##$XL= 0
##$YL= 0
##$YMAX_a= 210212
##$YMIN_a= -152531
##$ZGOPTNS= <>
##$ZL1= 120
##$ZL2= 120
##$ZL3= 120
##$ZL4= 120
##$ABSF1= 10
##$ABSF2= 0
##$ABSG= 5
##$ABSL= 3
##$ALPHA= 0
##$AQORDER= 0
##$ASSFAC= 0
##$ASSFACI= 0
##$ASSFACX= 0
##$ASSWID= 0
##$AUNMP= <proc_1d>
##$AZFE= 0.1
##$AZFW= 0.1
##$BCFW= 1
##$BC_mod= 2
##$BYTORDP= 1
##$COROFFS= 0
##$CY= 11.3945322036743
##$DATMOD= 1
##$DC= 2
##$DFILT= <>
##$DTYPP= 0
##$F1P= 15.9154993809931
##$F2P= -4.1035820241983
##$FCOR= 0.5
##$FTSIZE= 0
##$FT_mod= 4
##$GAMMA= 1
##$GB= 0.15
##$INTBC= 1
##$INTSCL= 1
##$ISEN= 128
##$LB= 0.24
##$LEV0= 0
##$LPBIN= 0
##$MAXI= 10000
##$MC2= 0
##$MEAN= 0
##$ME_mod= 0
##$MI= 1.114404
##$NCOEF= 0
##$NC_proc= 0
##$NLEV= 6
##$NOISF1= 3.799351
##$NOISF2= 2.8
##$NSP= 1
##$NTH_PI= 0
##$NZP= 0
##$OFFSET= 15.70392
##$PC= 1
##$PHC0= -11485.91
##$PHC1= 14.40101
##$PH_mod= 1
##$PKNL= yes
##$PPARMOD= 0
##$PSCAL= 0
##$PSIGN= 0
##$REVERSE= no
##$SF= 200.130013532006
##$SI= 16384
##$SIGF1= 3
##$SIGF2= 2
##$SINO= 400
##$SIOLD= 16384
##$SREGLST= <1H.CDCl3>
##$SSB= 0
##$STSI= 0
##$STSR= 0
##$SW_p= 3612.71676300578
##$SYMM= 0
##$S_DEV= 0
##$TDeff= 0
##$TDoff= 0
##$TI= <>
##$TILT= no
##$TM1= 0
##$TM2= 0
##$TOPLEV= 0
##$USERP1= <user>
##$USERP2= <user>
##$USERP3= <user>
##$USERP4= <user>
##$USERP5= <user>
##$WDW= 1
##$XDIM= 8192
##$YMAX_p= 0
##$YMIN_p= 0
$$ End of Bruker specific parameters
$$ ---------------------------------
##NTUPLES= NMR FID
##VAR_NAME=  TIME,          FID/REAL,        FID/IMAG
##SYMBOL=    X,             R,               I
##VAR_TYPE=  INDEPENDENT,   DEPENDENT,       DEPENDENT
##VAR_FORM=  AFFN,          ASDF,            ASDF
##VAR_DIM=   8192,          8192,            8192
##UNITS=     SECONDS,       ARBITRARY UNITS, ARBITRARY UNITS
##FACTOR=    0.0002496,     1,               1
##FIRST=     0,             0,               0
##LAST=      2.0444736,     0,               0
##MIN=       0,             -152531,         0
##MAX=       2.0444736,     210212,          0
$$ Real data points
##PAGE= N=1
##DATA TABLE= (X++(R..R)), XYDATA
0@%%%%%%%%%%%%qJ6j6J6j6K4l2L3m1M9n7P2q3R4j10J29j51J72j96K24k54K87l24
35a72L64m08M58n11N70o35P05p83Q66r57J060j170J287j418J564j723J898k090
53a095K304k547K820l128L485l900M386m970N687o588P756r347J1645j5253K1777
68A3032l7136J35417R8899k74222J6578L4955l2526j2696L9352Q0833L8390p5583
80B5293q6155J0857J10410j06664j02083K28003P7226j70200k006J5172m9654
91d9801k1900J2041J13870R3424p6167j56823k9310J51983k4012j19600J60380
102E4085Q3168j48277l1083K1061P326N845n1014L9640J17498R085j32156q3627
114a08449J09508j57j08195J52799J13800j33395q1341j9148L9889P3577n0044
$$ y = [0, 0, 0, 0, 0, 0, 0, 0, 0, 0, 0, 0, 0, -8, 8, -8, 8, -8, 16, -16, 17, -24, 25, -32, 40, -43, 51, -59, 70, -81, 91, -105, 119, -135, 152, -172, 192, -216, 242, -269, 301, -334, 371, -412, 454, -503, 557, -613, 674, -744, 820, -903, 995, -1095, 1209, -1338, 1482, -1646, 1839, -2061, 2325, -2645, 3042, -3546, 4210, -5137, 6508, -8745, 13032, -24104, 111313, 210212, -64010, -47432, -12477, -45003, -57699, -18347, 62486, 100876, 25293, -60862, -50005, 60405, -46259, -148342, 79661, 156887, -13313, -15319, -147, -49801, -71701, -59660, 54210, 147634, 71467, -85356, -114666, 37317, 13305, -106295, 54085, 137253, -11024, -42107, -21046, -13720, -7875, -58889, -19249, 98249, 107334, -24822, -108449, 1059, 902, -107293, 45506, 159306, 25911, -55430, -74578, -34689, 38888, -11156]
125a1156k1004R4139L2479j15999q9279J20368L6499j33703P1227J21235m5030
136E9776n1436p5935r706R1552j2731j6024Q3477K8313j18206j12845J12743R4394
148G3372j05511P826Q2971j3030k4964p7649j5783J01277j4207n3492O4077P5691
160A00578o3194j45360L6819J08081m2246P163N3814j9488k0283p9022k1935J20640
172C5567J2974p7081J8346P8005j5260j29581K530J05248k2873j6038L2931J0046
184C4814J8487r1170p6589J10654O5469n0145j7082M2244O393j02902j8234J01402
196B3341N606k3657q35L934M7021o5096r3522Q4710P4366l7548l2262L4445L9124
209E9627q7647o6603P9635N0501M630k5899l2445N1420k7167q9773N6108P6323
$$ y = [-11156, -32160, 61979, 94458, -21541, -110820, 9548, 46047, -87656, -16429, 104806, 59776, 8340, -67595, -77301, 14251, 1520, -14504, 68973, 97286, -20920, -133765, -21022, 73372, -32139, -24313, 58658, 45628, 20664, -56985, -72768, 28509, 14302, -39190, 24887, 100578, 37384, -107976, -71157, 36924, -5322, 1841, 55655, 36167, 15884, -63138, -85073, 35567, 48541, -28540, -10194, 67811, 52551, -77030, -74500, 30748, 7875, -8163, 24768, 34814, 53301, -37869, -114458, -3804, 61665, 11520, -5562, 36682, 43075, -59827, -78061, 23341, 28947, 5290, 4455, 8389, 55410, -9686, -103208, -18498, 55868, 18320, -13942, 20503, 59627, -28020, -94623, -14988, 35513, 40143, 14244, -18201, 33219, 6052, -83721, -27613, 48710]
221D8710j6745m2759O807N3427n1163p7103M8732N5781J8941k7667m2291N6154
233C0824p244j02326K6448R0217J9307m7459l6478M7349o594o8465J8183M7780
245A1542L5787j9311o0288M4786J8988q6771J258P2241L7487l1553n3268L7711
257H609J4621o6398m167M7587N6203r891q4684K3732M7095n9707k1533M3902N2124
270D7493l597o8498J1996L2565m3387j6156K6502N7112J1577q2697K012N0911
282B5833m0820k8313K6582N9558J6102p9662j2583M7692j6945k5785P58N5529
294B7946L8424p6157k7987M5918j0501k2285J212M6728L8868o6903l2706M0450
306C007j384k0086j0252M5602N1493o6757m6529M1252J0769j5977k0666L3970
$$ y = [48710, 31965, -10794, -3987, 49440, -1723, -78826, -30094, 25687, 44628, 16961, -25330, 30824, 23580, -78746, -52298, 37919, 57226, 9767, -26711, 20638, 14044, -54421, -36238, 11542, 47329, 28018, -32270, 12516, 31504, -55267, -54009, 18232, 55719, 24166, -29102, 8609, 23230, -43168, -47335, 252, 56455, 46564, -38120, -14388, 32707, -27000, -48533, -4631, 47493, 43896, -24602, -12606, 19959, -23428, -39584, -13082, 44030, 55607, -27090, -25078, 25833, -14987, -43300, -16718, 42840, 58942, -20720, -33303, 14389, -2556, -28341, -27583, 27946, 66370, -9787, -37774, 8144, -2357, -24642, -23430, 23298, 62166, -4737, -37443, 3007, 1623, -18463, -28715, 16887, 68380, 1623, -44906, -3654, 7115, -8862, -29528, 4442]
318D442O1132n1091n5961K6638J7283k104k3402K0456O2157m0950n6072K0415
330a7057J7419K715k4276J4024O4915l3176o2584J3885K5006J0909k9933P41O9438
343E2026j8456o4469p85K4113K4903k4958j3430O2301o179n8619p458J8750K8685
356A6424j9119j8006N7599p38n6192j3368J8069L5921j7739k8823N4666J2823
368D1517n3719k4890J3537M5148q989l7719M3182K0055m2373k7153J858M5483
380A5937K852l9744L3696K2823l6520k9664n46M7360N310m2771K9493K6305l0601
393C930l1256j0656M9372J9936m7418J3237L2069j7155l3407k0129M6924K6031
405C1478m1334R152K2794j3121k2428k6835L8100L7510l9582l644K7743m775k8772
$$ y = [4442, 65574, 14483, -41478, -14840, 2443, 339, -23063, -2607, 59550, 18600, -37472, -17057, 362, 3077, -21199, -7175, 57740, 24564, -38020, -24135, 871, 11780, -18153, -17412, 52026, 33570, -30899, -31684, -7571, 17332, -7626, -21056, 41245, 35066, -23553, -31011, -12261, 16424, -2695, -20701, 36898, 36160, -20032, -33400, -15331, 20590, 2851, -25972, 28694, 41517, -12202, -37092, -23555, 21593, 12604, -25115, 18067, 38122, -4251, -31404, -29546, 15937, 18789, -20955, 12741, 35564, -956, -30620, -31166, 16194, 21504, -21267, 8226, 34531, 3930, -27326, -37982, 11390, 31326, -16092, -2855, 29214, 12059, -21348, -41477, 5447, 31478, -9856, -704, 22090, 8969, -13459, -40294, -2194, 35316, -4266, -7910, 19833, 15058, -13714]
418a3714k9160M1053L7736l8134n094J9487Q89j3385m0585K3087N4409k5763k1045
431a0219J7154P445j6155l7110K5052M5198k1698j2354M454L511L218m0980P087
444b5397N8744j5387k9938R843J6808n527m3401R354M9293n563j3762j0267J354
457c846J9476l8539j1803N9843L556l2333o309J2509R077l2411k630L9284O37
470A6511p715j5612k403L1434l4721l0552N6042K0629k6561j7128L917J5932k3104
483a3331r754L2230J0613j453k7381j6059M4401j4150m0682L8164K3090j7624
495H064j3794j44J5459j7655j6703K2400J9226J3790l0548l5380M3914K738m1098
508b9731K9565K6798j4200j9725r038J9838K147j5443Q81Q131K8462j5598m2276
$$ y = [-13714, -42874, -1821, 35915, -2219, -7313, 12174, 13063, -322, -40907, -17820, 36589, 10826, -10219, 6935, 14380, -1775, -38885, -13833, 31365, 9667, -2687, 1767, 5278, 8496, -32484, -25397, 33347, 17960, -11978, -2135, 14673, 9146, -34255, -24901, 24392, 18829, 5067, -5200, -3846, 15630, -22909, -34712, 25131, 28687, -3646, -9955, 2554, 11631, -20780, -23410, 15874, 16511, 8796, -6816, -9219, 22215, -12506, -43058, 12984, 33613, 7052, -10076, -6159, 9773, -13331, -23085, 9145, 19758, 18305, -9076, -25135, 19266, 5116, -35566, 2598, 25688, 8064, -5730, -5874, 9585, -8070, -24773, -2373, 16853, 30643, 95, -35285, 8629, 11367, -29731, -166, 26632, 12432, -7293, -16331, 3507, 5654, -9789, -8908, -777, 27685, 12087, -30189]
521c0189L5624P622m4637K2436L4475l060j9257k4176R221J5102j011m285j978
534d113K8145j1328m9983L6456K7063m3146K026K2065P021J385k2609p270R170
547e118M120k319k046L5980o160o4485K1183L9618k5466K608J0064m535M541j5241
561g256n886J5515Q195j6014j9166M3349K0074n9800M70K7765k0441J2086J6169
574A5060o340L180j9694j8747J8813K9025p955l6173K5022K6375m6593L755L0125
587A5853k2836R09P813l683K3168p370l6932k447L2502J1753k8508J6990K1219
600B8431n0396m012L5848p422Q399m427k5197K3398J3482k6260r625K2783P221
613A2223l1466J9254L7309m0665j9977J6990o570K6620J0382l4400Q282J1601
$$ y = [-30189, 5435, 13057, -31580, -9144, 25331, 22271, 3014, -21162, -11941, 3161, 2150, -2135, -4113, 24032, 12704, -37279, -823, 26240, -16906, -14880, 7185, 14206, 15591, -7018, -14288, -5118, -998, -3317, -5363, 30617, 24457, -40028, -18845, 20773, -4693, -2085, 7979, 3444, 7985, -7256, -13142, 2373, 10568, -5446, -24612, 18737, 38811, -20989, -20519, 7246, -13195, -1109, 15060, 8720, 11900, -7794, -26541, -7728, 21297, 13342, -22831, 2191, 28566, -18027, -14272, 15853, -6983, -6074, 1739, -1944, 21224, 13854, -23078, -25525, 6977, 18730, -9778, 7212, 28431, -21965, -25977, 9871, 2449, 10848, 6421, -18776, 4622, 18104, -8156, -17781, 5002, 12223, -19243, 11, 37320, -3345, -23322, -6332, -12902, 13718, 24100, -10300, -2018, 9583]
625I583k4069n368L2266J4036m0520j978L5899j9894n938J1268k3847J8537J7697
638A7672k7003J4281J7357l3148k2716K9572L3329k3655j2641J7288k2556J505
650a0715K0421j9519J6441J2642l8685R175L3167j6062k7753Q619K5102j1086
662A747l179J9694k2263p355J0357j9892K8031K8812m2714j2168K4990l615j2734
675a0289P146J8606j4411j1717J7820q583L763P889l6660J6174M0041k6259j2116
688h596J5956q998j4914O796K5320k007j4854J329j5384J2034K2906l3162L144
701a0430L2756k4348j0648K0755o96j3875p390J3624Q753j31K220k3528J135K3531
715A1728k4412N180L5279k2901k0623J1090O557K301o854L37L121J518P553j7584
$$ y = [9583, -14486, -19854, 12412, 26448, -14072, -16050, 19849, -45, -5983, 5285, -18562, -25, 17672, -9331, 4950, 22307, -10841, -33557, -3985, 29344, 5689, -6952, 10336, -12220, -10715, 9706, -9813, 6628, 19270, -19415, -10240, 22927, 6865, -20888, -12269, 12833, 1747, -1432, 18262, -4001, -11356, -999, -20891, 7140, 35952, -6762, -18930, 6060, 2445, -10289, -3143, 15463, 1052, -10665, 7155, -1428, 2335, 10224, -26436, -10262, 29779, 3520, -8596, 7360, -1638, -16552, -9756, 15564, 13557, -1297, 32, -15352, -3318, 19588, -13574, -10430, 22326, -2022, -12670, 8085, 7389, -6486, -13876, -252, 8501, 8370, 10590, -12938, -11803, 11728, -12684, -7504, 27775, 4874, -15749, -4659, 1898, 4199, -2655, -2318, 803, 2321, 9874, -7710]
729g710O78K1924k7943l853L6943p816j5862j143l153O687O29K283L751j576K617
744F456j9824J088L1087j9745j4774K5322l416o724J362o619N607j364k405N954
758B005N502O174k3394j0450L0823o832j2774J8596n012o046o4p582J1481L228
772E655q504o71M548J2821j5543j6181K4055k783j2428J5409j191j360l067j4669
786a3909J0549J0531m352l613j867J2405r319j7194K1120K600j2747Q183k240
799A47M333J860j8073N494J0714j448j526m632J1911m783k0575J5012Q203o788
813a51M562p769M163P055j7399K965J0560J96j885q398J1476K869k0387P126Q292
828C275k328O035j0390K242R583j6292m16J0207L271P89j2455O469Q920j6393
$$ y = [-7710, -7032, 14892, -13051, -16904, 20039, 12223, -3639, -4782, -7935, -1248, -619, 1664, 5415, 3839, 6456, -13368, -12280, 18807, -938, -15712, 9610, 6194, -530, 832, -5787, -180, -1544, -3949, 2005, 7507, 13681, -9713, -20163, 10660, 3828, -8946, 9650, 4638, -1408, -1472, -9054, 2427, 5655, -2849, -3520, 1028, 13849, -1694, -17875, 6180, 3397, -9031, 6378, 5187, 3827, 760, -13909, -3360, 7171, 2819, -794, -2661, 9744, 425, -16769, 4351, 6951, -5796, 2387, 147, 4480, 6340, -11733, -6239, 4475, 3027, 1501, -3131, 8780, 3997, -16578, -1566, 6637, -151, 4411, -3358, 805, 7860, -9539, -6574, 3986, 4182, 2297, -6101, 5375, 8244, -12143, -5017, 3275, 947, 6982, -3408, -1166, 8417, -7875, -8291, 1916, 5187, 5976, -6479, -10, 8910, -7483]
842g483J666O635N66P062j2331p9J2905j2772m395O896N009N685j4063M30J2399
857H130j2056k054M681K115R714j2806m865J4484q182n060K794M106J0002j2588
871a585n249J2889p373k804J356J312J3358j1279r120J2826m089l652j31J205
885b336J3598r366j0263J1230k405j881j581j166J5522p757j2429J0341r90j024
899e07k134k661J5814n503j3302Q467j71R66k513n233J6140k342j4683O115J137
914d10J843j915p021J5510J69j4753M275O41L960j219j0031J5299K628j4218K180
929c062M44N206k67j1135J3499M578j3037M52o12O777J436j3230J1628P130j2450
944b643o28j230O617L230j3248Q584Q073r301k022l968Q450N307j5435P642R867
$$ y = [-7483, -5817, 818, 1384, 8446, -3885, -3964, 8941, -3831, -8226, -1330, 3679, 9364, -4699, -4269, 8130, -3926, -5980, -1299, 816, 10530, -2276, -7141, 7343, -839, -5899, -3105, 1001, 11003, -1585, -6834, 6055, -1318, -4122, -2766, -1454, 11904, 625, -8495, 4331, 242, -3410, -3541, -2336, 11262, 1896, -8367, 2863, 458, -1423, -3004, -4170, 11352, 3595, -8834, 1507, 517, -507, -2641, -5302, 10512, 5009, -8293, 174, 3, 969, -1544, -6777, 9363, 7021, -7662, -1547, -410, 1433, -482, -7503, 8007, 8176, -6577, -2302, -1661, 2299, 1080, -8951, 6348, 8976, -5242, -3062, -2618, 2588, 2321, -8814, 4685, 9263, -3774, -3322, -3934, 2843, 4279, -8951, 2677, 9807, -2643, -3271, -4501, 2116, 5346, -7902, 682, 8755, -546, -2568, -6536, 1914, 7221, -8214, -572, 9295]
959I295r533k535l594O344Q097j3694L455Q945m962k784p642Q044J0569j6338
973f333K836J1120o261j744o556M040J1838j1035j702P778p64j550j1790O423
987c700J5374j4101k391R486l516J079q021n1J4431p176o445N583L491J438j5036
1002i555K310J8090j0539m331P309l040L407p933m858J6598j483r571L41M680
1016A425O314j4699k098J8446p933n547N705k852P458p247j1583J5472N531q134
1030B58m571L480Q752j3022n411J8700l985n824J448n921J1866n83j6290J0037
1044a066Q617o103n994K670J2052j2253j0497J5958O94j249J85j2189J0942N210
1058F977j6744O976J2027n103j0983K6J5845n484j2322R318j050K906L926j4845
$$ y = [9295, -238, -2773, -6367, -23, 8074, -5620, -2165, 6780, 1818, -966, -8608, -564, 10005, -6333, -3497, 7623, 1362, -382, -6938, -2898, 8940, -2095, -3797, 3981, 3217, 1667, -10123, -3700, 11674, -2427, -4818, 4668, 1152, 2231, -5790, -5841, 8590, 1414, -5031, 552, 4043, 5481, -9555, -7245, 10845, 306, -4025, 3284, 244, 3651, -4282, -9140, 7458, 5975, -3596, -3255, 1425, 7739, -6960, -9058, 9388, 1455, -4092, 1613, -1239, 6219, -1028, -12611, 2861, 8392, 258, -4313, -833, 7919, -5103, -10514, 8186, 4201, -1623, -175, -6096, 5770, 5187, -11103, -1066, 7551, 1448, -4546, -1876, 10176, -2077, -12574, 3384, 4078, 2829, 3014, -9175, 1767, 6977, -9767, -2791, 9236, 4133, -6850, -6824, 9021, 3537, -8785, 533, -517, 2389, 6315, -8530]
1072h530R743Q161j9670K130J6531J416j1989p584J2736N83q489P386l132K724
1086B016L965j7991J0137J6862j9003p302J2805O295n464q093Q394k83q939O250
1100c51p92O725O415k4639J827K3388j0510q855P588M245m774p823R540M233p291
1115a074k09p788R756J7105k3064o775K0170p739q362R212P203l763j2657K248
1129e737P198K441L102j5201K116K0137j7925p470K2428o071j4342L277R485O284
1143I722q583n886j072M352J0392j2801j019K0588j9714j3942K4359L547j0734
1156g91m066Q68P338k91k871l300J913Q711j6080j624K9496j2422k3201J3811
1170b509N715j802Q98l116K497j296m173j983P475J3784k0210j3686K9078q87
$$ y = [-8530, 1213, 9374, -10296, -8166, 8365, 9781, -2208, -9792, 2944, 3527, -4962, 2424, -708, 2016, 5981, -12010, -1873, 14989, -4014, -11316, 1489, 7784, 2320, -5773, 2621, 2338, -6601, -351, -1143, 5582, 11997, -12642, -10815, 12573, 2063, -6792, 796, 5041, 267, -7556, 1984, 6217, -1074, -1283, -9071, 685, 17790, -5274, -12049, 8121, 382, -7980, 1232, 8435, 4672, -7985, -5737, 1461, 3902, 7004, -8197, -6081, 14056, -3869, -11339, 11089, 5018, -9324, -6047, 3438, 9722, 1139, -4747, -5819, -1467, 8925, -3876, -4895, 15693, -4021, -17963, 6396, 9943, -791, -4857, -3989, 3349, 3058, 187, -3113, -1200, 7511, -8569, -10193, 19303, 6881, -16320, -2509, 3206, 1404, 2302, -814, 1683, 387, -3786, -5769, 1706, 15490, -4720, -18406, 10672, 9785]
1184I785j8119Q798P30l659J959j907O482L320q156j1932N549K3976j1981j9448
1198a4603K0556k44j5807J0228L491r32j46j0702L470J3170J59j5944m149K1617
1212A0164o254j7248K1293K783j8929K788J802O954Q524j4388p692J1354O475
1225G626j0700n565J9946n224k2655J6831J0160j0355K22p809K768J5176q569
1238A852q597Q934N268j3297q147K3574M668k3976M884P478l549O704r012k491
1252e707J4755q619j0789J1502J1837j2161j6959J6181J2179j5195K528J919n304
1265c833P979q882j485J9190p338j8055N761J6159k187j7714P946J1025j1722
1278c156J557K475j663R272j3484q317K2000K379j6343k403J0976K591j4080N039
$$ y = [9785, -8334, 464, 1194, -2465, -506, -2413, 4069, 7389, -767, -12699, -7150, 16826, 4845, -14603, 5953, 5709, -10098, 130, 3621, 2689, 2543, -8159, -4689, 8481, 8640, -7304, -11453, 10164, 3910, -13338, 7955, 10738, -8191, -5403, -3601, 3353, 11877, -2511, -10203, 1151, 7626, -3074, -8639, 11307, 6083, -16572, 259, 10419, 64, 286, -7523, -4755, 10421, 1852, -6745, 2189, 7457, -5840, -13987, 9587, 14255, -9721, -4837, 2641, -908, 5796, -3216, -5707, 9048, 429, -10360, 1142, 12979, 818, -16141, 40, 12219, -2976, -448, 1471, -3833, 4146, -4736, -6221, 12969, 5631, -12424, -6663, 9496, 7309, -10405, -2459, 8566, -3156, -1599, 876, -787, 8485, -4999, -13316, 8684, 11063, -5280, -7683, 3293, 5884, -8196, -3157]
1292c157J2643q401l529k566J145J6304j0795j5664J6736O803j1900m351R271
1305B539N531j3838k469J3588l71j875q117m223J8579m643j6173J3118P632j0138
1319h60p516O235J2073r029q902P546L312K946p510q244J7876j711j8071R583
1333b272J1438m592j0764j535J3634j436r231K951K743N357p428j0523J7716L952
1347A0010j9042L220J0705J923q230p467J1770L441r795m30L275Q531n492j5722
1361a3303J4299J0023j4296k674O458N769m596j0961R311P797q301m569J196J1365
1375G518r96j8156Q484J2848r819n003K686Q370l49j4409M341J1709l803o413
1389b992l697J1175M750j7880K718J3715m553o276k600Q681N618j4608j674J1920
$$ y = [-3157, 9486, 1085, -2444, -5010, -3865, 12439, 1644, -14020, 2716, 9519, -2381, -6732, 2539, 8070, -5768, -8237, 5351, 4980, 3105, -5012, -9235, 9344, 4701, -11472, 1646, 9278, -860, -8376, -2141, 9932, 903, -7999, -453, 2859, 5805, -1705, -9949, 7927, 6216, -11855, -2272, 9166, 4574, -6190, -7725, 5909, 4473, -4758, -1807, 936, 6293, -1135, -11658, 6058, 10010, -9032, -5812, 4893, 6816, -1414, -8881, 2889, 6330, -3465, -3895, -620, 7911, 2419, -13303, 996, 11019, -3277, -5951, 507, 6276, 1680, -9281, 30, 7827, -474, -5043, -3847, 7518, 6522, -11634, -3150, 9698, -121, -5124, -2438, 5932, 5583, -8826, -4485, 7224, 3421, -2992, -6689, 4486, 9236, -8644, -5926, 7789, 3236, -3040, -5640, 3041, 8659, -5949, -7623, 4297]
1403D297Q62n744p064Q884R486j6291k852J3022O93n226p385O704J0844j2516
1417b286n941R643M114k989j0189N179J3587j2316p483R554M340j340j0848K942
1431d033J3884q731r100O172O780P56j1915J89J5332o525j0305M718O663K805
1445F690j1454k693J5144l508j0323K004O690N444j1188n450J5286j125j0382
1458d865j53O253P237j0313p647J4001J902r642k299M999R674q834j0169J2578
1472B722M027q320l756L143J0897o353j2239J0979N863p405m978J706J2180m567
1486C899j3550Q991O854m815o246l58J2790j722j4823O505Q403k852p167k315
1500f406J2809N99j4798M279Q173q24o283n206J2590L422j4823J224Q623J364
$$ y = [4297, 5159, -585, -7649, 1235, 10721, -5570, -8422, 4600, 5293, 67, -7318, -614, 10230, -2286, -8227, 1416, 5530, 2541, -7648, -2469, 11118, -1198, -8681, 873, 5213, 3873, -6975, -4033, 9851, 1120, -7980, -1808, 4972, 5728, -6187, -5998, 9334, 2809, -7496, -2778, 3885, 6690, -4764, -7457, 7687, 4179, -6144, -4140, 2550, 7994, -3194, -8644, 6642, 5517, -4865, -5018, 1235, 8472, -1841, -9488, 4513, 6415, -3227, -5526, -527, 9147, 313, -9856, 2722, 6749, -1571, -5327, -2184, 8713, 2360, -9879, 1100, 6963, -442, -5420, -3714, 8466, 3899, -9651, -660, 6194, 1379, -4867, -5225, 7565, 5843, -8980, -2475, 5928, 3076, -4091, -6406, 6403, 7002, -7796, -3517, 4656, 3832, -2451, -7657, 4933, 8355, -6468, -5244, 3379, 4743]
1514D743o142p069J1904N377j3788l32O914L387m181r686R793Q897j2614l601
1528f398P052M897l845j0402Q684R101j0626m089M279N717K8j2685N727J2015
1542I455r083o805M287P272n29j2579M747J1241o445n728l4O818M720j3655N51
1557e767J4195m527q933K46Q220L755j2293k04J0759k201m862m023O081Q923j3145
1572c776m913J4638q0q485l252O083O938r409l660Q478J723l234p971L982J3668
1587A0730j0393r989J1815L474n621n201L229Q877o338o939N491N374K49j0879
1601f121j393J6271m887j2054Q496M750l646n909J30J0449j770q896p7O050O302
1616G695j0204o563J5789j560j2623N462O627o96o222m574Q967M007o603m350
$$ y = [4743, -1399, -8468, 3436, 8813, -4975, -5307, 1607, 4994, 813, -8873, 920, 9817, -2797, -6398, 654, 5551, 1706, -8696, -12, 9089, -1537, -5626, -1347, 4370, 4398, -8287, -2560, 9455, 372, -6433, -2146, 5126, 4597, -7982, -3235, 8006, 1561, -4167, -4201, 2617, 7337, -6318, -5767, 8428, 3901, -5032, -4786, 3434, 7189, -5104, -5308, 5451, 3250, -1612, -5635, 446, 9369, -3776, -8689, 5949, 5869, -2616, -5868, 215, 7153, -2256, -5916, 2562, 4285, 1051, -6920, -2938, 10730, 337, -9652, 2163, 5637, 16, -5185, -1956, 6921, 583, -6356, -865, 4509, 4758, -6121, -7514, 8757, 3870, -8184, 312, 5062, 1416, -4493, -4363, 6086, 4316, -4580, -4657, 1393, 7695, -2509, -9072, 6717, 5157, -7466, -2004, 4623, 3927, -2295, -6869, 2098, 6105, -498, -4848]
1630d848L443Q728q109r413J5709K754j3971J327N424L510k337q147M184O524
1644D778l282o032J846J1365o718j4393J3508P986j0130j798M68L682K570p971
1658d121J713P717j936q886j464J5346j101j6958P169Q356n962n37r02K322L755
1673D511q727k122J0551L776j0051p668J2906M630j4054M345P168n723o93k254
1687c405K929Q640q361q761P750R074n316j0490R271N596j3228K486Q347j770
1701B762n17p377r90J3213k510j0166K443Q478l320j0503Q892R488j2860k623
1715e590M936J279O054o923p309J0466J238r111J879J0165k027j4328M556J2480
1729G765o010l137j45j909Q155l267p976J0306K644j1802k254J2040M797j3100
$$ y = [-4848, -1405, 7323, -786, -10199, 5510, 8264, -5707, -4380, 1044, 4554, 2217, -5930, -1746, 4778, 1496, -4536, -2690, 8675, 1957, -12436, 1072, 9058, -1072, -2870, -2402, 1280, 3850, -4121, -2408, 5309, 3373, -5513, -6977, 8369, 7268, -9690, -2521, 5835, -127, -664, -1566, 756, 4511, -4216, -6338, 4213, 7989, -2062, -9730, 3176, 7806, -6248, -1903, 5265, -458, -1151, -3405, -476, 8164, -197, -8958, -1208, 7866, 2550, -7940, 1331, 6927, -6301, -3815, 4532, 2762, 2245, -5132, -6122, 7091, 4581, -5585, -3142, 5336, 2016, -8487, 405, 9893, -2967, -5590, -654, 625, 6679, -244, -7553, 2913, 4151, -4960, -3081, 7084, 5057, -9271, -4715, 7765, 1755, -1382, -1527, -3436, 4719, 1452, -6524, 3782, 6426, -5376, -7630, 4410, 9207, -3893]
1743c893k082R006l268N61N70l631P966l859j1342J0548R342r926p978O646P690
1758F350p622j874O742l966m07p04l272J2142q03j6376M887J1507l635p212L300
1773i43N970o752l104O769k00J542l681r159J2509O233j4038N55Q832k999o332
1788d798K843Q436m212o624J948O49O982p59j2620P706P868j2106RJ0055j437
1803C940p595k300Q384J796l887j762l291P096K596j1728O582R098j2404l797
1817g272Q928L647m058n027K835K496n92n05m332O545K907j3909M729J3062p989
1832A465o642L454L291P19l755P29K232m21j998m612Q240O019j4325j170J2186
1847E412l264m402J103J690J753m187o38M003K379k571q376N598J0264j0410l910
$$ y = [-3893, -5975, 3031, -237, 324, 894, -2737, 5229, 1370, -9972, 576, 9918, -8, -7986, -1340, 6350, -1272, -3146, 3596, -370, -777, -1481, -4753, 7389, 6586, -9790, -4903, 6604, 2969, -4243, -943, 5027, -1725, -4829, 1940, 1740, 3282, -399, -9558, 2951, 9184, -4854, -4299, 4533, 1534, -4798, -1955, 6481, 2269, -4355, -2407, -1758, 5224, 4465, -8155, -449, 7419, -4687, -4678, 5377, 3940, -3655, -5955, 2429, 4225, 338, -1424, -4715, 2381, 4977, -6751, -169, 8929, -3475, -7272, 1656, 5303, 1245, -3782, -947, 1549, 957, 452, -3880, 2665, 5572, -8337, -3608, 9454, 1465, -5177, -1723, 1568, 2287, -1468, -739, 1493, 1072, -926, -5538, 2702, 8721, -5604, -6774, 5412, 2148, -2254, -1151, 539, 2292, -1895, -2533, 1470, 3849, 1278, -7098, -1500, 8764, -1646, -5556]
1862e556R588k538l523m5J994M684m220m775K512N307P41r354J893J0356p869
1877h05m318P843j18k575k803o32O999n09n864L4L982L050q062l86J0649n225
1893A260o645N208J683J067l243l811O315J500m802j447L738M261p786k898J0283
1908D683j337o399J755N84L565j688n706N331L340n194k731L309O209n648o705
1923f632Q575J342m230O2q52M346k64p317M572M370k984l917QO803j649p372N533
1940C94K560l037r30j927N463J272q297K325N160j087l342k477O651Q09p412K739
1956a136L414o45j528m210N214L564p329K5M271Q15k433m258N164L552o903J71
1972b252L358Q11m89n854L926N507o055j958L253K108k92o203L173N388n213j446
$$ y = [-5556, 4032, 1494, -2029, -2074, -80, 4604, 384, -4391, -1879, 3428, 4169, -5185, -3292, 7064, -805, -5123, 2720, 2602, 27, -2776, -3408, 3591, 3082, -2782, -2748, 1234, 4284, -3778, -4164, 6485, 1260, -5385, -177, 1506, 2573, -670, -4481, 1834, 3334, -1468, -2915, 823, 5084, -2702, -5600, 4683, 3346, -3053, -1298, -714, 2851, 1163, -4543, 788, 4128, -1066, -3797, -488, 5721, 73, -6632, 1943, 3285, -945, -883, -1735, 2611, 2347, -4970, -398, 3972, 988, -2929, -2921, 3882, 2233, -5139, 394, 2954, -83, -1013, -2940, 2523, 3795, -4502, -2177, 2983, 1896, -1446, -3923, 2728, 3537, -3875, -1136, 2278, 1633, 105, -4105, 1109, 4673, -2656, -2631, 1640, 2455, 22, -4236, 928, 4480, -2423, -2252, 1106, 1917, 1428, -4426, -500, 5007, -1048, -3006, 247, 2355, 2063, -4140, -967, 4421, -792, -2238]
1988b238K006J661J233o047J457O288m329k485J698K343J321o253Q40O444l306
2003F33k384K02K363K939o199q37O457j718k642n45J799L593n298j794O005j361
2019A213j952j222J530M462n301k301N667l95k373j530J441M731m447l452N479
2034A550L01j408k350K3N969l601m214M072J125k78k789p20N526k288m362L890
2050D46J084j87k684j478O282j961n048L107J880N03k829k344N891m06n120K296
2066e68J236J369j909m016N861O29n129J953Q22J468j324l744M955P66m380P37
2082a274R83K611j237m991M526K556m621J68P21K421j2n138L123K686k597p06
2098g81q18L413K61n655L805K751l794j49k15K538R46n251J887L254j592r21k115
$$ y = [-2238, -232, 1429, 2662, -3385, -1928, 4360, 31, -2454, -756, 1587, 2908, -3345, -2505, 3939, 633, -1751, -1549, 814, 3753, -2446, -3283, 3174, 1456, -1186, -1731, 68, 3661, -1637, -3431, 2574, 1213, -739, -1961, -431, 4031, -1270, -3571, 2096, 1701, -672, -2202, -761, 3970, -477, -3929, 1550, 1851, 443, -1907, -1884, 4085, 484, -3730, 342, 1467, 1189, -1600, -2320, 3206, 918, -3444, 446, 1530, 1343, -1341, -2819, 3463, 1502, -3546, -439, 1441, 1944, -885, -3229, 2662, 2256, -2864, -568, 668, 2037, 128, -3888, 1973, 2602, -2527, -574, 248, 1716, 392, -3352, 1603, 2369, -2011, -1274, -291, 2320, 1083, -3908, 618, 3174, -1447, -1279, -558, 1863, 1851, -3287, -164, 2522, -75, -781, -1599, 1814, 2075, -3580, 225, 2976, -818, -967, -1182, 1356, 2302, -2949, -1062, 2192, 600, -321, -2436]
2115b436L735K217o936J945M347k782j08j960J817L253m206m97K737j72o92k916
2131b654L416L329o772P41L916j924N20k150M80M221l572j963K725J550m07m957
2147c501K195N279m873n58K426j979K463j622j629M453k163k861J564K213Q71
2162B278m898J060N046m699k96K841j835K133k000l322N690P28m000q95K097K461
2178B389l741r9M494m187j01J885k412L971r89n035M245J808k878o59J704K150
2194B545m665m77N613k513m10L0l591N150J595o059K223K424k521r47J338L106
2210B841l205k147L583k053J452J858n367L504K160n925K714M322k922l284J81
2225b288M462j296j678K025l586K344K797n730L380L336o638M81M137n00j666
$$ y = [-2436, 1299, 3516, -3420, -1475, 2872, 90, -18, -1978, -161, 3092, -1114, -1611, 1126, 954, 262, -2654, 762, 4091, -2681, -1940, 1976, 52, 572, -1578, -1098, 3123, -449, -2412, 313, 1863, 1456, -3501, -1306, 3973, -900, -1458, 968, -1011, 1452, -170, -1799, 2654, 491, -2370, -806, 1407, 2278, -2620, -1560, 3486, -1213, -1509, 1332, -503, 1630, -370, -3692, 1998, 2726, -1274, -2169, -72, 2389, -1352, -1451, 3043, -1144, -1245, 640, -1772, 2199, 1210, -3825, 420, 2228, -650, -1309, 395, 2545, -2120, -2597, 3016, 503, 93, 123, -3468, 1682, 3277, -2782, -559, 1865, -656, -1603, -265, 2841, -364, -2511, 1072, -981, 471, 2329, -3038, 466, 2626, -3299, -585, 3737, 815, -2469, -2288, 2174, 878, -800, 1225, -2361, -17, 2780, -2950, 430, 3766, -2872, -2391, 1746, 1246, -420]
2240d20o78J967j830k75L768l283J176J713o913M059O292o141j943K710nJ8n33
2257c18J519j277j311K345k923K300M525q015J77N905l743K71K604j960j572l62
2273a835K718J29m85P57m951K017O647o328q53N341m387r74L135n66P42j253q19
2290i65n77J709L507n197p49N219n171r0O638l608k753R61K56J932N19j375k137
2307a881L81M407l962n39O286n663k907N541j342o8J312l225J48J584R74j207
2323a61k23K560m455j119Q115l630l817L768k148K05K627k042n8R33o62j770R36
2340i41N403m265m570N922j356j279M427l823j416K979j811Q82J616m68l486l95
2356b581N961k314m027N340k259l136M629j947J60K833l900j614L069K467k067
$$ y = [-420, -1098, 869, -961, -1236, 2532, -751, 425, 2138, -4775, -716, 5576, -565, -2508, 202, 197, 215, -318, 1201, -76, -1387, 958, -1965, 335, 4860, -3155, -2978, 2927, -816, -545, 2059, 99, -1473, -1835, 883, 1012, 527, 1284, -3667, -1650, 4997, -1331, -2184, 3157, -1230, -2204, 931, 365, 1107, -146, -965, -1542, 167, 3674, -1523, -2272, 2947, -2224, -2314, 4324, 716, -2037, -1076, -820, 1112, 1631, 256, -1881, -1500, 2907, -1055, -1594, 4692, -971, -3878, 1663, 321, 253, 1565, -1660, -1512, 72, 1046, -161, -384, 2176, -2279, -3398, 4717, 1087, -2730, 1038, -1110, -905, 1722, -320, -378, 555, -107, -1877, -941, 4462, 197, -4373, 1549, 193, -1086, 3341, -482, -1898, 1081, -730, 152, 1768, 1300, -2186, -2581, 3380, 1066, -2961, 2379, 120, -3016, 1613, -334, -174, 2659, -1241, -2855, 214, 2681, 614]
2371F14l259M011j253k921N529j387l448L221k367l02M736l040k116J556J592
2386A166j210k038M625q87m785L359J72r86M170m734k102M944j026j541R83Q82
2402I92j148k356L729R01l575K560j532k145N213k544k072M273k053k499J444
2417h12L016J6m378J490J549j755K850j788l196N162j976k646M437o43k358N8
2433i74J282J068k506R93J253k949K469q03j786M934k620l755M053J032j243j281
2449h33j26J993j252j58J354k354K728j088l333N260o58l597K527m5p56J70l66
2466e34J989j355j057J172j022K944j426m170M848N07l356J467j45P04k6j854
2482a314J956J86p57l1k082L340K60l736L071N44l160J687M10O88l64l098K463
$$ y = [614, -2645, 1366, 113, -2808, 2721, 1334, -2114, 1107, -1260, -1562, 3174, 134, -1982, -426, 1166, -44, -2082, 2543, 1656, -3129, 230, 402, -584, 3586, -1148, -3250, 1694, 668, -873, 110, 992, -156, -2512, 1217, 2118, -1457, 1103, -429, -2574, 2639, 95, -1977, 2296, 243, -2256, -812, 2204, 2220, -2158, -668, 881, -874, 1976, 188, -3008, 2154, 178, -2468, 1969, 1326, -1032, -974, 308, 1376, -1130, -137, 1116, -1833, 636, -167, -1953, 2981, 361, -3394, 659, 1691, 448, -833, -959, 1034, -218, -376, 978, -1376, 1352, 264, -3069, 2191, 1533, -2064, 463, 418, -338, -168, -534, 1455, 100, -957, 215, -807, 2137, 711, -3459, 1389, 1896, -1460, 7, -138, 566, 540, -1314, 642, 828, 71, 40, -2042, 1298, 1558, -2178, 893, 1437, -1723, -36, 374, 1062, 698, -2400, 63]
2499F3J297r92l01k192L147J223m744K264J693j774R36j670P38K301l247J047
2515b11Q89o54O04k045J949J822m546J852J604j314N18j922J475K306l406N0J060
2532C1L26J139l528J215L436l341j6J121q73J786k266J85K613k598k05J577o02
2549@J013k851R35L265k578j005J105L21J859l202q31L843j179j170j08R9K446
2566A962k643j118L392j533n71K76j27K065k119j511L608r97j236l42L89L120
2582B615k833k256L667l53q43n60p34L535j505k796K794l41m42j50j258L230j315
2599D55k404K741o1m73q07j010L525j071l533K880N39or20j996L490L18l416J444
2617c05M40Q16n01k911L407L75k882J200N13P08n51k493L284P11l555R88O51J318
$$ y = [63, 1360, 368, 67, -2125, 1022, 2245, -2499, -235, 1458, -316, 620, -1050, -312, 1989, -1258, -211, 678, 24, 628, -1417, 532, 2354, -2192, -340, 1264, -50, 468, -1454, 21, 2327, -1079, -1029, 31, 357, 1496, -2032, -817, 2619, -722, -738, 383, -490, 1296, -970, -785, 1828, -770, -975, 602, 0, 1013, -1838, -903, 2362, -216, -1221, -116, 205, 2064, -1138, -1969, 1874, 695, -475, -583, -484, 1962, -681, -1799, 1593, 60, -511, -235, -362, 1703, -416, -1927, 1681, 684, -552, -894, -505, 2615, -218, -2474, 1193, 840, -3, -563, -1297, 2238, 733, -2063, 731, 390, -52, -202, -1460, 1770, 455, -1949, 792, 731, 258, -549, -1559, 1966, 895, -2638, 242, 781, 775, -145, -2141, 1349, 1667, -1749, -305, 135, 951, 450, -2461, 946, 1321, -1561, -361, 152, 860, 309, -2184, 1100, 1811, -1744, -756, -105, 1213]
2635A213n06l343L156J984l464J39J85J759J60l633K417J695k228K60p97J412
2651D09J234l613J535K455k700j66M80J324N14l891J578K889j893n39j463K412
2667E65K198m839N22L418j403q94j071J724K077l463L70J658o63J74k158J162
2683f23L649m429p87L877q38p22j614J106K915l060j106J924Q43L03l405K81M829
2700C143l246j651K357l83M00j419J03K710j937j430R90P66J721l818m30N143
2716C019l114k405K910M57J93j709j483L642m4j640j117N06L292k821k340N134
2732B480j739k947K235K02J018r83k262K484Q88j126j575N35L834l644l032N700
2748B068o1k997N32o69K114M69l040J116J587m73k324P5M756k242m714M445Q59
$$ y = [1213, 707, -2636, 520, 2504, -960, -821, -636, 1123, 1283, -2350, 67, 1762, -466, -206, -1003, 409, 1643, -1970, -435, 2020, -680, -846, -366, 958, 1472, -2419, -841, 2048, 155, -384, -1847, 565, 2763, -2076, -1554, 1864, 461, -433, -1504, 220, 2297, -1166, -796, 862, 199, 373, -1785, -623, 3026, -1403, -2190, 1687, 849, 127, -1487, -381, 2534, -526, -1632, 292, 1135, 1438, -1967, -1686, 3143, -103, -1754, 603, 220, 620, -799, -696, 2014, 77, -1353, -363, 403, 2124, -1694, -2124, 3019, -95, -2500, 410, 867, 1060, -649, -2132, 1510, 1466, -174, -1291, -785, 2507, -314, -2654, 2480, 741, -2206, 29, 231, 1249, 266, -1996, 488, 1376, 250, -1325, -790, 3044, -600, -3632, 2068, 2007, -990, -458, -1127, 987, 1456, -1584, -468, 1119, 646, -1678, -1603, 3153, 911, -3803, 642, 1501]
2765A501k099J248j501J116J348l507R91K603M9l382j634N680j47m964L033L62
2781F97j146J274k079J422K300l250j321K597J905k527k677M384J20m337L082
2796D44R74j461P86l259J381M868k953l547J855L014j291l410L920P81m288J642
2812e44L06K34K550m147r47M696j187k757J496K525j688m201L767K842l343K13
2828a85j277M93M254l493k595N080q18l828J104L762k30m358Q84K253j148J509
2844A407j688j325L901k851k627N331O73m142j449L505J660l176n7J462j259J747
2860A112j781j283N670k883n243M481K406j874k092R77K057k554L28J777j102
2875dJ577k744k282O740n44n709J660K868j288j282Q21K078j954j498O61N75L473
$$ y = [1501, -598, 650, -851, 265, 1613, -1894, -903, 1700, 1749, -1633, -3267, 2413, 2266, -2698, 335, 697, -449, 825, -1254, 168, 2468, -782, -2103, 494, 2399, -128, -2805, 1579, 1699, -2638, 444, 1418, -43, 743, -2516, -1135, 3733, 780, -2767, -912, 2102, 811, -2599, 1321, 2102, -2186, -544, -238, -4, 2546, -1601, -2548, 2148, 961, -1796, -300, 2225, 537, -3664, 103, 2945, -398, -185, -1462, -969, 3285, -208, -2803, 2277, 1459, -2369, -1265, 2497, 2267, -2091, -1207, 1046, -102, 1407, -281, -1606, 2295, -556, -3183, 2148, 2821, -1321, -2770, 735, 2395, -781, -838, 624, -635, 1112, -669, -1952, 3718, 835, -4408, 73, 2479, 605, -1487, -510, 1547, -1007, -679, 1098, -4, 1573, -1171, -3453, 3287, 2743, -2966, -1306, 1562, 274, -1008, -187, 1891, -63, -1561, -900, -325, 3148]
2892C148k412m845N240J529m493J275K261j143j993M3L064m04j437r97o83L852
2908B005l94n060M594J606n216J051K516O85j424k611J720J151M35r73k174L613
2924A524j34m771L787L407m836q01J398J415K11k287L99J056K87j008j990M185
2940A842J081o501J581M945k402j159l1N09Q67j372M6J224J234j990l220M209
2956H63L035n687k5L445j514l53m17N94J920k371j503J581K706p71m768K290M570
2973C595m570o68L152j077k52j213k36L144p58k729K42K439R09m241J110M765
2989C612m313j532K702K47P58k327j279L372L43k180r46J818J990m212m2M818
3005B829k340k271J339J55K001j659k579L278R23k094j245K126K884m398j805
$$ y = [3148, 736, -4109, 1131, 2660, -1833, -558, 1703, 560, -1433, -1390, 1674, 1270, -167, -1164, -1847, 2005, 1611, -3449, 1145, 2751, -2465, -1414, 1102, 1787, 363, -2248, -528, 623, 1058, 85, -2089, 1524, 1390, -3381, 406, 3813, -1023, -1824, -426, 989, 1200, -1087, -688, 368, 655, -353, -2343, 1842, 2923, -3578, -1997, 2948, 546, -613, -644, -135, 732, -640, -594, 630, 1864, -126, -3346, 863, 3898, -1789, -1814, 1631, 117, -236, -653, -59, 1861, -510, -2013, -432, 2274, 1503, -3265, -975, 3595, -975, -1643, 1509, 432, 180, -1033, -1269, 1875, 1117, -1612, -1370, 1069, 1978, -2263, -1153, 3612, -701, -2233, 469, 716, 1474, -853, -2132, 1240, 1583, -597, -1543, 275, 2265, -1947, -1989, 2829, 489, -1782, -443, -288, 1713, 54, -2525, 753, 1676, -418, -1663, 463, 3347, -1051, -2856]
3020b856M315m68j377j48o39K765n89l482K505J761j446k137O29M045k893k530
3036b545K995M95r44j72j335L126j17m024K095K019m71k416n38M051j187l003
3052a971J891P72P3q35k106L146J213m089O58K096L51j884j464L352O64l451P56
3069h28J120Q69m82l232K760K365l436n76J658J146p79k767K484J797k899k46
3085a046M99J809j07l361J720K757k601r08Q65J576n9l423J936K469k064q49r6
3102h83J695J132l923R47L010j536j233m77K044J180l593N22K725j199q56j061
3118a506J611K148l463m84L226m80j312j483J931K249l314q66K877p5r31j488
3134a360O71K911k760j219K459J85n20k060J021L031k558j707K184O69k36k080
$$ y = [-2856, 1459, 991, -386, -534, -1173, 1592, 1003, -2479, 26, 1787, 341, -1796, -1167, 2878, -15, -2545, 450, 945, 1, -171, -1506, 1620, 1503, -2521, -426, 1593, 1122, -1294, -1832, 2219, 1032, -1971, -80, 692, 765, -70, -2176, 970, 2183, -1906, -1248, 848, 1199, -685, -2149, 1203, 1867, -1584, -828, 292, 1161, 679, -2553, 207, 2572, -864, -1440, 218, 1364, 585, -2182, 302, 2099, -800, -1046, -547, 1262, 1155, -2206, -486, 2271, -330, -1238, -373, 1203, 1144, -2279, -343, 2126, 62, -787, -883, 812, 1944, -1979, -1032, 1978, 442, -791, -1268, 776, 1956, -1637, -1115, 1610, 411, -445, -1506, 105, 2253, -1210, -1694, 1532, 1052, -260, -1743, 188, 2437, -877, -1743, 1134, 1059, 128, -1360, -689, 2222, -538, -1757, 702, 887, 367, -1693, -672, 2359, -199, -1906, 278, 947, 711, -1369]
3150a369J72L430k044j970J664P91L08k171k82L666j728j987J292P70O13j947
3166g92r91L432o21k479J028Q32J189k181j154L163p2k396K30O55J968j988k092
3183b269L302L99k567K29Q16J956j574k662L073P20j994m46K89K498j369k866
3199b465L052R97j744m37j89K336n24l098J916J568j120j165n28K775j41l443
3215b210K121J444j361k99q84K021O75l304P88J972k84j121j070K711P41m051
3231b111J366J797m98p03j404J902J573k927k20J656O95j066k021K230K030l418
3247a119K08R98L08K25j925J219J788j926j098J353J112k28k916J924K401k807
3263d83n22J217L69O12k604L28L066j461j637K16J741P59l207P19K564j863m48
$$ y = [-1369, -1197, 2233, 189, -1781, -117, 674, 982, -1189, -1471, 2195, 467, -1520, -228, 542, 1155, -792, -1783, 1649, 1028, -1451, -423, 409, 1598, -583, -1737, 1426, 1354, -1042, -812, -157, 1811, -177, -2269, 1033, 1432, -1135, -906, -90, 1866, 292, -2370, 703, 1423, -571, -1017, -728, 1770, 401, -2465, 587, 1584, -160, -597, -786, 1550, 1026, -2072, -156, 1412, 292, -873, -1401, 1374, 1233, -2210, -89, 1355, -6, -305, -1189, 832, 1507, -1797, -1009, 963, 679, -442, -1512, 1199, 1940, -2111, -745, 1052, 554, -149, -1553, 349, 1922, -1005, -1225, 431, 1126, 60, -1961, 269, 2299, -1119, -911, 87, 395, 620, -1305, -86, 1702, -224, -1322, 31, 1143, 915, -2001, -77, 2324, -483, -1005, 212, 581, 1193, -1411, -1083, 1983, 522, -1115, -899, 842, 1601, -1606, -887, 1677, -186, -634]
3280f34O59j59K191k922j194L365l54j603l02J351J082k744j8K840j347n89l89
3297g67O0K667j678k246K661N30j856m85J383J828l184m40K134m65M27r88j358
3314a777L171n50l233K641J317j508j627J088K444j770j136J438p52J163q65j951
3330a907L484k60l538J525K179o68j848n5K141r48p98J325j068J022m75k674M002
3347A439R38l899L52J800J75j185n96J763n13j120R34j011K349j38m432K959K381
3364B196l146n5J749n41o09l52J401n3p26l43j327K788J043m421K057K343k876
3381h72k44J816K45n04j820Q95R10M05j66k936K676J378l904J363L143k871q17
3398a303J035L34J191j376o21M33P53N67k683K103K024m620O32L453j445q23l7
$$ y = [-634, 25, -134, 2057, -865, -2059, 1306, 952, -651, -953, 398, 1480, -1264, -1282, 1558, 211, -378, -767, -707, 1960, 282, -1964, 697, 1227, -629, -1114, 269, 2097, -1087, -1527, 607, 142, 569, -419, -1777, 1394, 844, -2389, 252, 1569, 61, -1566, -478, 1966, 196, -940, 498, -254, 909, 44, -1907, 1577, 1317, -2221, -696, 1483, 815, -1033, -1088, 1053, 105, -693, 632, -436, 586, 111, -2563, 1439, 2377, -1522, -1170, 630, 805, -380, -976, 787, 274, -846, 88, -923, 1426, 1288, -3144, -185, 2196, -950, -1005, 744, 203, -406, -758, 643, 590, -136, -479, -1806, 982, 2025, -2396, -339, 2004, -872, -1116, 700, 945, 441, -1379, -484, 426, 831, 665, -2271, 405, 1783, -2121, -758, 2385, -486, -1303, -268, 66, 1257, -119, -740, -307, 446, 1013, -1670, 433, 2457, -2163, -1531, 1922, 477, -346, -383]
3415c83n46J475k85o34L15P17m8k962K108L373m171q94K887j251M04M09j093J310
3433G31m62j078K61J456O22l176m7L976k434q88K214j424J68j0p75K092j87j708
3451f69r04J730K090k825o85L308k767p02K334r35Q03o90j629J481J368r96j338
3468a026M01K248k521o59L518j654j439J267q72J347O47k606P64J232n09q49N81
3485a30K267k370j966L030k77o88Q32j788P82J367j823M68J300o45j326O5K781
3502A879j153k498K258n60k60J511j868L41J528k291R8K002J63j552j183K344
3518G59R0k264J834j32o92J083j650Q11K184k655o55J203Q94o10j440J637L86
3535G83k205J727k37r6J435k795P45K328j733p77N83P49k79j315J223J019k010
$$ y = [-383, -929, 546, 261, -373, -58, 659, 611, -2351, -243, 3130, -1041, -1935, 952, -299, 105, 514, -579, 731, 269, -809, -548, 908, 1530, -1646, -1693, 2283, -151, -1039, 1175, -249, -81, -91, -866, 1226, 1039, -669, -1573, 157, 2247, -578, -1263, 2045, -722, -1424, 910, -25, 778, 88, -1541, -60, 1308, 312, -1026, -625, 1623, -898, -1557, 1961, 307, -1132, 135, -737, 610, 1257, -1349, -585, 647, 138, -711, -130, 2137, -233, -2199, 831, 554, -134, 698, -1090, -308, 1059, -764, -296, 1004, 359, -967, -902, 1879, 726, -1772, 486, -74, -334, 1177, -691, -350, 1178, -1113, -1015, 987, 1150, -402, -1585, 759, 849, -1415, 419, 287, -405, 678, -972, -161, 2023, -632, -1287, -84, 810, 200, -1240, 397, 783, -1422, 305, 68, -28, 1407, -1388, -643, 1685, -48, -825, -242, 507, 228, -1087, 136, 1155, -855]
3552h55R72n25M5J889k365k39K213r47q22L25J061o9j897R67J202j025L33p60
3570d97l53K642k124p23K194p86p75q8O04R86j876K39J139q17P82r23n20K485
3588A589j972j263K498l06o56l46J00J706j637m83J177n25Q87j306p01K789j554
3605cj446J843k45J4l65m34J407r82j84O62o19R06p55j331K481l10j748J292l20
3624a37L62j99r32J619l55r22L89k20J357o67j437K004n5j703J214l95L38j85
3642G6r41J094K38p73O1k58J046J69k033J772J87j190O54p01J169q5j422J303
3660C66J38o90L70n08N95R05k644J574K13m57M11p43L98J032j797L58P02n03M83
3679B03o26M62Q27j572O98O37r26L82n44M53Q08j276J61P66n29L86j120N87J299
$$ y = [-855, 117, -408, -363, 1526, -839, -1078, 1135, 188, -634, -309, 752, 683, -1214, -247, 955, -70, 263, -497, -850, 1792, -332, -1055, 1139, 353, -422, -510, 94, 1080, -796, -557, 582, -235, 547, -376, -896, 1589, -383, -1646, 852, 546, -110, -456, -356, 1350, -287, -770, 407, -118, 769, -537, -1238, 1551, -3, -1449, 394, 149, 163, -202, -636, 771, -211, -395, 267, -352, 554, -201, -1532, 949, 639, -1109, 183, -137, 225, 26, -906, 713, 358, -564, -175, -395, 962, 295, -1142, 862, 807, -896, 318, -77, 261, 76, -865, 229, 467, -306, -245, -503, 543, 712, -1321, 451, 638, -552, 102, -599, 570, 485, -937, 366, 504, -186, 184, -324, 271, 1176, -1468, 106, 319, -138, 273, -470, -72, 960, -837, -479, 223, -280, 203, -423, 39, 866, -706, -8, 629, -297, 85, -459, -6, 802, -474, -313, 453, -76, 310, -810, -223, 1076]
3698A076j902P01M52m74O94j124K74J312j480R4L26M4P40j460L12J488j706L94
3716b39M66n78J018j081j19J353j036m8M21r6Q28j189k95J510j273K8N78q82J377
3735G43p75m19J097p11j20Q5k46J098q68o56J328p20r1K83o08J292n61j022J470
3754E99l42k54mn51J534o58j052J254m74j12Q4n37J334m26j099Q58R2l17Ko68
3774g37J360p56m61R94q53L44P00j474J284J67j372R52qm1K36r47J116j63q34
3793d93P24p45N63O20j579R05O84j437R82m11K13L65j056P98J4o34P87p13K50
3812a63Q52j369M10R01j211O47j98l3N99q92N56K1p27J363j207K65J168j886M14
3831d90J177j061N29n1j84M30n96N90l46m93J053j173J56J731j604m2P58j186
$$ y = [1076, -826, -125, 327, -147, 547, -577, -303, 1009, -471, -377, -51, -7, 733, -727, -415, 1073, -633, -239, 227, -351, 667, -414, -533, 820, -216, -264, 157, 61, 889, -300, -595, 915, -358, -330, 248, -634, 743, -32, -451, 646, -65, -185, -100, -346, 752, -116, -772, 556, -164, -255, 28, -580, 712, 151, -871, 599, 257, 3, -1, -552, 982, 324, -728, 526, 52, -60, 24, -513, 821, 395, -704, 154, 246, -71, -69, -737, 623, -133, -594, 400, -453, -109, 591, -883, 401, 568, -804, 148, 140, 99, 335, -612, 504, 341, -493, 231, -514, 49, 669, -910, -5, 679, -758, 224, -187, 26, 391, -665, 133, 147, -487, 300, -413, -163, 689, -680, -270, 631, -580, 67, -131, -164, 435, -457, 99, 120, -607, 756, -451, -186, 982, -904, -490, 687, -374, 155, 104, -80, 350, -246, 344, -2, -495, 558, -615, -459, 1272, -332, -374, 384, -802]
3849h02J046K9l64M99m70J92r9n25J394j398j50J886j858K38J265j345P23J90
3867D51p03O96n07N0j86l75J587j182n13J755j585j95J571j555O47M34r49M31
3885a28K26K49k75q25J395p30q61J892j115n77J224j307P86Q95j139j66L57L11
3903B12k39o78J540r33q37J804q44n18J454j606L2J522j118J70K10J40o23n49
3921h61K123r97j150J545r72k94J865j660k81J303r84p5O94K31m13j007J294k64
3939I7o93J748j405p78J894j242m52J921j110p67N07O07J57q61J145r97j149K351
3957I73p85j017K029j654o89J936n72l33j11K76k3l70R87l34j373K066j315p99
3975a108K788j521j145J327k11m34J99O08l19j118J138k5p76K166j703j061K463
$$ y = [-802, 244, 273, -91, 408, -62, 130, 31, -494, 900, -498, -648, 1238, -620, -382, 883, -462, 261, 451, -252, 444, -63, -13, -199, -574, 1013, -169, -682, 1073, -512, -707, 864, -691, -44, 390, -559, -128, 98, 347, 72, -753, 642, -88, -949, 943, -172, -749, 475, -832, -46, 849, -290, -456, -99, 212, -27, -705, 835, -98, -935, 869, 25, -493, 961, -645, -613, 909, -209, -39, 171, 311, -312, -861, 1262, 265, -885, 660, -312, -606, 1259, -401, -682, 621, -363, -438, 256, 487, 74, -933, 361, 97, -596, 1152, -253, -1031, 863, -379, -831, 1090, -20, -787, -280, 327, 484, -377, 768, -229, -1378, 973, 188, -829, 1200, -454, -1143, 793, 221, -112, -223, 53, 30, -340, 647, 313, -1060, 1006, -309, -1108, 1680, 159, -986, 341, 130, -304, -105, 503, 184, -934, 204, 179, -597, 1569, -134, -1195, 1268]
3992A268r50j037J602o17q92M05L46K14m79L73m68o60K164q84j758K260q24j129
4010a066J888l53n79j87LK64p7R83p60j184J693n18j190K090n11j687J224RJ61
4029B03M11n48k89l61O71K40r61J609m97j934K032J79j195O19n25k02Q95J30j95
4048B82p06O20nj487K167m0k024J473q4q77J446o81m95O96o84L68q3Q06j57k067
4068a532J597P46j459R86J22j219J112o82J60R68q67l26j03R25L79j579O97R06
4086H31j887J258K41j055J350r73l36J213l77j70o36O14P00j745Q04J151j635
4103f52M36K91q80J783p62j044J115L27n23n72K22J167j881M91J545j397L57k96
4121b73n45J508m77j052J233k14jo26L64J138j134m01J158j044O15J22j399J778
$$ y = [1268, 318, -719, 883, 266, -626, -221, 125, 339, -140, 233, -235, -895, 1269, 385, -1373, 887, 63, -1066, 822, 469, -110, -297, -294, -30, -107, 876, 116, -1068, 625, 107, -1083, 1007, 496, -1191, 33, 42, 203, 614, 66, -223, -584, 87, 327, -634, 975, 478, -1456, 576, 755, -440, 179, -346, -548, 347, 477, 282, -424, 196, 191, -1296, 871, 831, -1193, 280, 196, -681, 765, 84, -411, 285, -399, -31, -114, 692, 535, -1532, 65, 811, -648, 338, 460, -759, 353, -329, -169, 799, -68, -394, -497, 428, 807, -772, -75, 831, -1056, 202, 443, -612, 738, -235, -571, 642, 265, 95, -541, 73, 773, -972, -168, 983, -652, -216, 75, -805, 978, 216, -828, 287, 614, 91, -481, -259, 908, -973, -482, 1063, -334, 23, -273, -818, 690, 213, -839, 394, 180, 179, -447, -83, 1055, -79, -480, 678, -366, 249, 371, -1028, 750]
4139G50l91j062P81L18j67p60r9J164m23o22J093q30M92j81q06J450m3j576R05
4158gL24K06n36p32J439m47n33N62o74O66J32j514J375N00j083K17J02N11k76
4177B32r20J520n87p56O89r95J094L99j749J119P93j048J20k55P85Oj213J113
4195C47K35p73R7l65P64L72j515Q22M99o28Q8l07P99J02j356P05M21l76Q3n67
4215e53Q37O52j548K22Q08l55K32j044O22R62j082p3N00q7J69j129P45J155j681
4234f48J17Q19k84K57p80J29J530j732L15M14l0O07j361Q8J522j162o0M19j29
4253C1N05j136L59R91p41n57P09L7L08q81j62J298o25n34M56q2J004j194n79J395
4273F02m00l56k87K00R79o57j047J930n90n91J03k37J076o85q55Q80L4k19j22
$$ y = [750, 359, -703, 78, 396, 229, -531, -630, 534, 111, -511, 582, -248, 244, 63, -743, 707, 664, -912, -7, 317, 523, -13, -745, 694, 247, -286, 276, -398, 268, 400, -1114, 261, 761, -322, -105, -3, 508, 232, -688, 832, 245, -511, 178, -817, 277, 676, -1073, 46, 839, -209, -89, -344, 441, 447, -766, 347, 582, -191, -94, -459, 305, 677, -838, -16, 483, -145, -57, -364, 435, 537, -819, -114, 307, -69, 14, -553, 284, 936, -612, -390, 418, 63, 295, -749, -127, 835, -247, -320, 180, 93, 262, -867, -122, 1033, -648, -531, 288, 4, 261, -519, -390, 1140, -592, -277, 137, 107, 714, -647, -559, 963, -199, -259, 160, 31, 536, -600, -241, 750, 9, -548, 161, 198, 506, -375, -537, 761, 136, -398, 58, -24, 980, -214, -793, 602, 202, -154, -441, -241, 738, 81, -966, 964, 374, -217, -114, -351, 725, 40, -815, 65, 99, -120, -242]
4292b42k46J545j009r62J358N9m72j01m24J101m96r76Q82J46j75l28l06J419l64
4311D09j270J001K00j34q4q69J347J52j697P23M68L28n66r12J361J47j425Q41
4329B0M51j03j72j123J058N70j382L15N93K53l79j200J488K25r55R5M29K13J81
4348E77j351P14R21j178j64K35N94J53j450P96J157j267J08K29j42P22j421O21
4366a46J042j252j1K62K44N91j685Q40P23r93N39m76N41P07j250m26J552n34o79
4385d11J10N13P18j269J2R64o11k5m75Q1J598j327r62J556m53m5o59Q32O80j647
4405h20N02M92q2K30r54j24J805q66j151J156K44m42j51r4J202j189k28O46l79
4424b03J084r12q02J723m11j475J360j7Q6r21J37J117o50k47K88o58P84l58r80
$$ y = [-242, -488, 1057, 48, -914, 444, 503, 31, -70, -494, 607, 111, -865, 17, 163, -12, -340, -646, 773, 409, -861, 140, 340, 206, 122, -747, 600, 752, -945, -222, 246, 574, 8, -904, 457, 604, -821, 20, 471, 368, 196, -927, 131, 701, -681, -366, 227, 480, 101, -1099, 389, 614, -341, -246, 183, 396, 577, -774, -60, 861, -317, -481, -246, 348, 501, -949, -153, 1004, -263, -155, 74, -68, 654, -767, -146, 896, -356, -367, -105, 139, 730, -955, -115, 608, -385, 154, -322, 219, 926, -324, -750, 802, 268, -411, -301, 212, 930, -339, -327, 637, 26, 1, -474, -393, 1205, -122, -1084, 472, 19, -26, -685, 147, 827, -820, -318, 174, 92, 322, -632, -756, 1049, 183, -968, 188, 432, -10, -161, -255, 947, -242, -470, 176, -203, 881, -31, -833, 890, 479, -996, 364, 347, 433, -488, -351, 766, 116, -131, 157, -501, 283, -75, -1055]
4443a055J750M31j899M88N73J0j94n25O45k27K13j47n94J508o31j785K013L15
4461H89j583M68j0O35m05l66O70o2k78P8q36J774q8k351J367O34r22K70J57M35
4481D76k80r47L89M22L51k99j530K072M16k404J342J115j646M22r8M19L78q02
4499b04m71N15R82l20j567J691N49k346R80J166r75Q3m94J66P79n13l58J93N27
4518C83P1j791J538J619k797M17P16n67J036o16m56P42j54n80J58J034L3k178
4536a392J006J554j444k5O61o70P06m83j12P57J03j118m54J298P32k264N33J723
4554A111j552J91O68o54P87m09j235J314M08l11j070O63J157j720j18J828j265
4571b07k80O00n97J346l02j488O12R66j82j237O55J161j597j24J292m56j46J98
$$ y = [-1055, 695, 1126, -773, -285, 288, 298, 104, -421, 224, -3, 210, 63, -531, 977, 346, -1439, 574, 889, -694, -226, -236, 399, -6, -372, 298, 236, -42, 36, -800, 974, 886, -1465, -98, 536, -386, -116, 41, 476, 196, -751, -362, 60, 411, 112, -1418, 654, 1070, -1334, 8, 1123, -523, -101, -199, 220, 598, -204, -675, -160, 822, 502, -1065, 626, 1175, -1171, -191, 975, 0, 83, -411, -245, 534, 21, -337, -144, 383, 454, -1337, 201, 1820, -977, -560, 156, -411, 625, 9, -447, 295, 141, -439, -281, 753, 786, -1392, -386, 1168, -276, -301, 360, -310, 396, -87, -199, 558, 661, -457, -911, 387, 1119, -1145, -612, 1111, -441, -250, 418, -236, 551, 142, -1093, 221, 629, 318, -752, -89, 1068, -652, -770, 1058, -207, -487, 113, -484, 862, 560, -928, -316, 650, 468, -769, -114, 1047, -550, -674, 618, 162, 16, 214]
4589B14j460J510M98j602Q09O02l45j010P11J704j620p79P57j40L44J01j468J493
4607C19M67j768P03Q92k26q53j55J252j62r48R75q89O19L34j419J059R20j922
4625h02j73J412L35q85o64J170l5n19P44r87O89N83j895N72J521r11l82k10P39
4644C02q9o95J021k38o90O60p80P46J033k351M54J800j097k87j59Q53l10j047
4662h74R41J76n41N06r05N34J291j688J30J068p51k39j40P27K74j147J72Q09l46
4681cJ00p41M00J376j593l94J234k30l13k03r9J180q57j36N56m85R27j311oJ612
4701A014j138o61J170Mo31k75K9J341r92k10L26K6P92j173o81K040o09q63Q24
4720C33l23J29k03k23R78p62j27J24O8Q31j068p58J841n08r07O33k44O66q15n98
$$ y = [214, -1246, 264, 762, -840, -31, 571, 226, -784, -73, 1631, 11, -768, -11, -151, 193, 294, -1174, 319, 786, -982, -279, 613, 387, -466, -621, 631, 469, -479, 496, -393, 226, 560, -859, 200, 1120, -802, -975, 437, 772, -113, -777, 393, 358, -161, 583, -404, 285, 868, -1027, -455, 1066, 155, -227, -437, 302, 213, -482, 539, 301, -389, 271, -509, 237, 1270, -1081, -627, 1173, 76, -211, -370, 483, 173, -874, 67, 243, -298, 208, -697, -163, 1128, -560, -430, 638, -113, -352, -492, 235, 509, -638, -466, 343, -3, 97, -644, -244, 1132, -461, -855, 379, 149, -164, -367, -466, 714, -143, -279, 277, -208, 719, -592, -598, 1014, -124, -785, 385, 389, -242, -517, -488, 853, -139, -349, -23, 3, 795, -378, -1059, 981, 372, -491, 333, 10, 139, -64, -287, 691, -71, -198, -74, -6, 825, -243, -1001, 840, 332, -575, 58, -186, 480, -335, -933]
4740i33J475q1m02k72l17J062l60r05R49J48n70K7oO32k46p30Q11k6l51j19m20
4761f34J405l66j557J399K06l97l82m21J148J81j265O08N18j6k50q12J153K5j412
4780h69Q23K11j76M1m67P19M43j327K93N64j67j16r76J365N99j279j29O20m0R1
4800B23q11M41Q12p80K3J29L6j03o42N78P57j183N28O4L28j55q34L39J003q05
4820e2m02K01N60M04j419L12J103r85J39r1J4R37j396L76J240r07j37k91M14P52
4840G72j241k62J484n27m63j30N42O91r76n22J119l04j61l93nJ048p62n35R22
4859B97k93m9M2n59J468r54k37M28J27j90m30K94Q76o93p79Q62JL14o41p69J647
4880G62l80q39O15j75O8j26n39J220m17q78J086n57L35m54m12J060k18r28N63
$$ y = [-933, 542, 461, 59, -213, -530, 532, 172, -733, 216, 364, -206, -179, -185, 447, 201, -529, 282, 256, -95, -214, -634, 771, 405, -1152, 247, 453, 56, -326, -747, 401, 582, -683, -75, 443, 427, 177, -635, 518, 543, -869, -46, 165, -11, 30, -437, 282, 725, -602, -309, 255, 88, -28, -1004, 361, 960, -319, -448, 172, 132, 223, -588, -147, 665, -115, -92, 37, 73, -30, -672, -94, 663, -520, 8, 72, 400, 245, -589, -250, 753, -52, -454, -253, 307, 711, -708, -396, 707, -278, -139, -230, -216, 721, -675, -299, 941, 34, -103, -394, 20, 772, -469, -731, 753, 226, -237, -367, 175, 866, -110, -632, 487, 183, 22, -371, -376, 672, -90, -625, 297, 4, -45, -3, -562, 906, -48, -285, 143, 270, 80, -350, -56, 820, 127, -652, 210, 211, 525, -116, -885, 762, 382, -457, 158, -17, 51, -75, -614, 606, 189, -689, 397, -160, 175, -279, -691, 369, 151, -777, -214]
4899b14O93j21j29r17J062K13j092O16j92M41j63r59R80N69j252N07J49n9j84
4918e2p32J071n5n38L08k29Q72q7j616J117N48p48J19k16L74L33j060M51L33l18
4938a25L04p43R06J33j252L78J069p57j2J70K34L7o24J30N33l12J90q17P16N72
4958G30j149L23J79j17K41n25L97K18n72L4L95KK38p36M28P61j265P8R61p42J41
4979B0l59J20J010n25k45j24M07Q1r74K19J264j148k08P47l43L21l69l01O39m16
4999a84n1J47K55N14j188M4J227p57n37Q90p68P18p7l74K80n2k0k97nJ115j224
5020c44l54J214p67J0Q00q53K45J78o29R23K6k30q95L12J243j098l09Q96k79o33
5040e44Q25p27M54K98p97L57K51J08l63l75Q88o54n15J479n93l32M90q75O63L34
$$ y = [-214, 479, 358, 229, -688, 374, 587, -505, 111, -81, 360, 197, -762, 218, 787, -465, 42, 191, 132, -52, -784, 287, 232, -306, 2, -227, 645, 558, -1058, 59, 607, -141, -22, -238, 136, 469, -591, -140, 193, -125, 179, -564, 342, 475, -777, -399, 670, -87, -99, 71, 305, 342, -282, -152, 381, 69, 259, -558, 158, 730, -419, -96, 83, -34, 207, -318, 79, 297, -275, -241, 154, 156, 394, -342, 86, 847, -418, -340, 621, -121, 20, -339, -219, 791, 266, 21, -103, 304, 385, -589, -370, 894, -254, -462, 285, -58, 263, -106, -407, 232, -184, -235, -88, 167, 681, -507, -463, 764, 7, -530, 360, -408, 310, 233, -141, 139, 87, 67, -230, -235, 880, -344, -698, 516, -251, -241, 559, -294, -49, 129, -500, 423, 449, 219, -676, -364, 879, -219, -528, 368, 89, -544, 281, -446, 8, 306, -491, -134, 117, 225, -138, -513, 375, -279, -794, 685, 92, -240, 250, -625, 38, 372]
5060C72q45K58L94N5n87k05J315o41p78J149m83j21P43j342P4R72r81M47N35o2
5080B69m50l23R26l02o77J063n36j80P80j007K19Q81r31j87M42K02q5o60P43o
5100A81m98Q47n22l23R08q73p8J140o06m89J24O07l30n24P83l54k57M60k13n10
5120e27J219j318l54J369l38jj01K67k96m05O74R6p81R79p38l11J364r02n72J136
5140D60m65k48j00N53R2o00J27J47k36R97p63p61J413o72o06J099q5q25J91M27
5160A45J82p19M92n1l93J003o80o55J522o47r32R33j21pko5j52K23K06p9n85Q82
5182E00m97o95J143Q1j125P45m7l72N68m88L10l21K23q8k15Q07l24j056J152j04
5202A97p79J022k80k72K37K6o5K4k8J01o31R29j27q06P53o3n18M42Q0n25M76l65
$$ y = [372, -473, -215, 179, 234, -353, -558, 757, 116, -662, 487, 4, -117, 626, -716, -642, 330, -651, -204, 331, 269, -181, -504, 422, 120, -557, 506, -30, -210, 570, -437, -218, 663, -268, -455, -13, 189, 104, -556, 187, 181, -317, 530, 8, -315, 593, -280, -358, 782, 176, -313, -189, 418, 88, -436, 347, -7, -264, 196, -17, -527, 692, -626, -980, 389, 51, 50, -51, 216, -80, -485, 189, 285, -496, 483, -255, -566, 798, -104, -676, 460, -5, -253, -353, 200, 292, -308, -181, -34, -270, 727, -36, -797, 616, -56, -662, 437, 352, -473, -282, 145, 327, -392, 100, 49, -344, 659, -21, -676, 846, 199, -733, 200, 79, 72, 70, 5, -147, 76, 282, 203, -382, 500, 3, -692, 451, 532, -593, 152, 105, -267, 301, -187, 123, -198, 25, -63, -278, 529, 205, -851, 301, 197, -582, 440, 160, -112, 125, 151, 86, 110, 82, 183, -448, 481, 354, -452, 301, 238, -280, 162, 242, -283, 193, -172]
5224a72J1J50L25K3q15O80J49r31P75R0q64O98k05j4L29m04P9l1RN47n44K96K95
5247D76q47L16M67n02L38j71l28M82k18R7k82M3J36m48L71O02q03M11K14n54N28
5268C28l20k65N05l79o6L73m81P61n56n8P47j006M51m0l98P40j24o21O65n28L41
5289F9l87K25J10j1q8M71p65J95M39o57M79K4l41N30k07J51j20n43R31o75j91
5310c61P58o34K79K21o72M72j41j65L10l15L58K5j24K10k29n21Q23n44M6M10n60
5331c54L92K63o09M59j76J8K76n36M15k26l4M17l66k45M07k36K92n6m56P62m99
5352i2m6L31n57P58l34m13M86l34K06K64m52M73j20l24N41o15K58J46l83K65N9
5373A17m36O93n17J90M25p45K78l7l8L96l04j93M55n31K79J3n92N15J21j64K64
$$ y = [-172, -161, -11, 314, 337, -478, 202, 351, -580, 195, 285, -579, 119, -86, -100, 229, -175, -96, -127, -118, 429, -115, 181, 476, -371, -55, 412, -90, 248, 77, -251, 231, 13, 110, -172, -129, 7, -441, -70, 532, -271, 140, 354, -200, 328, 8, -257, 248, -131, -197, 176, -305, 456, -100, -158, 589, -417, 34, -6, -404, 336, 212, -409, 256, -272, 69, -318, -93, 17, 6, -82, 389, -376, -181, 258, -399, 80, 104, -237, 293, 86, 237, 117, -426, 505, -170, -361, 397, -237, 42, 263, -409, 63, -78, -243, 67, -248, 110, 135, 11, 221, -8, -529, 294, -250, -204, 206, -354, 38, 301, -308, 151, -25, -7, 269, -267, 148, -78, -112, 305, -61, -306, 101, -135, 157, 101, -355, 407, -92, -138, 193, -364, 394, 60, -353, 133, -201, 5, 269, -183, 290, 170, -154, 387, -228, 30, 176, -207, 58, 117, -319, 374, -143, 47, 472, -273, 5, -32, -70, 326, 22, -171, 284, -247, 32, 45, -547, -32, 89, -75, 189]
5394A89m32N05k15k84N37m18j32M03l12L59n4n29M16j25j97O48o84Q8L80j35O27
5415F35o79l24O09n91M41K20m56M71l88k54N69l24J35Pk48J06K17j81K49m27K48
5436C5r6k66O32m13j2M16l97p6L79l75K91q7k04O45m71R1J3l55K91j33n0L47n32
5459c27K10K05n16P8N73j62J34l41l5L37l38QQ3m6K77l28O8M97o85Q5N37l14J50
5482A50l16K71n4N4j94J32j15L55l05n8J91l30J18Q0p3J78l9j65L59l40J62P1
5504A32r8L92n25k33P47l10l26L04j49J52k51J86K10m07K22J17l70O74l91l95
5524c19N35k22k38M87j93K44l22k19M66k90K44k83l26O53k56k99N99J7m79J58
5544d3l5jJ12l29O05o84M16J37p02R02k04n27N88j83k57M32k42K0J30j96N5j25
$$ y = [189, -243, 262, 47, -237, 300, -118, -250, 153, -159, 200, 146, -383, 33, -92, -289, 359, -325, -237, 143, 8, 635, -44, -368, 241, -350, 91, 311, -145, 326, -62, -316, 253, -71, 64, 71, -177, -71, 146, -35, 214, -213, 35, -61, -327, 305, -108, -120, 296, -101, -177, 202, -173, 118, 31, -173, 472, 1, 92, 105, -250, 41, -92, -142, 205, -327, -117, 88, -428, -350, 223, 61, 195, -146, -181, 156, -182, -174, -91, -137, 140, -188, -120, 377, -308, -223, 314, 0, 150, -166, 105, 51, 105, -89, 43, -72, 283, -22, -80, 111, -219, -101, -21, -94, 84, 45, -120, 239, -101, 61, 132, 34, 426, -99, -332, 415, 105, -221, 83, -66, 86, -165, 21, 231, -176, 46, 163, -207, 467, 76, -319, 216, -6, -244, 243, 50, 294, -28, -247, 219, -71, 173, -110, -436, 217, -39, -338, 261, 278, -201, -43, -78, -79, 33, -296, 309, -375, 41, 178, -524, 378, 174, -353, 235, 52, -205, 227, -15, 5, 135, -61, -6, -131]
5566a31M17j38p40R10J38p13M17l2k78L36m20K59J09p9Q5k01K44p9q14R96O0q98
5588e52O77p5j11K68j01K8Pk63J48k41N18j38p33O72L29q62R11j96p33N53n89
5609d83L26L27j13L5j6O7K28q16O61L14j103N01J74n54P58l74k82N83K1j46k57
5630a49K47L45r97N73M89j001N78l1m22N11j12l04L73k38rm5N02L82j191M65K70
5651B36n09L89J35n93O35j96n44N29n8l9l85L58N34o98L11K46p38N79o8n23Q29
5672D30J44j098M40L43j41m91K04N37j060N31K65m80K48K40o58Q88J29o53K97
5691A15j01J95l10L1L44n74K06L72m18L40j07o19O20L17n55M8M5K50m41j39O72
5712B91j75oJ12p54P60K10j046M88O07q01n3O07J8l52j6L46k19j34P46r63L93
$$ y = [-131, 286, 148, -592, 318, 456, -257, 160, 128, -150, 186, -234, 25, 134, 55, 140, -61, 183, 104, -710, 286, 346, -552, 125, 50, -61, 207, 106, 134, 141, -122, 26, -215, 303, 165, -568, 104, 433, -429, 482, 286, -447, 106, -483, -157, 170, 57, 92, 76, 143, 371, -445, 216, 530, -573, -72, 102, -452, 306, -68, -350, 233, 254, 108, -149, 98, 443, -554, 19, 508, -493, 85, 54, -368, 143, 31, -273, 100, -138, -147, -192, 310, 692, -499, -34, 236, -273, 116, 251, -342, 293, 97, -447, 82, 24, -15, -400, -42, 492, -206, 105, 351, -387, 192, 124, -399, 430, 574, -524, -84, 259, 118, -373, -169, 368, -692, -161, 104, -376, -128, 112, -546, 342, 471, -182, 115, 14, 209, -101, -70, 274, -300, -94, 278, -140, 200, 93, -526, 94, 411, -144, -96, -51, 199, -242, -381, 291, 116, 110, 222, -532, 228, 438, -608, -120, 487, -314, -367, 240, 258, -94, -110, 236, 17, -117, 629, -334, 59]
5733E9N57j331Q62P6k82J19k90L72j73K9Q4k92J09K72n05N31K16q63L03M66m48
5754a29L63k54J64m54K19K85J9l27N27j097M57Q92j048K54K49k07J07j34K24L76
5774D86o67J78j72M4N30r73M78P58j126K97J9J40R6m52JO95j81J24n69J11N23
5795C40l87p6P68r98j51Q09k90K09l96j36K38P8J59l20P0N08q41j95J117m38n67
5816d99O33j07K60m45J93K0l06L35j70n3N47l52o89R43l00l21N43n95K59L39m50
5837b15Q0L03r8k55k28R62l44p94N88J72j91K15k83M43m98K6J55K57l9l22j77
5858b43O04%p94P71n03K22K30p64O65q8m13K24j32M35k09k17N75r7m76L96j81
5879EJ3Q8q05Q08L54p14J77P3n7J42n10N44L33q17M22j28K08n2m67K83L13k58
$$ y = [59, 616, -715, 147, 223, -59, 60, -230, 142, -31, -2, 82, -210, -101, 171, -334, 197, 413, -450, -147, 319, -129, 234, -20, 144, -310, -91, 194, 213, -114, 413, -684, -227, 665, -383, -129, 120, -87, 20, -114, 110, 486, -181, -3, -175, -131, 399, -574, -96, 662, -464, -167, -148, -8, 88, -364, -363, 332, 151, 275, -294, -183, 340, -47, -123, 645, -353, -504, 305, 15, 224, -172, -308, -70, 8, 167, -153, -83, 425, -416, -611, 506, 68, -499, 134, 27, 287, -158, 35, 55, -251, 84, -86, -139, 408, 56, -633, 310, 10, -311, 232, -363, -104, 235, -215, -135, 168, 70, -185, -413, 549, 205, -589, -1, 171, -20, 195, -88, 355, -143, -117, 38, 295, 256, -66, -243, 361, 361, -433, 338, -165, 57, 287, -477, 188, 100, -313, -89, -221, 214, 5, -212, 363, 266, -210, 186, 5, 18, 106, -699, 109, 463, -251, -74, -1, -58, 84, -426, 118, 451, -366, 56, -72, 136, 84, -383, -100, 213, -45]
5901d5J65k40R7R9m47K64M16n25J97J02j87L55n60L27J21l61K06l14K49P94q74
5922a61L23K42n30K76l31L94K20r65M35L39l29o9j34N77J03m91j91M40k71Q9j55
5943a89l23O75l06j86L90L8J02m67K64L89n30j35L21L3j0j21l36N85l15r3L47
5964A33j40J85n15j38O33m81K56q7P6K60k02n13R55l42q3k75K45L37l89j74P60
5985E01m87q0R6L3J76l89k14P96l62l68M32k02L13k33l84N60J39n83L57m63O56
6006B94o0o08O53q2l96M89k97L78k76m94P41l04m0M9l76O70k63l54N05k6k67j93
6028b57J70M74k69k03L06l66J49J35m63M93P2o40K52L41m09L17k24L87k78k69
6048b82K7J86L3J23m97K81N07n86O2K51r7P8k68N0K64m41K14J35J21M8p31O32
$$ y = [-45, 120, -120, -23, 76, -371, -107, 309, -216, -19, 83, -104, 251, -309, 18, 139, -222, -16, -330, -81, 713, -161, 162, 404, -126, 150, -181, 213, 433, -532, -97, 242, -87, -156, -290, 287, 390, -101, -292, 148, -123, -34, -189, -512, 163, -143, -329, 61, 99, 201, -266, -2, 387, -143, -278, 43, 76, 66, -55, -391, 194, -121, -214, 133, -7, 178, -337, -475, 158, -323, -67, -154, -78, 182, -20, -533, 422, 80, -3, -278, -33, 304, -85, -259, 501, 14, -66, 30, 63, 239, -150, -364, 432, 70, -298, 134, -68, 245, 12, -372, 188, 327, -256, 101, -362, 294, 234, -374, 279, 197, -199, 290, -7, 371, 95, -399, 342, 38, -2, 47, -329, 341, 78, -276, 229, 203, -64, -257, -87, 387, 118, -85, 221, -145, 4, 139, -324, 169, 241, -399, -147, 194, -215, 102, -122, 265, -13, -282, -255, -69, -36, 87, -410, -129, 378, -208, -146, 105, 8, 86, -182, -132, 132, -309, -95, 40, 161, 209, -522, 110]
6070A10M43q84M00rj46K81n10J56L59l91K3k7K67M18q23M9P51n10j77L57j19K02
6092B20l32r9N12o6r3m01J76N04o34R0O40m50j24J3PL35o50L7N67j97P1n94M92
6115B4K69o87J49L39l10J96R0m29M28j00k76M39J08k99ko1O75o40l33O83o19N34
6137A78j1n27R01j52q69M40K39J16m93J37N17p17M6O18m71M38j51m04N55o0p10
6158c80K80J60o2j29J3L90k68m65N23p1j51M29p38M04K56m61l4L60oj76j18N81
6180C37q7l24K02l50M33K16q06L93o5J80k08l6L67k58l19M26P0p3J63o35R3P54
6202D73r80L54P95o39k43Q3L01M9l21N9J23m81O09k96J45N29o34m52J118q09J65
6223e2j84K88J4j74J50l7J4J5k40K3N59o65k51O63j09l36K12Q1L89o61M30k46
$$ y = [110, 553, -331, 69, 60, -86, 195, -315, -159, 200, -191, -168, -195, 72, 490, -333, -284, 467, -43, -220, 137, 18, 220, -112, -211, 301, 235, 142, -259, -83, 421, -213, -123, 517, 67, -57, -44, -37, 298, -352, -315, 252, 55, 126, -468, 24, 293, -394, -245, 94, -216, -20, 70, -359, 69, -31, -307, 132, 240, -59, -61, -122, 553, -87, -420, 263, -356, 178, 167, -360, 541, 389, -480, -40, 199, 315, -178, -41, 476, -241, -195, 423, -48, 390, 239, -165, 390, 330, -380, -100, 60, -2, -131, -118, 272, 4, -461, 62, -9, -160, 269, -469, -65, 191, -270, -304, 56, 50, -126, -244, 337, 250, -74, 128, -222, 211, 427, -379, 14, -51, 129, -79, -115, 252, -6, -325, 101, 171, 98, 261, -374, -281, 473, -507, -153, 642, 3, -240, -157, 144, 193, -128, -69, 54, -427, 182, -114, 31, 560, -74, -526, 592, -217, -52, -236, 52, 66, -108, 42, 5, 19, 34, -206, -183, 376, -289, -540, 123, 14, -322, -110, -29, 360, -301, 129, -117]
6245a17j0Q34j011J2O05o77Q1L76k61p2r7L33P7m84P15l75O6M00n03r3P99q34
6267b36n9K61j33K85j46k61M95k87N4r6j07M20n36o8Q59k96m39M02m57K94l5Q6
6289@P4n6J09j89QO75m58n89O68k9l25M77l77j04P3p4m6L29M7o82K78O68p49p6
6313c48M87j8l48J79J48m02M82l42K80l6K99n82j71O48j40n68N59j30K09n3n06
6334c53L63J76k38j42J71L65j69n66O97O3p76O40k22k44L24j68J22L58n13K4P8
6355a0Q3N5k35Q6J62o00O54l81P9N55p44K15L86k86k21J85NJ67n39J76M86m89
6377b11J88L6j06M70l87k54N33k91l4j51L91pm39K8M60k89L2K25l45L83m76q2
6399c26N37l07J17p7K13l0k74k50M75l49N29k77j95P96l39p32N57o7N7k78K6M55
$$ y = [-117, -127, 707, -304, -292, 313, -364, -283, 93, -168, -240, -337, -4, 73, -411, 304, -71, -5, 395, -108, -201, 598, -236, -295, -34, -167, 118, -28, -289, 206, -81, -27, -123, -230, 190, -346, -414, 445, 149, -290, 112, -345, -51, -86, 0, 74, 18, 127, -62, -54, 621, 163, -426, 242, 213, -112, 365, -12, -116, -43, -117, -163, 166, 213, -469, -191, 477, -272, -348, 139, 121, -227, -48, 100, -302, 180, -162, 118, 82, 381, -201, -372, 276, 136, -432, 127, -3, 206, 153, -353, 10, 186, -52, -194, -23, 342, 173, -393, 304, 367, -409, 231, 9, -235, 89, -79, 43, 401, -112, -88, -10, 73, 128, -107, -21, 141, -459, 195, -186, -107, 448, -296, -81, 305, 19, -202, -17, -12, 155, -384, -208, 278, -211, -23, 13, -93, 377, -10, -264, 269, -22, -56, -207, 184, 177, -262, -234, 226, -63, -31, 194, -151, 232, -244, -326, 211, -96, 21, -56, 157, 127, -147, -397, 78, -271, 258, -19, -214, 582, 243, -489, 68, 1, 58, -220, -194, 261]
6421B61o22J20L00J2K32m09j74N72k84l46M50N5j27k1l26P13l71k0K40j45J52
6442B62k59m06M08mk80Q4J88J59m00j19O58k80j40Q8m2J52p3l69N45J38o71K11
6464a50L01j62j30J00J03J01m13K84l48N46j99l55M96J10n23M98l04K0J04k11
6484a32r7Q5K5K24l3p7O1j87K28P0l84K48j71K1K83k59N0J91o8j39n7L0L89n38
6508b37J56M5J00Mk11J82K53l48K05o6L1J38n42j8O13o64N53j05j30J18k87J14
6530i6L80n08K75J53k77K11j65k1J21k50O9M66l39J80l95K51P0k91l4M69k35K49
6552B83m39m0O59k87q9m6k31K57j29r6J54j06Rq2K29K96k70p7L4J2N8k12P2J95
6576A54j59l51L57k29j09K79k5M54m13j04L61j99k02L41k74J05J61l28Q8j0J60
$$ y = [261, -361, -241, 59, 71, 303, -106, -280, 292, 8, -338, 112, 167, 40, 19, -307, 406, 35, 15, 255, 110, 262, 3, -403, 5, 1, -279, -195, -7, 152, -248, -367, 291, 11, -129, -41, -83, 69, -4, -373, 172, 310, -361, -150, 151, -11, -141, -41, 62, 163, -250, 34, -314, 232, 33, -322, 174, 284, -239, 259, -45, -25, 79, -132, -229, -144, -119, 105, 72, -5, 56, -131, 97, 167, -217, 31, -140, -119, 164, -95, -45, 146, 78, -61, -118, -88, 301, -237, -81, -36, 64, 68, -143, 39, 292, -56, 149, 83, 114, 252, -290, -308, 305, -359, 194, 89, -41, 77, -210, -96, 284, -224, 51, 204, -73, 138, -27, -48, 73, -177, -108, 358, 19, 199, -196, 55, 125, -166, -200, 269, 34, 283, -156, -196, 463, 176, 87, 41, -190, 67, -62, -158, -4, -110, -101, -183, 46, 342, 72, -5, 29, 41, 99, -113, -41, 154, -5, -356, 1, -228, -337, -58, -83, 371, -42, -146, 215, 16, -186, 155, -119, -14, 147, -181, -93, -103, 57]
6597E7m9L2L80n22l12N78r3m2J13l10J68R9l00L30K2k08J27m81O43r3k83M4r7
6620a97M83k59r3J56p1p9Mk3P7P2j28J07l1q3K91l17k3M24l89J35J09j33L4j08
6644d2P9j09p6J8L27k12J14q5P7J09k57L2M5l1p4r2L01p0k78L62N5o06N67k66
6668a12r4M90m68J85K70m09J89j07K45K15q09O22j93k05K19Jk93M38l74K56O5
6689A31j81J66k78K33k93m4L93J70l25J31j34k90P06j39m14M23l51P3J6J33M4
6710A70l25j8J44m90N76j1m56L40r5K36J96l47L1j18J4K39l2l8R3l92M71j15m79
6733d06O92j51k46L00l03j26K5J80p6J72L10l42l08K33L2j39N08r3o29M83k81
6754a65J59L9m4j72J94m4J36j40M2J75m59M48N1l68J47pj7N2J51k43K32l8j18
$$ y = [57, 8, 40, 420, -102, -414, 164, 71, 29, 142, -168, 0, 99, -201, 129, 151, -57, 70, -411, 232, 139, -144, -100, -197, 286, 27, -66, 90, 19, -60, -56, -79, -2, 70, -58, 49, 18, -65, 226, -91, -114, 310, -79, 56, 165, 32, 66, -42, 37, -72, -148, -130, 197, -15, 99, 14, 91, 200, -57, -25, 20, -11, -85, -177, 124, 54, -224, 138, 193, -413, 154, -112, -206, 284, -184, 1, 271, -138, 51, -56, 189, 404, -405, 217, 24, -181, 38, 39, -254, 184, -190, 66, 131, -50, 116, -162, 71, -222, -266, 127, 297, -28, 103, -31, -321, 385, 246, -168, 255, -96, -23, -7, 126, 170, -155, -173, -29, -519, 57, 46, -410, -70, -165, 71, 267, -80, -49, -167, -153, 86, 54, 16, 109, -283, 188, 73, -406, 286, 135, -111, 189, -114, -240, -215, -35, -111, 61, 371, 29, -279, -46, -14, -153, 355, 262, -367, 116, -165, -6, 33, -11, -183, 11, -33, 103, -37, 5, 180, -279, 169, 220, -148, -1, -8, -25, 27, 178, -65, 167, 129, 11]
6777A1n15R93j68m02M22m16j25L62J5j61J9k9N1j64J34j6O6j28J85m68N83k22
6799B7j47K90k09m9K82j50RO0J37n2n94L99L21p99L67L81n39K65K96l04K18l41
6821a32J72J02lN2p46O45J83o89L05N42q71O04j0m64M05k37O9q3J67J59q37Q04
6843A37K54o29M13k91l06L01K21j20J73l81j0j01M41K47o59J85O48p71L00J68
6863B20l27K70j33k83K63j0j2j31J78k4j11R7Q4j50n0K48l79M56J14o34K48L75
6885C09l28pJ7J01k41j22N02k60q9P0o9K50K7m46J88m5k19M47j00J59r3k47K31
6908C5j16N4O1j53K65R0l63J58J35o8l00Q2K95k08j33N27o22K14K04l70kJ2K25
6931B2k4K00p6Jl13M52k14j55L27l65J12L48n23J69L14m79L29l99J58O0ML68l33
$$ y = [11, -504, 489, 321, -81, 341, -75, -200, 162, 177, 16, 35, 6, 57, -107, 27, 11, 77, -51, 134, -334, 249, 27, -120, 170, -39, -88, 194, 44, 53, 113, 250, 198, -396, 3, 324, -475, -108, 273, -266, -1, 295, -9, 209, -132, 40, 142, 139, 191, -555, 90, 273, -416, -111, 431, -440, 164, 154, -310, 95, -142, -73, -156, 11, 170, -667, 137, 391, -238, 175, -116, -422, -121, 100, -20, 153, -228, -238, -339, 102, 349, -310, -125, 523, -248, 52, 220, -107, 163, 30, -253, 10, 0, -12, -143, 35, 11, -100, -3, 81, -69, -119, 129, -250, 206, 320, -314, -66, 309, -19, -26, -9, 92, -149, -271, 231, -29, -118, -48, -117, 133, 160, -286, -98, -143, -362, 85, -15, 144, 51, -196, 35, -81, -27, 34, -119, 146, 236, -127, 31, 166, 98, -202, -120, 175, -33, -166, 361, -261, -47, 157, -213, -215, -203, 22, -2, 198, 122, 123, -190, 262, 48, -107, 220, -145, -33, 315, -208, -39, 275, -204, 125, -274, -116, -56, -52, 316, -17]
6954a7k73P40m82K0K94l02J80q0j73L58j72k41P2J6K1k06M17l9l86R0L66n66Q7
6977b76N65m00%K06k94L71j04J14j67k01J00j05J96Lk61L00m0K9K59m95M1K14
6999E5mn6J62j42L07k28j32J56l04K92J69n16O63m14O8J22j22q0J46n21M61J3
7021I5j44L67k61j77L49l40m1L2J66J2k21J5K91k72J80J59j95J28k72n9L78l46
7043a56K98Q4l43K84j76R7p9k01L95j75n0J35R5m69J43J4L65j71j3j9k16k8J99
7066A3k26M10k22j02M69l04j54P3k1K66k88o6K85k9l06K18P2k2j71M5M05k76j84
7089a15L52l25j51P0p5K75l7k1l1J7J83n4m33M40p6k11K39m1J23N2o17O69m08
7112a75PM35l10L17j01l78M01R6m74J19k62L92J25o8l12M68n69lR1K98K37p25
$$ y = [-17, -290, 450, -32, -12, 282, -20, 160, 80, -93, 265, 93, -148, -76, -60, -39, -245, 172, 133, -253, -163, 203, -363, -276, 289, -111, -111, 95, -199, 172, 68, 182, 15, -186, -86, -191, 5, 8, -253, 47, 7, 36, 295, -200, -159, 55, 51, -5, 157, 15, 322, 94, -38, 118, -186, 106, 275, -241, 422, 8, 76, 198, 76, -4, 142, -379, 82, 95, -49, 318, 57, -120, 229, -111, -152, -120, 46, 58, -163, -148, 143, -129, 51, 210, 15, 143, -129, -188, 190, -156, 142, 226, -117, 167, -9, 88, 9, -192, 203, 28, -22, 113, 208, -261, -118, -104, 261, 90, 77, 58, -158, -186, 13, -213, 197, -25, -127, 342, 38, -116, -43, -64, 202, -86, -152, 133, 104, -202, 16, 88, 66, -105, -60, 345, 69, -115, 237, -88, -239, -169, -244, 31, -6, -27, -58, -41, 142, 88, -345, 95, 19, -192, 47, 6, 129, 181, -436, 233, -175, -168, 267, -43, 274, 173, -205, 196, 292, -182, -63, -325, 67, 192, 124, -188, 280, -289, -292, -201, 97, 334, -391]
7134c91O30k4j15k05j86J97J95k26J81P6j65m4J57n2q7k39M59j07j35L68m90K71
7156F8J76m36j07J11j48O01l17q2K76m86L71K3k48K91j58j05J85q5o7P8J38j00
7178b1j64J84L58n86J36J5j40K63M9n1J2R2k33o1p2L00l6K1m1o9K32k61j24K45
7202D8Q9o8q4P0l11K01mK84jl69M51p54M28k9J66l9Q8n15M23j93o4L87j37J44
7226B11j95j38M29m47p3M62m51J30P8j29J63O6j98J58NJ43j55m8j95R7j8L3j72
7249b44M05o7m13O20k84J29lk00p5Q4J1m2N3Mj8l32N60P9o33N66j18%J50k02J16
7274A46p7j50J71N6k46L23m98O79l29l81J78J28P7n6j24J46j03J86M8k17J87O9
7296B13n11P8N0K6K47j99J47j4k32M20m32K7K34Q4j65K73m47k6L85j98K72j18
$$ y = [-391, 239, 215, 100, -105, -291, -94, 101, -125, 56, 132, -33, -77, 80, 28, -59, -298, 161, 54, -81, 287, -203, 68, 244, -192, -299, -188, -336, 265, -52, -134, 142, -344, 27, 50, -198, 93, -65, -170, 15, -70, -137, -59, 79, -21, -185, -1, 357, -229, -93, -78, -218, 45, 94, 43, 55, 147, -86, -147, -219, 81, 45, 66, 25, -44, 188, -73, -197, 48, 137, 69, -15, 55, -256, -55, -59, 225, 224, -145, 306, -448, -20, -49, 117, 78, 166, -349, 74, -119, -183, 204, 67, 211, 16, -122, 307, -140, -213, 249, -202, -72, 6, -123, 40, 106, -92, 66, 71, 214, 59, 11, -184, -87, -105, -72, -244, 161, 94, -319, 301, 17, 146, 143, -57, -132, -48, -37, -79, -26, -22, -40, -372, 188, 267, -366, 200, 82, 82, 232, 30, 146, 69, -81, 90, 146, -100, 223, -275, 404, 75, -306, -128, 0, 77, 21, -103, 43, -60, 126, 174, -43, 144, 213, -298, -220, -170, -144, 103, -96, 51, 37, -195, 225, -207, -180, 54, 138, -27, 246, -201, -227, 158, -40, 232, 114]
7318A14j25l4P6j3o5K4J80l95R0R8p1J77J95l05l7L08q0k47oL3K14k54o7q4J96
7343g8K57k99J74R2o1k58K22K1j26Q4j2l7n3J22l38N03j3m35K57K69n02J04K68
7366A61j75J34j06K56l07j08J59j22Q0J41j06j92M02k45J2pl1J56M7k58J8p7k3
7389a91O7p7N34n48O7K72k40J84j38k05K52J44m1j08K5J17l54J23K80k74j13L86
7411A62j74J86l0l28J65o8J58j91K46r9Ql68M76J39m49M78m99Rq9ml0L08J28j09
7435B5n1L12l40j48M92m60j23L09p3L2J3O3%J22l46J11K3Q6j22M6K31l74K16j18
7459g4K57j55M7l32L04Q9k10j2R4J85j0o13M66K10l92K54j05j80J58N7M9J15l29
7482a27J72k09K98j00k78J42r6K67K79l57J19L58n77n0M87j72j32J1l00O63l38
$$ y = [114, -11, -45, 31, 18, -47, -23, 157, -238, -148, -50, -121, 56, 251, -54, -91, 217, 137, -110, -116, -83, 131, -123, -190, -274, -78, 179, -120, 54, 146, 85, -173, 49, 70, -56, 28, 16, -21, -74, 48, -290, 213, 200, -235, 22, 291, -211, -107, 161, -14, 120, 14, 270, -37, -145, 14, -108, -28, 113, 7, -185, 217, -28, -16, -23, -54, 102, 149, -109, -91, -168, -191, -124, -201, 333, -215, -148, 124, -116, 68, -70, -275, -23, 121, 80, -28, -3, 114, -240, -117, 163, -111, -224, 162, -12, 174, 144, -184, -19, -87, 71, -120, 126, 27, 35, -333, 143, 282, -167, 311, -188, -179, -268, -272, -302, 6, 134, 25, -26, 286, -54, -202, 290, -170, -293, 16, -57, -25, -12, 51, 51, 173, -173, -62, -39, 47, -75, -29, 202, -172, 44, -74, 183, 28, 75, -257, 47, 136, -74, -86, 8, 193, 183, -430, 36, 246, -146, 108, 3, -177, -19, 38, 87, 202, -127, 45, -164, 134, 34, -244, -102, -198, 69, 348, -9, 110, 468, -109, -159, 328, 156, 24, 35, -265, 398, 60]
7503F0K0j94N4M51l89j87M42j84k96K91O7J4j74J9K7k43J71J1n8P1j65J9K06k48
7527b15R1K29j81K30o4j23J43k49K21r3l30K45R4j01J39Q2l05M19k05J35l31J70
7549AJ85P7m33M1k2N81m18m20M38L1j48L10j38j59K97k61P8j90m1j9Q0L96j21
7572A45l82M14j42n6q6P5J33j20r7J97k27J83k6Kj86L22j10N8q5mk12J18O4ON6
7597D0r0j3r3M3j41L77N6j51q4J28j21J97k94L17j89k44J92J41p4j17N7Q3k00
7620a80p7M54m24N02k11L17n50l0K24p6K30j71J29n47K92K27m6j60O1J44J67m92
7642b17L04Q1Jp5R5l52K58j59O0p0l6L59l89J15J51j47k28K56J65k04R1q2K23
7665B00k42m4J76j06L3j33O2M98m66K11r1k56L19j48k14K75r5q4L67l82M7j9m1
$$ y = [60, 80, -114, -60, 391, 2, -185, 257, 73, -223, 68, 135, 149, -25, -6, 21, -222, -51, -40, -98, -27, -192, -173, 33, -215, -124, 105, -76, 154, 90, -33, 110, -139, 82, -11, -341, -96, -2, -103, 36, 118, -187, 232, 27, 162, -169, 1, 186, 263, -170, -129, -151, 430, 12, -408, 30, 61, -87, 223, 85, -74, 223, -38, 40, -150, -191, -210, -130, 266, 145, -237, 177, 35, -21, -107, -32, 101, -19, -116, 81, -146, 37, 11, 13, -173, 149, 39, 97, 12, 8, -204, -86, -22, -16, 40, -50, -63, -156, -113, -254, 123, 179, 28, -56, 72, -49, 148, -146, 171, -18, -262, -70, 71, -3, -120, -63, 20, -180, -257, 197, -227, 275, 64, 381, -169, -199, 25, -51, 179, 8, 137, -410, -118, 109, 63, -97, -36, 108, 275, -217, 87, 168, 169, 94, 189, -163, 95, -64, -4, -74, -110, 249, -140, -25, 126, -21, -249, 7, 172, -32, 59, -23, 200, -42, -86, 90, -16, 17, -116, -54, 444, -22, 189, 98, -158, 161, 13, -201, 74, -21, -105, 262, -120, -73, -92, -133]
7688a33K74j61k14L12j09o6K42m25L04m90K46K07l8K82j41j31J23j37R7j02N6
7709dR2J10k82K23q0pj31N8J12j79j26L10k58j12L28j18J08j39Q0J77j61j31o
7732a36P3K24k2j92L45J8l20j28K25j02Q6l15K50O2r6J08q4j15L59l77K28J22
7754B13j83J62j31j41q5r4J50J06LJ14m17K98M51p13J13K46j9l01P6J04k8k04
7776b80L29o6l06K11J21o4J31l3P5N0m2m5l23J05K75%l71K27k15Q0K3j10L66k38
7800a00J12K1Oj35j00K43k1O2j14N5j77K23J83l74M30k96j32J92k3o7m9R5K31
7823B65k54n9K15l23J92l3j69J95Mj67K32r0L03l72n9n2j9K54j12l76M83j63J50
7846D5J61k04J62k33J20LJ3m64K48K54J3l1j01O8l11K91K95k71k29K44k03K81
$$ y = [-133, 141, -20, -234, 78, -31, -97, 145, -280, 24, -466, -220, -13, -51, 231, 90, -41, 82, -55, 42, -60, -4, 88, 198, -84, 139, 59, 52, -79, -21, 91, -88, -214, 96, -162, -274, 54, -64, 44, -95, -15, 162, 1, -130, -136, -63, 161, 139, -53, 292, 310, -10, -138, 87, -15, 71, -244, 6, 68, -28, 80, -4, -119, 240, -137, 91, 213, 30, 192, 61, -80, -165, -259, -109, -3, 0, 114, -303, -5, 446, -267, -154, 92, 73, -228, -152, -48, -76, -280, 49, -17, -323, -112, 9, -55, 76, 43, 118, 168, 126, 81, -242, -137, 138, 138, -233, -6, -221, -141, -118, -228, 138, -100, 12, 33, 39, -96, -196, 47, 26, 88, -26, 29, -148, 75, 258, -116, 314, 18, -114, 78, 55, -12, -61, 34, 265, 11, -48, 167, -156, 36, 3, -166, 29, 33, -134, 98, 8, 311, -61, -120, -172, -191, 63, -49, -425, 58, -105, 45, 206, 2, 164, -69, 51, 54, 67, -397, -149, 105, 118, 87, -14, 54, -257, 34, 329, 58, -171, 73, -130, 151]
7868A51k43J50l29L57m2m17K71J81j31n10N42R4l05L58J7k7J14j08j55N4M3j20
7890e5k51O89l60k69L75k35j20L00L1k9J55l64M7j11J94r8p9L13j28P9J90r3j59
7913B2PR8K00n10QK17J96l79K38k13J40j85r5J23J39R1M1l29J3K84PJ30k24O4
7937H3k29j11M83K3m17J07J58r9M6J14k94J25O7q7j27L30k26m7L2L71k58J28O
7960A78j74R8q3p5J38j12p5P7N1J33m19J91Q6j22J3j57J97J11k9j72J91j83K08
7983G1p7j6R5j61q0L86l95L36K27l50K75j96k48OL74j83rj02j26J16R6J65k90
8006h6P3j92J07K29l73K81j72K17j20N3j4K31Qk73J81j61N1K84m48J53J9k86J69
8029f9p8J84j24OqK76k08k67J70K35k18m1J99J31m45K37n3J14Rk2P4l5m3J40J9
$$ y = [151, -92, 58, -271, 86, 44, -373, -102, 79, -52, -562, -20, 74, -231, 127, 144, 117, 231, 123, -32, 22, 65, -55, -306, 383, 23, -246, 129, -106, -226, 74, 105, 76, 231, -133, -86, -197, -3, -101, -180, 133, 5, 84, 274, 181, 22, 29, 127, 327, -183, -175, 42, 238, -141, 97, -116, 24, -161, -256, -133, 6, 97, 138, -191, -178, 106, 113, 243, 19, 83, -146, -257, 226, 249, -168, -61, 97, -2, 44, 158, -136, -11, 56, -31, -158, 172, -54, -101, -69, 302, 44, 172, 178, 4, 102, 19, -56, 82, -30, -105, -28, 23, 156, -263, -72, 14, -108, -95, -252, -55, 56, 27, -145, 46, -137, 71, -6, -22, 73, -88, -168, 218, -177, 159, 386, 36, 311, 115, -133, -127, 247, 64, 55, -47, -173, -57, 39, 204, -86, -13, -205, -98, 131, -242, 39, -133, 84, -36, 17, 3, 234, 242, -31, 150, -11, 40, 324, -124, 29, 48, -238, -69, -147, 37, -87, -81, -89, 187, -21, -288, -118, 117, -101, -142, 57, 188, -257, -20, -73, 41, 50, 28, 102, 67, 24, 164, 183]
8054A83l98M20k08K69j27J6o0k03J44L6l63O8J38k1L4K10J25q7k58J10K58j84
8076A02m8n4N8k17j28J72j19K23O7p5n7L74n41K35N9K07j18k78K15k79J21P5L0
8099B4J7J38n83M96N3k26J42Qj17L22m36J73K33j80r8J08j17o2K29r9J34l62J75
8122b8M2r5Q5ML7K32m91k6K12J05j11Pj6rm7n4L83l90M17k37p1LL69l53M4q4j0
8149h2r7L05o9J8j08n9J3K45l6l49J67J94j85O6p3K13j90m0J56NJ51k01l9O0J08
8174A73l87L16j9j73Q0%l1J11k04J31R0j66J84m03L04L6j19
$$ y = [183, -215, 205, -3, 266, 139, 155, 95, -108, 36, 72, -291, -223, -85, -106, -72, 138, 263, 176, -82, 28, 286, 102, 54, 0, 58, -159, -287, -115, -234, -11, 56, -19, -76, 298, -243, -8, 51, 258, 140, -138, 77, -202, -81, -6, 24, 41, 179, -404, 92, 145, -81, 61, 69, -48, 274, -162, 11, 244, 64, -34, 74, -43, -105, 124, 25, 159, -203, -28, 14, -81, 4, 8, 45, 277, -214, -240, -28, 77, -34, -27, -43, -52, -99, -153, 230, -160, 257, 20, -51, -48, 321, -32, 12, -72, -82, -179, 126, 57, 75, -33, -92, -79, 166, 130, -219, -52, 142, -43, 23, -50, 163, -27, -67, 89, 94, 245, 44, 5, 65, 173, -214, 102, 83, -90, -10, -10, -41, 70, -134, -3, 87, -79, 105, -298, 6, 42, -77]
8191g7
$$ Imaginary data points
##PAGE= N=2
##DATA TABLE= (X++(I..I)), XYDATA
0@%%%%%%%%%%%%kJ0j6J6j6J9k7L2m0M8n6P0p9R0j06J24j47J69j93K23k53K87l26
35a73L67m13M63n18N81o47P21q02Q89r84J087j202J327j461J611j777J956k154
53a129K373k619K894l206L561l966M438m996N668o493P539q911J0799j3593J8202
68A0561k7631Q4147j62745n6863J67012m0089J4775L6319N5220j0598q9912p2542
80i2346L7844R8041l4566j11779J84110R2448k23776m5246Q6740l4022Q470M2191
92H109P5310L7649j15833j35305J5894J60017K7691j37219R9479J02393j79120
103d0935n7956Q4165J1627J1062k0950K0411Q7096l0228j33331n7228J21244O4119
115E9096j04814Q5565J13778j71249j02663N8060N7135O7616l7778m9046P2098
$$ y = [0, 0, 0, 0, 0, 0, 0, 0, 0, 0, 0, 0, 0, -2, 8, -8, 8, -8, 11, -16, 16, -24, 24, -32, 38, -41, 49, -57, 67, -80, 89, -104, 119, -134, 153, -173, 194, -219, 244, -274, 307, -340, 381, -421, 468, -516, 571, -631, 696, -765, 846, -931, 1025, -1129, 1244, -1375, 1519, -1687, 1874, -2092, 2346, -2650, 3018, -3475, 4064, -4847, 5952, -7641, 10561, -17070, 67077, -95668, -152531, 14481, -25608, -10833, 25486, 80706, 70108, -19804, -92346, -54502, 43539, 8973, -102806, 81304, 173752, -50024, -95270, -8530, -42552, -34082, 8109, 83419, 121068, 5235, -130070, -114176, 45841, 73532, -63687, 35792, 138185, -40935, -98891, -14726, -3099, 7963, -12987, 7424, 94520, 64292, -69039, -126267, -5023, 59096, -45718, 39847, 153625, -17624, -120287, -62227, -5092, 62524, 24746, -24300, 47798]
126D7798J2717j09610o6410J18128Q0503j26942K4043J34642q0231r1832j7171
137g4365J3415J03543R513n2624M7675M647j07811p3077J17563J22362j08809
148B032m2169R8879k9427n6684l0665k616J04308R111p7408M2238N1631p1005
160a775j15194M8529J45162l5031m8552N1965l3833m2339k6006m813J14730K4474
172G7317j02089M867O6303k1772j06057O616J31905r320n9627L4473l181j4484
184D951m8564n3209J15319Q0743q2555m0295L3302N516p1802j3479J16025J5058
196F1010o4240K375k51J8092l0989p6161Q6545R1963o3127m9918K4710K8767o1084
209c2308n5512R7462O3983l9420l4270l2201L1596P439p4067N1965R0422m0271
$$ y = [47798, 60515, -49095, -115505, 2623, 83126, -43816, -19773, 114869, 34638, -57194, -74365, -60950, 42593, 52106, -518, 47157, 51804, -56007, -129084, -11521, 110841, 2032, -40137, 58742, 29315, -27369, -58034, -60650, 43658, 52769, -24639, 17599, 69230, -1775, -116969, -68440, 76722, 41691, -6861, 45104, 11271, -31068, -57074, -61887, 52843, 77317, -24772, -19905, 46398, 24626, -81431, -74815, 57090, 47770, -11857, 22616, 19435, 4951, -43613, -96822, 18497, 99240, 16685, -23610, 9692, 15208, -56594, -70073, 45952, 61010, -3230, -855, -1106, 16986, -14003, -90164, -3619, 88344, 25217, -24701, 9, 28776, -32308, -87820, 9642, 73625, 34205, -65, -32266, -670, 6769, -67298, -15333, 75089, 34818]
221C4818n6700K809M1528k7367o8622O1147P2296j7417l6621m2470L4569K1381
233A9351q3091K6943J04454p096o6934l7795M1515J7711o0373K2074O4040N573
245D6372k9720n7553K4656M3973o9858j21Q7814J3963m9191n3250K7249L6889
257B1223n4786m22O4076K6447k5874p9358R647P0641m4857k6480N9083L2925k1319
270C0946o7571M79N3717k9933j6585M2066L2674m612p7438j2224P1046k4128l2835
283c4398M1823L9853l571p6458k1095O7783m574l0425J6242L6574K1433p2172
295a8985m1270O6055O047k8482J4250L0127K0532o2451m3116N7488J3875k4655
307a0585L167K8521L2981o1769n7048N8905K6913k3591q028K0299M2496m6782
$$ y = [34818, -21882, -19073, 22455, -4912, -73534, -12387, 59909, 42492, 5871, -36599, -2030, 19351, -63740, -36797, 67657, 60561, -6373, -44168, -2653, 15058, -45315, -23241, 40799, 46372, 16652, -40901, -16245, 27728, -42130, -42251, 45563, 59526, 10335, -42915, -15666, 21223, -33563, -33985, 30091, 56538, 30664, -48694, -39047, 31594, -13263, -39743, 19340, 52265, 30946, -36625, -36146, 17571, -12362, -28947, 13119, 45793, 41181, -36257, -48481, 22565, -1563, -34398, 7425, 47278, 43707, -32751, -53846, 13937, 9363, -21062, -4820, 31754, 53187, -18985, -60255, 5800, 11847, -16635, -2385, 27742, 48274, -14177, -57293, 195, 14070, -10585, -7418, 21103, 54084, -7685, -64733, -5828, 21085, -2506, -10534, 9765, 52261, 5479]
319E479o6771M3028L5652r876j2734O823M4215l4907o6699L4643L5665m975j3013
332c470J468M5731k7507p1914K8514M2768J534j9335q716M9890j2998p4515J2742
345c5808M3529J6332j6869k3300M4045J158o8794L738L8081K0849j0785k7504
357a5328L8189O285o4623k385L7429K6490j0072l6331L6301J8824o2150j4881
369d2252L3960L6849l575m5007K5211K7115n0013j9817K2038L8118Q271m6278
381a5380J4794K9904m2699k2867J8956L9930J0371m8842J1366L3593l7790k5206
393c3870J0873M0972K3163n1810m710L9070k2533k9476n42M1079L0565m7307r911
406a4437L1713j8709j9462m917K9943L9850m1802k2494L3542p572k5509j0272
$$ y = [5479, -61292, -18264, 17388, 7512, -5222, 1601, 45816, 10909, -55790, -21147, 14518, 9543, -3470, -2002, 43729, 16222, -55692, -27178, 15590, 17124, -2211, -10927, 38963, 25965, -48550, -35808, 7721, 24053, 7184, -16116, 27929, 29087, -39707, -35969, 2112, 22961, 12176, -15328, 22861, 29146, -35477, -37862, -433, 26057, 15985, -20346, 15955, 34779, -27371, -42252, -8292, 28557, 24982, -20025, 5186, 32301, -17712, -37529, -15491, 22627, 30898, -15380, -586, 29318, -13381, -36248, -17292, 22638, 33009, -15833, -4467, 29126, -8664, -33870, -22997, 17975, 41138, -10672, -15382, 23688, 1155, -28321, -28863, 12216, 42781, -4526, -14437, 17276, -1433, -20895, -25812, 4131, 43981, 2179, -20315, 13227, 5655, -19854, -30126]
418c0126L4985M0165m2208k3116K8833m045j3587j9094J7666N4999k6858m0115
430b2501K1619P807j4119k0499K0553M7950k6068l0671J3629O31K116j9912J181
443a8284N6164j2876m7159J3376J7524o494k7491O940N2580r058l3821j851L38
456a0112J7274j6460j7680N5813O303m9794l476J6953Q566j9599o139M1125k20
469B2554k5986o056m102K4819j3261l2653N1872K5230m5164j8168J0401J6852
481F338j0323j3157L2981Q370j9770j7216j3573L7696M794m5717L1773L1810l1649
494B357j6587M824J3822o691j6641K6060J7261p606k3850l0957L8612K3833m4590
507b0153J7804L4684k7184k1886m27J9956Q660j8877K629J1749J1271r063m1396
$$ y = [-30126, 4859, 45024, 2816, -20300, 8533, 4488, -9099, -28193, -10527, 44472, 17614, -22501, -882, 6925, -7194, -27693, -7140, 40810, 14742, -15929, -2300, -1669, 447, -19465, -18284, 37880, 25004, -22155, -8779, 8745, 2251, -25240, -18300, 34280, 25222, -8599, -10450, -10112, 7162, -9298, -26978, 28835, 35138, -14656, -18132, -1179, 7387, -12212, -18351, 22774, 22554, -3432, -9488, -13590, 11229, -2032, -34685, 17187, 42417, -2747, -20915, -10514, 6338, -3985, -17142, 15839, 24209, 4439, -12777, -26350, 11346, 16140, -29577, 2196, 34006, 2357, -14230, -9406, 4416, -2275, -18916, 7144, 24405, 16799, -7051, -38008, 604, 24437, -20153, -2349, 32335, 5151, -16735, -17162, 2794, 11454, -7423, -4794, 6955, 18226, 9163, -32233]
520c2233K4717K9743m2902J2488M1618j8202k6075j3972J3489K3778n293n722
532A434k175J2433k248m3169K4416M2783m3632q749L4911j957q569j7652o541
545a8715J8754N711j156l007J4903m65n5546J3911N8173k5735j5978J9449r126
558A173j489n944o502J7976N550j2973j3154K7553K2228n6767j1998M8884j2312
571B225m264K1771j5370o929q118j2092K3535K3971j1368l3845J3021L4092l8521
584a1892j2560M3634j7261j2631J9205o643Q662l617l2935N277L5791J0403l0316
597d883j627K6034l7526j3262N0144m113j3432M148k2135J5152K0041k7095r315
610a7869K3581J0222k5251L023L6749l4148l1481L4776N071O895J2351l6911j997
$$ y = [-32233, -7516, 22227, -20675, -8187, 33431, 15229, -10846, -24818, -11329, 12449, 7156, 1434, -741, 11692, 9444, -33725, -9309, 33474, -10158, -18907, 16004, 14047, 5478, -12174, -18715, 39, 5750, 4594, 1587, 16490, 16025, -39521, -25610, 32563, 6828, -9150, 10299, 1173, -316, -6260, -12762, 5214, 10764, -2209, -15363, 12190, 34418, -22349, -34347, 14537, 2225, -2039, 19732, 4362, -2567, -10685, -22777, 758, 24729, 13361, -20484, -7463, 26629, -11892, -24452, 19182, 1921, -10710, 8495, 1852, 10514, 6897, -26038, -20761, 15030, 25433, -4883, -6510, 19524, -18002, -31264, 18880, 14767, 1335, 5483, -16652, -1500, 18541, -8554, -17869, 5712, 15934, -9317, -6294, 30455, -3693, -35174, -398, 4673, 11568, 23919, -12992, -14989]
623a4989K3422j7446m859K8191J0494l6445j1571M1150j0374k3467K0502j2124
635g516M083K5861k6447k496K1856k7239j7089L2982L0430k6212k7560K1467p022
648d902r176K7647j2304l421J9759l1893j571L8026j6055k8609J2527K7629p909
661I748j6898J6324j1557j7283K2016o437Q732K8239m0761k1784L5625K596j6157
674g597N730J5563j0390j7687J8239R01j0088J2200k1535L386M3418k4367k8120
687b0347K1840j196j3067R843K0880l509k4221K006l8L383K3821k3343j2204L6984
701B0832j7065k2556K4775K030j5922k517J3893J0417r530l222j2399l637K8126
714A3225j2118j0839L3730j8297k9826J9512J1758k234n963j905O143j636K952
$$ y = [-14989, 8433, -9013, -13872, 14319, 24813, -11632, -23203, 17947, 7573, -15894, 4608, -7516, -3433, 22428, -4019, -6515, 15341, -11898, -28987, 3995, 34425, 8213, -19347, 2120, -4902, -14078, 13569, 1265, -2156, 17603, -14290, -15861, 22165, 6110, -22499, -9972, 17657, 9748, -7150, 9174, -2383, -19666, 2350, -4087, 4645, 32884, -7877, -29661, 5964, 8560, -7597, -1867, 13696, 3306, -14381, 3858, 4759, -5329, 6871, -14664, -11278, 32140, 7773, -20347, 1493, 297, -12770, -2927, 17953, 14444, -9777, -7771, -7809, -4426, 19395, -3948, -16152, 20832, 3767, -18789, 5986, 8016, -7906, -10423, 3470, 13887, 4357, 1135, -11264, -14901, 13225, 1107, -9732, 23998, 5701, -24125, -4613, 7145, 4911, -1052, -2957, 3186, 1550, 4502]
727D502r096o963K3126j3601j4549L6659m946k8989N311M024N955L738k980K997
741E188m677r57p845l506K8901r817k5544K5581M101j7880M449k724L635M228
755C133m861O026J598j239j3245j1148L0185L121k3933J5571J516j4187M574k281
769e170O786O948j1331QM736N915q666j7567K1716Q389k0015J2077L933j0740
783b981J066q878Q434J4431q978n304m91O341j694j6865J6769J1387j8963N128
797e98M153l790L908j3688K940J6536m750m078l506N204J859j8918J1219J6975
811A3466j3561P45j385k785R557j2372j543J5842k747m730m824M388P518j7911
825a0342K601J7134o793O85m737m450J2232j0477n209J5644L61l311q710O99J2723
$$ y = [4502, -4594, -11557, 11569, -2032, -16581, 20078, 15132, -13857, -8546, -4522, 1433, 5171, 2191, 5188, 511, -446, -8291, -11797, 17104, 7287, -18257, 7324, 11425, -6455, -2006, -4730, -1095, 3133, -1728, 4298, 5896, 4657, -8588, -19736, 10449, 13570, -10363, 5208, 6724, -7463, -2889, -5170, 1616, 8564, -2767, -2759, 1977, 7892, -774, -18341, 3375, 11764, -8251, 3826, 7759, -2981, -1915, -10793, -2359, 12072, 3094, -2210, -2701, 3640, 1946, -14919, 1850, 13237, -5726, -598, 3555, -235, 3673, -10015, -7075, 9461, 4711, 633, -2873, 2331, 4190, -14728, -3509, 13466, -95, 650, -735, -3520, 6037, -6335, -7878, 7964, 5217, 487, -4337, 51, 7569, -10342, -7741, 9393, 2600, 3285, -1452, -5902, 6330, -4147, -9356, 6288, 6649, 3338, -5372, -4673, 8050]
840H050j2822l424J4112k681J617o607o053J4783q024q622J2753K485Q96r637
854c174n244J5248p870o599J0877P9L735p528j0038J5508l007r696Q411K632M454
869G788q185j0346J4859k131q063P241R3O614n971j3831J4111J661q366M475K46
884A95P739m672j4790J2439K755p371L966j552Q775k276j6873J0677M840o057
898b205K400k732R255j51j7281Q043O413m598J590m580R678K144j7817N671P215
913C045k769J310o275R138M659j7770L578P435j095J364q267Q746P321j7783J398
928e965P446M0K330r377O887Q739j5857n31O166J783L949j1349N100J1414j5288
943d513k309N807K383M937j1227K749J1885j1954l725K915M050P361j3183Q61
$$ y = [8050, -4772, -8196, 5916, 3235, 4852, -1755, -7808, 6975, -1049, -9671, 3082, 5567, 6463, -3174, -8418, 6830, -1040, -7639, 3238, 3317, 7052, -476, -10514, 4994, 1987, -7709, 702, 3334, 7788, -397, -10743, 4116, 1985, -6078, 1163, 1256, 7870, 1899, -11932, 2179, 3840, -4526, -51, 195, 7934, 3262, -11528, 911, 3666, -3705, 261, -1291, 7484, 5208, -11665, -988, 3852, -2205, 195, -2537, 6718, 6567, -10714, -2671, 3742, -856, 734, -3846, 5832, 7976, -9841, -4170, 3045, 276, 1586, -4689, 4449, 9108, -8662, -5084, 2351, 1256, 2620, -5647, 3099, 10420, -7363, -5965, 1481, 1521, 3851, -5526, 1361, 10100, -5757, -6288, -122, 1661, 5610, -5739, -639, 10775, -4513, -6822, -1015, 1368, 6305, -4922, -2173, 9712, -2242, -5967, -3052, 998, 8359, -4824, -3963]
957c963J3884j1199n094L611L098Q392j1178k947J2602o659m661j087M411J1618
971A0828j3398m684J5231o701n586N50R26J1588p678p470J0509j666m446m421
985f418K642J5912j0907r944J3774l429l641r43k237J3434l876j1528P860L034
999C733k060q263j174J8804o827j2164J0862k224j443q57n784J4369J370j4371
1013f029K172N439L459q780n697J8541l347j3457R350r85N40m20j1384J3164Q910
1028A1476j3205l668L923O624o732q791J8251J53j4052M897j731M872M251j5496
1042i228O466J3022r353o080L156Q477o075j2913J6162N567j0009J394p526N015
1056a925J1111j5710K193J5115p973j0228J482J3304j415j5924R014N866m648
$$ y = [-3963, 9921, -1278, -6372, -2761, 337, 8729, -2449, -5396, 7206, 547, -4114, -5201, -790, 10828, -2570, -7254, 7977, 1276, -4310, -3760, -2834, 8754, 1076, -6394, 4115, 2449, -1997, -6418, -3776, 12136, 1229, -8715, 5059, 1630, -2011, -2954, -5191, 8243, 4367, -7161, 699, 3733, 1673, -6590, -7764, 11040, 4213, -7951, 2911, 687, -756, -1613, -7397, 6972, 8342, -6029, -3857, 1582, 5041, -3739, -9436, 9105, 5758, -7699, 1651, 666, 1206, 786, -10598, 2566, 11476, -1729, -5397, -1474, 5150, -1582, -10373, 7878, 8031, -6021, -1124, -2855, 2017, 6268, -9228, -2762, 10260, 907, -5173, -2017, 6460, 385, -12528, 3634, 9201, -808, 586, -6940, -1925, 9186, -6524, -4331, 10784, 2811, -7417, -5935, 7369, 5954, -9970, -956, 4910, 262]
1069B62M695j0612J433J3732j6462j286J8959k149j3198o050J2341N542j2001
1082d794M958L003m750N737j1330K227J9551j6585j1708J7006O039p971q420O287
1096g50N160j0159N109M737j875N211j7169l428K7177p549j5910R585M895n136
1110a02o247O829O815r974j005P77L331J4185j7216j4214K3841j396j3601R877
1124A900N787n843j0642K458J2019j341j184q601k590J9969j0162j5678K2630
1137H722j110j8757O667J0573K691j0041p391N194M291P148p827q203J8475j0002
1151D30j9037K4823Q127j8361k314M120O302j91n902k64N32O501o749p725K4476
1166A4768n651k9121J5862J3898q097k49k599K68J430l885J029M995P928j3047
$$ y = [262, 4957, -5655, -4222, 9510, -6952, -8238, 10721, 8572, -4626, -10676, 1665, 7207, -4794, 164, 3167, -1583, 4154, -7176, -4949, 14602, -1983, -13691, 3315, 9354, 1383, -7037, -750, 4410, -5749, -640, 4097, 2222, 7433, -9736, -13164, 14013, 6464, -9446, 139, 5034, -102, -6349, 480, 7295, -2679, -3684, -2907, 424, 14609, -2607, -16821, 7020, 5624, -7977, 1900, 7687, 1844, -8798, -6340, 5679, 4338, 3154, -5447, -8037, 11932, 1770, -13908, 8722, 7612, -11145, -4478, 6095, 8786, -1255, -8646, -3452, 839, 7987, 160, -8043, 10432, 430, -18607, 6216, 14343, -4018, -6332, -2212, 4090, 3899, -2003, -2267, -1735, 4766, -1983, -9708, 14768, 9117, -20004, -4142, 9756, 1659, 1410, -1189, -921, 509, -3376, -2347, 2648, 10576, -2471]
1180b471j5996K6260P271k5836O836Q587p368K967K48J941K612q481o754O793
1194c391J8608p476k4896J7482J0286k0461P691J0144p684k66o027K060J2738
1207H808k549j3734l335J8984J165k1035J4078J0260k3126K307J1098Q88N407
1220I216j2251q691J3384O628r502o872J5000J477k3565J2249J7864j6044l740
1233d847J098k1J3771o024j2593Q675N893r709o895J8478P676k6091M88J6599
1247F498n974J585k653n853J3013l789j2773J1248R820j1114j5024J3938J6764
1260A5686j7248m600R100o200M278n54o030J5473l614j9782P461J6564l151j7110
1274i727L990J5856j1053m317Q427m178M391m948j0236J9413N275k0764j062J2474
$$ y = [-2471, -18467, 7793, 15064, -10772, -3936, 4651, -2717, 250, 498, 2439, 5051, -3430, -10184, -3391, 15217, 7741, -17155, 327, 10613, -9848, -2157, 7987, 303, 37, -5990, -3930, 8808, 6259, -7475, -10810, 8174, 9339, -11696, 2382, 12642, -10484, -8177, 2921, 3809, 9216, -3035, -11726, 1658, 8286, -1216, -8088, 6912, 8389, -15176, -2927, 14937, -1107, -4847, -3749, -3770, 10001, 3977, -8616, 59, 5952, -3757, -10652, 7826, 15502, -10589, -10101, 6498, 524, 2109, -544, -6397, 6616, 2827, -9946, 1302, 11122, 8, -15016, -1078, 15686, -1562, -6162, 2938, -3262, 1016, 462, -5568, 9905, 6291, -13491, -6030, 10534, 7383, -9727, -5737, 10119, -934, -5251, 3176, -1002, 3389, -1559, -11795, 7618, 12893, -7871, -8933, 3541]
1288C541L318j2183N87J4791q548q168M641N14J0466n409j7774J5312J0858j4827
1302b881m465R248N468j1281m845J5340K41q520k446l373J4402R14j8714R753
1316a159J1970j2778o350P227J0615p744j1767J0053N322k775m012p439J3278
1329D441M677j9870P276J4715q533j0141N69J2839P37j2652K944N843M49l441
1343a47r259J2554Q510k0108R05J4886j721q058n945J0165O290j1533o21N894
1357A812L245k982j3457J0260J4304j6003n149J0328K708l554r274O527J0320
1370I085r897m973M603O916Q9j5663M199J7163j0303q360O387M953K52j1788J956
1385e381J4086n315q162J73P641N370j4961j683J7211m752r416J766N848N488
$$ y = [3541, 6859, -5324, -4737, 10054, 1506, -6662, -2021, -1507, 8959, 3550, -14224, 1088, 11946, -2881, -7346, 1902, 7370, -3911, -8756, 6584, 6825, -1695, -4141, -7514, 6888, 7802, -10912, -1159, 10811, -1967, -8317, -1090, 9525, 1781, -9986, 67, 5389, 2614, -1398, -8837, 4441, 9118, -10752, -3476, 11239, 2706, -7435, -6866, 5973, 6710, -5942, -2998, 2845, 3294, -147, -9406, 3148, 11658, -8450, -7545, 7341, 5620, -2438, -8383, 1782, 8072, -3461, -4082, 1812, 5057, 2075, -11382, -1122, 13182, -2821, -7970, 2358, 5066, 1512, -7762, -1235, 9085, -812, -5785, -1182, 5734, 5823, -9840, -5641, 11522, 1219, -7141, -754, 4199, 4451, -7337, -5381, 8705, 3390, -4772, -4599, 3042, 8412, -6549, -8232, 8979, 4227, -5189, -3423, 2425, 7913]
1399G913j2634l621J4307k71p890l722O203R320j3216o778J6292K21q029l582
1413e487M201J0257r604r235J2228M178n827o541K697J2994r270j1393J2505N075
1427F778n272o743M23J3434n981j2177Q784O947k558q478k142J5161l737j3741
1441i302P491P198j228p619m712J4423k10j3362L765P368K435q493o712J4182
1455E224K093j3862K175P244L841p393r319J3414M677j2884m51O557N894o208
1469A002j1177J1599P249j1726k492N167P301l956j3074R925Q660r759m376L637
1483b020Q864k247j4368P529J0431p831n208J301R258P64j5340M621J1882n474
1497B162o181q32R902K624j5453K685J1606l646n659k838Q779N681j4931o78J2035
$$ y = [7913, -4721, -8342, 5965, 5694, -2196, -5918, 285, 9605, -3611, -10389, 5903, 6124, -1905, -5487, -1286, 8971, -633, -9868, 2360, 6538, 711, -5830, -3133, 9861, 591, -10802, 1703, 6778, 1506, -5237, -4814, 8620, 2639, -9538, -754, 6193, 3635, -4843, -6985, 8176, 4439, -9302, -1811, 5387, 4159, -3460, -8172, 6251, 6041, -7321, -3556, 3812, 6247, -2246, -8958, 5224, 7317, -6545, -4370, 2874, 6715, -678, -9997, 3417, 8094, -4790, -5241, 1316, 7210, 1002, -10175, 1424, 8673, -3053, -5545, -378, 6923, 2967, -10107, -182, 8478, -1281, -5657, -2020, 6844, 4597, -9771, -2242, 8189, 358, -4850, -3549, 5709, 6473, -8867, -4246, 7636, 2162, -4019, -4851, 5051, 7675, -7778, -5093, 6513, 2867, -2792, -5630, 3149, 8830, -6101, -6779, 5256]
1512E256p32o251m926Q571P258j4088k162J0862O26m408o839O518J0169j2423
1526b569n672J0283L478m600p990N897J1136j1413o008P816M102j070r666K179
1540d097J3806q624r465P436O139j361j0127J785J3045o484q053L773N107L454
1554F334j0523k824J5057l584j1711L358P502K684j0169k799J2341j731p653N3
1568c665L970P661r694q101J5445J751j1736j052O203N950p261o367R717K023
1582D844o007l775K225J1783o885j3286J2495O604r406l831L790P377m496q336
1596f904O844N425k850p413k151J4784j201j5722Q009P717o757m232J447Q488
1610E484j069j0223J863O872K903p171p650J3760K749j5394M847R345l926n304
$$ y = [5256, 4524, -1727, -6653, 1918, 9176, -4912, -7074, 3788, 4414, 6, -6833, -315, 9854, -2569, -8241, 2042, 5520, 920, -7070, -1173, 9963, -1450, -7458, 358, 4460, 3390, -6276, -4097, 9709, 1085, -8380, -944, 5195, 3834, -6293, -4508, 8537, 2053, -6000, -2227, 2880, 6334, -4189, -7013, 8044, 4460, -7251, -3893, 3609, 6293, -3876, -6675, 5666, 3935, -3718, -3665, 305, 7966, -1728, -9829, 5616, 7367, -4369, -5421, 782, 6732, -529, -6896, 2821, 4844, -1163, -4938, -2713, 9070, 2185, -11101, 1394, 7998, -1408, -5239, -1449, 5928, 1432, -6904, -60, 5365, 2515, -4898, -7049, 7735, 6534, -9188, -1179, 6538, -219, -4451, -3004, 5484, 4415, -5808, -3945, 2927, 5830, -1341, -8991, 4769, 7518, -7876, -3029, 6316, 2390, -2914]
1624b914k839Q046M971q859l442M085O598m818j0070J2523O888j6359J02R560
1638C472P54l273o424L179P935m467n039J650Q393l432j3985J0850J1936j3378
1652a829m041N491J990J777o129q5P828k360p741J07J1605J043j7093M103J3628
1667H294p781l266K733L07L162o468k307J0227J829r641o367J1343P516j4576
1681d995j26J1220o062l151K079J265N931o428q912Q901Q730o125j0264O882R016
$$ y = [-2914, -5753, 2293, 7264, -1595, -5037, -952, 5646, 828, -9242, 3281, 10169, -6190, -6088, 3472, 4226, 953, -5471, -2292, 5643, 1176, -3863, -2213, 6180, 2748, -11237, -387, 11549, -1829, -5870, -379, 1611, 3388, -2741, -2826, 5002, 2642, -5099, -4992, 6613, 7656, -9437, -5334, 8294, 513, -2753, -20, 287, 3449, -3019, -5326, 4901, 6730, -2911, -9278, 2065, 9581, -4995, -5121, 6099, 37, -3114, -1035, 230, 6161, -267, -9179, -278, 8452, 2327, -7937, -1055, 7961]
$$ [...]
8191A77
##END NTUPLES=NMR FID
##END=
