##TITLE=1H_Pr SucAmOH3
 DMSO, 8 sc, 
 4.06.2021
##JCAMPDX= 6.0         $$ Bruker NMR JCAMP-DX V2.0
##DATA TYPE= NMR FID
##DATA CLASS= NTUPLES
##ORIGIN= UXNMR, Bruker Analytische Messtechnik GmbH
##OWNER= root
$$ XWIN-NMR		Version 3.5
$$ Fri Jun  4 13:46:35 2021 Russian Standard Time (UT+4h)  she@DPX200
##.OBSERVE FREQUENCY= 200.131506
##.OBSERVE NUCLEUS= ^1H
##.DELAY= (6, 6)
##.ACQUISITION MODE= SIMULTANEOUS
##.ACQUISITION SCHEME= undefined
##.AVERAGES= 8
##.DIGITISER RES= 18
##SPECTROMETER/DATA SYSTEM= spect
##.PULSE SEQUENCE= zg30
##.SOLVENT NAME= DMSO
##.SHIFT REFERENCE= (INTERNAL, DMSO, 0, 15.7039)
##AUDIT TRAIL= $$ (NUMBER, WHEN, WHO, WHERE, WHAT)
$$ ##TITLE= Audit trail, XWIN-NMR		Version 3.5
$$ ##JCAMPDX= 5.01
$$ ##ORIGIN= Bruker BioSpin GmbH
$$ ##OWNER= she
$$ F:/spectra/data/she/nmr/H-F/1/audita.txt
$$ ##AUDIT TRAIL=  $$ (NUMBER, WHEN, WHO, WHERE, WHAT)
(   1,<2021-06-04 13:45:35.15 +0400>,<she>,<DPX200>,
      <created by zg, POWCHK disabled, PULCHK disabled
       configuration hash MD5:
       00 E9 B6 7A A2 85 ED C7 34 08 36 98 17 FE 4E 26
       data hash MD5: 16K
       62 B7 E5 69 37 89 CB 95 31 0D 9F A0 CB AC 05 BA>)
$$ ##END=
$$ 
$$ hash MD5
$$ 24 8B 6B 85 FA 92 D1 20 2B 4F 1B 6A DB 07 14 5F
##$RELAX= 
##$RELAX= 
##$RELAX= 
##$RELAX= 
##$RELAX= 
##$RELAX= 
$$ Bruker specific parameters
$$ --------------------------
##$DU= <F:/spectra>
##$EXPNO= 1
##$NAME= <H-F>
##$PROCNO= 1
##$TYPE= <nmr>
##$USER= <she>
##$AMP= (0..31)
100 100 100 100 100 100 100 100 100 100 100 100 100 100 100 100 100 100 
100 100 100 100 100 100 100 100 100 100 100 100 100 100 
##$AQSEQ= 0
##$AQ_mod= 1
##$AUNM= <au_zg>
##$AUTOPOS= <>
##$BF1= 200.13
##$BF2= 200.13
##$BF3= 200.13
##$BF4= 200.13
##$BF5= 200.13
##$BF6= 200.13
##$BF7= 200.13
##$BF8= 200.13
##$BYTORDA= 1
##$CFDGTYP= 0
##$CFRGTYP= 5
##$CHEMSTR= <none>
##$CNST= (0..31)
1 1 145 1 1 1 1 1 1 1 1 1 1 1 1 1 1 1 1 1 1 1 1 1 1 1 1 1 1 1 1 1 
##$CPDPRG= <>
##$CPDPRG1= <>
##$CPDPRG2= <>
##$CPDPRG3= <>
##$CPDPRG4= <mlev>
##$CPDPRG5= <mlev>
##$CPDPRG6= <mlev>
##$CPDPRG7= <mlev>
##$CPDPRG8= <mlev>
##$CPDPRGB= <>
##$CPDPRGT= <>
##$D= (0..31)
0 1.2 0 0 0 0 0 0 0 0.06 0 0.03 0 0 0 0 0.0002 0 0 0 0 0 0 0 0 0 0 0 0 
0 0 0 
##$DATE= 1622799934
##$DBL= (0..7)
120 120 120 120 120 120 120 120 
##$DBP= (0..7)
150 150 150 150 150 150 150 150 
##$DBP07= 0
##$DBPNAM0= <>
##$DBPNAM1= <>
##$DBPNAM2= <>
##$DBPNAM3= <>
##$DBPNAM4= <>
##$DBPNAM5= <>
##$DBPNAM6= <>
##$DBPNAM7= <>
##$DBPOAL= (0..7)
0.5 0.5 0.5 0.5 0.5 0.5 0.5 0.5 
##$DBPOFFS= (0..7)
0 0 0 0 0 0 0 0 
##$DE= 6
##$DECBNUC= <off>
##$DECIM= 32
##$DECNUC= <off>
##$DECSTAT= 4
##$DIGMOD= 1
##$DIGTYP= 9
##$DL= (0..7)
0 120 120 120 120 120 120 120 
##$DP= (0..7)
150 150 150 150 150 150 150 150 
##$DP07= 0
##$DPNAME0= <>
##$DPNAME1= <>
##$DPNAME2= <>
##$DPNAME3= <>
##$DPNAME4= <>
##$DPNAME5= <>
##$DPNAME6= <>
##$DPNAME7= <>
##$DPOAL= (0..7)
0.5 0.5 0.5 0.5 0.5 0.5 0.5 0.5 
##$DPOFFS= (0..7)
0 0 0 0 0 0 0 0 
##$DQDMODE= 0
##$DR= 18
##$DS= 0
##$DSLIST= <SSSSSSSSSSSSSSS>
$$ [...]
##$SUBNAM2= <"">
##$SUBNAM3= <"">
##$SUBNAM4= <"">
##$SUBNAM5= <"">
##$SUBNAM6= <"">
##$SUBNAM7= <"">
##$SUBNAM8= <"">
##$SUBNAM9= <"">
##$SW= 20.0188882624521
##$SWIBOX= (0..15)
0 0 2 0 0 0 0 0 0 0 0 0 0 0 0 0 
##$SW_h= 4006.41025641026
##$TD= 16384
##$TD0= 1
##$TE= 0
##$TE2= 300
##$TE3= 300
##$TEG= 300
##$TL= (0..7)
0 120 120 120 120 120 120 120 
##$TP= (0..7)
150 150 150 150 150 150 150 150 
##$TP07= 0
##$TPNAME0= <>
##$TPNAME1= <>
##$TPNAME2= <>
##$TPNAME3= <>
##$TPNAME4= <>
##$TPNAME5= <>
##$TPNAME6= <>
##$TPNAME7= <>
##$TPOAL= (0..7)
0.5 0.5 0.5 0.5 0.5 0.5 0.5 0.5 
##$TPOFFS= (0..7)
0 0 0 0 0 0 0 0 
##$TUNHIN= 0
##$TUNHOUT= 0
##$TUNXOUT= 0
##$USERA1= <user>
##$USERA2= <user>
##$USERA3= <user>
##$USERA4= <user>
##$USERA5= <user>
##$V9= 5
##$VALIST= <valist>
##$VCLIST= <CCCCCCCCCCCCCCC>
##$VD= 0
##$VDLIST= <DDDDDDDDDDDDDDD>
##$VPLIST= <PPPPPPPPPPPPPPP>
##$VTLIST= <TTTTTTTTTTTTTTT>
##$WBST= 1024
##$WBSW= 4
##$XGAIN= (0..3)
0 0 0 0 
##$XL= 0
##$YL= 0
##$YMAX_a= 246979
##$YMIN_a= -143616
##$ZGOPTNS= <>
##$ZL1= 120
##$ZL2= 120
##$ZL3= 120
##$ZL4= 120
##$ABSF1= 10
##$ABSF2= 0
##$ABSG= 5
##$ABSL= 3
##$ALPHA= 0
##$AQORDER= 0
##$ASSFAC= 0
##$ASSFACI= 0
##$ASSFACX= 0
##$ASSWID= 0
##$AUNMP= <proc_1d>
##$AZFE= 0.1
##$AZFW= 0.1
##$BCFW= 1
##$BC_mod= 2
##$BYTORDP= 1
##$COROFFS= 0
##$CY= 11.3945322036743
##$DATMOD= 1
##$DC= 2
##$DFILT= <>
##$DTYPP= 0
##$F1P= 15.9154993809931
##$F2P= -4.1035820241983
##$FCOR= 0.5
##$FTSIZE= 0
##$FT_mod= 4
##$GAMMA= 1
##$GB= 0.15
##$INTBC= 1
##$INTSCL= 1
##$ISEN= 128
##$LB= 0.24
##$LEV0= 0
##$LPBIN= 0
##$MAXI= 10000
##$MC2= 0
##$MEAN= 0
##$ME_mod= 0
##$MI= 1.114404
##$NCOEF= 0
##$NC_proc= 0
##$NLEV= 6
##$NOISF1= 3.799351
##$NOISF2= 2.8
##$NSP= 1
##$NTH_PI= 0
##$NZP= 0
##$OFFSET= 15.70392
##$PC= 1
##$PHC0= -11106.56
##$PHC1= -10.39899
##$PH_mod= 1
##$PKNL= yes
##$PPARMOD= 0
##$PSCAL= 0
##$PSIGN= 0
##$REVERSE= no
##$SF= 200.130013532006
##$SI= 16384
##$SIGF1= 3
##$SIGF2= 2
##$SINO= 400
##$SIOLD= 16384
##$SREGLST= <1H.CDCl3>
##$SSB= 0
##$STSI= 0
##$STSR= 0
##$SW_p= 3612.71676300578
##$SYMM= 0
##$S_DEV= 0
##$TDeff= 0
##$TDoff= 0
##$TI= <>
##$TILT= no
##$TM1= 0
##$TM2= 0
##$TOPLEV= 0
##$USERP1= <user>
##$USERP2= <user>
##$USERP3= <user>
##$USERP4= <user>
##$USERP5= <user>
##$WDW= 1
##$XDIM= 8192
##$YMAX_p= 0
##$YMIN_p= 0
$$ End of Bruker specific parameters
$$ ---------------------------------
##NTUPLES= NMR FID
##VAR_NAME=  TIME,          FID/REAL,        FID/IMAG
##SYMBOL=    X,             R,               I
##VAR_TYPE=  INDEPENDENT,   DEPENDENT,       DEPENDENT
##VAR_FORM=  AFFN,          ASDF,            ASDF
##VAR_DIM=   8192,          8192,            8192
##UNITS=     SECONDS,       ARBITRARY UNITS, ARBITRARY UNITS
##FACTOR=    0.0002496,     1,               1
##FIRST=     0,             0,               0
##LAST=      2.0444736,     0,               0
##MIN=       0,             -143616,         0
##MAX=       2.0444736,     246979,          0
$$ Real data points
##PAGE= N=1
##DATA TABLE= (X++(R..R)), XYDATA
$$ plain form
0 0 0 0 0 0 0 0 0 0 0 0 0 0 -8 8 -8 8 -11 16 -16 24 -24 32 -39 40 -48 56 -68 80 -88 104 -120 136 -152 172
34 172 -194 218 -245 275 -307 340 -380 422 -469 518 -574 632 -699 771 -848 935 -1030 1134
52 1134 -1250 1380 -1528 1691 -1881 2095 -2351 2652 -3015 3466 -4038 4795 -5849 7412 -9977
67 -9977 14907 -27784 135633 246979 -120091 -76332 210409 152673 -115134 -24700 158709
78 158709 66612 -79477 -195 71442 12956 -35640 -8407 232 -1231 -6227 -23624 -26814 3757
91 3757 2649 -20357 -14899 4665 4444 8347 4398 -8615 12664 42322 5090 -25531 29230 55979
105 55979 -13676 -31261 39964 38815 -34310 -22821 32660 5946 -35392 -8856 8754 -14968
117 -14968 -15884 -5389 -16495 -7715 8220 -16568 -22263 21854 16587 -32999 -3595 49420 1548
$$ packed form
0@%%%%%%%%%%%%qJ6j6J6j9K7l2M0m8N6p1P9q8J04j24J48j68J92k24K56k88L24
34A72l66M12m63N20n82O47p20Q02q91R87j092J206j331J470j619J783j965K164
52A134k384K630k908L219l572L976m446N003n667O481p504Q833j0644J3261j7389
67i977K4884m2691J63417J11346l67070M3759K86741n7736k67807R0434J83409
78A58709r2097j46089P9282P1637n8486m8596K7233Q639j463m996j7397l190L0571
91C757j108k3006N458J9564k21L903l949j3013K1279K9658l7232l0621N4761K6749
105E5979o9655j7585P1225j149p3125J1489N5481k6714m1338K6536J7610k3722
117a4968r16J0495j1106Q780J5935k4788n695M4117n267m9586K9404N3015m7872
$$ plain form
130 1548 -40279 28088 54543 -25831 -31567 50990 33641 -46839 -12844 51953 1356 -48403
142 -48403 5108 33082 -21182 -32624 12599 8536 -25462 -11149 11783 -6302 -16031 5924
154 5924 9913 -9410 -7002 14862 13262 -8706 -6811 20316 20425 -13641 -14025 26987 23885 -26318
168 -26318 -20656 33859 18919 -39855 -18285 37385 6777 -43964 -8978 32470 -4854 -34196
180 -34196 2360 20477 -8526 -14674 6720 6940 -2422 2968 2424 -2328 7917 10923 -5386 -4376
194 -4376 14330 8427 -11044 -2882 12854 1482 -11176 -1086 5306 -2941 -6392 -2532 -1638 -1476
208 -1476 -1243 -5077 -3936 3249 1330 -6453 -1133 7075 1357 -4639 2549 7345 857 -1774 3495
223 3495 4734 965 -553 732 2534 1812 -2451 -2917 2848 983 -6919 -3273 5438 -1692 -9986 762
$$ packed form
130A548m1827O8367K6455q0374n736Q2557j7349q0480L3995O4797n0597m9759
142d8403N3511K7974n4264j1442M5223m063l3998J4313K2932j8085r729K1955
154E924L989j9323K408K1864j600k1968J895K7127J09l4066l84M1012l102n0203
168b6318N662N4515j4940n8774K1570N5670l0608n0741L4986M1448l7324k9342
180c4196L6556J8117k9003o148K1394K20r362N390n44m752J0245L006j6309J010
194d376J8706n903j9471Q162J5736j1372j2658J0090O392q247l451L860Q94J62
208a476K33l834J141P185j919p783N320Q208n718n996P188M796o488k631N269
223C495J239l769j518J285J802p22m263m66N765j865p902L646Q711p130q294J0748
$$ plain form
239 762 7001 -5761 -8700 6624 6276 -8929 -3245 11606 1990 -10079 3740 11721 -3428 -7402
253 -7402 8426 8159 -8055 -4326 9861 2640 -10013 -1358 8707 -1318 -9862 403 7257 -3111
267 -3111 -8863 1374 6446 -3340 -7331 2932 6402 -3168 -5534 4765 6281 -3686 -3327 5842 4033
282 4033 -4126 -799 5880 749 -4335 1171 3580 -2469 -3164 1957 684 -3829 -878 2044 -1733
297 -1733 -3196 991 1158 -2192 -1336 1579 701 -1029 466 1236 625 731 466 485 1408 1161 -904 -183
315 -183 2332 361 -2551 33 2356 -981 -3586 796 2269 -2670 -3385 1837 1990 -3161 -2545 3073
331 3073 1815 -3396 -1377 3456 1760 -3033 56 4570 1185 -3626 801 4596 -571 -4032 1723
346 1723 4211 -2744 -4242 3251 2942 -4550 -3001 4054 1218 -5564 -1210 4870 -577 -5194 1120
$$ packed form
239G62O239j2762k939J5324l48j5205N684J4851r616j2069J3819P981j5149l974
253g402J5828k67j6214L729J4187p221j2653Q655J0065j0025q544J0265O854j0368
267c111n752J0237N072r786l991J0263L470r570k366J0299J516r967L59R169j809
282D033q159L327O679n131n084N506K409o049o95N121j273m513K951K922l777
297a733j463M187J67l350Q56K915q78j730J495P70o11J06k65J9R23k47k065P21
315a83K515j971k912K584K323l337k605M382J473m939p15N222J53n151O16N618
331C073j258n211K019M833j696m793L089M514l385m811M427L795n167l461N755
346A723K488o955j498P493l09p492J549P055k836o782M354O080n447m617O314
$$ plain form
361 1120 4427 -1744 -3849 2885 3588 -2665 -2236 3354 2053 -2584 -634 3066 953 -2700 -149 2304
377 2304 -286 -2371 155 1637 -989 -1850 463 1221 -1230 -1540 684 791 -1083 -512 1168 445 -692
394 -692 83 985 420 -454 539 873 47 -211 530 722 181 -423 161 579 -265 -731 -96 743 -241 -1517
414 -1517 -87 1036 -597 -1720 462 1724 -744 -1665 1433 1975 -1691 -1612 2484 1463 -2022 -706
430 -706 2705 666 -2473 384 2972 -283 -2674 903 2308 -1769 -2554 1798 1675 -2247 -1714 2423
446 2423 1298 -2764 -993 2660 135 -2671 135 2720 -259 -2229 1498 2497 -1052 -1626 1785 1526
462 1526 -1639 -1106 1771 849 -1977 -288 1762 -118 -1895 373 1398 -725 -1473 762 1073 -1477
478 -1477 -1022 1105 857 -1236 -739 1091 848 -968 -245 879 471 -608 -474 645 419 -511 -497 350
$$ packed form
361A120L307o171k105O734P03o253M29N590j301m637J950L700k113l653K551K453
377B304k590k085K526J482k626q61K313P58k451l10K224J07j874N71J680p23j137
394f92P75R02n65q74R93L34q26k58P41J92n41o04N84M18q44m66O35Q39r84j276
414a517J430J123j633j123K182J262k468r21L098N42l666P9M096j021l485J316
430g06L411k039l139K857K588l255k391L577J405m077p85M352j23l922N33M137
446B423j125m062J771L653k525k806K806K585k979j970L727R99l549n74L411k59
462A526l165N33K877r22k826J689K050j880j777K268J025k123p48K235L11k550
478a477M55K127k48k093M97J830k43j816P23J124m08j079J34J119k26r30J4Q47
$$ plain form
496 350 326 -643 -563 172 153 -385 -259 6 15 -53 -95 226 -53 -182 180 499 -384 -370 938 416 -1183 -339
518 -339 1312 514 -1552 -461 1860 163 -2011 -143 2380 -126 -2509 274 2136 -768 -2323 561
534 561 1754 -1049 -1589 1021 1352 -1295 -1169 1848 603 -1795 -191 1684 -41 -1530 403 1213
550 1213 -642 -1418 1117 1258 -1111 -1130 1199 967 -1430 -724 1415 378 -1632 -59 1203 -242 -1366
567 -1366 312 1413 -433 -844 780 950 -854 -479 1112 573 -899 -340 1210 239 -1304 182 1179
584 1179 -402 -942 -97 1102 125 -745 -84 783 80 -858 -326 918 59 -798 -11 719 31 -667 -185
603 -185 762 191 -484 -61 658 -88 -398 219 313 -415 25 490 -178 -716 86 915 -560 -814 541 1050
623 1050 -481 -1076 681 1447 -772 -1371 999 1113 -1293 -1030 1423 950 -1496 -609 1471 353 -1548
$$ packed form
496C50k4r69Q0P35j9n38J26K65Ro8m2L21k79j29L62L19q83J4J308n22j599Q44
518c39J651p98k066J091K321j697k174J868K523k506k383K783J862k904j555K884
534E61J193k803n40K610L31k647J26L017j245k398J604J875j725j489J933Q10
550A213j855p76K535J41k369j9K329k32k397P06K139j037k010J573J262j445j124
567a366J678J101j846m11J624J70j804L75J591n39j472N59J550r71j543J486R97
584A179j581n40Q45J199r77q70O61Q67p03r38N32J244q59q57P87P30o88o98M82
603a85R47n71o75M23P19p46l10O17R4p28M40M65o68n38Q02Q29j475k54J355N09
623A050j531n95J757P66k219n99K370J14k406K63K453m73k446Q87K080j118j901
$$ plain form
640 -1548 -288 1187 -55 -1201 92 1229 -409 -1032 638 828 -675 -489 879 297 -964 -56
656 -56 998 -441 -845 276 906 -557 -839 655 913 -596 -464 548 325 -461 -315 567 241 -590
674 -590 -471 585 220 -574 -64 539 -205 -678 268 346 -57 -421 173 392 27 -153 246 334 222 -5 196
695 196 472 -114 -482 178 262 -118 -488 70 618 -171 -760 304 496 -323 -343 499 368 -765 56 552
715 552 293 -685 115 571 -328 -653 298 521 -742 -784 353 179 -759 -271 806 221 -784 -456 939
734 939 -1 -955 -193 861 -148 -799 113 525 -424 -471 699 370 -486 -229 325 174 -720 120 682 -205
754 -205 -508 378 540 -179 -621 381 171 -460 -437 217 255 -313 89 230 93 -348 -110 213 -41 -337 -19
775 -19 159 -129 -13 -1 -2 -92 -148 52 298 -225 -72 83 259 -191 -164 158 277 163 -197 118 241 -186 -158
$$ packed form
640a548J260J475j242j146J293J137j638o23J670J90j503J86J368n82j261R08
656e6J054j439m04J121O30j463k82J494K58j509J32J012k23p86J46Q82l26q31
674e90J19J056l65p94N10O03p44m73R46P8m03l64N94K19l65j80L99Q8j12k27K01
695A96K76n86l68O60Q4l80l70N58N48p89n89J064J92q19k0Q42j31j133Q21M96
715E52k59r78Q00M56q99l25R51K23j263m2J137j74r38M88J077n85j005L28J395
734I39r40r54P62J054j009o51R12M12r49m7J170l29q56K57N54j51q94Q40N62q87
754b05l03Q86J62p19m42J002k10o31K3O54L8n68M02J41j37m41K38L23k54k96L18
775a9J78k88J16J2jr0n6K00K46n23J53J55J76m50K7L22J19j14l60L15J23m27K8
$$ plain form
798 -158 131 -10 -291 -50 356 74 -469 25 460 222 -451 38 441 -49 -163 121 284 -116 -188 281 157
819 157 -298 -161 253 214 -310 -379 294 178 -560 222 387 -37 -511 295 343 -300 -156 265 414 -448 17
840 17 281 83 -286 -103 284 -194 -275 146 256 10 -587 253 232 -47 -324 53 -9 -392 -62 394 -65 -43
862 -43 -25 240 -189 -208 -127 261 203 -91 186 116 245 -8 119 133 -100 -73 -127 15 -106 32 57 278 130 -224
886 -224 82 257 -220 -111 162 231 -402 -271 344 336 -170 -127 525 -116 -62 -255 245 -161 -262 -256 54 34 -514
909 -514 352 257 -313 -117 289 137 -283 -157 309 54 -405 94 227 -137 -273 12 414 73 -361 114 325
930 325 -113 -287 154 154 -73 129 429 148 -7 24 369 122 -248 168 258 -121 -136 32 241 -32 -208 223
952 223 37 -261 -345 -104 102 -2 -97 314 53 -120 -81 250 -31 90 -122 122 -87 -5 -76 176 70 -362
$$ packed form
798a58K89j41k81K41M06k82n43M94M35k38o73M89M03m90j14K84J63m00p2M69j24
819A57m55J37M14l9n24o9O73j16p38P82J65m24m74Q06M8o43J44M21J49q62M65
840A7K64j98l69J83L87m78q1M21J10k46n97Q40k1k79k77L77o2l83L30M56m59K2
862d3J8K65m29j9Q1L88n8k94K77p0J29k53J27J4k33K7n4J42j21J38K5K21j48l54
886b24L06J75m77J09K73O9o33J31O15qn06M3O52o41N4j93N00m06j01OL10k0n48
909e14Q66r5n70J96M06j52m20J26M66k55m59M99J33l64j36K85M02l41m34M75K11
930C25m38j74M41%k27K02L00k81j55L1L45k47l70M16R0l79j5J68K09k73j76M31
952B23j86k98q4K41K06j04r5M11k61j73L9L31k81J21k12K44k09Q2p1K52j06m32
$$ plain form
974 -362 -192 111 31 -169 215 -29 -163 -114 9 117 -388 -214 -41 107 177 -62 135 92 -290 -143 264 -12
996 -12 -180 -136 63 208 -107 -38 543 -180 -53 253 343 -46 -344 167 418 -421 -70 403 129 -88 186 114
1018 114 -4 -368 210 136 -20 -112 21 110 -89 -136 -52 254 29 55 187 61 12 236 261 120 -385 160 230
1041 230 -193 -40 153 13 178 -72 -11 254 -207 -6 24 162 -174 164 62 34 -53 41 195 102 252 -130
1063 -130 -260 115 -236 -14 17 -32 -9 207 114 -26 -239 -23 175 -103 -344 -60 58 -138 -168 204 161 -192
1085 -192 -155 207 163 -359 -402 -91 79 -74 -82 284 166 -434 91 141 -90 -175 117 445 -133 -214 196 125 -127
1108 -127 4 83 34 -415 -159 490 37 -287 88 182 -39 20 -36 99 -118 -130 4 197 -60 -335 -35 33
1130 33 -149 -99 11 -11 -116 -53 31 -68 -231 67 221 34 -456 -24 -48 183 -243 -120 24 129 -206 47
$$ packed form
974c62J70L03q0k00L84k44j34M9J23J08n05J74J73J48P0k39J97m3l82J47M07k76
996a2j68M4J99J45l15O9N81p23J27L06R0l89k98N11K51q39L51M73k74k17K74p2
1018A14j18l64N78p4j56r2J33Q9j99m7Q4L06k25K6J32j26m9K24K5j41n05N45P0
1041B30m23J53J93j40J65k50O1K65m61K01L0J38l36L38j02k8q7R4J54r3J50l82
1063a30j30L75l51K22L1m9K3K16r3j40k13K16J98k78k41K84J18j96l0L72m3l53
1085a92L7L62m4n22m3L11J70j53qL66j18o00N25N0k31q5K92L28n78q1M10p1k52
1108a27J31P9m9m49K56O49m53l24L75R4k21N9n6J35k17j2J34J93k57k75L00O8
1130C3j82N0J10k2j05O3Q4r9j63K98J54j87m90M32k4K31m26J23J44J05l35K53
$$ plain form
1152 47 -153 -94 -50 -73 100 26 -171 -11 27 -32 -12 35 -200 -65 -243 26 -5 123 217 131 19 130 16 147
1176 147 182 -149 87 186 -2 -128 154 214 159 91 227 173 -54 161 73 -32 -29 -28 203 -33 93 -247 -85 -192
1200 -192 -135 -53 93 -114 -307 -57 171 -14 -35 -52 -47 -155 77 -163 55 66 48 197 -256 -221 -159 24 -75 1
1224 1 103 256 -182 -43 -67 110 -72 52 -39 104 -39 -161 -65 -87 212 22 -40 -190 37 -33 -196 177 -45
1247 -45 -40 88 93 -151 105 8 -94 -76 243 43 -89 94 -75 -50 -17 -175 38 88 78 8 -55 16 -172 -61 50
1272 50 108 -149 -205 -2 -27 -178 141 -74 -224 -236 26 -21 145 -250 86 256 66 86 102 -92 5 -148 -64
1295 -64 48 -98 -153 246 -43 -174 -129 235 130 194 122 -241 19 20 86 132 -21 131 154 -13 -83 -102 -32 36 103
1320 103 68 76 161 -316 22 85 -22 -346 178 45 -190 137 -95 -25 -68 23 -77 78 -144 -4 -193 70 -13
$$ packed form
1152D7k00N9M4k3J73p4j97J60L8n9K0M7k35J35j78K69l1J28R4q6j12J11j14J31
1176A47L5l31K36R9j88j26K82O0n5o8J36n4k27K15q8j05LJK31k36J26l40J62j07
1200a92N7Q2J46k07j93K50K28j85k1j7Nj08K32k40K18J1j8J49m53L5O2J83r9P6
1224AJ02J53m38J39k4J77j82J24r1J43j43j22R6k2K99j90o2j50K27p0j63L73k22
1247d5NJ28Nk44K56r7j02J8L19k00j32J83j69K5L3j58K13N0j0p0o3P1j88J11J11
1272E0N8k57n6K03k5j51L19k15j50j2K62m7J66l95L36J70j90K0J6j94R7j53Q4
1295f4J12j46n5L99k89j31M5L64j05O4p2l63K60JO6M6j53J52K3j67p0j9P0O8O7
1320A03l5QQ5m77L38O3j07l24N24j33k35L27k32P0m3R1j00J55k22J40j89K63q3
$$ plain form
1343 -13 110 47 70 -8 1 14 -49 74 -4 60 -250 53 151 -5 117 16 -17 -62 141 274 -153 -27 -104 -33 -16
1368 -16 -186 115 25 35 -220 -184 -205 -210 168 -63 -60 -78 51 21 153 236 2 20 -124 -61 -11 -21 30 -52 -21 8 -26
1395 -26 -126 148 103 63 15 -117 112 -6 -2 71 56 -129 99 141 112 51 8 26 133 -107 81 69 140 -72 150
1420 150 -97 187 -195 -49 -189 -197 -167 -219 -215 -20 -96 171 99 90 -299 -139 124 105 300 -309 160 112 19 13 -40
1445 -40 177 303 281 -90 -54 139 105 224 -183 -101 34 -181 217 48 -47 24 -33 94 -13 -5 -278 1 221
1468 221 -85 83 187 -22 -70 86 85 129 -18 -106 126 79 203 102 233 -139 -79 40 -58 -170 -15 121 -175
1491 -175 26 39 -161 -15 -95 -267 -89 -227 -85 154 133 182 -226 -114 176 -168 -25 -264 160 -88 111
1512 111 79 155 -108 -42 -18 54 78 8 106 165 -241 -34 119 159 54 -23 29 18 39 58 50 2 -162 158 106 66 -43
$$ packed form
1343a3J23o3K3p8RJ3o3J23p8O4l10L03R8j56J22j01l3m5K03J33m27J26p7P1J7
1368a6j70L01r0J0k55L6k1nL78k31Lj8J29l0J32Q3k34J8j44O3N0j0N1q2L1K9l4
1395b6j00K74m5m0m8j32K29j18MP3j5j85K28M2k9o1m3J8J07k40J88j2P1k12K22
1420A50k47K84l82J46j40qL0n2MJ95p6K67p2rl89J60K63j9J95o09M69m8r3on3
1445d0K17J26k2l71L6J93l4J19m07Q2J35k15L98j69r5P1n7J27j07Qk73K79K20
1468B21l06J68J04k09m8J56jM4j47q8K32m7J24j01J31l72O0J19r8j12J55J36k96
1491a75K01J3k00J46q0j72J78j38J42K39k1M9m08J12K90l44J43k39M24k48J99
1512A11l2P6k63O6K4P2K4p0R8N9m06K07J53M0j05p7N2j1K1J9qm8j64L20n2m0j09
$$ plain form
1539 -43 -34 136 51 -92 128 15 47 106 -11 187 -199 -253 95 -119 -106 45 -22 -17 108 -57 49 17 102 -116
1563 -116 -94 118 -224 235 85 -47 62 41 -101 -63 -137 299 132 -164 111 35 19 -184 11 193 174 10
1585 10 67 -77 -34 77 124 14 -51 -219 -161 -51 -77 -2 296 19 -10 -233 194 120 -103 50 275 33 72 -16
1609 -16 -113 15 -252 93 216 221 -78 136 -103 -167 -3 -49 22 -3 -164 -132 47 -35 -84 -101 188 -172 -114 96
1633 96 -51 73 26 67 189 -93 50 153 77 -152 -24 144 137 -22 308 197 -318 -220 211 -108 -360 -78
1655 -78 103 -165 -190 -138 -23 -153 -100 77 -134 94 -203 -34 90 -292 -150 250 137 -96 56 205 103
1676 103 -81 183 181 202 -23 -153 48 -98 124 320 301 119 -142 -24 -4 62 -151 15 -7 15 -209 -259 92
1699 92 -37 -82 -49 251 92 -115 139 346 -328 142 -8 154 -208 136 -10 229 16 128 15 -18 -268
$$ packed form
1539d3RJ70q5j43K20j13L2N9j17J98l86n4L48k14J3J51o7NJ25j65J06l2Q5k18
1563a16K2K12l42M59j50j32J09k1j42L8p4M36j67k96K75p6j6k03J95J82j9j64
1585A0N7j44M3J11M7j10o5j68N8J10k6P5K98k77k9k23M27p4k23J53K25k42L9q8
1609a6r7J28k67L45J23Nk99K14k39o4J64m6P1k5j61L2J79q2m9j7K89l60N8K10
1633I6j47J24m7M1J22k82J43J03p6k29J28J68pj59L30j11n15R8M31l19k52K82
1655g8J81k68k5N2J15j30N3J77k11K28k97J69J24l82J42M00j13k33J52J49j02
1676A03j84K64kK1k25j30K01j46K22J96j9j82k61J18K0O6k13J66k2K2k24n0L51
1699I2j29m5L3L00j59k07K54K07o74M70j50J62l62L44j46K39k13J12j13l3k50
$$ plain form
1720 -268 -34 230 -137 -138 167 73 81 -214 -68 32 -130 57 -50 -184 -212 8 106 4 -159 48 251 -114
1742 -114 -142 135 140 -20 -170 -129 -68 -92 92 178 187 -8 152 346 66 119 24 141 5 -143 -88 18 -236 -63
1766 -63 151 -381 -132 -155 -259 -45 -194 149 57 -335 87 -184 -62 -4 -134 5 79 254 -82 34 299 -199
1788 -199 -29 197 2 -64 83 101 57 44 -30 75 -50 72 91 -23 10 69 199 240 161 -135 -4 73 59 184
1812 184 -152 54 87 42 -97 91 -16 -485 -46 -109 34 -31 -160 38 -33 -97 114 -4 -151 130 220 -268
1834 -268 123 96 -51 -142 -51 188 -112 9 -20 -26 -161 -282 113 66 34 -230 283 -150 43 12 344 79 -25
1857 -25 33 -174 82 106 54 -134 196 -112 261 -31 49 46 106 -139 11 56 45 116 -32 244 230 105 -186 121
1881 121 162 82 6 -36 108 139 -90 35 31 -22 -114 -7 101 57 -75 261 -185 -15 -145 156 252 64 211 -334
$$ packed form
1720b68K34K64l67jL05r4Qk95J46J00j62J87j07j34k8K20R8j02j63K07K03l65
1742a14k8K77Nj60j50M1O1k4J84Q6Rj95J60J94k80N3r5J17j36j48N5J06k54J73
1766f3K14n32K49k3j04K14j49L43r2l92M22k71J22N8j30J39P4J75l36J16K65m98
1788a99J70K26j95o6J47J8m4j3p4J05j25J22J9j14L3N9J30M1p9k96J31P7j4J25
1812A84l36K06L3m5j39J88j07m69M39o3J43o5j29J98p1o4K11j18j47K81R0m88
1834b68L91k7j47r1R1K39l00J21k9oj35j21L95m7l2k64N13m33J93l1L32k65j04
1857b5N8k07K56K4n2j88L30l08L73k92Q0lO0k45J50M5j1P1j48K76j4j25k91L07
1881A21M1q0p6m2J44L1k29J25mn3r2J07J08m4j32L36m46J70j30L01R6j88J47n45
$$ plain form
1905 -334 149 -283 -96 -54 -84 1 88 21 38 -185 61 -197 -179 -224 -198 155 -80 -137 -198 -166 -76 135 -3 65 -110
1930 -110 -50 -42 111 -96 -12 129 -109 -184 46 13 -7 282 -40 60 129 104 51 98 -41 182 -57 -282 -95 -200
1954 -200 151 -71 -133 57 54 -447 -82 34 -197 -93 -88 210 114 33 129 -115 122 98 126 70 -59 -143 126 97
1978 97 -219 -222 15 200 -41 -8 -166 -166 -26 100 224 61 16 144 162 11 -118 256 -160 125 -20 -14 -138
2001 -138 -122 96 -15 227 99 92 143 35 87 0 166 34 -27 -286 13 7 21 100 121 -40 -119 -75 10 -172 -252
2026 -252 85 138 -5 -125 167 140 -306 -40 5 -9 -107 141 56 -77 -204 -115 7 53 -14 67 192 -191 -118 12
2050 12 -10 -133 -115 -128 -21 25 274 -25 -101 -176 6 -214 81 -143 75 -120 8 -60 -21 90 -5 -245 77
2073 77 -46 147 19 27 53 95 43 -11 19 -94 -113 -177 7 215 170 112 192 71 -14 101 -4 -99 166 -135 -153
$$ packed form
1905c34M83m32J87M2l0Q5Q7o7J7k23K46k58J8m5K6L53k35n7o1L2R0K11j38O8j75
1930a10O0QJ53k07Q4J41k38p5K30l3k0K89l22J00O9k5n3M7j39K23k39k25J87j05
1954b00L51k22o2J90ln01L65J16k31J04NK98r6q1R6k44K37k4K8n6j29q4K69k9
1978I7l16lK37J85k41L3j58%J40J26J24j63m5J28J8j51j29L74m16K85j45Oj24
2001a38J6K18j11K42j28pN1j08N2q7J66j32o1k59K99oJ4P9K1j61p9M4Q5j82q0
2026b52L37N3j43j20K92k7m46K66M5j4r8K48q5j33j27Q9J22M6o7Q1J25l83P3J30
2050A2k2j23J8j3J07M6K49k99p6p5J82k20K95k24K18j95J28o8L9J11r5k40L22
2073G7j23J93j28QK6M2n2n4L0j13j9o4J84K08m5n8Q0j21q5J15j05r5K65l01j8
$$ plain form
2098 -153 -293 -1 96 67 218 58 247 -54 -117 12 -106 -69 83 81 92 -73 69 289 27 -118 29 -34 -85
2121 -85 -182 11 148 -36 -76 -179 -33 78 -6 108 61 -6 167 172 147 -118 88 -82 -141 9 198 83 113 42
2145 42 81 -111 53 -42 27 21 -145 221 108 82 -108 38 -96 -121 -177 39 -138 -11 -21 56 50 245 -190 27
2169 27 143 -251 227 114 196 297 -99 151 -9 35 14 -149 156 127 38 -1 45 42 16 -66 267 -13 15 -133
2193 -133 205 -96 -34 50 -43 -146 17 220 -120 -252 -159 150 -7 116 163 38 -161 219 32 -97 336 0
2215 0 -188 126 -6 101 -60 -74 -117 -90 15 -126 7 104 72 -97 -100 8 -2 -88 39 206 74 -2 153 -169
2239 -169 60 -62 -201 130 135 99 -154 135 -215 200 353 -42 -72 93 -77 -29 0 172 -35 -136 71 -186
2261 -186 20 -94 138 44 52 13 14 208 -130 -43 -66 174 92 14 -47 -102 29 -82 -153 110 141 -65 -396 -427 -46
$$ packed form
2098a53j40K92R7k9J51j60J89l01o3J29j18L7J52kJ1j65J42K20k62j45J47o3n1
2121h5r7J93J37j84m0j03J46J11q4J14m7o7J73Nk5k65K06j70n9J50J89j15L0p1
2145D2L9j92J64r5O9oj66L66j13k6j90J46j34k5n6K16j77J27j0P7oJ95m35K17
2169B7J16l94M78j13Q2J01l96K50j60M4k1j63L05k9q9l9M6lk6q2L33k80K8j48
2193a33L38l01O2Q4r3j03J63K03l40j32R3L09j57J23M7j25j99L80j87j29M33l36
2215@j88L14j32J07j61j4m3K7J05j41J33R7l2j69lJ08j0q6J27J67j32p6J55l22
2239a69K29j22j39L31Nl6k53K89l50M15J53l95l0J65j70M8K9J72k07j01K07k57
2261a86K06j14K32r4Ql9JJ94l38Q7k3K40q2p8o1n5J31j11p1K63L1k06l31l1L81
$$ plain form
2286 -46 -111 397 99 235 -124 -70 152 -217 20 98 54 -284 -48 122 -161 -88 156 103 83 -112 -2 267 -158
2309 -158 -79 123 -78 -54 -223 225 -107 65 52 173 -34 29 204 27 -86 -145 -55 157 43 49 -87 70 211
2332 211 -274 154 59 160 -88 121 -161 -3 173 116 242 -295 -204 264 33 -108 -54 -3 -183 -132 235 -37
2354 -37 -90 41 -223 181 33 239 189 -402 -4 107 -60 -83 17 218 3 -143 176 -154 94 118 -30 61
2376 61 -302 -69 -142 22 292 137 177 137 185 -18 -12 1 110 -359 50 219 131 -101 30 14 -112 -70 -171 -155
2400 -155 103 40 -89 -55 -30 -137 41 216 -107 187 6 -139 -5 -36 53 -125 4 210 25 76 21 98 42
2423 42 -185 127 25 340 -70 -217 28 190 -98 -222 -4 -178 -128 -131 209 -288 -67 -34 -184 49 -99 6
2445 6 -167 -6 126 -104 -210 -136 53 -20 -181 55 61 39 -33 -233 -109 195 10 -63 -119 37 68 -120 -128 -164 -103
$$ packed form
2286d6o5N08k98J36l59N4K22l69K37P8m4l38K36J70k83P3K44n3k0j95J10K69m25
2309a58P9K02k01K4j69M48l32J72j3J21k07O3J75j77j13n9R0K12j14Oj36J57J41
2332B11m85M28r5J01k48K09k82J58J76n7J26n37R1M68k31j41N4N1j80N1L67k72
2354c7n3J31k64M04j48K06n0n91L98J11j67k3J00K01k15j46L19l30K48K4j48R1
2376F1l63K33p3J64K70j55M0m0M8k03OJ3J09m69M09J69q8k32J31j6j26M2j01J6
2400a55K58o3j29L4K5j07J78J75l23K94j81j45J34l1Q9j78J29K06j85N1n5P7n6
2423D2k27L12j02L15m10j47K45J62k88j24K18j74N0lL40m97K21L3j50K33j48J05
2445Fj73J61J32k30j06P4J89p3j61K36Ok2p2k00J24L04j85p3n6J56L1j88ql6O1
$$ plain form
2470 -103 -161 9 26 -117 134 22 -148 -127 188 -168 -68 41 43 -120 163 -12 28 205 112 23 -174 120 155
2493 155 21 162 132 21 -54 215 -207 -134 217 46 56 -244 5 164 201 127 71 202 -107 14 65 -52 107
2516 107 -54 165 305 -65 -114 117 -7 -28 -77 31 -8 -216 -188 -26 -20 206 129 58 120 83 9 259 -37 163
2540 163 -192 17 -26 263 -14 -208 -197 127 1 -203 -160 114 -162 -160 151 77 93 -48 -142 -129 137 -153 59
2563 59 74 -112 -160 185 102 131 199 0 76 103 -428 -105 60 -50 18 -167 94 107 -12 261 147 -167 -4
2586 -4 116 52 178 -56 -151 164 181 91 -11 16 -62 101 221 5 50 77 188 61 -284 118 262 -185 16
2609 16 171 92 -217 4 -190 -30 213 200 189 32 -50 78 40 -205 -77 -112 -170 -214 14 91 -111 -113 219 96
2633 96 -195 -175 141 130 116 25 -216 -112 -149 -197 -11 -62 25 88 -14 -30 -37 26 -43 30 81 -178 -74 50 15 -64
$$ packed form
2470a03n8J70J7j43K51j12j70K1L15l56J00J09Kj63K83j75M0J77r3q9j97K94L5
2493A55j34J41l0j11p5K69m22P3L51j71J0l00K49J59L7p4n6J31l09J21N1j17J59
2516A07j61K19J40l70m9K31j24k1m9J08l9k08K8J62OK26p7p1O2l7p4K50k96K00
2540A63l55K09m3K89k77j94J1L24j26k04M3K74k76KL11p4J6j41r4J3K66k90K12
2563E9J5j86m8L45q3K9O8j99P6K7n31L23J65j10O8j85K61J3j19K73j14l14J63
2586dJ20o4J26k34r5L15J7r0j02K7p8J63J20k16M5K7J11j27l45M02J44m47K01
2609A6J55p9l09K21j94J60K43j3j1j57q2J28l8k45J28l5n8m4K28P7k02kL32j23
2633I6k91K0L16j1j4r1k41J04l7m8J86n1Q7O3j02j6pO3o9P3N1k59J04J24l5p9
$$ plain form
2659 -64 34 36 -160 -72 46 -174 -92 238 -187 -139 75 42 366 143 -77 141 62 85 32 -48 -132 -196 -70 -43 -6
2684 -6 103 65 477 160 -173 149 119 129 -293 -73 -159 -85 50 202 -196 16 -71 345 210 81 33 -128 -2
2707 -2 5 51 93 -181 2 60 -20 -340 1 184 -148 43 124 39 69 -123 43 -120 -122 -70 147 122 -68 164 -180
2732 -180 36 26 70 16 4 127 21 249 -146 -57 -118 -64 82 3 69 -100 -46 231 9 33 337 115 -177 234
2756 234 -156 139 -167 -66 -84 2 -55 -216 -33 41 -7 -98 -64 34 131 163 -74 -104 12 -165 -38 -40 197 -19
2780 -19 225 -22 134 -69 -252 96 71 106 -155 166 368 -207 -174 154 246 55 -120 156 63 -43 192 312
2802 312 115 175 9 64 -165 178 277 94 -10 358 97 -22 225 -223 -14 -32 -52 -20 -238 67 211 77
2824 77 -91 -277 163 123 -203 -120 120 102 71 -85 -139 34 -41 31 -6 199 -90 220 -44 162 162 2 165 -47
$$ packed form
2659f4R8Kj96Q8J18k20Q2L30m25M8K14l3L24k23k20K18p9K3n3q0q4o4J26K7L7
2684fJ09l8M12l17l33L22l0J0m22K20q6P4J35J52l98K12q7M16j35j29m8j61J26
2707bPM6M2k74J83N8q0l20L41J83l32J91Q1q5L0j92J66j63kN2K17k5j90K32l44
2732a80K16j0M4n4j2J23j06K28l95Q9o1N4J46p9O6j69N4K77k22K4L04k22k92M11
2756B34l90K95l06J01j8Q6n7j61J83P4m8r1L4R8R7L2k37l0J16j77J27kK37k16
2780a9K44k47J56k03j83L48k5L5k61L21K02n75L3L28R2j91j75K76r3j06K35J20
2802C12j97O0j66N5k29L43R9j83j04L68k61j19K47m48K09j8k0L2k18L05J44j34
2824G7j68j86M40m0l26Q3K40j8l1j56n4J73p5P2l7K05k89L10k64K06%j60J63k12
$$ plain form
2848 -47 20 -41 11 21 -38 61 197 -61 13 -146 -333 226 137 -54 -190 -115 -52 -79 126 -219 -118 -21 175 -1
2872 -1 -42 -128 -15 333 7 60 80 105 -98 219 62 -175 51 -78 -36 0 399 -102 -125 -145 -48 -120 52 -145
2896 -145 30 243 -429 161 48 11 -52 -213 -69 142 -265 184 89 -200 -58 235 -180 -205 -16 -105 74 -76
2918 -76 129 241 150 171 -57 329 3 232 -224 204 371 2 -123 160 -71 -188 -145 67 73 -112 86 -76
2940 -76 -209 -26 109 -131 69 -23 -2 -88 -57 -72 8 -164 -13 -279 2 51 167 -293 193 46 -66 -27 159
2963 159 -196 124 -203 -57 -45 -115 241 74 -177 203 -28 28 -10 -136 94 -129 -137 -142 -127 -285 -111 -33 49 -118
2987 -118 109 -116 106 -113 -167 281 -221 27 -73 101 -10 31 -108 170 -45 87 -213 -37 -19 2 37 -178
3009 -178 24 -144 -58 -52 72 -104 125 258 128 -30 105 30 -88 -40 167 -142 -212 85 -89 138 -131 -156
$$ packed form
2848d7O7o1N2J0n9R9J36k58P4j59j87N59q9j91j36P5O3k7K05l45J01R7J96j76
2872am1q6J13L48l26N3K0K5k03L17j57k37K26j29M2L6L99n01k3k0R7p2J72j97
2896a45J75K13o72N90j13l7o3j61J44K11m07M49r5k89J42K93m15k5J89q9J79j50
2918g6K05J12r1K1k28L86l26K29m56M28J67l69j25K83k31j17M3K12Oj85J98j62
2940g6j33J83J35k40K00r2K1q6L1j5Q0j72J51k66K81M9J16m60M86j47j12L9J86
2963A59l55L20l27J46J2p0L56j67k51L80k31N6l8j26K30k23qnJ5j58J74P8Q2j67
2987a18K27k25K22k19n4M48n02K48j00J74j11M1j39K78k15J32l00J76J8K1L5k15
3009a78K02j68Q6OJ24j76K29J33j30j58J35p5j18M8K07l09p0K97j74K27k69k5
$$ plain form
3031 -156 103 -42 216 75 -349 85 287 15 -22 -97 20 90 14 88 288 96 72 -149 60 -80 195 -77
3053 -77 101 87 138 -148 -111 -57 -1 33 -138 300 203 -244 63 -36 33 -100 81 -260 193 34 172 232 -242 -266
3077 -266 -127 214 198 -92 -22 -146 -234 26 79 -46 24 -128 -111 -215 -56 7 26 -58 10 -113 -100 -168 -270 190
3101 190 -147 -167 40 3 -165 -263 -72 68 -159 53 12 193 215 -76 -195 -188 324 -8 162 -115 -84 -85 106
3124 106 100 -99 -40 -10 -65 -93 56 216 -268 104 -6 128 -185 55 108 80 90 -71 -153 -225 24 -30 9 24 -39
3149 -39 85 233 92 182 162 36 140 174 204 173 21 7 25 61 195 132 123 -124 34 -145 -12 -89 -194 57
3173 57 126 119 -183 174 194 78 -87 -59 72 54 83 120 -65 45 -90 86 -114 39 232 125 211 222 155 85
3197 85 -224 284 -13 -31 -156 -133 33 226 56 246 -300 68 61 -109 -59 74 1 96 37 21 -135 -189 286 181
$$ packed form
3031a56K59j45K58j41m24M34K02k72l7p5J17P0p6P4K00j92k4k21K09j40K75k72
3053g7J78j4N1k86L7N4N6L4j71M38r7m47L07r9O9j33J81l41M53j59J38O0m74k4
3077b66J39L41j6k90P0j24q8K60N3j25P0j52J7j04J59O3J9q4O8j23J3o8j02M60
3101A90l37k0K07l7j68r8J91J40k27K12m1J81K2k91j19PN12l32J70k77L1jJ91
3124A06oj99N9L0n5k8J49J60m84L72j10J34l13K40N3k8J0j61q2p2K49n4L9J5o3
3149c9J24J48j41R0k0j26J04L4L0l1j52j4J8L6J34o3rk47J58j79J33p7j05K51
3173E7O9pl02L57K0j16j65K8J31j8K9L7j85J10j35J76k00J53J93j07Q6J1o7p0
3197H5l09N08k97j8j25K3J66J93j70J90n46L68pj70N0J33p3R5n9j6j56n4M75j05
$$ plain form
3221 181 174 -110 -12 147 98 -248 101 -151 110 5 128 -136 -145 -149 22 64 -135 -163 74 258 115 -39 -299
3244 -299 24 120 -52 -6 -74 229 -209 -4 -10 -109 -95 -18 -188 -82 130 -139 -22 43 22 29 5 -137 8 -103
3268 -103 -79 183 -17 -10 221 -8 28 -107 -43 -53 33 -144 -64 45 23 227 -171 -24 -40 63 -164 -27 19 -171
3292 -171 -120 6 25 23 -47 -25 -222 68 58 93 18 -67 -241 100 -69 -87 -34 4 28 -168 98 -161 91 -89 6
3317 6 -78 -87 -347 -58 -141 286 -67 -80 -175 103 229 -123 108 -104 -159 -52 -143 -57 87 -8 -167 -131 246 228 -186
3342 -186 47 121 215 20 54 91 169 -249 -105 72 -103 -52 144 -18 -324 17 2 118 -53 9 -118 -118 -44 -84
3366 -84 24 233 -171 24 160 264 -203 95 -381 234 -75 -135 7 5 83 87 91 -9 -208 61 -17 20 -237 96
3390 96 118 -57 172 251 199 171 -53 -79 -39 152 276 74 202 4 159 -215 -113 -125 49 154 -2 216 -23
$$ packed form
3221A81pk84R8J59m9l46L49k52K61j05J23k64rmJ71M2j99k8K37J84j43j54k60
3244b99L23R6j72M6o8L03m38K05or9J4P7j70J06K12k69J17O5k1Pk4j42J45j11
3268a03K4K62k00PK31k29L6j35O4j0Q6j77Q0J09k2K04l98J47j6J03k27J37M6j90
3292a71N1J26J9kp0K2j97K90j0L5p5q5j74L41j69j8N3L8K4j96K66k59K52j80R5
3317Fq4rk60K89q3M27l53j3r5K78J26l52K31k12n5J07r1Q6J44r5j59L6L77j8m14
3342a86K33P4R4j95L4L7P8m18J44J77j75N1J96j62l06L41j5J16j71O2j27%P4m0
3366h4J08K09m04J95J36J04m67K98m76O15l09o0J42kP8MMj00j99K69p8L7k57L33
3390I6K2j75K29P9n2k8k24k6M0J91J24k02J28j98J55l74J02j2J74J05j56K18k39
$$ plain form
3413 -23 151 128 -47 -110 -38 -24 101 -211 50 22 -127 103 95 73 97 359 15 -108 -210 78 -30 251 -10
3436 -10 212 59 5 72 161 -38 21 274 -3 -170 -137 282 -53 -345 186 -23 -206 119 91 132 -32 -116 74
3459 74 -236 -198 137 260 58 -118 30 89 -54 108 -144 -324 78 -18 74 131 25 -78 -72 45 -199 -178 187
3482 187 211 -29 -144 -55 -125 102 183 85 -4 54 193 358 -70 189 152 181 -46 -15 -131 26 55 103 7 -84 -208
3507 -208 -9 -26 313 -247 -227 -77 -34 -61 -77 -175 26 121 71 -47 243 -57 -92 -65 -22 494 93 138 31 -17
3531 -17 -22 78 196 150 -103 -126 -79 32 126 111 36 -203 -65 -55 -36 61 -33 -252 -121 237 -86 157 -59 -176
3555 -176 131 -11 196 157 -361 -10 -7 63 -72 34 83 -194 -130 37 58 70 -74 -51 149 205 184 -66 4 -94
3579 -94 -220 -62 28 43 -117 -263 163 149 -290 -192 -280 17 26 14 -180 -91 153 0 120 -160 -163 -236 -84 14 86
$$ packed form
3413b3J74k3j75o3P2J4J25l12K61k8j49K30qk2K4K62l44j23j02K88j08K81k61
3436a0K22j53n4O7Q9j99N9K53k77j67L3M19l35k92N31k09j83L25k8M1j64q4J90
3459G4l10L8L35J23k02j76J48N9j43J62k52j80M02r6R2N7j06j03OJ17k44K1L65
3482A87K4k40j15Q9p0K27Q1r8q9N8J39J65m28K59l7K9k27L1j16J57K9M8r6r1j24
3507b08J99j7L39n60K0J50M3k7j6r8K01R5n0j18K90l00l5K7M3N16m01M5j07m8
3531a7nJ00J18m6k53k3M7J11R4j5p5k39J38J0J9R7r4k19J31L58l23K43k16j17
3555a76L07j42K07l9n18L51LP0j35J06M9k77O4J67K1J2j44K3K00N6k1k50P0r8
3579i4j26J58R0J5j60j46M26j4m39R8q8K97Rj2j94Q9K44j53J20k80lp3J52R8P2
$$ plain form
3604 86 264 29 -208 -41 224 216 -159 35 -5 -243 -154 139 148 132 274 -273 -335 -34 35 -101 -53 -71 141 4
3628 4 -153 62 -238 -64 42 60 -179 150 -72 71 -190 91 42 -3 65 29 -176 -251 148 -214 -60 -102 -220
3651 -220 108 -142 -255 -53 39 53 -107 -223 108 0 127 -96 13 127 31 -25 2 11 -99 37 77 -105 90
3674 90 -171 -92 -73 -26 -76 -213 -41 112 -1 76 -120 109 69 71 135 -115 320 228 -67 -121 110 -70 2 -58 224
3699 224 -37 129 67 -18 -90 -142 42 -331 -37 229 -196 44 -7 171 147 -137 73 -137 -125 62 43 -172 -19
3722 -19 94 35 111 105 -82 -111 -101 -106 -150 -240 -56 208 2 67 253 -271 45 -202 40 -18 129 122 100 61 145 63
3748 63 -134 -123 87 2 -219 108 28 88 109 39 -65 -158 323 67 75 -212 29 334 -30 -104 -21 -3 -44 71 143
3773 143 -148 17 -96 115 81 134 27 -169 297 152 15 5 206 -125 66 14 -161 -130 31 -56 105 -4
$$ packed form
3604H6J78k35k37J67K65ql75J94m0k38Q9K93Rj6J42n47o2L01O9j36M8j8K12j37
3628Dj57K15l00J74J06J8k39L29k22J43k61K81m9m5O8l6k05p5L99l62J54m2j18
3651b20L28k50j13K02R2J4j60j16L31j08J27k23J09J14r6n6K7Rj10J36M0j82J95
3674I0k61P9J9M7n0j37J72J53j13P7j96K29m0KO4k50M35r2k95n4K31j80P2o0K82
3699B24k61J66o2q5p2n2J84l73K94K66m25K40n1J78k4k84K10k10J2J87j9k15J53
3722a9J13n9P6oj87k9J0nm4r0J84K64k06O5J86n24L16k47K42n8J47pk2l9Q4q2
3748F3j97J1K10q5k21L27q0O0K1p0j04r3M81k56Qk87K41L05l64p4Q3J8m1J15P2
3773A43k91J65j13K11l4N3j07j96M66j45j37j0K01l31J91n2j75L1J61q7J61j09
$$ plain form
3795 -4 -252 -57 -189 -58 55 172 -278 60 -58 -133 277 -165 -56 -62 172 129 63 -32 5 102 -80 -80 406 -90
3819 -90 -34 150 169 -2 -24 120 -130 209 -134 -149 -173 216 -202 89 -42 -17 55 -9 -45 -128 -122 -8 -2 118 -259
3844 -259 -62 34 -186 5 -272 111 9 253 -23 -57 -37 203 70 175 -272 59 -113 -154 -31 101 -90
3865 -90 -90 215 35 -25 -187 31 -180 7 65 -108 217 -9 49 72 -14 54 -100 -170 -183 -50 -96 161 100 -153
3889 -153 174 44 283 391 -52 222 262 158 299 -22 -169 64 -22 -154 17 73 -150 170 -61 98 201
3910 201 -54 99 241 15 -155 -134 -148 137 81 -109 -92 -127 -199 160 -38 -113 41 16 -139 -141 15 90 -255 15
3934 15 143 370 35 135 -13 71 -124 -16 27 -9 71 -16 -90 -49 -172 45 1 -253 -62 -115 14 -65 117 164
3958 164 119 -211 111 157 -174 -116 -133 -30 64 61 57 -140 -127 28 174 -79 -69 -8 -118 52 63 161 256 197 134 -12
$$ packed form
3795dk48J95j32J31J13J17m50L38j18p5M10m42J09oK34m3o6r5L7R7j82%M86m96
3819i0N6J84J9j71k2J44k50L39l43j5k4L89m18K91j31K5P2o4l6q3OJ14OJ20l77
3844b59J97R6k20J91k77L83j02K44k76l4K0K40j33J05m47L31j72m1J23J32j91
3865i0%L05j80o0j62K18k11J87N8j73L25k26N8K3q6O8j54p0j3J33m6K57o1k53
3889a53L27j30K39J08m43K74M0j04J41l21j47K33q6j32J71N6k23L20k31J59J03
3910B01k55J53J42k26j70K1j4K85n6j90J7l5p2L59j98p5J54k5j55kJ56P5l45K70
3934A5J28K27l35J00j48Q4j95J08M3l6Q0q7p4M1j23K17m4k54J91n3J29p9J82M7
3958A64m5l30L22M6l31N8j7J03R4lmj97J3J55J46k53J0O1j10J70J1R8R5n9o3j46
$$ plain form
3984 -12 80 -173 229 -123 266 -153 217 -21 -177 200 -234 -52 -235 -65 48 153 286 -50 -210 -35 65
4005 65 426 156 20 4 119 -58 262 10 -48 116 19 -125 -31 -175 -121 247 -116 -21 -98 -32 -198 5 77
4028 77 25 11 -93 134 -81 34 -192 281 -134 -60 221 79 75 108 -152 0 -140 224 44 -183 -230 -68 150
4051 150 81 -95 -164 -106 138 -27 -59 199 -170 187 76 -95 -30 29 38 103 -65 -117 58 82 193 209 -21 74
4075 74 -244 44 -94 47 -262 -33 107 36 -23 212 101 -315 97 0 107 42 -65 159 -219 0 -67 -73 -61
4098 -61 -40 66 -38 -25 -71 104 130 -62 161 -95 42 -134 -27 -3 -230 -23 68 -177 172 -25 -208 87
4120 87 261 177 -80 54 -8 -364 -131 -39 -189 19 167 59 115 37 -37 108 76 -247 -39 115 -192 86 39
4143 39 -39 -71 196 -54 239 -23 113 -60 8 45 12 -15 -46 -11 271 137 -18 -85 15 -148 -193 -2 -28 -72
$$ packed form
3984a2R2k53M02l52L89m19L70k38j56L77m34J82j83J70J13J05J33l36j60J75J00
4005F5L61k70j36j6J15j77L20k52n8J64r7j44R4j44N4L68l63R5p7O6j66K03P2
4028G7n2j4j04K27k15J15k26M73m15P4K81j42mL3k60J52j40L64j80k27m7J62K18
4051A50o9j76o9N8K44j65l2K58l69L57j11j71O5N9RO5j68n2J75K4J11J6k30R5
4075G4l18K88j38J41l09K29J40p1n9K35j11m16M12r7J07o5j07K24l78K19o7oJ2
4098f1K1J06j04J3m6J75K6j92K23k56J37j76J07K4k27K07R1k45L49j97j83K95
4120H7J74q4k57J34o2l56K33R2j50K08J48j08N6p8p4J45l2l23K08J54l07K78m7
4143C9p8l2K67k50K93k62J36j73O8L7l3k7l1L5K82j34j55o7J00j63m5J91k6m4
$$ plain form
4167 -72 71 -72 -93 34 -73 -23 -79 40 188 -79 114 47 -49 -117 104 28 -46 -202 236 -37 -112 56 -55
4190 -55 -12 -88 104 94 -128 8 30 232 -1 110 -101 -66 145 74 95 116 -97 236 15 -156 137 1 314
4213 314 92 78 -87 -28 37 -37 -110 -46 182 43 153 -142 -153 339 38 272 280 -85 -271 20 -103 -135 -5
4236 -5 -255 104 -181 32 22 -19 126 -60 202 -63 -37 150 -60 155 154 -48 -108 -31 16 60 240 -34 114 261
4260 261 14 -60 82 40 -167 -97 43 75 222 -175 308 -315 -75 -78 -75 63 0 -109 -19 -200 101 -251 106
4283 106 25 -24 -47 -17 138 -101 -72 -309 -74 -50 101 29 32 -44 11 -150 233 175 -10 -56 -166 -17 271 58
4307 58 -32 -43 -5 -61 -173 -95 110 -51 175 100 124 55 -150 67 225 -59 -13 2 -79 -29 52 11 -100 -190 3
4332 3 -105 348 66 7 58 308 -76 -85 -89 -78 106 -99 -52 94 -135 -97 153 115 139 -167 -67 -77 -252 45 -26
$$ packed form
4167g2J43j43k1J27j07N0n6J19J48k67J93o7r6o8K21p6p4j56M38k73p5J68j11
4190e5M3p6J92j0k22J36K2K02k33J11k11L5K11p1K1K1k13L33k21j71K93j36L13
4213C14k22j4j65N9O5p4p3O4K28j39J10k95j1M92l01K34Ql65j86K91j23l2J30
4236ek50L59k85K13j0m1J45j86K62k65K6J87k10K15jk02o0P7M7M4J80k74J48J47
4260B61k47p4J42m2k07P0J40L2J47l97M83o23K40lLJ38o3j09R0j81L01l52L57
4283A06q1m9k3L0J55k39K9k37K35K4J51p2Lp6N5j61L83n8j85m6j10J49K88k13
4307E8r0j1L8n6j12P8K05j61K26p5K4o9k05K17J58k84M6J5q1N0Q1m1j11r0J93
4332Cj08M53k82n9N1K50l84rmJ1J84k05M7J46k29L8K50l8K4l06J00j0j75K97p1
$$ plain form
4357 -26 -125 -201 -246 -50 -76 -4 -68 53 50 8 139 201 16 -179 -150 -32 4 29 138 -76 -58 -78 288 74 -225
4382 -225 168 -7 212 -49 21 -15 -215 48 18 230 196 -251 315 41 -95 3 -128 35 -73 -216 -128 -129 -21
4405 -21 -112 69 157 -143 57 10 50 -4 -24 220 30 -35 188 127 -124 -130 185 -237 -71 132 283 223 -30 179
4429 179 -154 -67 -9 323 15 108 87 -4 -126 66 -25 -11 290 159 -105 7 96 3 -8 -11 -225 59 -3 -150
4453 -150 -194 179 -171 -9 70 -152 -12 -255 -208 72 80 53 -171 -109 -106 -19 109 178 159 -33 0 62 -49 -266 -25
4478 -25 25 188 -26 -272 200 -116 -42 -102 340 -199 -28 -119 50 -82 111 2 -37 340 -91 -14 -121 46
4500 46 43 212 -234 77 -9 50 98 150 53 -54 -125 -37 -87 128 -52 -180 18 -19 204 209 12 4 -186 51 -27 137
4526 137 -65 128 -105 -6 -40 -4 131 101 -56 46 -18 -48 56 57 -21 -175 -242 63 68 44 -37 166 -188 234 253
$$ packed form
4357b6r9p6m5J96k6P2o4J21lm2J31O2j85j95K9J18L6K5J09k14J8k0L66k14k99
4382b25L93j75K19k61P0l6k00K63l0K12l4m47N66k74j36R8j31J63j08j43Q8jJ08
4405b1r1J81Q8l00K00m7M0n4k0K44j90o5K23o1k51oL15m22J66K03J51o0k53K09
4429A79l33Q7N8L32l08R3k1r1j22J92r1J4L01j31k64J12Q9r3j1lk14K84o2j47
4453a50m4L73l50J62P9k22J40k43M7K80Qk7k24O2LQ7J28O9j9j92L3O2j11k17K41
4478b5N0J63k14k46M72l16P4o0M42n39J71r1J69j32J93j09l9L77m31P7j07J67
4500D6lJ69m46L11q6N9M8N2r7j07p1Q8n0K15j80j28J98l7K23Nj97qj90K37p8J64
4526A37k02J93k33R9l4L6J35l0j57J02o4l0J04Jp8j54o7L05Nk4q1K03l54M22J9
$$ plain form
4551 253 -131 7 -14 97 -60 91 -185 -75 -41 94 117 74 43 -210 195 -69 -17 -118 80 86 235 -84 86
4574 86 -34 94 -72 178 -58 -32 -133 -166 -31 71 -42 -1 -115 12 167 -150 -15 -160 -57 172 97 89
4596 89 -67 -94 75 -18 -43 -180 -16 246 135 -80 -102 -91 -96 -143 -62 -300 -42 -35 295 199 37 134 -91 128 104
4621 104 28 31 -6 -19 5 198 69 -215 66 5 111 -222 -90 -468 -154 -81 65 33 -129 15 43 -203 7
4644 7 104 -145 57 -197 -149 115 -71 34 -72 71 48 230 89 41 145 7 128 -66 136 -61 -23 -19 -291
4667 -291 -166 26 -82 68 54 73 -194 -215 162 -70 301 -85 120 -263 -173 -131 57 -229 -1 80 -241 147
4689 147 155 -107 8 8 102 115 36 172 230 -46 -32 -65 -82 -164 -114 -111 255 -2 -169 -108 14 36 165 245 -5 -12 27
4716 27 -24 -43 -2 -79 89 -50 -192 163 -293 31 273 -256 45 94 -187 -167 -58 79 21 -52 69 -40 -47 73
$$ packed form
4551B53l84J38k1J11j57J51k76J10L4J35K3m3l1k53M05k64N2j01J98OJ49l19J70
4574H6j20J28j66K50k36K6j01l3J35J02j13M1j14J27J55l17J35j45J03K29p5q
4596H9j56k7J69r3k5j37J64K62j11k15k2J1nm7Q1k38K58PL30r6j62R7k25K19k4
4621A04p6Ll7j3K4J93j29k84K81o1J06l33J32l78L14P3J46l2j62J44K8k46K10
4644GR7k49K02k54M8K64j86J05j06J43k3J82j41m8J04j38J21j94K02j97L8Mk72
4667b91J25J92j08J50j4J9k67k1L77k32L71l86K05l83R0M2J88k86K28Q1l21L88
4689A47Qk62J15%R4J3p9J36N8k76J4l3j7q2N0LL66k57j67O1J22K2J29Q0k50pL9
4716B7n1j9M1p7J68j39j42L55m56L24K42n29L01M9k81K0J09J37n8p3J21j09pJ20
$$ plain form
4740 73 -111 80 -23 56 140 -79 -37 -12 -43 -310 -138 103 174 -12 -66 67 -112 179 -11 -2 -1 -297 254 -180
4764 -180 -49 -65 157 135 -320 11 130 -77 119 12 102 -48 -184 45 -108 201 194 106 42 -46 91 204 194
4787 194 -183 89 49 -73 29 -93 131 79 44 74 180 76 246 -43 -128 -95 142 -30 -109 43 -276 -31
4809 -31 -91 -237 -65 55 112 -6 -69 -29 5 49 81 -43 0 -39 40 21 -22 -137 -58 119 40 -6 56 184 7 242
4835 242 -35 0 -75 -154 -136 149 243 -40 -177 136 148 -160 396 -109 393 68 60 -40 -70 -36 -132 25 52 273
4859 273 161 -71 83 53 61 43 44 -224 185 -53 -96 100 221 -394 206 -201 -225 297 -177 77 82 57 58 136 173
4884 173 -155 14 216 -103 -109 -70 47 -1 -16 -89 -94 189 -30 166 -99 -24 158 179 -80 -27 145 -198 -3 -141
4908 -141 -60 23 -10 106 -136 0 168 57 -74 147 -55 161 -96 99 -193 78 -89 105 -155 -46 43
$$ packed form
4740G3j84J91j03P9Q4k19M2K5l1k67J72K41P1j86n4J33j79K91j90RJk96N51m34
4764a80J31j6K22k2m55L31J19k07J96j07R0j50j36K29j53L09pq8o4q8J37J13j0
4787A94l77K72m0j22J02j22K24n2l5L0J06j04J70k89q5L3K37j72p9J52l19K45
4809c1o0j46J72J20N7j18o3M0L4M4L2j24M3l9P9j9m3j15P9J77p9m6O2J28j77K35
4835B42k77L5p5p9J8K85R4k83j37L13J2l08N56n05N02l25qj00l0L4r6J57K7K21
4859B73j12k32J54l0Qj8Jk68M09k38m3J96J21o15O00m07k4N22m74K54Nk5JP8L7
4884A73l28J69K02l19oL9J17m8j5p3nK83k19J96k65P5J82K1k59N3J72l43J95j38
4908a41Q1Q3l3J16k42J36J68j11j31K21k02K16k57J95k92K71j67J94k60J09Q9
$$ plain form
4929 43 76 114 138 -452 22 -78 -161 -141 -177 -143 42 337 9 50 -87 -128 34 -112 -103 168 69 42 -40 -3 -190
4954 -190 52 -28 24 -23 124 45 13 -43 -30 28 -38 -75 -108 86 85 -84 61 27 -87 19 -102 -387 112 -60 6
4979 6 -198 -80 -111 -84 -40 4 -137 10 90 -84 -37 -123 248 12 -76 -255 74 54 395 -66 175 -6 -344 70
5003 70 111 -99 102 146 -50 34 -45 -233 195 -2 -125 309 212 170 -6 130 -222 62 -2 -76 -129 27 124 252
5027 252 141 7 149 12 -86 138 -266 -152 -57 -145 -39 -96 -28 -220 -35 -43 114 340 -284 24 23 104 94 115
5051 115 -165 -59 -148 299 0 -80 -177 17 -104 -70 228 -100 156 -58 -123 114 -166 28 99 -51 -56 110 220
5074 220 -82 34 -51 -16 -77 -296 182 -191 -114 128 -101 -145 -168 176 -90 -220 -236 -215 89 32 147 -6 -122
5097 -122 -180 -89 6 -23 83 122 142 -103 379 -108 149 174 0 119 -83 5 156 -130 -19 33 64 72 -57 -203
$$ packed form
4929D3L3L8K4n90M74j00q3K0l6L4J85K95l28M1j37m1J62j46RK71r9k7q2L7j87
4954a90K42q0N2m7J47p9l2n6J3N8o6l7l3J94jj69J45l4j14J06j21k85M99j72O6
4979Fk04J18l1K7M4M4j41J47Q0j74M7q6L71k36q8j79L29k0L41m61K41j81l38M14
5003G0M1k10K01M4j96Q4p9j88M28j97j23M34r7m2j76J36l52K84o4p4n3J56R7J28
5027B52j11j34J42j37r8K24m04J14R5q8J06n7O8j92J85qJ57K26o24L08jQ1j0K1
5051A15k80J06q9M47k99q0r7J94j21L4K98l28K56k14o5K37k80J94P1j50nJ66J10
5074B20l02J16q5L5o1k19M78l73P7K42k29m4k3L44k66j30j6K1L04n7J15j53j16
5097a22n8R1R5k9J06L9K0k45M82m87K57K5j74J19k02Q8J51k86J11N2L1Qj29j46
$$ plain form
5121 -203 84 153 -127 -202 48 -139 -322 163 91 91 47 171 -100 60 -178 19 16 -149 -116 -174 54 -191 80
5144 80 -96 22 124 -127 -96 223 24 -113 -165 -131 -285 -212 240 53 186 -32 47 -94 -115 -95 -72 -160 224
5167 224 96 19 82 183 237 -59 18 -114 -54 237 -283 115 -28 -128 -14 53 193 35 21 -30 -138 -2 196
5190 196 6 -34 -29 101 -39 -298 180 176 210 13 81 -255 14 219 216 159 -160 -41 93 3 -25 58 -29 -5 143
5215 143 -9 -256 -237 40 -2 -122 -56 160 38 -144 -4 -84 1 -142 -170 -290 -46 124 131 -84 -241 -77 144
5238 144 -61 -78 115 -21 -15 -10 -228 -66 -2 -139 -167 32 -277 124 -93 -332 -153 -90 105 277 -69 -189 128
5261 128 -122 174 -19 94 64 192 8 113 -47 -104 75 -37 -99 89 55 93 35 -162 -215 -45 -138 139 46
5284 46 18 70 -5 212 25 -71 51 -165 -60 -89 5 11 -121 139 380 -55 231 -160 104 -150 -270 -151 12
$$ packed form
5121b03K87O9k80p5K50j87j83M85p2%m4J24k71J60k38J97lj65L3n8K28k45K71
5144H0j76J18J02k51L1L19j99j37n2L4j54P3M52j87J33k18P9j41k1K0K3q8L84
5167B24j28p7O3J01N4k96P7j32O0K91n20L98j43j00J14O7J40j58j4n1j08J36J98
5190A96j90m0NJ30j40k59M78mL4j97O8l36K69K05ln7l19J19J34r0k8Q3q7K4J48
5215A43j52k47J9K77m2j20O6K16j22j82J40q0Q5j43k8j20K44J70Pk15j57J64K21
5238A44k05j7J93j36ONk18J62O4j37k8J99l09M01k17k39J79O3J95J72l46j20L17
5261A28k50K96j93J13l0J28j84J05j60n7J79j12o2J88l4L8n8j97n3J70r3K77r3
5284D6k8N2p5K17j87r6J22k16J05k9R4Oj32K60K41m35K86l91K64k54j20J19J63
$$ plain form
5307 12 11 -9 187 0 138 298 -83 -144 -141 -30 -101 258 110 -136 86 21 195 10 36 -66 -24 49 -66 -207
5331 -207 90 -183 111 206 2 52 61 -223 118 -39 101 164 -3 231 -217 -45 -133 30 -222 37 133 199 -172
5354 -172 147 96 28 -83 -268 -103 44 40 -238 106 206 116 -83 -72 197 85 235 180 26 -253 -89 312
5376 312 31 -24 9 45 159 137 274 -8 102 -12 36 53 48 23 -32 295 -134 -60 -5 -193 112 -7 -56 127
5400 127 93 29 -67 86 183 13 -58 10 -71 311 -120 16 -181 -265 178 16 50 96 107 -191 -54 62 -43 -51
5424 -51 -99 81 202 109 -63 -207 213 -118 15 -236 142 -81 224 102 -45 39 -157 6 -209 107 -89
5445 -89 -1 -131 13 -61 37 -67 36 -15 -119 -21 37 400 15 -65 -84 -233 98 -194 -221 86 -121 70 -56
5468 -56 -4 -455 -250 31 7 -268 75 228 -58 83 -52 -171 -66 -189 -207 -25 -57 172 16 -19 124 157
$$ packed form
5307A2jk0J96j87J38J60l81o1LJ11p1L59j48k46K22o5J74j85K6j02M2P3j15j41
5331b07K97k73K94R5k04N0Rk84L41j57J40O3j67K34m48J72q8J63k52K59R6O6l71
5354a72L19n1o8j11j85J65J47mk78L44J00r0j99J1K69j12J50n5j54k79J64M01
5376C12k81n5L3L6J14k2J37k82J10j14M8J7nk5n5L27m29P4N5j88L05j19m9J83
5400A27l4o4r6J53R7j70p1O8q1L82m31J36j97q4M43j62L4M6J1k98J37J16j05q
5424e1m8J80J21r3j72j44M20l31J33k51L78k23L05j22j47Q4j96J63k15L16j96
5445h9Q8j30J44p4R8j04J03n1j04R8N8L63l85q0j9j49L31k92k7L07k07J91j26
5468e6N2m51K05K81k4k75L43J53k86J41j35j19J05j23j8J82l2K29j56l5J43L3
$$ plain form
5490 157 82 139 38 121 -103 53 62 12 35 12 8 61 132 -159 -31 225 -60 100 -9 -69 318 -70 42 32 -40
5515 -40 128 158 -18 73 53 105 293 -66 38 -67 182 21 69 -74 -90 130 -11 -67 -140 66 17 -175 2
5538 2 83 -88 126 12 -75 34 -31 34 -12 25 229 82 -306 -10 133 58 102 75 -188 114 5 -38 -248 209
5562 209 62 -41 148 -103 33 2 -76 -108 166 121 -51 22 -194 -62 -62 168 38 -126 17 -180 -180 -146 236
5585 236 144 -108 213 116 180 114 -79 278 157 205 -95 154 116 -78 98 112 -78 23 -30 182 -74 29 -65
5608 -65 -163 -127 22 -98 3 56 68 47 130 2 71 -85 -266 330 -119 165 5 49 75 -34 328 132 19
5631 19 -226 79 137 183 -48 -153 11 1 96 54 -200 -132 87 224 -117 47 -116 205 138 33 112 -4 -30
5654 -30 -122 -86 -74 -86 6 127 -29 -10 215 -47 -42 177 -76 -13 -34 -160 -37 -57 -305 -55 113 270 16 1
$$ packed form
5490A57p5N7j01Q3k24J56Rn0K3k3mN3P1k91J28K56k85J60j09o0L87l88J12j0p2
5515d0J68L0j76R1k0N2J88l59J04j05K49j61M8j43j6K20j41n6p3K06m9j92J77
5538BQ1j71K14j14q7J09o5O5m6L7K04j47l88K96J43p5M4k7k63L02j09m3k10M57
5562B09j47j03J89k51J36l1p8l2K74m5j72P3k16J32%K30j30j64J43j97%L4L82
5585B36r2k52L21r7O4o6j93L57j21M8l00K49l8j94J76J4j90J01n3K12k56J03r4
5608f5r8L6J49j20J01N3J2k1Q3j28O9j56j81N96m49K84j60M4K6j09L62j96j13
5631A9k45L05N8M6k31j05J64j0R5m2k54O8K19J37l41J64j63L21o7j05P9j16k6
5654c0r2L6J2j2R2J21j56J9K25k62NK19k53O3k1j26J23k0k48K50J68J57k54j5
$$ plain form
5678 1 137 -423 -77 -216 -53 -55 133 -91 -137 11 228 29 48 -52 78 -203 230 -118 167 -68 49 -17
5700 -17 49 -57 164 -7 -21 11 105 110 31 0 115 99 -10 -2 -348 -7 -5 4 -51 269 36 24 112 -36 -23 -161 29
5727 29 76 -98 64 131 117 14 146 -29 247 116 152 -17 -214 -10 -2 209 -330 70 57 -58 -119 31 -129
5750 -129 107 -106 -328 113 -4 134 -61 -190 93 161 -141 323 92 -67 -11 -317 -175 -62 -123 140 -1
5771 -1 -228 75 -88 239 -28 -100 95 186 -11 121 -24 -5 91 -28 6 -52 132 -43 58 158 80 -20 91
5794 91 3 97 -50 139 -64 -131 -101 -2 -80 -82 -74 -21 191 -178 -182 18 -155 -19 19 -180 86 43 -103 -10 176 219
5820 219 110 -26 -61 8 -178 -26 0 -183 16 121 -92 -16 -138 -21 207 -162 151 170 143 -28 68 136 19
5843 19 105 -46 25 110 -150 151 -27 99 188 -16 -64 8 160 -304 45 -59 209 -158 9 -72 -255 -50 -44
$$ packed form
5678AJ36n60L46j39J63kJ88k24m6J48K17j99J9j00J30k81M33l48K85k35J17o6
5700a7O6j06K21j71j4L2R4Np9l1J15j6j09Ql46L41KRn5L20k33j2Q8j48J3j38J90
5727B9M7j74J62O7j4j03J32j75K76j31L6j69j97K04QK11n39M00j3j15o1J50j60
5750a29K36k13k22M41j17J38j95j29K83O8l02M64k31j59N6l06J42J13o1K63j41
5771ak27L03j63L27k67p2J95R1j97J32j45J9R6j19L4n8J84j75J01J00p8j00J11
5794I1q8R4j47J89k03o7L0R9p8kQN3K12l69mK00j73J36L8j99K66m3j46R3J86M3
5820B19j09j36l5O9j86J52K6j83J99J05k13P6j22J17K28l69L13J9k7j71R6O8j17
5843A9Q6j51P1Q5k60L01j78J26Q9k04m8P2J52m64L49j04K68l67J67q1j83K05O
$$ plain form
5866 -44 -153 -4 115 124 174 -14 -7 -10 -210 130 -212 362 73 102 -161 -61 204 39 -280 96 211 -57 128
5889 128 76 102 -136 -127 76 -70 26 177 -94 -10 130 4 -59 -128 16 91 82 127 25 230 -1 70 -104 75
5913 75 67 129 -298 -217 20 75 25 18 -5 127 -98 -34 -75 33 243 -29 -174 -30 172 -82 258 189 -100 236
5937 236 -245 -58 -146 7 124 -128 -108 -165 -16 61 40 -31 34 76 -66 -104 -134 -142 -45 -121 167 -147 -182 -47 -148
5962 -148 -116 -147 55 2 -15 119 -19 76 55 -88 -109 184 -99 63 -2 45 9 207 94 -62 105 -330 -234 -320
5986 -320 90 -48 33 -123 63 -97 -241 -132 266 107 -8 58 193 -60 73 46 90 118 -136 -288 59 292
6008 292 -175 -45 70 -184 8 24 -155 81 -265 -54 -144 -70 122 145 96 13 156 176 -125 -136 4 -56 202
6031 202 238 81 -2 2 60 -62 -18 126 328 129 -92 2 145 14 98 143 -54 110 -169 260 -230 -109 281
$$ packed form
5866d4j09J49J19RN0j88Plk00L40l42N74k89K9k63J00K65j65l19L76J15k68J85
5889A28n2K6k38RK03j46R6J51k71Q4J40j26o3o9J44P5rM5j02K05k31P1j74J79
5913G5qO2m27Q1K37N5n0pk3J32k25O4m1J08K10k72j45J44K02k54L40o9k89L36
5937B36m81J87q8J53J17k52K0n7J49P7k1p1O5M2j42l8l0qR7p6K88l14l5J35j01
5962a48L2l1K02n3j7J34j38R5k1j43k1K93k83J62o5M7l6J98j13j56J67m35R6q6
5986c20M10j38Q1j56J86j60j44J09L98j59j15O6J35k53J33k7M4K8k54j52L47K33
6008B92m67J30J15k54J92J6j79K36l46K11r0P4J92K3m9q3J43K0l01j1J40o0K58
6031B02L6j57q3MN8j22M4J44K02j99k21R4J43j31Q4M5j97J64k79M29m90J21L90
$$ plain form
6054 281 86 -5 52 -29 -44 -149 73 -4 278 -28 153 205 18 -95 2 -70 -47 -388 -196 -247 106 -40 1 -65
6078 -65 -286 -99 431 37 -247 -126 57 67 75 247 -23 225 63 87 129 210 71 -120 -88 50 -18 -59 -16 -70
6102 -70 -83 88 122 1 -37 -38 -119 149 -342 -168 13 -29 77 107 -7 -29 35 -224 -203 -115 -136 -376 27 -203 53
6127 53 117 -332 -153 105 5 -136 226 -115 -153 -35 1 -7 27 217 114 49 55 -85 136 68 303 -406 -342 -56
6151 -56 105 55 2 -35 -265 100 15 -151 13 112 166 -128 11 -148 188 -65 138 67 30 -124 16 44 -44 -127
6175 -127 70 -121 235 -22 85 19 -80 -119 229 144 -79 141 10 -104 -221 255 -78 -94 244 32 -17 52
6197 52 217 -132 128 -39 120 106 -65 286 -303 235 83 -20 -283 -202 -71 -158 -163 -321 51 181 -40 178
6219 178 -146 37 -50 -68 200 -89 -136 -116 115 74 218 19 -53 -45 92 -109 173 112 -232 100 -111 -196 79
$$ packed form
6054B81j95r1N7q1j5j05K22p7K82l06J81N2j87j13R7p2K3l41J92n1L53j46M1o6
6078f5k21J87N30l94k84J21J83J0QJ72k70K48j62K4M2Q1j39j91L2J38o8m1M3n4
6102g0j3J71L4j21l8jq1K68m91J74J81m2J06L0j14k2O4k59K1Q8k1k40M03k30K56
6127E3O4m49J79K58j00j41L62l41l8J18L6qL4J90j03o5Oj40K21o8K35p09O4K86
6151e6J61n0n3l7k30L65q5j66J64R9N4k94J39j59L36k53K03p1l7j54J40K8q8q3
6175a27J97j91L56k57J07o6r9l9L48q5k23K20j31j14j17M76l33j6L38k12m9O9
6197E2J65l49K60j67J59j4j71L51n89N38j52j03k63Q1J31q7nj58L72J30k21K18
6219A78l24J83q7j8K68k89m7K0K31m1J44j99p2QJ37k01K82o1l44L32k11q5K75
$$ plain form
6242 79 115 -107 -185 188 92 79 41 37 149 26 -170 122 -176 4 133 26 14 -357 -177 -111 86 128 80 99
6266 99 320 72 35 132 -52 -113 75 150 -8 -55 -105 -5 -10 -17 -12 -8 -65 55 -104 4 9 143 -24 136 457 26
6292 26 98 -159 -58 -11 -126 -114 160 15 -27 -299 272 109 -20 60 -7 -7 9 167 83 215 113 -89 188 -83
6316 -83 -39 -65 -80 -50 117 -1 -192 -51 -123 -70 -44 -77 154 -170 -154 -102 -126 -90 -8 -42 46 -289 79 162 -201 78
6342 78 301 115 39 26 -88 -75 135 45 42 19 123 24 73 -202 -245 163 -216 -56 -139 -17 29 -82 -194 -199 -188
6367 -188 -92 -34 337 -21 70 -38 -302 137 42 -178 112 39 55 62 -154 -70 -22 -15 99 71 -11 133 -5 202 -102
6392 -102 112 -65 14 -116 -154 -127 228 24 -157 -66 100 -69 -85 105 13 -117 5 116 -35 123 260 73
6414 73 35 102 -298 -15 -214 74 15 -74 82 -203 -70 91 61 -107 24 41 74 -78 -148 -42 54 -266 -21
$$ packed form
6242G9L6k22p8L73r6j3l8mJ12j23j96K92k98J80J29j07j2l71J80O6J97M2m8J9
6266I9K21k48l7R7j84o1J88P5j58m7n0J00npNMn7J20j59J08NJ34j67J60L21m31
6292B6P2k57J01M7j15J2K74j45m2k72N71j63j29Q0o7%J6J58q4J32j02k02K77k71
6316h3M4k6j5L0J67j18j91J41p2N3K6l3K31l24J6N2k4L6Q2l4Q8l35L68Q3l63K79
6342G8K23j86p6j3j14J3K10r0lk3J04r9M9k75m3M08l79J60q3J22M6j11j12nJ1
6367a88R6N8L71l58R1j08k64M39r5k20K90p3J6Pk16Q4M8PJ14k8q2J44j38K07l04
6392a02K14j77P9j30l8K7L55k04j81R1J66j69j6J90r2j30J22J11j51J58J37j87
6414G3l8O7m00K83j99K88n9q9J56k85J33J61l0j68J31J7L3j52p0J06R6l20K45
$$ plain form
6437 -21 -238 157 203 -113 -66 261 -241 -128 165 146 146 -78 43 -179 -63 154 56 -88 87 -6 -226 63 83
6460 83 -213 -111 50 139 -199 139 -25 6 122 289 6 151 194 128 -48 -119 33 138 45 -49 -14 25 -192
6483 -192 -8 120 39 -58 25 -309 120 25 175 58 96 -56 44 -54 -297 114 8 4 -65 125 208 -33 -127 -261
6507 -261 -278 -149 -116 148 -46 103 -93 111 -61 142 173 102 1 79 -131 -253 2 23 -252 -165 -47 39 -53
6530 -53 34 -93 220 42 -43 240 -189 291 -136 38 -234 -77 170 140 -96 221 -124 52 42 -16 -190 -171
6552 -171 151 -212 -57 -85 -54 232 98 46 -83 -283 24 78 -76 -192 79 -179 -29 -200 224 271 17 28
6574 28 35 -307 -147 -65 72 321 106 -48 -137 82 -201 64 -4 98 87 68 -2 -110 -109 148 -41 -141 -56 -242
6598 -242 -62 -137 255 96 -69 -168 70 15 -105 315 -171 85 152 55 6 136 -90 -19 179 42 -31 96 2
$$ packed form
6437b1k17L95M6l16M7L27n02J13K93j9%k24J21k22J16K17r8j44J75r3k20K89K0
6460H3k96J02J61Q9l38L38j64L1J16J67k83J45M3o6j76p1J52J05r3r4L5L9k17
6483a92J84J28q1r7Q3l34M29r5J50j17L8j52J00r8k43M11j06mo9J90Q3k41r4j34
6507b61j7J29L3K64j94J49j96K04j72K03L1p1j01P8k10j22K55K1k75Q7J18Q6r2
6530e3Q7j27L13j78q5K83m29M80m27J74k72J57K47l0k36L17l45J76j0n8j74J9
6552a71L22l63J55k8L1K86j34n2j29k00L07N4j54j16K71k58J50j71M24M7k54J1
6574B8Pl42J60Q2J37K49k15j54q9K19k83K65o8J02j1j9p0j08JK57j89j00Q5j86
6598b42J80p5L92j59j65r9K38n5j20M20m86K56O7r7m9J30k26P1J98j37p3J27r4
$$ plain form
6621 2 90 -67 54 113 -11 -147 -53 -75 -9 385 78 -179 105 213 69 134 -186 -23 75 -100 -16 181 117 120
6645 120 104 -72 105 23 -64 -24 -46 -30 148 40 51 32 39 121 207 -175 190 -70 -123 1 -63 -111 152 34 271
6670 271 -38 9 96 -8 302 -29 59 -40 -44 326 50 -61 -336 79 -25 81 -158 -196 212 216 0 -37 -136 193
6694 193 -81 -113 -31 17 -69 -114 97 -22 337 -91 -100 -118 -158 37 -115 57 35 -72 102 240 0 144 286
6717 286 237 -15 -201 -132 35 198 -100 80 -157 -7 71 136 250 116 131 -39 -75 4 -36 -110 214 -111 60
6740 60 -45 165 12 -106 -48 -72 -63 -163 77 -140 38 33 11 -32 -60 -167 30 -102 -121 -99 -63 3 16 174 53
6765 53 -22 -3 77 -111 -30 38 78 231 101 -92 190 156 -9 -83 52 50 -95 -23 -195 -87 42 -72 171 36
6789 36 194 -133 -237 -94 -216 -2 -96 121 29 199 -7 70 -392 -46 93 -30 -48 151 17 -115 126 -233
$$ packed form
6621BQ8j57J21N9j24j36R4k2O6L94l07k57K84J08j44O5l20J63R8j75Q4J97o4L
6645A20j6j76J77q2q7M0k2J6J78j08J1j9PQ2Q6l82L65k60n3J24o4m8K63j18K37
6670B71l09M7Q7j04L10l31Q8r9mL70k76j11k75M15j04J06k39l8M08Mk16l7r9L29
6694A93k74l2Q2M8q6m5K11j19L59m28rj8m0J95j52J72k2j07J74J38k40J44J42
6717B86m9k52j86O9J67J63k98J80k37J50P8O5J14j34J5j70l6P9m0p4L24l25J71
6740F0j05K10j53j18N8k4Rj00K40k17J78nk2m3k8j07J97j32j9K2L6O6J3J58j21
6765E3p5J9Q0j88Q1O8M0J53j30j93K82l4j65p4J35kj45P2j72J08J29j14K43j35
6789C6J58l27j04J43j22K14r4K17r2J70k06P7m62L46J39j23j8J99j34j32K41l59
$$ plain form
6811 -233 178 -48 138 -34 157 61 95 17 -12 195 101 2 -126 55 284 -120 -42 133 -144 143 -97 -78 -60
6834 -60 -174 -56 -76 115 -79 62 -75 -173 75 -202 187 26 73 53 -32 -41 -135 86 294 237 150 -76 -26 36
6858 36 -65 12 47 95 -52 -211 95 128 -99 56 171 252 -12 -91 -88 -301 59 1 153 -42 58 -297 53
6881 53 23 198 -2 -157 -214 -36 129 -30 -213 -103 104 87 140 89 0 -24 -89 -84 103 -18 -63 -173 -33 -1
6905 -1 311 27 64 226 51 18 -57 -56 262 18 -5 198 -18 -129 131 342 251 29 -74 223 131 -1 130
6928 130 -27 -53 46 113 -44 -11 191 93 312 -127 151 101 41 189 -82 -172 -127 117 -5 -210 -114 85 165 67
6952 67 -213 77 22 -74 2 123 156 -116 -96 -73 -17 22 -191 304 18 122 -124 -74 8 22 28 -145 28 -248 -15
6977 -15 -209 374 -39 93 -50 -291 -40 -54 -87 177 -35 361 225 -5 -217 278 0 -6 -12 46 125 27 9 -100
$$ packed form
6811b33M11k26J86j72J91r6L4p8k9K07r4r9j28J81K29m04P8J75k77K87k40J9J8
6834f0j14J18k0J91j94J41j37r8K48k77L89j61M7k0q5rr4K21K08n7q7k26N0O2
6858C6j01P7L5M8j47j59L06L3k27J55J15Q1k64p9Lk13L60n8J52j95J00l55L50
6881E3l0J75k00j55n7J78J65j59j83J10K07j7N3n1q9k4o5NJ87j21m5j10J40L2
6905aL12k84L7J62j75l3p5JL18k44k3K03k16j11K60K11r1k22j03K97r2j32J31
6928A30j57k6R9O7j57L3K02r8K19m39K78n0o0J48k71r0M5K44j22k05R6J99Q0r8
6952F7k80K90n5r6P6J21L3k72K0K3N6L9k13M95k86J04k46N0Q2J4Oj73J73k76K33
6977a5j94N83m13J32j43k41K51j4l3K64k12L96j36k30k12M95k78ooN8P9r8j8j09
$$ plain form
7001 -100 176 118 196 -167 38 -13 -116 -71 201 113 -57 -247 -281 26 -187 165 -113 -74 17 -196 -123 20 -48
7024 -48 172 -6 -91 22 254 169 205 -287 -36 207 123 28 -72 72 11 32 22 -260 72 30 -58 -189 106 -58
7048 -58 -178 -1 -134 149 103 123 -71 102 -141 40 299 -22 -40 82 -80 191 -52 22 51 -98 -238 109
7070 109 86 22 47 -24 -40 -155 -176 -136 76 147 159 141 -4 152 -100 -50 47 -184 68 -134 13 123 10 172
7094 172 106 -32 -53 172 -205 169 -32 -27 -341 -54 0 73 -31 -1 -139 -83 -94 -8 23 -179 106 84 319 -117
7118 -117 -186 40 -121 -149 -243 -33 336 84 185 11 118 122 201 155 45 217 316 -228 97 -119 108 -264 -281
7141 -281 44 28 211 193 -49 232 -123 17 151 98 39 166 245 88 -216 19 90 -94 37 -141 -120 38
7163 38 -214 -114 83 95 -41 -222 -168 -29 -255 -45 24 -105 -123 -185 -9 35 -168 -58 -38 80 103 18 240
$$ packed form
7001a00K76n8P8l63K05n1j03M5K72q8j70j90l4L07k13L52k78L9R1k13P3J43o8
7024d8K20j78q5J13K32q5L6m92K51K43q4r5j00J44o1K1j0k82L32m2q8j31K95j64
7048e8j20J77j33K83m6K0j94J73k43J81K59l21j8J22j62K71k43P4K9j49j40L47
7070A09k3o4K5p1j6j15k1M0K12P1J2j8j45J56k52N0R7k31K52k02J47J10j13J62
7094A72o6j38k1K25l77L74k01Nl14K87N4P3j04L0j38N6j1Q6L1k02K85k2K35m36
7118a17o9K26j61k8r4K10L69k52J01j74J07MP9m6j10J72R9n44L25k16K27l72j7
7141b81L25j6J83j8k42K81l55J40J34n3n9J27P9j57l04K35P1j84J31j78K1J58
7163C8k52J00J97J2j36j81N4J39k26K10O9j29j8o2J76M4k03J10K0J18K3q5K22
$$ plain form
7186 240 -74 -280 15 44 22 116 16 -65 -46 159 -59 90 75 -230 63 -4 -102 -92 107 81 118 -171 -130 53
7210 53 14 97 -188 -92 -78 115 -40 121 -251 -278 -207 24 -49 -29 126 -35 -57 -37 174 46 -2 -393 -38 43
7234 43 -51 110 100 80 123 -5 197 -4 -44 225 162 1 -17 -36 187 84 95 -114 67 172 -187 57 72 232
7258 232 -98 190 -18 96 -32 115 116 -147 131 64 -77 -26 42 -5 -192 -135 64 15 64 -24 91 19 -219 -51
7282 -51 -336 54 43 -179 24 -161 -72 202 -366 -74 3 -175 343 -215 -101 -47 -89 -155 67 -12 -121 -128 28
7305 28 117 -13 114 131 -242 -122 130 -80 117 107 -69 141 17 -133 101 -109 -114 -150 251 146 87 80 -6 138
7329 138 -84 -125 -4 -27 23 -63 187 -70 124 106 379 -236 -115 -284 -91 213 171 135 -171 66 -57 -230
7351 -230 65 73 -104 34 -6 97 -23 -31 56 26 -103 102 -224 -31 -149 309 53 61 40 182 6 -100 -114 -125
$$ packed form
7186B40l14k06K95K9k2R4j00q1J9K05k18J49j5l05K93o7r8J0J99k6L7k89M1J83
7210E3l9Q3k85R6J4J93j55J61l72k7P1K31p3K0J55j61k2K0K11j28m8l91L55Q1
7234D3r4J61j0k0M3j28K02k01m0K69o3j61j8j9K23j03J1k09J81J05l59K44J5J60
7258B32l30K88k08J14j28J47Jk63K78o7j41N1O8m7j87N7J99m9M9q8J15p2k38J68
7282e1k85L90j1k22K03j85Q9K74n68K92P7j78N18n58J14N4m2o6K22p9j09pJ56
7305B8Q9j30J27J7l73J20K52k10J97j0j76K10j24j50K34k10nl6M01j05n9pq6J44
7329A38k22m1J21k3N0q6K50k57J94j8K73o15J21j69J93L04m2l6l06K37j23j73
7351b30K95Qj77J38m0J03j20qQ7l0j29K05l26J93j18M58k56Qk1J42j76j06j4j1
$$ plain form
7375 -125 10 -228 -118 91 107 13 11 89 26 -100 80 49 36 -8 16 -159 127 -63 106 20 -106 110 114 30 16
7400 16 83 60 -105 -30 -146 141 212 -7 69 -52 27 -3 -30 123 -42 -179 -71 88 -61 -117 -186 12 75 -137
7424 -137 277 -37 86 102 -14 158 -17 -365 -22 60 -292 -33 -77 -115 40 27 -160 -160 89 209 -18 36 -39
7447 -39 -27 14 14 16 174 151 99 -5 -55 -186 -80 -124 53 -233 -19 71 193 219 -4 192 -56 233 62 -13 182
7472 182 -86 34 114 -102 251 -73 98 -53 41 124 -34 -134 -57 -122 120 -51 -16 -309 25 77 73 5 175
7495 175 -54 -196 -131 216 -178 -77 32 167 148 98 108 108 -16 -129 -96 35 164 -33 -67 54 12 239 -161
7518 -161 28 -4 -65 -39 89 123 -2 76 10 2 154 187 221 -114 195 183 -156 -309 61 -6 3 -22 -28 19 -38 161
7544 161 -224 -299 53 -215 92 8 -9 -159 -83 126 59 -61 361 -67 -104 133 -28 -92 -99 2 -18 44 52 -59
$$ packed form
7375a25J35k38J10K09J6r4kP8o3j26J80l1j3m4K4j75K86j90J69q6j26K16Mq4j4
7400A6O7k3j65P5j16K87P1k19P6j21P9l0k7J53j65j37J08J59j49n6o9J98O3k12
7424a37M14l14J23J6j16J72j75l48L43Q2l52K59m4l8J55j3j87%K49J20k27N4p5
7447c9J2M1%KJ58k3n2j04n0j31J06m4J77k86K14R0J22K6k23J96k48K89j71p5J95
7472A82k68J20Q0k16L53l24J71j51R4Q3j58j00P7o5K42j71L5k93L34N2mo8J70
7495A75k29j42O5L47l94J01J09J35j9n0J0%j24j13L3J31J29j97l4J21m2K27m00
7518a61J89l2o1K6J28L4j25P8o6qJ52L3L4l35L09j2l39j53L70o7Rk5oM7n7J99
7544A61l85p5L52k68L07q4j7j50P6K09o7j20M22m28l7K37j61o4pJ01k0O2Qj11
$$ plain form
7568 -59 -165 307 -88 -33 -19 82 53 -92 -77 -87 -60 260 163 62 70 60 21 4 141 -78 -189 5 -109 41
7592 41 10 97 -108 -55 -85 168 -131 -251 216 310 -145 82 218 -27 72 -151 17 -31 -66 -50 180 -169 140
7615 140 62 243 87 -166 -11 -123 -241 -115 73 -220 185 -30 215 165 328 3 285 187 -276 30 -175
7636 -175 150 168 149 71 41 -30 122 -86 205 60 -188 184 214 10 107 -65 64 103 133 -15 16 -147 -79 251
7660 251 150 88 -24 89 -161 236 -142 -127 -75 -31 189 -44 -92 282 -111 -82 -16 -320 102 -69 -6 -26 3
7683 3 6 232 6 123 -98 -146 104 -60 307 247 8 3 88 -145 -83 -28 -220 -25 157 -299 77 170 56 324
7707 324 -170 -223 -114 -115 104 -6 9 -246 96 69 -359 75 -31 -105 -4 -192 150 132 86 -61 -7 161 39
7730 39 125 93 76 28 67 257 -8 171 85 116 321 219 -52 -23 -66 122 -141 -102 76 20 -167 2 1 176 126
$$ packed form
7568e9j06M72l95N5J4J01k9j45J5j0K7L20r7j01Qj0l9j7J37k19j11J94j14J50
7592D1l1Q7k05N3l0K53k99j20M67R4m55K27J36k45R9k23J68m8l5J6K30l49L09
7615A40p8J81j56k53J55j12j18J26J88k93M05k15K45n0J63l25K82r8m63L06k05
7636a75L25J8j9p8l0p1J52k08K91j45k48L72L0k04R7j72J29L9L0j48L1j63O8L30
7660B51j01o2j12J13k50L97l78J5N2M4K20k33m8L74l93K9O6l04M22j71O3k0K9
7683CLK26k26J17k21m8K50j64L67o0k39nQ5k33O2N5j92J95J82m56L76R3j14K68
7707C24m94n3J09jK19j10J5k55L42k7m28M34j06p4J01j88L42j8m6j47N4J68j22
7730C9Q6l2j7m8L9J90k65J79q6L1K05j02k71K9m3J88k63L9J78n6j87J69jJ75n0
$$ plain form
7755 126 113 -38 69 -16 -22 111 104 148 -61 -273 -56 302 76 -70 134 -26 -171 -191 85 132 -9 225 101
7778 101 -2 224 100 43 44 72 -34 -75 -121 63 70 -156 -161 -30 -31 -155 -101 -75 -272 -111 -10 167 -166 -139 -60
7803 -60 -223 31 -38 -82 -153 -331 40 -87 82 -227 -85 89 -21 126 24 -192 -25 89 -246 116 350
7824 350 124 118 8 -151 228 76 -137 -124 43 -196 88 93 -40 82 38 -120 82 9 -133 -115 -18 -177 79
7847 79 -155 78 52 21 302 165 -168 52 252 82 -80 8 31 127 -214 16 8 -37 61 -76 107 82 -91 -168
7871 -168 -69 -113 -102 29 -61 204 132 -189 262 90 185 -191 125 207 291 82 -48 -167 98 156 121 -164 93
7894 93 83 76 -189 52 90 -131 -88 -127 51 250 -10 153 149 99 -68 -270 88 -69 187 117 201 -145 -216 48
7918 48 40 48 384 -130 -269 -89 59 130 -22 -21 79 109 -44 -330 -50 -203 -122 123 136 135 -131 85 188 -39
$$ packed form
7755A26j3j51J07q5oJ33pM4k09k12K17L58k26j46K04j60j45k0K76M7j41K34j24
7778A01j03K26j24n7JK8j06m1m6J84Pk26nJ31jj24N4K6j97J61J01J77l33K7P9
7803f0j63K54o9m4p1j78L71j27J69l09J42J74j10J47j02k16J67J14l35L62K34
7824C50k26oj10j59L79j52k13J3J67k39K84Nj33J22m4j58K02p3j42J8R7j59K56
7847G9k34K33k6l1K81j37l33K20K00j70j62Q8K3R6l41K30qm5R8j37J83k5j73p7
7871a68R9m4J1J31r0K65p2l21M51j72R5l76L16Q2Q4k09j30j19K65N8l5k85K57
7894I3j0pk65K41L8k21M3l9J78J99k60J63mn0j67k02L58j57K56p0Q4l46p1K64
7918D8qQL36n14j39J80J48P1j52JJ00L0j53k86K80j53Q1K45J3jk66K16J03k27
$$ plain form
7942 -39 -24 -220 -107 149 280 19 96 -115 143 135 -62 129 -176 108 41 -13 -293 22 -48 26 -142 -202 -274 -44
7966 -44 -222 -150 330 -201 162 8 44 21 157 278 -10 -115 29 -48 5 88 -35 -137 8 -22 114 -103 -300
7989 -300 12 -156 -91 -139 -28 -67 214 -17 228 116 11 -61 18 14 -69 52 -90 88 3 -320 219 -190 -231
8012 -231 -54 73 -44 -36 -218 -32 47 -39 -11 17 145 -57 104 154 -15 -6 40 -111 190 -85 -103 25 -111 60
8036 60 41 106 299 59 -307 56 -55 51 -239 -97 78 -70 -30 -95 -199 -96 -301 -182 -142 55 15 68 -202
8059 -202 94 -142 21 -13 -134 -85 -138 48 -128 295 -285 -87 -67 -86 70 -217 -108 47 -14 -83 70 240
8081 240 0 187 -157 -7 83 -32 -1 238 -414 -224 -74 64 188 252 -175 -148 -72 -158 -39 -89 233 -129
8103 -129 -35 -64 116 27 269 -133 -11 -25 49 120 87 17 25 39 -104 70 50 -161 268 -3 -17 -16 -22 -71 198 -34
$$ packed form
7942c9J5j96J13K56J31k61P7k11K58qj97J91l05K84o7n4k80L15p0P4j68o0p2K30
7966d4j78P2M80n31L63j54L6k3J36J21k88j05J44p7N3Q3j23j02J45l0J36k17j97
7989c00L12j68O5m8J11l9K81k31K45j12j05p2P9mq3J21j42J78q5l23N39m09m1
8012b31J77J27j17Qj82J86P9q6K8K8J28k02J61N0j69RM6j51L01k75j8J28j36J71
8036F0j9O5J93k40l66L63j11J06k90J42J75j48M0o5j04J03k05J19M0J97m0N3k70
8059b02K96k36J63l4j21M9n3J86j76M23n80J98K0j9J56k87J09J55o1o9J53J70
8081B40k40J87l44J50R0j15L1K39o52J90J50J38J24O4m27K7P6q6J19n0L22l62
8103a29R4k9J80q9K42m02J22j4P4P1l3p0QJ4j43J74k0k11M29k71j4Jom9K69k32
$$ plain form
8129 -34 72 29 40 -37 -3 -12 16 98 -37 116 171 172 87 -75 -122 60 20 -57 -98 -49 125 -161 -30 -2 -61 -226 -19
8156 -19 88 27 120 59 -199 32 -82 177 263 -40 66 -277 76 11 62 272 -77 -50 116 93 141 58 63 -46
8180 -46 50 -136 -52 -134 -290 -55 102 -101 190 19 -113
$$ packed form
8129c4J06m3J1p7L4rK8Q2j35J53N5Jq5j62m7J82m0p7m1M9J74k86J31K8n9j65K07
8156a9J07o1R3o1k58K31j14K59Q6l03J06l43L53o5N1K10l49K7J66k3M8q3Nj09
8180d6R6j86Q4q2j56K35J57k03K91j71j32
8191a13
$$ Imaginary data points
##PAGE= N=2
##DATA TABLE= (X++(I..I)), XYDATA
$$ plain form
0 0 0 0 0 0 0 0 0 0 0 0 0 0 -8 8 -8 8 -13 16 -16 24 -24 32 -39 44 -50 61 -71 80 -94 108 -123 141 -159 181
34 181 -205 229 -259 291 -324 362 -404 447 -499 551 -611 675 -744 822 -906 996 -1099 1211
52 1211 -1334 1473 -1626 1799 -1995 2219 -2480 2786 -3149 3594 -4147 4862 -5824 7195 -9310
67 -9310 13054 -21643 90492 -77654 -132333 207260 131138 -143616 -84439 144819 38816
78 38816 -122049 -43252 67361 -8111 -62671 -22099 8412 -6291 -6074 -15422 -9948 16003 21216
91 21216 -6428 -285 22284 20868 11944 11538 1286 12912 32942 2733 -31647 12873 39913
104 39913 -24404 -49895 20889 27824 -46090 -40296 24979 5094 -43439 -14672 16614 -8253
116 -8253 -14478 4740 493 896 17033 1036 -10133 26033 27759 -20318 -3680 47929 8634
$$ packed form
0@%%%%%%%%%%%%qJ6j6J6k1K9l2M0m8N6p1Q3r4J11j32J51j74K02k31K64l00L40
34A81l86M34m88N50o15O86p66Q51r46J050j162J286j419J566j728J902k095K310
52A211k545K807l099L425l794M214m699N266n935O743p741R009j0686J3019j6505
67i310K2364l4697J12135j68146n4679L39593p6122k74754N9177K29258j06003
78C8816j60865P8797J10613p5472n4560M0572L0511j4703K17r348N474K5951N213
91B1216k7644O143K2569j416q924m06j0252J1626K0030l0209l4380M4520K7040
104C9913o4317k5491P0784O935p3914N794O5275j9885m8533K8767L1286k4867
116h253o225J9218m247M03J6137j5997j1169L6166J726m8077J6638N1609l9295
$$ plain form
129 8634 -41242 15967 49516 -26972 -44645 36701 29460 -53928 -28241 44337 1032 -56960
141 -56960 -3482 36133 -17916 -36245 15166 19681 -19222 -8704 20763 4889 -10280 10567
153 10567 17383 -3079 -3628 16347 13914 -8460 -7386 15732 14196 -16920 -18200 18396 16699 -29623
167 -29623 -25893 26827 15941 -41283 -22411 36323 10518 -42814 -8740 38171 1851 -32656
179 -32656 5262 29578 -3138 -14780 10915 13801 -1876 873 4931 -1284 4133 7870 -6819
192 -6819 -8581 9377 5509 -14899 -7687 9971 -74 -14575 -3217 6566 -2799 -7343 -896 1870
206 1870 119 615 -1103 -172 5978 4133 -3064 400 8585 3028 -4446 2208 7180 85 -3926 1903
222 1903 2700 -1997 -3534 -1003 -112 -1003 -4147 -3704 1227 936 -5792 -3194 5465 643 -7413 1589
$$ packed form
129H634m9876N7209L3549p6488j7673Q1346p241q3388K5687P2578m3305n7992
141e6960N3478L9615n4049j8329N1411M515l8903J0518K9467j5874j5169K0847
153A0567O816k0462n49J9975k433k2374J074K3118j536l1116j280L6596j697m6322
167b9623L730N2720j0886n7224J8872N8734k5805n3332L4074M6911l6320l4507
179c2656L7918K4316l2716j1642K5695K886j5677K749M058o215N417L737j4689
192f819j762J7958l868k0408P212J7658j0045j4501J1358R783r365m544O447K766
206A870j751M96j718R31O150j845p197L464Q185n557p474O654M972p095m011N829
222A903P97m697j537K531Q91q91l144M43M931k91o728K598Q659m822q056R002
$$ plain form
238 1589 9139 -2348 -6783 7477 8746 -6458 -3683 11186 3884 -9577 1380 11369 -3263
251 -3263 -9908 5909 7532 -9023 -7138 8342 2633 -10828 -3133 8409 -845 -9992 94 8306
265 8306 -1617 -7837 2515 8231 -1398 -5883 3696 7737 -2014 -5275 4473 6597 -3533 -4538 4892
280 4892 4028 -5193 -2759 4878 337 -5691 -265 3219 -2560 -4049 1923 1420 -3551 -1071 2785 -114
296 -114 -2639 1524 2827 -1001 -674 2367 1412 -583 282 1677 510 264 246 -65 430 200 -1264 -972
314 -972 867 -262 -2910 -831 1979 -1034 -3489 837 2878 -2136 -2836 2369 2867 -2519 -2074 3517
330 3517 2655 -2813 -1293 4334 1944 -3381 -543 4122 665 -3996 -29 4143 -768 -4481 932
345 932 3914 -2702 -4508 2524 3231 -3847 -3239 4174 2139 -4972 -1155 5280 784 -4685 1221 5236
$$ packed form
238A589P550j1487m435J4260J269j5204K775J4869p302j3461J0957R989j4632
251c263o645J5817J623j6555J885J5480n709j3461P695J1542r254r147J0086Q212
265H306r923o220J0352N716r629m485R579M041r751l261R748K124j0130j005R430
280D892q64r221K434P637m541o028N426L484n779j489N972n03m971K480L856k899
296a14k525M163J303l828L27L041r55j995Q65J395j167k46j8l11M95k30j464K92
314i72J839j129k648K079K810l013k455M326K041n014p00N205M98n386M45N591
330C517q62n468J520N627k390n325K838M665l457m661L967M172m911l713N413
345I32K982o616j806P032P07p078O08P413k035p111L817O435m496n469N906M015
$$ plain form
361 5236 -1070 -4086 2763 4149 -2621 -2829 2990 2060 -3197 -1732 3014 597 -3383 -788 1985 -479
377 -479 -2679 22 1606 -839 -1845 699 1453 -526 -1100 1138 1054 -638 -158 1276 487 -752 -5
394 -5 1087 124 -886 188 747 -188 -561 219 433 -662 -359 -127 71 -356 -827 -131 481 -279 -1005 163
414 163 1337 -263 -1335 653 2049 -709 -1341 1399 1902 -1301 -1676 2028 1517 -2350 -1096 2465
430 2465 598 -2880 -723 2473 -247 -2975 206 2569 -1214 -2516 1698 2280 -1877 -1566 2012 1530
446 1530 -2509 -927 2947 814 -2665 201 3198 -29 -2563 883 2349 -1181 -2075 1664 1682 -1687
462 -1687 -1652 1563 862 -2223 -699 1713 -295 -2065 293 1333 -518 -1466 893 1425 -956 -976 1355
479 1355 993 -926 -633 1544 505 -940 -398 752 380 -727 -511 666 612 -657 -710 518 527 -755
$$ packed form
361E236o306l016O849J386o770k08N819r30n257J465M746k417l980K595K773k464
377d79k200K701J584k445j006K544P54j979n74K238q4j692M80J434p89j239P47
394eJ092r63j010J074N59r35l73P80K14j095L03K32J98m27m71O96O12p60p26J168
414A63J174j600j072J988J396k758o32K740N03l203l75L704n11l867J254L561
430B465j867l478K157L196k720k728L181K363l783j302M214N82m157L11L578m82
446A530m039J582L874k133l479K866K997l227k534L446J466l530q94L739J8l369
462a687L5L215p01l085J524K412k008j770K358J040j851r48K359N32k381k0K331
479A355l62j919K93K177j039j445N42J150l72j107K16J177n4j269n3J228Rj282
$$ plain form
497 -755 -729 455 132 -526 -226 173 46 63 114 263 -241 -284 248 305 -485 -633 691 319 -1117 -577 1099
518 1099 250 -1902 -337 1785 53 -2139 -572 2212 -218 -2195 257 2141 -542 -2585 657
533 657 2000 -994 -1741 1151 1354 -1426 -996 1541 800 -1695 -512 1724 -92 -1768 214 1535
549 1535 -753 -1458 826 1322 -1106 -1366 1283 1053 -1357 -647 1319 710 -1608 -335 1589 216 -1268
566 -1268 39 1149 -353 -1007 487 909 -708 -993 958 479 -1215 -442 1169 -146 -1397 -89
582 -89 1047 -147 -1065 5 1349 -63 -1203 -40 650 -13 -941 -73 954 288 -889 -24 531 84
600 84 -450 -163 667 -12 -690 36 576 -189 -388 225 342 -112 -224 482 158 -551 336 640 -258 -822 199
621 199 1008 -557 -1301 548 1310 -759 -1228 987 1256 -1191 -855 1233 1337 -1161 -710 1387 733 -1514
$$ packed form
497g55K6J184l23o58L00L99j27J7N1J49n04m3N32N7p90j48J324l72j436N40J676
518A099q49k152J565K122j732k192J567K784k430j977K452J884k683k043L242
533F57J343k994p47K892K03k780M30K537p41k495J183K236j816j676J982J321
549A535k288p05K284M96k428k60K649k30k410P10J966o09k318J273J924j373j484
566a268J307J110j502o54J494M22j617k85J951m79j694P73J611j315j251J308
582h9J136j194r18J070J344j412j140J163O90o63r28Q68J027o66j177Q65N55m47
600H4n34K87Q30o79o78P26N40p65j99O13J17m54j12P06l24p09Q87L04q98n64J021
621A99Q09j565p44J849P62k069m69K215K69k447L36K088J04k498M51K097o54k247
$$ plain form
639 -1514 -250 1464 -50 -1182 118 1136 -316 -1097 448 817 -934 -507 1036 343 -920 -408
655 -408 994 -159 -890 -55 958 -480 -1087 457 770 -384 -484 423 660 -457 -534 632 348 -769
673 -769 -333 519 316 -556 16 647 -31 -740 -28 556 -332 -432 414 394 -136 -499 230 247 -113 -317 262
694 262 416 5 -529 152 484 -371 -368 490 650 -7 -501 317 330 -472 -581 543 344 -402 -37 309 139
715 139 -588 -21 686 123 -666 237 540 -545 -510 836 375 -626 -469 901 483 -806 -96 754 135
734 135 -795 142 786 -312 -611 134 367 -511 -503 544 652 -521 -300 430 248 -614 -64 817 -106 -429
754 -429 34 637 -236 -222 403 385 -265 -374 356 391 -343 -82 465 -11 -336 -270 297 75 -39 -31 96 -14
776 -14 -316 67 230 -113 -200 -221 253 39 -331 336 160 -221 -322 266 -21 -402 -415 -162 345 -332 -290 216
$$ packed form
639a514J264J714j514j132J300J018j452p81J545L69j751M27J543o93j263N12
655d08J402j153p31Q35J013j438o07J544L13j154j00R07K37j117p7J166k84j117
673g69M36Q52k03q72N72O31o78p09P12N84q88j00Q46k0n30l63P29J7l60k04N79
694B62J54m11n34O81L32q55LQ58J60o57m94Q18J3q02j09J124j99p46L65L46j70
715A39p27N67P07n63p89R03L03j085L5J346m61j001J57J370m18j289P10Q50o19
734A35r30R37O44j098k99P45K33q78QJ047J08j173K21P30j82q62N50Q81r23l23
754d29M63O03q73J4O25j8o50j09P30L5p34K61N47m76l25O6N67k22j14QJ27j10
776a4l02L83J63l43q7k1M74k14l70O67j76l81j01N88k87l81j3K53N07o77M2N06
$$ plain form
798 216 168 -125 -85 311 95 -364 -138 264 -144 -460 -1 357 94 -482 -23 298 -347 -443 83 477 -317
819 -317 -262 254 232 -264 15 667 198 -573 -185 511 107 -331 238 248 -225 -382 146 92 -162 -224 188 260
841 260 -75 -244 166 -75 -405 -84 -11 -109 -398 -47 476 -76 -135 9 55 14 4 324 -91 -191 -91 336
863 336 -37 -12 -170 438 -110 -188 68 236 -44 91 -234 -6 283 38 -74 169 11 -181 -47 -135 -301
884 -301 -199 -90 123 73 41 174 636 -301 -266 90 28 -107 -197 299 27 -218 142 315 -71 -256 -42 415
906 415 -41 -256 152 228 -57 -265 266 526 -366 -25 349 35 -528 23 160 -24 -413 -29 12 -199 -229
927 -229 156 171 -45 -453 172 166 -256 0 360 45 -207 -43 53 48 -77 -69 248 -69 -239 44 151 22 131
950 131 281 -9 -197 -4 216 207 -19 -99 -3 103 -169 -93 -333 70 -131 -246 141 78 -199 15 177 89 -16
$$ packed form
798B16m8k93M0L96k16m59K26M02m08l16M59L58k63n76M59L21o45r6N26L94p94
819c17N5N16k2m96K79O52m69p71L88O96m04m38N69J0m73j57N28n4k54o2M12P2
841B60l35j69M10k41l30L21P3r8k89L51N23n52n9J44M6m1j0L20m15j00J00M27
863C36l73K5j58O08n48p8K56J68k80J35l25K28K89k45j12K43j58j92J34q8j66
884c01J02J09K13n0l2J33M62r37L5L56o2j35r0M96k72k45L60J73l86j85K14M57
906D15m56k15M08P6k85k08N31K60q92L41L74l14n63N51J37j84l89L84M1k11l0
927b29L85J5k16m08O25om22K56L60l15k52J64R6nj25QL17l17j70K83J07j29J09
950A31J50k90j88J93K20rk26q0R6J06k72P6k40M03k01j15L87o3k77K14J62q8j05
$$ plain form
973 -16 16 205 134 -67 214 64 -73 48 111 150 -59 -73 46 3 129 176 392 -22 -320 -224 -31 188 -93
996 -93 -175 289 218 -111 25 207 109 -307 348 4 -255 -240 82 257 -237 -238 26 38 -93 40 175 160 39
1019 39 17 349 -94 -379 368 133 -168 -165 33 175 -76 -214 333 -76 -228 -376 317 -78 31 -35 278 29
1041 29 31 167 235 66 -248 140 -51 70 -110 -142 280 -91 -207 11 -180 53 -89 148 85 -213 -65 46
1063 46 31 -303 -28 14 227 -190 16 198 -127 -113 -77 193 -55 -316 -89 229 68 -230 300 133 -266 -214
1085 -214 -2 75 -200 -70 230 109 -158 -66 -26 243 -334 -36 28 -49 -129 12 288 -86 -393 129 50 20 -51
1108 -51 -84 -142 -200 -133 129 59 -102 -185 71 9 -172 209 281 222 -15 72 66 -93 -173 390 304 -273 -137 -16 324
1133 324 131 -61 208 34 -376 -355 252 97 -87 -89 76 30 -97 123 193 36 -171 359 144 4 -80 -101
$$ packed form
973a6L2J89p1k01K81j50j37J21O3L9k09j4J19m3J26M7K16m14k98R6J93K19k81
996i3q2M64p1l29J36J82r8m16O55l44k59J5L22J75m94jK64J2j31J33J35j5j21
1019C9k2L32m43k85P47k35l01LJ98J42k51j38N47m09j52j48O93l95J09o6L13k49
1041B9KJ36O8j69l14L88j91J21j80l2M22l71j16K18j91K33j42K37o3k98J48J11
1063D6j5l34K75M2K13m17K06J82l25J4L6K70k48k61K27L18j61k98N30j67l99N2
1085b14K12P7k75J30L00j21k67R2M0K69n77K98O4p7q0J41K76l74l07N22p9l0p1
1108e1l3n8n8O7K62p0j61q3K56o2j81L81P2n9k37Q7oj59q0N63q6n77J36J21L40
1133C24j93j92K69j74m10K1O07j55j84kJ65m6j27K20P0j57k07N30k15j40q4k1
$$ plain form
1155 -101 -113 20 186 194 223 171 -23 -78 251 -2 -176 37 -100 125 -132 120 78 -213 -90 44 108 55 226
1178 226 69 -178 -182 20 240 -12 -204 72 -1 51 -60 219 116 -216 13 -25 -106 -166 56 244 140 -191
1200 -191 10 -122 -64 68 75 -57 -256 -115 259 40 -291 31 233 177 -101 -72 -23 110 -234 -124 237 -123
1222 -123 -58 -141 237 106 -163 -58 -127 -45 161 -41 1 92 -62 -249 165 -242 268 -82 -60 210 -62 -90 -37
1245 -37 66 94 28 78 30 50 -5 66 23 24 178 151 -64 -309 139 165 -273 -203 -4 91 165 214 -71 84 -32 210
1271 210 7 54 165 63 114 -170 31 -7 -120 -9 -81 -114 43 65 195 -10 -18 -254 -122 147 -12 -168 43
1294 43 60 -177 -181 -12 -141 26 -25 172 -166 -116 214 3 -8 -136 -72 -51 -198 6 -57 -27 -182 -121 -74 -24 -189
1319 -189 333 -187 -157 -32 4 -91 -127 65 76 -87 -174 -73 -128 84 -126 -206 465 -162 -37 79 -69 67 12
$$ packed form
1155a01j2J33J66QK9n2j94n5L29k53j74K13j37K25k57K52m2k91J23J34O4n3J71
1178B26j57k47mK02K20k52j92K76p3N2j11K79j03l32K29l8q1o0K22J88j04l31
1200a91K01j32N8J32Pj32j99J41L74k19l31L22K02n6k78K9M9J33l44J10L61l60
1222a23O5q3L78j31k69J05o9Q2K06k02M2R1j54j87M14m07N10l50K2K70k72k8N3
1245c7J03K8o6N0m8K0n5P1m3JJ54k7k15k45M48K6m38P0J99R5P4M9k85J55j16K42
1271B10k03M7J11j02N1k84K01l8j13J11p2l3J57K2J30k05qk36J32K69j59j56K11
1294D3J7k37mJ69j29J67n1J97l38N0L30k11j1j28O4K1j47K04o3L0j55O1M7N0j65
1319a89N22n20L0J25L6r5l6J92J1j63q7J01n5K12k10q0O71o27J25J16j48J36n5
$$ plain form
1342 12 -122 -140 -41 -470 168 132 -10 -389 88 233 -75 -159 80 -15 -29 -4 -41 202 -283 26 53 -28 -130 44
1366 44 -19 -217 -111 37 13 -277 -67 291 59 69 51 -101 109 -76 -57 -103 -246 -39 39 -166 -6 161 12
1389 12 -199 -47 -59 49 83 -107 -84 -287 126 -120 -212 32 -56 49 -158 172 -266 0 103 -81 41 -363
1411 -363 -55 -77 -54 55 -77 134 -112 13 40 -72 62 -149 104 -102 -166 -106 -76 124 -8 445 135 143 1
1434 1 4 -3 -168 196 -93 -11 -83 227 -59 147 -197 255 38 -66 95 -60 -114 205 -68 43 36 -28 145 307
1458 307 -82 244 -42 -284 361 85 -225 -114 41 96 -15 -78 54 79 -90 212 215 3 -9 385 12 -55
1480 -55 20 22 110 -1 -102 -28 -116 -56 -237 154 211 -47 42 -143 244 -125 411 9 -227 89 -265 229 -30
1503 -30 94 282 132 -157 85 -62 -99 -8 -58 112 -192 139 -74 -9 260 -141 -8 -58 -109 2 228 152 58
$$ packed form
1342A2j34j8R9m29O38l6j42l79M77J45l08q4K39r5j4K5l7K43m85L09K7q1j02J74
1366D4o3j98J06J48k4k90K10L58k32J0j8j52K10j85J9m6j43K07P8k05J60J67j49
1389A2k11J52j2J08L4j90K3k03M13k46r2K44q8J05k07L30m38K66J03j84J22m04
1411c63L08k2K3J09j32K11k46J25K7j12J34k11K53k06o4O0L0K00j32M53l10Qj42
1434ALpj65L64k89Q2p2L10k86K06l44M52k17j04J61j55n4L19k73J11po4J73J62
1458C07l89L26k86k42O45k76l10J11J55N5j11o3J32K5j69L02Lk12j2L94l73o7
1480e5P5KQ8j11j01P4q8O0j81L91N7k58Q9j85L87l69N36m02k36L16l54M94k59
1503c0J24J88j50k89K42j47l7R1n0J70l04L31k13O5K69m01J33n0n1J11K26p6r4
$$ plain form
1526 58 -37 95 246 140 -194 77 194 -141 -314 48 64 1 92 184 42 -327 -18 155 -6 34 19 198 -94
1549 -94 -89 -79 11 -1 -56 144 -61 2 -42 156 23 -231 72 197 137 -31 11 248 -24 -3 64 9 -391 -29 168
1574 168 8 -193 -94 192 -3 -46 -106 110 79 -168 -68 -144 -91 153 162 279 4 -145 98 -22 3 -16 -97 178
1598 178 -286 38 -17 -106 -231 -408 146 -65 -39 -76 133 75 -217 -80 161 -17 -61 -67 92 15 239 35 255
1621 255 -309 46 -240 -110 -22 -48 251 219 70 84 63 104 -87 -318 191 -180 208 34 31 -43 -253 2 246
1644 246 -99 -33 -106 -29 -165 -143 168 224 -107 179 180 -118 -97 -71 -7 -327 -113 107 299 -40 169 21 42 -71
1668 -71 -231 25 187 -35 106 39 -161 -86 -46 -113 214 -78 -114 -5 80 -80 -148 -8 68 -212 -40 -48 -179 -174
1692 -174 -107 87 -206 -235 -308 187 -159 -172 168 -122 -99 -166 -21 70 -129 -260 -21 79 -118 -124 -81 119 45 -90
$$ packed form
1526E8r5J32J51j06l34K71J17l35j73L62J6o3R1R2j42l69L09J73j61M0j5J79k92
1549i4NJ0R0j2n5K00k05O3m4J98j33k54L03J25o0j68M2K37k72K1O7n5m00L62J97
1574A68j60k01R9K86j95m3o0K16l1k47J00p6N3K44RJ17k75j49K43j20K5j9q1K75
1598A78m64L24n5q9j25j77N54k11K6l7K09n8k92J37K41j78m4oJ59p7K24k04K20
1621B55n64L55k86J30Q8k6K99l2j49J4k1M1j91k31N09l71L88j74lp4k10K55K44
1644B46l45O6p3P7j36K2L11N6l31K86Jk98K1K6O4l20K14K20J92l39K09j48K1j13
1668g1j60K56J62k22J41o7k00P5M0o7L27k92l6J09Q5j60o8J40P6k80J72qj31N
1692a74O7J94k93k9p3M95l46j3L40k90K3o7J45R1j99j31K39J00j97oM3K00p4j35
$$ plain form
1716 -90 63 -267 20 -113 311 -56 47 119 77 69 151 18 281 207 64 280 323 87 150 267 48 -138 139
1739 139 84 -180 -66 221 -148 189 14 -113 165 -116 81 80 -109 -57 113 154 -182 -118 33 48 302 -161
1761 -161 -102 159 -76 34 10 2 35 -63 -44 -2 59 21 91 -44 -52 124 -62 40 -111 34 130 -77 136 -174 -52
1786 -52 -157 -83 179 -100 -48 228 -57 -38 108 109 -183 -91 -101 21 53 244 339 20 8 -29 -275 146 97 -267
1810 -267 31 127 288 8 106 356 127 130 149 91 -106 114 -80 254 -129 224 141 291 -89 -85 23 -55 -317
1833 -317 139 65 -177 -153 135 190 54 122 -141 -56 102 10 243 -43 -169 -64 25 130 -121 107 262 -164
1855 -164 -2 -99 30 -208 -49 243 44 -244 -78 178 -105 47 -75 -15 -66 50 69 -147 31 10 -105 -63
1877 -63 -54 224 -49 -72 253 -208 -30 107 47 -36 -11 -102 85 95 44 102 -38 -14 -133 91 75 102 -49 -67 164
$$ packed form
1716i0J53l30K87j33M24l67J03P2m2qQ2j33K63p4j43K16M3k36O3J17k19j86K77
1739A39n5k64J14K87l69L37j75j27K78k81J97jj89N2J70M1l36O4J51J5K54m63
1761a61N9K61k35J10k4qL3r8J9M2O1l8P0j35qJ76j86J02j51J45R6k07K13l10J22
1786e2j05P4K62k79N2K76k85J9J46Jk92R2j0J22L2J91R5l19j2l7k46M21m9l64
1810b67K98R6J61k80R8K50k29LJ9n8j97K20j94L34l83L53q3J50l80MJ08p8k62
1833c17M56p4k42K4K88N5j36O8k63Q5J58r2K33k86j26J05Q9J05k51K28J55m26
1855a64J62r7J29k38J59K92j99k88J66K56k83J52j22O0n1J16J9k16J78k1j15M2
1877f3RK78k73k3L25m61J78J37o0q3K5r1J87J0n1N8j40K4j19K24j6K7j51j8K31
$$ plain form
1902 164 7 -141 -119 -355 64 299 251 -123 6 51 -79 -171 -229 133 16 13 -144 -52 -114 61 148 -152 -123 88
1926 88 232 -80 -258 76 176 -3 -10 10 162 -87 -40 196 54 -85 158 178 -183 170 -63 4 32 54 115
1949 115 -4 -290 17 73 -48 39 -19 40 214 -110 66 -28 20 -237 199 77 27 -82 193 -31 -133 -226 -133
1972 -133 -18 -195 1 -195 40 234 229 -66 21 -143 14 -31 -28 71 128 92 -125 -101 -75 59 194 161 -72 16
1996 16 124 155 27 -253 209 -305 -79 -30 -32 -158 194 408 -198 131 160 165 -325 -74 243 270 -144 60 322
2019 322 -141 -24 296 257 -93 -174 -19 77 -16 -98 188 139 -167 55 38 -1 -217 74 -104 -243 -412 124 -22
2042 -22 17 -318 367 84 -28 -32 84 -87 -261 -142 -56 2 20 71 7 -57 -282 149 -174 -67 36 98 -46 -287
2066 -287 -135 -21 53 -200 -7 -29 -71 -67 111 175 132 163 -24 -19 129 -95 -88 4 42 -168 -216 66 -113 116 -256
$$ packed form
1902A64j57j48K2k36M19K35m8l74J29M5j30r2n8L62j17lj57R2o2J75Q7l00K9K11
1926H8J44l12j78L34J00j79pK0J52k49M7K36j42j39K43K0l61L53k33O7K8K2O1
1949A15j19k86L07N6j21Q7n8N9J74l24J76r4M8k57M36j22n0j09K75k24j02r3R3
1972a33J15j77J96j96K35J94nk95Q7j64J57m5LR9N7l6k17K4K6J34J35l3k33Q8
1996A6J08L1j28k80M62n14K26M9kj26L52K14o06L29K9Nm90K51L17K7m14K04K62
2019C22m63J17L20l9l50q1J55R6r3q2K86m9l06K22j7l9k16K91j78j39j69N36j46
2042b2L9l35O85k83j12mJ16j71j74J19Q6N8J8N1o4o4k25M31l23J07J03O2j44k41
2066b87J52J14P4k53J93k2m2MJ78O4m3L1j87NJ48k24PR2L8k10m8K82j79K29l72
$$ plain form
2091 -256 -118 174 71 -23 100 -145 29 122 128 68 120 48 -93 116 -109 -177 -100 93 114 0 -126 -12 -124
2114 -124 96 4 -133 85 213 -134 62 202 49 -31 6 -21 86 9 88 194 -114 -187 249 110 86 31 122
2137 122 -14 -203 -13 126 133 -49 42 104 -2 28 -167 21 -13 95 -47 -146 155 -140 167 37 41 -129 -86
2160 -86 105 5 -115 -3 132 -94 -381 -125 -133 228 -38 50 38 -113 -6 -77 145 41 -25 64 -22 -74 -176
2183 -176 182 23 57 -156 224 -110 81 161 -104 -171 -32 126 -10 -40 61 123 91 -3 128 -35 2 -164 -110
2206 -110 -182 149 -72 73 72 -179 62 -303 -204 -161 198 297 -71 -131 -237 -32 -36 26 73 -126 52 -101 16 -130
2230 -130 179 197 144 117 -25 -184 -422 76 -194 41 105 -40 -92 106 93 -50 -40 45 -26 -98 149 102 -132 -101
2254 -101 -128 -84 -93 5 -13 -199 -157 -225 76 -131 87 -120 -118 -158 -65 -24 -15 -95 70 101 -221 88 154 -19 136 88
$$ packed form
2091b56J38K92j03r4J23k45J74R3Oo0N2p2j41K09k25o8P7J93K1j14j26J14j12
2114a24K20r2j37K18J28l47J96J40j53q0L7k7J07p7P9J06l08p3M36j39k4n5R1
2137A22j36j89J90J39Pj82R1O2j06L0j95J88l4J08j42r9L01k95L07j30Mj70M3
2160h6J91j00j20J12J35k26k87K56qL61k66Q8j2j51J07p1K22j04o6Q9q6n2j02
2183a76L58j59L4k13L80l34J91Q0k65o7J39J58j36l0J01O2l2r4J31j63L7j66N4
2206a10p2L31k21J45jk51K41l65R9M3L59R9l68o0j06K05mO2M7j99J78j53J17j46
2230a30L09J8n3k7j42j59k38M98k70K35O4j45n2J98j3j43J0Q5p1p2K47m7k34L1
2254a01k7M4rR8j8j86M2o8L01k07K18k07Km0R3M1Rq0J65L1l22L09O6j73J55m8
$$ plain form
2280 88 -48 88 101 32 124 -87 7 -54 31 -113 -12 86 173 -24 10 -45 -313 86 79 102 132 -272 99 -141 173
2305 173 -36 48 20 -83 -1 110 164 -136 -135 21 -249 -61 166 -242 -157 50 12 -60 38 38 100 -125 -48 -125 -270
2330 -270 -318 -28 -218 -119 -106 24 -191 -138 182 -46 35 43 66 -42 222 25 225 -273 30 -155 63 -201 -38
2353 -38 -29 -22 138 -72 386 223 130 -117 -178 44 -95 -189 -125 158 181 -28 -105 -144 -58 -84 10 120 -53 -160 90
2378 90 55 -136 -69 13 -34 -60 89 -201 -55 38 -46 -143 -90 39 17 168 220 -149 -147 -83 -21 68 -260 163 31 91
2404 91 93 -233 -74 -98 -257 148 69 -38 21 21 -29 -76 219 -156 -22 41 -174 123 -45 179 65 111 1 -236
2428 -236 241 32 -81 -242 31 64 -160 157 0 -80 -284 63 92 -122 23 358 -37 56 -85 168 269
2449 269 -137 46 82 49 -29 -39 47 51 -18 -86 27 248 -10 106 -307 -80 -368 -192 34 -229 -334 -46 203
$$ packed form
2280H8j36J36J3o9R2k11R4o1Q5j44J01R8Q7j97L4n5k68L99pK3L0m04L71k40L14
2305A73k09Q4k8j03Q2J11N4l00JJ56k70J88K27m08Q5K07l8p2R8%O2k25P7p7j45
2330b70m8K90j90R9J3J30k15N3L20k28Q1QK3j08K64j97K00m98L03j85K18k64J63
2353c8RPJ60k10M58j63r3k47o1K22j39r4O4K83K3k09p7l9Q6k6R4J10j73j07K50
2378I0l5j91O7Q2m7k6J49k90J46R3q4r7N3J29k2J51N2l69KO4O2Q9l28M23j32O0
2404I1Kl26J59k4j59M05p9j07N9%n0m7K95l75J34O3k15K97j68K24j14M6j10k37
2428b36M77k09j13j61K73L3k24L17j57q0k04L47K9k14J45L35l95R3j41K53J01
2449B69m06J83L6l3p8j0Q6Mo9o8J13K21k58J16m13K27k88J76K26k63j05K88K49
$$ plain form
2472 203 -411 85 -48 -126 -132 -44 150 94 -158 -109 271 -191 -23 -225 14 255 5 -182 78 -106 256 59
2494 59 -29 -3 -82 103 191 47 -297 8 3 23 171 -64 -36 -110 224 191 -79 -85 -146 -93 96 107 255 62 -152
2519 -152 -21 -10 123 -155 -79 -121 63 -103 -207 -16 -35 -80 295 50 158 -130 -68 -2 -11 33 123 -47 203 196
2543 196 151 25 -199 51 287 -1 327 2 191 262 -58 149 -182 -102 165 122 50 -2 -56 -73 157 120 -239
2566 -239 -225 -62 -254 78 -53 87 -156 -10 33 -8 72 -11 142 88 230 -65 114 147 -28 -109 228 -45 -75
2589 -75 97 -31 194 123 83 226 -78 24 -211 -202 -164 44 -49 37 102 -15 -34 50 178 121 -75 -19 -89 -179 3
2614 3 -195 -99 70 -11 -2 -51 -29 -75 -110 44 12 15 111 203 -33 -45 21 101 48 -145 155 52 39 -123 192 17 47
2641 47 -216 -107 30 -2 63 -60 33 -189 -321 -224 -92 102 -77 69 -169 228 139 -65 27 -197 2 -23 -99
$$ packed form
2472B03o14M96j33p8oQ8J94n6k52M9L80m62J68k02K39K41k50j87K60j84L62j97
2494E9q8K6p9J85Q8j44l44L05nK0J48k35K8p4L34l3k70oo1N3J89J1J48j93k14
2519a52J31J1J33k78P6m2J84j66j04J91j9m5L75k45J08k88O2O6rM4R0j70K50p
2543A96m5j26k24K50K36k88L28l25J89P1l20K07l31Q0K67m3p2n2n4j7K30l7l59
2566b39J4J63j92L32j31J40k43J46M3m1Q0q3J53n4J42k95J79L3j75q1L37k73l0
2589g5J72j28K25p1m0J43l04J02k35RL8K08r3Q6O5j17j9Q4J28n7j96N6p0r0J82
2614Cj98R6J69q1Rm9K2m6l5J54l2LR6R2k36j2O6Q0n3j93L00j03j3j62L15j75L0
2641D7k63J09J37l2O5j23R3k22j32R7J32J94j79J46k38L97q9k04R2k24J99k5p6
$$ plain form
2664 -99 140 33 -105 98 -309 -79 -187 -28 -35 -30 166 85 40 56 226 -69 -60 -13 134 -217 31 -98 -88 308
2688 308 143 98 -85 226 71 28 -133 134 54 -399 -74 -305 -15 -35 -166 20 203 -227 -75 -54 -232 -13
2710 -13 -171 50 -45 60 -140 -96 43 122 216 160 40 -345 152 243 8 -67 132 -98 -81 178 -245 -270 90
2733 90 -101 -172 -111 113 214 70 31 -73 141 -84 166 67 -146 -178 -168 148 93 49 -37 13 -31 91 -21 73
2757 73 7 -148 -14 -15 -240 93 -20 -29 -248 225 -160 -175 59 385 243 -51 -33 -143 106 163 119 -208 -142 37
2781 37 -141 21 -358 -200 69 -152 -133 98 173 115 93 174 60 -262 58 -15 -72 -345 180 -54 -36 87 151
2804 151 89 169 -219 36 134 -29 219 -36 192 -165 -194 49 -52 54 -8 -173 -241 -52 100 -247 -20 -22 75
2827 75 -93 -192 -32 17 -28 -58 -49 102 0 41 -129 -106 49 36 -149 -161 -108 -138 175 104 -75 -84 -70 -111 181 121
$$ packed form
2664i9K39j07j38K03m07K30j08J59pNJ96q1m5J6J70k95RM7J47l51K48j29J0L96
2688C08j65m5j83L11j55m3j61K67q0m53L25k31K90k0j31J86J83m30J52K1j78K19
2710a3j58K21r5J05k00M4J39P9R4n6j20l85M97R1k35p5J99k30J7K59m23k5L60
2733I0j91p1O1K24J01j44l9j04K14k25K50r9k13l2J0L16n5m4q6N0m4J22j12R4
2757G3o6j55J34jk25L33j13rk19M73l85j5K34L26j42k94J8j10K49N7m4l27O6J79
2781C7j78J62l79J58K69k21J9K31P5n8k2Q1j14l22L20p3n7k73N25k34J8J23O4
2804A51o2Q0l88K55R8j63K48k55K28l57k9K43j01J06o2j65o8J89J52l47K27kR7
2827G5j68r9J60M9m5l0RJ51j02M1j70K3J55j3j85j2N3l0L13p1j79rJ4m1K92o0
$$ plain form
2853 121 132 116 -34 -282 75 1 0 29 64 181 224 32 59 10 -58 320 -44 82 8 -20 -70 -67 36 378 87
2878 87 -41 -51 54 246 162 2 28 -80 -188 62 -140 131 129 -66 -379 104 2 154 78 -44 113 242
2900 242 -48 2 -185 -8 -35 -40 -160 102 361 -177 112 195 -92 155 -6 -30 -81 48 29 -4 -62 104 114 -86
2924 -86 -82 -216 -194 132 -86 105 -29 18 -210 150 -80 -180 53 12 -52 22 -172 2 127 45 58 77 168 204
2948 204 175 -107 187 64 -133 139 -40 -21 -28 153 -37 -202 -179 172 -94 234 103 116 76 -98 -1 250 -152
2971 -152 -28 -99 108 -73 49 3 47 107 -53 -74 79 129 -288 -33 61 -86 -136 24 27 -69 165 -106 -239 -149
2995 -149 51 122 27 261 193 109 -128 168 164 -167 -240 268 31 62 -175 218 107 83 241 40 -109 236 -145
3018 -145 -30 -356 281 -74 12 262 -77 -32 39 173 194 -268 210 -30 68 -220 -41 -206 -171 24 -13 -215
$$ packed form
2853A21J1j6j50k48L57p4jK9L5J17M3j92K7m9o8L78l64J26p4k8n0LJ03L42k91
2878H7j28j0J05J92q4j60K6j08j08K50k02K71kj95l13M83j02J52p6j22J57J29
2900B42k90N0j87J77k7nj20K62K59n38K89Q3k87K47j61k4n1J29j9l3n8J66J0k00
2924h6Mj34K2L26k18J91j34M7k28L60k30j00K33m1o4P4j94J74J25q2J3J9R1L6
2948B04k9k82K94j23j97K72j79J9pJ81j90j65K3L51k66L28j31J3m0j74R7K51m02
2971a52J24p1K07j81J22m6M4O0j60k1J53N0m17K55R4j47n0J60Lr6K34k71j33R0
2995a49K00P1r5K34o8q4k37K96ml31p3N08k37L1k37L93j11k4J58k01j49L45l81
3018a45J15l26O37l55Q6K50l39M5P1J34K1m62M78k40R8k88J79j65L5J95l7k02
$$ plain form
3040 -215 -198 -111 225 90 -151 -38 8 -226 29 183 149 -49 -171 26 -241 -13 175 141 -229 -282 -146 0
3062 0 55 -145 69 -112 -331 -106 -152 -183 91 76 219 -44 86 -158 -147 -28 -20 -211 73 -41 10 -9 -112 143
3086 143 -119 -100 -85 75 -192 22 122 -129 121 157 219 182 -6 171 -34 -221 213 -265 337 -125 99 -203
3108 -203 79 -105 74 -100 1 -35 214 -174 -82 64 -17 293 -114 296 -278 43 126 -51 29 -151 211 84
3130 84 -42 -337 -135 -135 53 -19 21 -42 129 127 -141 -229 166 -114 -170 210 -69 -97 -211 12 90 -218 148 -144
3154 -144 19 -95 92 128 -76 75 57 -46 -59 -200 151 74 -81 -16 311 5 -160 -75 45 110 -11 -74 125
3177 125 -203 125 257 -88 -11 -60 -33 131 275 -91 -42 -201 -176 -164 115 177 88 75 -54 78 204 -31 54
3200 54 30 48 -254 130 -205 3 -35 136 57 -146 87 164 -80 -62 -59 234 79 90 -2 218 -3 1 172 46
$$ packed form
3040b15J7Q7L36j35k41J13M6k34K55J54l4j98j22J97k67K28J88l4l70n3J36J46
3062@N5k00K14j81k19K25m6l1K74j5J43k63J30k44J1J19Qj91K84j14N1j9j03K55
3086A43k62J9J5J60k67K14J00k51K50L6O2l7j88J77k05j87M34m78O02m62K24l02
3108b03K82j84J79j74J01l6K49l88R2J46q1L10m07M10n74L21Q3j77Q0j80L62j27
3130H4j26k95K02%J88p2M0o3J71kk68q8L95k80n6L80k79k8j14K23P8l08L66k92
3154a44J63j14J87L6k04J51j8j03j3j41L51p7j55O5L27l06j65Q5J20O5j21o3J99
3177A25l28L28J32l45P7m9K7J64J44l66M9j59K5J2K79O2q9j3j29J32J26k35Q5
3200E4k4J8l02L84l35K08l8J71p9k03K33P7k44J8LK93j55J1r2K20k21MJ71j26
$$ plain form
3224 46 152 17 -73 -50 12 -235 160 13 -31 -152 86 80 40 -80 -196 -412 -155 88 -32 -49 327 201 -65
3247 -65 -44 10 185 69 -123 -30 3 128 -187 -60 -18 7 222 -40 -143 -59 -25 -10 -238 -81 106 -117 17
3270 17 212 122 -198 147 195 11 17 27 120 -40 43 147 -169 65 -226 -68 -261 20 -278 -151 -98 -269 38
3293 38 -46 163 -143 -81 -153 9 -29 61 197 -134 258 -64 -144 69 -220 161 116 -64 140 -169 -202 161 -51
3316 -51 -44 118 42 -30 -257 -163 42 -119 116 163 -191 77 -88 -156 -64 291 -204 -75 120 -64 165 75 -117
3339 -117 29 -95 12 -120 -25 90 -226 110 -49 150 -64 -49 -41 125 69 46 196 4 -404 -11 130 148
3361 148 106 -47 117 44 -213 30 164 88 -93 60 -107 -48 101 93 -76 -183 152 -111 -12 -16 -134 -31 118
3384 118 56 18 -81 -77 -143 -8 50 43 77 -167 -142 -54 -173 -239 -174 24 8 8 -67 -37 -28 113 39 -151 337 -11 -96 68
$$ packed form
3224D6J06j35r0K3O2k47L95j47m4j21K38om0j20j16k16K57K43j20j7L76j26k66
3247f5K1N4J75j16j92R3L3J25l15J27M2K5K15k62j03Q4L4J5k28J57J87k23J34
3270A7J95r0l20L45M8j84OJ0R3j60Q3J04l16K34k91J58j93K81k98J27N3j71L07
3293C8q4K09l06O2p2J62l8R0J36l31L92l22q0K13k89L81m5j80K04l09l3L63k12
3316e1PJ62p6p2k27R4K05j61K35M7l54K68j65o8R2L55m95J29J95j84K29r0j92
3339a17J46j24J07j32R5J15l16L36j59J99k14J5QJ66n6k3J50j92m08L93J41J8
3361A48m2j53J64p3k57K43J34p6j81J53j67N9J49qj69j07L35k63R9mj18J03J49
3384A18o2l8r9Mo6J35N8pL4k44K5Q8j19o6O5J98j6%p5L0RJ41p4j90M88l48q5J64
$$ plain form
3412 68 156 31 44 -39 -100 -174 31 151 62 -138 -256 3 -153 -203 -33 0 -186 215 176 23 34 -96 -73 -8
3436 -8 -37 16 -237 34 168 119 -78 -28 -146 -48 -1 -69 -176 31 258 112 184 -94 -91 -146 -113 -147 -116 137 -26
3461 -26 -41 213 -250 212 91 41 152 -383 48 100 0 -113 172 -19 98 134 157 110 164 11 -77 -133 -142 -291
3485 -291 -112 -43 25 -84 111 -50 -247 115 -153 -73 292 -138 180 59 -34 31 -126 -178 -176 228 -73 -186 -122
3508 -122 33 -205 39 -123 104 -39 33 -111 -65 -10 -151 -92 76 42 267 -61 120 37 -2 4 -104 -160 -253 -78
3532 -78 90 140 -72 10 101 -134 82 79 -20 -118 -99 176 97 6 31 -110 222 -115 -126 251 96 -6 -71 246 -133
3557 -133 45 66 -233 156 -298 -94 307 -89 -61 -118 -16 222 -64 4 -268 39 4 23 -39 -65 56 49 270
3580 270 14 114 -13 -136 -18 87 -30 77 -281 -13 117 46 52 15 156 206 142 350 -135 -89 -116 -39 -130
$$ packed form
3412F8Q8j25J3q3o1p4K05J20q9k00j18K59j56n0J70L3j86M01l9j53J1j30K3O5
3436hk9N3k53K71J34m9j97N0j18R8M7o8j07K07K27j46P2k78Ln5L3l4L1K53j63
3461b6j5K54m63M62j21n0J11n35M31N2j00j13K85j91J17L6K3m7N4j53q8n6rj49
3485b91J79O9O8j09J95j61j97L62k68Q0L65m30L18j21r3O5j57n2KM04l01j13O4
3508a22J55k38K44j62K27j43P2j44M6N5j41N9J68l4K25l28J81q3l9Oj08n6r3J75
3532g8J68N0k12Q2R1k35K16lr9r8J9K75p9r1K5j41L32l37j1L77j55j02o5L17l79
3557a33J78K1k99L89m54K04M01l96K8n7J02K38k86O8k72L07l5J9o2k6J21pK21
3580B70k56J00j27j23J18J05j17J07l58K68J30p1Ol7J41N0o4K08m85M6k7P7r1
$$ plain form
3603 -130 -90 58 76 -153 -56 36 -95 -125 105 -69 -164 -15 271 179 -224 -216 -62 -64 -77 -42 -199 -43 -332 41
3627 41 -238 386 -84 18 -62 -156 27 -184 -9 -74 2 75 259 189 -31 -299 -32 206 -201 62 -50 -174
3649 -174 95 174 68 102 -103 -386 -18 21 165 233 190 16 64 -199 -188 -402 227 16 123 53 -1 -196 65
3672 65 241 -255 -104 97 -6 272 -120 116 -66 -13 4 56 121 -138 31 -155 179 38 53 74 90 202 270
3695 270 -115 249 1 -47 56 -35 -46 -331 -235 139 157 39 -26 171 -35 -116 -232 -67 28 -145 232 74 166
3718 166 -45 39 167 212 227 43 22 80 10 218 -149 -98 -82 24 -331 276 -128 -20 3 -133 83 270 226
3741 226 -6 -39 -183 -172 80 -44 -179 -21 154 -136 103 -148 -90 205 -212 221 -44 83 -54 -113 134
3762 134 182 -85 56 -329 -214 104 -234 32 46 61 58 -133 107 46 137 -21 200 -204 -9 -19 7 58 -36 53
$$ packed form
3603a30M0J48J8k29R7R2j31l0K30j74r5J49K86r2m03QJ54kj3L5j57J56k89L73
3627D1k79O24m70J02q0r4J83k11J75o5P6P3J84p0k20k68K67K38m07K63j12j24
3649a74K69P9j06L4k05k83L68L9J44O8m3j74M8k63J1k14O29k11J07p0n4j95K61
3672F5J76m96J51K01j03K78l92K36j82N3J7N2O5k59J69j86L34j41J5K1J6J12O8
3695B70l85L64k48m8J03r1j1k85R6L74J8j18o5J97k06q1j16J65R5j73L77j58R2
3718A66k11Q4J28M5J5j84k1N8p0K08l67N1J6J06l55O07m04J08K3j36K16J87m4
3741B26k32l3j44J1K52j24j35J58J75k90K39k51N8K95m17M33k65J27j37n9K47
3762A34M8k67J41l85J15L18l38K66J4J5lj91K40o1R1j58K21m04J95j0K6N1r4Q9
$$ plain form
3786 53 -432 172 233 195 24 30 120 192 -117 -74 -128 8 -128 221 -6 230 -33 201 -10 188 -152 93 11
3809 11 -22 -162 -24 -84 48 -22 46 -126 -11 -174 -42 67 174 -10 -249 -15 -137 66 -266 -15 -34 59
3831 59 -147 -143 -229 -116 151 -58 -85 -160 290 -92 62 194 312 -264 -54 -94 -50 45 18 -141 98 4 329 8
3855 8 -30 -186 -230 -30 13 217 99 81 -29 -102 113 68 82 -62 -137 48 208 -159 -187 -72 40 -42 57 218
3879 218 107 145 217 53 61 130 102 73 91 21 -22 157 141 -67 172 153 -63 66 -82 184 160 139 -14 202 138
3904 138 133 84 127 87 -245 21 -163 22 -173 -96 -32 175 475 -65 51 40 305 63 -153 206 -253 -112 -56
3927 -56 21 -98 88 0 -135 243 48 284 150 -21 108 -296 -42 -44 38 7 -71 177 -3 70 36 123 -24 166
3951 166 228 331 376 91 4 -143 72 92 258 -53 60 -97 -157 148 -133 226 -34 329 266 -12 -37 -56 -38
$$ packed form
3786E3m85O04O1l8j71OR0P2l09M3n4J36j36L49k27K36k63K34k11J98l40K45q2
3809A1l3j40J38o0J32p0O8j72J15j63J32J09J07j84k39K34j22K03l32K51j9R3
3831E9k06Mq6J13K67k09k7p5M50l82J54J32J18n76K10m0M4R5k7j59K39r4L25l21
3855Hl8j56m4K00M3K04j18j8j10p3K15m5J4j44p5J85J60l67k8J15J12q2R9J61
3879B18j11L8P2j64QO9k8k9J8p0m3J79j6k08K39j9k16J29j48K66k4k1j53K16o4
3904A38nm9M3m0l32K66j84J85j95P7O4K07L00n40J16j1K65k42k16L59m59J41N6
3927e6P7j19J86q8j35L78j95K36j34j71J29m04K54kQ2l1p8K48j80P3l4Q7j47J90
3951A66O2J03M5k85q7j47K15K0J66l11J13j57o0L05k81L59k60L63o3k78k5j9J8
$$ plain form
3974 -38 78 -60 -84 77 12 75 157 -408 25 95 -68 5 98 148 -10 -34 -248 -37 13 69 115 -53 -109 81 -247
3999 -247 -38 -45 164 180 -32 -50 -381 126 -202 407 193 -125 328 -213 -24 -15 109 -29 35 -19 29 87 138 143
4023 143 38 157 261 91 -4 -62 -119 -93 67 236 27 104 269 83 102 -10 -273 178 94 -384 -98 5
4045 5 -127 6 37 158 152 30 71 -124 -67 248 57 110 -29 71 -127 54 136 98 -152 -7 -50 74 337 93
4069 93 -149 50 55 -208 -164 -34 10 -19 191 50 -27 6 -89 61 27 43 43 -242 -169 72 -160 4 -83 -142 -136 -16
4095 -16 108 41 -37 -38 -53 -174 -203 111 19 -176 154 246 -59 282 -24 -70 129 -1 -22 -222 -187 43 164 188
4119 188 -173 -6 -119 -291 185 -175 -30 1 -9 12 6 227 -14 87 -85 -120 -132 167 -41 -238 97 131 -4
4142 -4 344 -141 354 58 141 -182 -40 -203 170 245 185 353 -132 12 61 -33 -129 102 139 118 30 50 -91 42
$$ packed form
3974c8J16j38k4J61o5O3Q2n65M33P0j63P3R3N0j58k4k14K11N0N6M6j68n6J90l28
3999b47K09pK09J6k12j8l31N07l28O09k14l18M53n41J89RJ24j38O4n4M8N8N1N
4023A43j05J19J04j70r5n8n7K6J60J69k09P7J65j86J9j12k63M51q4m78K86J03
4045Ej32J33L1J21oj22M1j95N7L15j91N3j39J00j98J81Q2l8k50J45m3J24K63k44
4069I3k42J99Nk63M4J30M4k9K10j41p7L3r5J50l4J6%k85P3K41k32J64q7n9OJ20
4095a6J24o7p8jj5j21k9L14r2j95L30R2l05L41l06m6J99j30k1k00L5K30J21K4
4119A88l61J67j13j72M76l60J45L1j0K1oK21k41J01j72l5j2K99k08j97L35L4j35
4142dL48m85M95k96Q3l23J42j63L73P5o0J68m85J44M9r4r6K31L7k1q8K0j41J33
$$ plain form
4166 42 -17 156 20 234 -83 248 23 -101 -54 -61 221 -316 49 -15 -90 14 78 -74 -224 -252 -180 196 137 -89
4190 -89 -58 132 -79 -65 -20 45 7 60 -121 40 -63 -53 -13 -205 160 35 60 99 22 -62 85 233 -2 186
4214 186 -191 -138 29 -124 135 -198 20 57 -10 127 -245 146 193 -57 52 -33 -102 241 -159 245 -232 -205
4236 -205 -32 151 43 -163 36 11 -19 -12 40 -55 315 45 -186 131 -29 -110 -205 -208 91 -86 -175 -259 -276 98
4260 98 144 9 36 87 -281 -22 -132 139 -80 39 66 -83 -3 -147 -99 37 124 -195 -85 -244 8 -35 85
4283 85 -46 -109 -70 -197 -390 109 -15 -75 112 147 -62 20 -153 300 58 -155 -83 -202 -16 -20 -80 -123 -40 -61
4307 -61 -181 84 9 -105 8 113 -112 -22 -14 60 180 111 -83 79 -200 -5 240 -126 -43 -78 48 -13 -24 -40
$$ packed form
4166D2n9J73j36K14l17L31k25j24M7pK82n37L65o4p5J04O4j52j50k8P2L76n9k26
4190h9L1J90k11J4M5O5l8N3j81J61j03J0M0j92L65j25K5L9p7q4J47J48k35J88
4214A86l77N3J67j53K59l33K18L7o7J37l72L91M7k50J09q5o9L43m00M04m77K7
4236b05J73J83j08k06J99k5l0PN2r5L70k70k31L17j60q1r5lK99j77q9q4j7L74
4260I8M6j35K7N1l68K59j10K71k19J19K7j49Q0j44M8J36Q7l19J10j59K52m3J20
4283H5j31o3L9j27j93M99j24o0J87L5k09Q2j73M53k42k13P2j19J86mo0m3Q3k1
4307f1j20K65p5j14J13J05k25R0QP4J20o9j94J62k79J95K45l66Q3l5J26o1j1j6
$$ [...]
8191d4
##END NTUPLES=NMR FID
##END=
