##TITLE=1H_Pr SucAm
 CDCl3, 8 sc, 
 14.05.2021
##JCAMPDX= 6.0         $$ Bruker NMR JCAMP-DX V2.0
##DATA TYPE= NMR FID
##DATA CLASS= NTUPLES
##ORIGIN= UXNMR, Bruker Analytische Messtechnik GmbH
##OWNER= root
$$ XWIN-NMR		Version 3.5
$$ Fri May 14 12:05:30 2021 Russian Standard Time (UT+4h)  she@DPX200
##.OBSERVE FREQUENCY= 200.131506
##.OBSERVE NUCLEUS= ^1H
##.DELAY= (6, 6)
##.ACQUISITION MODE= SIMULTANEOUS
##.ACQUISITION SCHEME= undefined
##.AVERAGES= 8
##.DIGITISER RES= 18
##SPECTROMETER/DATA SYSTEM= spect
##.PULSE SEQUENCE= zg30
##.SOLVENT NAME= CDCl3
##.SHIFT REFERENCE= (INTERNAL, CDCl3, 0, 15.7039)
##AUDIT TRAIL= $$ (NUMBER, WHEN, WHO, WHERE, WHAT)
$$ ##TITLE= Audit trail, XWIN-NMR		Version 3.5
$$ ##JCAMPDX= 5.01
$$ ##ORIGIN= Bruker BioSpin GmbH
$$ ##OWNER= she
$$ F:/spectra/data/she/nmr/H-F/1/audita.txt
$$ ##AUDIT TRAIL=  $$ (NUMBER, WHEN, WHO, WHERE, WHAT)
(   1,<2021-05-14 12:04:15.81 +0400>,<she>,<DPX200>,
      <created by zg, POWCHK disabled, PULCHK disabled
       configuration hash MD5:
       00 E9 B6 7A A2 85 ED C7 34 08 36 98 17 FE 4E 26
       data hash MD5: 16K
       93 93 54 09 3B 84 CC 5D D5 6F 74 C9 D7 F8 AF D8>)
$$ ##END=
$$ 
$$ hash MD5
$$ 96 CA A2 29 24 80 AF B0 BC BA CE AE 3D 50 F6 81
##$RELAX= 
##$RELAX= 
##$RELAX= 
##$RELAX= 
##$RELAX= 
##$RELAX= 
$$ Bruker specific parameters
$$ --------------------------
##$DU= <F:/spectra>
##$EXPNO= 1
##$NAME= <H-F>
##$PROCNO= 1
##$TYPE= <nmr>
##$USER= <she>
##$AMP= (0..31)
100 100 100 100 100 100 100 100 100 100 100 100 100 100 100 100 100 100 
100 100 100 100 100 100 100 100 100 100 100 100 100 100 
##$AQSEQ= 0
##$AQ_mod= 1
##$AUNM= <au_zg>
##$AUTOPOS= <>
##$BF1= 200.13
##$BF2= 200.13
##$BF3= 200.13
##$BF4= 200.13
##$BF5= 200.13
##$BF6= 200.13
##$BF7= 200.13
##$BF8= 200.13
##$BYTORDA= 1
##$CFDGTYP= 0
##$CFRGTYP= 5
##$CHEMSTR= <none>
##$CNST= (0..31)
1 1 145 1 1 1 1 1 1 1 1 1 1 1 1 1 1 1 1 1 1 1 1 1 1 1 1 1 1 1 1 1 
##$CPDPRG= <>
##$CPDPRG1= <>
##$CPDPRG2= <>
##$CPDPRG3= <>
##$CPDPRG4= <mlev>
##$CPDPRG5= <mlev>
##$CPDPRG6= <mlev>
##$CPDPRG7= <mlev>
##$CPDPRG8= <mlev>
##$CPDPRGB= <>
##$CPDPRGT= <>
##$D= (0..31)
0 1.2 0 0 0 0 0 0 0 0.06 0 0.03 0 0 0 0 0.0002 0 0 0 0 0 0 0 0 0 0 0 0 
0 0 0 
##$DATE= 1620979455
##$DBL= (0..7)
120 120 120 120 120 120 120 120 
##$DBP= (0..7)
150 150 150 150 150 150 150 150 
##$DBP07= 0
##$DBPNAM0= <>
##$DBPNAM1= <>
##$DBPNAM2= <>
##$DBPNAM3= <>
##$DBPNAM4= <>
##$DBPNAM5= <>
##$DBPNAM6= <>
##$DBPNAM7= <>
##$DBPOAL= (0..7)
0.5 0.5 0.5 0.5 0.5 0.5 0.5 0.5 
##$DBPOFFS= (0..7)
0 0 0 0 0 0 0 0 
##$DE= 6
##$DECBNUC= <off>
##$DECIM= 32
##$DECNUC= <off>
##$DECSTAT= 4
##$DIGMOD= 1
##$DIGTYP= 9
##$DL= (0..7)
0 120 120 120 120 120 120 120 
##$DP= (0..7)
150 150 150 150 150 150 150 150 
##$DP07= 0
##$DPNAME0= <>
##$DPNAME1= <>
##$DPNAME2= <>
##$DPNAME3= <>
##$DPNAME4= <>
##$DPNAME5= <>
##$DPNAME6= <>
##$DPNAME7= <>
##$DPOAL= (0..7)
0.5 0.5 0.5 0.5 0.5 0.5 0.5 0.5 
##$DPOFFS= (0..7)
0 0 0 0 0 0 0 0 
##$DQDMODE= 0
##$DR= 18
##$DS= 0
##$DSLIST= <SSSSSSSSSSSSSSS>
$$ [...]
##$SUBNAM2= <"">
##$SUBNAM3= <"">
##$SUBNAM4= <"">
##$SUBNAM5= <"">
##$SUBNAM6= <"">
##$SUBNAM7= <"">
##$SUBNAM8= <"">
##$SUBNAM9= <"">
##$SW= 16.9725357007746
##$SWIBOX= (0..15)
0 0 2 0 0 0 0 0 0 0 0 0 0 0 0 0 
##$SW_h= 3396.73913043478
##$TD= 16384
##$TD0= 1
##$TE= 0
##$TE2= 300
##$TE3= 300
##$TEG= 300
##$TL= (0..7)
0 120 120 120 120 120 120 120 
##$TP= (0..7)
150 150 150 150 150 150 150 150 
##$TP07= 0
##$TPNAME0= <>
##$TPNAME1= <>
##$TPNAME2= <>
##$TPNAME3= <>
##$TPNAME4= <>
##$TPNAME5= <>
##$TPNAME6= <>
##$TPNAME7= <>
##$TPOAL= (0..7)
0.5 0.5 0.5 0.5 0.5 0.5 0.5 0.5 
##$TPOFFS= (0..7)
0 0 0 0 0 0 0 0 
##$TUNHIN= 0
##$TUNHOUT= 0
##$TUNXOUT= 0
##$USERA1= <user>
##$USERA2= <user>
##$USERA3= <user>
##$USERA4= <user>
##$USERA5= <user>
##$V9= 5
##$VALIST= <valist>
##$VCLIST= <CCCCCCCCCCCCCCC>
##$VD= 0
##$VDLIST= <DDDDDDDDDDDDDDD>
##$VPLIST= <PPPPPPPPPPPPPPP>
##$VTLIST= <TTTTTTTTTTTTTTT>
##$WBST= 1024
##$WBSW= 4
##$XGAIN= (0..3)
0 0 0 0 
##$XL= 0
##$YL= 0
##$YMAX_a= 621023
##$YMIN_a= -529115
##$ZGOPTNS= <>
##$ZL1= 120
##$ZL2= 120
##$ZL3= 120
##$ZL4= 120
##$ABSF1= 10
##$ABSF2= 0
##$ABSG= 5
##$ABSL= 3
##$ALPHA= 0
##$AQORDER= 0
##$ASSFAC= 0
##$ASSFACI= 0
##$ASSFACX= 0
##$ASSWID= 0
##$AUNMP= <proc_1d>
##$AZFE= 0.1
##$AZFW= 0.1
##$BCFW= 1
##$BC_mod= 2
##$BYTORDP= 1
##$COROFFS= 0
##$CY= 11.3945322036743
##$DATMOD= 1
##$DC= 2
##$DFILT= <>
##$DTYPP= 0
##$F1P= 15.9154993809931
##$F2P= -4.1035820241983
##$FCOR= 0.5
##$FTSIZE= 0
##$FT_mod= 4
##$GAMMA= 1
##$GB= 0.15
##$INTBC= 1
##$INTSCL= 1
##$ISEN= 128
##$LB= 0.24
##$LEV0= 0
##$LPBIN= 0
##$MAXI= 10000
##$MC2= 0
##$MEAN= 0
##$ME_mod= 0
##$MI= 1.114404
##$NCOEF= 0
##$NC_proc= 0
##$NLEV= 6
##$NOISF1= 3.799351
##$NOISF2= 2.8
##$NSP= 1
##$NTH_PI= 0
##$NZP= 0
##$OFFSET= 15.70392
##$PC= 1
##$PHC0= -11128.38
##$PHC1= 7.80099
##$PH_mod= 1
##$PKNL= yes
##$PPARMOD= 0
##$PSCAL= 0
##$PSIGN= 0
##$REVERSE= no
##$SF= 200.130013532006
##$SI= 16384
##$SIGF1= 3
##$SIGF2= 2
##$SINO= 400
##$SIOLD= 16384
##$SREGLST= <1H.CDCl3>
##$SSB= 0
##$STSI= 0
##$STSR= 0
##$SW_p= 3612.71676300578
##$SYMM= 0
##$S_DEV= 0
##$TDeff= 0
##$TDoff= 0
##$TI= <>
##$TILT= no
##$TM1= 0
##$TM2= 0
##$TOPLEV= 0
##$USERP1= <user>
##$USERP2= <user>
##$USERP3= <user>
##$USERP4= <user>
##$USERP5= <user>
##$WDW= 1
##$XDIM= 8192
##$YMAX_p= 0
##$YMIN_p= 0
$$ End of Bruker specific parameters
$$ ---------------------------------
##NTUPLES= NMR FID
##VAR_NAME=  TIME,          FID/REAL,        FID/IMAG
##SYMBOL=    X,             R,               I
##VAR_TYPE=  INDEPENDENT,   DEPENDENT,       DEPENDENT
##VAR_FORM=  AFFN,          ASDF,            ASDF
##VAR_DIM=   8192,          8192,            8192
##UNITS=     SECONDS,       ARBITRARY UNITS, ARBITRARY UNITS
##FACTOR=    0.0002944,     1,               1
##FIRST=     0,             0,               0
##LAST=      2.4114304,     0,               0
##MIN=       0,             -529115,         0
##MAX=       2.4114304,     621023,          0
$$ Real data points
##PAGE= N=1
##DATA TABLE= (X++(R..R)), XYDATA
0@%%%%%%%QqQj6K4l2L2m0N6o9P8r4J17j44J71j98K36k81L29l79M36n04N80o62
$$ 0 0 0 0 0 0 0 0 8 0 8 -8 16 -16 16 -24 32 -37 41 -53 64 -80 91 -107 129 -152 177 -202 234 -270 310 -352
31c52P53q57R72j099J237j388J557j741J940k158K398k663K949l259L601l977
$$ -352 401 -456 516 -583 654 -734 823 -918 1022 -1136 1262 -1401 1548 -1711 1890 -2087
47b087M387m832N321n864O461p119P853q677R604j0656J1863j3261J4912j6890
$$ -2087 2300 -2532 2789 -3075 3386 -3733 4120 -4557 5047 -5609 6254 -7007 7905 -8985
61h985J9301k2327K6255l1571L9198n1112P2385j21429M26679J00684r78193M99349
$$ -8985 10316 -12011 14244 -17327 21871 -29241 43144 -78285 348394 449078 -529115 -29766
73b9766N21871n09558m19960N81837J82752o25432m3922O45428j71602n63769
$$ -29766 492105 -17453 -437413 144424 327176 -298256 -342178 303250 131648 -432121
83d32121K75013N08606m16248l62986N12788J64439n05656R422M63333p7111m39605
$$ -432121 -157108 351498 -64750 -427736 85052 249491 -256165 -246743 216590 139479 -300126
94c00126K24079M12477l12284l05427M38955J75085m74028j7194M68820j34589
$$ -300126 -76047 336430 24146 -281281 157674 332759 -141269 -158463 310357 175768
104A75768m01572K28165K94491k68820k45156L24776J50299m16895j1054L96600
$$ 175768 -225804 2361 296852 28032 -217124 107652 257951 -158944 -169998 226602
114B26602j36181l76548K09534K99181l09292k13961L66758M6211l37840R7177
$$ 226602 90421 -286127 -76593 222588 -86704 -300665 66093 112304 -225536 -128359
124a28359K49472j23229k14467J79068K03637k39134j09366K62175L7729k17079
$$ -128359 121113 -2116 -216583 -37515 166122 -73012 -182378 79797 117526 -99553
134i9553M2003J99022p8371j47645J52011R0413j54085l4878J25301K7203j47532
$$ -99553 -57550 141472 63101 -84544 67467 157880 3795 -31083 94218 121421 -26111
145b6111R947J29962q5505p8199Q9863R794p8614J0485L1308k5138j7900M944
$$ -26111 -16164 113798 28293 -49906 39957 49751 -28863 -18378 12930 -12208 -30108 -25164
157b5164j8364R484M533k5042K0905J937O95r413Q059N4562l6278m1539P2854
$$ -25164 -43528 -34044 -29511 -54553 -33648 -31711 -31016 -40429 -32370 22192 -14086 -55625 17229
170A7229L0696o5932l094O7934J997o2142L8674N5893n1088l2761M3250N4082
$$ 17229 47925 -18007 -21101 46833 48830 -13312 25362 81255 30167 -2594 40656 94738
182I4738p4308o5409J03614K0399j25850M368J09042m6482j13107O7342J05395
$$ 94738 20430 -44979 58635 79034 -46816 -42448 66594 20112 -92995 -25653 79742
193G9742j27857q4364J59787K9458j83069J3545J97115q7570j76099J60702J37707
$$ 79742 -48115 -132479 27308 56766 -126303 -112758 84357 -3213 -179312 -18610 119097
204A19097k01851o5137K45075K310k34130P9800K30424j47319j80297K17196J31172
$$ 119097 -82754 -147891 97184 99494 -134636 -54836 175588 28269 -152028 65168 196340
215A96340k59856n4902K97065m1985k75078J21924K28726j88722j82238K32848
$$ 196340 -63516 -118418 178647 136662 -138416 -16492 212234 23512 -158726 74122
225G4122J04690k82268l8507K92473o2431k81276J28362K39189k01062j91034
$$ 74122 178812 -103456 -141963 150510 88079 -193197 -64835 174354 -26708 -217742
235b17742K61990J00741k89791j5449K92963o5103k73411J46027K46562k06215
$$ -217742 44248 144989 -144802 -160251 132712 67609 -205802 -59775 186787 -19428
245a9428j84719K81659J07473k99505j0363L11866p2284k89031J64357K42241
$$ -19428 -204147 77512 184985 -114520 -124883 186983 114699 -174332 -9975 232266
255B32266k30936j81365K88368R4421l21509m285L19560r6071l05975J83040K35273
$$ 232266 1330 -180035 108333 202754 -118755 -123040 196520 100449 -205526 -22486 212787
266B12787k61416j68261L01683O3986l25037L0350L02728j17526k70778K01159
$$ 212787 -48629 -216890 84793 148779 -176258 -145908 156820 39294 -231484 -30325
276c0325K06084k56938j21132K90565L6274k87000O1150K62943j21008k12747
$$ -30325 175759 -81179 -202311 88254 124528 -162472 -101322 161621 40613 -172134
286a72134J91179J60627k21796q2294K42117K1282k40989N1973K16593j10181
$$ -172134 19045 179672 -42124 -124418 117699 138981 -102008 -50035 166558 56377
296E6377j83135J57038J29616j95287p1950J97535J3999k07519L7085J84391r6346
$$ 56377 -126758 30280 159896 -35391 -107341 90194 104193 -103326 -66241 118150 21804
307B1804j61985J32595J14505j71632n9602J76862R193j74474M4307J59454q7280
$$ 21804 -140181 -7586 106919 -64713 -124315 52547 61740 -112734 -68427 91027 3747
318C747j20429J21876Q7882j38246l3535J44813k154j31120M7774J18412p9924
$$ 3747 -116682 5194 93076 -45170 -78705 66108 63954 -67166 -19392 99020 19096
329A9096p5318R6342M2241r9976r897R0029k0109p9702L5646N6761n9421l1954
$$ 19096 -56222 40120 82361 -17615 -27512 62517 42408 -37294 -1648 55113 -4308 -36262
341c6262M9504P426m8645R95L4343j9281k1922J3689P711j2437J618J475o11J0402
$$ -36262 13242 20668 -27977 -26982 7361 -11920 -33842 -20153 -12442 -24879 -23261 -21786 -22397 -11995
355a1995j18j0026Q118K5033j6809j5147L2277J5059l5572j919N1505j2236m4425
$$ -11995 -12113 -22139 -14021 11012 -5797 -20944 11333 26392 -9180 -11099 40406 28170 -16255
368a6255K7767M4685m1045l6045N3532K3923o8650j2438P6265j8666p7165K8989
$$ -16255 11512 56197 15152 -20893 32639 56562 -12088 -24526 51739 33073 -44092 -15103
380a5103P1107n5602o9850Q0761M0140j00635j7043J07872j3229j13657M2982
$$ -15103 56004 402 -69448 11313 51453 -49182 -66225 41647 28418 -85239 -42257
391d2257J13462q0944r1565J20084N5557j29166j7411J49267k1552j49380P9710
$$ -42257 71205 -9739 -101304 18780 74337 -54829 -72240 77027 55475 -93905 -14195
402a4195J32130j17107r5609J49668N5779j68305o909J79365n4508j66787J07485
$$ -14195 117935 828 -94781 54887 110666 -57639 -64548 114817 60309 -106478 1007
413A007J28173j45498r8423J75631L9225j98279J9305J84810p7349j70283J24120
$$ 1007 129180 -16318 -114741 60890 100115 -98164 -78859 105951 28602 -141681 -17561
424a7561J34969j68016q8943J96351K5587j98016L4400J88299q2474j71927J49970
$$ -17561 117408 -50608 -139551 56800 82387 -115629 -81229 107070 24596 -147331 2639
435B639J30525j85175o4573J98408J9292j94928L7942J89464r4364j58334J50324
$$ 2639 133164 -52011 -116584 81824 101116 -93812 -55870 133594 39230 -119104 31220
446C1220J07955j75682o4102J91475J9918k09556M2399J89075j00886j58754J37104
$$ 31220 139175 -36507 -100609 90866 110784 -98772 -56373 132702 31816 -126938 10166
457A0166J19213j83314p1595K09525k40k12705O6662J79981j12720j45558J53865
$$ 10166 129379 -53935 -125530 83995 83755 -128950 -62288 117693 4973 -140585 13280
468A3280J02582j88626l3415J91578j8472j75704O8249J59318j14165j13823J52412
$$ 13280 115862 -72764 -106179 85399 66927 -108777 -40528 118790 4625 -109198 43214
479D3214O3391j61901j2914J61150k1233j61908O9784J37752j17621q3820J25411
$$ 43214 106605 -55296 -68210 92940 71707 -90201 -20417 117335 -286 -84106 41305
490D1305L8316j32253o050J33658l8613j26019O6813R8576q5871p7555R3444N3095
$$ 41305 79621 -52632 -58682 74976 36363 -89656 -22843 75733 -10138 -87693 5751 58846
502E8846j14025j0053J13405l0369r3084M7950R2549p1659p5727J04159L8449
$$ 58846 -55179 -65232 48173 17804 -75280 -27330 65219 -6440 -82167 21992 60441
513F0441j04129P047Q9673k8287o8542M5801N9301o1855l0399O1145J0332m9171
$$ 60441 -43688 -36641 53032 24745 -43797 2004 61305 -550 -30949 30196 40528 -8643
525h643p487N3928j4051n0715L1339K7647l2790j8790K0950J5400k5144j0519
$$ -8643 -16130 37798 23747 -26968 4371 32018 -772 -19562 1388 16788 -8356 -18875
537a8875K7742j5333j2851J8829p82r723k910R315k65M216O42j7505J4345K1122
$$ -18875 8867 -6466 -19317 -488 -1270 -10993 -13903 -4588 -4853 -637 5 -17500 -3155 17967
551A7967j8800j0366J7262J0355j6002q866L5892j2688l7280L6042K3574l7783
$$ 17967 -833 -11199 6063 16418 416 -8450 27442 14754 -22526 13516 37090 -693
563f93k3414M4086J5135n6009O18N5244k3718n3626L7409M6230n8739l7449P7626
$$ -693 -24107 19979 35114 -20895 -20277 34967 11249 -42377 -4968 41262 -17477 -54926 22700
576B2700L858p6314J9485O5002l0052o8837N6430O1442q0666l3933R0783J0197
$$ 22700 26558 -49756 -30271 34731 4679 -64158 -7728 53714 -26952 -60885 29898 40095
588D0095q5348J3590Q8240l8694q2478P8383O1085r5361l9090J09689K0209j25033
$$ 40095 -45253 -31663 56577 17883 -64595 13788 74873 -20488 -59578 50111 70320 -54713
600e4713K0860J17851o3864r2078R1417O1616j13284l8376J32479k43j44802M6010
$$ -54713 -33853 83998 20134 -71944 19473 81089 -32195 -70571 61908 61665 -83137 -37127
612c7127J23207q0992r7356J05089O4773j28459k2564J34431j6010j30148N2729
$$ -37127 86080 5088 -92268 12821 77594 -50865 -73429 61002 44992 -85156 -32427
623c2427J18650q5169r4438J18226N9498j34155j4047J34575j7057j31011N6138
$$ -32427 86223 1054 -93384 24842 84340 -49815 -63862 70713 53656 -77355 -21217
634b1217J17459r3675q3467J16191M8199j32382j1577J38823l0068j35600O8804
$$ -21217 96242 2567 -80900 35291 83490 -48892 -60469 78354 48286 -87314 -18510
645a8510J09955r9568p8898J11912M7125j31624n872J35844m2610j22342P5396
$$ -18510 91445 -8123 -87021 24891 72016 -59608 -65480 70364 27754 -94588 -19192
656a9192J03028j01841p5345J21882M0904j31165N005J26281m3044j06214P4163
$$ -19192 83836 -18005 -93350 28532 69436 -61729 -56724 69557 26513 -79701 -5538
667e538R0113j01062n6921J17206K3862j17029R837J12405m2490r5836O9707P1843
$$ -5538 84575 -16487 -73408 43798 67660 -49369 -39532 72873 30383 -65453 4254 76097
679G6097r1194m1919R7594J1702r8691J3505R2105m4622p5761O2079N4264p5512
$$ 76097 -15097 -57016 40578 52280 -46411 -32906 59199 14577 -61184 895 55159 -20353
691b0353l4030Q2733O490p9309J6745O9857l6427n3950M9975M0107n8646k3149
$$ -20353 -54383 28350 34840 -44469 -27724 42133 5706 -48244 1731 41838 -16808 -39957
703c9957O7230K744n9456J2528N2757k4003m1572L6840K7359m2026j4087M4951
$$ -39957 27273 30017 -29439 -16911 35846 11843 -29729 7111 34470 -7556 -21643 23308
715B3308j296m0762R067L4116j7326k8684K3602J4119k4468p128K1759k350j8090
$$ 23308 22012 -18750 -9683 24433 7107 -21577 2025 16144 -8324 -15452 6307 3957 -14133
728a4133N546J1660o660r123P779K840l138l68j68J678M756k257p223J0074P306
$$ -14133 -8587 3073 -3587 -12710 -4931 -2091 -5229 -5597 -5765 -4087 669 -1588 -8811 1263 8569
743H569j1536o272J9663K758k3695Q207K3817j5038k2443K5668J6259l3087r662
$$ 8569 -2967 -9239 10424 13182 -10513 -2306 21511 6473 -15970 9698 25957 -7130 -16792
756a6792L9451k202m4597J7051L8918k9826l4150M0704K1887n1149p789N4255
$$ -16792 22659 20457 -24140 -7089 31829 2003 -32147 8557 30444 -20705 -28494 25761
768B5761p872n6492K6107M9181l9901l9848N3259K7422o4102o796O7326j0239
$$ 25761 17889 -38603 -12496 36685 -3216 -43064 10195 37617 -26485 -33281 34045 23806
780B3806o6653L2835N9089m9507m5323O4325L0172p6919n768P8967j6128p7865
$$ 23806 -42847 -10012 49077 -430 -45753 18572 48744 -28175 -33943 45024 28896 -48969
792d8969M0362O6863o3042m9203P6561K7824r0236o70Q9763k7757q3391N1580
$$ -48969 -8607 58256 -4786 -53989 22572 50396 -39840 -40510 49253 21496 -61895 -10315
804a0315O8975p4469m7670Q8583K2222r7276Q193R4846l5813q2632N9509O8864
$$ -10315 58660 -15809 -63479 25104 47326 -49950 -41757 53089 17276 -65356 -5847 63017
816F3017q1433m2321R5024J5469r7799J4436R4719m1376q0784O5100O3480q5667
$$ 63017 -18416 -60737 34287 49756 -48043 -33607 61112 19736 -61048 4052 67532 -18135
828a8135l5309R4435P616r5661J8614R1263m8405p4908O8024N3617q4256k9637
$$ -18135 -53444 40991 48607 -47054 -28440 62823 14418 -60490 7534 61151 -23105 -52742
840e2742R1750J468r2249K4583Q3869n0613o6449O7147M7667q0862k4338R0296
$$ -52742 39008 40476 -51773 -27190 56679 6066 -60383 6764 54431 -26431 -50769 39527
852C9527m835q5164K9025P6046m8510o1707O8053M1109p9267j5486Q3070j0237
$$ 39527 34692 -50472 -21447 54599 6089 -55618 12435 53544 -25723 -41209 41861 31624
864C1624p5652K8495O9009m9752n3444O6126K8533p0696r065P0986j2334o7743
$$ 31624 -44028 -15533 53476 3724 -49720 16406 44939 -25757 -34822 36164 23830 -43913
876d3913L1775N5423m8814l8108N5987J8262n6558m332N7823j4543n0621L0134
$$ -43913 -12138 43285 -5529 -43637 12350 30612 -25946 -30278 27545 13002 -37619 -7485
888g485L6819l4482k7346M1405J5978m3731p37M2149j0793l4209J8504K9269k3317
$$ -7485 29334 -5148 -32494 8911 24889 -18842 -19579 22570 11777 -22432 -3928 25341 2024
901B024k4093L3036J0065l1429J098K6185n500k5552J3050K0114j9334j1827J7955
$$ 2024 -22069 10967 21032 -10397 -9299 16886 11386 -14166 -1116 18998 -336 -12163 5792
914E792M035j3896k605J1989q85j2896Q240L787n045k700N86O822l095l593R48
$$ 5792 9827 -4069 -6674 5315 4430 -8466 -226 3561 -1484 -4184 -3598 3224 129 -3464 -2516
929b516K312M133m383n593J0133J390j0008J813J0965k399j7730J3420J4734k0175
$$ -2516 -204 3929 -454 -6047 4086 5476 -4532 -2719 8246 5847 -11883 1537 16271 -3904
943c904p595K0125M969k5183R66K9531j3881k7583K3846J9014k7818j4811L1590
$$ -3904 -11499 8626 13595 -11588 -10622 18909 5028 -22555 1291 20305 -7513 -22324 9266
956I266Q893m1100P896L8100k0371l3337K8662L1922m2228k0712N1729K876m9642
$$ 9266 18159 -22941 -15045 23055 2684 -30653 -1991 29931 -12297 -33009 18720 21596 -28046
969b8046J4494M2421k3200l9354L8048L3857n5059j3365N7183q82n3491J2319
$$ -28046 -13552 28869 5669 -33685 4363 38220 -16839 -30204 26979 26097 -27394 -15075
981a5075N2300k9068m3418M3783K9640n4119j5488N9057K314o5615J7611O1670
$$ -15075 37225 8157 -35261 8522 38162 -15957 -31445 27612 29926 -35689 -18078 43592
993D3592m0054m5251M9144L2848o0175j8221P0429n240o9350K7147N9792m4278
$$ 43592 3538 -41713 7431 40279 -19896 -38117 32312 27072 -42278 -15131 44661 383
1005C83m6017N7885L1026p0120q157P2776j3204o5183K6485O0824m5043m7350
$$ 383 -45634 12251 43277 -26843 -35000 37776 24572 -40611 -14126 46698 1655 -45695
1017d5695O3394K2567o9102n08O7590j6017o5606L1686N9481n1172m1258O0885
$$ -45695 17699 40266 -28836 -29344 38246 22229 -43377 -11691 47790 -3382 -44640 16245
1029A6245J8483o2462j921O5695k1104o0623M0003M7128m9649l4480N6603K0496
$$ 16245 34728 -27734 -29655 36040 14936 -45687 -5684 41444 -8205 -42685 13918 34414
1041C4414o2664n41O4262k3127n2704L8305M0765m6023l0631N7584J2940n9829
$$ 34414 -28250 -28791 35471 12344 -40360 -2055 38710 -7313 -37944 19640 32580 -27249
1053b7249O576N5679k2067m8118L5623L7918m5791k3521N0286O286m7172N350
$$ -27249 -20673 35006 12939 -35179 444 38362 -7429 -30950 19336 25622 -21550 -16200
1065a6200M4858j8018m3021L3900L1299m1958j9104M3029P759m2713N007L8092
$$ -16200 28658 10640 -32381 1519 32818 -9140 -28244 14785 22544 -20169 -15162 22930
1077B2930j7934k9986K8808J8909l2516j1597L6252K263l5586R791K5963j3342
$$ 22930 4996 -24990 3818 22727 -9789 -21386 14866 17129 -18457 -8666 17297 3955
1089C955j8595J6578J2939k0553o318K2608o94k0947N635J5879o389j4156Q987
$$ 3955 -14640 1938 14877 -5676 -11994 10614 9920 -11027 -5392 10487 4098 -10058 -1071
1102a071J0016j2056m440R772L023j0528n60Q816j824o322K479L871k328k671
$$ -1071 8945 -3111 -7551 2221 5244 -5284 -5844 2972 1148 -5174 -2695 1176 -1152 -3823
1116c823Q10N668k980m237J835N185J190q502J019Q537j184p988L462Q013o787
$$ -3823 -3013 2655 -325 -4562 -2727 2458 3648 -4854 -3835 4702 3518 -4470 -1008 7005 218
1131B18o804J1814N216j6963o85J7745r92k0363N635K0841j4119j5468J8635J0258
$$ 218 -6586 5228 10444 -6519 -7204 10541 9549 -10814 -5179 15662 1543 -13925 4710 14968
1145A4968k4536l173K7813m870k9268J3476K7398k2988k0157K7901J3700l4273
$$ 14968 -9568 -12741 15072 10202 -19066 -5590 21808 -1180 -21337 6564 20264 -14009
1157a4009k937L6707q630l3895J7684L0632k7990k2176L4960J2925m0837q55M2686
$$ -14009 -16946 19761 11131 -22764 -5080 25552 -2438 -24614 10346 23271 -17566 -18421 24265
1170B4265j1596l9724K1890L4588l2748k4430M0141J1120m3689J058M5195j5762
$$ 24265 12669 -27055 -5165 29423 -3325 -27755 12386 23506 -20183 -19125 26070 10308
1182A0308m1481K6733L5414l7187k5095M3724J1783m6396J425M7399j7015m2112
$$ 10308 -31173 -4440 30974 -6213 -31308 12416 24199 -22197 -20772 26627 9612 -32500
1194c2500K9627L4784l9715k4908M9191J0256n0997M152N0868j9754m3994L3172
$$ -32500 -2873 31911 -7804 -32712 16479 26735 -24262 -20110 30758 11004 -32990 182
1206A82L4282m3054k2008N0905N846n1433Q773M8641k2619m2573L5632L0760m3307
$$ 182 34464 -8590 -30598 20307 26153 -25280 -16507 32134 9515 -33058 2574 33334 -9973
1219i973j8861M8917L145m8514J0886M4213k3642l7721L5530K5972m1749j4651
$$ -9973 -28834 20083 23228 -25286 -14400 29813 6171 -31550 3980 29952 -11797 -26448
1231b6448M5581J095m5079J2563L9757k3233l2468L3247K1442l8598j0250M1246
$$ -26448 19133 20228 -24851 -12288 27469 4236 -28232 5015 26457 -12141 -22391 18855
1243A8855j522m0515J3805L4588k2279k8263L0039J8495l5004p369L5615k587
$$ 18855 17333 -23182 -9377 25211 2932 -25331 4708 23203 -11801 -19170 16445 13858
1255A3858l5200J3250L0033k1179k3951K7369J5193l1040n458L0560k639k9630
$$ 13858 -21342 -8092 21941 762 -23189 4180 19373 -11667 -17125 13435 10796 -18834
1267a8834J2668K3976j9016j7101K2712J0686k4883k262K3857m021k1368J0608
$$ -18834 -6166 17810 -1206 -18307 4405 15091 -9792 -12054 11803 7782 -13586 -2978
1279b978J6408j3917j1055J5625O791j7063j99J4822l543j1775N642J0102q176
$$ -2978 13430 -487 -11542 4083 10874 -6189 -6388 8434 4891 -6884 -1242 8860 684
1292F84o813Q439M017q701r88O385N29n764j31N556j646l379K60L913k13m710
$$ 684 -6129 2310 6327 -2374 -3362 3023 3552 -2212 -2343 3213 1567 -1812 -1552 2361 2148 -2562
1308b562J171M227r91m832J333N218j921o240M422N240n834m054O052N167r920
$$ -2562 -1391 2836 1845 -2987 -1654 3564 1643 -4597 -175 5065 -769 -4823 1229 6396 -3524
1323c524k149J1074r62j1110K706J1913o316j1844J0334J0158j5231n088J5964
$$ -3524 -5673 5401 4439 -6671 -3965 7948 1632 -10212 122 10280 -4951 -10039 5925
1336E925K068j8199K171K0507j0571j7425J6116J3137j9853q473K3670K288k5951
$$ 5925 7993 -10206 -8035 12472 1901 -15524 592 13729 -6124 -14597 9073 11361 -14590
1349a4590N969K5282j4290k0163J9611J6323k5257j0205L1346r07k9939R223K7946
$$ -14590 -8621 16661 2371 -17792 1819 18142 -7115 -17320 14026 13119 -16820 -7597 20349
1362B0349j6972k4063K5390J6570l1389o490L3040l357l1084J0481K9931k0569
$$ 20349 3377 -20686 4704 21274 -10115 -16605 16435 13078 -18006 -7525 22406 1837
1374A837k3766K8592J3544l0854o383L3149k312l4142J3015L0138k2363k2444
$$ 1837 -21929 6663 20207 -10647 -17030 16119 13807 -20335 -7320 22818 455 -21989
1386b1989K7943J4556l1858p277L6679m548l5578J5857K8902k2292k3773K9934
$$ -21989 5954 20510 -11348 -18625 18054 13506 -22072 -6215 22687 395 -23378 6556
1398F556J5396l6058l366L6667p811l3795J6300K9552k4226k4000L3168J1569
$$ 6556 21952 -14106 -17472 19195 11384 -22411 -6111 23441 -785 -24785 8383 19952
1410A9952l5612q0L3847q246l3070J8442K8030k7283j8219L1263Q194l1913Q56
$$ 19952 -15660 -15740 18107 9861 -23209 -4767 23263 -4020 -22239 9024 17218 -14695 -13839
1423a3839L1727j0334k8831J9992K1073k3765j4096K6120Q425k9967K472K8381
$$ -13839 17888 7554 -21277 -1285 19788 -3977 -18073 8047 16472 -13495 -11023 17358
1435A7358j1405k3440J7164J8674k1492j3257K5254N426k6485M727K1883r483
$$ 17358 5953 -17487 -323 18351 -3141 -16398 8856 14282 -12203 -7476 14407 4924
1447D924j9918J5173J6789k1640q572K1426K728j9504R61J8727o154j7764J3547
$$ 4924 -14994 179 16968 -4672 -13244 8182 10910 -8594 -7633 11094 4940 -12824 723
1460G23J2288j7386n721J5723M176j8035J375J7304p664j2339R865Q734j1758
$$ 723 13011 -4375 -10096 5627 9803 -8232 -6857 10447 2783 -9556 309 9043 -2715
1473b715n652J3323J691j3462L302R471n198n875M152O570p560l543Q265j82n503
$$ -2715 -8367 4956 6647 -6815 -3513 5958 760 -5115 -963 5607 -1953 -5496 2769 2587 -2916
1488b916k69M366j03l286R40K406k055n41Q28J745j76m317K254L562j064m565
$$ -2916 -3185 1181 1078 -2208 -1268 1138 -917 -1458 -630 1115 939 -3378 -1124 2438 1374 -3191
1504c191L28P225l373n432N698K698o653j87P229p87q918L212R548n940p175N691
$$ -3191 -2863 4362 989 -4443 1255 3953 -2700 -2887 4342 3555 -5363 -2151 7397 1457 -5718 -27
1520b7P205q354n067J1013Q82j1055J377J1526l549j2431P144J1987j2543p624
$$ -27 7178 -1176 -6243 4770 5652 -5403 -4026 7500 3951 -8480 -1336 10651 -1892 -9516
1534i516J5169K759j5709j63J8176n570j7175J0982J3050j4122r511J8070M013
$$ -9516 5653 8412 -7297 -7460 10716 5146 -12029 -1047 12003 -2119 -11630 6440 10453
1547A0453k0989K231K2269r562j9472J3664J5601j6745j1999K1867L705k3323
$$ 10453 -10536 -8305 13964 4402 -15070 -1406 14195 -2550 -14549 7318 11023 -12300
1559a2300M452K2273j1022k0393J7047J6407k1659j0513K4095K810k3517M132
$$ -12300 -7848 14425 3403 -16990 57 16464 -5195 -15708 8387 11197 -12320 -8188
1571h188K2430j0926k0412J8539J4317k2024q617K4412K176k4932N167K3557j1894
$$ -8188 14242 3316 -17096 1443 15760 -6264 -14881 9531 11707 -13225 -8058 15499 3605
1584C605k0189J8438J4359k1791q408K4016J501k4948P163K2193j3109j9360J8992
$$ 3605 -16584 1854 16213 -5578 -13986 10030 11531 -13417 -6254 15939 2830 -16530 2462
1597B462J4549k2995q330K4667J189k4369O613K1318j2827j8095J9556J2252k3756
$$ 2462 17011 -5984 -14314 10353 11542 -12827 -6214 15104 2277 -15818 3738 15990 -7766
1610g766n569K4646m05k4423P447K0612j3091j5781J7932R668k1413k611K1646
$$ -7766 -13335 11311 10906 -13517 -6070 14542 1451 -14330 3602 13270 -8143 -10754 10892
1623A0892l168k0757Q971J7314j3565j2334J5797P548j7902j583J7404l046j6441
$$ 10892 7724 -13033 -4062 13252 -313 -12647 3150 10698 -7204 -8787 8617 5571 -10870
1636a0870P629J3806j1421r915J3602O264j5645j352J5058k362j3479N422J1843
$$ -10870 -3241 10565 -856 -10771 2831 9095 -6550 -7902 7156 4794 -8685 -3263 8580
1649H580r248p668J0586M751j1887j087J2088k188j1150M740J0058o999p060P898
$$ 8580 -668 -8336 2250 7001 -4886 -5973 6115 3927 -7223 -2483 7575 576 -6484 1414
1663A414M136p929j606Q533j563p537L451O566m948m952N444L506n335j767N029
$$ 1414 5550 -2379 -3985 4548 2985 -4552 -1101 5465 517 -4435 1009 4515 -820 -2587 2442
1678B442m91l404Q14L012j684k341J814J497o58k222J006J905r90k481J166K801
$$ 2442 1951 -1453 -639 2373 689 -1652 162 1659 1001 -1221 -215 1690 700 -1781 -615 2186
1694B186j949k974K486L248m056k064M852J041n603J22O501k769n946M351N506
$$ 2186 237 -2737 -251 2997 -1059 -3123 1729 2770 -2833 -2711 3790 1021 -4925 -574 4932
1709D932o253m179P714K139q702j9R218l044q071N165P020p148o052J0116K955
$$ 4932 -1321 -5500 2214 4353 -4349 -4368 4850 1806 -6265 -1100 5920 -1228 -7280 2836 5791
1724E791j0677k81J1049k315j0813N255R790q424p566J1380L987j2067j249J3284
$$ 5791 -4886 -5167 5882 3567 -7246 -1991 7799 -625 -8191 3189 7176 -4891 -6140 7144
1738G144k524j3388P145J1367r886r349J3244N353j5039r63J5969l731j5548Q925
$$ 7144 4620 -8768 -1623 9744 -142 -9491 3753 9106 -5933 -6896 9073 5342 -10206 -1281
1752a281J2771j2368r839J5652N239j7908Q51J6917n087j6062J0055J2780j3865
$$ -1281 11490 -878 -10717 4935 10174 -7734 -6883 10034 4947 -11115 -1060 11720 -2145
1765b145q806J6854L536j7921J616J7107o008j6026J1166J2194j4779p477J6218
$$ -2145 -10951 5903 9439 -8482 -6866 10241 4233 -11793 -627 11567 -3212 -10689 5529
1778E529L244j7314J915J6663p120j4553J1413J0904j4217p148J6192L100j7746
$$ 5529 8773 -8541 -6626 10037 2917 -11636 -223 10681 -3536 -10684 5508 8608 -9138
1791i138K863J5985p071j3541J0463J1043j4253o597J5996K312j6716K957J5188
$$ -9138 -6275 9710 2639 -10902 -439 10604 -3649 -10246 5750 8062 -8654 -5697 9491
1804I491o775j3443J0914J0644j4965m638J4860J020j4662K848J4309p421j1455
$$ 9491 2716 -10727 187 10831 -4134 -8772 6088 7108 -7554 -4706 9603 2182 -9273
1817i273J0949P473j2471l801J2851Q55j3425L401J1985p405q363Q774O172j0279
$$ -9273 1676 9149 -3322 -7123 5728 6583 -6842 -3441 8544 1139 -7224 1550 7722 -2557
1831b557l589J1359m36j0509L174R294n606p045O756N266q729k186R064q09p497
$$ -2557 -6146 5213 4777 -5732 -2558 6736 1130 -5915 841 6107 -2622 -4808 4256 3447 -4050
1846d050J341P667l737o285N625L603n868k331O247R15o344M70O370k946m157
$$ -4050 -2709 4958 1221 -5064 561 4164 -1704 -4035 2212 3127 -3217 -2747 3623 677 -3480
1861c480L106K815k912l096M531J263m360J18L078K63l037M0L488j613k629K379
$$ -3480 -374 2441 -471 -3567 964 2227 -2133 -2015 1063 1326 -1711 -1671 1817 204 -2425 -46
1877d6J236j080j872J687K188k715r59J791J483k176j460L418L59l474L37L833
$$ -46 1190 110 -1762 -75 2113 -602 -1561 230 1713 -463 -1923 1495 1854 -1620 -1283 2550
1893B550j039l858J117N351l863l822N154J919n206j035O472q58p106L308O187
$$ 2550 1511 -2347 -1230 4121 258 -3564 1590 3509 -1697 -2732 3740 2882 -4224 -916 5271
1908E271n284m492O052L333p230j591Q694j822q211M015O887n015o775P657M214
$$ 5271 -13 -4505 1547 4880 -2350 -3941 4753 2931 -5280 -1265 5622 607 -6168 1489 5703
1923E703r062r32R097j975q728L955Q381o065p804R272M183r395k096R820l94
$$ 5703 -3359 -4291 4806 2831 -5897 -1942 6439 374 -7430 1842 6025 -3370 -5466 4354 3960
1938C960j1038N054R347p719p518R521N318j0968k868J2507j288j2308N999R932
$$ 3960 -7078 -2024 7323 -396 -7914 1607 6925 -4043 -6911 5596 4308 -8000 -2001 7931
1952G931q322q078J0618N767j2976p70J2296k291j1949N880J0443r376p891J2185
$$ 7931 -391 -8469 2149 7916 -5060 -5830 6466 4175 -7774 -1894 8549 -827 -8718 3467
1966C467M065j2673r47J2173j608j1740O600R375r958o372J1469L785j2317p79
$$ 3467 7532 -5141 -6088 6085 4477 -7263 -663 8712 -1246 -7618 3851 7636 -4681 -5460
1980e460J2815l099j1869P319Q060r063n242R804L594j1747p07J1803l008r888
$$ -5460 7355 4256 -7613 -294 7766 -1297 -6539 3265 6859 -4888 -5595 6208 3200 -6688
1994f688N860Q315q323o329J0043K470j0051n3J0926m001r156N673Q356p709o387
$$ -6688 -828 7487 -836 -7165 2878 5348 -4703 -4756 6170 2169 -6987 -1314 7042 -667 -7054
2009g054R545K705r184o23J0571l260r048M848P774p407m120P675J000o916j08
$$ -7054 2491 5196 -3988 -4611 5960 2700 -6348 -1500 6274 -1133 -5253 2422 3422 -3494 -3602
2024c602Q444k531o650L615N897n908l528N693J798n935M53O169k491n470L357
$$ -3602 4842 2311 -4339 -724 5173 -735 -4263 1430 3228 -2707 -2254 3915 1424 -4046 -689
2039f89M894l998l919M783J528l717p22M129q73l896J994L303k001l281K951K245
$$ -689 4205 207 -3712 1071 2599 -1118 -1840 2289 1416 -2480 -486 2817 816 -2465 486 2731
2055B731k913j636L247N21l535Q99K403j79l378J053K858j871k232K454J336k178
$$ 2731 -182 -1818 1429 1950 -1585 -686 1717 1538 -1840 -787 2071 200 -2032 422 1758 -420
2071d20r83J711J571l168j19K653L04k821m32L240r50k590J789J938k474j691
$$ -420 -1403 308 1879 -1289 -1408 1245 1549 -1272 -1704 1536 586 -2004 -215 1723 -751 -2442
2087b442L606J164m376q87M625j7m336Q56M415k551l246M574K031m862j876N841
$$ -2442 1164 2328 -2048 -2935 1690 1673 -2663 -1807 2608 57 -3189 1385 3416 -1446 -3322 2519
2103B519K03n764J609N090k796n097N559K518n965j760O688O60p422K556N193
$$ 2519 2722 -3042 -1433 3657 861 -4236 1323 3841 -2124 -3884 2804 3464 -3958 -1402 3791
2118C791k881n593O191L295p030k111P751M13p640K369O217l565o286O047M072
$$ 3791 910 -4683 1508 4803 -2227 -4338 3413 3826 -3814 -1445 4772 1207 -5079 968 5040
2133E040p423j781Q106L2q792K308Q255m428o532N928M748p637k088Q062K72r699
$$ 5040 -2383 -4164 3942 3974 -4818 -2510 5745 1317 -5215 713 5461 -2176 -4264 3798 4070 -5629
2149e629L141Q622n298o935O835N273q763k543Q925j69r142L321P941n569n982
$$ -5629 -2488 6134 836 -6099 736 6009 -2754 -5297 3628 3459 -5683 -2362 5579 10 -5972
2164e972O633M864q733j825Q839n22q297K181Q220m879o003O444M007p709j704
$$ -5972 661 5525 -3208 -5033 3806 3284 -5013 -2832 5388 509 -5494 950 4957 -2752 -4456
2179d456Q122l43p975K470P293m858o031O818L923o394k335P408m24o926K002
$$ -4456 3666 3323 -4652 -2182 5111 253 -5778 1040 4963 -1431 -3766 3642 3218 -3708 -1706
2194a706O188m113n191O006L248o438j216N845Q10o352J414N676k880n117M884
$$ -1706 4482 369 -4822 1184 4432 -2006 -3222 2623 3433 -2919 -1505 4171 1291 -3826 1058
2209A058L091n743j653O441K01o638J755N318l120l884L969K812n102j710N396
$$ 1058 4149 -1594 -3247 3194 3395 -3243 -1488 3830 710 -3174 795 3607 -1495 -3205 2191
2224B191m52m191J102M159k245l735L326K248l200j678L356J094l664K0L117n55
$$ 2191 1739 -2452 -1350 2809 564 -3171 155 2403 -797 -2475 881 1975 -1689 -1669 1448 893
2240H93l537K201K075j983j907K524J447k924p73K986M3k561K07K801q91k460
$$ 893 -2644 -443 1632 -351 -2258 266 1713 -1211 -1984 1002 1045 -1516 -1309 1492 601 -1859
2256a859J570J900k046j018J660J575k637n80K931k29k557N5K729p65k454J933
$$ -1859 -289 1611 -435 -1453 207 1782 -855 -1435 1496 1267 -1290 -1235 1494 729 -1725 208
2272B08K277k169k388K593J046j910p28K170M71l449J834K645j749k932K531K316
$$ 208 2485 316 -2072 521 1567 -343 -1071 1099 1570 -1879 -45 2600 851 -2081 450 2766
2288B766l365j440L883P6l921Q24L658j745l736L561K322l656j987M240R81n073
$$ 2766 -599 -2039 1844 1920 -2001 -1177 2481 736 -3000 561 2883 -773 -2760 1480 2461 -2612
2304b612R88M749k210m118L021L432m507k387N382R88o197J456M994k230m805
$$ -2612 -1624 3125 915 -3203 -182 3250 -1257 -3644 1738 2726 -3471 -2015 2979 749 -4056
2319d056M076L711n238k035N460P45n893J005N300k084m871L538M164n143k077
$$ -4056 20 3731 -1507 -3542 1918 2663 -3230 -2225 3075 991 -3880 -342 3822 -1321 -3398
2334c398N103J398n802J11O209k285n186L605M087m708k695N547J525o431O35
$$ -3398 1705 3103 -2699 -2588 3621 1336 -3850 -245 3842 -866 -3561 1986 3511 -2920 -2285
2349b285O398k601n036L415M576n384k976O436P75o173Q45N675k167n404M079
$$ -2285 4113 1512 -3524 -109 4467 -917 -3893 2543 3318 -2855 -2010 3665 1498 -3906 173
2364A73L913n329j881N355O34n332L08N678k407m808L902L151l975k601M958J045
$$ 173 4086 -1243 -3124 2231 2865 -2467 -2159 3519 1112 -3696 206 3357 -618 -3219 1739 2784
2380B784n358L06N495k218m113K772L448l606l089N164R40n025L37M552j026m638
$$ 2784 -2574 -2268 3227 1009 -3104 -332 3116 -490 -3579 1585 2525 -2500 -2163 2389 1363 -3275
2396c275K532L660l626k316L938J254m376j9M574r90m437K738K956k736k632L096
$$ -3275 -743 2917 -709 -3025 913 2167 -2209 -2228 2346 1356 -3081 -343 2613 -123 -2755 341
2412C41J715l708k42L994J78m640J878K989j893k475K164J267k486l48K786J34
$$ 341 2056 -1652 -1894 2100 2278 -2362 -484 2505 612 -1863 301 1568 -918 -1266 1520 1654
2428A654l352P70L227j768k230J704J821j935j033J977J074l064L7K699p66k118
$$ 1654 -1698 -928 2299 531 -1699 5 1826 -109 -1142 835 1909 -1155 -1118 1581 815 -1303
2444a303M22K614j267j896J592J408j941q76K275L88k875KL291j176k377J134
$$ -1303 -881 1733 466 -1430 162 1570 -371 -1247 1028 1416 -1459 -1457 1834 658 -1719 -585
2460e85K182j895j619K727N04k855nL084o03l040R37L014j741k176K256J197k516
$$ -585 1597 -298 -1917 810 1314 -1541 -1546 1538 935 -2105 -1168 1846 105 -2071 185 1382 -1134
2477a134o02K881m3l101R78K854j422k664K288J836k600j354L303O85l608K92
$$ -1134 -1736 1145 1102 -1999 -1021 1833 411 -2253 35 1871 -729 -2083 1220 1905 -1703 -1411
2493a411L487r59l409K221K421k887j387L475O60m169L23M442j297l941K153L056
$$ -1411 2076 1117 -2292 -71 2350 -537 -1924 1551 2211 -1958 -1635 2807 1510 -2431 -278 2778
2509B778l050j660L110J109l917R8M179j146m297K250L669l411k288L520J174
$$ 2778 -272 -1932 1178 2287 -1630 -1532 2647 1501 -2796 -546 3123 -288 -2576 944 2118
2524B118l735J28L822j394l823K389L341l056k530L544J058l400n19M084r61l613
$$ 2118 -1617 -1489 2333 939 -2884 -495 2846 -210 -2740 804 1862 -1538 -2057 2027 1066 -2547
2540b547J710L325k732k470L155J577l650n09M256r50l943J607L895k787k889
$$ -2547 -837 2488 -244 -2714 441 2018 -1632 -2141 2115 1165 -2778 -1171 2724 -63 -2952
2555b952L466J788l553n49L736r63l371J752L375k534k901L338J544k920j110
$$ -2952 514 2302 -1251 -1800 1936 973 -2398 -646 2729 195 -2706 632 2176 -744 -1854
2570a854L228j04l057J338K750k021k612K993J777l338j109L638P5l134Q03K766
$$ -1854 1374 1270 -1787 -449 2301 280 -2332 661 2438 -900 -2009 1629 1704 -1430 -627 2139
2586B139j327k796K226J906k558j026K705L26l129P74K757j169k696J811K042
$$ 2139 812 -1984 242 2148 -410 -1436 1269 1595 -1534 -760 1997 828 -1868 -57 1985
2601A985k109j643K256J119k655R9K354p25k559J455K210k005j933K286J454k476
$$ 1985 -124 -1767 489 1608 -1047 -948 1406 681 -1878 -423 1787 -218 -2151 135 1589 -887
2617h87q34K727n6k614Q14K435j789j590J956J700k653j024K677K53k346K19K345
$$ -887 -1721 1006 950 -1664 -850 1585 -204 -1794 162 1862 -791 -1815 862 1115 -1231 -1012 1333
2634A333j123j720J530J522k049j170K385O31k445j71K633n27k423J234K182j265
$$ 1333 210 -1510 20 1542 -507 -1677 708 1339 -1106 -1277 1356 829 -1594 -360 1822 557
2650E57k123K015J353k382o57K925n44k511J371J890j430k198K211J324k245p95
$$ 557 -1566 449 1802 -580 -1237 1688 1144 -1367 4 1894 464 -1734 477 1801 -444 -1239
2666a239K771l61k564R06K009j301k041K230J367k572q98K618O53l187O03K441
$$ -1239 1532 1171 -1393 -487 1522 221 -1820 410 1777 -795 -1693 925 1578 -1609 -1006 1435
2682A435j026k215J799J803k201j407K708L83k704K19K499o39k680J531K214k340
$$ 1435 409 -1806 -7 1796 -405 -1812 896 1279 -1425 -1206 1293 654 -2026 -495 1719 -621
2698f21q46J915R59k492n28L024p39k571J222K413k132j404K170J367k794o02
$$ -621 -1467 448 1407 -1085 -1613 1411 672 -1899 -677 1736 -396 -1800 370 1737 -1057 -1659
2714a659K740l83k235J047K407k121j483K317R59k605k11K527j38k161M87K224
$$ -1659 1081 698 -1537 -490 1917 -204 -1687 630 1589 -1016 -1227 1300 1162 -999 -512 1712
2730A712j576j423J976O55j783m88K019K32k329L34K193r34k033J307J475j392
$$ 1712 136 -1287 689 1344 -439 -927 1092 1324 -1005 -671 1522 588 -1445 -138 1337 -55
2746e5j321K389J73k120J74K009k60k508J495J617j835j183J954P00k255r9K298
$$ -55 -1376 1013 1186 -934 -760 1249 989 -1519 -24 1593 -242 -1425 529 1229 -1026 -1125 1173
2763A173o27k139J339J383j421j026J524J043k318q8J909J38k052M44J801p15
$$ 1173 546 -1593 -254 1129 -292 -1318 206 1249 -1069 -1157 752 890 -1162 -718 1083 368
2779C68k088J506J599j958r42K061L93k123K34K686j331j867J484J513j936j005
$$ 368 -1720 -214 1385 -573 -1515 546 939 -1184 -950 1736 405 -1462 22 1535 -401 -1406
2795a406K105N42k387L19K331j035j705R08K265j954j241K079N23k017m66K482
$$ -1406 699 1241 -1146 -827 1504 469 -1236 -328 1937 -17 -1258 821 1344 -673 -1139 1343
2811A343k39k396J092K110j852j688K135J151k304n20K731p33k307J080K075j616
$$ 1343 1104 -1292 -200 1910 58 -1630 505 1656 -648 -1168 1563 830 -1477 -397 1678 62
2827F2j823K252J192k664k58K553n05k236J062J926j544j895K138R38k021l84
$$ 62 -1761 491 1683 -981 -1239 1314 809 -1427 -365 1561 17 -1878 260 1198 -823 -1207
2843a207K101J09k769J057K071j256j833J818J181j943j010K422K32k783J020
$$ -1207 894 1003 -1766 -709 1362 106 -1727 91 1272 -671 -1681 741 973 -1810 -790
2858g90K054p37k260J647J858k531m90K132q1k110P46J894j093j757J865J151
$$ -790 1264 527 -1733 -86 1772 -759 -1249 883 802 -1308 -562 1332 239 -1518 347 1498
2874A498j952k31J492J75j944M37J927j076j229Q86J417j491p56J654J64j640
$$ 1498 -454 -685 807 982 -962 -525 1402 326 -903 -17 1400 -91 -847 807 971 -669
2890f69K68J616q36j456J171J585j815q17J465K96j342J1J327n53r90O42J091
$$ -669 -401 1215 379 -1077 94 1679 -136 -953 512 808 -534 -523 804 251 -739 -97 994
2907I94j245l86P04N23q79l73J258o62m51lJ200n13j164Q50P29j025l88Q63J83
$$ 994 -251 -637 67 590 -289 -662 596 -66 -517 -520 680 167 -997 -147 582 -443 -831 32 215
2926B15o75JQ15j07j404Q74P07m25r68Q22N46r80P5O38N7o20J70O95k01j095P19
$$ 215 -460 -459 356 249 -1155 -281 426 1 -967 -145 401 -579 -504 134 191 -429 -259 436 235 -860 -141
2947a41R65o78q49P39Q99j219k11J200r4j147L65J267p65r06O60J091j222m22
$$ -141 824 146 -703 36 935 -284 -495 705 611 -536 -171 1096 331 -575 85 1176 -46 -468
2965d68J166m2j446L90J721q90j435J124J026j309m27J284O9j551L50J842j035
$$ -468 698 656 -790 -400 1321 431 -1004 120 1146 -163 -590 694 763 -788 -438 1404 369
2982C69j777J391J440j465j462K028K69j658J9K050j072j827J404J733j968j224
$$ 369 -1408 -17 1423 -42 -1504 524 793 -865 -846 1204 132 -1695 -291 1442 -526 -1750
2998a750K275M15k002j5K245r15k194K094J322k117j145K387O72k538N16J988
$$ -1750 525 940 -1062 -1077 1168 253 -1941 153 1475 -642 -1787 600 1272 -1266 -750 1238
3014A238q50k188J878J535j954j292K549J57k378N99K205j118j889J747J330k004
$$ 1238 388 -1800 78 1613 -341 -1633 916 1073 -1305 -706 1499 381 -1508 239 1569 -435
3030d35j067K320N86k382M38J927j071j920J867J492k339o91K540J89k512L65
$$ -435 -1502 818 1404 -978 -540 1387 316 -1604 263 1755 -584 -1275 1265 1454 -1058 -693
3046f93K136q23j966J739Q17j705m66J972P5k328M62K180j066j523J392Q19j658
$$ -693 1443 620 -1346 393 1210 -495 -961 1011 1086 -1242 -780 1400 334 -1189 203 1022 -636
3063f36o2J555j5j841Q15R81r90q17R23J030j805r0J509M4j636O14J015o94n47
$$ -636 -698 857 842 -999 -184 797 -193 -1010 -87 943 -862 -952 557 601 -1035 -421 594 -100 -647
3082f47P46L65j110R9J209m02j242N96J263q07n93O09L52p70J70N62l16l27K97
$$ -647 99 464 -646 -547 662 260 -982 -386 877 70 -523 86 438 -332 -162 400 84 -243 54
3101E4O30p27m51N42L57l55k1L12l15L0J05K26n26K03Q9k04L20m18J75J32N1q3
$$ 54 684 -43 -494 48 405 50 29 341 26 56 161 387 -139 64 153 -51 269 -149 26 158 209 126
3123A26O0K3q3j72j69N08k15j30j88Q00l67n68O08Ml18l97P97j43j047N64J010
$$ 126 186 209 126 -46 -215 293 78 -52 -240 560 193 -375 233 237 -81 -478 319 176 -871 -307 703
3144G03o28q85P93N87r48l05R87k22j067R98P96j064o89J321K48j180j17J466
$$ 703 75 -810 -17 570 -378 -683 304 82 -985 13 809 -255 -944 377 625 -555 -672 794
3162G94n43j149P28J082j046j086J703N30k012M42J670m87j766R11J536j475q08
$$ 794 251 -898 -170 912 -134 -1220 483 1013 -999 -557 1113 626 -1140 -229 1307 -168 -976
3179i76J732J72j771K54J839q73k054K113J204k091m78J880J39k052M25K015j139
$$ -976 756 928 -843 -589 1250 377 -1677 436 1640 -451 -929 951 1090 -962 -537 1478 339
3196C39j648J870Q84j929n75K169j44k283R62J619j536j422K203Q1j541N5K057
$$ 339 -1309 561 1445 -484 -1059 1110 966 -1317 -355 1264 -272 -1694 509 590 -951 -896 1161
3213A161o95k062J404J491j408j628K169R13k471J27K085m39k260J454J382j878
$$ 1161 466 -1596 -192 1299 -109 -1737 432 1345 -1126 -999 1086 647 -1613 -159 1223 -655
3229f55p10K132R8k263N84J815p28j766J393J262j769m62J547L99j890M30J683
$$ -655 -1365 767 865 -1398 -814 1001 273 -1493 -100 1162 -607 -1069 478 877 -1013 -583 1100
3246A100r01j491J282J213j735l99J604K93k074Q85J508j331p21J252Q81j924
$$ 1100 199 -1292 -10 1203 -532 -931 673 966 -1108 -223 1285 -46 -767 485 1366 -558
3262e58n3J766m42j475J129O97j126m45J216R7j637Q15J133j239m44O96O55j322
$$ -558 -611 1155 713 -762 367 1064 -62 -507 709 806 -831 -16 1117 -122 -566 130 785 -537
3280e37L78P49m09n90L69Q36r02p04J083J23r93N40P12q06n35L97Q47j143j08
$$ -537 -159 590 181 -409 -40 796 -106 -810 273 396 -597 -57 655 -151 -686 -289 558 -585 -693
3299f93J033j94r27P01O46p14l71Q09K4j074N58N04m51o40J033K86j240K78J121
$$ -693 340 146 -781 -80 566 -148 -519 290 314 -760 -202 302 -149 -789 244 530 -710 -432 689
3318F89o15q58R29O12j139k79J200O1j441Q56P16p57q49J075P63j572O26R35o63
$$ 689 74 -784 145 757 -382 -661 539 600 -841 15 731 -26 -875 200 963 -609 17 952 289
3337B89j053Q82Q03j013o61J370J56j495M01J367q73j218J491O89j744RJ712o90
$$ 289 -764 118 921 -92 -753 617 773 -722 -321 1046 173 -1045 446 1135 -609 -600 1112 422
3355D22j599J078J058j095j077K031J05k005O09J291l88j647J189J059j695k65
$$ 422 -1177 -99 959 -136 -1213 818 923 -1082 -473 818 430 -1217 -28 1031 -664 -929
3371i29J703k42j678O08J717j081j460J746N06j777n8J670j05k075R81J810j413
$$ -929 774 532 -1146 -538 1179 98 -1362 384 890 -887 -945 725 620 -1455 -474 1336 -77
3388g7j331J554P09j990L11J770o83j792J585J137j829n31J911M10k094M70J614
$$ -77 -1408 146 855 -1135 -824 946 263 -1529 56 1193 -636 -1167 744 1154 -940 -470 1144
3405A144j042j282J429J209k031l59K133l28j806Q14J378j267j225J955N63k325
$$ 1144 102 -1180 249 1458 -573 -932 1201 873 -933 -119 1259 -8 -1233 722 1285 -1040
3421a040L27J935l79j962J457J076j646q39J538M96k234L42K039j257p71J232
$$ -1040 -713 1222 843 -1119 338 1414 -232 -1071 467 963 -1271 -929 1110 -147 -918 314
3437C14J096j822k45J214l63j246L31K132j192j356R82J040j838J31J802j045
$$ 314 1410 -412 -657 557 194 -1052 -721 1411 219 -1137 -155 885 -953 -822 980 -65
3453f5j004j78K806j771j693K142K30q64P60R3n83j103J754M19j768O04J203q54
$$ -65 -1069 -1247 1559 -212 -1905 237 467 -397 363 456 -127 -1230 524 943 -825 -221 982 128
3471A28j057Q10R72j199j30R43O11k160O39J554p15j227J083Q55j422l55J427
$$ 128 -929 -119 853 -346 -476 467 1078 -1082 -443 1111 396 -831 252 1107 -315 -670 757
3488G57n0j513P78J072r11q31J147K69j068j02J396o28j514J181J145j934Q2O17
$$ 757 707 -806 -28 1044 133 -698 449 718 -350 -452 944 316 -1198 -17 1128 -806 -724 -107
3506a07J42r83R11J126j589r48K042j04j026n83J604j84j637R25J146j171n41
$$ -107 35 -948 -37 1089 -500 -1448 594 490 -536 -1119 485 301 -1336 -411 735 -436 -977
3523i77J734qk386J228O69p87l82P27R18j893M06J655n08j586J040J248j426p00
$$ -977 757 749 -1637 -409 260 -527 -909 -182 736 -1157 -751 904 396 -1190 -150 1098 -328 -1028
3541a028J399J27j264J69J651q47j392J257J158j955M4J448j53j437N12J405j146
$$ -1028 371 498 -766 -597 1054 207 -1185 72 1230 -725 -681 767 614 -823 -311 1094 -52
3558e2j040J481P11j845J81J535l57j517Q42J211j250r66J958K35j872J25J617
$$ -52 -1092 389 1100 -745 -564 971 614 -903 -61 1150 -100 -1066 892 1127 -745 -620 997
3575I97n31j107J121P32j682l93J778m8k069P75J353p05j462J678M87j849L30
$$ 997 466 -641 480 1212 -470 -863 915 867 -1202 -427 926 221 -1241 437 924 -925 -595
3592e95J095J90j826J044O58j248m00K157n90p61m09Q64m08j656J879J294k264
$$ -595 500 690 -1136 -92 566 -682 -1082 1075 485 -276 -685 179 -229 -1885 -6 1288 -976
3609i76R8J325p3j690R83J587j213j399J783O0j118k63J799j192j407K043R34
$$ -976 -878 447 374 -1316 -333 1254 41 -1358 425 485 -633 -896 903 -289 -1696 347 1281
3626A281j748n56J221O70j818N83J365j075r45J242P82j555k30J683k92j575R85
$$ 1281 -467 -1023 198 868 -950 -367 998 -77 -1022 220 1002 -553 -783 900 608 -967 18
3643A8J216j461o07J449M38j895M45J660r17j261J096R80j721j67J518m0j737
$$ 18 1234 -227 -834 615 1053 -842 -397 1263 346 -915 181 1161 -560 -727 791 751 -986
3660i86O13J237o82j266J306O17j410k79J715n77j590J185J299j865l92J701O7
$$ -986 -373 864 182 -1084 222 839 -571 -850 865 288 -1302 -117 1182 -683 -1075 626 693
3677F93j926O04J790j076j171J248Q53j862j11J625k08j595Q90J369j207j030
$$ 693 -1233 -629 1161 85 -1086 162 1015 -847 -958 667 459 -1136 -246 1123 -84 -1114
3693a114J495M62j590k3J804p28j347R47J177j331n54J691n4j663K81J872j633
$$ -1114 381 843 -747 -770 1034 306 -1041 -94 1083 -248 -802 889 835 -828 -547 1325 -308
3710c08q42J626M93j725M9J695l22j671J119J086j531o14J625K79j510P9J415
$$ -308 -1150 476 969 -756 -707 988 666 -1005 114 1200 -331 -945 680 959 -551 -472 943
3727I43r57q91J167J026j680q59K021J88k113N49K027j657p37J503O97k113N4
$$ 943 -14 -905 262 1288 -392 -1251 770 958 -1155 -606 1421 -236 -973 530 1227 -886 -832
3744h32J694o72q75O97P83j197o57J975l61j169P00J442j552j381J050K633k880
$$ -832 862 190 -685 12 795 -402 -1059 916 555 -614 86 1528 -24 -1405 -355 2278 -602
3761f02j4J106k97q23N39P70p56j728K127O21j797J63J422n48j413J303Q26j256
$$ -602 -616 490 193 -630 -91 679 -77 -1805 322 943 -854 -691 731 183 -1230 73 899 -357
3779c57n60J446J24j484N45J235q39j054J135O74j476KJ707o28j200O94J087j364
$$ -357 -917 529 653 -831 -286 949 110 -944 191 865 -611 -609 1098 470 -730 -36 1051 -313
3797c13l60J382k3j576M28J601p94j239J222Q10j592k12J446l29j370Q29J189
$$ -313 -673 709 686 -890 -462 1139 345 -894 328 1138 -454 -666 780 451 -919 -90 1099
3814A099j047j141J420M24j557mJ854m82j712J136R26j462n07J585J41j703N02
$$ 1099 52 -1089 331 755 -802 -806 1048 566 -1146 -10 916 -546 -1053 532 673 -1030 -528
3831e28J559j149q85J415L99j597k70K032o78j523J136J243j525o97J499M76j880
$$ -528 1031 -118 -1003 412 811 -786 -1056 976 298 -1225 -89 1154 -371 -1068 431 907 -973
3848i73L87J483q54j143J219J347k096k09J668o9j779O49J644j182j503J839O42
$$ -973 -586 897 43 -1100 119 1466 -630 -839 829 760 -1019 -370 1274 92 -1411 428 1070
3865A070k009m5K011o27j324Q13J464j538p68J775L16j975L55J704q79j719J528
$$ 1070 -939 -984 1027 400 -924 -111 1353 -185 -953 822 1138 -837 -482 1222 343 -1376 152
3882A52J111j770n67J938j11j895O87J930j604j056J522P22j547m14K001p26j514
$$ 152 1263 -507 -1074 864 753 -1142 -455 1475 -129 -1185 337 1059 -488 -902 1099 373 -1141
3899a141P49J496j437p77J749L50k098J12K175j006j258J122J026j575p26K002
$$ -1141 -392 1104 -333 -1110 639 989 -1109 -997 1178 172 -1086 36 1062 -513 -1239 763
3915G63j91j721O39J558j221j036J375Q08j720j13K072q85j470R14J213j152q47
$$ 763 572 -1149 -510 1048 -173 -1209 166 974 -746 -859 1213 328 -1142 -228 985 -167 -1014
3932a014J515J1j288J20J535p17j050J129O26j242m97J641j00j452O24J169r28
$$ -1014 501 512 -776 -656 879 162 -888 241 867 -375 -872 769 669 -783 -159 1010 82
3949H2q29J269K49j075j52J338o65j098J128P98j514l16J546j55j330O02Q45p45
$$ 82 -747 522 771 -304 -456 882 217 -881 247 1045 -469 -785 761 606 -724 -122 723 -22
3967b2q28J180L43j244o0J520o08j251J049O19r87o38J414M5j311L63J258j038
$$ -22 -850 330 673 -571 -631 889 281 -970 79 698 -289 -927 487 532 -779 -416 842 -196
3985a96p68J253L38j166R7J090n56j024O54J235j562l41J380K8j091O1J618j152
$$ -196 -964 289 627 -539 -442 648 92 -932 -278 957 -605 -946 434 462 -629 -568 1050 -102
4003a02p99J100P37j648j32J869o08j198O32J302j371n58J525o6j521L12J614
$$ -102 -901 199 936 -712 -844 1025 417 -781 -149 1153 -218 -776 749 683 -838 -526 1088
4020A088q56j278J285Q97j679l43J927m20j426M52J348p64j289J456P56j764k59
$$ 1088 232 -1046 239 1136 -543 -886 1041 621 -805 -353 995 231 -1058 398 1154 -610 -869
4037h69J952o85j485R61J434j712p91J840K26j807M50J896j138j402J327Q97j755
$$ -869 1083 398 -1087 -126 1308 -404 -1195 645 871 -936 -486 1410 272 -1130 197 1094 -661
4054f61n19J787P4j720Q23J573j281j494J713P29j957j20K161o92j756J113J279
$$ -661 -1180 607 681 -1039 -216 1357 76 -1418 295 1024 -933 -1053 1108 416 -1340 -227 1052
4071A052j393j009J869L65j813K93J804q61j372R99J147j656m44J884M3j918N59
$$ 1052 -341 -1350 519 884 -929 -636 1168 307 -1065 -66 1081 -575 -1019 865 908 -1010 -451
4088d51J764j089j482J488R50j937l30K021l17j875P52J708j196j065J652L90
$$ -451 1313 224 -1258 230 1180 -757 -1087 934 617 -1258 -506 1202 6 -1059 593 983
4104I83j610J45J709j189j100J176J121j462j035J987R9j729M16J450p95j219
$$ 983 -627 -482 1227 38 -1062 114 1235 -227 -1262 725 824 -905 -489 961 166 -1053
4120a053J226N59j161j08J246l20j411Q60J153j106q28J083L42j162K10J152m60
$$ -1053 173 732 -429 -537 709 389 -1022 -162 991 -115 -943 140 482 -680 -470 682 222
4137B22r59N96Q31r74m71J229l29r92O24R10p34q25J007M68j199M3R83k63q11
$$ 222 -737 -141 690 -284 -755 474 145 -847 -223 687 -47 -872 135 603 -596 -553 430 167 -644
4156f44M83Q96j047l41J241r6j211O67Q63r48n15R87M38j280J13J238m91j241
$$ -644 -161 735 -312 -653 588 492 -719 -52 811 -137 -652 335 773 -507 -394 844 353 -888
4174h88R42N47q15j68J077l59q27N46P75r23o09J155J84j215Q5J409p21j002Q70
$$ -888 54 601 -214 -382 695 336 -491 55 830 -93 -702 453 637 -578 -493 916 195 -807 63
4193F3O83r14n19J293l33j007N55J224j025r48J227N65j630K77J353o06j063P20
$$ 63 746 -168 -687 606 273 -734 -179 1045 20 -928 299 864 -766 -489 864 258 -805 -85
4211h5J006j421m17J444J5j350K13J572r98j324J599Q29j612m54J866m24j609
$$ -85 921 -500 -917 527 542 -808 -595 977 -21 -1345 254 1083 -529 -983 883 459 -1150
4228a150Q15J633j456r03J589N04j718j85J975o87j557R99J457j733q58K031K23
$$ -1150 -335 1298 -158 -1061 528 1032 -686 -871 1104 417 -1140 -141 1316 -417 -1275 756 979
4245I79j869L59J801j074j337J529O86j519n64K040k38j878P81J619j199j280
$$ 979 -890 -531 1270 196 -1141 388 1074 -445 -1009 1031 793 -1085 -304 1315 116 -1164
4261a164J702P29j820n19K287o59j926J212J334j214j027J612L49j738J48J664
$$ -1164 538 1267 -553 -1072 1215 556 -1370 -158 1176 -38 -1065 547 896 -842 -694 970
4277I70n55j706J248J233j526n89J712j79j529M71J514j055j401J610R28j716
$$ 970 415 -1291 -43 1190 -336 -925 787 608 -921 -450 1064 9 -1392 218 1146 -570
4293e70l75J848j92j637O80J291j169r44J581K30j469lJ617o91j176J045R56j305
$$ -570 -945 903 711 -926 -246 1045 -124 -1068 513 743 -726 -729 888 197 -979 66 1022 -283
4311b83n43J271K32j307L15J352o69j234J282O91j570l49J586l43j387Q67P69
$$ -283 -826 445 677 -630 -315 1037 368 -866 416 1107 -463 -812 774 431 -956 -89 680
4328F80o32o83J085J76r10l7R04l79j044J076L31p12k88Q99m0j118N11R42r47
$$ 680 48 -635 450 626 -284 -321 583 204 -840 236 567 -145 -433 466 426 -692 -181 761 -186
4347a86l90R17J4p18J07P11k84q60P68N78r12k96J077l72r42P60P33q03m42Q73
$$ -186 -576 341 355 -363 -256 455 171 -689 79 657 -255 -551 526 154 -788 -28 705 -98 -540 333
4367C33K10j161K86J002o87q56J070M69j125j27J234k62j140P54Q41j026l76J208
$$ 333 543 -618 -332 670 -17 -873 197 666 -459 -586 648 386 -754 0 841 -185 -561 647
4385F47o9j146K07J136o48q44R99L79j014k40J358k43j065M26J017r25q52J574
$$ 647 578 -568 -361 775 127 -717 282 661 -353 -593 765 522 -543 -117 900 -25 -877 697
4403F97J61j587J77J689q18j307R58J157j371r28J801Q2j639O50J597j180j342
$$ 697 858 -729 -552 1137 319 -988 -30 1127 -244 -1172 629 711 -928 -278 1319 139 -1203
4420a203J550Q00j832j30J393m3j600Q02J350j356p85J524M89j716J5J547k08
$$ -1203 347 1147 -685 -815 578 535 -1065 -263 1087 -269 -1054 470 959 -757 -742 805 597
4437E97j781R06J485j446r91J731K24j630M6J947q48j568J564R71j733n95K013
$$ 597 -1184 -278 1207 -239 -1230 501 725 -905 -859 1088 240 -1328 236 1207 -526 -1121 892
4454H92J2k135P01J706j163j284J772N17j795j53J805k42j687Q15J386j242q17
$$ 892 904 -1231 -530 1176 13 -1271 501 1018 -777 -930 875 633 -1054 -239 1147 -95 -912
4471i12J422M94j651l5J678l94j637R94J040j018r47J383L93j309J04J364p37
$$ -912 510 1004 -647 -682 996 602 -1035 -41 999 -19 -966 417 810 -499 -395 969 232
4488B32j186J192P28j378l82J366K12j572N28J149r57r80J369L66j130j01J297
$$ 232 -954 238 966 -412 -794 572 784 -788 -260 889 -68 -1048 321 687 -443 -544 753
4505G53j89j462Q42P93j113k94J089K99j360J85J107m71j017P10P34r96Q6P84
$$ 753 564 -898 -56 737 -376 -670 419 718 -642 -457 650 179 -838 -128 606 -390 -304 480
4523D80o8j122M38Q51o74m81P13L18q25O1R60m03p45M38L29m25r3O15k13n31O71
$$ 480 412 -710 -272 579 -95 -576 137 455 -370 -309 651 248 -497 -59 270 -155 -248 367 154 -377 294
4544B94K92q39k85Q56J30q12K31O97l92o89J012N4q43P1O15j10q66P54M88q68
$$ 294 586 -253 -538 318 448 -364 -133 564 172 -517 495 549 -294 -223 392 282 -584 170 658 -210
4564b10k98J055l07j035Q57N69n59q91J138K08j089K59J013n38j029R62Q07j217
$$ -210 -508 547 240 -795 62 631 72 -819 319 527 -562 -303 710 172 -857 105 912 -305
4582c05m20J247P2j262M07J062p65j104J387M04j260j04J405j58j469N71J131
$$ -305 -725 522 594 -668 -261 801 36 -1068 319 723 -537 -641 764 606 -863 -292 839
4599H39j241n24J434L22j581j39J783n25j400R79J064j454n38J648l0j568M98
$$ 839 -402 -926 508 830 -751 -890 893 368 -1032 -53 1011 -443 -981 667 637 -931 -433
4616d33J644j075j201J181J056j694l99J661n9j587M46J620r14j324J544P44j794
$$ -433 1211 136 -1065 116 1172 -522 -921 740 681 -906 -460 1160 246 -1078 466 1210 -584
4633e84O1J214j7j709R14J526j379j061J648K28j925K34J807l42j877J234J197
$$ -584 -523 691 674 -1035 -121 1405 26 -1035 613 841 -1084 -850 957 615 -1262 -28 1169
4650A169j424q34J694K66k010N63J690q77j567J501R25j703m63J889j43k084J017
$$ 1169 -255 -1089 605 871 -1139 -576 1114 237 -1330 171 1096 -607 -1070 819 676 -1408 -391
4667c91J532j090j110J285O89j487l90J807l60j331P41R81j040r05J505L17j117
$$ -391 1141 51 -1059 226 915 -572 -962 845 485 -846 -105 876 -164 -1069 436 753 -364
4684c64l17J437k57j386Q77R54j200n14J128M19j162j18J172n09r24J149L76j080
$$ -364 -681 756 499 -887 -10 944 -256 -770 358 777 -385 -503 669 160 -764 385 761 -319
4702c19J02P71l75q57M56J085r25m98R66J8r30K69Q99m77q23O93N30q30O2O81
$$ -319 -217 554 179 -678 -222 863 -62 -560 406 424 -506 -237 662 185 -638 55 585 -245 -183 498
4722D98k49p10L87N61n80l43O28K89q10J08O82m77l62M46K44o97K0P14l36m74
$$ 498 249 -461 -74 487 -93 -436 192 481 -329 -221 461 -16 -378 68 312 -385 -365 349 13 -461
4742d61L95L41n60q0N98j29o60L47P18o84l21O22L75j039K53Q49n60n99O19M75
$$ -461 -66 275 -285 -365 233 104 -556 -209 509 -175 -496 126 501 -538 -285 564 4 -595 24 499
4762D99j048J5J056k22r27N72R72r45q10J362rj041K96Q21m09j124J066P89j159
$$ 499 -549 -534 522 300 -627 -55 917 -28 -838 524 515 -526 -230 591 182 -942 124 913 -246
4781b46l82J267n8j354O19J106q18j187J291P81j416k88J549j25j576O27J130
$$ -246 -628 639 581 -773 -154 952 134 -1053 238 1019 -397 -685 864 739 -837 -210 920
4798I20r74j019J537N14j467k61J593l81j401J031Q47r93j269J881J63j539P0
$$ 920 -54 -1073 464 978 -489 -750 843 462 -939 92 939 -54 -1323 558 721 -818 -748
4815g48J876q83j608J352J143j445r04J891j23j540M60J401o06j445J214R15j380
$$ -748 1128 245 -1363 -11 1132 -313 -1217 674 551 -989 -529 872 266 -1179 35 950 -430
4832d30n03J591J8j678O53J434j207j098J624L73j337n3J372k46j648J117J333
$$ -430 -933 658 676 -1002 -349 1085 -122 -1220 404 777 -560 -613 759 513 -1135 -18 1315
4849A315j414j082J526N88j563K74J236m82j394J164P39j135m44J275p5j428M12
$$ 1315 -99 -1181 345 933 -630 -356 880 398 -996 168 907 -228 -672 603 528 -900 -488
4866d88J426p46j152J047J040j499l47J252K20j470N04J040q09p79R81N17j404
$$ -488 938 192 -960 87 1127 -372 -719 533 753 -717 -213 827 18 -761 220 737 -667
4883f67K82P86q7q74K85Q97p39n39R56K16j031O2Q69m17o75Q25M53j169J89O84
$$ -667 -385 401 314 -560 -275 622 -117 -656 300 516 -515 -453 416 -1 -676 149 602 -567 -378 306
4903C06k17o29L28N44l84l53P55J26q90K97N69m16m53M56L30n29k53O98j27m63
$$ 306 89 -540 -212 332 -52 -405 350 476 -414 -117 452 36 -417 39 369 -160 -413 285 158 -305
4923c05K02M38m22r4M55J40o16K80L45o92K50K50J07o02J09O79l68m79M20M36
$$ -305 -103 335 -87 -181 274 414 -202 78 423 -269 -19 231 338 -264 -155 524 156 -323 97 533
4943E33p96p2R68n03o29L49O95n85m33N49L95r01K84P16m65j011J036N15j028
$$ 533 -263 -335 633 130 -499 -150 545 -40 -473 76 471 -430 -146 570 105 -906 130 645 -383
4962c83j09R60j24r63O13P68j028m61J128K57j107l4J186m46j261Q43J120j235
$$ -383 -492 468 344 -619 -6 762 -266 -727 401 658 -449 -483 703 257 -1004 -161 959 -276
4980b76m71J256J96j489J41J634q73j098J078R63j438l90J292K40j761N17J429
$$ -276 -747 509 705 -784 -643 991 118 -980 98 1061 -377 -767 525 765 -996 -479 950
4997I50q24j254J391N66j118k37J240j26j334P23J409j364j008J316N91j716J6
$$ 950 126 -1128 263 829 -289 -526 714 588 -746 -23 1386 22 -986 330 921 -795 -779
5014g79J866n08j356N90J455j550q08J666M95j534j78J323l19j369J153R89j337
$$ -779 1087 579 -777 -187 1268 -282 -1090 576 1071 -463 -641 682 363 -1006 147 1136 -201
5031b01n62J470M7j660K67J431o11j162J023R21j279o27J619j46j340M37J231
$$ -201 -763 707 754 -906 -639 792 181 -981 42 963 -316 -943 676 530 -810 -373 858
5048H58o74j081J116Q04j773N5J215k1j228N28J041q90o87J196K39j372L6J353
$$ 858 184 -897 219 1023 -750 -695 520 499 -729 -201 840 -50 -737 459 698 -674 -638 715
5066G15n18q96M44R01o54p16J092J70q92R2Q59l46r06P81O81r80l72Q86Q7r12
$$ 715 197 -699 -255 646 -8 -724 368 538 -354 -262 597 251 -655 126 807 -173 -545 341 428 -484
5086d84M01O16n06l85Q08M9p74K1P75m05l67K58L84m58m27O88j55m80L09N75o38
$$ -484 -83 533 27 -358 450 499 -275 -254 521 116 -251 7 391 -67 -494 194 39 -441 -132 443 -195
5107a95j6M20j7l99P4M17l04l47L73J01k96L2M04r6m29K96K38n19q3N32J37p73
$$ -195 -211 209 192 -207 -133 284 -20 -367 6 107 -189 -157 247 151 -278 18 256 -263 -346 186 323 -450
5129d50L88M65n85k99O73L85j005K91M79l65m86Q00L35j054J34O74l1r59N19P70
$$ -450 -62 403 -182 -481 192 577 -428 -137 342 -23 -509 291 626 -428 -294 380 349 -610 -91 679
5149F79q09m09Q77L65j093NQ68m56q77P71R51r80l32R77m1j091L52J044n99r04
$$ 679 -130 -539 338 703 -390 -385 483 27 -850 -79 872 -108 -440 537 496 -595 -243 801 202 -702
5169g02R87N79j254k02J296m15r00L52J114p25j018J151N87j475j03J552l33j261
$$ -702 285 864 -390 -592 704 289 -611 -259 855 130 -888 263 850 -625 -728 824 491 -770
5187g70O74R61r05r27J152N97j379J33J530q30j271Q16J112j445m44J452J79j470
$$ -770 -96 865 -40 -967 185 782 -597 -464 1066 236 -1035 -219 893 -552 -996 456 635 -835
5205h35J57J636q17j011Q95Q99j355l32J332M1j514L39J392p03r79Q28P34j358
$$ -835 -678 958 141 -870 25 924 -431 -763 569 610 -904 -565 827 124 -855 -27 707 -651
5223f51N4R90R5j371P38J019r96p04J089M98j325j38J548n26j293R65R58r92n56
$$ -651 -597 393 488 -883 -145 874 -122 -826 263 761 -564 -702 846 320 -973 -8 950 -42 -598
5242e98J061K48j300J66J218n74r50P63P56r65k44J028M2r43n6J003n44r05Q15
$$ -598 463 711 -589 -423 795 221 -729 34 790 -175 -419 609 651 -292 -348 655 111 -794 21
5261B1L94o47m18J245k46p56K81N44l06o64P77J69o94k17J009k81o22L44M78l32
$$ 21 415 -232 -650 595 349 -407 -126 418 112 -552 225 394 -300 -517 492 211 -411 -67 411 79
5281G9m38O12J42p23Q1O13l05n12N47K44l02k80M84l9n11M40K12l01j48K14j07
$$ 79 -359 253 395 -328 -247 366 61 -451 96 340 38 -242 242 203 -308 132 344 43 -105 109 2
5302Bj83M18J73n67j32N60j24m40L23K28j43k25L10P5l17k99N56j67l02L97K88
$$ 2 -181 237 410 -157 -289 271 147 -293 30 258 115 -110 200 275 -42 -341 215 48 -254 143 431
5323D31l44l38M37j09l44K56M05m89l48P29R3q02J84Q24p63n53N93N56q93j05
$$ 431 87 -251 186 77 -267 -11 394 -95 -443 286 379 -423 -239 585 -178 -731 -138 418 -475 -580
5343e80J039Q5j138M06P42o84n08R23J57r34M0J081m33j014O50Q31r59l40R70
$$ -580 459 544 -594 -188 554 -130 -638 285 442 -492 -452 629 196 -818 -168 663 -296 -636 334
5362C34J76j130J05R61l51q48P58N68j093q0J152j70j099K55J269q27p12Q74O26
$$ 334 510 -620 -515 446 95 -753 5 573 -520 -600 552 382 -717 -462 807 -20 -732 142 768
5381G68j115k41J210j08j288M19J384j181q16J324N23j539P5J374k95j371Q88
$$ 768 -347 -588 622 514 -774 -355 1029 -152 -968 356 879 -660 -585 789 494 -877 11
5398A1J067j203o18R32M58j221J07J259m32j256J040P74j145m93R84L23j317J69
$$ 11 1078 -125 -743 189 647 -574 -467 792 360 -896 144 918 -227 -720 264 587 -730 -561
5416e61J257l53j204P97P38r68m50J186J31j094L6J194n79q66Q40M00q79l44J203
$$ -561 696 343 -861 -64 674 -294 -744 442 573 -521 -485 709 130 -736 104 504 -375 -719 484
5435D84M1j207L56R52n49r42J125N2p02q1J071j90r83M43P67p00n68R49K41j062
$$ 484 525 -682 -326 626 77 -865 260 312 -390 -471 600 410 -573 -130 637 -63 -631 318 559 -503
5455e03K35O00o4p37M94M34m87m67P44J95n91j37P75n34n32P09N28o51j40J91
$$ -503 -268 332 268 -469 25 459 -28 -495 249 444 -147 -284 491 -43 -575 134 662 11 -129 62
5475F2K80n70J73L25R9j71p9N93j106J35K85Mq28J121l57Mo38R93p15j31M98L09
$$ 62 342 -228 -55 270 369 198 119 712 -394 -259 26 30 -798 323 -34 -30 -668 325 -390 -521 -23 286
5497B86m27l51M08O2N92n65M92O4j166O59k48j52L12J20k22J05J13M8l39J72L34
$$ 286 -141 -492 -84 -22 570 5 497 561 -605 54 -194 -346 -34 86 -136 -31 82 130 -209 -37 297
5518B97l28k52M61L57q46k7N42Oo26K53N77l76l93Q00N5q11j11J095m43o69O08
$$ 297 -31 -283 178 535 -311 -338 204 210 -416 -163 414 38 -355 445 500 -311 -422 673 230 -439 169
5539A69L33r70J41P16Q3r87L19P72m62p93Q38M67r79j45R73n1q84L57Q90j027
$$ 169 502 -468 -327 389 472 -515 -196 576 114 -679 159 626 -353 -498 475 424 -460 -103 787 -240
5559b40n00J034J28o47l41J195j14r55J99J099q62p32J105L57j168o5J170m26
$$ -240 -740 294 422 -225 -566 629 515 -440 -241 858 -4 -736 369 726 -442 -507 663 237
5577B37q83M91R41j112k40J040M1j070p5J310m83p86O68O88r81m53J178j04q86
$$ 237 -646 -155 786 -326 -566 474 515 -555 -630 680 197 -589 79 767 -214 -667 511 407 -479
5596d79L28Q75n34r86R70L89j005r1J029p0j116N85O60n72q45R47N64r95Q5O72
$$ -479 -151 724 190 -796 174 563 -442 -533 496 426 -690 -105 555 -17 -862 85 649 -346 -261 411
5616D11r6q75L25R12p55o46J113J5q27L8P29k65p73O47Q96j007m33P34K43p89
$$ 411 315 -560 -235 677 -78 -724 389 404 -423 -385 344 79 -694 -47 849 -158 -591 143 386 -403
5636d03J60O93l21o86M85P51j035j8N92L7q11M14P03m60p53P63J42m99k4L98j3
$$ -403 -243 450 129 -557 -72 679 -356 -374 218 255 -556 -142 561 101 -652 111 253 -246 -270 128 115
5657A15m38K83L89l19k36L73j4m32P0K52J59n81M81Q1j80j73L30k71j09K6K02
$$ 115 -323 -40 349 30 -206 167 153 -279 -209 43 202 -379 102 183 3 -170 160 -111 -220 -194 8
5678HO5l11L57k5j70L14j56J9j7M7j37k07J20L21r2l17L68j44p9Q0J03l13j12
$$ 8 73 -238 119 94 -76 238 82 101 84 131 -6 -213 -93 228 136 -181 187 43 -36 44 147 -166 -278
5701b78M15J08n13Q2M84l86k64K91K01k30j82O12k39l84K31L95m08j62L48K17
$$ -278 137 245 -268 -186 298 -88 -352 -61 140 -90 -272 340 101 -283 -52 343 -65 -227 121 338
5721C38m06l17P16j18o52M73M06n47j71K84L15o65J07O20m07m08O23J41o58o2
$$ 338 -68 -385 331 213 -439 34 440 -107 -278 6 321 -344 -237 383 -24 -432 191 332 -326 -388
5741c88O32O4p36J76Q82l51r25Q40L96p60l50R28N9r24M14O01n36p38Q70L31q31
$$ -388 244 308 -428 -252 630 279 -646 194 590 -170 -520 408 467 -457 -43 558 22 -716 154 485 -346
5762c46N3P64k45q58N92O66o99o82R92L34r50j3J092k47q34L02P34q72k71Q75
$$ -346 -293 471 226 -632 -40 626 -73 -755 237 571 -379 -392 700 453 -381 -79 655 -217 -488 387
5782C87Rp81j19J320n25r63N75O15o10n66R12J64q03L7Q52n10n49N66N59p21n13
$$ 387 396 -385 -504 816 291 -672 -97 518 -92 -658 254 418 -385 -348 504 -6 -555 11 570 -151 -664
5803f64J043Or86K36J041n01p87O56K77o56j50O75K94r39J42Q56m71o65N81L49
$$ -664 379 385 -601 -365 676 175 -612 44 321 -335 -485 190 484 -455 -313 543 72 -593 -12 337
5823C37p31J9O18q1o64L46O26n56k91N49K97o13n3O31l52m25L90J29j76l09L86
$$ 337 -394 -375 243 162 -502 -156 470 -86 -377 172 469 -144 -197 434 82 -343 47 176 0 -309 77
5844G7K81o34K61K83o2m38K55L31l32k95L80J14l92%N73k98l24r5M53k93q4O89
$$ 77 358 -276 -15 268 206 -232 23 354 22 -273 107 221 -171 -171 402 104 -220 -315 138 -155 -239 450
5866D50n06K1Q8p5P1j79K31k3k19K3K58j66k08L33k94J88J30M6k98j12L93j93
$$ 450 -56 -35 53 -22 49 -130 101 78 -141 -118 140 -26 -234 99 -195 -7 123 169 -129 -241 152 -41
5888d1J3Q0J42j34k60L64l95R2J08J68Jl43M41O1n03K40K44k18m17N35R1n19j
$$ -41 -28 52 194 60 -200 164 -231 -139 -31 137 138 -205 236 297 -206 34 278 60 -357 178 269 -250 -251
5911b51M14R6l75O5L29l54l70O62J40o35n8M98K66q31K95M98n50k20N43K44o93
$$ -251 163 259 -116 -51 278 -76 -446 216 356 -279 -337 161 427 -404 -109 389 -161 -381 162 406 -287
5932b87k7P06l15n33O09L93n62m57N54M44j023M76N37l63m64K60O08o83j56P32
$$ -287 -314 392 77 -456 153 546 -16 -473 81 525 -498 -22 515 152 -312 -52 556 -127 -283 449
5952D49j93p26N3R89n88o69N93M74p09o3N74J14o29J29O77m53o34P64M30r26k02
$$ 449 256 -470 -417 572 -16 -685 -92 382 -327 -390 184 298 -331 -202 475 22 -612 152 582 -344 -546
5973e46R44m5o70P0P75o97l93P77J44o78r1R67m18o83N44M30m61m39N71M60r89
$$ -546 398 353 -317 -247 528 -169 -562 215 359 -319 -410 557 139 -544 0 430 -31 -470 101 561 -428
5994d28K37O03l71k32m3P55n78l40N48K36o06j96P94j10n77L46M93m78m76N41
$$ -428 -191 412 41 -191 -234 521 -57 -397 151 387 -219 -415 379 269 -308 38 531 53 -423 118
6014A18K76p54J47O96o07k98L84K82m09j57L96K39p42J01Q82l05n88L00M08n32
$$ 118 394 -360 -213 483 -124 -422 -38 244 -165 -322 74 313 -429 -328 554 249 -339 -39 369 -163
6034a63jK88l5l56n1O32k79n30M99J70j23j81L32k48J8N5qj35K8K28K1k91L46
$$ -163 -164 124 89 -267 -318 314 35 -495 4 174 51 -130 202 -46 -28 27 19 -116 -88 140 161 -130 216
6057B16k79J14p2J31r7O6q5J47n8Qn0L5j37m9N9P0j62J77J9k01K01Pj34M9J19
$$ 216 -63 51 -21 110 13 79 -6 141 83 91 41 76 -61 -110 -51 19 -143 34 53 -148 53 60 -74 -25 94
6082I4m8O4j05K36k43j00J23M7k20n5L00J72m53K04O9Q6n11K84J27k93k0L03j09
$$ 94 46 110 5 241 -2 -102 21 68 -152 -207 93 265 -188 16 85 171 -340 -56 71 -222 -242 61 -48
6105d8j90L42L6k76r9N31L5n39K16L80m45k07K41L81o07P7L07J80p40L25M33l95
$$ -48 -238 104 140 -136 -235 296 331 -208 8 388 -57 -264 -23 358 -249 -172 135 315 -425 -100 333 -62
6127f2j10K78L8k27p0K92n7m60L45M23l52m66O80J14o25J39N00l22n04N98K71
$$ -62 -172 106 144 -83 -153 139 82 -378 -33 390 38 -428 252 366 -259 -120 380 58 -446 152 423
6148D23m60m77Q97j74n05J33N62k55n47N10L45m18m43P64p6p32L82M14l22n26
$$ 423 -37 -514 383 209 -296 -163 399 144 -403 107 452 34 -409 355 279 -453 -71 343 21 -505
6168e05O71K12q51J63O91j49o50K35M96k56m87P53m9o57j25P17J75n80KO22m74
$$ -505 166 378 -473 -310 381 232 -418 -183 313 57 -430 323 274 -383 -508 209 384 -196 -194 428 -46
6189d6l48M15M13m51l70P37n1o96L12L75m65j89L64L81n23p4O50j81l31r9N15
$$ -46 -394 21 434 -17 -387 350 299 -397 -85 290 -175 -364 0 381 -142 -216 434 253 -78 -177 338
6210C38k53k80M70l5k20l72O26r0m97M26K45m37k55L97N6q4J9K12j08k41O4J95
$$ 338 85 -195 275 240 20 -352 274 184 -313 113 358 -79 -334 63 119 35 54 266 158 -83 -19 176
6232A76l72N6L27mk25n8L39j46j76L6m7J25k3j08l4K4K85j81j2j48Q7j4R5p7n9
$$ 176 -196 -140 187 183 -42 -100 239 93 -83 -47 -94 31 8 -100 -134 -110 175 -6 -18 -166 -79 -93 2 -75 -134
6257a34K10m69N29k94Q7J62j00R8k6k2J49l64K83j85M0M3K29o3l49K81K4l02J6
$$ -134 76 -393 136 -158 -71 91 -9 89 63 41 190 -174 109 -76 -36 7 236 173 -176 105 129 -173 -157
6280a57R8o5O9j49K52M5l23J30K63l06m9L19J1m08K63L41j84l26Q0M07m69J66
$$ -157 -59 -124 -55 -204 48 93 -230 -100 163 -143 -192 127 138 -270 -7 334 150 -176 -96 311 -158 8
6302HQ7rk15J53J08j63k30N19j65k83J96M83m70l50K74N44n81l94O26o8l05J55
$$ 8 95 86 -129 24 132 -31 -261 258 93 -190 6 489 19 -331 -57 487 -94 -488 138 70 -235 -80
6324h0K18mm06J11M05m83J84J75J28o07K06O08k72n07L28K94o09nO17j45l72J09
$$ -80 138 134 -272 -161 244 -239 -55 120 248 -359 -153 455 183 -324 4 298 -311 -316 301 156 -216 -107
6346a07N77m38m07M46J24l27j97M69m9j90J84J87l67k02L12K68l61m0K10o2l31
$$ -107 470 32 -375 71 195 -132 -329 140 91 -99 85 272 -95 -297 15 283 -78 -118 92 30 -301
6367c01K54K00j81j58K32k2l1j54K49J9l07K33K23k85k47L96N9l29L8L27k55q8
$$ -301 -47 153 -28 -186 46 24 -7 -161 88 107 -200 33 256 -29 -276 120 179 -150 -112 215 -40 -128
6389a28K37K07l40j17L82q3n47K52K85k8l92J13N38l70j31J57J18l50Q0J91J35
$$ -128 109 316 -24 -141 241 158 -389 -137 148 120 -272 -159 379 9 -122 35 153 -197 -117 74 209
6410B09n22L78J08j60l17K44l2j58J10L8J75k86K40K31m15J60J12j59O1j3L8k46
$$ 209 -313 65 173 13 -304 -60 -92 -250 -140 -102 73 -213 27 258 -157 3 115 -44 17 4 42 -204
6432b04O2lJ40N7K44j95k9m1j57K69M6j55q3J75K9l44J80J04j72J57r1K71o1l14
$$ -204 -142 -145 -5 52 296 101 72 31 -126 143 189 34 -49 126 155 -189 -9 95 -77 80 -11 260 199 -115
6456a15L7J06%O6J86l29J23k44O7J64J35k29J71k72n5K28K1L9j85R2J92l56j11
$$ -115 -78 28 28 94 280 -49 74 -170 -103 61 196 -33 138 -134 -189 39 60 99 -86 6 198 -158 -269
6479b69K18K11m80O4K62P6k17J42K08l47n8K63J8l55J44M08l26n8lK31l42J49
$$ -269 -51 160 -320 -256 6 82 -135 7 215 -132 -190 73 91 -264 -120 288 -38 -96 -99 132 -210 -61
6501f1K53r0m75K54L22j56m29N69J22m54PK53q0k89L91N4j82l84L02M42n12R8
$$ -61 192 102 -373 -119 203 47 -382 187 309 -145 -138 115 35 -254 137 191 9 -375 -73 369 -143 -45
6523d5K97l63l5L2L72l50p2M03kk87j62M15k38k31J21M38l38Q9J35K45p15K46
$$ -45 252 -111 -146 -114 258 -92 -164 239 237 -50 -212 203 -35 -266 -145 293 -45 44 179 424 -291 -45
6545d5K38j90l70K95J43r9j25J88m4k81K44K07m1m49L62K87m47j54L49l4l03J40
$$ -45 193 3 -367 -72 71 -28 -153 35 -9 -290 -46 161 120 -329 33 320 -127 -281 68 34 -269 -129
6567a29M69n39l31O63K2l05o3M69k51j43j8N04n67R3K50m5k34M4J55q4m5O9P5
$$ -129 340 -199 -530 133 155 -150 -213 256 5 -138 -156 348 -219 -126 124 79 -155 -111 44 -40 -85 -16 59
6590E9j43r1J83Q6k77J9M63j89k4j21K72m12N9K88k30P7j30K32j19J56p5o2q6
$$ 59 -84 -175 8 94 -183 -164 299 110 86 -35 237 -175 -116 172 -58 19 -111 121 2 158 83 21 -65
6613f5K5K54j57j22l4Q3j67J77k9j7k7J76j48K7Oj1J23k47K73k62Q8k8K1M3J02
$$ -65 -40 214 57 -65 -99 -16 -183 -6 -35 -52 -79 97 -51 -24 -18 -29 94 -153 120 -142 -54 -82 -61 -18 84
6638H4K1j22m6JQ6P2O5k45J31k40R8J53L2j34J12j32j08K66m7J9r5J42k67N6L0
$$ 84 105 -17 -63 -62 24 96 161 -84 47 -193 -95 58 90 -44 68 -64 -172 94 47 66 -29 113 -154 -98 -68
6663f8Q3O3k56K77j44J53k07K17N4j61p1Q0J99l3j47k4kj26L5J83j80P6J52j26
$$ -68 15 78 -178 99 -45 108 -99 118 172 11 -60 20 219 186 39 15 13 -113 -78 105 -75 1 153 27
6687B7j47M2P8R7j20PL24l42k04K30K93k75j49J74N0k52R5M54m06%J57O7m50K51
$$ 27 -120 -78 0 97 -23 -16 308 -34 -238 -8 285 10 -139 35 85 -167 -72 382 -24 -24 133 200 -250 1
6711AJ26Nm45R1M54k59j84K27K10l91J22J77k8m15L18M5k17P1J36L21o08L4L90
$$ 1 127 132 -313 -222 232 -27 -211 16 226 -165 -43 134 106 -309 9 54 -163 -92 44 365 -243 -209 181
6734A81Pk97J50J48l39L8J23J64k52j22K13j01k05K83L18j69j82K80k3m06Q7J28
$$ 181 188 -109 41 189 -150 -112 11 175 -77 -199 14 -87 -292 -9 309 140 -42 238 215 -191 -104 24
6756B4m9p5J35K18j27j45O1J2k88L9M33j92l39M58k8j75M7Q5Q1n40O0M07k79N2
$$ 24 -25 -100 35 253 126 -19 42 54 -234 -195 238 46 -293 165 137 -38 9 94 175 -365 -305 102 -177 -125
6780a25J01R6j75N2K90q2q1k07K54P3l27N9M3j17J55%j36J66j29Q1j42Oo3J95
$$ -125 -24 72 -103 -51 239 157 76 -131 123 196 -131 -72 -29 -146 9 9 -127 39 -90 -9 -151 -145 -208 -13
6804a3j1j51K10k1Q9j29J88k6p9j93J45M4j70K06p6Pk46M45j93j7L7J5n3QJ79
$$ -13 -24 -175 35 14 103 -26 162 136 57 -136 9 53 -117 89 13 20 -226 219 26 9 46 61 8 16 195
6829A95k04j26M9J44n5k24j9J38J66j7p5Q1j44n4J27J29j9o4n8J58l21J62K36
$$ 195 -9 -135 -86 58 3 -221 -240 -102 64 47 -28 53 -91 -145 -18 111 92 28 -30 128 -193 -31 205
6852B05o9l10K07N5n8k01J78J2qp8MK4j24l2L50L3M9l40J28j44J72j85K22j60
$$ 205 136 -174 33 88 30 -171 7 19 11 -67 -63 -39 -163 -195 155 188 237 -103 25 -119 53 -132 90 -70
6876g0J56MM6j63K6o8K20k58K27K0L9j91R4K05n59K40r5J40k46L64k14j60J31
$$ -70 86 90 136 -27 -1 -69 151 -107 120 140 179 -12 82 287 -272 -32 -127 13 -233 131 -83 -243 -112
6899a12K32Q4l45N1L40p6k91L5n0J61J75L8j53k71K37L74o20q3N46j01k99N9L8
$$ -112 120 204 -141 -90 250 174 -117 -82 -132 29 204 242 89 -182 55 429 -191 -274 272 171 -128 -69 -31
6922c1K15j67p8J76o4l16K2K84k44J62K5J84k08n2J02J09n81L86K59m12q3K73
$$ -31 184 17 -61 115 51 -265 -243 41 -203 -41 -16 168 -40 -92 10 119 -462 -76 183 -229 -312 -39
6944c9J53k69j0L63l9k99J80k6J05k20K05mm01J74N6J10j93J02J45r4Qj1Mr6N6
$$ -39 114 -155 -165 198 159 -140 40 14 119 -101 104 100 -301 -127 -71 39 -154 -52 93 -1 7 -4 0 -96 -40
6969d0K30j15j43J84O0l43J48J74n8j39Q9J02k50r3K51j05o4m6J27J71M1j55J43
$$ -40 190 75 -68 116 176 -167 -19 155 97 -42 47 149 -101 -194 57 -48 -112 -158 -31 140 181 26 169
6992A69j41k85M10J28k08j51J38J15l29K83o6Jn7l50M72j86K00k16J46j03j9J98
$$ 169 28 -257 153 281 73 -78 60 175 -154 129 63 64 7 -343 129 -57 143 -73 73 -30 -49 149
7014A49l6q8p6L18l02q3N8Q3J30j75J40k83ML42j39J0k21n3K21j98J19m7J85m0
$$ 149 113 25 -51 267 -35 -118 -60 23 153 -22 118 -165 -161 181 42 52 -169 -222 -1 -199 -80 -127 58 18
7038A8k58L32k02J20j24J29l8J4K6J37j35j3kJ38k29j5Rn2K32J95k42p9K6J42
$$ 18 -240 92 -110 10 -114 15 -23 -9 17 154 19 6 4 142 -87 -102 -93 -145 87 282 40 -39 -13 129
7062A29j58J01j4Q5j18j05J63l0pk3m4J37N6k13K8j17J91k49J88J22j68p0L22
$$ 129 -29 72 58 143 25 -80 83 53 46 23 -21 116 172 -41 -13 -130 61 -188 0 122 -46 -116 206
7085B06q0j53K60k61j25K75K2j13r1L1K33l68p2M92k19k17J99M8J07j45L5O0j61
$$ 206 126 -27 233 -28 -153 122 144 31 -60 -29 204 -164 -236 256 37 -180 19 67 174 29 64 124 -37
7108c7n3J29N2l7r2J2LJ2L33j83k70o1J96N2j34m3M09l05q9o3J48J5J79L4k05
$$ -37 -90 39 91 54 -38 -26 -23 -11 322 139 -131 -192 4 56 -78 -121 288 -17 -106 -169 -21 -6 173 207 2
7133Bj25K39j11k49J26J49P4k68j50L13J07m8r0R0o0L5l6O2r1j58L10l01j52L69
$$ 2 -123 116 5 -244 -118 31 105 -163 -313 0 107 59 -31 59 -1 34 -2 60 -31 -189 121 -180 -332 37
7157C7r3llJ94K8k81J4N4k15J54n9L32j42pk2K15l00m4K06Lo5J84l71J39J5j16
$$ 37 -56 -59 -62 132 160 -121 -107 -53 -268 -114 -173 159 17 10 -12 203 -97 -141 65 68 3 187 -184 -45 -30 -146
7183a46J63k9q4L31k62k36J11R9J57Rj93K23k39N0p3J58n5p7L2O4j78J27J98O6
$$ -146 17 -12 -96 235 -27 -263 -152 -53 104 113 -80 143 -96 -46 -119 39 -16 -93 -61 3 -175 -48 150 216
7207B16j75J6p8J52k05K42j93J29k56J18J10p2k21J87J01k06Q6Q5j23jJ11N1j10
$$ 216 41 57 -21 131 -74 168 -25 104 -152 -34 76 4 -217 -30 71 -135 -49 36 -87 -88 23 74 -36
7230c6J5J5J45l15R0M8N1p8p8M09l31L8J0R8k09J19O4j70J44Q7p7l07M12j23o7
$$ -36 -21 -6 139 -176 -86 -38 13 -65 -143 266 -65 -27 -17 81 -128 -9 55 -115 29 116 39 -268 144 21 -46
7255d6ml4J90j30j74J44J77k35K04nJ02m86K14P1OJ48oo0n2l5M9P4r5J11j19O6
$$ -46 -50 -84 106 -24 -198 -54 123 -112 92 87 189 -297 -83 -12 -6 142 136 76 24 -11 38 112 17 128 9 75
7281G5j25J42P2l33K91J33l11j75J94O1M1k03K50j63ko0J54R8L0k40j50K43j14
$$ 75 -50 92 164 -169 122 255 -56 -231 -37 24 65 -138 112 -51 -53 -113 41 139 169 -71 -221 22 -92
7304i2J28l9K13m55K79M9p2q9K99l76P8J70J51k78lK7K5j61L2L43l97R6oJ34j87
$$ -92 36 -3 210 -245 34 83 11 -78 221 -155 -77 93 244 -34 -37 -10 15 -146 -114 229 -168 -72 -78 56 -131
7329a31o8L01j6k65K09j07rK1K52j95Qn2Q4L0j8j07L64l12n8K17J6Qk10J85J29
$$ -131 -199 102 86 -179 30 -77 -86 -65 187 -8 0 -52 32 62 44 -63 301 -11 -69 148 164 172 -38 147 276
7354B76m25J2J68K50k13n8J40O7k80N2K70l43K44M2k00Q7j18R5o4n3k28L77j20
$$ 276 -149 -137 31 281 68 10 150 217 -63 -11 259 -84 160 202 2 89 -29 66 2 -51 -279 98 -22
7377b2M3j21L2J26j83K78k28o5J03m1j44P9lJ59jj57J18r0J93j23nL0p3K32j85
$$ -22 21 -100 -68 58 -125 153 -75 -140 -37 -78 -222 -143 -146 13 12 -145 -27 -117 76 -47 -52 -22 -95 137 -48
7402d8O4k1P7R8k61J95K2j20L3j50n8L86j65j39K69n00K85j47J85K9n4l5J91k55
$$ -48 16 -5 72 170 -91 104 126 6 39 -111 -169 217 52 -87 182 -318 -33 -180 5 34 -20 -55 136 -119
7426a19M0J77k90K17J12j4k35M3NJ48j88K14R1l15j6K06j89K1O5O9R9k53N0J60
$$ -119 -79 98 -192 25 137 123 -112 -69 -64 84 -104 110 201 -114 -130 76 -113 -92 -27 42 141 -112 -62 98
7450I8N9l27J76j8k16K82O6j02Q0J8Mq5k35K55J4j02J58o3N7l28M36j30r8J90
$$ 98 157 -170 6 -12 -228 54 120 18 98 116 120 35 -200 55 69 -33 125 62 119 -209 227 97 -1 189
7474A89j26kq6J66J6j39l8m0K05p9k54K85k35K2J73P0r4m45M74O4m81L19J66j4
$$ 189 63 61 -25 141 157 18 -20 -60 145 66 -188 97 -138 -116 57 127 33 -412 62 126 -355 -36 130 116
7498A16N5k22J64l53L11l43J41M7j06L62K9p0j83M04l05j24J45pm2j90K16l1p2
$$ 116 171 -51 113 -240 71 -272 -131 -84 -190 172 201 131 -52 352 47 -77 68 61 19 -171 45 14 -58
7521e8q4J94n7j52J49n2N1j36K11j41J08j65j37K86QJ9j29kM4J84j03o8k88M60
$$ -58 -142 52 -5 -157 -8 -60 -9 -145 66 -75 33 -132 -269 17 25 44 -85 -87 -43 141 38 -30 -318 142
7545A42j31l2j94K67m5k09J43P3j91N4M1J93J8j07O9M7k31K60j30q7J71M3j90
$$ 142 11 -21 -215 52 7 -202 -59 14 -177 -123 -82 111 129 22 91 138 -93 167 37 -50 121 164 -26
7568b6j91J37J42r3l4O0r0J17j71Q1J62o4O2k25R4j17L01j62q0O8Q4NJ0p1rP2
$$ -26 -217 -80 62 -31 -65 -5 -95 22 -149 -68 94 30 92 -133 -39 -156 145 -17 -97 -29 55 60 70 -1 -10 62
7594F2j39R5J11j71m7J04j32L7K32m9J37l73lK00M9l8j41J12r6J27nJ49k7k64
$$ 62 -77 18 129 -42 -89 15 -117 -80 152 103 240 -133 -136 64 113 75 -66 46 -50 77 72 221 194 -70
7618g0J58k34O5J66J41j93M6K1j16J99k53J27Ql7J22j46r5J04Q2j34k3J57k26
$$ -70 88 -146 -81 85 226 33 79 100 -16 183 -70 57 65 28 150 4 -91 13 95 -39 -62 95 -131
7641a31J43j2pP0K0M0j95N9k47K46J29j51K3N4J78l09K19j29J62J17k46K44k69
$$ -131 12 0 -7 63 83 123 -72 -13 -260 -14 115 -36 -13 41 219 -90 129 0 162 279 33 277 8
7664Hq6K2J08l0J70j36O3Pj05J20M7p5j94O7J42k21j76L90J1l03M34m02J5K16
$$ 8 -78 -56 52 22 192 56 119 126 21 141 188 113 -81 -14 128 -93 -269 121 132 -171 263 -139 -124 92
7688I2j21J2qR0k3j3j04j6J00K10k10k8J90k84J33L8o4O4o7opJ4J05J61k96k8
$$ 92 -29 -17 -25 65 42 29 -75 -91 9 219 9 -19 171 -113 20 58 -6 58 -9 -15 -22 -8 97 258 -38 -66
7714f6J9k5Rl5R2J07j5j74K04l2j77J65k26P1K18j80O6l4J36l2%o6p9J36j93K6
$$ -66 -47 -72 -63 -98 -6 101 86 -88 116 84 -93 72 -154 -83 135 -45 21 -13 123 91 91 25 -54 82 -111 -85
7740h5J14r5K21k03k33K27O2j14r1L08m1j65j19J48J47k01L65k03O1j01q1R4j74
$$ -85 29 -66 155 -48 -281 -54 8 -106 -197 111 70 -95 -214 -66 81 -120 245 42 103 2 -79 15 -159
7763a59J68j84pP8j0J09K20k44K04k03j08K88p9j98N6J9J51j28R6l91K73j7Q2
$$ -159 9 -175 -182 -104 -114 -5 215 -29 175 -28 -136 152 73 -125 -69 -50 101 -27 69 -322 -49 -66 16
7786A6J01j23J67k52J78j08j1j57K02L5O6q1o9J32m38K38j10K74j86K53j23j27
$$ 16 117 -6 161 -91 87 -21 -32 -189 13 48 114 33 -36 96 -342 -104 -214 60 -126 127 4 -123
7808a23L2J94j17j5M4J16P5l92J85O8J3j72L8J73j59p5L24j92l6k9R0l2k2k40
$$ -123 -91 103 -14 -29 15 131 206 -186 -1 67 80 -92 -54 119 -40 -115 209 17 -19 -48 42 10 -12 -252
7832b52K60Oo0M23l57o9r8J51k88L91k20RL92k63J64p9j02r2J35J26k16N4o1K49
$$ -252 8 14 -46 377 20 -49 -147 4 -284 107 -113 -104 288 25 189 110 8 -84 51 177 -39 15 -46 203
7856B03l32J8J57j11N6O5J00m17J25L74k14J8P7l8j35j47J51J90l57Q7L70qj25
$$ 203 -129 -111 46 -65 -9 56 156 -261 -136 238 24 42 119 81 -54 -201 -50 140 -217 -130 240 232 107
7879A07k36J66p7n6j97L12OJ01k46J37R4n5j03N9j35J13qo6j57L43j42J10p4J77
$$ 107 -129 37 -40 -96 -293 19 25 126 -120 17 111 56 -47 12 -123 -10 -18 -84 -241 102 -40 70 -4 173
7903A73k20l1j14K38m8q1J05lL4k0Q1k50J7j02K76J92l47K6L29m18j7J62P2%l12
$$ 173 -47 -78 -192 46 -2 -83 22 19 53 33 114 -136 -119 -221 55 247 -100 -74 255 -163 -180 -18 54 54 -258
7928b58K84l4K5j62R1n4J33r3M7k9KL5L0k5m8J03J12j56j17R7j49R5k46L38j04
$$ -258 26 -8 17 -145 -54 -108 25 -68 -21 -50 -48 -13 17 -8 -56 47 159 3 -114 -17 -166 -71 -317 21 -83
7953h3J48Q0j97j81J70J11l8N4L1j21K29l24J42j41J50P6K4j42j06L21k76j3n
$$ -83 65 145 -52 -233 -63 48 10 64 95 -26 203 -121 21 -120 30 106 130 -12 -118 203 -73 -86 -91
7976i1J41j02j07J58o9L3L3K56k65o8l8Q8K17l10J53j3J2J2j37J46j31k3J05Q9
$$ -91 50 -52 -159 -1 -70 -37 -4 252 -13 -81 -119 -31 186 -124 29 16 28 40 -97 49 -82 -105 0 89
8000H9k14K40k55j9J60J79j71j37L06k47M9K6q9K40j69j18J40j16L9K45q0O4j69
$$ 89 -125 115 -140 -159 1 180 9 -128 178 -69 -20 6 -83 157 -12 -130 10 -106 -67 178 98 162 -7
8023gk6M3q1K75k20J02Q8k29M5j38J38J32Pj57o8J59j6j49L5K1J4l5J73J30k75
$$ -7 -33 10 -71 204 -16 86 174 -55 -10 -148 -10 122 129 -28 -96 63 47 -102 -67 -46 -32 -67 106 236 -39
8048c9j43K32k06K23j19L7P5M4j93O6J13J2k38K50r4J30M3Kj98j45K31L3J2n1
$$ -39 -182 50 -156 67 -52 -15 60 104 -89 -23 90 102 -136 114 20 150 193 195 -3 -148 83 116 128 77
8072G7k4j50K84Mk72N2q8J6m0LR3J14j20J07j50J04M9j58K18l09K06k01L06o8
$$ 77 53 -97 187 191 -81 -29 -117 -101 -141 -138 -45 69 -51 56 -94 10 59 -99 119 -190 16 -185 121 53
8096E3j65l3J72R8m29L44J8M8j42J87k71J72R6j21j10L01j57j33L8J88j36L9j11
$$ 53 -112 -145 27 125 -304 40 58 106 -36 151 -120 52 148 27 -83 218 61 -72 -34 154 18 57 -54
8119e4kP3P1P9k10K95n4m86K66J01k46K70p0J24j24k7PNj34R1J62j82J8q9R6k6
$$ -54 -56 17 88 167 -43 252 198 -288 -22 79 -167 103 33 157 33 6 13 18 -116 -25 137 -45 -27 -116 -20 -46
8145d6J29l4k04J32KJ9J9k28J44m6L2L4J19j00k42L07j48J33J64j09M0n5n7J05
$$ -46 83 49 -155 -23 -21 -2 17 -211 -67 -113 -81 -47 72 -28 -270 37 -111 22 186 77 117 62 5 110
8169A10k34k0P8Q5K12l11J24j16M9j9L1Q4j79J46m5J00m83L32K31k81K46p9
$$ 110 -124 -144 -66 19 231 -80 44 -72 -23 -42 -11 73 -106 40 -5 95 -388 -56 175 -106 140 61
8191F1
$$ Imaginary data points
##PAGE= N=2
##DATA TABLE= (X++(I..I)), XYDATA
0@%%%%%%%%qQqJ6j6K4l2L4m2N6p2Q8j05J28j52J77k09K46k88L34l85M45n15N89
$$ 0 0 0 0 0 0 0 0 0 -8 0 -8 8 -8 16 -16 18 -24 32 -40 48 -57 71 -81 96 -113 133 -155 179 -206 239 -276 313
32C13o68P60q63R75j097J232j383J546j722J916k130K366k622K898l201L533l898
$$ 313 -355 405 -458 517 -580 652 -731 815 -907 1009 -1121 1245 -1377 1521 -1680 1853 -2045
49b045M297m732N211n742O330o983P714q536R469j0542J1786j3249J5001j7142
$$ -2045 2252 -2480 2731 -3011 3319 -3664 4050 -4486 4983 -5559 6227 -7022 7979 -9163
63i163J9829k3318K8054l4892M5758o6406J72771n48279K29078Q07591n71682
$$ -9163 10666 -12652 15402 -19490 26268 -40138 132633 -415646 -186568 621023 49341
74D9341m15196N12157L18322o14820j20421O35016p0651o38049K36899N00577
$$ 49341 -365855 146302 464624 -150196 -270617 364399 293748 -344301 -107402 393175
84C93175l38355m73478M63141K58832n41223o7853M75515n4236m39951J34691
$$ 393175 54820 -418658 44483 303315 -237908 -305761 169754 115518 -324433 -189742
94a89742M43608k72097l63766L90185K44971m52484q6330M82904m0660m41315
$$ -189742 253866 -18231 -381997 8188 253159 -199325 -285655 197249 156589 -284726
104b84726K10331L55931k42086k48333K90299K19688l75266q5447M21462p6788
$$ -284726 -74395 281536 39450 -208883 81416 301104 -74162 -159609 261853 185065
114A85065l86159J70782L34028k60288k76417L40560J27771l78804L4744K76806
$$ 185065 -201094 -30312 303716 43428 -232989 107571 235342 -143462 -108718 168088
124A68088j23939k32806J31982K13207k23620j62148K56517O9000k36883L197
$$ 168088 44149 -188657 -56675 156532 -67088 -229236 27281 96281 -140602 -137405
134a37405K13699n4808j71591J26746J26725j53447m7589J42798M1436j27335
$$ -137405 76294 21486 -150105 -23359 103366 -50081 -97670 45128 86564 -40771
144d0771o356J55738m6542r8507R4807M5071q7642K315N4543k6336k7136R344
$$ -40771 -47127 108611 62069 -36438 58369 103440 15798 18113 72656 46320 19184 28528
156B8528q901n392Q183k9026M273N654j9429p248r346K8211k7488n5145N3210
$$ 28528 19627 14235 22418 -6608 -2335 3319 -16110 -23358 -32704 -4493 -31981 -87126 -33916
169c3916L6780p1844j5373P0722N740n7631K2019O9375m2008l4228N3907M6710
$$ -33916 2864 -68980 -84353 -13631 -7891 -65522 -43503 25872 -16136 -50364 3543 50253
181E0253m7675n8823R7373N1278j12932m766J22605k6023j08762N4888J07708
$$ 50253 2578 -56245 41128 92406 -20526 -25292 97313 71290 -37472 17416 125124
192A25124r7661j05606J43236M9746j78803j5538J85676n3693j96998J21727J53602
$$ 125124 27463 -78143 65093 114839 -63964 -79502 106174 52481 -144517 -22790 130812
203A30812j87691j08247K24386L1011k42697L7427K35772j11780k07052J90110
$$ 130812 -56879 -165126 59260 90271 -152426 -114999 120773 8993 -198059 -7949
213g949J60490k32249r0598K89526J4172k87204R2010K57314j51832k02721K15305
$$ -7949 152541 -79708 -170306 119220 133392 -153812 -61802 195512 43680 -159041 56264
224E6264J47220k57563p3261K92035j2821k92656R6420K56545j67671k25801K28739
$$ 56264 203484 -54079 -127340 164695 151874 -140782 -44362 212183 44512 -181289 47450
235D7450J41987k86824o1937K86588k9695k90870J02684K57478j78155k21412
$$ 47450 189437 -97387 -159324 127264 97569 -193301 -90617 166861 -11294 -232706
245b32706K45977J48646k95107n6466L08833k6872l01491J25775K73076j93664
$$ -232706 13271 161917 -133190 -189656 119177 92305 -209186 -83411 189665 -3999
255c999k07752K66440J46900l04984m4071L26826m1342l14782J42382K75425k25995
$$ -3999 -211751 54689 201589 -103395 -147466 179360 138018 -176764 -34382 241043 15048
266A5048k03375K83014J17168l21274j7900L12142p8688k94486J55737K37910
$$ 15048 -188327 94687 211855 -109419 -127319 184823 106135 -188351 -32614 205296
276B05296k38503j68549K71673P6608k96912J2013K76670r3824k38127J57846
$$ 205296 -33207 -201756 69917 146525 -150387 -138374 138296 44472 -193655 -35809
286c5809J90672k08733j17997K36393N6027k40197K0275K36446p9343j96178J38074
$$ -35809 154863 -53870 -171867 64526 120553 -119644 -99369 137077 57734 -138444 -370
297c70J63329j76477r6779J99853M3906k02926R980J97802p0088j75870J12079
$$ -370 162959 -13518 -110297 89556 133462 -69464 -59484 138318 68230 -107640 4439
308D439J38142j59042r1074J72760K8769j80114J2179J66241p2222j43979J02079
$$ 4439 142581 -16461 -107535 65225 93994 -86120 -73941 92300 20078 -123901 -21822
319b1822J02765j33225o2285J44493J4689j36564K5674J30003o3157r4513R4415
$$ -21822 80943 -52282 -114567 29926 44615 -91949 -66275 63728 571 -93942 473
330D73O1727r5259k2752J00697l533q0899L1191P2618m6751m2967N7865J7395
$$ 473 62200 -33059 -55811 44886 41353 -39546 -8355 64263 17512 -25455 32410 49805
342D9805m8258n016M1741j3610l0535J4855J0770j6951o100M944o394L305l846
$$ 49805 1547 -3469 38272 24662 -5873 8982 19752 2801 -3299 1645 -4749 -1444 -5290
355e290j2005O70J6057j2901k2819K6269J4570l1653r082M6669k296m6132K4216
$$ -5290 -17295 -16625 -568 -13469 -36288 -10019 4551 -27102 -36184 10485 8189 -37943 -13727
368a3727M7291l0391l8181N0723L2312n7711j7224P6664j392p6900K5704P2501
$$ -13727 33564 3173 -35008 15715 48027 -9684 -26908 49756 48364 -28536 -2832 69669
380F9669m0096p4258O7946N4367r4622l0989J01063j088j14743K4306J10878o3237
$$ 69669 29573 -44685 23261 77628 -16994 -47983 53080 51992 -62751 -38445 72433 9196
392I196j09096J00757P1618j28220l6789J37382O72j52684N2096J43735r8450
$$ 9196 -99900 857 72475 -55745 -92534 44848 45520 -107164 -55068 88667 -9783
403i783j12880J37150P9780j57072k9374J78128j9310j74882Q6671J50559j25432
$$ -9783 -122663 14487 94267 -62805 -92179 85949 66639 -108243 -21572 128987 3555
414C555j12209J61857P3035j90920r080J93102n0033j79702R9586J52297j49419
$$ 3555 -108654 53203 126238 -64682 -73762 119340 69307 -110395 -10809 141488 -7931
425g931j16889J81874N6000k03771M114J90575n9247j84430J14853J54659j73106
$$ -7931 -124820 57054 113054 -90717 -86603 103972 44725 -139705 -24852 129807 -43299
436d3299r6536J93985M1966j96375R765J95536o3846j74759J27346J36914j64252
$$ -43299 -139835 54150 96116 -100259 -90494 105042 41196 -133563 -6217 130697 -33555
447c3555q1293J84860M6740k00848J1388K05361p4077j73061J19102J39842j61356
$$ -33555 -114848 70012 116752 -84096 -72708 132653 58576 -114485 4617 144459 -16897
458a6897r8948J98093L5629k17770L3242J96145r5179j64667J29500J25475j76619
$$ -16897 -115845 82248 117877 -99893 -66651 129494 34315 -130352 -852 124623 -51996
469e1996p1106J92403L117j84470M1763J69488r1265j38756J36732R0117j58652
$$ -51996 -123102 69301 72418 -112052 -70289 99199 7934 -130822 5910 96027 -62625
480f2625l4651J63675k276j59339M5082J57643r5583j09502J27264N9803j25976
$$ -62625 -97276 66399 64123 -95216 -50134 107509 11926 -97576 29688 89491 -36485
491c6485k1869J35042j6114j31845N4002J12525p8913q8273Q7320O5210j05604
$$ -36485 -58354 76688 60574 -71271 -17269 95256 16343 -71930 15390 80600 -25004
502b5004l6465J16220j5580j04295L8626Q9924n8788q9181Q8851N8583j08009
$$ -25004 -61469 54751 39171 -65124 -26498 63426 4638 -84543 4308 62891 -45118
513d5118j3978R9088j9664p6800L7800O5988n2419m4906O6822J9205n1617p767
$$ -45118 -59096 39992 20328 -56472 -18672 47316 -5103 -50009 16813 36018 -15599 -23366
525b3366N1946O89n3857K6211M0457l3788k1429K6441J5674k1643j6844K6935
$$ -23366 28580 29269 -24588 1623 42080 8292 -13137 13304 28978 7335 -9509 17426
537A7426l809k4217J8893R45j5312k784P875O91o139R32j3225N453K0319j8111
$$ 17426 13617 -10600 8293 9238 -6074 -8858 -983 -292 -6431 -5499 -18724 -13271 7048 -11063
551a1063j6146J9363R592j3731j0248K6432K594l8939K8897L2038l6329k0801
$$ -11063 -27209 -7846 1746 -11985 -22233 4199 6793 -32146 -3249 28789 -7540 -28341
563b8341M0712K2620m9462o717N7463j1437n4801L1181M9627m7450m4544O8735
$$ -28341 12371 34991 -14471 -21188 36275 24838 -29963 1218 50845 3395 -41149 27586
575B7586K1418q2082R632O7137k5699o7558M0538O6541p1698m9616Q7094K0662
$$ 27586 49004 -33078 -23446 43691 17992 -49566 -9028 57513 -14185 -63801 23293 43955
587D3955q9311J976Q6023k3970q7120N9970P4186q8637m7194J02581L3275j17085
$$ 43955 -45356 -43380 42643 18673 -68447 -8477 65709 -22928 -70122 32459 65734 -51351
599e1351o72J26863m2797j05367Q0539P7317j02461m9364J22672K1665j42075
$$ -51351 -52023 74840 32043 -73324 7215 84532 -17929 -67293 55379 77044 -65031
610f5031K2342J36339o6880j10622R1489Q1371j19784m5904J32161J133j34508
$$ -65031 -42689 93650 26770 -83852 7637 89008 -30776 -76680 55481 56614 -77894
621g7894L3102J24838p0178j08555J01274P8981j29173l5745J35865j941j32283
$$ -77894 -44792 80046 9868 -98687 2587 81568 -47605 -83350 52515 50574 -81709
632h1709L6175J28166p5367j00050J07516O7223j23340k9590J38073p737j38534
$$ -81709 -45534 82632 7265 -92785 14731 81954 -41386 -70976 67097 59360 -79174
643g9174N0730J25877q6195r3959J05771O3393j22208k9017J36117k0513j31187
$$ -79174 -28444 97433 11238 -82721 23050 86443 -35765 -64782 71335 50822 -80365
654h0365N9332J12170r0597r1004J11830N8234j28751j9500J30964k6380j16322
$$ -80365 -21033 91137 540 -90464 21366 79600 -49151 -68651 62313 35933 -80389
665h0389N8602R9448q7615p5084J12327M0329j17237o140J16785k5188j04055
$$ -80389 -21787 77661 -9954 -85038 27289 67618 -49619 -55759 61026 35838 -68217
676f8217N7834Q5316q0215n7077R6717K6227r7558O42R6628k9907q5422N4317
$$ -68217 -10383 74933 -5282 -62359 34358 60585 -36973 -36331 60297 30390 -55032 -715
688g15O3691o9563m6170P9885J9321q3461M646P4173k7959o3516M3816M5591n4778
$$ -715 62976 -6587 -52757 27128 46449 -37012 -32366 41807 13848 -49668 -5852 39739 -15039
701a5039l2998O3678J2801o4198N931N6189j7295m7728L1845L5410l8994j9816
$$ -15039 -48037 15641 28442 -35756 -29825 26364 9069 -38659 -6814 28596 -10398 -30214
713c0214M5169P114m2665O878L7585j1944l1775K1795K2155k4678j0255K2871
$$ -30214 14955 22069 -20596 -13718 23867 11923 -19852 1943 24098 -580 -10835 12036
725A2036K461k1216M597J3607n989j1563O598N337p080j191M06O43J404j313p265
$$ 12036 14497 -6719 -2122 11485 5496 -6067 531 5868 -1212 -2403 -1997 -1354 50 -1263 -8528
740h528N788P733j0841o451J5184O084k2313L778K4479j0888k2384K0804K0707
$$ -8528 -2740 4993 -5848 -12299 2885 8969 -13344 -9566 14913 4025 -18359 2445 23152
753B3152k9280j1946L6438N429m3196J0075M2642k3806l6458L4537K8434m7154
$$ 23152 -6128 -18074 18364 23793 -19403 -9328 33314 9508 -26950 7587 36021 -11133
765a1133j5135N2067j00n7190J6413N2639l4507m4960M5126L4374n9864j7505
$$ -11133 -26268 25799 25699 -31491 -15078 37561 3054 -41906 3220 37594 -22270 -39775
777c9775O5132j966o7065K0932O4174m1932n1679N7244L9052p0785j7855P9698
$$ -39775 25357 23391 -43674 -22742 41432 -500 -52179 5065 44117 -26668 -44523 35175
789C5175m538p8307K8884P4114n1937n7695P0577L9618q3821j4657R1496j4286
$$ 35175 30637 -47670 -18786 55328 3391 -54304 16273 55891 -27930 -42587 48909 34623
801C4623q7008L9196P7147o4294n9054Q1827L4653r4261q172R7613k3987q9144
$$ 34623 -52385 -13189 63958 -336 -59390 22437 57090 -37171 -45343 52270 28283 -60861
813f0861M7073P6624p1225n7269Q9852K8817r7018q38R8364k8247q8332N4161
$$ -60861 -13788 62836 -8389 -65658 24194 53011 -44007 -44845 53519 25272 -63060 -8899
825h899P3745p5763m9767R2387K0945r4484N384R5202l4062q3736N9517O4561
$$ -8899 64846 -10917 -60684 31703 52648 -41836 -36452 58750 24688 -59048 469 65030
837F5030p6931m2356Q9009J4926r2942J1119Q8841l8918p6758N9576N6298p4427
$$ 65030 -11901 -54257 34752 49678 -43264 -32145 56696 17778 -58980 596 56894 -17533
849a7533l8310Q7068R014q9177J7245Q0297l8613o9846N9001N2027p4245k8382
$$ -17533 -55843 31225 40239 -48938 -31693 48604 9991 -59855 -854 51173 -23072 -51454
861e1454Q3091K159p9320K0304P2807l7930o2541N9927M1470o8995j7603P1166
$$ -51454 31637 33796 -45524 -25220 47587 9657 -52884 7043 48513 -20482 -38085 33081
873C3081j022p0047K2334O2723m0966m8349N4174K7379n6837j1574N7027m856
$$ 33081 32059 -37988 -15654 47069 6103 -42246 11928 39307 -17530 -29104 27923 23067
885B3067n6493K3750M3163l3224l2222L7431K2448m3774q139M3348n606l8161
$$ 23067 -33426 -9676 33487 263 -31959 5472 27920 -15854 -23993 19355 13749 -24412
897b4412J5785L1281k0132k7025K8601J8336l3595k464K8392k906k5344R334K3947
$$ -24412 -8627 22654 2522 -24503 4098 22434 -11161 -13625 14767 11861 -13483 -4149 19798
910A9798j7290j5843J9738P223j6261k959J1933J594j3622M919Q178q397j909
$$ 19798 2508 -13335 6403 13626 -2635 -5594 6339 7933 -5689 -770 7408 -989 -2898
923b898J102M603k106o304K451K479R50l014n722P274M049j0847J673R483j159
$$ -2898 -1796 2807 701 -5603 -3152 -673 277 -2737 -8459 -1185 2864 -7983 -6310 3173 2014
938B014j4055P066J8450j7921r911K0196O682k1453k841K7993o739k9305J9630
$$ 2014 -12041 -4975 13475 -4446 -14357 5839 12521 -8932 -11773 16220 9481 -19824 -194
951a94K3806k6646j5614K8203J2894l6953j448M0944j5667l5223K3862L2775l5468
$$ -194 23612 -3034 -18648 9555 22449 -14504 -15952 24992 9325 -25898 -2036 30739 -4729
964d729k7961M8033J1955n2282O610M5988j9402l9785K9142L8299m7394k4284
$$ -4729 -32690 15343 27298 -24984 -18374 27614 8212 -31573 -2431 35868 -11526 -35810
976c5810N8383N163n4921O413N4090k0388m8472L7288L7095m9829k2110N7207
$$ -35810 22573 27736 -27185 -20772 33318 12930 -35542 1746 38841 -10988 -33098 24109
988B4109Q881o2719O425O5870l0200n3970M5344L7846n4196k6982O6269O289p2005
$$ 24109 32990 -29729 -23304 42566 12366 -41604 3740 41586 -12610 -39592 26677 32966 -39039
1001c9039J6743O4738l6312n3492N1208L8638o4204k0786P3656m043o8704J9942
$$ -39039 -22296 42442 6130 -47362 3846 42484 -21720 -42506 31150 27107 -41597 -21655
1013b1655O3185l4480n6049N6114L5550o7589j0449O9199q013o6573K3754O3861
$$ -21655 41530 7050 -48999 7115 42665 -24924 -35373 33826 25813 -40760 -17006 46855
1025D6855m1231n1730N7707K9250o1459j0051O3643q781o4741L1598N3790m5724
$$ 46855 5624 -46106 11601 40851 -20608 -30659 32984 24203 -40538 -8940 44850 -874
1037h74m0931N2969K7853n9851j1583O4389j1489n9771L2163M5828m1699l6045
$$ -874 -41805 11164 39017 -20834 -32417 31972 20483 -39288 -7125 38703 -2996 -39041
1049c9041N1624K3002o0157j855N7801j4259n2287K9383M3920m0814l1346M9361
$$ -39041 12583 35585 -24572 -26427 31374 17115 -35172 -5789 38131 -2683 -34029 15332
1061A5332J4398m9235M14M5020j0296m5036K5939L7989l9109k5062M2366J3470
$$ 15332 29730 -19505 -19091 25929 15633 -29403 -3464 34525 -4584 -29646 12720 26190
1073B6190m3507j749M0474j1817l4899K4017K4322l1824j4710L4187P720l7531
$$ 26190 -17317 -19066 21408 9591 -25308 -1291 23031 -8793 -23503 10684 18404 -19127
1085a9127M328L1257j2303k1614J4872J5858j8547r654K2323L346k2662L883J8724
$$ -19127 -14799 16458 4155 -17459 -2587 13271 -5276 -14930 7393 10739 -11923 -8040 10684
1098A0684n815j4860P180J3386j1071o864J1104L572j0249k105J0465j044p687
$$ 10684 4869 -9991 -2811 10575 -496 -7360 3744 7316 -2933 -5038 5427 4383 -3304
1111c304K037N010k862k697Q90M245j861n526L184L561L93o795n64Q860j124p934
$$ -3304 -1267 3743 881 -1816 -926 3319 1458 -4068 -884 2677 3070 -3725 -4289 4571 3447 -4487
1127d487J816Q584n195o995Q733O861j4428k864J7663n10j8413K452K1549j0204
$$ -4487 -2671 5913 718 -6277 2456 9317 -5111 -7975 9688 9178 -9235 -6783 14766 4562
1141D562j8406J6566J2710k2084o413K6012r72k8617Q350K9035j8820k3753K5592
$$ 4562 -13844 2722 15432 -6652 -13065 12947 11975 -16642 -8292 20743 1923 -21830 3762
1154C762J6390l1043r499L6638l633l5264J2948L2631k2805k6990L2258J7431
$$ 3762 20152 -10891 -20390 16248 12615 -22649 -9701 22930 125 -26865 5393 22824
1166B2824l7763p464M2778n806m0987J6738L7613k7115l0114L7465J7780m1617
$$ 22824 -14939 -22403 20375 14569 -26418 -9680 27933 818 -29296 8169 25949 -15668
1178a5668n451M4884q253m4010K1811L8486l1956l0732M1332J7914m5400n461
$$ -15668 -21119 23765 15512 -28498 -6687 31799 -157 -30889 10443 28357 -17043 -22504
1190b2504M7449r246m5723K4202L8375l4928l0408M5042J7634n0701k818N1164
$$ -22504 24945 15699 -30024 -5822 32553 -2375 -32783 12259 29893 -20808 -23626 27538
1202B7538j1860m8020K7158L9175l8055k8417M7666J4208n2016J825N0609j5658
$$ 27538 15678 -32342 -5184 33991 -4064 -32481 15185 29393 -22623 -20798 29811 14153
1214A4153m6367K9506L7133l9771k5417M6920J0953m9767M365M6213j7218m1633
$$ 14153 -32214 -2708 34425 -5346 -30763 16157 27110 -22657 -18292 27921 10703 -30930
1226c0930K9813L2049l9297k0640M3844Q293m6602O153M2642j8157l6511K8645
$$ -30930 -1117 30932 -8365 -29005 14839 23132 -23470 -17317 25325 7168 -29343 -698
1238f98K7333l6770j5223L9780M654m1586Q356L7816j7961l1713K6260K4301l3288
$$ -698 26635 -10135 -25358 14422 19076 -22510 -14154 23662 5701 -26012 248 24549 -8739
1251h739j2548L5514K374l5476Q127L2856j7136k7140K4361K0029k9979r993L0916
$$ -8739 -21287 14227 16601 -18875 -10748 22108 4972 -22168 2193 22222 -7757 -17750 13166
1264A3166J301l0399P463K7635j6466k0406K0673J3855k4028o351K4473o24k3022
$$ 13166 14467 -15932 -8469 19166 2700 -17706 2967 16822 -7206 -13557 10916 10292 -12730
1277a2730P339J9624j2879j3625J4973Q985j6605l304J6588k445j3107M464J1177
$$ -12730 -5391 14233 1354 -12271 2702 11687 -4918 -8222 8366 5921 -7186 -2722 8455
1290H455o901q318Q307N165q612k328P650O2n337j040N869j142m598J610K817
$$ 8455 1554 -6764 1543 6708 -1904 -4232 3418 3480 -1857 -2897 2972 1830 -2768 -1158 1659
1305A659j48m472O24M221r11m390R85M763j835n489K843O357n611m080N495N051
$$ 1659 1511 -2961 -2337 1884 973 -3417 -2432 2331 496 -4993 -2150 4207 -1404 -5484 11 5062
1321E062p877m160J1078J79j0490J762J1538m268j1698Q082J1200j2716q107J6566
$$ 5062 -2815 -6975 4103 4282 -6208 -4446 7092 2824 -8874 -792 10408 -2308 -10415 6151
1335F151L200j6934l74J9705o190j9407J3736J4858j7634j1284K1904N943k5185
$$ 6151 9351 -7583 -7957 11748 5558 -13849 -113 14745 -2889 -14173 7731 13674 -11511
$$ [...]
8191D5
##END NTUPLES=NMR FID
##END=
