##TITLE=1H_Pr Sl
 200.13MHz, CDCl3,
 8 sc
 
 27.1.2025
##JCAMPDX= 6.0         $$ Bruker NMR JCAMP-DX V2.0
##DATA TYPE= NMR FID
##DATA CLASS= NTUPLES
##ORIGIN= UXNMR, Bruker Analytische Messtechnik GmbH
##OWNER= pz
$$ XWIN-NMR		Version 3.5
$$ Mon Jan 27 14:24:32 2025 Russian Standard Time (UT+4h)  she@DPX200
##.OBSERVE FREQUENCY= 200.1313
##.OBSERVE NUCLEUS= ^1H
##.DELAY= (6, 6)
##.ACQUISITION MODE= SIMULTANEOUS
##.ACQUISITION SCHEME= undefined
##.AVERAGES= 8
##.DIGITISER RES= 18
##SPECTROMETER/DATA SYSTEM= spect
##.PULSE SEQUENCE= zg30
##.SOLVENT NAME= CDCl3
##.SHIFT REFERENCE= (INTERNAL, CDCl3, 0, 14.3821)
##AUDIT TRAIL= $$ (NUMBER, WHEN, WHO, WHERE, WHAT)
$$ ##TITLE= Audit trail, XWIN-NMR		Version 3.5
$$ ##JCAMPDX= 5.01
$$ ##ORIGIN= Bruker BioSpin GmbH
$$ ##OWNER= she
$$ F:/spectra/data/she/nmr/H-C/1/audita.txt
$$ ##AUDIT TRAIL=  $$ (NUMBER, WHEN, WHO, WHERE, WHAT)
(   1,<2025-01-27 14:23:20.28 +0400>,<she>,<DPX200>,
      <created by zg, POWCHK disabled, PULCHK disabled
       configuration hash MD5:
       00 E9 B6 7A A2 85 ED C7 34 08 36 98 17 FE 4E 26
       data hash MD5: 16K
       47 A7 E2 B4 D4 98 6D D8 67 C1 73 FC 07 4D EC FD>)
$$ ##END=
$$ 
$$ hash MD5
$$ 00 B9 33 72 4D AD 23 10 D6 24 8A 77 44 35 00 BB
##$RELAX= 
##$RELAX= 
##$RELAX= 
##$RELAX= 
##$RELAX= 
##$RELAX= 
$$ Bruker specific parameters
$$ --------------------------
##$DU= <F:/spectra>
##$EXPNO= 1
##$NAME= <H-C>
##$PROCNO= 1
##$TYPE= <nmr>
##$USER= <she>
##$AMP= (0..31)
100 100 100 100 100 100 100 100 100 100 100 100 100 100 100 100 100 100 
100 100 100 100 100 100 100 100 100 100 100 100 100 100 
##$AQSEQ= 0
##$AQ_mod= 1
##$AUNM= <au_zg>
##$AUTOPOS= <>
##$BF1= 200.13
##$BF2= 200.13
##$BF3= 200.13
##$BF4= 200.13
##$BF5= 200.13
##$BF6= 200.13
##$BF7= 200.13
##$BF8= 200.13
##$BYTORDA= 1
##$CFDGTYP= 0
##$CFRGTYP= 5
##$CHEMSTR= <none>
##$CNST= (0..31)
1 1 145 1 1 1 1 1 1 1 1 1 1 1 1 1 1 1 1 1 1 1 1 1 1 1 1 1 1 1 1 1 
##$CPDPRG= <>
##$CPDPRG1= <>
##$CPDPRG2= <>
##$CPDPRG3= <>
##$CPDPRG4= <mlev>
##$CPDPRG5= <mlev>
##$CPDPRG6= <mlev>
##$CPDPRG7= <mlev>
##$CPDPRG8= <mlev>
##$CPDPRGB= <>
##$CPDPRGT= <>
##$D= (0..31)
0 0.7 0 0 0 0 0 0 0 0 0 0.03 0 0 0 0 0 0 0 0 0 0 0 0 0 0 0 0 0 0 0 0 
##$DATE= 1737973399
##$DBL= (0..7)
120 120 120 120 120 120 120 120 
##$DBP= (0..7)
150 150 150 150 150 150 150 150 
##$DBP07= 0
##$DBPNAM0= <>
##$DBPNAM1= <>
##$DBPNAM2= <>
##$DBPNAM3= <>
##$DBPNAM4= <>
##$DBPNAM5= <>
##$DBPNAM6= <>
##$DBPNAM7= <>
##$DBPOAL= (0..7)
0.5 0.5 0.5 0.5 0.5 0.5 0.5 0.5 
##$DBPOFFS= (0..7)
0 0 0 0 0 0 0 0 
##$DE= 6
##$DECBNUC= <off>
##$DECIM= 32
##$DECNUC= <off>
##$DECSTAT= 4
##$DIGMOD= 1
##$DIGTYP= 9
##$DL= (0..7)
0 120 120 120 120 120 120 120 
##$DP= (0..7)
150 150 150 150 150 150 150 150 
##$DP07= 0
##$DPNAME0= <>
##$DPNAME1= <>
##$DPNAME2= <>
##$DPNAME3= <>
##$DPNAME4= <>
##$DPNAME5= <>
##$DPNAME6= <>
##$DPNAME7= <>
##$DPOAL= (0..7)
0.5 0.5 0.5 0.5 0.5 0.5 0.5 0.5 
##$DPOFFS= (0..7)
0 0 0 0 0 0 0 0 
##$DQDMODE= 0
##$DR= 18
##$DS= 0
##$DSLIST= <SSSSSSSSSSSSSSS>
$$ [...]
##$SUBNAM0= <"">
##$SUBNAM1= <"">
##$SUBNAM2= <"">
##$SUBNAM3= <"">
##$SUBNAM4= <"">
##$SUBNAM5= <"">
##$SUBNAM6= <"">
##$SUBNAM7= <"">
##$SUBNAM8= <"">
##$SUBNAM9= <"">
##$SW= 18.0517328524113
##$SWIBOX= (0..15)
0 0 2 0 0 0 0 0 0 0 0 0 0 0 0 0 
##$SW_h= 3612.71676300578
##$TD= 16384
##$TD0= 1
##$TE= 0
##$TE2= 300
##$TE3= 300
##$TEG= 300
##$TL= (0..7)
0 120 120 120 120 120 120 120 
##$TP= (0..7)
150 150 150 150 150 150 150 150 
##$TP07= 0
##$TPNAME0= <>
##$TPNAME1= <>
##$TPNAME2= <>
##$TPNAME3= <>
##$TPNAME4= <>
##$TPNAME5= <>
##$TPNAME6= <>
##$TPNAME7= <>
##$TPOAL= (0..7)
0.5 0.5 0.5 0.5 0.5 0.5 0.5 0.5 
##$TPOFFS= (0..7)
0 0 0 0 0 0 0 0 
##$TUNHIN= 0
##$TUNHOUT= 0
##$TUNXOUT= 0
##$USERA1= <user>
##$USERA2= <user>
##$USERA3= <user>
##$USERA4= <user>
##$USERA5= <user>
##$V9= 5
##$VALIST= <valist>
##$VCLIST= <CCCCCCCCCCCCCCC>
##$VD= 0
##$VDLIST= <DDDDDDDDDDDDDDD>
##$VPLIST= <PPPPPPPPPPPPPPP>
##$VTLIST= <TTTTTTTTTTTTTTT>
##$WBST= 1024
##$WBSW= 4
##$XGAIN= (0..3)
0 0 0 0 
##$XL= 0
##$YL= 0
##$YMAX_a= 30483
##$YMIN_a= -27363
##$ZGOPTNS= <>
##$ZL1= 120
##$ZL2= 120
##$ZL3= 120
##$ZL4= 120
##$ABSF1= 10
##$ABSF2= 0
##$ABSG= 5
##$ABSL= 3
##$ALPHA= 0
##$AQORDER= 0
##$ASSFAC= 0
##$ASSFACI= 0
##$ASSFACX= 0
##$ASSWID= 0
##$AUNMP= <proc_1d>
##$AZFE= 0.1
##$AZFW= 0.1
##$BCFW= 1
##$BC_mod= 2
##$BYTORDP= 1
##$COROFFS= 0
##$CY= -3
##$DATMOD= 1
##$DC= 2
##$DFILT= <>
##$DTYPP= 0
##$F1P= 0
##$F2P= 0
##$FCOR= 0.5
##$FTSIZE= 0
##$FT_mod= 4
##$GAMMA= 1
##$GB= 0.15
##$INTBC= 1
##$INTSCL= 1
##$ISEN= 128
##$LB= 0.25
##$LEV0= 0
##$LPBIN= 0
##$MAXI= 10000
##$MC2= 0
##$MEAN= 0
##$ME_mod= 0
##$MI= 1.114404
##$NCOEF= 0
##$NC_proc= 0
##$NLEV= 6
##$NOISF1= 3.799351
##$NOISF2= 2.8
##$NSP= 1
##$NTH_PI= 0
##$NZP= 0
##$OFFSET= 14.38212
##$PC= 1
##$PHC0= 250.7065
##$PHC1= 13.7922
##$PH_mod= 1
##$PKNL= yes
##$PPARMOD= 0
##$PSCAL= 0
##$PSIGN= 0
##$REVERSE= no
##$SF= 200.129724274929
##$SI= 16384
##$SIGF1= 3
##$SIGF2= 2
##$SINO= 400
##$SIOLD= 16384
##$SREGLST= <1H.CDCl3>
##$SSB= 0
##$STSI= 0
##$STSR= 0
##$SW_p= 3205.1282051282
##$SYMM= 0
##$S_DEV= 0
##$TDeff= 0
##$TDoff= 0
##$TI= <>
##$TILT= no
##$TM1= 0
##$TM2= 0
##$TOPLEV= 0
##$USERP1= <user>
##$USERP2= <user>
##$USERP3= <user>
##$USERP4= <user>
##$USERP5= <user>
##$WDW= 1
##$XDIM= 8192
##$YMAX_p= 0
##$YMIN_p= 0
$$ End of Bruker specific parameters
$$ ---------------------------------
##NTUPLES= NMR FID
##VAR_NAME=  TIME,          FID/REAL,        FID/IMAG
##SYMBOL=    X,             R,               I
##VAR_TYPE=  INDEPENDENT,   DEPENDENT,       DEPENDENT
##VAR_FORM=  AFFN,          ASDF,            ASDF
##VAR_DIM=   8192,          8192,            8192
##UNITS=     SECONDS,       ARBITRARY UNITS, ARBITRARY UNITS
##FACTOR=    0.0002768,     1,               1
##FIRST=     0,             0,               0
##LAST=      2.2672688,     0,               0
##MIN=       0,             -27363,          0
##MAX=       2.2672688,     30483,           0
$$ Real data points
##PAGE= N=1
##DATA TABLE= (X++(R..R)), XYDATA
$$ [...]
1579H47p04l13O86l7r53L16L07p47l89P60Qo62N60N46o55Q2R60k95k64K95M29
1600G77o72N1O27l18p52M00N0p25K9N14j49o85N81J90n89L44P62n33k10P86R7
1621E75n82L10M95n10o07O54rp31K38L49p32k09P49k28o03P13L16m26k05Q62K1
1642D40n93N68L58o05j54P33l80n46K51L24p02r8J94J10n49L86J88l87K33M63
1662B34j88r1L28K08o38N33M65o56k11L07O4p68L30J82m90j85L44n1m20N36L54
1683A87l27M3M44Q2n31M68L27o38J05L88l76m01K60J45n10k40N30l96k03M84n1
1704b10l13L32N29k28k17N67R1m70K58K83l46k93K57o2m47J07J59l02l26M29r7
1725b99k00J42L43k38J60L81k4k55M33J97l99j06L39j85k96m4K45l63k91L39j65
$$ plain form
1579 847 143 -170 516 479 -474 -158 149 -598 -987 -227 -219 -881 -321 225 -430 -348 612 317 53 348 777
1600 777 105 156 783 465 -287 113 163 -562 -533 -19 -168 -853 -272 -82 -671 -327 435 -98 -308 478 575
1621 575 -7 303 798 288 -319 335 326 -405 -167 182 -550 -759 -10 -238 -841 -128 188 -238 -443 419 440
1642 440 -153 415 773 168 14 747 367 -179 72 396 -306 -404 -210 -100 -649 -263 -75 -462 -229 234
1662 234 46 -45 283 491 -147 386 851 195 -16 291 355 -413 -83 99 -391 -576 -232 -283 -703 -167 187
1683 187 -140 -97 347 429 -102 366 693 55 160 548 172 -229 31 176 -334 -574 -44 -440 -643 -159 -210
1704 -210 -523 -191 338 110 -107 460 551 81 339 622 276 -17 240 178 -269 -162 -3 -305 -631 -202 -299
1725 -299 -499 -357 -14 -252 -92 289 265 10 443 640 241 135 474 289 -7 -51 194 -169 -460 -121 -286
1746b86k86L10K59k56p2N40j18j2K72n6n5P6J49l46qM7j74k40P0K53m76m4J52
1769c01K50l45J16K99k3j25M49k82K17P5M5j57n2J79j80j97P3jk43k65L72k61
1791c57k26L73J24l05M62M3J%J13J85j03k07J50K8l37K42k08j19Lm1j11Q4q2P0
1815b18r3N5J05J42n3L37j25q4K58J50j92j55R0j2j08k38L6n1K9k14N0j14K87
1838a18k51M03k9J8J14J17J2m8j8R8q6P2q5k14j07m8R0j96L0M4j77J23m2J25J72
1863aJ41R3k84L60o9J20j41J13j4k02J34l76J19j45p8J6p4M3O3J3k46R5K71r1
1887a40L73j12N0J28R4k3L5l41J69k82J24k27J18m1o0k11P5Q2L3N8p5K01L1J47
1911B06j9M2J01J2j82M5J3j51q0R7k37N6k05K10k17k1m2L34q5O3K56p0Nr4L30
$$ plain form
1746 -286 -572 -262 -3 -259 -331 209 91 79 351 295 240 316 465 119 111 158 -16 -256 -186 67 -409 -453 -301
1769 -301 -51 -396 -280 19 -4 -129 320 38 255 330 375 218 166 345 165 -32 41 40 -203 -468 -96 -357
1791 -357 -583 -210 -86 -391 71 114 115 115 228 413 310 103 253 281 -56 186 -22 -141 -138 -179 -290 -206 -288 -218
1815 -218 -311 -256 -151 -9 -62 275 150 66 324 474 282 127 217 205 97 -141 -105 -156 -127 -341 -291 -405 -118
1838 -118 -369 34 5 23 137 254 266 218 200 298 212 284 199 -15 -122 -170 -80 -276 -246 -202 -379 -256 -298 -173 -1
1863 -1 140 233 -51 309 240 360 219 332 318 116 250 -126 -7 -152 -230 -214 -288 -245 -182 -169 -415 -320 -49 -140
1887 -140 233 121 171 299 393 370 405 64 233 -49 75 -152 -34 -75 -135 -346 -271 -189 -156 -98 -173 28 59 206
1911 206 187 229 330 342 160 205 218 67 -13 84 -153 -97 -302 -92 -309 -330 -372 -38 -123 -60 196 126 131 37 367
1936C67j16p7j6kj37J11j80k12Q8J71j45j81N5O8Q0K03mj10J72O9N6k32K06p2
1960A62j5k4J23n3l17J21L0k98rJ17j77l0J53J64n9L6L82j17m9K8J46n3j42L64
1984D83m37q8K72j83k15M9J8p0j78J31K05k19J01J84M6k39K77J24l7p3K36l40
2006D7N2J35k77j50K38J1m82J53R1p5j63K27R4j79R7L69j75j40M92Nk66L72q3
2029C93l32j13J57L4l92Q5J71k72j48K84j23k18L08L22k13k2L20p4p3J24K28l33
2051A13r5L58j45l56K10J9m82j09N18k35m6J46J34m23J73N71k67j13L60l9k87
2072EK25K23l48k31M61k49m04J08K38l69O0R3Q4l3O5K66j43k39N29j61l81M18
2094B17K11l45r5J47M5l12J01J09m21l6L89k43k23K49J76j69r0M67p5k72L15J53
$$ plain form
1936 367 251 174 158 156 19 130 -50 -262 -174 -3 -148 -329 -274 -206 -126 77 73 -37 135 204 260 28 234 162
1960 162 147 123 246 193 -124 -3 27 -271 -280 -163 -340 -370 -217 -53 -112 -76 306 189 140 168 314 261 119 483
1984 483 46 -42 230 47 -168 -119 -101 -171 -349 -218 -13 -232 -131 53 99 -140 137 261 224 151 387 47
2006 47 99 234 -43 -193 45 56 -426 -273 -182 -257 -420 -193 -99 -278 -181 188 13 -127 365 370 104 476 393
2029 393 61 -52 105 139 -253 -168 3 -269 -417 -133 -256 -474 -166 156 -57 -79 241 167 94 218 446 113
2051 113 18 376 231 -125 85 104 -378 -487 31 -204 -250 -104 30 -393 -220 351 84 -29 331 292 5
2072 5 230 453 105 -126 335 86 -318 -210 28 -341 -281 -188 -104 -137 -72 194 51 -188 341 180 -201 217
2094 217 428 83 -12 135 180 -132 -31 78 -343 -379 10 -233 -456 -207 -31 -200 -290 177 102 -170 145 298
2116B98o7K1R5k35m16L20P9l49J63J68l65j54J77J29k08J24K96rj61L98l5k69
2138@J10K12k10j36K75j36m37K72N8l65j26N03k29j98M48N8k64J20L63j23j65
2159C0J35L44m11P2K71j18m86K22r4l79J48J82j02j94K15K8j87L29K62m40P9L47
2181B53n2k30K93J60k82J5N1r5k89j6K40l29j9M12l57r3J34K53l99K16L89K0k53
2204B2M80j48j84J46J1j85j19J78j02j89j57K45j96j58M01m4l08K74M0o7j30M12
2226B22Oj84K07o9j40l9J59Q4m21P0K00l52q0L20k9r8O8J47o4R6J28o1j22K4K66
2251C38l56J26M9j57l7J36kl48J99K7j24k12L32l35K29o1L31j45l8J71Q2j40J19
2274A84j6r1p0J79j21r3Q8j84j11n5K25nj22J53m9j57L12Q0J95k03P5J33k39Q8
$$ plain form
2116 298 231 252 347 112 -304 16 95 -254 -91 77 -288 -442 -265 -136 -344 -220 76 67 -94 304 269 0
2138 0 110 322 112 -24 251 115 -322 -50 8 -357 -483 20 -209 -407 41 99 -165 -45 318 195 30
2159 30 165 509 98 170 441 323 -163 59 -35 -414 -266 -84 -186 -380 -165 -137 -324 5 267 -173 -94 253
2181 253 201 -29 264 424 142 157 208 113 -176 -192 48 -281 -300 112 -245 -338 -204 49 -350 -134 255 275 22
2204 22 502 354 170 316 327 142 23 201 99 -90 -247 -2 -198 -356 45 1 -307 -33 7 -60 -190 222
2226 222 228 44 251 182 42 3 162 246 -175 -105 95 -257 -337 -17 -46 -144 -76 71 7 103 231 170 48 72 338
2251 338 -18 108 157 0 -37 99 97 -251 -52 -25 -149 -361 -29 -364 -135 -196 135 -10 -48 123 205 65 184
2274 184 168 77 7 186 65 -28 60 -124 -235 -290 -65 -70 -192 -39 -88 -245 67 147 342 139 214 347 108 196
2298A96j46N2k36K24O0j32k78J84j79K14n1J03k66J23K53j45J1J29J64k33J00
2319A47j16J16m7J0n9q4p2N3k05j12J26L1j19K63m0J46k0pK57j96J11M5Q4k09
2343A03J9j67J15K0j88J5j05O4q2j42J16l8O0L33j14l2Q7j4R0j14L21n3r9j83
2367A2J77j02k06j1Q8k01P7Rj65J79m1K00r2M5N7k1K1P1l6J58K2k40O0r3N5L6
2393E9k37r6P7j58K10k48K6K10M9p4K96j47L2J04J19mJ26j31j34o2J86j55j96
2416a48Q5j93n6J8J18l6K42N9l18K55R6o0K27j05R6j92L3oM4j37k8N4j86j48P8
2441b08Nj9K23o9O7pJ86k82K56J85q4J35l40J86j20m0Nj08j07Q8k5pk13l3Q8N9
2467a79J91j13K8K55p5l0J1J3J23j71l3L62m53l8O9K3j81N8km4l9K12p6k7J0P5
$$ plain form
2298 196 50 102 -134 90 150 18 -260 -76 -255 -41 -92 11 -255 -132 121 -24 -13 116 280 47 147
2319 147 31 147 100 110 51 -33 -105 -52 -257 -369 -243 -212 -331 -68 -108 38 18 11 268 72 183 228 312 103
2343 103 122 -45 70 90 -98 -83 -188 -124 -206 -348 -232 -270 -210 123 9 -23 64 50 140 26 347 294 195 12
2367 12 189 87 -119 -130 -42 -243 -166 -157 -322 -143 -184 16 -76 -31 26 5 26 97 61 219 241 1 61 -32 23 59
2393 59 -178 -274 -197 -355 -145 -393 -367 -157 -108 -182 114 -33 -1 103 222 218 344 213 79 17 203 48 -148
2416 -148 -63 -256 -312 -294 -176 -212 30 89 -229 26 122 62 289 184 280 88 121 115 159 22 -6 48 -138 -286 -208
2441 -208 -203 -222 1 -68 -1 -8 178 -104 152 337 253 388 48 234 114 74 79 -29 -136 -48 -73 -80 -293 -326 -238 -179
2467 -179 12 -101 -73 182 107 77 88 101 224 53 20 382 -71 -109 -40 -17 -198 -140 -142 -186 -225 -13 -89 -116 -106 -31
2493c1j44K52K13K3k98K29mj61M8j11J85m13J54K12m49n9Q3Q2Qo3K92k59NO03
2517C97l4l07O4l9O1j30N9p7j50J64Q8n6k36J46k06O3P0r5J36p6K99O7k31J34
2541A11K14k04K9K35k65j23L33j72k39n4Q2j39j39L25j39j74L47q3N9j84L56j3
2563A63j47J95mq1l0K88k45k52J19q3k35J65Qo9j95M95j50l4%K43j94L9J77P2
2587B45l93L28R6k23p9R4N2k64N8O1j67j81L08J5l65K48L36o4n7J36K85l78Q6
2610A77J68k66m8J19j84j65J74J8k04L0J92j27j70K53Q5k96N2M97m6j48K73k02
2632A82m3m0K23l45p3J67jm29M00K7m51J31J96R0n31K99L63k66J1L53j5n58M57
2655A47K78m41Q2J76j35m17M87M7m55j71L66j02k99M07R3l75L07K35j84j61K97
$$ plain form
2493 -31 -175 77 290 313 15 244 240 79 127 16 201 -212 -58 154 -295 -354 -271 -189 -181 -244 48 -211 -206 397
2517 397 363 56 120 81 142 12 71 -6 -156 8 96 40 -196 -50 -256 -193 -123 -218 -82 -158 141 208 -23 111
2541 111 325 121 150 385 120 -3 330 158 -81 -135 -53 -192 -331 -6 -145 -319 28 -55 4 -180 176 163
2563 163 16 211 207 126 96 384 139 -113 6 -77 -312 -147 -139 -208 -403 92 -58 -92 -92 151 -43 -4 173 245
2587 245 -148 180 276 53 -26 68 120 -144 -86 -25 -192 -373 -65 -50 -415 -167 169 105 48 184 469 91 177
2610 177 345 79 31 150 -34 -199 -25 -7 -211 -181 11 -116 -286 -33 52 -244 -192 305 259 111 384 182
2632 182 139 99 322 -23 -96 71 70 -359 41 68 -383 -252 -56 34 -497 -198 165 -101 -90 263 248 -310 147
2655 147 425 -16 66 242 107 -310 177 224 -231 -402 -36 -138 -437 -30 63 -312 -5 230 46 -115 182
2676A82j0j56K56O5m19M9l2K12l78R3L03k73k21L41k9l40K53K15r9k20L20K2k41
2699a07L99P3k54o8K11j00l30K15Q4m57L1J05L1j19J37K11k30J75Q2J55m06K19
2721E7K49k76k2P0q5R9o9J22l38O8J46l92J49J22j6j49J29K52k27J59N3p2Q8l9
2745G8J63j79n1J70j06k49R5J5l2j21J70k48J09J29qQ1n5K24j04n1K04q4k1J1
2769A40k8o2p4K1l1k31J69k6j50o3L03k67J63M1K01j18K1M7J48j62J83J8k20R1
2793A14pn1q2qJ34j77ml2p2k1Q1L0PR9Q4q8P8L9Pl8q3l9K02k23JJ8k34M6J86p1
2823a04k58M27n5j96p8J49M0J70M7P3K6p1K7O4j98l4J55l33N5N6j03N9l4R1l9
2848f4J7Qk14J29J08m2J93Q6j26L0m6m5O9p9K1j36n2QP6j00m7P6N3J60l6m1L1
$$ plain form
2676 182 172 16 272 337 -82 -33 -65 147 -231 -138 165 -108 -329 12 -17 -357 -104 111 12 -208 112 134 -107
2699 -107 292 365 111 43 254 154 -176 39 123 -334 -303 -198 -167 -286 -149 62 -168 7 89 244 -162 57
2721 57 306 30 8 78 -7 92 23 145 -193 -125 21 -371 -222 -100 -116 -265 -136 116 -111 48 101 29 117 78
2745 78 241 62 11 181 75 -174 -79 -64 -96 -217 -47 -295 -186 -57 -65 16 -39 185 81 30 234 150 129 140
2769 140 112 50 -24 -3 -34 -265 -96 -122 -272 -335 -32 -299 -136 -95 106 -12 9 56 204 42 225 243 23 114
2793 114 107 56 -26 -34 100 -77 -81 -113 -185 -206 -125 -95 -88 11 95 7 85 124 131 93 10 -29 173 -50 -49 -31 -265 -219 -33 -104
2823 -104 -362 65 10 -186 -264 -115 -75 95 142 215 241 170 197 261 63 29 184 -149 -94 -38 -141 -82 -116 -25 -64
2848 -64 -47 -39 -253 -124 -16 -58 135 221 95 125 79 34 103 24 45 -91 -143 -135 -59 -159 -206 -130 -77 83 47 6 37
2875C7L6J03J36k80N6J4n0J76Q7k25rj99m2K24l21L02n8j70J18m3J01n5J29r2
2899b5J66k6K1K4k06J09j71j31K05Mj5n3n6k7J24j18K82j68P5k5R9j5J02R3j64
2924A04O4J29j42k19K25l10R5J40l02L4O0m9O2K9m8J01j56k7K18L8J63k9j7J40
2948C03k45J79j85N4q0j0k55J53L9k1p9K3n1J05mJ49K2m7L8Q8j18M4O4j34J35
2973A67k21K16p0o8k36k3j7K45J6j92J11rJ13rK2o5L23k39O5q7l9N3k5O2j07J3
2999ar1Jq1k6j4mJ66m4J02l4R2j33K11Q3r4M0O0j08k16J27q9j9r0J53j55j6QK44
3027G2j50m1Q3j16J37J15k15R4J25K18k16r8K54j88l38K50N3k63K8J19j9N3J5
3050b8K3j67J60Rp0O0J75J30m54M20j86Q0K3k01N3k93L24q7r6L2J40l13K5K13
$$ plain form
2875 37 73 176 312 32 88 102 52 228 315 90 81 -118 -160 64 -257 45 -13 -183 -65 -108 -7 -62 67 -25
2899 -25 141 115 136 160 -46 63 -108 -239 -34 -30 -45 -98 -154 -181 -57 -175 107 -61 14 -11 88 73 175 268 104
2924 104 168 297 155 -64 161 -149 -54 86 -216 -182 -122 -171 -109 -80 -128 -27 -183 -210 8 46 209 180 163 303
2948 303 58 237 52 106 26 16 -239 -86 -47 -68 -147 -124 -175 -70 -74 75 97 50 88 176 58 102 166 32 167
2973 167 -54 162 92 24 -212 -235 -252 -7 9 -183 -72 -81 32 23 45 -20 303 64 129 42 3 56 31 93 -14 -1
2999 -1 -92 -91 -172 -198 -212 -216 -50 -94 8 -26 66 -67 144 227 133 173 233 125 -91 36 -53 -72 -162 -9 -164 -180 -172 72
3027 72 -78 -119 -36 -152 -15 100 -115 -21 104 322 106 8 262 74 -264 -14 39 -224 -196 -77 -96 -43 -28
3050 -28 -5 -172 -12 -3 -73 -13 162 292 -162 258 72 152 175 -26 27 -266 58 -29 -125 -93 47 -266 -241 -28
3074b8M7no3J48Q5j76J89J0k00n3L08k12p9Q3m2k72OK64q1m3N3P4j58P8K91j29
3100I5j92K39L9k35R6K39l34RJ52j16k95J93J37k96J69n2L6k50M51j20L8O4J71
3123B38k49qK11J1k08J1O9J5j59P1O6k56j15J35L1j37J91mj71K29K16n5j56J07
3147H3J67k94J28J74k98j5K71l36o2J38N8l00N4J46L2k13K78pM7k0K54q9k84L01
3171B13%l8k5nj45k86K17J29j61PJ14l18O9L11m9j37k4K15J61k74J79P7k34O3
3195E9J21k03n5J44j4k69J06O5j22o2K87k0l88L23K56k95M9P7N8j94J68K87l81
3218cP5Q4q1l77L08k12N0j98L61r6l5J63n3k06K11P1q7o5Q8J24l4o7J01m7p6N5
3244E4j95J51k0j9J6j46Q6K26l80J39K73k16J58j15M1J12m1Q9j61R5j00J16j35
$$ plain form
3074 -28 19 14 -49 99 184 8 197 207 7 -46 262 50 -29 54 12 -260 -254 10 -71 -114 -61 13 -145 -67 224 95
3100 95 -97 142 181 -54 42 281 -53 -44 108 -8 -303 -110 27 -269 -100 -152 -116 -366 85 -35 3 67 238
3123 238 -11 -19 192 203 -5 6 75 90 -69 2 68 -188 -303 -168 -137 -274 -83 -87 -258 -29 187 132 -24 83
3147 83 250 -44 84 258 -40 -55 216 -120 -182 -44 14 -286 -232 -86 -54 -267 11 4 51 31 285 196 -88 213
3171 213 213 175 150 145 0 -286 -69 60 -101 -94 20 -298 -229 82 33 -104 -128 87 248 -26 153 230 -4 59
3195 59 180 -23 -78 66 52 -217 -111 -46 -168 -230 57 37 -351 -28 228 -67 -18 59 117 -77 91 378 -3
3218 -3 72 156 75 -302 6 -206 -156 -354 7 -89 -124 39 -14 -220 -9 62 -25 -90 -2 122 88 21 122 75 -1 54
3244 54 -141 10 -10 -29 -13 -159 -73 153 -227 -88 185 -31 127 12 53 165 124 213 52 147 47 163 28
3267B8m9L5j50R1j33J02k17R0J77J51k14J92m9K2l4J86l71J27J09k24r9J99j02
3290a33L2J12m6P7j35K1N7j94J89K80m19K29K8m7O5j9J02p5j40J18J37l46K1J02
3314A6k00J8MJ43j51J40N4j7n8L0R3m7N1O9K2k37P0n7n2Q6j33J55o7O9k48J98
3340d9O1Q1j94K53k01K7J5J38j11P1n9L0j26o3j45L32j33K4p9n2J64j2K5j9n6
3365g8kO5j42J11l3J38r6J80k93K97j35J01k30J5K21j64j21K13q4j49J50L2oj42
3389a52L01r2n0K04j92p4K49k31jo9J08JR6k58kJ25P1n9j32kO2J18j44K48L2o
3415A51j85Q9l7QpJ10l03J14M9o6p4Q0Q9j70L9j00L1J62PK2N3n3p3K33k59J63
3441G3Ln5M8Qj12J48k06P1j50J30r9M6R2j5p0Q2j36K32m5o8J72k12J76k34J66
$$ plain form
3267 28 -21 14 -136 -45 -178 -76 -293 -203 -26 125 -89 103 54 76 42 228 -143 -16 93 -131 -230 -31 -133
3290 -133 -101 11 -35 42 -93 -72 -15 -209 -20 260 -159 70 98 51 116 97 199 124 -16 102 239 -107 -86 16
3314 16 -184 -166 -162 -19 -170 -30 24 7 -51 -21 72 25 76 145 167 -70 0 -57 -109 -23 -156 -1 -68 1 -247 -49
3340 -49 12 93 -101 152 -49 -22 -7 131 20 91 32 62 -64 -127 -272 60 -73 -49 -128 -180 -16 -28 -3 -22 -78
3365 -78 -80 -15 -157 -46 -79 59 -37 143 -150 147 12 113 -117 -102 119 -45 -166 47 -37 -186 -36 -4 -10 -152
3389 -152 149 57 7 211 19 -55 194 -37 -38 -107 1 2 98 -160 -162 -37 34 -25 -157 -159 -97 21 -123 125 157 151
3415 151 -34 55 18 26 19 129 -174 -60 -11 -77 -151 -71 18 -152 -113 -213 -182 -20 -13 9 62 9 -64 169 -90 73
3441 73 76 21 69 77 -35 113 -93 -22 -172 -42 -141 -95 -3 -18 -88 -6 -142 90 45 -23 149 -63 113 -121 45
3466D5ro7L1M9k52P9O8l9J51j44K18k19N8k2N7J25r0lJ86j15J32j75r0J15P7r3
3492G3k12J15n3J28j92M2O9m1J28j71k1J48n9J10nO3j82L15j65k9j03Q3K2M8j58
3517d7p5J80k57k4R1L21j37po4J70j61J72j30QM9L4l53K59R2m07K91m7n0j09J40
3542f1N6j33P7QJ38R0j00l1O1qK1k9j47K32q5k04K21j06n0R5q6K4k29R5J39J8
3568FJ9J1R2j95L01j21k23J84J18p0Ro9M3l34J78J87k96L3J47j8J5m7K3o9Q7j65
3594a54J48r0K08L4j73J47J36k32k17K18M7q7r1J93j43L4l4m4j28M6R0K21j14
3617A5K21j14j3j75N7L6J8p2k1L6l5j0n4r3K94j57k33J33O9N3O7P1pj48J50J15
3643B03k23J04J30k75j54L88k70N6p1R9N1k37J20kN5N8q2O5O7J2K2j3r0Lq1J11
$$ plain form
3466 45 36 -31 0 49 -203 -124 -56 -95 56 -88 130 -89 -31 -53 4 129 39 36 222 107 239 64 -26 89 166 73
3492 73 -139 -24 -77 51 -141 -99 -30 -71 57 -114 -135 13 -46 64 59 122 -60 255 90 61 -42 41 63 111 -47
3517 -47 -122 58 -199 -223 -132 189 52 45 -19 151 -10 162 32 40 89 123 -230 29 121 -286 5 -42 -92 -201 -61
3542 -61 -5 -138 -61 -53 85 175 75 44 105 97 118 89 -58 174 89 -115 106 0 -50 45 -41 -17 -246 -151 -12 6
3568 6 25 36 128 -67 234 113 -110 74 192 122 131 62 105 -229 -51 136 -160 -127 20 2 17 -30 -7 -76 11 -154
3594 -154 -6 -96 112 146 -27 120 256 24 -193 25 72 -15 -106 87 -56 -22 -56 -100 -228 -182 -92 129 15
3617 15 236 122 109 -66 -9 27 45 -27 -48 -12 -47 -57 -111 -204 90 -67 -300 -167 -98 -45 22 93 86 -62 88 203
3643 203 -20 84 214 -61 -215 173 -97 -41 -112 -13 38 -199 -79 -81 -26 32 -50 15 82 94 116 103 13 16 -65 46
3669D6P8j27j77M6K21q2m9j9J3k94K35J77q0M8j14J04J47k46L07k83j46L32j51
3692a4K8M9j53j79J23O2j82J91K41k32j10R1K56m2j02j74K72j03L0j67R4j7O3
3715B5k01J19L8Ml5j50J87k6K0R7J28j84M0Q5L2L3j95J39j55n1k7j6M0kK42k31
3741d4j82J60M4k8j2M6M3j04K06n7M4p1J68k00r1K76k27n4R0o4L3O2o3P2k09P1
3767i1LQ7j23K46%j89K72k71L09l82J82N7j60J03p4O5k3o3M3o3r0K36k20J98r6
3792d4K7o6J16q4Q7J1P9j75J45r9J5K2k7l9j65J75k0j3n1P9J39k17R7Q8j35mJ4
3819d5K06k6N1r8j9j31NO7k0lr1J20k23J18J50j33N9k46K18k7mK19r4j0j9K46
3845B70j62M4j0k61J58n3j25J05J4j91K73k19J99q4J53q6P4j12m2J45j99K43n6
$$ plain form
3669 46 124 -3 -180 -134 87 5 -44 -63 -50 -344 -109 68 -12 36 -78 26 173 -73 234 -49 -195 137 -14
3692 -14 14 63 -90 -269 -146 -84 -266 -75 166 -66 -176 -85 171 129 27 -147 125 22 52 -115 -21 -38 25
3715 25 -176 -57 -19 -15 -50 -200 -13 -39 -19 78 206 22 62 147 179 212 17 156 1 -50 -77 -93 -53 -55 187 -44
3741 -44 -226 -66 -22 -50 -62 -16 27 -77 129 72 116 45 213 13 -78 198 -29 -83 7 -57 -24 38 -25 47 -162 -91
3767 -91 -88 -1 -124 122 122 -67 205 -66 243 -139 43 100 -60 43 -31 34 11 -52 -9 -72 -162 74 -146 52 -44
3792 -44 -17 -83 33 -51 36 47 126 -49 96 -3 12 34 7 -32 -197 -22 -42 -55 -106 -27 112 -105 -8 80 -55 -59 -45
3819 -45 161 135 186 88 69 -62 -57 10 -10 -13 -104 16 -207 -89 61 -72 -13 -259 -41 -68 -72 147 53 43 24 270
3845 270 108 152 142 -119 39 -14 -139 -34 -20 -211 62 -157 42 -42 111 25 99 -13 -55 90 -109 134 78
3868G8L3j42O8J74k75j64K14j50R5q1N4J60q2L0J05k04J12J75q5o5j12J08M9n5
3892D0K5o3j48J14o9K4J30m8O0p9J2J03j19m8J46oQ3j53k2P9k6n3L6j00K12k17
3918h7J17M5r7p8n0J24j04R4J31j78pJ01J6K9r3L1K3n3l3R1O8k33J29O4J7j21
3944e4P0r8%NM2q8K71j99p3K23k5j00K7K9K7r4j12K80k79O5n7J67j77M1L8k2K03
3971A10l00J96jm0J4m1M7k4K09j37J10n2n6K5j45R8J3O4k73J19K6P9k8Oj21J36
3997C4N7k40K61r8N1J2o3L5rp1j21J08R8j45Q7J30j05J20j75J7M9r4K11q1p9k7
4023c8K25j78M2Q4j18M9p1j51J07j26K35o7J3j0Qj44N9J05j47K37p9O1j39LN2
4048A2O4j38P0n6mJ2r9N8q4J85mj57K17j29P2J36j31K10j39j04k3L3N6j35J53
$$ plain form
3868 78 111 -31 37 211 -64 -228 -14 -164 -69 -150 -96 64 -18 12 117 -87 25 200 115 50 -62 46 95 40
3892 40 65 2 -146 -32 -101 -77 53 5 65 -14 -2 101 -18 -66 80 74 157 4 -18 61 35 -18 18 -82 130 -87
3918 -87 30 75 -22 -100 -150 -26 -130 -36 95 -83 -90 11 27 56 -37 -6 17 -36 -69 22 90 -143 -14 50 67 -54
3944 -54 16 -82 -82 -77 -35 -123 148 -51 -124 99 74 -26 1 30 57 -37 -149 131 -148 -83 -140 27 -150 -109 -71 -93 110
3971 110 -190 6 5 -35 -21 -62 -15 -39 170 33 143 91 35 60 -85 13 26 90 -183 -64 -38 41 13 19 -102 34
3997 34 91 -149 112 14 65 77 14 49 40 -31 -152 -44 54 -91 -4 126 21 141 -34 -17 32 -62 149 68 -11 -38
4023 -38 187 9 51 135 17 66 -5 -156 -49 -175 60 -7 6 -4 4 -140 -81 24 -123 114 35 96 -43 -40 12
4048 12 76 -62 8 -48 -52 -40 -139 -81 -165 20 16 -141 76 -53 19 155 24 234 95 -9 -32 1 57 -78 75
4073G5q1QM7r5L8j6R3K4J74l40J8R0j61M4Q6J46j02Rk18K08j14K09j95K0J4n3
4099g2J22l1j53N7o9l0J01P5L8j11l2J41n6N4oj08l8J22M0J0o9r0p9Q3J45n4J3
4126Co3N8p4J67o9K8K4RR2l8q5j07j68J26J38k0o1k6N5j90J22O8l8o7J76n5K7
4153C2pn9K7l2n6J9m0J37M3q2J6r9J61r6J07j01O9QKp8J3n3L4l5J29R3j96k0M6
4182a8L2j16K20j31j13N4N3L6j95m7L22Oo3p7K30m1j96K03k8j19Q7p0J34j78q9
4207a04J78O8k67O6o2j0K03j02K9o9P3J2o1J66j81K19q3pP5j35q0L6n0J87Lr1
4233A3J5N7l03J52O7o2K31k79p7K10M3o9J09j52J73j29j28QNK40k30np9J28k2
4258h4J40j59J32p8N3k5n3m1J95j35J26Mj98Q5L0Q1j30k2r6R9k3p0J73j7N6O6
$$ plain form
4073 75 -6 2 49 -46 -8 -24 69 93 267 -73 -55 35 -126 -82 4 150 48 57 -161 47 -67 142 -53 -33 -19 -72
4099 -72 50 19 -134 -77 -146 -176 -75 0 38 -73 -105 36 -20 34 28 -80 -118 4 44 54 -15 -105 -184 -101 44 -10 3
4126 3 -60 -2 -76 91 22 50 74 83 175 137 52 -55 -223 -97 41 21 -40 -66 -11 -201 -79 -11 -49 -116 60 5 32
4153 32 25 -34 -7 -39 -95 -76 -116 21 64 -18 -2 -101 60 -36 71 -30 39 47 49 -29 -16 -69 -35 -70 59 152 -44 -64 -18
4182 -18 14 -102 118 -13 -126 -72 -19 17 -178 -225 97 103 40 -37 193 152 -44 159 131 12 99 29 163 -15 -104
4207 -104 74 142 -125 -59 -121 -131 72 -30 -1 -70 3 15 -46 120 -61 158 75 68 143 8 -72 -36 -86 101 104 13
4233 13 28 85 -218 -66 1 -61 170 -109 -186 24 67 -2 107 -45 128 -1 -129 -121 -116 124 -106 -111 -190 -62 -84
4258 -84 56 -103 29 -49 4 -21 -74 -115 80 -55 71 75 -123 -38 -8 73 -57 -79 -175 -76 -99 -169 4 -13 43 109
4284A09k34J6J97j41r0K73j25l5J9l5J06k46J12j3K25k55P0P3l9J40j51j6J56
4307A16k15R5n0m9M5j2J54o5O4m7m5K2J44kk09J08K6j26J02r8nLn6N7J77q2M3
4334I5j42l6J13P0j80J70k46J22M6K01k97Q1M5j17J05o7R1k78L33J7k08L69l04
4357a7K9q1j28K80jo1j28J21j01O2r4J36oo1q9J17J46j84M4M7j3r0J60j21m8l7
4383a18K38j98J6p7K19k42J7K96o3K2l9j35l6J23K2k55J09J03N1p0K48j69l3O3
4407I2r6N5q7K72k14J1j15J23Oj79Q2o3J73o0Q5j9o2j41L13k22J39r1o5J3l1J63
4433H2j03R9j04m4J50%j08l5J09o8J36k68J10M3p0J97j96J36m2Q4k1j32o4N2J30
4458G3o9L7k9j31K07k4j15j5k2K40j89K7mK33j94M5j35J07p9L2nJ5q0j2P4j5J9
$$ plain form
4284 109 -125 -109 88 -53 -143 130 5 -30 -11 -46 60 -186 -74 -87 138 -117 -47 26 -13 127 -24 -40 116
4307 116 -99 -4 -54 -103 -58 -70 84 19 83 36 -9 13 157 155 -54 54 80 -46 56 -42 -47 -44 -100 -43 134 52 95
4334 95 -47 -83 30 100 -80 90 -156 -34 12 213 -84 -3 42 -75 30 -37 54 -224 109 126 -82 287 -17
4357 -17 12 -69 -197 83 82 21 -107 14 -87 -25 -119 17 11 -50 -139 -22 124 -60 -16 31 18 -72 88 -33 -81 -118
4383 -118 120 -78 -62 -139 80 -162 -145 151 88 110 71 -64 -100 23 45 -210 -101 2 53 -17 231 62 29 92
4407 92 -4 51 -36 236 22 33 -82 41 47 -132 -50 -113 60 0 85 66 4 -137 176 -46 93 2 -63 -50 -81 82
4433 82 -21 78 -26 -70 80 80 -28 -63 46 -22 114 -154 -44 -1 -71 126 -70 66 24 108 87 -45 -109 -57 73
4458 73 4 41 12 -119 88 64 -51 -66 -88 152 -37 -10 -14 219 25 70 -65 42 -37 -5 -10 5 -75 -87 -13 -28 -9
4485iP2l2j03J67J1m9o1q1K59k88J09O3q4J56k53J60j17J42l3k91L01j29j13K78
4509G5j28O9qn8m7QQ3Q5m7K4m5j78O8r2L46j4O0j40j37M8j3J93l46J74Q1o8J03
4536I6P4J1r1k10N6J57j0j72P3k7p7q9KNL13k38k5J18m0J06m5L3K7M5l4q3L1q5
4564g9P3O2q7O6L8j7k58J63k1J06j72Q1J15O1k39J15j06L2K34j68p0J34k0o9M8
4589B2j14L9J53j17M2o0q7J11P6j10J1j17J10j30K13j42K80j33m7JJ55k52K52
4612A56k52J9J44j13K03j82J35o0o8J82k31p4N6P2q9J42r2Q1k15K43o3k1O0l13
4636b80J34O0R3j21L1RR4j21N4L1L2j06J65m0q5P6j6o3L6J11N0L7j90lqj03J26
4663Ck5O7l6j54J53J04O9Oj18p8O9j0j73J24l4J64l07J36j13J93o1N2l5l59L33
$$ plain form
4485 -9 63 31 -72 95 106 57 -4 -85 174 -114 -5 58 -26 130 -123 37 -80 62 29 -262 39 -90 -203 75
4509 75 -53 16 8 -50 -97 -89 -6 79 32 56 11 -167 -99 -191 155 141 201 61 -76 -28 -41 152 -194 -20 61 -7 96
4536 96 170 181 90 -120 -64 93 83 -89 -16 -43 -120 -209 -207 -202 111 -127 -152 -34 -74 32 -13 20 47 92 58 -25 6 -79
4564 -79 -6 56 -31 35 73 56 -202 -39 -60 46 -126 -45 70 131 -108 7 -99 -67 167 -1 -71 63 43 -26 22
4589 22 -92 -53 100 -17 25 -35 -122 -11 65 -45 -34 -151 -41 -171 42 -100 180 47 0 1 156 -96 156
4612 156 -96 -77 67 -46 157 -25 110 50 -18 164 -67 -141 -85 -13 -102 40 -52 29 -186 57 -6 -27 33 -280
4636 -280 -146 -86 7 -114 -83 -74 20 -101 -47 -16 16 -90 75 35 -50 26 10 -53 -17 94 144 181 -9 -12 -20 -123 3
4663 3 -22 45 9 -145 8 112 181 187 69 -9 60 50 -123 1 -33 131 -176 -40 -153 40 -21 31 -4 -363 -30
4688c0m6M2J19p8r7P0J4r9J68K4j21N1J02j57n1j3K32j74P0p0J29j19J17o0j23
4713a00K03j31O1k3j85J58J73l63L63k60jK3k1N0j65J70J3o7Q8J05q0j82J23L02
4737B54k72k4J18k02PK67j20m9Q9l7J2kj3J42j88N9j18J13O7k8q3rN3o2J72j38
4763Hj55J75O4j27O9R1j37n2J2k1kJ86j80L3Q8q9r9R2K17j11J2M8j00j80O8J49
4789E9J51k62K2K58q8n6j19J8m4P6m5k6j29L27k45k5NR3q0j4K13j38J51q8p0J23
4815F7m1Q9K9j15m0J08j83J64M2l31J89n3J60O9l56K18J18K8j80k0Q5P3J30j22
4839A28j23o6M2m5J54l4p0l9Q5j11Q0p0L2l3J39j06K2LOJ8Oj03Q6kJ13j92J04
4866B4j98J49P1j17q8M5J63j17p0J5J09j5Q9k24j0K21j19O5k2N7O8j81N7k6J24
$$ plain form
4688 -30 -76 -34 85 7 -90 -20 -6 -105 63 87 -34 17 119 -38 -89 -102 130 -44 26 -44 85 -34 83 23 -100
4713 -100 103 -28 33 10 -175 -17 156 -207 156 -104 -105 -82 -103 -53 -218 -48 -35 -102 -14 91 11 -171 -48 254
4737 254 -18 -42 76 -126 -119 148 28 -21 68 31 43 41 28 170 -18 41 -77 36 103 75 -8 -17 36 -26 146 8
4763 8 -147 28 92 -35 34 125 -12 -64 -52 -73 -75 111 -69 -36 52 -37 -136 -44 173 62 74 122 22 -158 -90 59
4789 59 210 -52 -30 228 140 84 -35 -17 -61 15 -30 -56 -185 142 -103 -128 -123 -30 -110 -124 89 -49 102 14 -56 67
4815 67 26 115 144 29 -11 97 -86 78 120 -211 -22 -75 85 154 -202 16 134 162 -18 -38 47 120 250 128
4839 128 5 -61 -19 -64 90 56 -14 -53 32 -79 1 -69 -37 -70 69 -37 -15 -12 -6 12 18 -85 1 -1 112 -80 24
4866 24 -174 -25 46 -71 -159 -114 49 -68 -138 -123 -14 -29 60 -164 -174 47 -72 -7 -29 28 96 -85 -28 -54 70
4891G0J16k84K13l68K71j53J74R0k15J26Rj07L5O4Poq5Q9j87J96m4%M6J20j58
4916A9m9J17j04j01J80J12j85M2n5k4J10k06K5J68J18k78N9N3n4p2J80q0K1O7
4940F3J48j68j69J96j30M1J05j27R3n5k9p2P8J32p0j04j3J05p6J70j71P5J66j18
4964G0J0P8r4J03k92J86pm8j24J67p4M7p5O9n8P6j01j06N7p0J47l9J39m1J49k22
4990e3K45j48J43k34K57j76m3M9j4R3o2q3k8J08M7K6n2j53O2L1l2J09n2j4N4l3
5016D7l7R6j41Q4K3l9J07l09Q3j54K56L4J2j75K48j13J8k2J68k76n8J6J22K3N3
5041F6K8J58j34k18J06J90j69M4q9k7K74k02J4n5O1Rnl3K5p8k6j08J29j35J31
5066d4M6p9j8J54oj45O7J86m3j04L5k31K30N2k70j0K81j18k0pn7P3pJ20k12J95
$$ plain form
4891 70 186 -98 115 -253 18 -135 39 129 -86 40 49 -58 -23 41 48 42 -43 46 -141 55 11 11 57 177 19
4916 19 -30 87 -17 -118 62 174 -11 31 -24 -48 62 -144 -119 49 167 -111 -52 1 -53 -125 55 -25 -4 63
4940 63 211 43 -126 70 -60 -19 86 -41 52 -3 -32 -104 -26 106 36 -68 -81 24 -52 118 -53 22 188 70
4964 70 80 158 64 167 -125 61 54 6 -118 49 -25 22 -53 16 -42 34 -67 -173 -116 -186 -39 -78 61 20 169 -53
4990 -53 192 44 187 -47 210 34 -9 40 26 119 57 -26 -54 54 101 127 75 -78 -16 15 -17 92 40 26 80 47
5016 47 10 106 -35 49 72 33 140 -169 -86 -240 16 50 62 -113 135 22 40 18 186 -90 -148 -132 -10 13 66
5041 66 94 252 118 -100 6 196 27 71 -18 -45 229 27 41 -14 47 56 51 18 43 -35 -61 -169 -40 -175 -44
5066 -44 2 -77 -95 59 53 -92 -25 161 118 14 49 -182 48 100 -170 -180 101 -17 -37 -44 -101 -28 -35 85 -127 68
5092F8k0o1M5K7j33Q9P5k39K21N7q9n9N7k7J25o4n1L7k68J95j35J31J6j7K1Qk8
5119a9J89k11m1M9J11J02k71pJ59j03q1K38j42J8q6J58L8n0O4q4j1k0k6j2k2j0
5145g0Q3k4j65J36Q2j61J31p4J78j95L4n7Q8M3K9nl6j29R9k6J67r8p8j1K0P0k6
5172ELK8r8k3J14qM5k28J15PJ0MJ77j51J52k48P5M9OL3n8J6J00k67J87Ok21K73
5200A03q3r3qM9j8o0L6k2J81l6R1k19Q3J06r0j1m5P3l5J37k44J04o2M5N7j7k0
5227BP3j8j43J94k29P9k0L3J14n7j67J42J5j05R1P9j15K19j19P4q7j3R2j24o1
5252e1N7n0LN0%L6K1l0M8o5p1J4M1K8M2j12m1J53k38J65K4O7n6j38M8k5P9j37
5280a38J56j27J18n0j59R8L0j0j06K19M6j74J65q3J8R6L0M2k37J6N5J14j9N0k12
$$ plain form
5092 68 48 -13 32 59 -74 15 90 -149 72 129 40 -19 38 11 136 72 21 58 -210 -15 -150 -19 -3 -20 1 9 -19
5119 -19 170 -41 -82 -33 78 180 -91 -98 61 -42 -123 115 -27 -9 -95 63 101 51 115 31 20 0 -26 -38 -60 -70
5145 -70 13 -11 -176 -40 42 -119 12 -62 116 -79 -45 -102 -14 29 58 53 17 -112 -13 -39 128 30 -48 -59 -39 31 5
5172 5 8 36 -62 -85 29 21 66 -162 -47 -40 -30 -26 151 0 152 -96 -21 28 34 67 9 25 125 -142 45 51 -170 103
5200 103 20 -73 -81 -32 -50 -110 -74 -96 85 49 140 -79 4 110 20 9 -36 37 2 139 -105 -1 -63 -18 39 22 2
5227 2 75 57 -86 108 -121 -42 -62 -29 85 28 -139 3 18 -87 4 83 -32 187 68 142 55 42 134 10 -51
5252 -51 6 -44 -41 9 9 45 66 36 84 19 -52 -38 3 31 73 -39 -80 73 -165 0 24 91 35 -103 -55 -80 -1 -138
5280 -138 18 -109 9 -41 -200 -102 -72 -82 -188 31 77 -97 68 -15 3 99 129 171 -66 -50 5 119 100 150 -62
5305f2L9p3m4N1mR9kk19J43P8j38J4J94L2l1J1j72J60K8p5j06J29j21J32j39q9
5331a65J31J24j10j10q6K42K9j61J69p7J13Qo7J20k16J09OK1l4N2j87J19j35M3
5355f2n7J16n9J3j25R4J33Q6N6k43R4j81K78l43J89j19J16q5J35O1j19R7j30o5
5379a20Q5J9k1J29k2O5n6j03K25j55j2m0oNM0P3k35J23j11J08J6Qj49J76j24J7
5405f5L4p6K53j39o8j3O3j67K6N1P4Q6q8J93j25K4k0q0K8K5Q4J4j03O6o0J3K4
5432E4rn7l8J8K3L4P3k63K6K93l23Q5L1J92j19J5o0Q3m5P3k3q0R0J08k22Q8j17
5459g0K2j46J65J02j33Q9LQ5j23n5R2J43k29K7P2l1j07J03k18K44j14J42Jj98
5483a34K34k29K10l45K09j4r7K92j9l3j1L8m6p0J83q8lk63J24j2J14l9N9K1l20
$$ plain form
5305 -62 -23 -96 -140 -89 -93 6 4 -215 -72 6 -132 -118 76 108 77 88 -84 76 104 29 -77 52 -69 63 -76 -165
5331 -165 -34 90 -20 -130 -216 26 55 -106 63 -14 99 107 40 160 -56 53 59 80 46 98 -89 30 -105 -62
5355 -62 -119 -3 -62 -49 -174 -80 53 139 195 -48 46 -135 143 -200 -11 -130 -14 -99 36 97 -22 75 -55 -120
5379 -120 -35 -16 -37 92 70 135 79 -24 201 46 34 -6 -12 -7 33 106 -129 -6 -117 -9 7 15 -134 42 -82 -65
5405 -65 -31 -107 146 7 -61 -74 -11 -178 -152 -101 -27 59 -29 164 39 63 43 -37 -9 16 100 114 11 77 17 30 54
5432 54 45 -12 -50 -32 -9 25 98 -165 -139 154 -169 -84 -53 139 20 35 -25 58 13 86 63 -17 73 181 -41 47 -70
5459 -70 -48 -194 -29 73 -60 29 32 117 -6 -61 31 174 -55 -28 44 13 -94 9 -209 35 -79 63 64 -134
5483 -134 100 -129 81 -264 -55 -69 -166 126 107 74 63 101 55 -15 168 80 77 -186 -62 -74 40 1 60 81 -239
5508b39K86J72l01j27L05q8r3O3KRj32N8J15j4N%J0K8j01O8j4k61Q4J75r5PN3
5535b5K7L0O8J9j39j72J02K27j33N6j01N1j77Q5j17J38N3q2j3J95j48K98l46K57
5559A53n5j26j34J11Q9Rk20K07j51N1N5J46j74N7qo9J10j1j00q3j06K07J18j49
5583g3o3K42j43mR6qj19K3m2Q4R8j24qK54j46m2j28K5K9m8R0k0J47j34P0Jj13
5610e6K1J23k16j3J52j28R8L5M1q0JJ03L7k39K13r6l9P2q3L3k8O1M8O2j62n7J60
5637F3l1Q5Qk60jJ85j53J20j37KQ6j9R7r0J15O3j2j95J12k2K9Q9k23J07R4P0j63
5664A9p5J53j28O6q3N9M3nJ31k25l2O2r3J85k19J24J41l34K88j2q3K2RJ8j74O7
5690g6K29l25J28J99k46R8m8M3q6M8Nm0M5J24n2L8k42R5K27J1k51K21q6j3j48
$$ plain form
5508 -239 47 219 -82 -209 96 8 -85 -22 -20 -11 -143 -85 30 16 21 21 31 59 -42 26 12 -249 -165 10 -85 -78 -25
5535 -25 2 32 100 119 -20 -192 -90 137 4 60 -41 10 -167 -82 -199 -61 -8 -90 -103 92 -56 242 -104 153
5559 153 98 -28 -162 -51 38 47 -173 34 -117 -66 -11 135 -39 18 10 -59 51 40 -60 -143 -249 -42 76 -73
5583 -73 -136 106 -37 -41 55 47 -72 -49 -91 -7 91 -33 -41 213 67 25 -103 -78 -49 -97 -7 -27 120 -14 56 57 -56
5610 -56 -35 88 -128 -141 11 -117 -19 16 57 -23 -22 81 118 -121 92 -4 -43 29 -54 -21 -49 12 60 122 -40 -97 63
5637 63 32 117 125 -135 -136 49 -104 16 -121 -119 -33 -52 45 -45 70 133 121 -74 38 16 45 134 -89 18 112 182 19
5664 19 -56 97 -31 35 -48 11 54 49 180 -45 -77 -15 -108 77 -142 -18 123 -211 77 65 -18 4 13 31 -143 -76
5690 -76 153 -172 -44 155 -91 7 -41 2 -84 -36 -31 -71 -26 98 46 84 -158 -63 164 175 -76 145 59 46 -102
5715a02L2RK7j0n7J30m0R5o5n0l1K11j61pj04J60r7K04k77J92Mj35P5O4n0N8k3
5742E2M6r5K8n8J26Kr3n6J35j77O9q7L8K93j66J0j28R6j92J16J45R7j65m7J07
5767I6r5K63j62j40l1J25r4Q5jN6k24J38O6l7Mo1J06m3J06k09J51k1Oo5N0N3k1
5794A01j71M6n9J42m5k8j19P4j62R7N5j18J75q5J22J68l04L07j43J11p0j01O6
5817E9j78K03j99M7J54l9Q3k50M5Q4k4j8j81L11r3J47k84J66m0O4N8j77RK14j34
5842B7l4pj37K20o4o3J21J14r7L3J70q1l01Q8k0J54j58J21Mj42OQ3j11Q4o5K6
5868b9K9p9J39l8l2j81J34l5K45j91Q4M1k06Q7J21r5K6j04N0k2J33J16k27M5j27
5893a16K49k63Q2l4J70m2r0J56r1N8p4j11Q3L2p0J36n1K5j0m5J9Lj32K47m2k15
$$ plain form
5715 -102 -70 -61 -34 -44 -101 29 -11 84 19 -31 -62 149 -12 -19 -123 37 -60 144 -133 59 63 -72 3 67 17 75 52
5742 52 98 3 31 -27 99 101 8 -48 87 -90 -21 -108 -70 223 57 67 -61 35 -157 -41 104 201 36 -11 96
5767 96 1 264 102 -38 -69 56 -38 47 46 102 -122 16 82 45 49 -12 94 51 157 -52 99 78 84 19 69 122 101
5794 101 -70 -24 -83 59 14 -14 -133 -59 -221 -124 -69 -187 -12 -97 25 193 -111 196 53 164 94 -7 59
5817 59 -119 84 -115 -68 86 47 130 -120 -75 9 -15 -33 -214 97 4 151 -133 33 -7 57 115 -62 -53 161 27
5842 27 -7 -14 -151 69 5 -58 63 177 80 113 283 202 -99 -11 -31 123 -35 86 90 -52 -46 37 -74 10 -55 -29
5868 -29 0 -79 60 22 -10 -191 -57 -92 153 -38 46 87 -119 -32 89 -6 20 -84 -34 -56 77 193 -34 11 -116
5893 -116 133 -130 -48 -82 88 46 -44 112 21 79 5 -106 -23 9 -61 75 24 49 39 -6 13 16 -116 131 89 -126
5919a26J69ok9J40j56l8J42J18k09m7J06j72J13J03J7j30nj12J45k0R8j27k2J00
5943E2L2l5o0J00j04p3R6J85j80N2o1l6R3p5Q2J2J20n1l20K88j08N0l9N1n1j0
5969A0J56j32J71k07k6J28n9K5j37N7o3J78j02J4l3Qj42J27R8k41J08K30j38j53
5993a23P5M9p1Q4q7Q5j76J58R6j99P9q0Lj3j9M7rJ95L1p4k5J4k79K40kR1j63J58
6021H5O1k74K26j28j99K48k71J39K87j53K0j76K16k22M6N2O6j78J12r9K36p8j62
6044a46Q6J7O5l7J2j83R5M3J05n0P4n1N0Q8k59J03m0p3N7K2L3r6K2N7l8Q0o3j5
6072d2L5k7l3n8j1K00m6L3o2J40M3k89J51j7J5L5j70k1J94r7n3L04q6j42J7K5
6098C8j03p0J5J02K23r3k60K21j67L8n4J11m3N0lm6m6P7l3m3J42q3K01k40qR1
$$ plain form
5919 -126 43 37 8 148 -8 -46 96 214 5 -42 64 -108 5 108 125 -5 -10 -122 23 3 101 -26 -48 52
5943 52 84 49 -11 89 -15 -88 8 193 13 65 4 -32 61 -14 68 80 200 149 -171 117 9 59 20 71 20 10
5969 10 166 34 205 -2 -28 100 41 66 -71 -14 -77 101 -1 13 -20 -12 -154 -27 71 -170 -62 168 30 -123
5993 -123 -48 1 -70 14 -73 12 -164 -6 90 -109 -30 -110 -107 -120 -139 -92 -101 94 125 51 26 40 -239 1 -1 90 -73 85
6021 85 146 -128 98 -30 -229 19 -252 -113 174 21 41 -135 81 -141 -95 -43 23 -155 -43 -142 94 16 -146
6044 -146 -60 -43 22 -15 -3 -186 -91 -48 57 7 81 30 80 168 -91 12 -28 -101 -44 -22 11 -85 -63 -6 -44 36 -27 -42
6072 -42 -7 -34 -67 -125 -136 64 18 51 -11 129 172 -117 34 17 32 67 -103 -124 70 -27 -80 224 138 -4 13 38
6098 38 -65 -135 -120 -18 205 112 -148 73 -94 -56 -110 1 -42 8 5 -41 -87 -10 -43 -86 56 -27 174 -66 -74 17
6124A7Q5k06J20j90J54j71J37jN1p6R6q8K8M1k0M1j01Q8P4QJ28l52K08R6k14J85
6150A38O1r9k11K3n5K66k64K67j58p0Q7j71J64k6J54j34k2J35j20J52j06kRLO
6175B7j09P2N4n9j28J32K6m9Q2j39M1J52j55Q2p3k2J1R2K3j71J23Q7k54P6p2J40
6201a1J7N4j3m2J07j46P2j93K65m5n7q0m3J32j3K46k14q9l3kJ30q7mj17R5L6J35
6228A00jk21J10J19k49J72o3j4QJ42m2m3R3k68K01Q2j25j29J40m3N9k61K78j13
6252f8o4J62LJ50k66J3P0j01J39o0J2K4K4j20O6j30K36q1j83K27k8J53m23L63
6276A18J0j91j5J11q2P3J3j3j5K1j88L56j35m1j48K42j93p7J68J2j01n6J71J08
6300A48k24J38q2%j81J12K46j48j45J56m6J59j42o8M4Q2j24Q7L0j35Q4o1O9P3
$$ plain form
6124 17 102 -104 16 -174 -20 -191 -54 -55 -4 -80 16 -72 -44 -3 -23 18 -83 5 79 87 215 -137 71 167 -47 138
6150 138 199 100 -111 -88 -143 123 -141 126 -32 -102 -15 -186 -22 -48 106 -28 -50 85 -35 117 11 9 18 21 27
6175 27 -82 -10 44 -15 -143 -11 15 -34 48 -91 -50 102 -53 29 -44 -66 -55 37 60 -111 12 99 -155 -79 -151 -11
6201 -11 6 60 47 5 112 -34 38 -155 110 65 8 -72 -115 17 4 250 36 -53 -86 -88 42 -45 -49 -166 -71 -35 100
6228 100 99 -122 -12 107 -142 30 -33 -47 -39 103 61 18 111 -157 44 126 1 -128 12 -31 28 -233 45 -68
6252 -68 -132 30 33 183 -83 -70 0 -101 38 -22 -10 14 38 -82 -16 -146 90 9 -174 53 25 178 -245 118
6276 118 128 -63 -78 33 -49 24 37 24 9 30 -158 198 63 22 -126 116 -77 -154 14 26 -75 -131 40 148
6300 148 -76 62 -20 -20 -201 -89 157 9 -136 20 -26 133 -9 -77 -33 49 -75 12 42 -93 -9 -70 -1 72
6324G2l9m2j2O1J3j56P7m1J64k61J71O1n8J26l11K19N2l10K08J02o6m1K2L5j04
6349e8K89j26o4P6r2k6L7M5n4k9j27Q4J6P9j45J56r6n6Q2n9N1j4J16j6j00J56
6375A25m0r2J20j22m0nJ52k22K4k2M0Q2p9P4p9P0K9o1J6J45K8j52jJ24o5n3K0
6402A6N2j66Q3q9J21j2o1K96l27L1L9LN0k14J05R9j03O5JJ0J78k35oJ55j79J56
6428F8j20j8M9pP8P3k78K52K4q6l0j17K91o0j92Q1k4J74k45K26k81l6L2K7O0j00
6454a59J65O8l0l24K56j77K5L6L02j88p2K44j53O2P6n9j74P6j7mm0J13p1o3J35
6479B7o1R7j15p4K09r9j20J91o3K26j39j39R0Q9k93O9J85n4j72J18j7L2m6J4J47
6504A02j96K33Lj55J13j80J75l4k77K13n0Q5j30K47r1k70K33n8K0O3j76j1J58
$$ plain form
6324 72 33 -9 -21 40 53 -103 -26 -67 97 -164 7 68 10 136 -175 44 96 -214 -6 96 30 -11 11 46 -58
6349 -58 231 105 41 117 25 -1 36 81 27 -2 -129 -45 -29 50 -95 61 -35 -91 -9 -68 -17 -31 85 69 -31 125
6375 125 85 -7 113 -9 -49 -54 98 -124 -100 -122 -82 0 -79 -5 -84 -14 15 -46 -30 115 143 -9 -10 114 49 -4 16
6402 16 68 -98 -15 -104 17 5 -56 240 -87 -56 -17 -14 36 -178 -73 26 -77 -12 -11 -1 177 -58 -64 91 -88 68
6428 68 -52 -70 -21 -28 50 123 -155 97 121 35 5 -112 179 119 -73 8 -16 158 -87 139 -142 -178 -146 -119 -59 -159
6454 -159 6 74 44 -280 -24 -201 -176 -140 162 -26 -98 146 -7 55 131 72 -102 -26 -43 -47 -87 26 -45 -108 27
6479 27 -34 63 -52 -126 83 -16 -136 55 -8 218 79 -60 30 119 -174 -105 80 26 -146 -28 -45 -13 -59 -45 102
6504 102 -94 139 142 -13 100 -80 95 61 -216 -3 -53 32 -98 149 58 -212 21 -37 -17 46 -130 -141 17
6527A7K4j64J36N0L0K9j64M1N8n5J09k23M5k2j23K14R4j28L6l5L1J36j32J2P0
6552H6r9M6R1j47p8m7R2O9L5k11R3K0J18j22N2j31J46O2j27J47o0J01j54J22N4
6577A58j01j26M4j40P1L8L1j53Q3R8l3j2J67j05J02o2j38N7O1Pk23K46j52M3r6
6602a35PK8R9pR7J61k85r5O3J25qM7j56K53k33m1J70O2j26o6K13k49J7K8K5j01
6628a07j8J26J7l5P8j06J28k64K89k02K74q2lj9m7J38k04j02J4Q2m4M0K29j27
6652E5j56K12l1j58O2J61j24O8p8K32k95O5n7J01o4rP9q6rj33J29O2qj60R7J21
6678G6n8o0M7M5j26m1k0J3J48J00o3n2j52J37J6L4q5j40J35R4m3q1J2R5lK1J18
6705A67k08Q5j60K64J1k06P2p1NL0q1j8l2K16j40m2J92j59J82k08J7M5K30k61
$$ plain form
6527 17 41 -123 13 63 93 122 -42 -1 57 2 111 -112 -67 -89 -212 2 96 -32 4 -31 0 136 4 16 86
6552 86 -13 33 124 -23 -101 -148 -56 13 48 -163 -70 -50 68 -54 -2 -133 13 75 -52 95 35 136 -18 104 158
6577 158 57 -69 -25 -165 -94 -56 -25 -178 -95 3 -30 -42 125 20 122 60 -78 -21 40 47 -176 70 -82 -39 -135
6602 -135 -128 -100 -1 -8 89 250 -35 -130 -67 58 50 97 -59 194 -39 -80 90 152 26 -40 173 -76 -59 -31 -6 -107
6628 -107 -125 1 18 -17 61 -45 83 -181 108 -94 180 98 95 76 29 167 -37 -139 -125 -43 -87 -47 182 55
6652 55 -101 111 80 -78 -16 145 21 89 11 243 -52 13 -44 57 -7 -16 63 -23 -32 -165 -36 26 18 -142 -45 76
6678 76 18 -42 5 50 -76 -117 -137 -124 24 124 61 9 -143 -6 10 44 -41 -181 -46 48 5 -76 -64 31 28 49 167
6705 167 -41 44 -116 148 159 -47 25 -46 -41 -11 -92 -110 -142 74 -66 -108 84 -75 107 -101 -84 -39 191 -70
6729g0J35j3J5j14P5o0j13K51n0m2M6j13Q6o9k9n3J77or9Q5M8o3N3n0m6q8J77
6756G0m1M8l8k3J2r2P8j2j58R9N7q5P9k0p1R4O8L3m4j44J78J5j83R2j7m1J39o5
6784B8J19j94l0q6K89j75O8Qj66J86J8j23N9K7j36Q9o4j2r7K31p3RJ50q0k07K60
6810I8j9j31J37r5k52L50k6k0N5J08l20R8m9q4J66O8m7pj35N2O9j6Pj37J62p9
6836d7J05R3j28J03j04M4j21o3Q9p2N7o6J65k51Q8L9Q9p2J89l12l1K29j28J25
6860B0J24nk59J29q6J30N7%j24m8P5N8j99L6P1m0M9J23j94R1r1J79o2p2J15j20
6886d3N7j19J61j4j04pJ18QJ87l35R6j14J70j12J87j60o9mJ02k2J8j60K52j02
6910ip2J31j00j02K81j37J26j36j66K13j03J85l05Q6J58Qm8K3j29J21oo1Q9L9
$$ plain form
6729 -70 65 52 67 -47 28 -32 -145 106 56 14 60 -53 33 -36 -65 -118 59 53 -46 39 87 24 77 27 -19 -107 70
6756 70 29 77 39 16 28 -64 14 2 -156 -57 0 -85 -6 -26 -97 -3 65 98 54 -90 88 103 -80 12 -5 -46 93 28
6784 28 147 -47 -77 -163 126 -49 19 27 -139 47 65 -58 1 28 -108 -19 -83 -95 -192 39 -34 -25 125 45 -162 98
6810 98 79 -52 85 -10 -262 88 62 42 97 205 -115 -17 -66 -150 16 84 37 30 -105 -53 16 0 7 -130 32 -47
6836 -47 58 151 23 126 22 66 -55 -118 -29 -101 -44 -110 55 -196 -108 -69 20 -52 137 -175 -206 23 -105 20
6860 20 144 139 -120 9 -77 53 110 110 -14 -62 13 71 -128 -92 -21 -61 -12 111 -83 8 -83 96 34 -38 77 -43
6886 -43 14 -105 56 42 -62 -69 49 57 244 -91 5 -109 61 -51 136 -24 -93 -97 5 -17 1 -159 93 -9
6910 -9 -81 50 -50 -152 129 -8 118 -18 -184 29 -74 111 -194 -108 50 58 10 33 -96 25 19 -42 47 86
6934H6j53k4K6J75j86M7j1o8K42l76J38R3j11QJ91l8N4r5m0m0J72j88J77j67L7
6959e1k7N9K1l8q6K25j67K24j24l8j17J63j49L5R8k5J19r5j23J99Lk2j84J33p
6984B6j63L33Oj80N0oM0L1o5j3j48L6%L9K1j34K22N0k13Q7J03R0l26J18j42J42
7010DP9m3q4J24q5r6O6j14P9J01Q6k94K15j60J56j39K19j10%m0J59j75l9J92j3
7035H8Q4k61J77j12o9L8J95j67KO3Kp4L6j94J31lJ97j86lO5l8L4l6R0k6k24J72
7062a9O5L9j03o8m2L43j63j68k9J65L2q0L9q1K37r2j83J39j32J42Pk27J79J94
7086A94j89nOR3n2o4K7R9j43J30r0j39K9M8Q2r0J91p6j10LK14j00J0r7k3P0Lm2
7114b1l4j47J53R3P0j57j9J3j0l6J27j12O5J17j15J48l3P4k22Q3q9o0J80J4Qj49
$$ plain form
6934 86 -67 -91 -65 110 -76 -29 -40 -108 134 -242 -104 -11 -122 -114 77 39 93 -2 -42 -82 90 -98 79 -88 -51
6959 -51 -78 -19 2 -36 -122 103 -64 160 36 -2 -119 44 -105 -70 28 3 122 27 -96 103 106 84 -100 33 26
6984 26 -137 196 202 22 72 66 106 137 72 59 -89 -53 -53 -14 7 -127 95 145 -68 19 122 212 -114 4 -138 4
7010 4 83 40 -44 80 -5 -101 -35 -149 -70 31 117 -177 38 -122 34 -105 114 4 4 -36 123 -52 -91 101 88
7035 88 172 -89 88 -24 -93 -55 140 -27 -25 38 40 -34 2 -192 -61 -64 133 -53 -56 9 -29 5 -31 59 33 -191 -19
7062 -19 46 85 -18 -86 -128 215 52 -116 -145 20 52 -28 11 -70 167 75 -108 31 -101 41 48 -179 0 194
7086 194 5 0 6 99 47 -17 10 109 -34 96 6 -133 -104 -56 26 -64 127 51 -59 -56 158 58 68 -29 -52 18 21 -21
7114 -21 -55 -202 -49 44 114 -43 -62 -49 -59 -95 32 -80 -15 102 -13 135 102 176 -46 37 -52 -112 68 82 90 -59
7140e9N5k06K79r9m3J26p4L8rj64P1J39q7Jp3J12L0j25j4J24k0j29K72l9q9j4
7166Cj04Pk8M2J3kJ70j71K6O3n9L2Q1p2p6P1N7n1N1q3j23K61k23O4j26L3L00j58
7194bQ0p4K3k9P7j37J77k03P9J44r8K6j34%R9n3J17j62PK46k43K06k77J93r8K6
7220a0K9LJ27k31J65M4k74K21k70K07J8M1j8k16L20l54R5K41r8k0O6j72J81j18
7244b3P1J6pk4K4qQ1l24J97L0r2M2kQ7j56J24j13J75k60K58n6Mn4J86k30J67k36
7271a23J50Q7j10R6k38J64K6j18k5r0L37M1j08p3km9J33k96J06K23j19m2o8P1
7295b7j21K86j88R8j47J80j58J04k22K65N1j45j66L02j36j30K36j76M8J68o9l3
7317B0J25l51J62j4O1m4P5j71M5L9m4J93j03M0j6q5j88J62K46j36j12L31k48j51
$$ plain form
7140 -59 -4 -210 69 -30 -73 53 -21 17 8 -156 -85 54 -33 -32 -105 7 37 -88 -102 22 2 -127 145 106 17 3
7166 3 -101 -94 -122 -80 -67 -69 101 -70 -44 19 -40 -8 73 1 -75 -4 53 2 53 -30 -153 108 -115 -51 -177 -144 156 -2
7194 -2 78 4 27 -2 75 -62 115 -88 -9 135 37 63 -71 -71 28 -25 92 -70 -63 183 -60 146 -131 62 -36 -10
7220 -10 19 22 149 -82 83 127 -147 74 -196 11 29 70 52 -164 156 -198 -103 138 40 20 86 -86 95 -23
7244 -23 48 64 57 33 57 49 130 -194 3 33 -59 -17 -19 68 -88 36 -77 98 -162 96 40 44 -10 176 -54 113 -123
7271 -123 27 114 4 100 -138 26 52 -66 -91 -181 156 197 89 16 14 -35 98 -198 -92 131 12 -30 -98 -27
7295 -27 -148 138 -50 48 -99 81 -77 27 -195 70 121 -24 -190 112 -24 -154 82 -94 -46 122 53 20
7317 20 145 -206 -44 -58 3 -41 34 -137 -92 -53 -97 96 -7 33 17 -68 -256 -94 152 16 -96 235 -13 -164
7341a64r1K41J7o3O3K33j02j72J31k58K52j03m9J20j81J58k6J5N9j17J29n2N2
7364I2o1O6J83p5k48Q5k40J20J22jL2n1M3J2j01O4n9j9J0j40K51k36K00k6N0j3
7390F0q6J02j16J36l0L2r2L3p1P8k3N1m6J03k47J94j10R4q8M6j15K51Lk55N7J38
7416I9L2j11J74l83J63J43r1K4N2mk18K25j24J07j46J14k33K37J6n0P1j04J10
7439A03m6o1o1J52j21R7j61J08J57k27j92rJ79J06p0j18J32p3n0m1L30J19l94
7462a41J69j3J13j06N1J5j37o8Q9L6n0K4j8J73j51q4R9j08J55j61J79l8j2j04
7486h8J3M1J6p6J98j83N6K41k16O2q1O9j01J26Pr5o4R1L7J90k57n2P5L0k2R2K0
7513A29j29J89j72jN2j5j86J64n8M1r5O1k0K05l36O3R0J29j30J02j04o0O1MM1
$$ plain form
7341 -164 -255 -14 3 -60 3 236 134 -38 93 -165 87 -16 -65 55 -126 32 6 21 80 -37 92 40 92
7364 92 31 97 280 205 -43 42 -198 -78 44 43 75 24 67 79 -22 42 -17 -36 -26 -166 85 -151 49 23 73 60
7390 60 -26 76 -40 96 66 98 6 39 -32 46 23 74 28 131 -116 78 -32 62 -26 20 -95 156 159 -96 -39 99
7416 99 131 20 194 -189 -26 117 26 50 102 98 -120 105 -19 88 -58 56 -177 60 76 26 97 -7 103
7439 103 57 -4 -65 87 -34 63 -98 10 167 -60 -252 -261 -82 24 -46 -164 -32 -105 -155 -196 134 253 -141
7462 -141 28 15 128 22 73 88 -49 -117 -28 8 -42 -18 -36 137 -14 -98 1 -107 48 -113 66 28 16 -88
7486 -88 -75 -34 -18 -94 104 -79 -23 218 2 64 -17 52 -49 77 84 -11 -75 16 53 243 -14 -66 9 39 17 109 129
7513 129 0 189 17 16 68 53 -133 31 -27 14 -81 -20 -40 165 -171 -108 -18 111 -19 83 -21 -81 -20 -16 25
7538B5n0Q5lr4M4l0M1QL3Jj64O8m2P9K3j41M3J08l8J9L1j10J40P2j64Q8K6j46
7566d8J14mj09m9J1M6j11J13l2K25O7k22J67m3j29L6k1J15j35O3L2j35j0P5pq2
7592g3rJ14M7k5k12K17p7l9O1l3R2r1o1R6K01k58j93K84q2n5M2j33L06j5r1O1
7618G4n1J53j87n5J96k20P8J6m7L3K5k11J60L5k4j09K23j23J0j0J18o1K22l14
7642f9J21l5j08R4J8j0P6k14O4J58j26M5J34j72L6r6j30J24K8L1j0J92j90N3N5
7667F9j38p6K20j20K0JL0n6J71j39j9J21p4Q3j0o2j36K3O5j37J86m3lk1P5j41
7693a11K35j90N6k6R3k09J34p6L37j58j80K40q4o3j20Q8o5J26o1j22J24J23k49
7716a58N8J01j01J84K2r2j5R0j37J19j71J03L9j07R1j37K39k23J71K4q2o3n9J05
$$ plain form
7538 25 -25 60 57 -37 7 -23 18 26 59 60 -104 -36 -78 1 24 -117 -74 34 -4 15 46 -64 76 148 -16 72 98 -48
7566 -48 66 62 -47 -96 -85 -39 -150 -37 -69 156 223 1 168 125 -4 32 11 126 -9 54 86 -49 -59 16 9 -73
7592 -73 -82 32 79 54 -158 59 -18 -57 4 -29 63 -28 -89 7 208 -50 -243 41 -41 -96 -54 -187 119 104 13 74
7618 74 23 176 -11 -66 130 -90 -12 4 -43 -10 15 -196 -36 -1 -25 -134 89 -34 -24 -34 84 23 245 -69
7642 -69 52 17 -91 3 21 11 87 -127 -63 95 -31 14 148 -24 12 -84 -214 -90 -62 -31 -41 151 -39 14 69
7667 69 -69 -145 75 -45 -25 -24 6 -50 121 -18 -37 84 10 93 83 21 -115 -92 -27 -164 22 -21 -24 -45 30 -111
7693 -111 124 -66 -10 -36 57 -152 -18 -94 243 85 -95 145 61 -2 -122 -34 -99 27 -34 -156 -32 91 -158
7716 -158 -100 1 -100 84 106 14 -1 89 -48 71 -100 3 42 -65 26 -111 128 -95 76 100 18 -45 -104 1
7740Aq4J04K1n3j29pm5L01k83J95M3m6jj53O0k5J14j26J74m2M9n5o6n1l3R2M0
7767el6K29o7j90J10OJ0OK6j44R6j22OJ49P7j08j97oK2J65j06Q8K9o7k5k4j7O5
7795c0l8K63j01k85L97k06j2J0J26p5MN0j83Q8j25J42K1q3M0Rm6j7m9L8l3K07
7821A12j42j33Q5J03j28Q6J69p1j17k8L2N8N7K8J56l29J63j72K21M5j55j22J98
7844A16j09Kj08J37j59K20j28N4j11K13k21K3K4P0o9J5j50P0J76m7J55j17L0j99
7868a13K32n6O1j78M4j31J37p0n6J87r8o6jK58k52K77m7j40l6L2J76j83p2J76
7892H1r5k09K07O0j08J75j1k73L17j16j86J3J66j8J31j30J9r6R2lK38k81J68j47
7916fJ27K6j22j17J28R5k07J50Oq7l5Q4m0q0L5O6l9N4NP1j73J0L5J9R6p0J7q4
$$ plain form
7740 1 -83 21 42 -11 -140 -147 -192 109 -174 21 64 18 17 -136 -76 -101 13 -113 61 19 68 13 -53 -104 -137 -45 -5
7767 -5 -41 188 121 -69 41 47 57 63 89 -55 41 -81 -75 74 151 43 -154 -160 -138 27 -79 9 38 -29 -54 -78 -95 -30
7795 -30 -68 195 94 -191 206 0 -12 -2 124 49 53 103 -80 8 -117 25 46 -37 3 12 -34 -51 -100 -62 -95 112
7821 112 -30 -163 -78 25 -103 -17 152 81 -36 -64 -32 26 83 111 267 -62 101 -71 150 195 40 -82 116
7844 116 7 9 -99 38 -121 99 -29 25 -86 127 -94 -71 -47 23 -46 -31 -181 -111 65 18 173 56 86 -113
7868 -113 119 63 124 -54 -10 -141 -4 -74 -130 57 -41 -107 -108 150 -102 175 128 -12 -48 -16 160 -23 -95 81
7892 81 -14 -223 -16 44 -64 111 100 -173 144 28 -158 -145 21 3 134 4 23 -73 19 16 254 -27 141 -6
7916 -6 121 147 25 -92 36 131 -76 74 80 -7 -42 42 2 -78 -43 23 -16 38 43 114 -59 -49 -14 5 101 31 48 -36
7944c6o4J6J82j51rJ64j92J1K41k10P0j71Q9K8J34k24J90r4r6J07p1K08r5mj0
7969A3J55j30j00J40r2p0R3P5k02K25j62J28n6J27p2r5j94K78j91l9Q6l2J81j69
7993a03J08j19K0L8Q7N5l1j29J33r7n3J96j08k5R6k42K89Lj18N4N1J8j55j25K34
8018G7r6j44J45j27K84j11q5n0J13k5J8j63J68p7J04R8n2n4K7l4J12o0j91J55
8042C2j94J48np9J49O2j32k1J01L2j42K3K5M9j14P8j18rP3K11j27j41Q9J57k15
8067f8R0l3N5q0l0J31j04k15K65p3P3m5Q1r7j2Q5j46J06o4L25j74O5j57n1O3J53
8093A43o7o9J02L2p9l6m6r7L9Q0j22J5J48j04J62l47J08K21j35R1K5o2l2M8j2
8118Fp8J03r2Q5n4mm6j23K58m4j15J92O9n0j02o4PJ73M9j97J84j37M4mj43K08
$$ plain form
7944 -36 -100 -84 98 -53 -62 102 -90 -79 162 -48 22 -149 -60 -32 102 -122 68 -26 -122 -15 -86 122 27 23 13
7969 13 168 38 -62 78 -14 -84 9 84 -118 107 -55 73 17 144 72 -23 -217 61 -130 -169 -83 -115 66 -103
7993 -103 5 -114 -94 -56 31 86 55 -74 59 -38 -91 105 -3 -28 68 -174 115 118 0 54 105 123 -32 -157 77
8018 77 -19 -163 -18 -145 139 28 -57 -107 6 -19 -1 -164 4 -73 31 129 77 23 50 16 128 68 -123 32
8042 32 -162 -14 -19 -98 51 113 -19 -40 61 93 -49 -26 -1 48 -66 12 -106 -115 -42 169 42 -99 -10 147 -68
8067 -68 22 -11 44 -36 -66 65 -39 -254 11 -62 11 -34 47 -50 -62 23 -123 -17 -81 244 70 135 -22 -73 -10 143
8093 143 76 7 109 141 62 26 -20 -117 -78 2 -120 -105 43 -61 101 -246 -138 83 -52 39 64 2 -30 18 6
8118 6 -72 31 -61 24 -30 -34 -80 -203 55 11 -104 88 157 107 5 -59 -52 121 170 -27 157 20 64 60 -83 125
8144A25j69Q3j08J84Rp6k2p6O2m9K17k87O4R1k0k19R1J12J38j07j49J24P0j30
8168d2K97l70J97k39R1R0n0J04j07O6n3q6L14k25j3J60j13J16k46k2J01J2J4
$$ plain form
8144 125 -44 39 -69 115 124 48 26 -50 12 -37 180 -107 -43 48 28 -191 -100 12 150 43 -106 18 88 -42
8168 -42 255 -115 82 -157 -66 24 -26 78 -29 37 -16 -102 212 -13 -26 134 21 137 -109 -131 -30 -18 -4
8191d
$$ Imaginary data points
##PAGE= N=2
##DATA TABLE= (X++(I..I)), XYDATA
0@%%%%%%%%%%%%%%%%%%JrJ6j6J6j6J6k0K8l2L3m0M7n2O1o9P7q9R9j08J21j36J52
41H0j70J89k09K33k56K82l13L46l81M17m59N07n60O18o83P57q42R39j053J191
61F33j355J560j825K177k675L435m763P760l0212J2669K8361l0824N182K1666
75A1789j4512k0559L1887J7497k1432l723J8287j5790j4609K1956J0356k3685
87b538m413Q491j2930p753J9812L977j7144J082R276r679L374K2103j296j5925
101c563Q255O652j3087N396J9859j1586k1099R597N269j8586M937K0416j5551
114c091k1511J6202J0246j6049P102K2609j2409j8701J8132J3448j4742K974J7588
127B1798j3540j9153J3773R380j4813j487J0481j2342j3972J2355R256r749J172
$$ plain form
0 0 0 0 0 0 0 0 0 0 0 0 0 0 0 0 0 0 0 0 1 -8 8 -8 8 -8 8 -12 16 -16 17 -23 24 -28 33 -36 41 -48 51 -57 64 -72 80
41 80 -90 99 -110 123 -133 149 -164 182 -199 218 -241 266 -294 324 -359 398 -444 495 -558 633
61 633 -722 838 -987 1190 -1485 1950 -2813 4947 -25265 -12596 15765 -15059 -9877 11789
75 11789 -2723 -23282 8605 26102 4670 947 19234 3444 -11165 10791 21147 -2538
87 -2538 -6951 1540 -11390 -19143 669 4646 -12498 -11416 -2140 -11819 -8445 13658 12362 -3563
101 -3563 4692 11344 -1743 3653 23512 11926 -9173 424 5693 -12893 -7956 12460 -3091
114 -3091 -24602 -8400 1846 -14203 -7101 15508 3099 -15602 2530 15978 1236 4210 21798
127 21798 8258 -10895 2878 12258 -2555 -4042 6439 -5903 -19875 -7520 1736 -8013 -6841
140f841R227q318m807J4723O313p328L916M432j0571j528J2572j887j0881L681
154B703K51j4166Q78J3961n579j1115Q327L357j1700N067J7210m352j0419J0173
168D596N871j1571L037J4998o899j3818O349L995j1954k25J0725o538j2345N942
182g837O141o917J544J0422l128o646P007N685l266K381N074m713m844M284K57
197E444n180J351P94p896k517N068j853l753N323J629n883J752R020q66l234O736
213E935K746p422R16P955l471o962L764J036q661j774O514k495p278L483L766
228a948n012j43P780N25l671L494M514k112j97M020j46l914o0R07l175j825O33
245c30k310k208n5j13p31J580J355o66J340L029K51J19L461J272k587N47K416
$$ plain form
140 -6841 2386 -5932 -10739 3984 10297 2969 6885 11317 746 -782 11790 9903 -978 2703
154 2703 2954 -11212 -10334 3627 -1952 -13067 -4740 -1383 -13083 -8016 9194 4842 -5577 4596
168 4596 10467 -1104 1933 16931 10032 -3786 2563 6558 -5396 -5621 5104 -1434 -13779 -7837
182 -7837 -1696 -8613 -7069 3353 225 -6421 586 6271 3005 5386 10460 5747 903 5187 5444
197 5444 264 1615 2409 -5487 -8004 -2936 -4789 -8542 -3219 -1590 -7473 -5721 3299 2433 -801 5935
213 5935 8681 1259 2175 10130 6659 -303 3461 4497 -4164 -5938 576 -1919 -9197 -5714 -1948
228 -1948 -6960 -7103 677 1202 -2469 1025 5539 3427 3230 7250 7104 3190 3130 4037 862 -963 -330
245 -330 -2640 -4848 -4903 -5016 -5747 -4167 -2812 -3478 -2138 891 1142 1261 4722 5994 3407 3954 6370
262F370k415k755J317j15m784j601K356j760l496K202K342k560q8M352J210j440
278h65K166L526q08j268K584R01l156q52J129j995k950k40M6j940j492Q38O99
295c677q14Q51J914J015N43J198J649J012L91m4O55k63j300j086l40j275k254
312a825p39J90j440j425J126R23p51O30K638R05k89J642K481k41j061J838M14
329E016k279p57P03j553k768l61M05j900j443J287N08r48O91K442K78K61J692
346A274J877l2n3J034J73r50q95k72o49j650j430k95n15j325o46J117J91m63J126
365b383K032K97K17J899J555q35J52J759p09j967L24p2k251j481M28o97k186r8
383d016J248q98j59J952J017k38J262J510N25N59O58L21n76j33n80r68n02p89
$$ plain form
262 6370 3955 1200 2517 2402 -2382 -3983 -1627 -3387 -6883 -4681 -2339 -4899 -4987 -635 575 -865
278 -865 1301 4827 4019 2751 5335 6236 3080 2228 3357 1362 -1588 -1828 -1782 -3722 -5214 -4376 -3677
295 -3677 -4491 -3640 -1726 -711 -168 1030 2679 3691 4082 4038 4693 4430 3130 2044 1704 429 -1825
312 -1825 -2564 -2374 -3814 -5239 -4113 -3190 -3941 -3311 -673 232 -57 1585 4066 3825 2764 4602 5016
329 5016 2737 1980 2683 1130 -1638 -1999 -1594 -3494 -4937 -3650 -3142 -4090 -3399 -957 -679 -418 1274
346 1274 3151 3119 3066 4100 4273 3323 2428 2156 1507 -143 -1573 -1868 -2383 -3708 -4354 -3237 -3046 -3509 -2383
365 -2383 -351 -54 163 2062 3617 2782 2934 4693 3984 2017 2341 2269 18 -1463 -1035 -1732 -3918 -4016
383 -4016 -2768 -3666 -3825 -1873 -856 -1094 168 1678 2203 2762 3420 3741 3165 3032 2452 1484 982 193
401A93j951m64J24j448p25J751P7j119J225K280j85J52K991O81j948J076K151
418D861j690j870J867r57l508m50J596j872k086J573M58k553J078K995l42o51
434a551K670Q52j173J545K130r61j029P76r86k133N61M77k805r11Q32j960j177
451d843K771R12k247J123K793j115j69M156R97l009Q38K598k820j529L344q18
467B982n050k0K203k818j830L868l45m348J528L976j921J32M379J08l491K072
483A425L230k011p08K780j988m415J675J390k934o76J934k756k958L349K112k157
499b708R37L534k413j603M963K122l588J279K485l950k133M235K37n085N07J939
515G58m862j807N675L73n073K111L192l219J20O433L10m488K032K802l490l07
$$ plain form
401 193 -1758 -2222 -2098 -3546 -4271 -2520 -2443 -3562 -2337 -57 -242 -90 2901 3582 1634 2710 4861
418 4861 3171 1301 3168 2211 -1297 -1747 -151 -2023 -4109 -2536 -2078 -4631 -3553 -558 -900 -1551
434 -1551 1119 1971 798 2343 4473 3512 2483 3259 2273 140 701 1178 -1627 -2538 -1706 -3666 -4843
451 -4843 -2072 -1160 -3407 -2284 509 -606 -775 3381 4378 1369 2207 4805 1985 456 3800 2982
467 2982 -2068 -2088 115 -2703 -4533 -665 -1010 -5358 -3830 146 -1775 -1643 2736 2844 -647 1425
483 1425 4655 2644 1936 4716 2728 -1687 -12 1378 -1556 -2232 -298 -3054 -6012 -2663 -551 -2708
499 -2708 -1771 1763 -650 -2253 2710 4832 1244 2523 5008 1058 -1075 3160 3397 -1688 -1181 758
515 758 -4104 -5911 -236 137 -4936 -2825 367 -2852 -2732 3701 4011 -477 1555 4357 867 560
531E60M970j661n697J325J662m096N0M082k472m512K575K150k509J921M871k590
547F29l147M103K126k875K256L190m454l841M003N60m401J639K203n340l140N205
563a284P72l624K825K983m321j097O345J155l575K477K716n343j143N805q44m827
579i80J561Q81n356n73N113j027m081K243J489l711J766N958j516k796L103J139
595C213l597K141M323l240l768K532l35m169J920L437m344l349L730q0l228L638
611a176L676l724j843M907O42k763L348K888m805k096M240q63l636K277J368n340
627b900j660L937m23k916K861J610l818J53M868l15j651L107P93l569M03L703
643D183j559k477J968p83m285Q60L039k437k172K499n10k914K521L668j926j009
$$ plain form
531 560 5530 3869 -1828 -503 1159 -2937 -2887 1195 -1277 -5789 -3214 -1064 -3573 -1652 3219 629
547 629 -2518 1585 3711 836 3092 6282 1828 -2013 1990 2550 -1851 -212 1991 -3349 -6489 -1284
563 -1284 -512 -4136 -1311 1672 -2649 -3746 2599 3754 179 2656 5372 29 -1114 4691 3847 -980
579 -980 581 1462 -3894 -4467 646 -381 -4462 -2219 -730 -4441 -2675 3283 1767 -1029 2074 3213
595 3213 -384 1757 6080 2840 -928 1604 1269 -2900 -980 2457 -1887 -5236 -1506 -1586 -4814 -1176
611 -1176 2500 -1224 -3067 1840 2482 -281 3067 5955 1150 -946 3294 2431 -1205 1072 2440 -2900
627 -2900 -4560 -623 -1046 -3962 -1101 509 -3309 -3156 1712 1397 -254 2853 3646 77 480 4183
643 4183 2624 147 2115 1332 -2953 -2093 946 -1491 -3663 -1164 -1674 -4588 -2067 1601 -325 -1334
659a334L329k8k565K577K966l019j581K369j261l239K180J569l636j797K334o47
675a783k050K504J850k485j75K980M5j045K514J206k391m11K040q54j871J787
691A861k37l365k40J721j645j068J786P1j961J061K462p56k62K647j66j871J621
708A659J866j885n80J559j360k277N95J043k006j088J473o20j800J695J297q38
724a267R6J973K2r08J848J194j308k51Q97n42j633P52m6j747m30K44q11o73J009
743a581K38n05M45J453m34M53J505R2n25P17L76p91j29M73p33j290j26J60j199
762a401m54N77l84n82P15N33k63Q21J027L20k88P26O61l46j26L24n04p52j57k21
782B26p71o81N0m22k90M6M12K28J30M64N16M49O96L60o5L60k8j3k02l75n99k96
$$ plain form
659 -1334 1995 1967 -598 1979 4945 1926 345 2714 1453 -1786 394 1963 -1673 -3470 -1136 -1783
675 -1783 -3833 -1329 521 -1964 -2139 841 886 -159 2355 3561 1170 759 2799 1945 74 1861
691 1861 1624 -1741 -1981 -260 -1905 -2973 -1187 -1116 -3077 -2016 446 -310 -572 2075 1909 38 1659
708 1659 3525 1640 1060 2619 1259 -1018 -423 620 -1386 -2474 -1001 -1621 -3421 -1726 -429 -1267
724 -1267 -1171 802 824 -84 1764 2958 1650 1399 2296 1754 121 873 827 -920 -1350 -1106 -1917 -2590 -1581
743 -1581 -1343 -1848 -1403 50 -384 69 1574 1666 1141 1858 2234 1443 1314 1787 1054 -236 -362 -202 -1401
762 -1401 -1855 -1278 -1662 -2244 -1529 -996 -1259 -438 589 909 621 1347 2008 1662 1536 1860 1356 604 447 226
782 226 -545 -1226 -1176 -1598 -1888 -1842 -1430 -1202 -1072 -608 -92 357 1053 1413 1348 1708 1680 1667 1465 1090 491 195
804A95n61l06o20k39J38j29l10N12L07J71M33P38N18J96K13M49r2j50Q4l55o05
825E87k50l42n54l50n83J53m64k41M99L20L89N28K92N80L20K87N55q1k97M9k12
846A185l18l46n61l11o12k75j08k06j49L02J03K72L88O03M02M13K08L58L71k90
866A429r8J20m04m99k25m55m95l79k70r0k41K9M67J3K92O30K48M70M42L74jJ80
888A537p6p0l57l76l87l60k00m09n02j40N6k82J86K84M64RN20N12L86q9O45K32
910A583m05l7M04n36q30o5P1j098k48M08m37n10N59M38n28M36J140k53oR44M09
931A439l77K26M84p60o69M28k33j135Q7J79j143q4P00j36n37N48O74l05K77J251
951I14Q8m44O11N19p49O0O95o57j196J83K32j368j07R16n90j182R77N25p95P01
$$ plain form
804 195 -366 -672 -1292 -1531 -1393 -1522 -1832 -1320 -1013 -842 -409 329 847 1043 1256 1705 1613 1463 1547 1192 587
825 587 337 -5 -559 -909 -1492 -1339 -1803 -2044 -1545 -1225 -836 -308 -16 564 884 1171 1726 1645 1348 1397 1185
846 1185 867 521 -40 -351 -963 -1238 -1346 -1552 -1701 -1399 -1296 -1024 -636 -33 369 782 990 1348 1719 1429
866 1429 1331 1451 1047 548 323 -132 -627 -1006 -1276 -1366 -1607 -1578 -1111 -1098 -806 -176 72 542 984 1358 1357 1537
888 1537 1461 1391 1034 658 271 -89 -289 -698 -1200 -1340 -1284 -1566 -1380 -1096 -632 -623 -103 409 795 706 1351 1583
910 1583 1178 1141 1545 1009 179 114 185 -913 -1161 -753 -1190 -1700 -1141 -703 -1231 -795 345 92 86 1030 1439
931 1439 1062 1288 1772 1012 343 771 538 -597 -510 -331 -1474 -1558 -858 -994 -1531 -983 -309 -614 -337 914
951 914 1002 558 1169 1688 939 999 1694 1037 -159 24 256 -1112 -1219 -303 -893 -2075 -1098 -573 -1368 -667
971f67J290j41q65J395M32p09M45R11j148q65P85j95j306K24O21j512n35J142
989f98L6r23P28J173r37l06J913L30j042J103O28j318l22J463o16j484N14L06
1007E48k149j5J550o61j401J341O62j622Q33K000m57j026J493O86j651O22J547
1024B300j250j212R04k7j900M74J335j663j222J800r6j213J051J825j622l64J894
1041A014J31j071J213J019j852n54J634o08j566J034M17k128n96J888p02j343
1057b070J651Q20j879L18K049l30r27J694L85j825M72J905j256j330J324p7k490
1074a566M33J705j322j147J519k04j584J361J719j196l53J840j84j377J287J239
1090B170j344p95J242m24j958J312P07j991p10J605p32j290J608J042j524l8J766
$$ plain form
971 -667 623 482 -383 1012 1444 735 1180 2091 943 78 863 668 -638 -414 207 -1305 -1840 -698
989 -698 -662 -1585 -857 316 -621 -927 986 1316 274 1377 2005 687 365 1828 1212 -272 242 548
1007 548 -1601 -1616 -66 -727 -2128 -787 -125 -1747 -914 1086 629 -397 1096 1782 131 753 2300
1024 2300 1050 -162 742 715 -1185 -711 624 -1039 -2261 -461 -557 -1770 -719 1106 -516 -880 1014
1041 1014 1145 74 1287 2306 454 -100 1534 926 -640 394 811 -1317 -1913 -25 -727 -2070
1057 -2070 -419 401 -1478 -1160 889 559 -368 1326 1711 -114 358 2263 1007 -323 1001 924 -1566
1074 -1566 -1133 572 -750 -1897 -378 -582 -2166 -805 914 -282 -635 1205 1021 -356 931 2170
1090 2170 826 31 1273 849 -1109 203 910 -1081 -1791 -186 -918 -2208 -600 442 -1082 -1120 646
1107F46m36n69J676Q24k018PJ851j316r57J166n9k118qJ558j108q81J591R3j711
1126a769P02J789r86p1J614j31j358P33J441j176o27J289o49j876Q72R01j455
1143g57n10J053q28r52J033J312r83R0J339n27q91J796M96j230J18R06q46j188
1161e69J320j2j670M4J035j061o92J164M41j356M81J348q14P2J383R8j047L76
1179E41J096j065k97Q53m36j487M54N21j015l52J107n00r10P21O42n71M09Q98
1197F09r5q48J169M82q66K13O17p80r66R28n8j034l03R76q86q24J385Rp69M26
1217f15P99k70k13Q66M00n54M01M72q33l03P12k36j035Q6L02p37l51N73j31m56
1237a123M10N16j60J34O92Q7l63O51K68m32j41M56l58p34M48k20o80p3L39l15
$$ plain form
1107 646 210 -359 1317 2141 123 130 1981 665 -292 874 815 -1303 -1311 247 -861 -1742 -151 -58 -1769
1126 -1769 -1067 722 -264 -335 1279 1148 -210 523 1964 788 161 1450 801 -1075 -203 698 -757
1143 -757 -1267 -214 -1042 -1994 -961 351 -632 -542 797 270 -621 1175 1671 441 559 1465 619 -569
1161 -569 751 739 -931 -887 148 -913 -1605 -441 0 -1356 -875 473 -341 -269 1114 1212 165 541
1179 541 1637 572 275 1128 692 -795 -341 180 -835 -1187 -80 -580 -1490 -769 -127 -698 -289 609
1197 609 514 -334 835 1317 451 664 1281 501 -465 463 405 -629 -932 44 -842 -1666 -281 -272 -1041 -615
1217 -615 184 -86 -299 567 967 413 814 1286 453 150 862 626 -409 -323 -21 -758 -1109 -536 -667 -1123
1237 -1123 -713 -197 -357 -223 469 556 193 844 1112 680 539 995 637 -97 351 131 -549 -622 -283 -598
1257e98m86M50J21j91K99P66k42n4L25L05j46K64K45o65j7L2l15k47k27J99l71
1278e53k83J97J2j92M75lp6K45L36K04m7L49J85k15j43K49j14l71j80L3n47j56
1300e95J62m28m1K66O8J36J80J64J93m0K07M41j84J24r1K8k42j11J1n05k9l6k47
1323e69l28K06K13j94J42K9L14K50m5L29K3L51j99J17k15MP3k56k28j79j90o9
1345d21q8k58J16M4O0j15M32J75O6M11J08J8q9K48j63J42k12k08n1l03m2j93j00
1368d23k9j77l3J09O2K49l8K39J81J74J56rJ15j13J52J4l23k12J55k03l87J40
1390b01l16Kj06J34plK39K01MK48K17P8K9M0J00k24l7k04r4l30J75j75q9j90J20
1415c89j82N3K1K68J14J01J88J10M4K27K13m05q0J81j28k61j63R7l03j52N0j84
$$ plain form
1257 -598 -1084 -634 -513 -704 -405 361 119 65 390 695 549 813 1058 393 376 408 93 -154 -381 -182 -553
1278 -553 -836 -639 -627 -819 -344 -347 -423 -178 158 362 315 664 849 634 491 740 626 255 75 108 -439 -595
1300 -595 -433 -861 -902 -636 -568 -432 -252 -88 105 65 272 713 529 653 562 590 348 237 248 -257 -286 -322 -569
1323 -569 -897 -691 -478 -672 -530 -501 -187 63 18 347 370 721 522 639 424 428 501 245 17 -162 -352 -421
1345 -421 -509 -767 -651 -607 -547 -662 -230 -55 11 422 530 548 459 707 544 686 474 266 215 -88 -130 -323 -423
1368 -423 -452 -629 -662 -553 -491 -242 -280 -41 140 314 470 461 576 463 615 629 306 94 249 46 -341 -201
1390 -201 -517 -515 -621 -487 -494 -497 -258 -57 -53 195 412 490 519 559 659 435 398 194 100 -230 -55 -230 -319 -509 -389
1415 -389 -571 -518 -497 -229 -115 -14 174 284 328 555 768 363 283 464 336 75 -88 9 -294 -446 -396 -580
1437e80j37K09L50k26J28M36q2M7L26J02k62J68K59l24p1R8k72m78k9K83l90k15
1459f60M13m7l72M32L12l80K28N42kk60L55J45m20m1K47j49n37L07k00j93l59
1480f39N17m72j20L37K02k79K7Q39l61j43M50K25l36J9N54m43m28N89j81q59J74
1501c28L81l46l22M83k25l58L68N26k67k15P90J1n14O32K81o24k9L52j95o84M59
1522A76K05q91oM31l62l33M23M19m49K7P10q1m66O78O9m06K46M69n78l53L61R4
1544C83j078L85L79n08j75M21J00p60N92N44n52N7P94k05m69N10N04m91j54K99
1564E76k95p67M85J52m28k03M79m44m33N82M45p17M08O23k53l93O34J83o27K59
1584B66N66n29l20M37r4p94K07K38l80l59P97j2o40J16O92l42j52P71m4l49K40
$$ plain form
1437 -580 -717 -508 -158 -384 -256 180 98 145 471 573 311 479 738 414 343 441 169 -309 -338 -55 -445 -660
1459 -660 -247 -294 -666 -234 78 -302 -74 468 466 206 561 706 286 245 492 343 -194 113 -87 -280 -639
1480 -639 -122 -594 -714 -377 -175 -454 -427 412 51 -92 358 583 247 266 820 377 -51 538 357 -502 -328
1501 -328 53 -293 -615 -132 -357 -715 -347 179 -88 -303 487 498 -16 616 897 273 244 596 401 -283 176
1522 176 381 -510 -516 -85 -447 -780 -357 62 -387 -360 350 269 -197 481 550 144 390 859 281 -72 289 383
1544 383 -695 -310 69 -439 -614 -193 -93 -853 -261 283 -269 -212 582 377 -92 418 922 431 277 576
1564 576 281 -486 -1 151 -277 -480 -1 -445 -878 -296 149 -568 -160 463 210 -183 451 634 7 266
1584 266 832 303 -17 420 326 -468 -261 -23 -403 -762 35 23 -617 -501 191 -151 -303 468 424 75 315
1605C15L36p21J92N61m05n43K32L26r52N7O24n07m71P74L65n74m5P52l08l74P49
1626C83K71p54K92N43n04m29M02J3o44J45M21q07k53P96j01l35K46N04m80j38
1646d29R68M8n48K56L85m75k59Q97o51l59J23J12o14m3O38m48l67L64N30n94J52
1667c14Q19j49m56M15L84n64J60K27l70k74K77J7o07K11K78n25k12O65q4k46K2
1688c26M69k89j40N77m1M3J10J56m24j26L94Jp26M95j45m36kM05l06l07L79J32
1710a07q4K2L86Mj80L96J55m41J55J70k13m01K56Q5n23J25J90j98k18J39k8j56
1732d66J65N35l60j6M69K6k16J82K43r4j77o1k05k29J57J52l28k16N05l67l10
1753f11L68P3j8P3L61l6o8L18P5l21J4K25j97j93J55n4l28K5p8j39j38J86J75
$$ plain form
1605 315 651 -70 122 683 278 -265 -33 293 -659 -602 22 -485 -956 -182 183 -391 -436 316 8 -366 383
1626 383 654 -100 192 735 231 -198 204 217 -427 -282 139 -668 -921 -125 -226 -561 -315 189 -291 -429
1646 -429 539 587 39 295 680 205 -54 843 192 -167 -44 68 -546 -589 49 -399 -766 -402 128 -466 -314
1667 -314 505 356 -100 315 699 135 295 522 152 -122 155 172 -435 -224 54 -471 -683 -18 -102 -348 -326
1688 -326 143 -146 -286 291 250 293 403 559 135 9 403 404 -322 173 28 -408 -410 -5 -311 -618 -239 -107
1710 -107 -191 -169 217 221 41 437 592 151 306 476 263 -138 118 203 -320 -195 -5 -203 -421 -282 -310 -466
1732 -466 -301 234 -126 -142 327 353 137 319 562 468 291 230 25 -204 -47 105 -223 -439 66 -301 -611
1753 -611 -243 -170 -188 -115 246 210 142 460 535 214 228 453 256 63 218 164 -164 -139 -217 -356 -494 -308 -133
1776a33k58K83J52o1ML31n3k1J41j36J01j01R6l58Pk03J60k84o4L95j87l1mJ60
1800f4l8j41J30K14K12P2p9j64J39N4k37J56j93j03r2j0j85QQo6P3n0K80j19J51
1825d4K10n1L6J1J57M6r0j94J61n0k64J1lp9j79k2o6L25j7J05j92M2M23q2l8J38
1851B94p9R3NK3k39j62J42j08p9j21L8j31On8J31J34j2N6J31M3p3L07j2L3r8K0
1877B84p8O2n2j90j62O4j35l7o8O8Q2j11J50J71k0J28O0pL0O0%j9l1k42J62j57
1903A2N1l77K52j10j07m1J87j89K42PO4mJ53J9K48Q4k34kR2k92K49k55k64J27
1927h8o8O6k77L71k37J0J72q2R7J23l0J34j07K79L6j34J2j02r6P4M8k72j04J5
1951a60k91J69rJ16j31N6K4L12o3J5K42o2j31K12J10l47k0P4q1j51J71o1k66J29
$$ plain form
1776 -133 -391 -108 44 -17 -13 318 265 244 385 249 350 249 345 -13 -6 -209 -49 -333 -397 -2 -189 -220 -224 -64
1800 -64 -102 -243 -113 101 313 385 306 142 281 335 98 254 61 -42 -134 -144 -329 -321 -313 -379 -306 -356 -76 -195 -44
1825 -44 166 115 151 162 319 365 275 81 242 192 -72 -61 -64 -143 -322 -344 -410 -85 -102 3 -189 -147 276 194 156 294
1851 294 215 308 313 336 97 -65 77 -31 -110 -231 -193 -324 -318 -376 -245 -111 -123 -67 64 107 34 341 329 362 264 284
1877 284 206 268 216 26 -136 -72 -207 -244 -312 -244 -162 -273 -123 48 28 156 216 209 239 299 299 280 249 7 169 12
1903 12 63 -314 -62 -172 -279 -320 -133 -322 -80 -73 -9 -13 140 159 407 491 257 255 347 55 304 49 -215 -88
1927 -88 -156 -90 -367 4 -233 -223 -51 -133 -36 87 57 191 84 363 399 265 277 175 79 153 201 -71 -175 -160
1951 -160 -451 -282 -291 -175 -306 -250 -226 86 23 38 280 218 87 299 409 62 42 116 35 -116 55 -6 -272 -143
1975a43M0j44j68L18J85k06J34J99j36K9J71qj55Q0K17k27l17K32l6j75N1k62
1997c21J50l53L65k6j29O9K59N4j09L89q3k14K00K19j43m6J3n6l58l7K52k65k15
2020c85K83j36N3Q7Q6j97K20K87p1l31L12J24m21K86J59k22l12K77j5l82P7L78
2042A57k75m03J79K42k48L26K77k44J42J07qk14K18L83m32j49R4j3k76L7K08l84
2064b76j37L07K2l01L48R9m03J74N16j48j16k5M76n93J45L43m07l6K99j50n13
2085c76j4M32l10k17M43j6k46K11L23l23pL94J66n35L71N7k44j57K34o8l91J31
2107a42J69k16l48M70j7l17L57K08k01j21N96j41k64K43P7l07J26K20m00j38K75
2128A29K6k53j46L36n26J64J80k5l32K62L39j52j87N97j22l68L48K00l72j15K00
$$ plain form
1975 -143 -103 -247 -415 -97 88 -118 16 215 79 108 279 271 116 196 413 186 -131 101 65 -110 -59 -321
1997 -321 -171 -524 -159 -185 -314 -245 14 68 -41 348 265 51 251 470 327 281 294 238 -120 -157 95 -170 -385
2020 -385 -102 -238 -185 -98 -12 -209 11 298 227 -104 208 332 -89 197 356 134 -178 99 84 -298 -221 157
2042 157 -118 -521 -342 -100 -348 -22 255 11 153 260 252 38 256 639 207 58 152 139 -137 -100 108 -276
2064 -276 -413 -106 -84 -385 -37 62 -341 -167 349 201 85 60 536 -57 88 431 24 -12 287 137 -376
2085 -376 -390 42 -268 -485 -42 -58 -304 -93 230 -93 -100 294 460 -75 296 353 109 -48 186 118 -273 -142
2107 -142 27 -189 -537 -67 -84 -401 -44 164 -37 -158 438 297 33 276 353 46 172 392 -8 -146 129
2128 129 155 -98 -244 92 -434 -270 -90 -115 -447 -185 154 2 -185 412 290 -78 270 470 98 -17 183
2149A83k14k66J91K15l62l7J60k7j46K66L06l15p1M48k67m6J67K55k65m6J88j77
2171A40m23J99J62m62J75L08q2l30J86K38m06R4L29k53k3M34J19l32J75J41n12
2192a23O5J38R2m37R8K59k81m8K11k40l24M56K17j22R9L08l28n8J54K49l21K8
2214I2R6p8k29J80j21m3Q6J27l18m9R5J2ML6J74K25l47L59p7j56J70J50l08k36
2238a56M49j60j58K2r3o9j0Q4k5k95K71Q5j55O7J61M6m5J96J35j65o5J15k31k96
2262b92K94j4j08k59L60j23p0J5j35J32l8L31p6o3J06J97r2M3Q6k39J0J17J4l93
2286a97Q5k9j18P2J2K26k56RQ9L1P0J60K21l95K27J86l16J27r0R6k46K2J6p7j09
2311a84R9j41j01L5K27j42L2L88k2m0j15J19R0j15J77j84J91k35k01J65j07q9
$$ plain form
2149 183 -31 -297 -106 109 -253 -290 -130 -157 -303 -37 269 -46 -117 331 64 18 185 440 175 129 317 140
2171 140 -283 -84 78 -384 -209 99 17 -313 -127 111 -295 -201 128 -125 -148 286 405 73 248 389 -123
2192 -123 -58 80 172 -265 -167 92 -189 -237 -26 -266 -590 -134 83 -39 60 368 40 -18 136 385 64 92
2214 92 188 110 -119 61 -60 -103 -17 110 -208 -257 -162 -150 -146 -110 64 289 -58 301 224 68 238 388 80 -156
2238 -156 293 133 -25 -3 -96 -165 -175 -91 -116 -411 -140 -55 -210 -143 18 64 19 215 350 185 120 235 4 -292
2262 -292 2 -12 -120 -379 -19 -142 -212 -197 -332 -200 -238 93 17 -46 60 257 165 208 294 55 65 182 196 -197
2286 -197 -112 -141 -259 -187 -175 51 -205 -196 -107 -76 -6 154 375 -20 207 393 77 204 114 210 -36 -14 2 -75 -184
2311 -184 -85 -226 -327 -292 -65 -207 -175 213 191 151 36 155 245 130 307 123 314 79 -122 43 -64 -153
2333a53j2n5J22j23R1M7Qj47K65J20o0j41J42J82n6k8p3k21K1jJ45k57N4J26j51
2358a55N8k51J23J55L3J14M1N9J0j6qr2Q5q9m6m8n0n4K3k00J56n6J12m5J4J09
2384a8m1J14j44J80N1j43J58K04n5j63p8J73k40j4r1k5j0j35M8%r3O3J17J68n7
2409c1N1K86j50l8k3J2J2P1j75O6k40l1j03qR6j1J71k06J35j8o8K51l4O6m9J30
2435A62J13r1l6j27J63k27J33p8k5p8lj41lL7J85L8q9RP5Q2j03J69J02K4q4J46
2461C53j97k9Lj19m8m2Q0j80j00O7J35j21K05J22k52L2J6L60j6j00m2j21J69l4
2485A41r3m8j64K71l17R0k4k7j20L71J6k75P1K20R3k60J68J68j69k3L26k90j79
2508e4R0R5m34J11P3j61J19j1qm1K17LL4p9K63n4Nn4K74j85j93K50j11l02KJ70
$$ plain form
2333 -153 -165 -220 -98 -221 -130 -83 -75 -222 43 163 103 -38 104 286 230 202 129 -92 -71 -72 73 -184 -130 -4 -155
2358 -155 -97 -348 -225 -70 -37 77 118 177 187 171 163 71 156 67 21 -27 -77 -131 -108 -308 -152 -208 -96 -141 -127 -18
2384 -18 -59 55 -89 91 142 -1 157 361 306 143 65 238 -2 -16 -107 -132 -142 -277 -229 -229 -322 -259 -142 26 -31
2409 -31 20 306 156 118 95 107 119 190 15 81 -159 -190 -293 -301 -205 -216 -45 -251 -116 -134 -202 49 15 81 32 162
2435 162 275 184 148 21 184 -43 90 12 -13 -91 -94 -235 -238 -201 -16 22 -67 -58 17 99 -4 165 267 291 207 353
2461 353 156 127 130 11 -37 -79 1 -179 -279 -212 -77 -198 7 129 -123 -91 -75 285 269 169 127 6 175 141
2485 141 48 0 -164 107 -210 -120 -144 -171 -291 80 96 -179 -108 112 205 -55 113 281 112 89 415 125 -54
2508 -54 36 131 -303 -192 -119 -280 -161 -172 -180 -221 -4 -1 33 -46 217 163 168 114 388 203 10 260 149 -153 -151 19
2534A9l37J44K9j08j69K92J98k27J37K56k18J19%R2p1Pmj52j2J53l2m41J54L55
2558A84m96O6J63J7j18N2K22j37l4L92Kk61K21P3k85L1J31k36j67K12j39j01J01
2581a07K02j54k77L70O9j73q4K49j19j79M18R6j90pK47l68j83K74j90l03M18r7
2603h8m5j25K96j48j70K78K65l58OJ36K58k83K78J42m54Q9K26n6m80L56n9k46
2625a82m6L52j99k75L81N7n7j37R4N6k9K10J34l08nK06M1l06J66k9l65J34K82
2648A75k38k73L24n5j91J81L13l42m3M35j29l26L00J98m11J5L60j38k06J24L6
2669A09k22k07L59m10K3M08n2j25P3J91l5j05J82K02l28j87L63k26M4K4j24m3
2691h6j44K22k48pJ89J15j32j39M23j90j23M70j97j46J54p0j19R3P3j23p7L5q8
$$ plain form
2534 19 -318 -174 -145 -253 -422 -130 68 -159 -22 234 16 135 135 227 156 163 159 7 -5 148 116 -325 -171 184
2558 184 -312 -246 -83 -66 -184 -132 90 -47 -81 311 313 52 273 346 61 92 223 -13 -180 32 -107 -208 -107
2581 -107 95 -59 -336 34 103 -70 -154 95 -24 -203 215 311 121 114 361 -7 -190 84 -106 -409 9 -88
2603 -88 -133 -258 38 -110 -280 -2 263 -95 -89 47 305 22 300 442 -12 77 303 247 -233 123 64 -182
2625 -182 -228 124 -75 -350 31 88 31 -106 -12 44 15 225 359 51 46 252 293 -13 153 124 -241 -107 175
2648 175 -63 -336 -12 -67 -258 -77 236 -106 -149 286 157 -169 131 329 -82 -67 293 155 -51 73 109
2669 109 -113 -320 39 -371 -348 60 8 -117 -44 147 112 7 189 391 63 -124 239 13 57 81 -43 -86
2691 -86 -230 -8 -256 -263 -74 41 -91 -230 193 3 -120 350 153 7 161 91 -28 65 138 15 -62 -27 -115
2714a15k34J67J02rj96j6L07j85R1K34j03p0R2K07l98J83K74k02m3Pj37l3m1K63
2738A45l83O4j3N1j0K25J44k24p1J41J54k41J65K8j03J9J29j22j87nJ74m47J10
2761b57J37j66m1P0K72o1j49L36J19k05M02k54j38J2l7Ko3j40K44j4k29m0M1j58
2785c17K42o2M7j3J99k16J63J57p3N3Q3j23O7k71J91j47q6K27k05o3M2R9j83%
2809a89M6J65k36J06K23lj24O6K16j68N9k65L09k81L15k66K45k53j01j3OP1n5
2832a27j29K70L5rO9J0R7n5J45j40j60j4J28k19k0J36k21J35rQ1n8j1Q3j60J10
2857c3O7NJJ34O9j38o2J36r5K5p1P8l04L7N8j78M7J12oJ04JLK2J43n1j18J87J52
2885C25j92J69k05R8l00J2l7J70j44J13r9L0J5k9j02J71P7nJ01j78L0J45Q8j52
$$ plain form
2714 -115 -349 -182 -80 -89 -285 -301 6 -179 -88 146 43 -27 65 272 -126 57 331 129 86 93 -44 -77 -118 145
2738 145 -238 -174 -187 -136 -146 79 223 -1 -72 69 223 -18 147 175 72 91 220 98 -89 -94 80 -367 -257
2761 -257 -120 -286 -327 -257 15 -46 -195 141 260 55 457 203 65 77 40 42 -21 -161 83 69 -160 -200 -159 -317
2785 -317 -75 -137 -90 -103 96 -120 43 200 127 180 263 140 207 -64 127 -20 -106 121 -84 -147 -105 -6 -189 -189
2809 -189 -143 22 -214 -108 115 112 -12 54 270 102 161 -104 205 -76 239 -27 218 -35 -136 -149 -143 -72 -127
2832 -127 -256 14 49 40 109 119 216 161 306 166 6 -8 120 -99 -119 17 -204 -69 -78 3 -55 -66 17 -143 -33
2857 -33 34 39 40 174 243 105 43 179 84 109 38 116 -188 -151 -93 -271 -224 -112 -118 -14 -13 -10 12 155 104 -14 173 325
2885 325 133 302 97 195 -105 -93 -130 40 -104 9 -90 -60 -45 -74 -176 -5 72 67 168 -10 20 165 253 101
2909A01J75l23R6k04J57J8j66J4k8J28j23l6Q7J47K5k2k0m4l7K66r2K2j30M4K4
2934G9M8k63R9j17L5l8K02k23J86j39J61R0K1j34J81l10J41J99L5q6j95K11j47
2957C6j11Q5j48L8j01r2J93LO7N5k26K52m9o6P0O9M7M1j81L04j72j26J54M8k27
2982c7m3J0j18Q0j41J42K9mN1Q0k2J91j20j8K9J48l1k30O5J23k61mN8j32P0J34
3008D9q7p2j27K45qj4m9K37j63J56J00k95L7J47j62m9J76n1j10K9r8K5k69J87
3032a66K15j18l4kJ69j71K57k71J4J46L04k32o7J28M6m31J23J62k23J44o8M3j60
3055a92J05Q8Jj94M03j22j15K70Q1j34k61L64k98K6k9o0k06J76Q5j71j00L04p0
3078d9l02K46J97j32k7L39l05q8K82J30n10L13J64k77k79K16q6j85J32J22q8J0
$$ plain form
2909 101 276 -47 49 -155 2 20 -146 -132 -160 -32 -155 -191 -104 43 68 46 26 -18 -55 211 119 141 11 55 79
2934 79 127 -136 -37 -154 -119 -157 45 -178 8 -131 30 120 141 7 188 -122 19 218 253 167 -28 183 36
2957 36 -75 10 -138 -100 -201 -293 -100 -97 -30 25 -201 51 2 -64 6 75 122 163 -18 286 114 -12 142 190 -37
2982 -37 -80 -70 -188 -108 -249 -107 -78 -82 -31 49 27 218 98 80 109 257 226 -4 61 184 -77 -81 -23 -155 -85 49
3008 49 -38 -110 -237 8 0 -14 -63 174 11 167 267 -28 9 156 -6 -55 121 70 -40 -11 -109 -84 -353 -166
3032 -166 49 -69 -103 -105 64 -107 150 -121 -107 39 343 111 44 172 218 -213 -90 72 -151 -7 -75 -32 -192
3055 -192 -87 1 2 -192 211 89 -26 244 325 191 -70 294 -4 22 -7 -67 -273 -97 -12 -183 -283 21 -49
3078 -49 -351 -105 92 -40 -67 272 -33 -121 161 291 -219 94 258 -19 -298 -82 -168 -353 -221 -99 -187 -177
3100a77J70J39k17L4J57p3J12K14l08n6J64l9r2j21J88j98M3M0J01j85j37J87
3122e4L0l05K65J63k42J82K02j73j26J68P6o3p5K43k81J22p9R1k76J7J33j79j2
3145a73j1J65p2l7L79Jk56K04O7l08J86K49n29J49RM6nk70J41j69N9J03R4l5p4
3170h7K44j07p3R3j49J79o0J53j06j11K08n5l13J27R8k49J59j00P2k33K25R7k27
3193b15J77K11o0j5j28K56m83L50L6j72q2R1K4j56J04MJ07l18L6K20j48J24J02
3216F5O0o9L00q3j75qpk0j10K89j82j68n5K8pk2R4j47j30L32J45j32J50q8Q4j00
3242D4J6J6o5Q8J53k00Ll9J16k78J02Q1ol91M90j54j55L29N8k12j5J68R1k07j8
3267A5P5J04l37J84r8J6r2L3j83J79l7J58k96K55n2q2R3K6J16O2Ro0N2j89O9r2
$$ plain form
3100 -177 -7 132 -85 -51 106 33 145 359 51 -5 159 120 28 -93 95 -103 -60 -20 81 -104 -241 -54
3122 -54 -24 -329 -64 99 -143 39 241 68 -58 110 186 123 48 291 10 132 53 144 -132 -115 18 -161 -173
3145 -173 -184 -19 -91 -128 251 252 -4 200 267 -41 145 394 -135 14 23 69 64 -206 -65 -234 -175 -72 22 -13 -87
3170 -87 157 50 -23 70 -79 100 40 193 87 -24 184 129 -184 -57 41 -208 -49 -149 -77 -310 -85 12 -215
3193 -215 -38 173 113 98 -30 226 -257 93 129 -43 -125 -34 -10 -166 -62 -58 49 -269 -233 -13 -161 -37 65
3216 65 125 56 356 273 98 90 83 63 -47 242 60 -108 -163 -135 -142 -164 -70 -217 -347 -15 130 -2 148 60 144 44
3242 44 60 76 11 99 252 52 55 16 132 -146 -44 37 31 -360 130 -24 -179 150 208 -4 -19 149 240 33 15
3267 15 90 194 -143 41 -57 -41 -133 -100 -283 -104 -141 17 -279 -24 -76 -158 -65 -39 77 139 148 88 140 -49 20 -72
3293g2K31q3j21k7j3r0Oj25J67J62r0K8R4j43K17r7K18k52J62n6j8M6n3k5m3k66
3319b43J23k0j40J60m5J8J02Qo2J42R6m8k8L3R3k60q3K02k10K21r8J37j81r1N6
3344a18j2M7m0K23l33J45K87k52l3J80r4L2k6L2O7j90J04j02j26L7Q9k11M3P9
3368a72j21J18Q8J84k20J52R7J07rp3j40R9QQ9j37n2J5p5m7K00j36j32K74j73
3392e6M1K2lR4l0J01qj03P9m5j5r0J34p2q4J66k09m6m8J29O5j7L6j09J10r2Q3
3419C3nM0K2KJ20k01J06j16K8L1pk02k6J67j83J07l8K19%r3Jj59L21j12l4o2j0
3446e1J41j36K52l36J55j48K50r8j39K00j94j85J58p5J28J74j99J63N3j54j5K39
3468A83j11k10J99J12j22m6k0p0J0M9J11k16M1L3j35K66R8j75j13J54j01M6k8
$$ plain form
3293 -72 159 76 -45 -72 -85 -175 -169 -294 -127 35 -55 -27 67 -76 141 44 262 10 172 116 98 144 91 66 23 -243
3319 -243 -120 -140 -280 -120 -165 -147 -45 -37 -99 43 139 91 63 96 189 -71 -154 48 -162 59 -39 98 -83 -174 -118
3344 -118 -130 -83 -123 100 -233 -88 199 -53 -86 94 0 32 6 38 105 -85 19 -83 -209 -172 -83 -294 -251 -172
3368 -172 -293 -175 -87 97 -123 29 126 233 224 151 11 110 118 207 70 18 33 -42 -89 111 -25 -157 117 -56
3392 -56 -15 7 4 98 68 169 161 58 137 92 77 -13 121 49 -35 131 -78 -124 -172 -43 22 5 41 -68 42 -50 33
3419 33 28 68 90 92 212 11 117 1 29 60 53 -149 -175 -8 -191 -84 -122 97 97 4 5 -154 167 55 21 -41 -51
3446 -51 90 -46 206 -130 25 -123 127 29 -110 90 -104 -289 -131 -206 -78 96 -103 60 113 -41 -56 183
3468 183 72 -138 61 173 51 5 -15 -85 -75 -26 85 -131 -90 -57 -192 74 172 -3 -116 38 -63 -17 -45
3491d5Q1J19k22jR4j21J12j21JJ7j09O0j3J84J4j03J51j16o8J84j05J62j18L4
3515G1P6K6j55k1k7p4rOR8q7N7j10J89m8j7J7Q5r4P2N8R8j54j70J88J3j37J99
3542A50k28j07J53L2j0q4N5K5P4l9L1j92M5K80l53J54J94k04j66J96K1j26J41
3565D2j64J17n3m1p1j4K7K57j37J07k4kJ6pJ55n2o6j4q5j28K7L8J63J7N2j19l05
3592b64K95L4j62K50j24Q2j55J75j63R4K3j6o4J35k1j21j10K71j05j12pj1K23
3615A47m29L24n5L1k6j8Jr1J48j06J34j64K87j84O9n2l6p5p7L94k32o8j68K31
3639a5j1r0K05o0j6J68l2j81J03O1j86q8J89k4j10L5m5K8PR9j45p2P0J10J38j47
3665iJ14j8j11Q3J1o3J53L4k53kK00j12m1n7ok1N3M0J88l11p8K72j25O0J93J44
$$ plain form
3491 -45 36 155 -67 -68 26 -95 17 -104 -103 -86 -195 -135 -148 36 50 -53 98 -18 -86 98 -7 155 37 71
3515 71 147 173 18 -3 -30 -104 -113 -107 -9 -96 -39 -149 40 -8 -25 -8 77 -17 55 113 211 57 -113 75 88 -49 150
3542 150 -78 -185 -32 0 -10 -94 -39 -14 60 21 52 -140 -95 185 -168 -14 180 -24 -190 6 27 -99 42
3565 42 -122 -5 -58 -99 -170 -184 -157 100 -37 70 46 44 60 53 208 156 90 76 -9 -137 -110 -72 91 108 160 41 -264
3592 -264 31 65 -97 153 29 111 -44 131 -32 62 85 69 5 140 119 -2 -112 159 54 -58 -65 -76 147
3615 147 -282 42 -13 18 -8 -26 -25 -116 32 -74 60 -104 183 -1 68 16 -20 -95 -172 222 -10 -78 -246 -15
3639 -15 -26 -116 89 29 13 181 149 -32 71 132 -54 -142 47 23 -87 -52 -97 -69 -62 37 -108 -180 -110 0 138 -9
3665 -9 105 87 -24 59 70 7 160 194 -59 -61 139 27 -14 -71 -77 -98 -45 -5 183 -128 -206 66 -59 1 194 338
3691C38m45K42o4J03k14J59k05r5J01J36j56j35J26J49j90J75R7j44K00q4n0J11
3713A55M3j1j57N9j06m0J54J0j37M9r5J64j17J40j15L5j05J40r4l9R7K72k93j4
3737ekQ9P0k69P8J88j93r2K23j27q6K00k03j56K76P0j5M1Q1nr1o1J0Ro8J80j44
3764bP9r6j30J70n4k8J31k58L13j66j5mkO4M2m4q2Q4J20l8j73J93o0r7j18J05
3790f6O0p8J55O0q4r2N0J2J11j52K17k44R2j08L27l33K7J26n8j40P8J15j71l4
3814a30Nl7mQ2J58j47J70j11M7j3M7j10J01n9j01K67j03j92J25J37j68m1N5P7
3838E5p3K2K6q2J71j98K60j45L4m8r2M00l54K58k87K0j21L73j54k26N6O4k1kP4
3863A0J77k98M4J11j26K54q3Q6k32J35K2P5k41O9K9R0m6K6p7q0N5l4j05J67J5
$$ plain form
3691 338 -107 135 71 174 -40 119 -86 -181 -80 56 -100 -235 -109 40 -150 25 122 -22 178 94 44 155
3713 155 198 187 30 89 -17 -57 97 107 -30 19 -76 88 -29 111 -4 31 -74 66 -28 -67 30 302 9 -5
3737 -5 -7 82 152 -117 -39 149 -44 -136 87 -40 -126 74 -129 -285 -9 61 46 87 168 163 72 11 21 30 -38 142 -2
3764 -2 77 -19 -149 21 -33 -61 70 -188 125 -41 -56 -60 -62 2 44 0 -82 2 122 84 -89 104 44 -53 -171 -66
3790 -66 -6 -84 71 131 47 -45 5 17 128 -24 193 -51 41 -67 260 -73 -46 80 22 -118 -40 75 -96 -130
3814 -130 -125 -162 -166 -84 74 -73 97 -14 33 20 67 -43 58 -1 -102 165 62 -130 -5 132 -36 -77 -22 55
3838 55 -18 4 30 -52 119 -79 181 36 70 22 -70 330 -24 234 -53 -33 -154 219 65 -161 -105 -41 -62 -64 10
3863 10 187 -111 -67 44 -82 172 89 175 -57 78 100 175 -66 3 32 122 76 102 25 -55 0 -34 -139 28 43
3888D3k39K79j19o0J61J60j74m2k0lJ7N2M5k32J46j67K51n1j81K6P8K1j63J47
3912b5J53j18l3K06k36J41J75j88n7j29l1j6J97j35J69j92L3J8M3j1J28j04L0
3935A8L2J24j14J16j67J1JJ5k8Q3J4j70J27J50j85r0kJ11j28K13j64N3M5j40J80
3960A05j7j04j58L39o7r6Q7k18J08M6KN7j04M8M5Qj27l5j28K62N1J88m27J20J65
3985A50j12j84Q4q3K62j56m6K2rLp2Q1rR9J41J0j05J9j67p8K48Lq6j6k55K90J3
4012D7O8j77m1J69k7j0o9l4K94l24L9J08j96K81o4m9N0jl3j01J06j18MP0l1j8
4038e7j60K78n2q9oJ23j08N0Q8j0k22K50r1j4K8Q5q1M8j6K14k82o4K0K5J40j64
4064f7j07O9Q4P8JR3p5j24L6K7J77n6k18J39P9j48N9J5J2k38K3P0J08k1J14k42
$$ plain form
3888 43 -196 83 -36 -96 65 225 51 9 -11 -14 3 55 100 -132 14 -153 98 47 -134 -108 -30 -9 -172 -25
3912 -25 128 10 -23 183 -53 88 263 75 18 -111 -142 -158 39 -96 73 -119 -86 -68 -25 -36 92 -12 18
3935 18 50 174 60 176 9 20 21 36 8 91 105 -65 62 212 27 -63 -65 46 -82 131 -33 20 65 -75 105
3960 105 88 -16 -174 165 98 2 89 -129 -21 25 27 84 -20 28 73 81 -46 -81 -209 53 104 292 -135 -15 150
3985 150 38 -146 -62 -145 117 -39 -85 -63 -72 -69 -141 -60 -69 30 171 181 76 95 -72 -150 98 101 15 -1 -256 34 47
4012 47 115 -62 -103 66 39 29 -40 -74 220 -104 -65 43 -153 128 64 15 65 64 31 -70 36 -82 -78 -8 -39 -57
4038 -57 -217 61 9 -80 -86 37 -71 -21 67 57 -165 85 -6 -20 8 93 12 60 44 258 -24 -88 -68 -43 97 -67
4064 -67 -174 -105 -21 57 58 151 76 -48 -12 15 192 136 -82 57 136 -12 47 62 74 -164 -141 -71 37 16 130 -112
4090a12pK99k48J10L4P5k27J92r6L6j03k9P2P6q4O8Q6k02R0k6m9J47l7j96O7K28
4116A64j1j09p1K08l36J70rp9m6J73l5n9J04p1Loo7N5J30j13m8J48p6QM3n9J56
4143A67k04J33m7j05l7N1r4N8J42J6j46J28o7o1J27L2j94J92j14r1J1K14n9j18
4167f6J54l2k4o8N0p8K54j68k8k3j5KN7J55j96J32j39J04R7j60J0k5m8j95J55
4192i5J70j77pj05K15m9J44j73K3K12j02O6k84L16k38J14j12j28J25j81J95Q1
4214A0K7j67J58j28M9K31l02m3j7K44K1k07L38j52n2j5KQ9j22J60j90O0O8J3j37
4239f2k2K57j57j7K%MR1m0j9O6j22L7O9n4J05k72J26J38j87l5N6oK1n4mJ15P6
4267A12m9n2j5P9j52K41m9j04MJ04p6J13j59L4P2p2pJ35o7n6r6j1J08j24J33N2
$$ plain form
4090 -112 -119 180 -68 42 76 151 -76 116 20 56 -47 -76 -4 72 -12 56 142 -60 30 4 -45 102 65 -131 -64 164
4116 164 153 44 -27 181 -155 15 6 -73 -119 54 19 -40 64 -7 -4 -10 -77 -22 108 -5 -53 95 19 27 70 11 167
4143 167 -37 96 49 -56 -93 -42 -136 -78 64 80 -66 62 -5 -66 61 93 -101 91 -23 -114 -103 111 52 -66
4167 -66 88 56 32 -36 14 -64 190 22 -6 -29 -44 -42 15 170 -26 106 -33 71 168 8 18 -7 -55 -250 -95
4192 -95 75 -102 -109 -214 1 -48 96 -77 -54 158 56 122 -162 154 -84 30 -82 -210 -85 -266 -71 10
4214 10 37 -130 28 -100 -51 180 -122 -165 -182 62 83 -124 214 62 10 -5 -3 86 -36 124 -66 -6 62 75 -62
4239 -62 -84 173 16 -1 1 1 5 96 56 37 103 -19 18 87 33 138 -134 -8 130 -57 -92 -36 -42 -21 -75 -79 36 112
4267 112 63 11 -4 75 -77 164 115 11 15 119 43 156 -3 31 103 31 24 159 92 36 -60 -71 37 -87 46 98
4293I8j60J37j27J87l0r1l2M6j71J17P1O3k40m6K01Q8n0lj70J82J01o8k8p2K51
4318B54k93J00j14j0J40q3K02k37q6P2J11r3O6q5m3J86m7m6Pk8J08j04PN4O4l4
4344F8l2l0p0P3j3L0p2l5n8K00J22q1k70K04m7J04j38j40K90m6P7r1o8J48Pj99
4370f7J69J5j06j18J08m0J05m7o5J5K5K1q3J20l5J48k3j54J12m3p0L2j11j0m3
4395a45J53j20J67j45Q4j13K25k42j8K50j38m3K03j12l0jR9O2k02J06j08K6J29
4418H7j65n0K6RQ3q8J49j05J86q2j12R9J54k42Q8j8r4P8o1L5k04K83j86J88j73
4443a15K33j63O4j1K6p7J10j05j07L9Q2J45J4j17j5L7j3Q5k21R7J98q4nj26J5
4468a4JJJ15o1K53l03K3J13q8R7j49R0K8k09K35k04o7J29j42J16J66j05J45l26
$$ plain form
4293 98 -62 75 -52 135 105 14 -18 28 -143 -26 45 108 -132 -178 23 111 61 58 -112 70 171 103 75 3 254
4318 254 -39 61 -53 -63 77 -6 196 -41 -127 -55 56 -37 29 -56 -99 87 40 -6 1 -27 81 -23 -16 38 102 68
4344 68 36 6 -64 9 -4 26 -46 -81 -139 61 183 102 -168 36 -11 93 -45 -185 105 59 136 45 -23 125 132 -67
4370 -67 102 117 11 -107 1 -39 66 19 -46 -31 -6 15 -68 52 17 165 142 -12 100 57 -13 19 -92 -102 -145
4395 -145 8 -112 55 -90 -6 -119 106 -136 -154 96 -42 -85 118 6 -24 -25 74 136 -66 40 -68 -42 87
4418 87 -78 -128 -102 -93 -10 -98 51 -54 132 50 -62 37 191 -51 37 19 -75 3 -58 -23 -227 56 -130 58 -115
4443 -115 118 -45 19 8 34 -43 67 -38 -145 -106 -24 121 135 18 3 40 27 112 -109 -12 186 102 97 -29 -14
4468 -14 -13 -12 103 42 295 -8 15 128 40 137 -12 78 106 -103 132 -72 -139 -10 -152 -36 130 25 170 -156
4492a56J83L0j28K86l11qJ23kJ38j29O9j34n4J29N6p2l4j16J25q4Q5K4J06j06
4516B0j04J8M8j2kj8J79j77j35J93P9q5M8r8J45r9Q1L9q4k19M7J26P7k55K12N
4542B9M1j40J39j39N6m4J48k0j55m9N2L73k75J22m00J74K1l2J42nj12K55k47J46
4566H0q4r2J29N1k11P2j04kP1J6J31j16K16o1j86l1J32K9r0R8L0q6K4k2n6M0o
4593b8J03N9j46q2J33n9q8J38j28O5P7j34J11L6k2j02K05Q7j58j07L2P4n2n5O
4618c5k05L12k55J58L3r1q9J86n2J29j14j14J55N6o3ro9K38k10P2p1J15k50N6
4642a17K84j38p1O5j61K26lr8j5R5j02m7K32j85J19j44Q7q5L8n9J66k66J73L0
4666B4P4j51J21j10o0J27j28M7nJ33j06O4l5K4j29QO3R7K3k9Qo2n2P1q3lL8K08
$$ plain form
4492 -156 27 57 -71 215 -96 -104 19 17 155 26 95 -39 -93 36 92 20 -14 -130 -5 -89 -4 20 126 20
4516 20 -84 -66 -18 -30 -32 -50 129 -48 -183 10 89 4 52 -46 99 0 81 120 36 -183 -136 -10 67 -188 24 29
4542 29 70 -70 69 -70 -14 -58 90 70 -85 -134 -82 291 16 138 -262 -88 -67 -99 43 38 -74 181 -66 80
4566 80 -4 -96 33 84 -127 -55 -159 -161 -90 -74 57 -59 157 96 -90 -121 11 40 -50 48 78 -8 16 -6 -62 -22 -28
4593 -28 75 134 -12 -94 39 -20 -108 30 -98 -33 44 -90 21 57 35 -67 138 225 67 -40 -8 66 14 -41 -35
4618 -35 -240 72 -183 -25 8 -83 -172 14 -38 91 -23 -137 18 74 11 2 -67 171 -39 33 -38 77 -173 -117
4642 -117 167 29 -42 23 -138 88 85 -13 -28 67 -35 -82 150 -35 84 -60 27 -58 -20 -79 87 -179 -6 24
4666 24 98 -53 68 -42 -102 25 -103 -56 -61 72 -34 30 -5 19 -110 -102 -39 58 81 52 60 -2 -54 17 -66 -69 -31 177
4694A77j16J35j20l2L3j47J99j59P4nr8J35j78N8L5j37K05j17J3m2J36r7K4R7
4718G3o3J15j67J52k72K93j45J44k26L8J41k55J52J01k79K34q2K7k8L2j33J34
4740a4r2J24k48L20r1J76j82J22j60J13R2o3N7j64o1J09m7L5r1N7Q6k19K18rL9
4765A07M1j90O1R4q3r6k5P5J45k95L88j99J09r2K9j02L1j37J15j07J27k8m5J52
4789G5p6Pq9L20k87j0kk49L52J22k99J78p5j4L5J03j14m8J76k75J53K01k78Q9
4813ej4J0J5k13M90r4j71l24L28m4R1N9j74J20O6j35n2J17M4p0l6k0j95K25k5
4838gJ94k3k25K34k34J14m6m5R0K6Pj12L9j88K33M8j18R1j01R4k20K73P4o7j65
4863c4N6j07J40M6j97J3J34n5o6M4k9L4K7J06j48j9J36N9k19n6K07l17J50J58
$$ plain form
4694 177 61 196 76 44 77 -70 129 -30 44 39 -59 76 -102 -44 -9 -146 59 -58 -45 -87 49 -48 -24 73
4718 73 10 125 -42 110 -162 131 -14 130 -96 -58 83 -172 -20 81 -198 36 -46 -19 -47 -15 -148 -14
4740 -14 -106 18 -230 90 -1 175 -7 115 -45 68 160 97 154 -10 -71 38 -9 26 -65 -8 78 -141 77 68 107
4765 107 148 -42 19 113 30 -66 -91 -16 129 -166 222 23 132 40 69 -33 -2 -139 -24 -131 -4 -32 -77 75
4789 75 -1 6 -83 237 -50 -60 -62 -311 41 163 -136 42 -33 -47 -12 91 -23 -71 105 -170 -17 184 -94 -5
4813 -5 -19 -9 6 -207 283 189 18 -306 22 -22 69 128 -46 74 140 5 -47 70 114 44 8 -12 -207 18 -7
4838 -7 187 164 -61 173 -61 53 7 -38 52 78 85 -27 12 -176 57 105 -13 78 -23 71 -149 124 198 131 -34
4863 -34 22 -85 55 101 -96 -83 51 -4 -70 -26 -55 -21 6 112 -36 -55 81 140 -79 -135 72 -245 -95 63
4887F3o6q4J16r1Jk6rJ06l0JO3K2R1j94K14k14M0k5oN0M1q1o0QJ6J29n3R8j59
4916c9kj48L33j03k9J57l01J56Q8j89K00j51Q2m9pR7M5r8j07Q3o3M2J56k83Q4
4941d6Q6j39J1J70k58L49k09J1Q1nN5j08M4r2J10M4j3j56Km6L1J32j2p7P4m3N
4968AL2o1j34J33q5J09o7J1K1J19j47J01q2j86J80L9N4j04O0j02l8J49J62j38
4992B7P2r3K07k31P3j12k2J38j7kk6L0j43Q3N0r4J24j5j4j0j63J22m1J45K5j05
5018Hj64O1R8ok7M1m0J09k02m2o8K49M9j32N0J21k45J15K56k80J27p9N5o7l5J47
5044I9j82R9j6p5j90L99k10J30r2l4J43l9r5J10j85J65p4K55j58J9k9j13J21O3
5068A11l53K1K02l1J42p3P0l9k13J51K14l84M21l01P9k61M30j81rN3n3No8N7J21
$$ plain form
4887 63 -3 -87 29 -62 -61 -87 -96 10 -20 -19 44 66 157 -37 177 -37 3 -22 -28 22 63 -18 -78 -70 -54 75 22 120 -39
4916 -39 -41 -189 144 41 12 169 -132 24 112 -77 123 -28 54 5 -2 95 140 42 -65 18 -45 -3 153 -130 -46
4941 -46 40 -99 -88 82 -176 173 -36 -25 56 51 106 -2 42 -50 60 104 91 -65 -63 -109 -78 54 42 -35 39 -4 1
4968 1 33 -28 -162 -29 -114 -5 -72 -61 -40 79 -68 33 -49 -235 -55 -16 38 -66 -6 -108 -146 3 165 27
4992 27 99 6 213 -18 55 -57 -79 59 42 40 14 44 -99 -16 34 -60 64 49 35 25 -138 -16 -57 88 113 8
5018 8 -156 -95 3 -3 -30 11 -29 80 -122 -164 -232 17 66 -66 -16 105 -140 -25 231 -49 78 -1 54 -13 -48 99
5044 99 -83 16 0 -75 -265 134 -76 54 -38 -72 71 32 -63 47 -138 27 -47 208 50 69 40 -73 48 111
5068 111 -242 -221 -19 -50 92 19 89 50 -163 -12 202 -182 239 -62 17 -244 186 5 -4 49 -4 1 -67 -10 111
5093A11j05p6M0l8J09n2j90J47J49n7K7k6j63Q2j3rN2m2J28kr1O8p8o8N3j54L69
5120A71j95N0J96j59R5l70L61l40J79M3q3q1J04P0mN0k65J93j02l5J41p4J21k29
5144a63K70j10J60nk48J56N6n1p5K9K16j78q3m5K47k75J87k70Q0l3L26j88m3Q3
5168D3n8K9q1J29Oj15J28j00j22J77k0j37O3J34k25M3K23j61M9rM3M9j33P5j73
5193a43J97km3J20j91J2J53m5q1j09Q2l4L2L1J37j43J80q8L4j78O3j16M6J72n9
5218B7j94K88j13j70J57k05K71M3j47m0j9O8O2j48%K77k63J54j06m8J17J77k32
5241d4J53k93J55N6k4j58J12p2J67p0P8M0k14J83j08l1m2J04L9r7J28j86J34q9
5265g9K46j66M9J16k15n3J15N8j05o6J86j98p7K74o5j24R7J34n9j53J03j08Q9
$$ plain form
5093 111 6 -70 -30 -68 41 -11 -201 -54 95 38 65 39 -124 -42 -55 -64 -12 -54 74 72 -19 49 -29 -97 -44 -198 171
5120 171 -24 26 222 63 158 -212 149 -191 -12 31 -52 -133 -29 41 37 87 -178 15 -87 -122 19 -55 66 -163
5144 -163 107 -3 157 152 -96 60 116 65 -10 19 235 57 -26 -71 176 -99 88 -182 -102 -135 191 3 -40 43
5168 43 -15 14 -67 62 68 -47 81 -19 -141 36 16 -121 -58 76 -149 -106 117 -44 5 -4 39 88 -45 30 -143
5193 -143 54 52 9 129 -62 -50 103 58 -23 -132 -50 -84 -52 -21 116 -27 153 65 99 -79 -16 -132 -86 86 27
5218 27 -167 121 8 -162 -5 -210 61 104 -43 -83 -102 -34 28 -120 -120 157 -106 48 -58 -106 11 188 -44
5241 -44 109 -184 -29 27 3 -155 -43 -115 52 -18 60 100 -114 69 -39 -70 -112 -8 31 -66 62 -124 10 -79
5265 -79 167 1 50 166 -49 -102 13 71 -34 -100 86 -112 -189 85 20 -104 -7 127 68 -85 18 -90 -1
5288aN4n5M1N6o8J40k93K46o8q3M0J7l1J07j55J60j01j27J93j00n0P1J48N7k05
5313go7J60j93O8J19l6n2K77k69p3N6j47J16L7p1k0J73j16J06j13P2kj3j70L1
5338a34K18j27j0j48L00K9l9r5j40J39j02L42l91l8J97J46l49O1J16LP5j57Q3
5361b1k7Q1k1k3p0m5K31r6Q9j73J17J08j21l9m5J2p4K18k82L35j4o0j43P0j28
5386a21M8J5k1J33p1J90k16O1Q4j22k41J74J1k3K66k43N3k2O2J26k43r2K41q8
5410c9J52K7j55J4J9K00k38m3M8K6M3R8m0j16Q3j19N4q1J8j1J39j96J62N3J2L5
5436A45k10M2OJ23k30J01J11j22L2j07K20k20j7J10M9P4j66R3K5l8P4J00k35n2
5460i2K22j57J5p4J35kJ00o8Qj86J68j13J4k2l5l3r4K60k0Q7p2JJ34j71N4j02
$$ plain form
5288 -1 53 -2 39 95 27 167 -126 120 52 -31 9 26 -5 102 -53 107 6 -121 72 -28 -78 -7 141 198 -7
5313 -7 -74 86 -107 -39 80 44 -8 269 0 -73 -17 -164 -48 -11 -82 -102 71 -45 61 -52 20 18 5 -165 -134
5338 -134 84 -43 -53 -201 99 128 89 -6 -146 -7 -109 233 -158 -196 1 147 -202 -141 -25 -22 53 -104 -21
5361 -21 -48 33 12 -11 -81 -126 105 9 98 -75 42 150 29 -10 -55 -43 -117 101 -181 154 140 80 -63 7 -121
5386 -121 -73 -58 -79 54 -17 173 -43 18 102 -20 -261 -87 -76 -99 167 -76 -23 -45 17 143 -100 -192 49 -39
5410 -39 113 140 -15 -1 18 218 -20 -63 -15 11 54 152 112 -4 79 -40 14 -67 -49 -60 79 -117 45 98 110 145
5436 145 -65 -23 -17 106 -124 -23 88 -34 -2 -109 111 -109 -126 -16 33 107 -59 34 59 21 95 195 -40 -92
5460 -92 130 -27 -12 -86 49 47 147 79 87 -99 69 -44 -30 -52 -87 -120 -214 46 26 113 41 42 176 5 59 -43
5486d3J06j37J19j16J41q6M9p1j09N7O5J46j11Qk3P2M7l4j40P9L3j15N6J8J30
5511A41j49j11K05k32K12n8lj15J89K1l20J39K3J59k73m6J47K1n4J48q0J22qj4
5535F4j09m1J77k16J52j45K36n6j61J41M7K3j07M2jqj3K71j84l5L1j6K6j35K5
5560HJ16k02m3L72k08q8p9J86Q6r2J1j02N0K3j11J17J6j67J95q4O0j41O0J40N
5585A28r3M9j56J69j19M6o3J79j46m1JM6L1M8L5k03J75q1j69M4J07q6j2K09N8
5610A56m11K97p4K4N5r0k0O7m9J14k4p5L5K7q5J45n5j71J04J27k43J54k7J41n4
5635F8j67J88o0l2o5K56k36N9Q0J34j28r8L2j95L00j55o1N1l7j24J76Q0q1ll7
5660e5O0n4M9QO8q4Pj9J34j29N3O0j41J0R8R6j48j94O3M4J15m4mL5r5R1n9J65
$$ plain form
5486 -43 63 -74 45 -71 70 -16 33 -38 -147 -90 -25 121 10 18 -5 67 114 80 -60 19 52 -63 -7 11 141
5511 141 -8 -119 86 -146 66 8 5 -110 79 100 -220 -81 -58 101 -172 -218 -71 -50 -104 44 -36 86 78 64
5535 64 -45 -86 91 -125 27 -118 118 62 -99 42 89 112 5 47 46 38 25 296 112 77 108 92 118 -17 8
5560 8 124 -78 -121 251 43 -45 -124 62 148 56 67 -35 15 38 -73 44 60 -107 88 4 64 -77 -17 123 128
5585 128 35 84 -72 97 -22 24 -39 140 -6 -47 -46 0 31 79 114 -89 86 5 -164 -120 -13 -99 -111 98 156
5610 156 -255 42 -32 -8 47 -43 -63 4 -45 69 45 -30 5 32 -53 92 37 -134 -30 97 -146 8 -19 122 68
5635 68 -99 89 29 -3 -68 188 -48 11 91 225 97 -1 31 -164 136 -19 -80 -29 -66 -190 -14 66 -15 -18 -55
5660 -55 5 -49 0 8 76 -8 -1 -20 114 -15 38 98 -43 -33 65 161 13 -181 -118 -74 41 -3 -7 28 -67 24 -35 130
5688A30j11j7n7J46j43J13p2O3j03q3J52r6p8J02n7J69q8J67P9j42p1N1Rj93P9
5713e1N7j02J12n6k17K32r3j00J33J38j32P5K28j81Q3l02K13j32n8L17n6j22q2
5736i6K11j09L1j23j00%J36M1j5J3j8O2NQ3Mj43Q6k12K46o0k42L11j61J33M6R5
5762B24l50K8J2m9K12j57k4K4N9J32or6j63J25Q4p0o5K5q7J69j38M1q9N8Q8MJ09
5789A00p4o4P5j92J58o5J72o3j0J26j96l2O9P5Jk63O9J31n0q8K87k13N4rk4Q9
5815F3m8o7K59q6o8J62j25j26J08j15L9K7o8J54j67J05m8o8J99j57L6r4J38m4
5839Ij04P3M3M4J51j53n9J5J5K2L8q6Q2k10P3L5J81k15j90K31M6R8R3l0j82j12
5865i2J36%P8j68J19k3Q7k37M9j5LJ25M2qk67J66J28J4j99O9Q8j37O8p8M2j24
$$ plain form
5688 130 19 2 -55 91 -52 61 -11 52 -51 -134 18 -78 -156 -54 -111 58 -30 137 216 74 3 54 63 -130 -51
5713 -51 6 -96 16 -40 -257 -25 -118 -218 -85 53 -79 -4 224 43 126 -176 37 -95 -153 164 108 -14 -96
5736 -96 115 6 37 -86 -186 -186 -50 -9 -24 -11 -29 33 38 121 125 -18 68 -144 102 42 -200 111 -50 83 129 224
5762 224 -126 -98 -86 -135 77 -80 -104 -80 -21 111 105 9 -154 -29 55 -15 -80 -55 -142 27 -111 -70 -159 -101 -13 -9 100
5789 100 26 -38 37 -155 3 -62 110 47 37 163 -33 -65 4 79 80 -183 -114 17 -33 -121 166 -47 7 -2 -26 63
5815 63 15 -52 207 121 53 215 90 -36 72 -43 -4 23 -45 109 -58 47 -1 -69 130 -27 9 -85 53 9
5839 9 -95 -22 21 65 216 63 4 19 34 56 94 8 90 -120 -47 -12 169 -46 -236 -5 41 139 232 202 20 -92
5865 -92 44 44 122 -46 73 50 137 -100 -51 -66 -63 62 104 96 -171 -5 123 137 -62 7 95 -42 26 -52 -10 -134
5891a34N3Q0rj09J97J4kJ02j73k54L21j35J18K6q4J79K1j38Mm7j08L8O5J21j79
5916c3o3J05o6J2o5P1j2N2j02J42O7j16K0N2j86K17Mj73J27j83r9P9M2M4j70K08
5942b6N2N7oj07j37K58l9l1j24n6L21o7p5p9Q0o2q8J24N7k07K82l62K57Ql2m4
5968d6R8j66J28p0p2L04j07p7p0J44j43J48j03L4R0k26M8N6l3J38r6j81K52o4
5992a4q0J23L9N3k18J40n4pm7M7J68j69O3N8O0k99Q9O5j08O9M7p7l4O0M1R4l2
6019G7j14N1o5N2j0K1J26j47K5J9p9J0R4j78q5J72PN7J68j28p1n7J6K7N6j78J33
6046aJ59j48k53K85j37Q7rJ07k30J05l7J57n7K1J1M6N6p7p1n4Q8q5P7j08j5R0
6072GoJM0o4M2j3m3l7l7N5n1R6J6p7P1P3j57r2J88Jp0J06q9j30K15M1j30q9J24
$$ plain form
5891 -134 -81 -1 -10 -119 78 92 90 192 19 -235 86 -49 69 95 11 190 211 73 77 30 -78 -40 25 146 -33
5916 -33 -96 9 -57 -45 -110 -39 -51 1 -101 41 108 -8 12 64 -122 95 99 -74 53 -130 -229 -150 -108 -64 -234 -26
5942 -26 26 83 77 -30 -167 91 52 21 -103 -159 162 95 20 -59 21 -41 -129 -5 52 -155 127 -235 22 30 -2 -46
5968 -46 52 -114 14 -56 -128 176 69 -8 -78 66 -77 71 -32 2 92 -134 -86 -30 -63 75 -21 -202 50 -14
5992 -14 -94 29 68 121 -97 43 -11 -18 -65 -18 150 -19 44 102 162 -137 -48 17 -91 -22 25 -52 -86 -26 15 109 77
6019 77 -37 14 -51 1 -9 12 138 -9 16 35 -44 -34 60 -118 -203 -31 -24 33 201 73 2 -55 -39 -12 44 -134 -1
6046 -1 158 10 -243 42 -95 -8 -17 90 -140 -35 -72 85 28 49 60 106 162 85 14 -40 48 -37 40 -68 -83 7
6072 7 1 2 42 -22 20 7 -36 -73 -110 -55 -106 -10 6 -71 0 73 -84 -176 12 13 -57 49 -40 -170 45 86 -44 -133 -9
6101iJ09k15J68Q7j73J39q0l6j48J79o3j43J62k15K5J83oj7K84m56K90M6r9N5
6125F7j70J76j47J51j7J0q3n2J7%N8o0P4m5j03J35Mq2p0J33Om0q0rJ57j30L07
6152B07k31J41j78MJ01J04k66J33q4l4m0q3J00P3j54K38kN4Pq7L9j69L26j30N5
6177A24j09L8q8J05j16m9m3J14k8R5k8J8j33N3r7N9J45J9jk26L54l09L4K54q5
6202A00j56N2nL9L9k80J49q3J60m1j38O8K48j43l4M0r7%R8J29j57m7N9RMJ05j09
6229Iq4J06j02J17k71L16m6M4p7q3Q9K7j06J14k38J82K8k52J87j21J82j8O5j01
6253c3P1j13J71K9m7k14Q1J23l8q0J30p4R6j75J20M9j17K8K3o2J07P2j2k62L28
6278B01m24O7J14M5j12J79np3J12p8N3O2Qj64N7M5j44K3l6K4L8m5K5k0J64p5n6
$$ plain form
6101 -9 100 -115 53 140 -33 106 26 -10 -158 21 -42 -185 -23 -238 -213 -30 -36 -53 231 -225 65 111 12 67
6125 67 -103 73 -74 77 60 70 -13 -65 -48 -48 10 -50 24 -21 -124 11 15 -67 -137 -4 2 -38 -118 -127 30 -100 207
6152 207 -24 117 -61 -57 44 148 -118 15 -69 -103 -143 -226 -126 -53 -207 31 29 83 90 3 42 -127 199 69 124
6177 124 15 53 -35 70 -46 -95 -138 -24 -52 43 15 33 -100 -47 -144 -85 60 79 78 -148 206 -103 -69 185 100
6202 100 -56 -4 -9 30 69 -211 -62 -145 15 -26 -164 -96 152 9 -25 15 -82 -82 16 145 -12 -59 0 9 13 118 9
6229 9 -75 31 -71 46 -225 91 45 89 12 -71 18 45 -61 53 -185 -3 25 -227 -40 -161 21 3 68 -33
6253 -33 38 -75 96 125 78 -136 -55 68 30 -50 80 6 102 -73 47 96 -21 7 30 -32 75 147 135 -127 201
6278 201 -223 -156 -42 3 -109 70 65 -8 104 26 79 141 149 -15 42 87 -57 -34 -70 -46 -8 -53 -28 -48 116 41 -15
6305a5Q2j54J19K9j98M13j74P4j87j73J53P8R1j00j16k3O7J1J8Np5J90p6J2m2
6330IM0j73J72J25j68O4PN3j54R6n8Ll4K2m4Q5M2q8R1J23k75R5J02j02q2M1J13
6357A05l3M2l0p0l4q3j05J26J30k41J80L0j4J09r9mK7J14j84J83j47L6K5j0o7
6382a4k0j3kn2K77k61N8j3L5J7mj69J03L7J21j68J16ql0r7K87k19k41L52Qk99
6408a99K04k6J07j38NPm6O2k04K55j22J28j67J52PP8j47O4o7J26j8p6j47J45O6
6433D9K1o3J3k4J23m1j03M9l8R2j30J29p9q8lnK22l7j88J18P0q3j23J31l0j4J1
$$ plain form
6305 -15 67 -87 32 61 -137 276 102 176 -11 -184 -31 47 138 38 -78 -101 -34 -23 -5 0 -75 115 39 51 9
6330 9 49 -124 48 173 5 69 76 129 -25 71 13 16 -18 4 -40 45 87 -1 90 213 -62 33 135 33 -49 -8 105
6357 105 72 114 84 14 -20 -103 -208 -82 48 -193 -13 17 3 112 13 9 36 150 -34 149 2 38 63 53 -14
6382 -14 -34 -47 -49 -101 176 -85 -27 -40 -5 12 8 -161 -58 -21 100 -68 48 40 10 -87 200 -19 -260 92 100 -199
6408 -199 5 -21 86 -52 -47 -40 -86 -24 -228 27 -95 33 -134 18 25 103 -44 20 -47 79 61 -15 -162 -17 49
6433 49 70 7 20 -4 119 78 -25 24 -14 78 -52 77 -2 -90 -93 -98 124 87 -101 17 87 4 -119 12 -18 -32 -21
$$ [...]
8191c1
##END NTUPLES=NMR FID
##END=
