##TITLE=1H_Pr Sl-2
 200.13MHz, CDCl3,
 8 sc
 
 5.2.2025
##JCAMPDX= 6.0         $$ Bruker NMR JCAMP-DX V2.0
##DATA TYPE= NMR FID
##DATA CLASS= NTUPLES
##ORIGIN= UXNMR, Bruker Analytische Messtechnik GmbH
##OWNER= pz
$$ XWIN-NMR		Version 3.5
$$ Wed Feb  5 17:05:58 2025 Russian Standard Time (UT+4h)  she@DPX200
##.OBSERVE FREQUENCY= 200.1313
##.OBSERVE NUCLEUS= ^1H
##.DELAY= (6, 6)
##.ACQUISITION MODE= SIMULTANEOUS
##.ACQUISITION SCHEME= undefined
##.AVERAGES= 8
##.DIGITISER RES= 18
##SPECTROMETER/DATA SYSTEM= spect
##.PULSE SEQUENCE= zg30
##.SOLVENT NAME= D2O
##.SHIFT REFERENCE= (INTERNAL, D2O, 0, 14.3821)
##AUDIT TRAIL= $$ (NUMBER, WHEN, WHO, WHERE, WHAT)
$$ ##TITLE= Audit trail, XWIN-NMR		Version 3.5
$$ ##JCAMPDX= 5.01
$$ ##ORIGIN= Bruker BioSpin GmbH
$$ ##OWNER= she
$$ F:/spectra/data/she/nmr/H-C/1/audita.txt
$$ ##AUDIT TRAIL=  $$ (NUMBER, WHEN, WHO, WHERE, WHAT)
(   1,<2025-02-05 17:04:45.51 +0400>,<she>,<DPX200>,
      <created by zg, POWCHK disabled, PULCHK disabled
       configuration hash MD5:
       00 E9 B6 7A A2 85 ED C7 34 08 36 98 17 FE 4E 26
       data hash MD5: 16K
       FE D6 FE DB D4 F2 E3 8C C7 C9 F0 AC 8C E1 41 EF>)
$$ ##END=
$$ 
$$ hash MD5
$$ 22 28 4A CF 43 E8 20 12 C5 E9 B0 8A 18 12 7B 72
##$RELAX= 
##$RELAX= 
##$RELAX= 
##$RELAX= 
##$RELAX= 
##$RELAX= 
$$ Bruker specific parameters
$$ --------------------------
##$DU= <F:/spectra>
##$EXPNO= 1
##$NAME= <H-C>
##$PROCNO= 1
##$TYPE= <nmr>
##$USER= <she>
##$AMP= (0..31)
100 100 100 100 100 100 100 100 100 100 100 100 100 100 100 100 100 100 
100 100 100 100 100 100 100 100 100 100 100 100 100 100 
##$AQSEQ= 0
##$AQ_mod= 1
##$AUNM= <au_zg>
##$AUTOPOS= <>
##$BF1= 200.13
##$BF2= 200.13
##$BF3= 200.13
##$BF4= 200.13
##$BF5= 200.13
##$BF6= 200.13
##$BF7= 200.13
##$BF8= 200.13
##$BYTORDA= 1
##$CFDGTYP= 0
##$CFRGTYP= 5
##$CHEMSTR= <none>
##$CNST= (0..31)
1 1 145 1 1 1 1 1 1 1 1 1 1 1 1 1 1 1 1 1 1 1 1 1 1 1 1 1 1 1 1 1 
##$CPDPRG= <>
##$CPDPRG1= <>
##$CPDPRG2= <>
##$CPDPRG3= <>
##$CPDPRG4= <mlev>
##$CPDPRG5= <mlev>
##$CPDPRG6= <mlev>
##$CPDPRG7= <mlev>
##$CPDPRG8= <mlev>
##$CPDPRGB= <>
##$CPDPRGT= <>
##$D= (0..31)
0 0.7 0 0 0 0 0 0 0 0 0 0.03 0 0 0 0 0 0 0 0 0 0 0 0 0 0 0 0 0 0 0 0 
##$DATE= 1738760684
##$DBL= (0..7)
120 120 120 120 120 120 120 120 
##$DBP= (0..7)
150 150 150 150 150 150 150 150 
##$DBP07= 0
##$DBPNAM0= <>
##$DBPNAM1= <>
##$DBPNAM2= <>
##$DBPNAM3= <>
##$DBPNAM4= <>
##$DBPNAM5= <>
##$DBPNAM6= <>
##$DBPNAM7= <>
##$DBPOAL= (0..7)
0.5 0.5 0.5 0.5 0.5 0.5 0.5 0.5 
##$DBPOFFS= (0..7)
0 0 0 0 0 0 0 0 
##$DE= 6
##$DECBNUC= <off>
##$DECIM= 32
##$DECNUC= <off>
##$DECSTAT= 4
##$DIGMOD= 1
##$DIGTYP= 9
##$DL= (0..7)
0 120 120 120 120 120 120 120 
##$DP= (0..7)
150 150 150 150 150 150 150 150 
##$DP07= 0
##$DPNAME0= <>
##$DPNAME1= <>
##$DPNAME2= <>
##$DPNAME3= <>
##$DPNAME4= <>
##$DPNAME5= <>
##$DPNAME6= <>
##$DPNAME7= <>
##$DPOAL= (0..7)
0.5 0.5 0.5 0.5 0.5 0.5 0.5 0.5 
##$DPOFFS= (0..7)
0 0 0 0 0 0 0 0 
##$DQDMODE= 0
##$DR= 18
##$DS= 0
##$DSLIST= <SSSSSSSSSSSSSSS>
##$DSPFIRM= 0
$$ [...]
##$SUBNAM0= <"">
##$SUBNAM1= <"">
##$SUBNAM2= <"">
##$SUBNAM3= <"">
##$SUBNAM4= <"">
##$SUBNAM5= <"">
##$SUBNAM6= <"">
##$SUBNAM7= <"">
##$SUBNAM8= <"">
##$SUBNAM9= <"">
##$SW= 18.0517328524113
##$SWIBOX= (0..15)
0 0 2 0 0 0 0 0 0 0 0 0 0 0 0 0 
##$SW_h= 3612.71676300578
##$TD= 16384
##$TD0= 1
##$TE= 0
##$TE2= 300
##$TE3= 300
##$TEG= 300
##$TL= (0..7)
0 120 120 120 120 120 120 120 
##$TP= (0..7)
150 150 150 150 150 150 150 150 
##$TP07= 0
##$TPNAME0= <>
##$TPNAME1= <>
##$TPNAME2= <>
##$TPNAME3= <>
##$TPNAME4= <>
##$TPNAME5= <>
##$TPNAME6= <>
##$TPNAME7= <>
##$TPOAL= (0..7)
0.5 0.5 0.5 0.5 0.5 0.5 0.5 0.5 
##$TPOFFS= (0..7)
0 0 0 0 0 0 0 0 
##$TUNHIN= 0
##$TUNHOUT= 0
##$TUNXOUT= 0
##$USERA1= <user>
##$USERA2= <user>
##$USERA3= <user>
##$USERA4= <user>
##$USERA5= <user>
##$V9= 5
##$VALIST= <valist>
##$VCLIST= <CCCCCCCCCCCCCCC>
##$VD= 0
##$VDLIST= <DDDDDDDDDDDDDDD>
##$VPLIST= <PPPPPPPPPPPPPPP>
##$VTLIST= <TTTTTTTTTTTTTTT>
##$WBST= 1024
##$WBSW= 4
##$XGAIN= (0..3)
0 0 0 0 
##$XL= 0
##$YL= 0
##$YMAX_a= 151138
##$YMIN_a= -148674
##$ZGOPTNS= <>
##$ZL1= 120
##$ZL2= 120
##$ZL3= 120
##$ZL4= 120
##$ABSF1= 10
##$ABSF2= 0
##$ABSG= 5
##$ABSL= 3
##$ALPHA= 0
##$AQORDER= 0
##$ASSFAC= 0
##$ASSFACI= 0
##$ASSFACX= 0
##$ASSWID= 0
##$AUNMP= <proc_1d>
##$AZFE= 0.1
##$AZFW= 0.1
##$BCFW= 1
##$BC_mod= 2
##$BYTORDP= 1
##$COROFFS= 0
##$CY= -3
##$DATMOD= 1
##$DC= 2
##$DFILT= <>
##$DTYPP= 0
##$F1P= 0
##$F2P= 0
##$FCOR= 0.5
##$FTSIZE= 0
##$FT_mod= 4
##$GAMMA= 1
##$GB= 0.15
##$INTBC= 1
##$INTSCL= 1
##$ISEN= 128
##$LB= 0.25
##$LEV0= 0
##$LPBIN= 0
##$MAXI= 10000
##$MC2= 0
##$MEAN= 0
##$ME_mod= 0
##$MI= 1.114404
##$NCOEF= 0
##$NC_proc= 0
##$NLEV= 6
##$NOISF1= 3.799351
##$NOISF2= 2.8
##$NSP= 1
##$NTH_PI= 0
##$NZP= 0
##$OFFSET= 14.38212
##$PC= 1
##$PHC0= -104.9869
##$PHC1= 10.39221
##$PH_mod= 1
##$PKNL= yes
##$PPARMOD= 0
##$PSCAL= 0
##$PSIGN= 0
##$REVERSE= no
##$SF= 200.129724274929
##$SI= 16384
##$SIGF1= 3
##$SIGF2= 2
##$SINO= 400
##$SIOLD= 16384
##$SREGLST= <1H.CDCl3>
##$SSB= 0
##$STSI= 0
##$STSR= 0
##$SW_p= 3205.1282051282
##$SYMM= 0
##$S_DEV= 0
##$TDeff= 0
##$TDoff= 0
##$TI= <>
##$TILT= no
##$TM1= 0
##$TM2= 0
##$TOPLEV= 0
##$USERP1= <user>
##$USERP2= <user>
##$USERP3= <user>
##$USERP4= <user>
##$USERP5= <user>
##$WDW= 1
##$XDIM= 8192
##$YMAX_p= 0
##$YMIN_p= 0
$$ End of Bruker specific parameters
$$ ---------------------------------
##NTUPLES= NMR FID
##VAR_NAME=  TIME,          FID/REAL,        FID/IMAG
##SYMBOL=    X,             R,               I
##VAR_TYPE=  INDEPENDENT,   DEPENDENT,       DEPENDENT
##VAR_FORM=  AFFN,          ASDF,            ASDF
##VAR_DIM=   8192,          8192,            8192
##UNITS=     SECONDS,       ARBITRARY UNITS, ARBITRARY UNITS
##FACTOR=    0.0002768,     1,               1
##FIRST=     0,             0,               0
##LAST=      2.2672688,     0,               0
##MIN=       0,             -148674,         0
##MAX=       2.2672688,     151138,          0
$$ Real data points
##PAGE= N=1
##DATA TABLE= (X++(R..R)), XYDATA
$$ [...]
$$ plain form
2037 89 223 254 283 565 699 582 680 590 501 247 -42 -316 -58 -286 -394 -553 -515 -382 -741 -426 -90 -190
2059 -190 -46 579 346 547 489 628 459 335 501 53 189 -155 -389 -275 -377 -507 -456 -665 -450 -66 -456
2080 -456 -360 193 407 315 591 665 446 628 651 297 137 78 -316 -346 -182 -139 -691 -683 -271 -355 -363 -221 190 284
2104 284 379 406 420 166 426 632 348 231 214 81 40 -299 -387 -464 -597 -80 -467 -556 -300 71 -42 -148 62
2127 62 463 397 484 511 663 412 418 277 28 37 -373 -246 -268 -93 -444 -611 -705 -131 -76 -20 10 306 186 617
2151 617 297 525 562 250 250 146 347 146 -64 -96 -209 -197 -429 -428 -474 -259 19 -56 -87 116 266 376 558
2174 558 415 303 307 481 175 139 110 19 -110 -489 -358 -174 -186 -405 -310 -213 -39 -233 372 123 292 240 408
2197 408 497 300 47 -223 2 -194 -277 -176 -346 -748 -413 -416 -395 -483 -40 -11 368 429 -57 437 162 721 382
$$ packed form
2037H9J34L1K9K82J34j17R8r0q9k54k89k74K58k28j08j59L8J33l59L15L36j00
2059a90J44O25k33K01n8J39j69j24J66m48J36l44k34J14j02j30N1k09K15L84l90
2080d56R6N53K14r2K76P4k19J82K3l54j60n9l94l0J64M3n52QM12q4qJ42M11R4
2104B84R5K7J4k54K60K06k84j17j7j33m1l39q8p7j33N17l87q9K56L71j13j06K10
2127F2M01o6Q7K7J52k51Oj41k49Rm10J27k2J75l51j67r4N74N5N6L0K96j20M31
2151F17l20K28L7l12%j04K01k01k10l2j13J2k32Jm6K15K78p5l1K03J50J10J82
2174E58j43j12MJ74l06l6k9r1j29l79J31J84j2k19R5R7J74j94O05k49J69n2J68
2197D08Q9j97k53k70K25j96q3J01j70m02L35lK1q8M43K9L79O1m86M94k75N59l39
$$ plain form
2220 382 401 -52 23 -318 286 64 -75 -300 -409 -489 -506 -579 -341 -126 -252 -39 -82 347 194 177 -79 534
2242 534 250 486 211 51 -186 -41 6 -208 -351 -600 -242 -127 -181 -156 217 108 154 219 244 246 225 455 114
2265 114 129 107 197 -143 53 -224 -206 -368 -42 -495 -503 -349 -151 -86 -56 171 107 447 615 -24 471 250 171
2288 171 156 14 -42 -229 -204 -114 56 -390 -285 -213 -181 45 -154 -73 302 139 160 383 429 262 499 208 69
2311 69 274 323 -3 -175 -141 9 -500 -192 -41 -59 -487 -62 -8 33 -7 101 197 459 325 150 94 154 37
2334 37 19 -281 -302 -181 -365 -443 -101 -31 -117 137 -209 -39 -76 16 176 60 164 177 412 217 181 135 -11 38
2358 38 8 -92 -255 -196 -351 -14 -93 -78 -302 -66 268 405 45 345 354 243 212 283 114 221 -114 161 58
2381 58 -210 16 -408 -49 -33 -327 -260 7 -1 266 269 347 28 211 467 227 227 116 -5 198 -13 -28 -30 -277
$$ packed form
2220C82J9m53P5l41O04k22j39k25j09q0j7p3K38K15j26K13m3M29j53j7k56O13
2242E34k84K36k75j60k37J45M7k14j43k49L58J15n4K5L73j09M6O5K5Kk1K30l41
2265A14J5k2R0l40J96k77J8j62L26m53qJ54J98O5L0K27o4L40J68o39M95k21p9
2288A71j5j42n6j87K5R0J70m46J05P2L2K26j99Q1L75j63K1K23M6j67K37k91j39
2311F9K05M9l26j72L4J50n09L08J51j8m28M25N4M1m0J08R6K62j34j75n6O0j17
2334C7j8l00k1J21j84p8L42P0q6K54l46J70l7R2J60j16J04J3K35j95l6m6j46M9
2358C8l0j00j63N9j55L37p9J5k24K36L34J37l60L00Rj11l1P1j69J07l35K75j03
2381E8k68K26m24L59J6k94O7K67qK67LP8l19J83K56k40%j11j21K03k11j5kk47
$$ plain form
2405 -277 -287 -254 -128 -613 -263 -263 -186 31 186 162 70 260 197 250 206 113 244 6 112 -169 15 -81 -246 -293
2429 -293 -217 -143 -70 -83 70 -157 28 274 68 119 719 210 22 376 -98 -96 -161 -214 -187 -382 -428 -169 -87 -163
2453 -163 -173 202 -48 8 218 309 108 191 246 347 130 -20 377 -339 28 -47 -422 -139 -130 -478 -337 -269 -70
2476 -70 -198 -258 136 -78 60 165 144 127 456 298 -15 248 129 -163 -45 -338 -90 -502 -174 -231 -131 -332
2498 -332 -15 168 -147 -40 344 110 120 95 240 216 302 -155 -309 16 -83 78 -134 -151 31 -366 -495 -338
2520 -338 -170 -114 35 104 115 71 350 -127 281 280 110 431 33 -41 75 -5 -96 -82 -88 -132 -308 -258 -236 -149 -47
2545 -47 119 168 452 -33 89 272 277 40 280 429 128 75 298 3 -484 -512 -120 -337 -167 -263 -309 64 53
2568 53 -65 -118 158 448 162 477 189 43 -114 -1 167 -278 -140 -216 -69 -68 -225 -483 -135 200 -278 -105
$$ packed form
2405b77j0L3J26m85L50%P7K17J55k4r2J90o3N3m4r3J31k38J06k81J84r6j65m7
2429b93P6P4P3j3J53k27J85K46k06N1O00n09j88L54m74Ko5n3K7j95m6K59Q2p6
2453a63j0L75k50N6K10R1k01Q3N5J01k17j50L97p16L67p5l75K83Rl48J41O8J99
2476g0j28o0L94k14J38J05k1j7L29j58l13K63j19k92J18k93K48m12L28n7J00k01
2498c32L17J83l15J07L84k34J0k5J45k4Q6m57j54L25r9J61k12j7J82l97j29J57
2520c38J68N6J49O9J1m4K79m77M08jj70L21l98p4J16q0r1J4om4j76N0K2Q7J02
2545d7J66M9K84m85J22J83Nk37K40J49l01n3K23k95m87k8L92k17J70r6m6L73j1
2568E3j18n3K76K90k86L15k88j46j57J13J68m45J38p6J47Jj57k58L48L35m78J73
$$ plain form
2590 -105 87 43 221 140 324 316 187 542 141 125 -356 -237 -76 -242 1 -152 -312 -350 -503 -321 66 -118
2612 -118 63 7 389 -9 262 258 32 195 5 273 -122 17 -58 -47 -5 -192 -160 -443 -160 -185 -166 -110 -45 95
2636 95 86 285 225 242 419 112 94 88 138 204 -80 -123 -148 10 -274 -37 -81 89 -102 -67 240 -12 -101 103 137
2661 137 250 165 250 81 383 4 -271 -146 -219 -303 149 -345 -303 -357 -206 -365 -205 -145 149 228 27 57 343
2684 343 214 173 259 123 259 -343 15 44 28 -366 -327 -242 -221 -268 -180 12 -55 -89 99 52 321 756 174 235
2708 235 379 198 162 -95 165 261 -25 66 -297 -435 -106 -393 -107 -334 -170 -82 78 -74 386 274 164
2729 164 212 106 253 284 181 17 -9 -172 -250 -308 -339 -129 -324 -212 -208 -261 46 -149 269 530 -157 257 488
2752 488 113 200 21 282 210 -160 101 -234 31 -47 -352 -361 -312 -62 119 -38 56 327 53 231 289 351 315
$$ packed form
2590a05J92m4J78q1J84qj29L55m01j6m81J19J61j66K43j53j60l8j53J82L87j84
2612a18J81n6L82l98K71mk26J63j90K68l95J39p5J1M2j87L2k83K83k5J9N6O5J40
2636I5rJ99o0J7J77l07j8oN0O6k84m3k5J58k84K37m4J70j91L5L07k52q9K04L4
2661A37J13q5Q5j69L02l79k75J25p3q4M52m94M2n4J51j59J60O0K94P9k01L0K86
2684C43j29m1Q6j36J36o02L58K9j6l94L9Q5K1m7Q8J92o7l4J88m7K69M35n82O1
2708B35J44j81l6k57K60R6k86R1l63j38L29k87K86k27J64Q8J60j52M60j12j10
2729A64M8j06J47L1j03j64k6j63p8n8l1K10j95J12Mn3L07j95M18K61o87M14K31
2752D88l75Q7j79K61p2l70K61l35K65p8l05rM9K50J81j57R4K71k74J78N8O2l6
$$ plain form
2775 315 339 194 202 6 -119 164 -45 -404 -184 -301 -138 -250 31 -93 -229 -132 231 324 224 274 123 271
2797 271 174 170 106 145 -91 217 -139 -165 -333 -295 -315 -394 -10 -149 -103 31 31 50 36 136 157 369 329 231 246 -89
2823 -89 -106 -287 -26 24 -227 -190 -63 -447 -299 -151 -99 -14 162 379 277 386 121 168 276 425 134 342
2845 342 -272 75 -46 -161 -343 -303 -2 -160 -102 -478 -198 13 -22 -36 -98 -2 112 74 224 152 107 -10 -54
2868 -54 140 36 7 -379 -268 -334 -105 -145 -275 -44 -125 -85 206 352 -4 298 224 -4 173 191 237 307 81
2891 81 -271 -47 -104 -272 -661 -144 -157 -215 -97 -268 112 -64 213 2 199 74 49 376 200 213 59 1
2913 1 89 -144 -248 -167 -134 -315 171 47 -156 -55 -327 277 352 125 295 210 224 215 -89 -151 -8 119 -323 -231
2937 -231 -95 -277 -371 -353 179 -180 57 -78 -225 111 113 173 422 76 471 254 278 452 53 -278 123 -205
$$ packed form
2775C15K4j45Qj96j25K83k09l59K20j17J63j12K81j24j36R7L63R3j00N0j51J48
2797B71r7mo4L9k36L08l56k6j68L8k0p9L84j39M6J34%J9j4J00K1K12m0r8J5l35
2823h9j7j81K61N0k51L7J27l84J48J48N2Q5J76K17j02J09k65M7J08J49k91K08
2845C42o14L47j21j15j82M0L01j58N8l76K80K11l5j4o2R6J14l8J50p2m5j17m4
2868e4J94j04k9l86J11o6K29m0j30K31q1M0K91J46l56L02p4k28J77J8M6P0k26
2891H1l52K24n7j68l89N17j3n8J18j71L80j76K77k11J97j25k5L27j76J3j54n8
2913AQ8k33j04Q1L3j81M86j24k03J01k72O04P5k27J70q5J4rl04o2J43J27m42R2
2937b31J36j82r4J8N32l59K37j35j47L36KO0K49l46L95k17K4J74l99l31M01l28
$$ plain form
2959 -205 -117 154 -217 -215 -215 85 -62 -46 206 -103 5 408 218 -2 427 130 -108 16 2 118 -36 78
2981 78 -166 7 107 -310 -234 -344 4 119 33 10 92 9 277 175 36 -261 -174 146 55 -18 -86 -163 -183 40
3005 40 -242 -275 -177 -223 -142 -176 -80 -115 80 156 -119 38 138 68 385 19 158 -49 98 -97 -92 -237 -141 -53 -46
3030 -46 301 -379 -328 52 70 201 -16 39 148 93 460 336 169 -58 83 32 -477 -186 -426 20 -78 -88 -208
3053 -208 -128 159 -160 150 34 124 65 48 101 160 -48 55 6 -227 -187 -185 -61 -14 -133 -173 84 97 -169 -219 -200
3078 -200 194 212 162 169 198 -38 158 136 -12 -143 196 46 -175 57 -265 124 -218 10 -181 42 129 -137
3100 -137 217 241 447 62 256 203 66 251 234 -397 79 -32 -200 -234 -29 58 -185 -27 -102 -132 -63 38 249
3123 249 172 365 214 -43 88 39 18 131 -25 -67 -132 -211 -209 -70 -387 43 -347 -307 67 162 117 177 268 94
$$ packed form
2959b05Q8K71l71K%L00j47J6K52l09J08M03j90k20M29k97k38J24j4J16j54J14
2981G8k44J73J00m17P6j10L48J15q6k3Q2q3K68j02j39k97Q7L20r1p3o8p7k0K23
3005D0k82l3R8m6Q1l4R6l5J95P6k75J57J00p0L17l66J39k07J47j95Nj45R6Q8P
3030d6L47o80N1L80J8J31k17N5J09n5L67j24j67k27J41n1n09K91k40M46r8j0j20
3053b08Q0K87l19L10j16R0n9j7N3N9k08J03m9k33M0KJ24M7j19m0K57J3k66n0J9
3078b00L94J8n0PK9k36J96k2j48j31L39j50k21K32l22L89l42K28j91K23Q7k66
3100a37L54K4K06l85J94n3j37J85j7o31M76j11j68l4K05Q7k43J58p5l0O9J01K11
3123B49p7J93j51k57J31m9k1J13j56m2o5p9KJ39l17M30l90M0L74R5m5O0R1j74
$$ plain form
3147 94 331 114 266 109 -43 33 15 -271 62 38 -171 -173 -156 -76 -155 72 -49 243 -98 -30 157 67 363 377
3171 377 72 233 82 107 -5 -95 -67 -136 264 -387 -149 -152 -350 -141 238 218 311 60 -170 385 407 230 88
3194 88 -140 -97 93 189 -222 -118 153 -223 -220 -337 -20 89 -132 -107 -21 92 380 98 54 545 298 -212 515
3217 515 8 -18 -75 -141 -232 -173 -171 -228 -379 -392 44 -344 -74 205 70 74 126 139 202 184 -270 -74 7 70 -177 -156
3243 -156 -18 -268 -85 -217 -130 -277 -330 9 -17 -17 155 -130 49 116 248 118 22 138 361 -46 -304 77
3265 77 -183 -20 -309 -72 -161 -295 -274 -150 -383 32 202 62 126 226 384 378 53 326 61 177 174 -76 -234
3288 -234 -12 -282 -221 -267 -272 -186 -214 40 10 34 299 484 -43 390 277 325 45 55 -21 29 -125 -69 -136 -284 -257
3313 -257 -425 -232 -154 -117 -333 -236 166 178 314 152 239 125 132 314 114 4 98 180 -277 -197 -324 -430 -115
$$ packed form
3147I4K37k17J52j57j52P6j8k86L33k4k09kJ7Q0p9K27j21K92l41O8J87r0K96J4
3171C77l05J61j51K5j12r0K8o9M00o51K38lj98K09L79k0R3k51k30N55K2j77j42
3194H8k28M3J90R6m11J04K71l76Lj17L17J09k21K5Q6J13K88k82m4M91k47n10P27
3217E15n07k6n7o6r1N9Kn7j51j3M36l88K70K79j35MN2J3O3j8m54J96Q1O3k47K1
3243a56J38k50J83j32Q7j47n3L39k6%J72k85J79O7J32j30r6J16K23m07k58L81
3265G7k60J63k89K37q9j34K1J24k33M15J70j40O4J00J58ol25K73k65J16lk50j58
3288b34K22k70O1m6nQ6k8K54l0K4K65J85n27M33j13M8k80J0p6N0j54N6o7j48K7
3313b57j68J93P8L7k16R7M02J2J36j62Q7j14PJ82k00j10R4Q2m57Q0j27j06L15
$$ plain form
3336 -115 -346 -380 -122 -116 -290 -200 45 116 148 121 558 204 273 116 124 -20 34 -234 -251 -349 -202 -133 -453 -324 -218
3361 -218 157 -72 102 580 126 118 234 464 217 261 280 304 174 -199 -273 -292 -20 29 -270 -720 -471 -20 -373
3384 -373 22 -229 52 350 343 368 404 328 103 278 301 217 -18 89 -99 -238 -266 -402 -123 -135 -76 -269 -216 94
3408 94 -33 353 363 362 232 383 537 434 298 155 67 63 -177 -436 -286 -379 -321 -303 -465 -70 -249 -270 103 52
3432 52 280 316 338 142 497 250 128 303 -115 -53 -30 -279 8 -321 -175 -529 -146 -208 -155 -3 154 404
3454 404 420 593 567 550 619 367 678 290 -15 62 -83 -200 -214 -312 -148 -157 -600 -115 -243 -159 306 162 231 556
3478 556 516 380 351 6 126 295 319 80 -216 -447 -432 -328 -586 -446 -369 -322 -477 -160 -11 71 129 336 247
3501 247 437 475 439 281 75 164 -190 -139 -302 -496 -286 -213 -310 -434 -290 -541 -98 -64 2 -15 139 244 409
$$ packed form
3336a15k31l4K58Oj74R0K45P1L2k7M37l54O9j57Qj44N4k68j7r8J47O9l20J29J06
3361b18L75k29J74M78m54qJ16K30k47M4J9K4j30l73p4j9K72M9k99m50K49M51l53
3384c73L95k51K81K98pK5L6p6k25J75K3q4k35J07j88j39k8j36K79j2N9j93N3L10
3408I4j27L86J0jj30J51J54j03j36j43q8mk40k59J50r3N8J8j62L95j79k1L73n1
3432E2K28L6K2j96L55k47j22J75m18O2K3k49K87l29J46l54L83o2N3J52J57K50
3454D04J6J73k6j7O9k52L11l88l05P7j45j17j4r8J64rm43M85j28Q4M65j44O9L25
3478E56m0j36k9l45J20J69K4k39k96k31J5J04k58J40P7M7j55L17J49Q2N8K07q9
3501B47J90L8l6j58k06Q9l54N1j63j94K10P3r7j24J44k51M43L4O6j7J54J05J65
$$ plain form
3524 409 432 426 281 148 299 208 63 -133 -397 -207 -339 -524 -698 -581 -182 -366 144 -46 435 156 80 387
3546 387 229 229 220 317 455 -47 60 73 -161 -137 -276 -681 -437 -283 -266 -167 -425 -145 14 31 284 276 411 366
3570 366 455 375 377 225 51 21 8 -78 -497 -528 -304 -402 -449 -466 -341 105 15 296 154 289 308 496 536 704 383
3595 383 477 172 187 -32 -265 -300 -530 -560 -459 -486 -361 -83 -272 -337 -44 137 461 246 219 333 558 532 202
3618 202 115 191 -222 -109 13 -476 -382 -544 -205 -572 -225 -65 85 188 -59 547 391 576 420 489 116
3639 116 109 166 263 117 -4 -347 -385 85 -625 -690 -514 -518 -421 -115 -101 253 313 471 359 329 337 429 377 220 356
3664 356 327 201 -126 -102 -339 -433 -423 -439 -224 -345 158 -15 -182 112 216 393 598 357 445 467 305 65
3686 65 41 -55 -218 -254 -613 -337 -549 -667 -194 -290 -273 7 -96 205 335 280 423 496 603 592 581 482 108 -39
$$ packed form
3524D09K3oj45j33J51r1j45j96k64J90j32j85j74J17L99j84N10j90M81k79p6L07
3546C87j58%rR7J38n02J07J3k34K4j39m05K44J54J7R9k58K80J59J7K53qJ35m5
3570C66Q9q0Kj52j74l0j3q6m19l1K24r8m7j7J25M46r0K81j42J35J9J88M0J68l21
3595C83R4l05J5k19k33l5k30l0J01k7J25K78j89o5K93J81L24k15k7J14K25k6l30
3618B02q7P6m13J13J22m89R4j62L39l67L47J60J50J03k47O06j56J85j56O9l73
3639A16pN7R7j46j21l43l8M70p10o5J76mR7L06J4L54O0J58j12l0QR2n2j57J36
3664C56k9j26l27K4k37r4J0j6K15j21N03j73j67K94J04J77K05k41Q8K2j62k40
3686F5k4r6j63l6l59K76k12j18M73r6J7K80j03L01J30n5J43P3J07j1j1r9l74j47
$$ plain form
3710 -39 33 -100 -176 -193 -305 -389 -684 -563 -44 -13 -194 -44 309 169 139 341 452 483 617 289 264 -23 114
3733 114 -243 -382 -399 -226 -394 -362 -138 -204 -151 -254 -129 188 280 248 360 721 512 336 543 313 125 162
3755 162 -256 -45 -439 -392 -531 -250 -498 -498 -235 -267 30 27 100 224 451 143 439 568 485 361 296 -83 7
3778 7 -184 -491 -469 -464 -656 -460 -162 -207 -79 -82 157 307 357 387 77 602 547 406 158 42 226 21 -303 -164
3802 -164 96 -225 -617 -345 -332 -535 -263 -122 -171 -58 105 319 379 485 536 403 356 291 568 124 144 -313
3824 -313 -485 -448 -609 -385 -470 -341 -71 -227 -180 99 304 409 398 225 402 511 348 392 335 126 64 -152
3846 -152 -395 -167 -330 -585 -695 -875 -395 -232 -12 6 -15 235 450 557 398 404 531 469 439 94 -63 -98
3868 -98 -321 -170 -308 -372 -278 -525 -445 -192 -250 -164 142 16 241 402 552 189 583 604 312 344 260 313 -132
$$ packed form
3710c9P2j33p6j7j12q4k95J21N19L1j81J50L53j40l0K02J11L1J34l28k5k87J37
3733A14l57j39j7J73j68L2K24o6N3j03J25L17R2l2J12L61k09j76K07k30j88L7
3755A62m18K11l94M7j39K81k48%K63l2K97lP3J24K27l08K96J29q3j24o5l79R0
3778Gj91l07K2Nj92J96K98m5J28lK39J50N0L0l10N25n5j41k48j16J84k05l24J39
3802a64K60l21l92K72J3k03K72J41m9J13J63K14O0J06N1j33m7o5K77m44K0m57
3824c13j72L7j61K24q5J29K70j56M7K79K05J05j1j73J77J09j63M4n7k09o2k16
3846a52k43K28j63k55j10j80M80J63K20J8k1K50K15J07j59OJ27o2l0l45j57l5
3868i8k23J51j38o4R4k47Q0K53n8Q6L06j26K25J61J50l63L94K1k92L2q4N3m45
$$ plain form
3891 -132 -474 -120 -187 -700 -465 -638 -591 -350 -361 -192 10 159 509 366 768 626 705 326 413 170 148 5
3913 5 -351 95 -633 -471 -442 -679 -593 -198 -363 -104 -3 28 280 510 481 556 586 448 275 125 -87 -164 -383
3936 -383 -115 -287 -429 -258 -104 -455 -301 -192 42 -281 246 286 255 315 813 708 469 365 382 434 -318 84
3958 84 -368 -449 -368 -490 -404 -476 -426 -550 -362 -247 177 255 319 594 504 324 436 234 344 220 370 71 -241
3981 -241 -327 -457 -400 -384 -392 -200 -374 -27 -355 -403 146 54 476 453 420 511 175 185 233 302 -76 -20 -254 -217 -436
4006 -436 -711 -417 -420 -269 -267 -410 -205 348 181 126 422 518 382 582 565 330 208 268 66 -479 -350 -433 -472
4029 -472 -237 -480 -688 -431 -221 -220 -31 224 508 746 375 798 727 367 304 421 186 -30 -191 -521 -213
4050 -213 -242 -394 -199 -942 -417 -499 79 105 169 -29 436 420 333 444 542 405 429 240 98 -59 1 -367 -334
$$ packed form
3891a32l42L54o7n13K35j73M7K41j1J69K02J49L50j43M02j42P9l79Q7k43k2j43
3913El56M46p28J62K9k37Q6L95j65K59J01L1K52K30k9P5L0j38j73j50k12p7k19
3936c83K68j72j42J71J54l51J54J09K34l23N27M0l1O0M98j05k39j04J7N2p52M02
3958H4m52q1Q1j22Q6p2N0j24J88J15M24P8O4K75r0j80J12k02J10j24J50k99l12
3981b41q6j30N7J6qJ92j74L47l28m8N49r2M22k3l3R1l36J0M8O9l78N6k34L7k19
4006d36k75K94lJ51Kj43K05N53j67n5K96R6j36K00j7k35j22O0k02n45J29q3l9
4029d72K35k43k08K57K10JJ89K55K84K38l71M23p1l60o3J17k35k16j61l30L08
4050b13k9j52J95p43N25q2N78K6O4j98M65j6q7J11R8j37K4j89j42j57O0l68L3
$$ plain form
4073 -334 -287 -718 -211 -434 -626 -78 -170 50 -5 580 303 490 362 804 568 430 313 321 37 -76 -294 -633
4095 -633 -316 -789 -513 -524 -344 -180 -314 91 221 119 260 507 545 457 552 578 701 284 191 -64 -448 -483
4117 -483 -410 -578 -617 -381 -577 -275 -34 -196 150 63 389 385 562 569 564 402 345 146 146 253 -47 -309 -295 -463
4141 -463 -452 -665 -518 -340 -282 -147 289 176 62 180 429 730 440 294 129 371 246 135 -39 -306 -280
4162 -280 -236 -593 -739 -363 -603 -424 -164 -56 110 193 483 269 195 471 611 424 331 438 -119 -101 -70 -297
4184 -297 -296 -467 -593 -714 -485 -545 -477 -283 -431 311 405 290 391 752 346 747 552 309 287 25 -101 50
4206 50 -268 -470 -397 -314 -343 -438 -272 -245 -70 227 84 240 122 261 315 323 71 39 440 -56 29 -58 -275 -382
4230 -382 -609 -572 -427 -642 -485 -208 -91 113 180 369 216 296 425 347 490 78 321 226 144 57 -352 -381 -282
$$ packed form
4073c34M7m31N07k23j92N48r2K20n5N85k77J87j28M42k36j38j17Qk84j13k18l39
4095f33L17m73K76j1J80J64j34M05J30j02J41K47L8q8R5K6J23m17r3k55l84l5
4117d83P3j68l9K36j96L02K41j62L46q7L26mJ77Pnj62n7j99%J07l00k62J4j68
4141d63J1k13J47J78N8J35M36j13j14J18K49L01k90j46j65K42j25j11j74k67K6
4162b80M4l57j46L76k40J79K60J08J66Q3K90k14p4K76J40j87r3J07n57J8L1k27
4184b97Jj71j26j21K29o0O8J94j48P42R4j15J01L61m06M01j95k43k2k62j26J51
4206E0l18k02P3Q3k9r5J66K7J75K97j43J56j18J39N4Qk52l2M01m96Q5q7k17j07
4230c82k27L7J45k15J57K77J17K04O7J89j53Q0J29p8J43m12K43r5q2q7m09k9R9
$$ plain form
4253 -282 -563 -592 -603 -397 -377 -48 -164 347 188 500 551 455 747 286 412 330 219 -109 -23 -228 -246 -489 -385
4276 -385 -438 -483 -451 -428 32 -175 166 244 178 415 495 327 468 460 502 213 18 -127 -63 26 -387 -398 -565 -447
4300 -447 -449 -509 -230 -343 97 -98 413 289 198 347 380 544 281 81 196 148 -259 -228 -490 -359 -560 -427
4322 -427 -599 -199 -347 -579 -182 114 265 24 375 434 176 372 461 100 228 171 90 -35 -105 -491 46 -574
4344 -574 -618 -197 -170 -36 -167 -209 292 123 37 301 476 385 707 49 391 276 -206 -79 38 106 -319 -295
4366 -295 -301 -239 -219 -184 -440 -180 -21 123 460 626 565 605 407 398 308 379 175 214 -260 -213 -281 -331 -441 -336 -585
4391 -585 19 -168 -103 -153 -10 150 509 500 176 336 465 264 187 127 120 21 -295 -365 -650 -366 -365 -347 -516 -130
4415 -130 -164 -200 109 76 90 240 338 514 82 205 372 35 190 -102 54 -543 -19 -366 -344 -47 -481 -265
$$ packed form
4253b82k81k9j1K06K0L29j16N11j59L12N1r6K92m61J26q2j11l28Q6k05j8k43J04
4276c85n3m5L2K3M60k07L41P8o6K37Q0j68J41qM2k89j95j45O4Q9m13j1j67J18
4300d47ko0K79j13M40j95N11j24r1J49L3J64k63k00J15m8m07L1k62J31k01J33
4322d27j72M00j48k32L97K96J51k41L51N9k58J96Q9l61J28n7q1j25p0l86N37o20
4344e74m4M21K7J34j31m2N01j69q6K64J75r1L22o58L42j15m82J27J17O8m25K4
4366b95oO2K0L5k56K60J59J44L37J66o1M0j98rr0P1k04L9m74M7o8n0j10J05k49
4391e85O04j87O5n0J43J60L59rl24J60J29k01p7o0pr9l16p0k85K84JJ8j69L86
4415a30l4l6L09l3J4J50R8J76m32J23J67l37J55k92J56n97N24l47K2K97m34K16
$$ plain form
4437 -265 -355 -150 -43 55 443 248 422 221 260 287 182 294 264 72 -128 -42 -318 -300 -253 -385 -315 -519 -192
4460 -192 -200 63 445 197 344 193 238 588 553 201 402 283 22 -221 -62 -37 -527 -206 -388 -180 -397 -223
4482 -223 -53 55 116 59 198 393 158 311 218 315 361 469 72 373 -126 -126 -243 71 -44 -412 -216 -74
4504 -74 -313 -68 15 248 382 293 279 264 209 188 349 352 219 3 -19 -484 -300 -439 -577 -511 -302 -368 -75 -167
4528 -167 -172 -450 -169 259 327 393 275 498 531 153 115 6 133 -55 -156 -193 -144 -537 -526 -89 -478 -327 -98
4551 -98 -186 88 -108 538 406 229 323 261 252 500 363 -74 292 -128 -141 -361 -376 -109 -319 -491 -274 -63 35
4574 35 67 162 49 228 202 408 389 265 146 117 250 69 -28 -201 -340 -246 -353 -211 -27 -163 -204 -252 -126
4597 -126 -18 400 148 98 417 371 199 476 -44 252 -323 103 -159 -271 -466 -242 -283 -232 -25 -261 -32
$$ packed form
4437b65r0K05J07R8L88j95J74k01L9K7j05J12l0j92k00Q6k76J8M7j32P0k04L27
4460a92qK63L82k48J47j51M5L50l5l52K01j19k61k43J59K5m90L21j82K08k17J74
4482b23J70J08O1n7J39J95k35J53r3R7M6J08l97L01m99%j17L14j15l68J96J42
4504g4k39K45Q3K33J34q9j4j5n5k1J61Lj33k16k2m65J84j39j38O6K09o6K93r2
4528a67nk78K81M28O8O6j18K23L3l78l8j09J27j88j01l7M9l93J1M37l89J51K29
4551i8q8K74j96O46j32j77R4o2rK48j37m37L66m20j3k20j5K67k10j72K17K11R8
4574C5L2R5j13J79k6K06j9j24j19k9J33j81r7j73j39R4j07J42J84j36m1m8J26
4597a26J08M18k52n0L19m6j72K77n20K96n75M26k62j12j95K24m1N1K07k36K29
$$ plain form
4618 -32 -90 -93 10 251 390 225 397 364 403 174 -22 129 -89 -188 -14 -252 -425 -267 -369 -281 -355 -27 99
4641 99 -190 -220 74 244 158 139 340 512 481 124 358 -12 94 68 -28 -282 28 -108 -276 -215 -321 -438 -211
4664 -211 45 196 112 310 339 129 572 367 520 140 246 215 -337 -156 -140 -69 -588 -186 -38 19 -134 -369
4686 -369 55 -304 455 177 92 166 65 80 107 77 154 -18 -112 -67 -260 -308 -181 40 -275 -267 -366 -43 14 65 243
4711 243 62 113 21 122 364 51 417 402 60 95 154 -256 -346 -42 -348 -111 -154 -188 -115 -285 -153 164 -28
4734 -28 231 186 321 318 131 385 405 -70 8 -33 102 -92 -233 -352 -515 -92 -336 -118 -136 -244 345 -84 137
4757 137 30 156 36 -8 392 126 314 -70 3 115 49 249 -287 -251 -254 -369 -322 -194 -372 -293 187 15 120
4780 120 189 -117 -40 381 440 145 49 -9 -197 -129 -41 -198 -144 -5 -280 -321 -153 -293 -32 54 -201 126 260
$$ packed form
4618c2n8lJ03K41J39j65J72l3L9k29j96J51k18r9J74k38j73J58j02Q8p4L28J26
4641I9k89l0K94J70q6j9K01J72l1l57K34l70J06k6r6k54L10j36j68O1j06j17K27
4664b11K56J51q4J98K9k10M43k05J53l80J06l1n52J81J6P1n19M02J48N7j53k35
4686c69M24l59P59k78q5P4j01J5K7l0P7j72r4M5j93m8J27K21l15Qr9L23N7N1J78
4711B43j81N1r2J01K42l13L66j5l42L5N9m10r0L04l06K37m3l4P3j70J32L17j92
4734b8K59m5J35lj87K54K0m75P8m1J35j94j41j19j63M23k44K18j8j08N89m29K21
4757A37j07J26j20m4M00k66J88l84P3J12o6K00n36L6lj15M7J28j78P9M80j72J05
4780A20O9l06P7M21N9k95r6n8j88O8Q8j57N4J39k75m1J68j40K61Q6k55L27J34
$$ plain form
4803 260 33 311 199 51 251 344 -101 203 -3 -492 93 -114 -416 -91 -154 66 -40 -56 -68 -66 -34 154
4825 154 72 283 -4 314 -12 163 24 137 49 -189 -66 -216 -180 -259 -164 48 -184 -115 176 51 309 346
4847 346 143 55 169 54 339 144 171 166 37 109 -354 -98 -418 -24 -175 -208 15 -105 53 -163 -76 -49 300
4870 300 32 256 -69 -130 131 248 248 208 -50 -252 -99 -121 -378 -65 -197 -371 -86 -202 -193 -237 208 179 501
4893 501 381 26 27 -29 332 481 70 -79 -166 -134 -133 -87 -62 -330 -90 11 45 -34 97 9 -33 184 235 189 46
4918 46 330 331 555 501 154 144 -169 -198 -266 -198 -224 -132 116 -295 -174 -159 -24 271 -112 71 308 103 125 36
4942 36 -90 313 -133 -34 -50 -309 -412 -265 -19 -162 221 -63 -100 -57 43 -168 -60 164 235 255 320 271 341
4965 341 94 258 213 142 19 -249 -330 -55 -251 -217 163 -84 -104 -104 74 -29 164 162 489 279 56 98 120 148
$$ packed form
4803B60k27K78j12j48K00R3m45L04k06m89N85k07l02L25o3K20j06j6j2KL2J88
4825A54q2K11k87L18l26J75j39J13q8k38J23j50L6p9R5K12k32O9K91j25K58L7
4847C46k03q8J14j15K85j95K7nj29P2m63K56l20L94j51l3K23j20J58k16Q7K7L49
4870C00k68K24l25o1K61J17%m0k58k02J53k2k57L13j32j74K85j16Rm4M45k9L22
4893E01j20l55Jn6L61J49m11j49q7L2JM6K5k68K40J01L4p9J31q8m2K17N1m6j43
4918D6K84JK24n4l47j0l13k9o8O8k6R2K48m11J21J5J35K95l83J83K37k05K2q9
4942C6j26M03m46R9j6k59j03J47K46j43L83k84l7M3J00k11J08K24P1K0O5m9P0
4965C41k47J64m5p1j23k68q1K75j96L4L80k47k0%J78j03J93kL27k10k23M2K2K8
$$ plain form
4989 148 26 84 187 -269 -55 -262 -195 -176 -136 -50 -139 -18 200 24 287 138 11 208 189 119 173 -62 230
5012 230 80 172 -258 208 -221 -281 -193 -78 -7 79 -183 -130 -178 28 155 164 69 -64 -10 49 327 121 2 -37
5036 -37 207 -251 -105 123 -367 -374 -42 -29 -96 210 36 30 181 61 -15 51 46 166 149 -175 382 238 -51 72
5060 72 14 -41 -159 -115 -147 104 -84 -22 170 -42 143 179 -45 -140 131 -69 152 343 48 -100 -18 -140 -165
5083 -165 -137 -59 -101 -145 -357 25 -160 -92 -277 -158 -250 130 121 170 13 12 288 -147 117 354 -174 120 -45 -160
5107 -160 -176 135 -45 -3 -9 -48 -14 117 348 -295 138 308 147 319 235 -160 54 96 168 -35 313 97 -61
5130 -61 -164 -157 -233 -25 165 -146 110 8 84 211 20 -45 188 470 157 -19 181 -16 70 -14 -275 -243 -80
5153 -80 -96 -206 -87 95 -44 -8 58 -189 229 108 92 -37 191 249 58 238 21 59 -115 115 -112 -17 107
$$ packed form
4989A48j22N8J03m56K14k07O7J9M0Q6q9J21K18j76K63j49j27J97j9p0N4k35K92
5012B30j50R2m30M66m29o0Q8J15P1Q6k62N3m8K06J27Rr5j33N4N9K78k06j19l9
5036c7K44m58J46K28m90pL32J3o7L06j74oJ51j20p6O6nJ20j7l24N57j44k89J23
5060G2n8n5j18M4l2K51j88O2J92k12J85L6k24r5K71k00K21J91k95j48Q2j22k5
5083a65K8P8m2m4k12L82j85O8j85J19r2L80rM9j57jK76m35K64K37n28K94j65j15
5107a60j6L11j80M2ol9L4J31K31o43M33J70j61J72q4l95K14M2P2k03L48k16j58
5130f1j03Pp6K08J90l11K56j02P6J27j91o5K33K82l13j76K00j97Q6q4k61L2J63
5153h0j6j10J19J82j39L6O6k47M18j21j6j29K28N8j91J80k17L8j74K30k27R5J24
$$ plain form
5176 107 -26 41 -200 -110 38 -69 26 -110 -43 54 -297 -141 -101 -27 134 158 -135 -52 76 32 -94 -75 80 159
5200 159 -9 -149 33 -65 137 -130 8 -77 63 -65 -105 105 -264 155 141 -43 114 -50 -66 -246 85 -277
5222 -277 -289 42 -72 -75 -158 34 304 -89 -192 -136 59 192 218 -124 38 -39 21 -31 27 -135 -123 -87 29 -259
5246 -259 -4 25 -24 -50 49 23 -48 -126 -121 269 45 52 -133 263 271 43 -301 -140 -74 62 -100 -157 10 14 223 2
5272 2 5 -129 149 105 -123 109 -18 -219 -22 11 -71 -189 -230 -144 121 37 173 38 23 12 37 -19 35 88 157 62
5298 62 -35 21 -45 60 -270 91 89 -75 -328 208 128 -145 -279 272 -23 -151 -242 -139 -167 232 -99 -34 157
5321 157 -242 -36 -63 194 -81 -27 -78 212 -117 -172 307 178 257 119 -25 46 -167 -99 -6 286 -208 -101 50
5344 50 231 41 177 142 -21 -26 9 -241 220 134 -111 24 -171 7 -99 154 15 372 181 30 -51 -29 66
$$ packed form
5176A07j33O7k41R0J48j07R5j36O7R7l51J56M0P4J61K4k93Q3J28m4j26J9J55P9
5200A59j68j40J82r8K02k67J38q5J40j28m0K10l69M19j4j84J57j64j6j80L31l62
5222b77j2L31j14lq3J92K70l93j03N6J95J33K6l42J62p7O0n2N8j62J2L6J16k88
5246b59K55K9m9k6R9k6p1p8NL90k24Pj85L96Qk28l44J61O6J36j62n7J67MK09k21
5272BLj34K78m4k28K32j27k01J97L3q2j18m1Q6K65q4J36j35j5j1K5n6N4N3O9r5
5298F2r7N6o6J05l30L61kj64k53N36q0k73j34N51k95j28r1J03k8L99l31O5J91
5321A57l99K06k7K57k75N4n1K90l29n5M79j29P9j38j44P1k13O8R3K92m94J07J51
5344E0J81j90J36l5j63nL5k50M61q6k45J35j95J78j06K53j39L57j91j51q1K2R5
$$ plain form
5367 66 -43 36 -42 199 -49 -37 -222 -12 114 -132 -112 -47 -166 75 -100 21 -187 -154 -118 70 157 -137 -269
5390 -269 -92 236 -291 46 -8 -67 45 -270 -15 182 9 118 -179 -238 -105 -51 140 -186 -27 -197 -242 154
5412 154 -101 -1 -80 -126 -136 -27 34 147 -33 -8 111 -59 45 -52 -261 213 -23 98 -91 138 17 -12
5434 -12 24 426 14 -154 -61 -294 10 -44 -93 -36 170 -259 -23 -152 211 -72 2 -72 -40 42 -9 94 272 -63
5458 -63 -188 62 136 -6 -208 344 -81 24 74 -51 -18 -1 17 62 -39 -113 -114 102 -152 -408 -20 -213 89
5481 89 2 18 159 148 294 -214 -18 51 16 44 -187 -34 -88 -215 -341 -55 -108 42 -15 122 -237 -153 -146 172
5505 172 33 17 -135 -33 -52 68 -20 -46 -203 -141 -170 -121 234 -97 -124 30 -88 15 -28 -179 139 -75 52
5528 52 114 -56 60 -83 -86 -47 195 76 -145 14 -39 309 -17 -70 76 74 -56 56 125 -30 -158 4 -291
$$ packed form
5367F6j09P9p8K41k48J2j85K10J26k46K0O5j19K41j75J21k08L3L6J88Q7k94j32
5390b69J77L28n27L37n4n9J12l15K55J97j73J09k97n9J33N4J91l26J59j70m5L96
5412A54k55J00p9m6j0J09O1J13j80K5J19j70J04r7k09M74k36J21j89K29j21k9
5434a2L6M02m12j68R3k33L04n4m9N7K06m29K36j29L63k83P4p4L2Q2n1J03J78l35
5458f3j25K50P4j42k02N52m25J05N0j25L3J7J8M5j01p4jK16k54k56L88j93L02
5481H9q7J6J41j1J46n08J96O9l5K8k31J53n4j27j26K86n3J50n7J37l59Q4PL18
5505A72j39j6j52J02j9J20q8k6j57O2k9M9L55l31k7J54j18J03m3j51L18k14J27
5528E2O2j70J16j43lL9K42j19k21J59n3L48l26n3J46kj30J12O9j55j28J62k95
$$ plain form
5551 -291 101 -276 -185 -113 -141 27 -242 -222 -106 -82 -87 3 24 -103 -66 217 105 -264 -323 -170 39 -10 -173 39
5575 39 125 65 25 66 23 120 105 253 36 -3 22 -181 -189 -179 -40 -93 -4 139 -121 -236 -153 -213 -114 111 -92 243
5601 243 192 -84 -7 -128 222 144 156 157 91 -89 157 83 -90 159 -83 -34 102 21 -162 52 182 -64 -219
5624 -219 302 94 -88 -165 -77 250 -18 107 188 -108 21 -27 -129 -17 102 -242 -187 -92 -281 48 40 289 88
5647 88 -27 196 6 -76 102 90 -20 -278 82 27 -37 -46 -165 1 -78 32 85 163 -49 -238 24 -5 14 -223
5671 -223 -107 194 34 -43 -17 16 86 78 -218 44 -273 -43 30 62 38 -84 16 -14 -260 72 289 -38 162
5694 162 361 58 -94 225 149 351 32 12 -94 -238 76 -139 -218 -235 -166 69 -36 189 48 -169 -75 63
5716 63 -148 61 68 -7 105 43 38 131 -124 -72 -211 -76 -57 2 386 -23 64 -98 4 83 -103 185 190 -50 181
$$ packed form
5551b91L92l77R1P2k8J68k69K0J16K4nR0K1j27L7K83j12l69n9J53K09m9j63K12
5575C9Q6o0m0M1m3R7j5J48k17l9K5k03qJ0J39n3Q9J43k60j15Q3o0R9K25k03L35
5601B43n1k76P7j21L50p8J2Jo6j80K46p4j73K49k42M9J36q1j83K14J30k46j55
5624b19N21k08j82p7Q8L27k68J25Q1k96J29m8j02J12J19l44N5R5j89L29qK49k01
5647H8j15K23j90q2J78j2j10k58L60n5o4rj19J66p9J10N3P8k12j89K62k9J9k37
5671b23J16L01j60p7K6L3P0qk96K62l17K30P3L2k4j22J00l0k46L32K17l27K00
5694A62J99l03j52L19p6K02l19k0j06j44L14k15p9j7O9K35j05K25j41k17R4J38
5716F3k11K09Pp5J12o2nR3k55N2j39J35J9N9L84m09Q7j62J02P9j86K88Nk40K31
$$ plain form
5741 181 12 208 103 -84 -121 -212 -7 -176 -125 -51 5 -137 228 176 -131 264 26 310 320 4 159 125 -38
5764 -38 53 11 -104 228 50 179 34 105 -147 -273 -57 -136 -93 66 -172 161 -87 193 148 184 -47 441 117
5787 117 22 109 -21 30 -269 -404 163 -319 -286 101 -262 -141 -107 -66 184 21 -7 -90 194 102 -34 232 285
5810 285 192 116 82 47 -35 -130 -47 -36 132 -184 -274 226 132 168 -36 15 -35 209 72 108 -186 150 269 18 -153
5835 -153 -104 36 87 112 -155 -211 5 -141 -93 268 -82 14 -41 -44 -7 325 229 191 128 184 75 -96 174 -296 -195
5860 -195 -100 -198 150 -273 -89 -358 98 287 43 26 237 -170 5 -119 72 281 -195 224 -42 106 10
5881 10 -126 9 -281 -182 -53 -107 -247 -99 -106 107 204 115 -127 12 117 260 355 280 47 -15 -71 -107 -210 138
5905 138 128 -195 -111 -68 -22 -193 -223 11 56 -47 -33 -60 260 242 415 132 -44 -9 -153 192 224 -247 181 -261
$$ packed form
5741A81j69J96j05j87l7r1K05j69N1P4N6j42L65n2l07L95k38K84J0l16J55l4j63
5764c8R1m2j15L32j78J29j45P1k52j26K16p9M3J59k38L33k48K80m5L6k31M88l24
5787A17r5Q7j30N1k99j35N67m82L3L87l63J21L4M1K50j63k8q3K84r2j36K66N3
5810B85r3p6l4l5q2r5Q3J1J68l16r0N00r4L6k04N1n0K44j37L6k94L36J19k51j71
5835a53M9J40N1K5k67n6K16j46M8L61l50R6n5lL7L32r6l8o3N6j09j71K70m70J01
5860a95R5r8L48m23J84k69M56J89k44j7K11m07J75j24J91K09m76M19k66J48r6
5881A0j36J35k90R9J29n4j40J48pK13R7q9k42J39J05J43R5p5k33o2n6l6j03L48
5905A38j0l23Q4M3M6j71l0K34M5j03J4k7L20j8J73k83j76L5j44L45L2m71M28m42
$$ plain form
5929 -261 -198 -237 -184 -44 -19 -159 19 -176 232 202 -14 95 228 175 -4 233 239 -151 98 -86 90 -127 -163
5952 -163 143 246 -62 -371 35 -70 -198 -83 -2 50 -16 138 192 34 39 174 74 -220 27 -98 -164 -272
5974 -272 -63 -158 240 -167 -102 -77 91 316 100 205 134 -192 -97 64 8 116 -133 150 -131 -69 -329 -398 -197
5997 -197 -355 -161 20 -71 294 96 -22 244 -82 -82 200 226 263 97 112 112 66 162 50 -89 -100 -74 -327 -179
6021 -179 47 115 -31 -182 115 38 216 226 330 90 235 -193 -82 157 -184 -138 -324 -148 -158 -255 -33 -57
6043 -57 -182 21 56 -186 -12 260 -65 153 57 -151 86 -42 107 -34 -48 -25 -244 89 -75 97 -107 -61
6065 -61 -47 -200 128 -143 -47 225 139 -11 166 73 305 151 50 105 186 107 34 22 -123 -34 -263 -199 -254 42
6089 42 -102 -63 138 54 200 306 -108 294 220 160 214 4 77 131 -27 -60 -178 -226 -227 -283 -337 -82 -116 62 100
$$ packed form
5929b61O3l9N3J40K5j40J78j95M08l0k16J09J33n3j79K37Ol90K49j84J76k17l6
5952a63L06J03l08l09M06j05j28J15Q1N2o6J54N4j58NJ35j00k94K47j25o6j08
5974b72K09r5L98m07O5K5J68K25k16J05p1l26R5J61n6J08k49K83k81O2k60o9K01
5997a97j58J94J81r1L65j98j18K66l26%K82K6L7j66J5%m6R6j12j39j1K6k53J48
6021a79K26O8j46j51K97p7J78J0J04k40J45m28J11K39l41M6j86J76j0r7K22k4
6043e7j25K03L5k42J74K72l25K18r6k08K37j28J49j41j4K3k19L33j64J72k04M6
6065f1J4j53L28k71R6K72q6j50J77r3K32j54j01N5Q1p9p3j2j45Q9k29O4n5K96
6089D2j44L9K01q4J46J06m14M02p4o0N4k10P3N4j58l3j18m8jn6n4K55l4J78L8
$$ plain form
6114 100 -59 269 -13 495 -4 212 200 211 129 349 170 46 -228 172 -220 -80 -86 -133 -158 -38 -47 146 -21
6137 -21 -67 -114 91 188 385 -43 98 209 61 -83 99 -143 -16 -171 -318 -321 -181 -105 -46 -33 -26 -167 -3 130
6161 130 261 308 218 122 157 159 -86 -30 -24 30 -37 -150 -134 -251 26 327 -52 -66 81 21 82 134 -268 35 89 -105
6187 -105 -61 347 202 427 -27 -119 -38 -263 -311 -73 -295 -77 -274 -75 99 -75 81 122 -229 -69 452 -59
6209 -59 147 157 129 243 117 138 -296 345 -176 -48 -183 -54 -279 -267 26 -52 -186 89 180 80 -120 246
6231 246 283 223 229 322 254 131 -254 127 -41 -55 -186 -215 -47 -16 15 -194 39 -35 81 -166 281 153 139 181
6255 181 -67 295 332 80 151 103 25 -13 -116 -51 -68 -3 -99 -370 -210 -148 0 117 44 36 147 145 343 -16 234
6280 234 264 -27 -185 -194 -161 -287 -148 -111 -111 -285 8 -9 -303 -47 -157 220 73 415 203 136 -66 12 36 143
$$ packed form
6114A00j59L28k82N08m99K16j2J1q2K20j79j24k74M00l92J40om7k5J20rJ93j67
6137b1m6m7K05R7J97m28J41J11j48j44J82k42J27j55j47lJ40P6N9J3Pj41J64J33
6161A30J31M7r0r6L5Kk45N6ON4o7j13J6j17K77L01l79j4J47o0O1N2m02L03N4j94
6187a05M4M08j45K25m54r2Q1k25m8K38k22K18j97J99J74j74J56M1l51J60N21n11
6209e9K06J0k8J14j26K1m34O41n21J28j35J29k25J2K93p8j34K75R1j00k00L66
6231B46L7o0OR3o8j23l85L81j68j4j31k9J68L1L1k09K33p4J16k47M47j28j4M2
6255A81k48L62L7k52P1m8p8l8j03O5j7O5r6k71J60O2J48J17p3qJ11kJ98l59K50
6280B34L0k91j58rL3j26J39L7%j74K93j7k94K56j10L77j47L42k12o7k02P8K4J07
$$ plain form
6304 143 137 -309 -7 -365 -149 16 -412 1 47 -125 -235 33 -48 74 153 97 293 260 -20 118 -50 299
6326 299 118 -124 -170 -147 -225 -314 -43 -404 -77 -230 -97 146 -222 59 323 -30 262 90 44 128 228 396
6348 396 -97 -137 -257 17 -190 -80 -237 -65 -85 -169 -97 62 -76 -180 46 286 106 113 27 291 11 120
6370 120 46 -23 -36 87 -229 -162 0 -128 -76 -59 127 -111 90 224 -81 98 228 54 385 217 -30 241
6392 241 294 -73 245 138 -138 61 -32 -267 -317 -87 -43 240 -279 216 62 151 -30 35 270 148 337 155
6414 155 268 125 6 -194 6 53 -113 -295 -136 -156 148 -9 -4 -173 8 220 3 301 -17 299 325 238
6436 238 233 -11 81 -157 -143 -45 -278 -59 -64 -243 -80 -54 -129 19 -81 -13 241 92 -70 -330 184 309 112
6459 112 57 74 142 126 -16 -191 -28 -115 -55 -420 -162 -354 23 6 2 382 100 203 152 73 320 56 181 -198
$$ packed form
6304A43om46L02l58K16J65m28M13M6j72j10K68q1J22P9n6J96l3k80J38j68L49
6326B99j81k42m6K3p8q9K71l61L27j53J33K43l68K81K64l53K92j72m6Q4J00J68
6348C96m93m0j20K74k07J10j57J72k0q4P2J59j38j04K26K40j80Pq6K64k80J09
6370A20p4o9j3J23l16O7J62j28N2J7J86k38K01J34l05J79J30j74L31j68k47K71
6392B41N3l67L18j07k76J99r3k35n0K30M4K83n19M95j54Q9j81O5K35j22J89j82
6414A55J13j43j19k00K00M7j66j82J59k0L04j57Nj69J81K12k17K98l18L16K6q7
6436B38nk44R2k38J4R8k33K19nj79J63K6p5J48j00O8K54j49j62k60N14J25j97
6459A12n5J7O8j6j42j75J63q7O0l65K58j92L77j7mL80k82J03n1p9K47k64J25l79
$$ plain form
6483 -198 72 -25 109 21 -198 105 -228 -51 -3 -133 -225 252 -269 51 128 163 -8 335 33 160 280 80
6505 80 150 -65 35 -112 -180 -9 -87 -290 -323 -84 -296 -298 -51 94 68 17 222 457 50 158 119 113 -14 221
6529 221 -1 -73 -69 -102 -384 -139 -127 -329 50 74 27 -73 -73 128 -107 125 376 240 229 0 208 10 -11 117
6553 117 -186 102 -185 -222 -187 -306 -215 -30 216 170 177 52 110 227 -52 353 -47 123 232 122 127 -38 -112
6576 -112 -168 -51 -369 -72 -159 -82 -23 -77 -100 142 275 392 135 112 18 -48 237 172 293 62 -25 -57 30 -43 -340
6601 -340 -366 -444 -381 -95 -282 -271 26 103 245 79 112 104 289 -25 39 44 -162 179 13 -345 -220 -89 -97 -46 -259
6626 -259 -234 -185 56 -104 -183 -23 154 203 188 -38 454 168 57 177 -115 84 -274 -123 -291 -100 -61 -134
6648 -134 -426 -186 35 -19 -76 -78 -4 340 257 49 67 304 339 -27 36 -263 156 -61 78 -182 384 -207 -264
$$ packed form
6483a98K70r7J34q8k19L03l33J77M8j30r2M77n21L20P7L5j71L43l02J27J20k00
6505H0P0k15J00j47o8J71p8k03l3K39k12kK47J45k6n1K05K35m07J08l9oj27K35
6529B21k22p2Ml3k82K45J2k02L79K4m7j00%K01k35K32K51j36j1k29K08j98k1J28
6553A17l03K88k87l7L5j19R1J85K46m6Pj25N8J17k79M05m00J70J09j10Nj65p4
6576a12n6J17l18K97q7P7N9n4k3K42J33J17k57k3r4o6K85o5J21k31q7l2Q7p3k97
6601c40k6p8O3K86j87J1K97P7J42j66L3qJ85l14O4Nk06L41j66l58J25J31qN1k13
6626b59K5M9K41j60p9J60J77M9j5k26M92k86j11J20k92J99l58J51j68J91L9p3
6648a34k92K40K21n4n7kP4L44q3k08J8K37L5l66O3k99M19k17J39k60N66n91n7
$$ plain form
6671 -264 -284 -224 -73 150 219 52 -49 190 21 37 332 153 44 -183 -66 -227 -84 -390 -216 -185 -150 69
6693 69 -366 109 -116 5 -61 150 161 -65 301 69 192 518 237 219 212 -181 16 -153 -227 -210 -99 -190 -85
6716 -85 10 -137 -32 -13 59 164 164 35 132 468 159 21 126 223 167 -161 -226 -269 -119 -106 -143 -265 -85 -114 -95
6741 -95 254 157 435 210 238 303 194 415 349 217 204 15 -2 150 -59 -243 -129 10 -243 -199 -293 -176 -5
6764 -5 -68 226 37 275 84 219 28 0 3 -18 181 -139 -243 -133 -17 -155 -314 -261 -121 -234 -220 94 -79
6787 -79 -56 -54 30 470 479 336 174 22 262 123 112 -258 -204 -88 -88 141 -433 -326 -354 10 -336 46 335 259
6811 259 16 181 84 43 93 181 124 168 173 -117 -186 58 115 -83 -327 -275 -24 -305 -213 -54 -205 59 -8 389
6835 389 207 337 308 183 380 -47 198 -12 -232 -125 188 -256 -168 -274 -156 -45 -374 -285 98 -129 105
$$ packed form
6671b64k0O0J51K23O9j67j01K39j69J6K95j79j09k27J17j61J43l06J74L1L5K19
6693F9m35M75k25J21o6K11J1k26L66k32J23L26k81j8pl93J97j69p4J7J11r1J05
6716h5R5j47J05J9P2J05%j29R7L36l09j38J05R7n6l28o5m3J50J3l7j22J80k9J9
6741i5L49r7K78k25K8O5j09K21o6j32j3j89j7J52k09j84J14J39k53M4r4J17J71
6764eo3K94j89K38j91J35j91k8Lk1J99l20j04J10J16j38j59N3J40j13J4L14j73
6787g9K3KQ4M40Rj43j62j52K40j39j1l70N4J16%K29n74J07k8L64l46L82K89p6
6811B59k43J65r7m1N0Q8n7M4Nk90o9K44N7j98k44N2K51k81R2J59j51K64o7L97
6835C89j82J30k9j25J97m27K45k10k20J07L13m44Q8j06J18J11l29Q9L83k27K34
$$ plain form
6856 105 65 285 126 -132 373 317 185 -378 52 -30 -211 -355 64 61 -129 -294 -215 -2 -189 17 -209 155
6878 155 -73 -68 459 264 131 107 106 36 110 -371 -14 -357 -350 52 -63 -203 -215 -101 164 53 168 -122 508
6901 508 110 80 187 225 249 76 138 -21 11 -329 -203 -7 -186 -97 -5 59 -162 -264 119 -4 19 249 94
6924 94 75 153 398 308 135 177 178 -133 -119 -42 -26 -449 -223 -85 -83 -88 -148 -77 -47 114 139 249 23 454 476 141
6950 141 74 63 -151 -30 -29 -5 -138 -15 -138 -123 -68 -176 -185 178 36 -75 69 159 463 399 163 312 179 270
6974 270 361 296 59 -46 -100 -74 -73 -178 -111 -360 -9 -113 -129 -1 -40 62 235 22 249 419 344 210 -26
6997 -26 147 -213 353 -47 -171 -16 -461 -266 31 57 -335 -102 275 -4 9 -88 231 370 -58 169 119 -37
7019 -37 0 60 -214 -168 -230 59 -204 -313 -182 -315 102 -169 -143 -30 39 136 -14 109 241 416 297 498 106
$$ packed form
6856A05m0K20j59k58N05n6j32n63M30q2j81j44M19lj90j65P9K13j87K06k26L64
6878A55k28NN27j95j33k4jp0P4m81L57l43PM02j15j40j2J14K65j11J15k90O30
6901E08l98l0J07L8K4j73O2j59L2l40J26J96j79Q9R2O4k21j02L83j23K3K30j55
6924I4j9P8K45r0j73M2Jl11J4P7J6m23K26J38Kno0P1L0J61K5J10k26M31K2l35
6950A41o7j1k14J21JK4j33J23j23J5N5j08rL63j42j11J44R0L04o4k36J49j33R1
6974B70R1o5k37j05n4K6Jj05O7k49L51j04j6J28l9J02J73k13K27J70p5j34k36
6997b6J73l60N66m00j24J55m45J95K97K6l92K33L77k79J3r7L19J39m28K27n0j56
7019c7L7O0k74M6o2K89k63j09J31j33M17k71K6J13O9R7j50J23J32J75j19K01l92
$$ plain form
7042 106 187 5 -127 -195 158 -142 4 -122 -184 -47 -323 164 -190 -175 32 278 133 132 306 236 212 210 95
7065 95 71 -267 60 15 -68 76 -301 -23 202 -50 -55 149 225 220 -62 284 370 42 -8 108 177 -133 -18 211
7089 211 -86 26 49 -13 -364 -183 -364 -333 -61 -333 152 -121 297 -111 5 207 177 0 251 104 18 -34
7111 -34 -24 -52 -170 -98 -387 -391 -273 -136 58 -308 -201 4 15 19 92 -100 203 246 284 342 -136 188 27 -52 -157
7136 -157 -104 53 -241 -95 -377 -246 -90 245 -124 212 291 429 218 213 246 214 206 -10 -94 -404 181 291 -185
7159 -185 -8 -457 -116 -195 -206 -272 125 -46 -89 175 177 -31 83 105 89 174 20 238 149 -11 -37 -160 -463 -83
7183 -83 -302 -223 -143 -237 -79 56 -64 45 338 247 75 75 177 -14 -14 240 -8 15 -130 -195 -85 -373 -75 -192
7207 -192 -55 -240 -241 -84 135 -55 -128 252 153 273 145 485 274 107 102 84 -71 -105 -91 -124 -27 -154 -190 -283
$$ packed form
7042A06Q1j82j32o8L53l00J46j26o2J37k76M87l54J5K07K46j45jJ74p0k4kj15
7065I5k4l38L27m5q3J44l77K78K25k52nK04P6nk82L46Q6l28n0J16O9l10J15K29
7089B11k97J12K3o2l51J81j81L1K72k72M85k73M18m08J16K02l0j77K51j47q6n2
7111c4J0k8j18P2k89mJ18J37J94l66J07K05J1MP3j92L03M3L8N8m78L24j61p9j05
7136a57N3J57k94J46k82J31J56L35l69L36P9J38k11nL3l2qk16q4l10N85J10m76
7159a85J77m49L41p9j1o6L97j71m3K64Kk08J14K2j6Q5j54K18q9j60k6j23l03L80
7183h3k19P9Q0r4J58J35j20J09K93r1j72%J02j91%K54k48K3j45o5J10k88K98j17
7207a92J37j85jJ57K19j90p3L80r9J20j28L40k11j67nj8j55l4J4l3R7j27l6r3
$$ plain form
7231 -283 -197 -129 -95 296 90 192 133 -103 497 192 132 44 -157 294 293 -20 158 -19 -183 -252 -376 20 -74
7254 -74 -20 201 -80 -71 145 167 98 72 377 181 268 -112 -25 -68 -83 -67 -7 0 -322 114 -84 -339 303 -141 -191
7279 -191 -133 161 208 -3 227 431 231 -43 54 200 131 -282 -64 90 -170 -91 -196 -316 -195 -298 29 -231
7301 -231 56 77 93 116 112 131 262 194 -26 226 78 -84 159 -225 92 -207 6 -190 -142 -203 -97 -10 97
7324 97 39 -156 -121 77 213 451 126 159 135 375 241 -11 -270 -158 -296 -141 -106 -123 149 -231 136 -199
7346 -199 65 69 -19 140 96 241 -135 189 347 -114 -102 317 -357 32 -134 110 -348 -177 0 -42 -91 -118 77
7369 77 -131 -39 -60 158 408 41 136 260 224 41 22 50 -297 348 -152 -106 -8 -195 -222 -19 183 7 -91 -10
7393 -10 -82 280 332 431 45 278 167 236 -101 77 -235 193 14 -210 -66 -88 -153 -114 122 -2 -358 -16 148
$$ packed form
7231b83Q6O8L4L91k06J02n9k36O00l05o0q8k01M51jl13J78j77j64o9j24L96r4
7254g4N4K21k81RK16K2o9k6L05j96Q7l80Q7m3j5J6O0Pl22M36j98k55O42m44n0
7279a91N8K94M7k11K30K04k00k74R7J46o9m13K18J54k60P9j05j20J21j03L27k60
7301b31K87K1J6K3mJ9J31o8k20K52j48j62K43l84L17k99K13j96M8o1J06Q7J07
7324I7n8j95L5J98J36K38l25L3k4K40j34k52k59J12j38J55L5j7K72l80L67l35
7346a99K64Mq8J59m4J45l76L24J58m61J2M19o74L89j66K44m58J71J77m2m9k7J95
7369G7k08R2k1K18K50l67R5J24l6j83j9K8l47O45n00M6R8j87k7K03K02j76r8Q1
7393a0p2L62N2R9l86K33j11O9l37J78l12M28j79k24J44k2o5L9K36j24l56L42J64
$$ plain form
7416 148 13 40 233 52 341 216 284 110 52 -43 -248 -36 -266 -371 -377 -60 -278 -29 14 284 98 -19
7438 -19 110 26 144 17 71 462 292 61 537 83 120 -26 163 -173 -61 -178 -179 -362 197 131 -160 94
7460 94 120 -97 -50 85 234 54 -16 23 100 95 -59 59 -144 -31 -196 -232 -327 -204 215 -52 65 5 -174 116
7484 116 -141 37 170 184 -95 243 240 -18 128 50 -64 -84 -369 -148 113 -110 39 15 -187 33 12 -30 133
7507 133 -109 184 116 -140 164 -194 -47 -222 122 -85 -124 -150 -1 -17 -94 -141 101 52 -183 319 183 21
7529 21 -87 -25 -109 226 118 41 106 47 10 78 -415 95 -15 -200 -2 -135 -92 42 -30 -15 -27 17 -1 49 148
7554 148 217 151 66 359 43 189 -172 -74 -402 -190 124 10 -112 -38 -315 -184 -314 -295 291 -163 32 132
7576 132 138 -5 45 213 192 -103 -83 -2 36 -107 102 -257 210 -24 -90 -289 162 169 -40 138 116 80 410 161
$$ packed form
7416A48j35K7J93j81K89j25O8j74n8r5k05K12k30j05oL17k18K49M3K70j86j17
7438a9J29q4J18j27N4L91j70k31M76m54L7j46J89l36J12j17jj83N59o6k91K54
7460I4K6k17M7J35J49j80p0L9P7nj54J18k03J13j65l6r5J23M19k67J17o0j79K90
7484A16k57J78J33J4k79L38lk58J46p8j14k0k85K21K61k23J49k4k02K20k1m2J63
7507A33k42K93o8k56L04l58J47j75L44k07l9k6J49j6p7m7K42m9k35N02j36j62
7529B1j08O2q4L35j08p7O5n9l7O8m93N10j10j85J98j33M3J34p2J5j2M4j8N0R9
7554A48O9o6q5K93l16J46l61R8l28K12L14j14j22P4k77J31j30J9N86m54J95J00
7576A32Oj43N0J68k1k95K0Q1L8j43K09l59M67k34o6j99M51Pk09J78k2l6L30k49
$$ plain form
7600 161 187 -11 -15 12 140 199 -4 -100 -103 102 -81 -162 36 -102 -142 -52 446 16 -112 44 107 38 416 199
7624 199 208 -51 -37 98 -113 97 -243 -182 -249 -373 -458 -40 -69 -128 12 -233 227 -44 37 -122 123 -72 407
7647 407 88 -88 -97 -275 -79 77 376 -144 -149 -393 -142 -110 104 -58 -134 249 -37 146 239 124 24 -58 75
7670 75 93 233 -260 11 -218 -298 -227 -2 -30 -114 -41 42 -174 42 326 197 324 55 21 180 93 301 82
7693 82 -86 59 -149 -236 -336 -146 24 -48 198 -212 -116 -74 123 198 157 150 -28 -56 393 238 349 -261 116
7716 116 -23 55 182 -34 -247 47 162 -319 127 -29 -36 202 -74 -196 332 154 181 246 177 -149 -8 150
7738 150 -58 110 -19 -293 -219 33 -410 -193 -122 124 300 5 323 236 74 132 -46 244 316 109 219 103
7760 103 -67 156 102 160 -145 -41 -63 -133 -82 -415 -15 22 21 7 -73 150 254 -65 221 261 -156 -200 57 171
$$ packed form
7600A61K6j98mK7J28N9k03r6lK05j83q1J98j38m0R0M98m30j28J56O3o9L78k17
7624A99Rk59J4J35k11K10l40O1o7j24q5M18k9n9J40k45M60k71Q1j59K45j95M79
7647D07l19j76rj78J96J56K99n20nk44K51L2K14j62p6L83k86J83R3j15j00q2J33
7670G5J8J40m93K71k29q0P1K25k8q4P3Q3k16K16K84j29J27k69l4J59q7K08k19
7693H2j68J45k08q7j00J90J70p2K46m10R6M2J97P5m1pj78k8M49j55J11o10L77
7716A16j39P8J27k16k13K94J15m81M46j56pK38k76j22N28j78K7O5o9l26J41J58
7738A50k08J68j29k74P4K52m43K17P1K46J76k95L18q7j62N8j78K90P2k07J10j16
7760A03j70K23n4N8l05J04k2p0N1l33M00L7jj4q0K23J04l19K86M0m17m4K57J14
$$ plain form
7784 171 130 -124 40 192 181 35 -149 42 102 -14 -35 131 -230 -92 56 82 147 37 192 87 33 12 53
7807 53 14 -221 -55 -43 -89 -157 131 0 -157 -315 -56 -107 172 34 112 -4 142 -84 -143 13 -184 10 -46
7830 -46 56 -194 4 -191 -290 -9 -306 205 145 274 93 -92 194 -149 349 -41 161 102 177 129 -118 -121 -51
7853 -51 66 -227 -355 -38 -155 -7 -137 -230 -113 201 -1 239 -37 184 78 -14 -32 -76 141 -47 -24 -5
7875 -5 66 -94 -210 -60 -71 -258 10 23 99 -52 -3 -77 192 -194 58 229 297 -169 -82 102 253 -81 -64 -103
7899 -103 -211 -108 -110 -158 -75 90 -176 105 -220 -256 48 63 104 64 228 358 -35 -55 246 147 -74 -327 -217
7922 -217 -153 -338 -214 -248 61 75 -203 -84 -195 228 107 -13 481 -96 -215 179 17 -235 -11 -120 -117 -246
7944 -246 -2 245 -348 118 47 -22 -7 14 6 68 -27 -90 364 -237 84 -299 72 50 -3 392 -5 -36 -131 -197 157
$$ packed form
7784A71m1k54J64J52j1j46j84J91O0j16k1J66l61J38J48K6O5j10J55j05n4k1M1
7807E3l9k35J66J2m6o8K88j31j57j58K59n1K79j38P8j16J46k26n9J56j97J94n6
7830d6J02k50J98j95r9K81k97N11o0J29j81j85K86l43M98l90K02n9P5m8k47lP0
7853e1J17k93j28L17j17J48j30r3J17L14k02K40k76K21j06r2j8m4K17j88K3J9
7875eP1j60j16J50j1j87K68J3P6j51M9p4K69l86K52J71O8m66Q7J84J51l34J7l9
7899a03j08J03km8Q3J65k66K81l25l6L04J5M1m0J64J30l93k0L01r9k21k53J10
7922b17O4j85J24l4L09J4k78J19j11M23j21j20M94n77j19L94j62k52K24j09Lj29
7944b46K44K47n93M66p1o9J5K1qO2r5o3M54o01L21l83L71k2n3L95l97l1r5o6L54
$$ plain form
7969 157 -26 -106 -18 167 124 223 199 19 27 29 71 -51 -56 89 -174 -57 -138 -79 -79 -361 -175 -188 -105 175 -224 -86
7995 -86 156 -155 -21 -92 15 10 360 -161 257 -35 -106 -161 10 31 -170 -2 -70 62 25 54 78 107 -86 56
8019 56 -107 -35 180 127 17 78 50 217 292 -53 -285 -20 -310 207 -17 31 -188 78 113 47 -378 -29 243
8042 243 84 145 304 -50 -87 308 -140 -61 44 174 46 154 10 -63 -176 -109 -90 -138 15 -68 120 108 -164
8065 -164 145 403 -88 -93 -71 12 54 -164 -313 65 -190 168 -161 -88 -10 -50 -266 -122 -104 -57 -72 -274 -39 -135
8089 -135 -69 200 251 194 -335 -34 242 -204 -44 99 -35 -157 -159 34 -408 68 -2 77 -41 53 115 53 113 334
8113 334 -10 156 111 -33 -36 90 -147 70 115 -185 54 -75 109 -41 -36 -83 166 106 -180 0 69 11 -92
8136 -92 -25 35 3 152 -242 -80 95 29 -5 -120 238 130 -26 -220 342 -266 22 83 -37 -64 6 64 -18 209
$$ packed form
7969A57j83q0Q8J85m3R9k4j80QKM2j22nJ45k63J17q1N9%k82J86j3Q3K80l99J38
7995h6K42l11J34p1J07nL50n21M18k92p1n5J71K1k01J68o8J32l7K9K4K9j93J42
8019E6j63P2K15n3j10O1k8J67P5l45k32K65k90N17k24M8k19K66L5o6m25L49K72
8042B43j59O1J59l54l7L95m48P9J05J30j28J08j44p3j13O7J9m8J53q3J88j2k72
8065a64L09K58m91nK2Q3M2k18j49L78k55L58l29P3P8m0k16J44J8M7j5k02K35r6
8089a35O6K69N1n7n29L01K76m46J60J43j34j22kJ93m42M76p0P9j18R4O2o2O0K21
8113C34l44J66m5j44lJ26k37K17M5l00K39j29J84j50Nm7K49o0k86J80O9n8j03
8136i2O7O0l2J49l94J62J75o6l4j15L58j08j56j94N62o08K88O1j20k7P0N8q2K27
$$ plain form
8160 209 -23 -226 -96 -19 -147 -169 -10 8 16 -166 231 -115 -182 -102 -189 143 -285 -4 -42 148 223 -59 -4 -104
8184 -104 15 113 28 97 -28 -97 -203
$$ packed form
8160B09k32k03J30P7j28k2J59J8Qj82L97l46o7Q0q7L32m28K81l8J90P5k82N5j00
8184a04J19R8q5O9j25o9j06
8191b03
$$ Imaginary data points
##PAGE= N=2
##DATA TABLE= (X++(I..I)), XYDATA
$$ plain form
0 0 0 0 0 0 0 0 0 0 0 0 0 0 0 -4 8 -8 8 -8 9 -16 16 -20 24 -26 33 -39 44 -50 58 -67 78 -89 101 -114 129 -145
36 -145 162 -183 204 -227 253 -283 312 -345 382 -421 466 -512 566 -623 688 -756 833 -919 1016
55 1016 -1125 1251 -1392 1559 -1755 1990 -2281 2645 -3126 3784 -4746 6298 -9233 16792 -85692
70 -85692 -148674 -85355 -108842 -69516 -16612 9640 13109 75764 117383 111942 107397 125237 97750
83 97750 61917 56195 44501 -6911 -39127 -53998 -83537 -107773 -95339 -88545 -96534 -83626 -54579
96 -54579 -40260 -13700 31552 56495 61910 83942 99303 89947 89480 96315 69037 28947 12716
109 12716 -7679 -48360 -65176 -62257 -85859 -108962 -91253 -72572 -71688 -45734 -2094 10065 15847
122 15847 52342 80297 77686 85643 100844 80391 49425 44636 32033 -4682 -27387 -37360 -66325
$$ packed form
0@%%%%%%%%%%%%%mJ2j6J6j6J7k5L2l6M4n0N9p2Q3r4J08j25J45j67J90k15K43k74
36a45L07l45L87m31M80n36N95o57P27q03Q87r78J078j189J311j444J589j752J935
55A016k141K376k643K951l314L745m271M926n771O910q530J1044j5531K6025j02484
70h5692o2982O3319k3487L9326N2904K6252L469O2655M1619n441m545J7840k7487
83I7750l5833n722j1694n1412l2216j4871k9539k4236J2434O794p989J2908K9047
96e4579J4319K6560M5252K4943N415K2032J5361r356m67O835k7278m0090j6231
109A2716k0395m0681j6816K919k3602k3103J7709J8681Q84K5954M3640J2159N782
122A5847L6495K7955k611P957J5201k0453l0966m789j2603l6715k2705r973k8965
$$ plain form
135 -66325 -90982 -85333 -77548 -80972 -67440 -42156 -30402 -13784 20880 46237 56930 73080 84387
148 84387 76480 70580 71075 55026 28368 11331 -9574 -41397 -57127 -59114 -72117 -83945 -73485
161 -73485 -63864 -60889 -38665 -5278 10290 22239 49443 67044 66194 74653 85647 70599 48264
174 48264 39163 22224 -8319 -26154 -34521 -56358 -75981 -74104 -69524 -70812 -57440 -33812 -20462
187 -20462 -7238 18212 39638 50122 63664 74527 70698 62204 57071 44259 23843 7320 -10734
200 -10734 -34704 -51343 -58928 -67632 -72295 -64763 -56223 -48717 -31146 -7062 9700 25340 46728
213 46728 59135 60824 66214 69428 58632 43303 33033 15667 -9294 -25448 -35149 -51640 -64614
226 -64614 -64317 -61875 -61224 -49443 -29751 -15422 -1130 20054 37758 47648 57851 66792 65200 57214
$$ packed form
135f6325k4657N649P785l424J3532K5284J1754J6618L4664K5357J0693J6150J1307
148H4387p907n900M95j6049k6658j7037k0905l1823j5730j987j3003j1828J0460
161g3485R621K975K2224L3387J5568J1949K7204J7601q50Q459J0994j5048k2335
174D8264r101j6939l0543j7835q367k1837j9623J877M580j288J3372K3628J3350
187b0462J3224K5450K1426J0484J3542J0863l829q494n133j2812k0416j6523j8054
200a0734k3970j6639p585q704m663P532Q540P506J7571K4084J6762J5640K1388
213D6728J2407J689N390L214j0796j5329j0270j7366k4961j6154r701j6491j2974
226f4614K97K442O51J1781J9692J4329J4292K1184J7704R890J0203Q941j592p986
$$ plain form
240 57214 49760 37147 18370 1471 -14251 -32123 -47012 -55936 -61575 -62895 -57910 -48652 -37323
253 -37323 -22124 -4426 11973 27285 42919 52935 57142 59733 58110 49001 37162 25426 9103
266 9103 -10010 -25205 -36941 -49867 -58595 -58151 -56401 -52631 -41303 -25657 -11219 3757 21724
279 21724 36687 46140 53539 59078 57335 49517 41184 29427 13603 -3346 -17550 -31152 -43721
292 -43721 -51726 -54701 -54204 -50290 -41240 -29210 -15846 -722 14719 28788 40342 48654 53544 54576
306 54576 50448 42353 31881 18572 3700 -11787 -25018 -37104 -46459 -52077 -52474 -49702 -43988 -33076
320 -33076 -19752 -6389 7634 22254 34483 43029 48687 51985 49118 42359 34010 22872 8625
333 8625 -5680 -18482 -30543 -41446 -47391 -49416 -48957 -44627 -35274 -24041 -11749 2174 16252
$$ packed form
240E7214p454j2613j8777j6899j5722j7872j4889q924n639j320M985R258J1329
253c7323J5199J7698J6399J5312J5634J0016M207K591j623r109j1839j1736j6323
266I103j9113j5195j1736j2926q728M44J750L770J1328J5646J4438J4976J7967
279B1724J4963R453P399N539j743p818q333j1757j5824j6949j4204j3602j2569
292d3721q005k975M97L914R050J2030J3364J5124J5441J4069J1554Q312M890J032
306E4576m128q095j0472j3309j4872j5487j3231j2086r355n618l97K772N714J0912
320c3076J3324J3363J4023J4620J2229Q546N658L298k867o759q349j1138j4247
333H625j4305j2802j2061j0903n945k025M59M330R353J1233J2292J3923J4078
$$ plain form
346 16252 28370 38078 45236 48929 48577 43749 36404 26520 14013 394 -12824 -24449 -34683 -42431
360 -42431 -46451 -46403 -43260 -37288 -27147 -15586 -3470 9319 22393 32794 39677 45246 46915 43891
374 43891 37470 30008 19141 5097 -7217 -18585 -30338 -39223 -43564 -44775 -44629 -39015 -29584 -19810
388 -19810 -8442 4865 17186 26917 35517 42357 43762 42122 38300 31109 20298 9405 -1540
401 -1540 -14823 -25671 -33253 -39731 -43276 -41870 -38171 -32760 -23597 -11090 -159 10753 23663 32648
415 32648 36910 41548 43300 38657 31859 25764 14357 792 -9555 -18524 -29184 -36700 -38540 -39795
429 -39795 -39904 -33447 -23698 -15430 -5507 7784 17681 24702 33491 40102 39898 37413 35170 27132 15739
444 15739 6989 -2116 -15328 -25308 -31179 -37228 -41001 -37874 -32581 -28502 -19795 -7626 1492 10708
$$ packed form
346A6252J2118R708P158L693l52m828p345r884j2507j3619j3218j1625j0234p748
360d2431m020M8L143N972J0141J1561J2116J2789J3074J0401O883N569J669l024
374D3891o421p462j0867j4044j2314j1368j1753q885m341j211J46N614R431R774
388a9810J1368J3307J2321R731Q600O840J405j640l822p191j0811j0893j0945
401a540j3283j0848p582o478l545J406L699N411R163J2507J0931J0912J2910Q985
415C2648M262M638J752m643o798o095j1407j3565j0347q969j0660p516j840j255
429c9795j09O457R749Q268R923J3291R897P021Q789O611k04k485k243q038j1393
444A5739q750r105j3212r980n871o049l773L127N293M079Q707J2169R118R216
$$ plain form
458 10708 23197 31595 33786 36635 38373 33017 26561 21688 11914 -1477 -11002 -18211 -28437 -34699
472 -34699 -33899 -34874 -36478 -29558 -19929 -13520 -3768 10231 18794 23188 30739 37206 35724 33482 31920
487 31920 23612 11026 3996 -3980 -16005 -24231 -27388 -33337 -37811 -33706 -27312 -23655 -15652 -3542
501 -3542 3549 10001 21718 29939 31512 33509 35200 28957 21315 17632 10088 -2923 -11205 -17152 -27803
516 -27803 -33585 -31281 -30664 -32058 -25355 -16265 -11468 -2472 11434 19559 21988 28591 33264 29942 27753
531 27753 28034 20491 8222 1581 -5308 -16578 -23315 -24059 -28996 -34083 -30090 -24384 -21605 -13286 -756
546 -756 5521 9723 20090 27539 28084 30861 33205 26644 18065 14036 7150 -4181 -10972 -15513 -24838
561 -24838 -31253 -29165 -27421 -27850 -20558 -11942 -8113 -1535 10525 18422 21173 26983 31045 26910 23269
$$ packed form
458A0708J2489Q398K191K849J738n356o456m873r774j3391r525p209j0226o262
472c4699Q00r75j604O920R629O409R752J3999Q563M394P551O467j482k242j562
487C1920q308j2586p030p976j2025q226l157n949m474M105O394L657Q003J2110
501c542P091O452J1717Q221J573J997J691o243p642l683p544j3011q282n947j0651
516b7803n782K304O17j394O703R090M797Q996J3906Q125K429O603M673l322k189
531B7753K81p543j2269o641o889j1270o737p44m937n087L993N706K779Q319J2530
546g56O277M202J0367P449N45K777K344o561q579m029o886j1331o791m541r325
561b4838o415K088J744m29P292Q616L829O578J2060P897K751N810M062m135l641
$$ plain form
576 23269 23745 17452 6815 1286 -5300 -16835 -23800 -23645 -26793 -30400 -26478 -21355 -19133 -11849 602
591 602 7515 11343 19866 25534 24967 26309 29308 23973 15376 11111 4286 -6277 -12419 -14944 -22372
606 -22372 -28269 -26537 -25157 -24731 -18272 -8997 -4801 455 10350 17200 19812 25381 29433 25556 21241
621 21241 19912 13968 4733 -270 -6017 -15838 -22458 -23040 -25042 -27093 -22422 -17337 -15187 -9423 1148
636 1148 7666 12028 19760 24373 23047 23127 24602 20398 13361 9484 3267 -7140 -13191 -15607 -20853
651 -20853 -25442 -23818 -22390 -22188 -16829 -7820 -2624 2422 10815 16646 18573 22657 25999 23305 19255
666 19255 16738 10890 2176 -2248 -6941 -14527 -20366 -21230 -22808 -24140 -20115 -14552 -11807 -6646 1924
681 1924 7343 11918 18338 22660 22185 21373 21531 17529 11488 7235 2036 -6732 -12660 -15611 -19782 -23275
$$ packed form
576B3269M76o293j0637n529o586j1535o965J55l148l607L922N123K222P284J2451
591F02O913L828Q523N668n67J342K999n335q597m265o825j0563o142k525p428
606b2372n897J732J380M26O459R275M196N256R895O850K612N569M052l877m315
621B1241j329n944r235n003n747r821o620n82k002k051M671N085K150N764J0571
636A148O518M362P732M613j326Q0J475m204p037l877o217j0407o051k416n246
651b0853m589J624J428K02N359R009N196N046Q393N831J927M084L342k694m050
666A9255k517n848q714m424m693p586n839q64j578j332M025N563K745N161Q570
681A924N419M575O420M322m75q12J58m002o041m253n199q768n928k951m171l493
$$ plain form
697 -23275 -21765 -19564 -18575 -13945 -6832 -1436 3626 10815 15705 17980 20798 22056 20352 16966 14196
712 14196 9063 1726 -3485 -8183 -13970 -18444 -19893 -20840 -21453 -18264 -13617 -10055 -4681 2128 7609
727 7609 11720 16795 20499 20616 19939 18809 15201 9731 5253 -332 -6807 -11812 -15165 -18525 -20818 -19800
743 -19800 -17626 -15414 -11494 -5392 -433 4391 10748 14936 17316 19260 20223 18592 15371 12093 7835
758 7835 1393 -3811 -8586 -13537 -17244 -18607 -19217 -19102 -16427 -12147 -7812 -3093 2603 7927 12027 15664
774 15664 18261 18917 17929 16217 12853 7994 3373 -1448 -6877 -11274 -14616 -17253 -18635 -18095 -16449 -13710
790 -13710 -9798 -4451 657 5201 9996 13981 16584 18037 18031 16623 13512 9989 5396 292 -4659 -8593
806 -8593 -13079 -16025 -17197 -17538 -16619 -14016 -10466 -6040 -1578 3529 8141 12020 15076 16713 17353 16441
$$ packed form
697b3275J510K201R89M630P113N396N062P189M890K275K818J258j704l386k770
712A4196n133p337n211m698n787m474j449r47o13L189M647L562N374O809N481
727G609M111N075L704J17o77j130l608n470m478n585o475n005l353l360k293J018
743a9800K174K212L920O102M959M824O357M188K380J944R63j631l221l278m258
758G835o442n204m775m951l707j363o10J15K675M280M335M719N696N324M100L637
774A5664K597O56r88j712l364m859m621m821n429m397l342k637j382N40J646K739
790a3710L912N347N108M544M795L985K603J453oj408l111l523m593n104m951l934
806h593m486k946j172l41R19K603L550M426M462N107M612L879L056J637O40r12
$$ plain form
822 16441 14378 11113 6832 2383 -2414 -6961 -11129 -14101 -16200 -17156 -16531 -14448 -11635 -7825 -3494
837 -3494 1406 6009 9998 13002 15384 16177 16235 14514 11740 8501 3929 -194 -5042 -8682 -12265 -14464
853 -14464 -16038 -15879 -14634 -12481 -8783 -4777 -685 3534 7894 11416 13973 15511 15735 14626 12603
868 12603 9594 5756 1512 -2777 -7189 -10552 -13011 -14742 -15025 -14332 -12439 -9886 -6204 -2063 2087
883 2087 5842 9860 12371 13887 14775 14544 12768 9955 7153 2995 -1057 -5236 -8479 -11794 -13715 -14744
899 -14744 -14211 -13237 -10821 -7521 -3789 -28 4155 7986 10621 12866 14295 13946 12597 11062 8212 4015
915 4015 497 -3317 -7144 -10066 -12104 -13434 -14063 -12996 -10873 -8538 -5078 -978 2396 5803 9211
930 9211 12113 12971 13622 13409 11396 8606 5760 2537 -2002 -5400 -8080 -11304 -13184 -12870 -12362 -11538 -9495
$$ packed form
822A6441k063l265m281m449m797m547m168k972k099r56O25K083K813L810M331
837c494M900M603L989L004K382P93N8j721k774l239m572m123m848l640l583k199
853a4464j574J59J245K153L698M006M092M219M360L522K557J538K24j109k023
868A2603l009l838m244m289m412l363k459j731k83O93J893K553L682M141M150
883B087L755M018K511J516Q88k31j776k813k802m158m052m179l243l315j921j029
899a4744N33R74K416L300L732L761M183L831K635K245J429l49j349j535k850m197
915D015l518l814l827k922k038j330o29J067K123K335L460M100L374L407L408
930I211K902Q58O51k13k013k790k846l223m539l398k680l224j880L14N08Q24K043
$$ plain form
947 -9495 -5589 -2527 680 4988 7999 9896 11763 13358 12377 11056 9904 6882 2851 -137 -3298
962 -3298 -7414 -9852 -11241 -12338 -13176 -11479 -9051 -7526 -4437 204 3123 5672 9159 11432 11702 12048
978 12048 12142 9778 6618 4402 1465 -3095 -5571 -7719 -10545 -12602 -11681 -11032 -10419 -7809 -4165 -2005
994 -2005 889 5223 8095 9657 11301 12747 11233 9521 8590 5708 1584 -1114 -3513 -7574 -10242
1009 -10242 -10438 -11073 -12044 -9715 -7404 -6217 -2880 1421 3979 5817 8945 10831 10595 10690 10809 8762
1025 8762 5368 3468 935 -3490 -6091 -7284 -9519 -11559 -10553 -9843 -9333 -6679 -2866 -818 1766
1040 1766 5425 8076 8487 10575 11717 9710 8263 6948 4555 99 -1867 -3701 -7153 -9570 -9512 -10132
1056 -10132 -10860 -8577 -5869 -4872 -2475 1453 4138 5696 8685 10506 9707 9072 9593 7489 4451 2595
$$ packed form
947i495L906L062L207M308L011J897J867J595r81j321j152l022m031k988l161
962c298m116k438j389j097q38J697K428J525L089M641K919K549L487K273K70L46
978A2048R4k364l160k216k937m560k476k148k826k057R21O49O13K610L644K160
994b005K894M334K872J562J644J446j514j712r31k882m124k698k399m061k668
1009a0242j96o35r71K329K311J187L337M301K558J838L128J886k36R5J19k047
1025H762l394j900k533m425k601j193k235k040J006P10N10K654L813K048K584
1040A766L659K651M11K088J142k007j447j315k393m456j966j834l452k417N8o20
1056a0132p28K283K708R97K397L928K685J558K989J821p99o35N21k104l038j856
$$ plain form
1072 2595 -75 -3920 -6330 -6976 -8721 -10828 -9146 -8152 -7955 -5732 -1788 374 2570 5687 7535 8050
1088 8050 9006 10119 8585 6689 5850 3438 -391 -2558 -3686 -6981 -8964 -8710 -9234 -9768 -7676 -5057
1104 -5057 -3616 -1600 2153 4253 5624 8107 9820 9020 8194 8031 6004 2911 1473 -260 -4267 -6362
1120 -6362 -7045 -8581 -9483 -8016 -6881 -6647 -4357 -1040 919 2584 5731 7569 7455 8113 8881 7520
1136 7520 5661 4880 2415 -982 -2848 -4038 -6674 -8297 -8113 -8144 -8626 -6479 -3648 -2503 -444 2680
1152 2680 4667 5627 7564 9031 7591 7065 6807 4701 2216 739 -1075 -4320 -5913 -6653 -7769 -8692
1168 -8692 -7554 -6076 -5377 -3351 -493 1191 2871 5546 7319 7293 7643 7903 6427 4667 3671 1890
1184 1890 -1346 -3430 -4700 -6291 -7534 -7274 -7073 -6773 -5254 -3093 -1734 101 3183 4826 5620 6987
$$ packed form
1072B595k670l845k410o46j745k107J682R94J97K223L944K162K196L117J848N15
1088H050R56J113j534j896q39k412l829k167j128l295j983K54n24n34K092K619
1104e057J441K016L753K100J371K483J713q00q26j63k027l093j438j733m007k095
1120f362o83j536r02J467J135K34K290L317J959J665L147J838j14O58P68j361
1136G520j859p81k465l397j866j190k636j623J84l1m82K147K831J145K059L124
1152B680J987R60J937J467j440n26k58k106k485j477j814l245j593p40j116r23
1168h692J138J478O99K026K858J684J680K675J773k6L50K60j476j760r96j781
1184A890l236k084j270j591j243K60K01L00J519K161J359J835L082J643P94J367
$$ plain form
1200 6987 7507 7005 6455 5935 4157 1648 -151 -1975 -3953 -5978 -5848 -7006 -7705 -6597 -5142 -4155 -2287
1217 -2287 396 1875 3374 5387 6379 6819 6765 6760 5509 3474 2312 987 -1704 -3451 -4429 -5804 -7082
1234 -7082 -6365 -6008 -5655 -4439 -2239 -1035 754 3025 4448 5258 6264 6729 6522 5368 4644 2959 928
1251 928 -693 -2241 -4370 -5407 -5839 -6407 -6302 -5717 -4304 -2937 -1405 580 2275 3535 4978 5950
1267 5950 5978 6174 5744 4572 3219 1616 -135 -2112 -3336 -4729 -5543 -6208 -6155 -5584 -4917 -3599 -1815
1284 -1815 -160 1378 3211 4382 5302 6024 6086 5855 4557 3644 2147 290 -1117 -2799 -3958 -5225
1300 -5225 -5449 -5788 -5488 -4781 -3340 -2267 -1043 702 2537 3495 4905 5522 5120 5076 4650 4013 2327 875
1318 875 -759 -2056 -3546 -4511 -5343 -5622 -5286 -4582 -3828 -2685 -974 369 1906 2976 4476 4902 5329
$$ packed form
1200F987N20n02n50n20j778k509j799j824j978k025J30j158o99J108J455R87J868
1217b287K683J479J499K013R92M40n4nj251k035j162j325k691j747r78j375j278
1234g082P17L57L53J216K200J204J789K271J423Q10J006M65k07j154p24j685k031
1251I28j621j548k129j037m32n68J05N85J413J367J532J985J695J260J443R72
1267E950K8J96m30j172j353j603j751j977j224j393q14o65N3N71O67J318J784
1284a815J655J538J833J171R20P22O2k31j298r13j497j857j407j682j159j267
1300e225k24l39L00P07J441J073J224J745J835R58J410O17m02m4m26o37j686j452
1318H75j634j297j490r65q32k79L36P04P54J143J711J343J537J070J500M26M27
$$ plain form
1335 5329 5336 4841 3867 2708 1324 18 -1492 -3041 -3878 -4724 -5191 -5142 -4824 -4182 -3076 -1640 -209 1172
1353 1172 2437 3737 4372 5086 5185 4826 3766 3126 2017 412 -984 -2264 -3275 -4406 -4839 -4843 -4709 -3994
1371 -3994 -3292 -2126 -414 837 2129 3262 4270 4843 4892 4660 3952 3045 1962 901 -837 -1660 -2865
1388 -2865 -4225 -4307 -4751 -4952 -4039 -3362 -1852 -935 265 1634 2896 3703 4387 4428 4581 4057 3048 2277
1406 2277 1060 -243 -1293 -2547 -3479 -3899 -4353 -4330 -3884 -3161 -2352 -1415 -95 1290 2283 3483 3908 4325
1424 4325 4151 4076 3308 2479 1426 383 -785 -2094 -2828 -3886 -4186 -4060 -3666 -3602 -2579 -1567 -496 601
1442 601 1692 2841 3246 3850 4126 3827 3104 2896 1781 775 -644 -1559 -2914 -3657 -3776 -3964 -4264 -3571
1460 -3571 -2437 -1773 -722 524 1255 2385 3332 3715 3849 3638 3493 2765 1773 970 -54 -1323 -2294 -2822
$$ packed form
1335E329Pm95r74j159j384j306j510j549q37q46m67M9L18O42J106J436J431J381
1353A172J265J300O35P14R9l59j060o40j109j605j396j280j011j131m33mJ34P15
1371c994P02J166J712J251J292J133J008N73M9k32p08r07j083j061j738q23j205
1388b865j360q2m44k01R13O77J510R17J200J369J262Q07O84M1J53n24j009p71
1406B277j217j303j050j254r32m20m54K3M46P23Q09R37J320J385R93J200M25M17
1424D325j74p5p68q29j053j043j168j309p34j058l00J26L94O4J023J012J071J097
1442F01J091J149M05O04K76k99p23k08j115j006j419r15j355p43j19j88l00O93
1460c571J134O64J051J246P31J130R47L83J34k11j45p28r92q03j024j269r71n28
$$ plain form
1478 -2822 -3588 -3795 -3623 -3093 -3007 -2220 -949 77 915 1832 3003 3127 3406 3654 3259 2643 2353 1209 -91
1497 -91 -841 -1562 -2576 -3245 -3277 -3282 -3660 -2852 -1908 -1433 -448 910 1724 2074 3103 3459 3421 3135 2967 2260 1032
1518 1032 884 -333 -1458 -2324 -2879 -3374 -3486 -3350 -2893 -2388 -1651 -618 246 1072 2251 2929 2877 2979 3379
1537 3379 2565 2028 1521 890 -148 -1525 -1765 -2597 -3733 -3096 -2880 -3183 -2365 -1328 -902 -88 1017 1793
1555 1793 2032 2784 3059 3005 2562 2467 1580 809 46 -791 -1794 -2326 -2396 -2917 -3131 -2698 -2163 -2021 -892 34
1575 34 487 1014 2240 2594 2554 2808 3223 2414 1493 1045 285 -523 -1395 -1658 -2639 -2899 -2545 -2545 -2593 -2045 -685
1596 -685 -266 354 1384 1768 2094 2356 3301 2546 2081 1970 1209 184 -280 -678 -2094 -2135 -2119 -2606 -2771 -2372
1616 -2372 -1730 -1226 -955 442 1027 1479 2075 2561 2594 2552 2611 1960 1198 648 283 -974 -1461 -1700 -2492 -2773
$$ packed form
1478b822p66k07J72N30Q6P87J271J026Q38R17J171J24K79K48l95o16k90j144j300
1497i1p50p21j014o69l2nl78Q08R44M75R85J358Q14L50J029L56l8k86j68p07j228
1518A032j48j217j125q66n55m95j12J36M57N05P37J033Q64Q26J179O78n2J02M00
1537C379q14n37n07o31j038j377k40q32j136O37K16l03Q18J037M26Q14J105P76
1555A793K39P52K75n4m43r5q87p71p63q37j003n32p0n21k14M33N35J42J129R26
1575C4M53N27J226L54m0K54M15q09r21m48p60q08q72k63r81k60L54%m8N48J360
1596f85M19O20J030L84L26K62R45p55m65j11p61j025m64l98j416m1J6m87j65L99
1616b372O42N04K71J397N85M52N96M86L3m2N9o51p62n50l65j257m87k39p92k81
$$ plain form
1636 -2773 -2420 -2375 -2001 -1333 -463 -24 368 1473 1899 1930 2310 2790 2231 1930 1788 922 -40 -669 -1170 -1671
1656 -1671 -2177 -2016 -2359 -2380 -1928 -1450 -1035 -304 373 901 1273 1816 2476 2262 1851 1911 1273 829 401 -274
1676 -274 -971 -1446 -1438 -2098 -2187 -2029 -1912 -1549 -1197 -110 115 609 1348 2019 1928 2187 2270 2215 1535 1218 896 -140
1698 -140 -803 -1187 -1813 -2134 -2290 -1919 -2039 -1904 -1292 -557 -239 721 886 1517 1988 2181 1847 1615 1893 1115
1718 1115 524 86 -607 -1012 -1463 -1730 -1828 -2360 -2030 -1664 -1123 -647 42 193 731 1296 1736 1835 1830 1769 1434
1739 1434 1205 605 623 -239 -1022 -1160 -1532 -2043 -1953 -1856 -1770 -1521 -531 -278 89 847 1178 1569 1572 1977 1577 1711
1761 1711 1605 913 237 -168 -377 -980 -1463 -1644 -1489 -1744 -1483 -1196 -830 -394 221 633 873 1458 1684 1877
1781 1877 1668 1394 1195 850 420 190 -509 -912 -946 -1696 -1905 -1623 -1317 -1337 -1193 -500 -112 9 819 1065
$$ packed form
1636b773L53M5L74O68Q70M39L92J105M26L1L80M80n59l01j42q66r62o29n01n01
1656a671n06J61l43k1M52M78M15P31O77N28L72N43O60k14m11O0o38m44m28o75
1676b74o97m75Qo60q9J58J17L63L52J087K25M94P39O71r1K59Q3n5o80l17l22j036
1698a40o63l84o26l21j56L71j20J35O12P35L18R60J65O31M71J93l34k32K78p78
1718A115n91m38o93m05m51k67r8n32L30L66N41M76O89J51N38N65M40R9no1l35
1739A434k29o00J8q62p83j38l72n11R0R7Q6K49R90K53L67P58L31L91LM05m00J34
1761A711j06o92o76m05k09o03m83j81J55k55K61K87L66M36O15M12K40N85K26J93
1781A877k09k74j99l45m30k30o99m03l4p50k09K82L06k0J44O93L88J21Q10K46
$$ plain form
1801 1065 1334 1622 1564 1537 1299 879 348 47 -350 -800 -1031 -1350 -1327 -1333 -1465 -1257 -946 -481 -56 38 610 748
1823 748 1115 1147 1322 1364 1372 1319 653 215 89 -429 -745 -1227 -1334 -1811 -1607 -1413 -1249 -764 -256 117 507 1100
1845 1100 1117 1390 963 1420 1382 707 769 173 -203 -384 -844 -1270 -1100 -1217 -1391 -1160 -1322 -782 -550 41 127
1866 127 430 800 1055 1223 1169 1072 1258 615 387 95 -95 -494 -842 -818 -1391 -1068 -1095 -1163 -647 -243 -53 306
1888 306 759 1076 629 1120 1170 1084 862 942 553 322 -244 -565 -707 -981 -1323 -1346 -1062 -997 -694 -492 -87 -118
1910 -118 193 709 1435 1181 1083 844 945 703 581 477 -182 -158 -562 -1105 -1200 -930 -1291 -1079 -909 -360 -464
1931 -464 78 470 713 726 1043 1029 882 827 1020 207 374 -4 -532 -363 -671 -766 -1046 -702 -838 -588 -552 -310
1953 -310 46 -73 556 625 950 774 908 1008 663 798 248 51 5 -797 -753 -805 -919 -788 -785 -566 -550 -280
$$ packed form
1801A065K69K88n8k7k38m20n31l01l97m50k31l19K3oj32K08L11M65M25R4N72J38
1823G48L67L2J75M2Qn3o66m38j26n18l16m82j07m77K04J94J64M85N08L73L90N93
1845A100J7K73m27M57l8o75O2n96l76j81m60m26J70j17j74K31j62N40K32N91Q6
1866A27L03L70K55J68n4r7J86o43k28k92j90l99l48K4n73L23k7o8N16M04J90L59
1888C06M53L17m47M91N0q6k22Q0l89k31n66l21j42k74l42k3K84O5L03K02M05l1
1910a18L11N16P26k54r8k39J01k42j22j04o59K4m04n43r5K70l61K12J70N49j04
1931d64N42L92K43J3L17j4j47n5J93q13J67l78n28J69l08r5k80L44j36K50L6K42
1953c10L56j19O29O9L25j76J34J00l45J35n50j97m6q02M4n2j14J31LK19J6K70
$$ plain form
1975 -280 -249 94 409 170 954 1118 918 611 794 841 286 54 -428 -365 -448 -1088 -805 -765 -891 -679 -530 -295
1997 -295 -106 -41 522 567 692 613 736 758 529 165 276 -73 -62 -271 -529 -592 -978 -684 -593 -714 -403 -195
2019 -195 -430 45 400 574 528 837 1040 768 409 697 300 22 -11 -130 -294 -349 -422 -876 -603 -717 -452
2040 -452 -427 -578 158 -42 379 480 625 746 717 456 363 123 504 78 -296 -455 -508 -382 -772 -440 -577
2061 -577 -620 -241 -322 128 153 253 407 356 441 667 447 201 604 212 38 16 69 -509 -597 -359 -305 -324 -476
2084 -476 -421 -270 66 111 238 573 649 531 447 275 482 307 -173 164 -97 -548 -226 -172 -493 -313 -457 -453
2106 -453 -432 -60 11 300 -79 483 558 465 685 517 418 252 182 -45 -327 -312 -104 -279 -499 -418 -563 -574 -217
2129 -217 -190 210 -189 254 490 420 305 477 581 595 381 107 -105 -77 -141 -237 -281 -297 -623 -293 -184 -149 -149 -234
$$ packed form
1975b80L1L43L15k39P84J64k00l07J83M7n55k32m82O3q3o40K83M0j26K12J49K35
1997b95J89O5N63M5J25p9J23K2k29l64J11l49J1k09k58o3l86K94R1j21L11K08
2019a95k35M75L55J74m6L09K03k72l59K88l97k78l3j19j64n5p3m54K73j14K65
2040d52K5j51P36k00M21J01J45J21k9k61r3k40L81m26l74j59n3J26l90L32j37
2061e77m3L79q1M50K5J00J54n1Q5K26k20k46M03l92j74k2N3n78q8K38N4j9j52
2084d76N5J51L36M5J27L35P6j18q4j72K07j75m80L37k61m51L22N4l21J80j44M
2106d53K1L72P1K89l79N62P5r3K20j68r9j66p0k27k82J5K08j75k20Q1j45j1L57
2129b17K7M00l99M43K36p0j15J72J04J4k14k74k12K8o4r6m4j6l26L30J09L5%q5
$$ plain form
2153 -234 109 134 153 323 261 119 475 313 137 151 26 -78 44 -345 -313 -347 -389 -159 -172 -416 -298 -313 193
2176 193 83 66 160 414 426 587 267 329 139 178 -43 7 -225 -686 -150 -329 -443 -364 -378 -155 317 98 309
2199 309 234 307 117 342 268 378 193 340 -44 -351 -258 -337 -218 -328 -425 -340 68 -411 -58 94 143 124 209
2222 209 389 72 215 149 118 169 181 -359 -266 -254 -425 -483 -485 -403 -341 -365 -74 -294 -244 154 201 -89 629 73 381
2247 381 459 142 -5 98 159 -347 -205 -3 -141 -205 -198 -436 -283 -202 3 -14 210 265 276 303 306 184 348 272
2271 272 152 207 -265 -189 -240 -364 -266 -214 -250 -329 -423 -173 25 13 130 166 -3 -80 181 362 247 373 283 140
2295 140 -144 41 -94 -135 -25 -120 -25 -277 -404 -140 -73 -117 82 143 215 565 429 185 207 78 -21 -24 -19 -210
2319 -210 -253 -257 -195 -155 -659 -450 -189 0 -250 57 86 338 323 246 236 303 283 196 -203 229 37 -294 -15 -343
$$ packed form
2153b34L43K5J9J70o2j42L56j62j76J4j25j04J22l89L2l4m2K30j3k44J18j5N06
2176A93j10j7R4K54J2J61l20O2j90L9k21N0k32m61N36j79j14P9j4K23M72k19K11
2199C09p5P3j90K25p4J10j85J47l84l07R3p9J19j10r7Q5M08m79L53J52M9j9Q5
2222B09J80l17J43o6l1N1J2n40R3J2j71n8kQ2O2k4K91k20N0L98M7k90P18n56L08
2247C81P8l17j47J03O1n06J42K02j38o4Pk38J53Q1K05j7K24N5J1K7Lj22J64p6
2271B72j20N5m72P6n1j24R8N2l6p9r4K50J98j2J17L6j69p7K61J81j15J26r0j43
2295A40k84J85j35m1J10r5R5k52j27K64O7m4J99O1P2L50j36k44K2j29r9lNj91
2319b10m3mO2M0n04K09K61J89k50L07K9K52j5p7j0O7k0q7l99M32j92l31K79l28
$$ plain form
2343 -343 -164 -73 -336 -599 -204 240 -250 72 248 240 235 210 343 333 387 322 105 -73 47 80 -239 -134 -395
2366 -395 30 -147 -598 -201 -73 26 62 -125 72 39 414 197 315 592 207 6 2 -243 -70 -423 7 -97
2388 -97 -396 -23 -484 -265 -143 -204 -8 -83 85 306 41 252 116 97 389 93 186 -25 -182 -43 -135 -366
2410 -366 -358 -197 -80 -266 -145 -527 94 10 -105 152 257 649 385 391 227 274 93 -168 -67 4 -209 -51
2432 -51 -278 -376 -457 -135 -164 366 -94 289 298 84 163 31 12 183 304 -153 122 19 -134 149 -104 -228 3
2455 3 -256 -302 -60 -376 -9 -29 -128 258 84 80 174 273 572 230 -15 140 -31 151 -114 -385 -155 -401 -130
2478 -130 -146 -442 -74 -206 -195 -149 -59 -32 425 304 242 165 79 217 213 -167 96 -11 -191 -448 -386 -284 -233 -36
2502 -36 -240 140 -55 186 -67 87 63 250 199 304 98 258 186 -167 200 60 48 -168 -429 -121 -505 -180
$$ packed form
2343c43J79R1k63k63L95M44m90L22J76qnk5J33j0N4o5k17j78J20L3l19J05k61
2366c95M25j77m51L97J28R9L6j87J97l3L75k17J18K77l85k01mk45J73l53M30j04
2388i7k99L73m61K19J22o1J96p5J68K21k65K11j36j9K92k96R3k11j57J39r2k31
2410c66QJ61J17j86J21l82O21q4j15K57J05L92k64Oj64M7j81k61J01P1k13J58
2432e1k27r8q1L22k9N30m60L83Rk14P9j32j9J71J21m57K75j03j53K83k53j24K31
2455Ck59m6K42l16L67k0r9L86j74mR4R9K99l42k45J55j71J82k65k71K30k46K71
2478a30j6k96L68j32J1M6R0K7M57j21o2p7q6J38ml80K63j07j80k57O2J02N1J97
2502c6k04L80j95K41k53J54k4J87n1J05k06J60p2l53L67j40j2k16k61L08l84L25
$$ plain form
2524 -180 -154 -220 -133 -28 44 66 164 118 142 229 267 515 1 73 204 74 -86 159 -106 -376 -44 -500 -40 -339
2548 -339 -9 -123 147 72 122 207 -64 295 423 173 278 -68 189 -95 18 -118 -391 -335 -483 -517 -198 -227
2570 -227 -117 -117 1 100 104 -57 168 191 240 258 239 123 32 23 11 96 -28 -293 -453 -119 55 -105 -237 -158 -14
2595 -14 -55 112 324 11 60 250 -66 20 137 84 274 45 97 24 -217 -359 -208 -285 -197 70 84 96 -209 6
2619 6 137 484 233 346 202 419 193 374 180 109 70 -375 37 -378 -377 -165 -434 26 -153 -162 -69 -210 115
2642 115 181 447 56 215 72 48 312 82 -41 102 -187 -162 -535 -562 -104 -84 -164 -63 -175 -61 102 121
2664 121 -64 355 182 307 -103 -44 316 89 -31 224 133 -390 -178 -90 -307 -120 92 -122 -89 50 -89
2685 -89 90 250 234 335 286 472 414 52 162 197 35 -535 146 -222 -406 -186 -351 -175 -352 -96 -11 -1
$$ packed form
2524a80K6o6Q7J05P2K2R8m6K4Q7L8K48n14P2J31j30j60K45k65k70L32m56M60k99
2548c39L30j14K70p5N0Q5k71L59J28k50J05l46K57k84J13j36k73N6j48l4L19k9
2570b27J10%J18R9Mj61K25K3M9J8j9j16r1rj2Q5j24k65j60L34J74j60j32P9J44
2595a4m1J67K12l13M9J90l16Q6J17n3J90k29N2p3k41j42J51p7Q8K67J4J2l05K15
2619FJ31L47k51J13j44K17k26J81j94p1l9m45M12m15JK12k69M60j79rR3j41L25
2642A15O6K66l91J59j43k4K64k30j23J43k89K5l73k7M58K0q0J01j12J14J63J9
2664A21j85M19j73J25m10N9L60k27j20K55r1n23K12Q8k17J87K12k14L3J39j39
2685h9J79J60j6J01m9J86n8l62J10L5j62n70O81l68j84K20j65J76j77K56Q5J0
$$ plain form
2707 -1 150 144 249 266 242 383 195 334 294 45 29 -3 -12 -417 -134 62 -185 -343 -132 66 13 -151 -43 169
2731 169 222 305 187 369 348 69 269 465 70 216 -136 60 -211 -336 -163 -266 -131 -204 93 18 193 146
2753 146 168 176 103 247 176 135 -11 283 7 -69 -206 -300 -204 -246 -352 -150 -185 319 88 83 230 -112 160 271
2777 271 494 6 141 333 204 468 -255 -118 -7 -109 -118 170 -82 -354 -237 -112 75 -232 -21 3 -93
2798 -93 101 577 126 241 68 290 160 141 -202 -79 133 -37 -60 -256 -212 -55 -175 -392 -28 -68 215 173
2820 173 -23 -68 216 100 240 39 269 -136 -281 -84 -101 -258 -329 -112 -187 -143 -181 -220 -1 27 -235 132 -86
2843 -86 206 321 249 215 53 360 117 130 -140 -132 -115 -144 -355 -147 -306 42 -269 -201 -89 -25 151 147 157 72 215
2868 215 242 -126 253 128 29 -20 -20 -121 -68 -88 162 -319 -51 -286 -325 -212 -130 -21 327 100 275 151 -11
$$ packed form
2707aJ51oJ05J7k4J41j88J39m0k49j6l2rm05K83J96k47j58K11J98n3j64J08K12
2731A69N3Q3j18J82k1k79K00J96l95J46l52J96k71j25J73j03J35p3K97p5J75m7
2753A46K2Qp3J44p1m1j46K94k76p6j37r4R6m2j06K02l5N04k31nJ47l42K72J11
2777B71K23m88J35J92j29K64p23J37J11j02rK88k52k72J17J25J87l07K11K4r6
2798i3J94M76m51J15j73K22j30j9l43J23K12j70k3j96M4J57j20k17L64m0K83m2
2820A73j96m5K84j16J40k01K30m05j45J97j7j57p1K17p5M4l8l9K19K8k62L67k18
2843h6K92J15p2l4j62L07k43J3k70QJ7k9k11K08j59L48l11O8J12O4J76mJ0q5J43
2868B15K7l68L79j25r9m9%j01N3k0K50m81K68k35l9J13Q2J09L48k27J75j24j62
$$ plain form
2891 -11 98 69 -8 77 -44 31 83 -154 -140 30 -212 -150 -126 -149 -93 131 201 201 -110 121 128 327 126 291 316 44
2917 44 -218 1 40 91 67 -157 -424 -272 -286 -139 -26 -138 -138 -11 -65 404 174 260 140 232 263 208 -96 -56
2941 -56 53 -492 -17 -303 2 51 -310 116 130 -12 24 -66 20 406 159 40 63 120 44 334 -161 -354 9
2964 9 -95 -252 -185 28 -235 -180 40 -262 52 -35 215 207 261 276 108 130 136 397 44 -23 -63 -101 46 -169 -358
2989 -358 -119 -66 -330 -97 -100 -110 -23 71 -45 136 304 110 217 -255 202 -26 -51 -68 -92 152 -148 4 -81
3012 -81 -32 -283 -49 -267 -249 19 298 150 68 206 2 354 -25 176 -55 90 -8 2 -404 -132 -48 -334
3034 -334 -364 -461 9 -28 40 89 33 266 117 294 196 108 -51 340 -129 23 65 -53 127 -86 -304 178 -218
3057 -218 -213 -156 -53 42 131 138 308 4 122 -31 358 179 182 75 -55 126 -84 8 -308 -168 -188 -263 -163 216
$$ packed form
2891a1J09k9p7Q5j21P5N2k37J4J70k42O2K4k3N6K24P0%l11K31PJ99k01J65K5k72
2917D4k62K19L9N1k4k24k67J52j4J47J13j12%J27n4M69k30Q6j20R2L1n5l04M0
2941e6J09n45M75k86L05M9l61M26J4j42L6r0Q6L86k47j19K3N7p6K90m95j93L63
2964Ij04j57O7K13k63N5K20l02L14q7K50qN4J5j68K2OK61l53o7m0l8J47k15j89
2989c58K39N3k64K33lj0Q7R4j16J81J68j94J07m72M57k28k5j7k4K44l00J52q5
3012h1M9k51K34k18J8K68K79j48q2J38k04L52l79K01k31J45r8J0m06K72Q4k86
3034c34l0r7M70l7O8M9n6K33j49J77r8q8j59L91m69J52M2j18J80k13k18M82l96
3057b18NN7J03R5Q9PJ70l04J18j53L89j79Lj07j30J81k10R2l16J40k0p5J00L79
$$ plain form
3081 216 -161 -40 263 142 154 204 17 34 227 259 55 -46 -161 -7 -94 54 -28 -125 -195 73 -62 -65 -94 -109
3105 -109 209 -129 42 -22 255 280 -50 160 102 -39 -39 -55 135 -134 -54 -198 -270 -86 -246 356 -112 232 -125
3128 -125 312 457 -80 -99 168 -69 167 -196 -143 -103 -97 -361 -100 -321 -67 -90 84 9 -139 -80 -38 98 191
3151 191 40 144 62 -81 143 122 -3 -215 228 97 -21 81 -133 -349 -384 -79 -149 -370 155 18 -94
3172 -94 334 339 192 352 255 240 295 123 231 -97 -152 90 -7 37 -124 82 -131 -14 -93 -144 1 64 223 421
3196 421 58 199 138 16 183 -324 -76 -259 -94 36 -262 -362 -182 -375 -222 -239 -147 70 88 304 -2
3217 -2 -148 416 18 462 218 35 298 174 -396 -77 -433 -129 -17 -205 -124 -265 -203 -318 -69 170 -51
3238 -51 270 138 206 16 185 241 221 244 -63 -23 -26 -307 -88 -232 -40 -66 -242 -182 -43 54 35 -6 129 273
$$ packed form
3081B16l77J21L03j21J2N0j87J7J93L2k04j01j15J54q7J48q2r7p0K68j35lk9j5
3105a09L18l38J71o4K77K5l30K10n8j41%j6J90k69Q0j44p2J84j60O02m68L44l57
3128a25M37J45n37j9K67k37K36l63N3M0Ok64K61k21K54k3J74p5j48N9M2J36R3
3151A91j51J04q2j43K24k1j25k12M43j31j18J02k14k16l5L05p0k21N25j37j12
3172i4M28Nj47J60r7j5N5j72J08l28n5K42r7M4j61K06k13J17p9n1J45O3J59J98
3196D21l63J41o1j22J67n07K48j83J65J30k98j00J80j93J53j7R2K17J8K16l06
3217bj46N64l98M44k44j83K63j24n70L19l56L04J12j88Q1j41O2j15K49K39k21
3238e1L21j32O8j90J69N6k0K3l07M0lk81K19j44J92k6j76O0J39R7j9m1J35J44
$$ plain form
3262 273 294 562 294 339 208 377 445 78 -108 150 -301 -148 -532 -511 1 -141 -205 -30 189 164 86 196
3284 196 238 248 334 421 132 -18 -43 -5 207 -208 -19 -312 -118 -556 -155 -139 283 41 87 90 166 146 91 592
3308 592 359 311 259 174 -74 -9 -198 -174 -65 -265 -292 -424 -127 -2 -16 -211 47 341 556 159 47 221
3330 221 160 42 336 117 84 -118 -81 -123 -396 -92 -357 -358 -331 -105 -273 -166 -218 6 343 79 239 513 134
3353 134 136 8 121 23 75 -6 -412 -155 -445 -103 -629 -182 -308 145 -30 251 232 -114 487 91 399 285
3375 285 266 116 228 32 13 -209 -57 -271 -190 -280 -446 -437 -241 -89 -153 435 97 205 319 285 66 178 -122
3398 -122 171 405 199 338 -80 -103 -279 -132 -452 -261 -159 -191 -279 -193 160 -223 -52 272 175 192 114 274
3420 274 258 78 331 106 -143 51 -72 -259 -464 -366 -372 -439 -407 -199 -2 -187 18 158 366 297 517 218
$$ packed form
3262B73K1K68k68M5j31J69O8l67j86K58m51J53l84K1N12j42o4J75K19k5p8J10
3284A96M2J0Q6Q7k89j50k5L8K12m15J89k93J94m38M01J6M22k42M6LP6k0n5N01
3308E92k33m8n2q5k48O5j89K4J09k00k7j32K97J25j4j95K58K94K15l97j12J74
3330B21o1j18K94k19l3k02L7m2k73L04k65jK7K26j68J07n2K24L37k64J60K74l79
3353A34Kj28J13r8N2q1m06K57k90L42n26M47j26M53j75K81j9l46O01l96L08j14
3375B85j9j50J12j96j9k22J52k14Q1r0j66RJ96J52o4N88l38J08J14l4k19J12l00
3398a22K93K34k06J39m18k3j76J47l20J91J02l2q8Q6L53l83J71L24r7J7p8J60
3420B74j6j80K53k25k49J94j23j87k05R8oo7L2K08J97j85K05J40K08o9K20k99
$$ plain form
3442 218 157 114 10 -3 106 4 -321 12 -174 -361 -444 -135 -322 -531 -199 -236 154 397 201 456 162 472
3464 472 192 65 427 -17 56 -288 -198 -366 -320 -247 -324 -221 -302 -93 -140 -208 -146 237 7 372 43 323 385
3487 385 87 168 242 417 -28 -138 -361 -417 -415 -257 -410 -565 -368 -322 -48 70 18 317 136 200 336 300 456
3510 456 102 403 45 54 269 -151 -354 -210 -399 -395 -606 -337 -456 -221 -95 342 249 430 473 331 344 367 321
3533 321 228 251 117 1 -192 234 -435 -294 -383 -440 -502 -321 -214 -189 -182 112 212 294 269 407 320 330 510 289
3557 289 99 -109 43 -447 -390 -232 -439 -396 -456 -400 -98 88 -62 140 457 467 211 325 470 526 153 173
3579 173 109 5 -13 -212 -125 -297 -466 -395 -423 -302 -102 -128 -52 210 217 286 67 412 260 384 301 124 311 165
3603 165 -161 45 -217 -215 -218 -504 -235 -335 -57 -135 42 -69 -17 92 238 349 551 520 487 308 186 371 143
$$ packed form
3442B18o1m3j04j3J09j02l25L33j86j87q3L09j87k09L32l7L90K43j96K55k94L10
3464D72k80j27L62m44P3l44R0j68M6P3p7J03q1K09m7o8O2L83k30L65l29K80O2
3487C85k98Q1P4J75m45j10k23n6KJ58j53j55J97M6K74J18n2K99j81O4J36l6J56
3510D56l54L01l58RK15m20k03J44j89Mk11K69j19K35J26M37r3J81M3j42J3K3m6
3533C21r3K3j34j16j93M26o69J41q9n7o2J81J07K5PK94J00Q2k5J38q7J0J80k21
3557B89j90k08J52m90N7J58k07M3o0N6L02J86j50K02L17J0k56J14J45N6l73K0
3579A73o4j04j8j99Q7j72j69P1k8J21K00k6P6K62PO9k19L45j52J24q3j77J87j46
3603A65l26K06k62Klk86K69j00K78p8J77j11N2J09J46J11K02l1l3j79j22J85k28
$$ plain form
3626 143 -9 -141 -539 -444 -431 -524 -383 -334 -138 -168 16 141 76 52 225 464 782 352 326 376 330 -2 -106
3649 -106 -178 -122 -120 -338 -496 -592 -434 -401 -217 -164 321 97 311 576 319 398 374 184 238 137 278 143 42
3672 42 -344 -477 -466 -276 -503 -418 -462 -334 43 121 33 351 125 441 532 380 373 324 327 298 -63 -266 50 -257
3696 -257 -440 -314 -516 -496 -413 -356 -163 -264 12 -20 118 576 371 319 583 529 437 143 418 233 217 -515 -270
3719 -270 -527 -406 -509 -268 -323 -460 25 -136 275 218 660 572 406 427 386 603 271 217 92 122 -129 -563
3741 -563 -427 -506 -162 -186 -530 -146 18 -90 195 264 286 329 487 298 432 335 589 161 28 188 -255 -100
3763 -100 -222 -542 -478 -567 -317 -411 -226 -131 52 224 359 324 225 406 645 335 215 457 182 111 -284 -103
3785 -103 -315 -418 -410 -863 -394 -416 -337 -321 -64 253 235 -18 361 488 520 414 393 420 147 140 -106 -57 -48 -449 -321
$$ packed form
3626A43j52j32l98R5J3r3J41M9J96l0J84J25o5k4J73K39L18m30k6N0m6l32j04
3649a06p2N6Kk18j58r6J58L3J84N3M85k24K14K65k57P9k4j90N4j01J41j35j01
3672D2l86j33J1J90k27Q5m4J28L77P8q8L18k26L16R1j52pm9Lk9l61k03L16l07
3696b57j83J26k02K0Q3N7J93j01K76l2J38M58k05n2K64n4r2k94K75j85j6p32K45
3719b70k57J21j03K41n5j37M85j61M11n7M42q8j66K1m1K17l32n4j25L0k51m34
3741e63J36p9L44k4l44L84J64j08K85O9K2M3J58j89J34r7K54m28j33J60m43J55
3763a00j22l20O4q9K50r4J85R5J83J72J35l5r9J81K39l10j20K42k75p1l95J81
3785a03k12j03Qm53M69k2P9J6K57L17j8k53L79J27L2j06k1K7k73pk46M9Rm01J28
$$ plain form
3810 -321 -290 -92 -355 -469 -311 -100 73 315 384 661 242 101 528 591 184 134 -33 70 -206 -235 -281 -464
3832 -464 -473 -231 -529 -438 -473 -114 -45 14 280 278 324 571 426 348 425 244 550 -22 -67 8 -713 -441 -360 -389 -26
3857 -26 -444 -321 -513 -188 -51 38 305 290 584 659 590 396 248 329 161 76 -149 -189 -532 -768 -531 -428 -507
3880 -507 -623 -351 -331 -25 -203 491 467 320 658 462 486 406 304 265 82 127 248 -18 -53 -333 -294 -786 -610
3903 -610 -444 -387 -150 78 -29 515 518 457 253 505 652 390 87 202 318 -66 -201 -336 -413 -432 -392 -492
3925 -492 -426 -195 -177 -250 284 377 281 705 663 500 469 279 157 274 -62 -79 -181 -233 -156 -576 -593 -609 -571 -313
3949 -313 -313 -286 -57 9 410 213 547 531 580 461 405 96 57 -14 -35 -110 -484 -429 -175 -517 -565 -325 -336 -340 -28
3974 -28 11 116 353 361 371 530 389 560 104 275 187 171 -334 -185 -488 -456 -275 -543 -418 -332 -382 -364 63 -38
$$ packed form
3810c21L1J98k63j14J58K11J73K42O9K77m19j41M27O3m07n0j67J03k76k9m6j83
3832d64rK42k98R1l5L59O9N9K66kM6K47j45p8P7j81L06n72m5P5p21K72Q1k9L63
3857b6m18J23j92L25J37Q9K67j5K94P5o9j94j48Q1j68q5k25m0l43k36K37J03p9
3880e07j16K72K0L06j78O94k4j47L38j96K4q0j02l9j83M5J21k66l5k80L9m92J76
3903f10J66N7K37K28j07N44Lo1k04K52J47k62l03J15J16l84j35j35p7j9M0j00
3925d92O6K31J8p3N34R3r6M24m2j63l1j90j22J17l36j7j02n2P7m20j7j6L8K58
3949c13%K7K29O6M01j97L34j6M9j19n6l09l9p1k1p5l74N5K54l42m8K40j1mL12
3974b8L9J05K37QJ0J59j41J71m56J71q8j6n05J49l03L2J81k68J25Q6n0J8M27j01
$$ plain form
3998 -38 487 468 431 539 400 477 521 137 224 45 -288 -210 -427 -287 -331 -500 -187 -228 -350 -119 -175 73 218
4021 218 383 424 619 390 662 577 548 54 -185 -11 -182 -399 -419 -497 -303 -551 -433 -550 -425 -131 125 115
4043 115 456 642 315 394 499 515 187 312 -22 -65 -131 -238 -278 -427 -582 -506 -686 -392 -349 52 397 139
4065 139 288 588 503 438 366 381 487 258 -19 177 -39 -222 -518 -415 -417 -610 -416 -310 -440 -340 -118 -99
4087 -99 196 490 605 428 555 543 609 195 440 22 -242 -60 -272 -426 -692 -285 -470 -628 -135 -301 -119
4108 -119 90 207 146 294 542 646 363 560 453 414 -9 -26 -185 -267 -561 -161 -743 -676 -641 -281 -401 -196
4130 -196 -42 68 142 319 502 426 583 485 711 611 400 260 -49 -229 -311 -134 -514 -538 -484 -341 -281 -195 -16
4153 -16 -97 178 237 248 326 425 399 290 329 363 171 194 -367 -585 -450 -595 -451 -537 -548 -491 -315 1 283 350 289
$$ packed form
3998c8N25j9l7J08j39P7M4l84Q7j79l33P8k17J40m4j69L13m1j22K31n6K48J45
4021B18J65M1J95k29K72q5k9m94k39J74j71k17k0p8J94k48J18j17J25K94K56j0
4043A15L41J86l27P9J05J6l28J25l34m3o6j07m0j49j55P6j80K94M3M01L45k58
4065A39J49L00q5o5p2J5J06k29k77J96k16j83k96J03kj93J94J06j30J00K22J9
4087i9K95K94J15j77J27j2O6m14K45m18k64J82k12j54k66M07j85j58M93j66J82
4108a19K09J17o1J48K48J04k83J97j07l9m23j7j59q2k94M00n82O7L5L60j20K05
4130a96J54J10P4J77J83p6J57r8K26j00k11j40l09j80q2J77l80k4N4J43O0Q6J79
4153a6q1K75N9J1P8R9k6j09L9L4j92K3n61k18J35j45J44q6j1N7J76L16K82O7o1
$$ plain form
4178 289 374 398 468 655 462 404 338 539 -167 -104 -210 -225 -365 -477 -287 -667 -468 -345 -124 152 185 225 425
4201 425 441 354 527 402 360 439 406 344 158 -69 -165 -519 -492 -346 -479 -553 -262 -535 148 -110 -60 248 240 422
4225 422 422 558 520 456 506 176 -99 -60 65 -52 -338 -485 -391 -631 -386 -80 -362 -127 89 198 208 115 554
4248 554 491 29 499 345 93 112 1 -84 -274 -327 -479 -474 -376 -409 -268 -181 38 -218 281 220 539 621 656 769
4272 769 213 455 356 401 10 162 -234 -430 -416 -518 -212 -301 -472 -246 -160 238 -113 300 182 395 472 517
4294 517 521 545 244 90 24 -181 -199 -215 -230 -314 -563 -406 -184 -136 -93 -104 -55 -84 444 199 600 429 228 283 384
4319 384 265 51 93 -204 -69 -249 -498 -250 -534 -364 -343 -202 -299 -160 -134 324 150 540 432 357 147 502
4341 502 297 -92 -145 158 -162 -250 -526 -307 -557 -730 -282 -337 -193 66 91 173 179 197 345 245 207 584 221
$$ packed form
4178B89Q5K4P0J87j93n8o6K01p06O3j06j5j40j12J90l80J99J23K21K76L3M0K00
4201D25J6q7J73j25m2P9l3o2j86k27r6l54K7J46j33p4K91k73O83k58N0L08qJ82
4225D22%J36l8o4N0l30k75L9J25j17k86j47R4k40K45L06k82K35K16J09J0r3M39
4248E54o3m62M70j54k52J9j11q5j90n3j52NR8l3J41Q7K19k56M99o1L19Q2L5J13
4272G69n56K42r9M5l91J52l96j96J4j02L06q9j71K26Q6L98l51M13j18K13P7M5
4294E17MK4l01j54o6k05j8j6j5q4k49J57K22M8M3j1M9k9N28k45M01j71k01N5J01
4319C84j19k14M2k97J35j80k49K48k84J70K1J41r7J39K6M58j74L90j08p5k10L55
4341E02k05l89n3L03l20q8k76K19k50j73M48n5J44K59K5Q2OJ8J48j00l8L77l63
$$ plain form
4364 221 321 329 -85 -300 -305 -66 -403 -772 -373 -196 -309 -80 -151 96 218 -59 167 85 468 441 130 311
4386 311 554 169 156 130 -261 -83 -393 -487 -253 -338 -471 -556 -249 -130 81 247 198 40 185 428 235 362
4408 362 384 81 39 -36 -117 -81 -424 -258 -554 -558 -367 -298 -67 -73 -120 -204 30 468 288 635 378 386 489 277 162
4433 162 -102 -65 -239 -64 -358 -50 -231 -123 -187 -155 -97 -131 8 43 313 180 334 448 568 291 576 334
4455 334 217 74 -187 -267 -207 -280 -509 -82 -169 -385 -323 -58 153 314 -13 141 232 370 254 360 381 433 92
4478 92 163 -135 -37 47 -516 -495 -425 -288 -86 -377 -11 123 1 -17 -248 338 330 301 145 285 240 269 -72 -79 -5
4503 -5 -388 -459 -164 -454 -252 -260 -155 -420 -172 20 -19 349 248 68 279 516 259 252 5 216 8 127 -115
4526 -115 -289 -295 -373 -499 -448 -419 -20 -162 202 -125 76 256 84 379 297 176 435 281 20 37 29 -238 -44
$$ packed form
4364B21J00Qm14k15nK39l37l69L99J77j13K29p1K47J22k77K26q2L83k7l11J81
4386C11K43l85j3k6l91J78l10r4K34q5j33q5L07J19K11J66m9j58J45K43j93J27
4408C62K2l03m2p5q1L6l43J66k96mJ91O9K31om7q4K34M38j80L47k57QJ03k12j15
4433A62k64L7j74J75k94L08j81J08o4L2N8l4J39L5K70j33J54J14J20k77K85k42
4455C34j17j43k61q0O0p3k29M27q7k16O2K65K11J61l27J54R1J38j16J06K1N2l41
4478I2P1k98R8Q4n63K1P0J37K02k91L66J34j22j8k31N86qk9j56J40m5K9l41pP4
4503el83p1K95k90K02qJ05k65K48J92l9L68j01j80K11K37k57pk47K11k08J19k42
4526a15j74op8j26N1K9L99j42L64l27K01J80j72K95q2j21K59j54k61J7qk67J94
$$ plain form
4549 -44 -264 -95 -567 -439 -299 -545 -62 -207 149 126 346 199 370 389 623 468 208 310 514 -165 -66
4570 -66 84 -35 -12 -475 -175 -417 -316 -479 -79 61 -218 0 -91 372 255 479 278 333 175 32 -56 -59
4592 -59 -152 -352 -220 -28 -305 -324 -437 -252 -202 335 -107 46 163 116 199 320 373 231 110 66 215 -25 160
4615 160 -89 -214 -201 -310 -230 -284 -221 -55 -271 -160 -42 7 176 184 193 450 472 208 175 74 -56 -131 -207 -73
4639 -73 -72 -335 -201 -430 -358 -180 -139 -132 -43 81 124 284 267 381 233 511 371 137 -191 -124 -32 -231 -389 -139
4663 -139 -156 -298 -239 -69 -431 -242 -188 142 174 195 189 334 -38 56 293 105 86 -38 42 -197 -50 -74 -310 -413
4687 -413 -358 -158 -233 -65 100 -8 442 100 258 331 195 398 243 257 77 112 101 -43 -47 -309 -307 88 -278
4710 -278 -185 -246 -429 -161 41 -43 -208 -106 -131 156 346 233 208 -81 310 -132 178 -232 -233 -328 -105 -539 -275
$$ packed form
4549d4k20J69m72J28J40k46M83j45L56k3K20j47J71J9K34j55k60J02K04o79R9
4570f6J50j19K3m63L00k42J01j63M00J40k79K18r1M63j17K24k01N5j58j43q8l
4592e9r3k00J32J92k77j9j13J85N0N37m42J53J17m7Q3J21N3j42j21m4J49k40J85
4615A60k49j25J3j09Q0n4O3J66k16J11J18M9J69QRK57K2k64l3j01j30p5p6J34
4639g3Jk63J34k29P2J78M1PQ9J24M3J60j7J14j48K78j40k34l28O7R2j99j58K50
4663a39j7j42N9J70l62J89N4L30L2K1oJ45l72R4K37j88j9j24Q0k39J47k4k36j03
4687d13N5K00p5J68J65j08M50l42J58P3j36K03j55J4j80L5j1j44mk62KL95l66
4710b78R3o1j83K68K02q4j65J02k5K87J90j13k5k89L91m42L10m10jr5K23m34K64
$$ plain form
4733 -275 -255 -324 -169 -166 -286 213 -25 161 372 100 165 16 126 -5 224 -244 -155 -88 -179 -74 53 -435 -73
4756 -73 -2 -123 -35 -218 223 -76 212 213 470 61 406 159 214 307 87 -38 177 -383 17 -175 -199 -383 -322
4779 -322 41 -229 -164 -87 -114 179 428 174 378 145 -5 334 267 -203 66 213 68 -262 -222 -650 -210 -394
4801 -394 -203 -303 -216 -120 210 3 139 73 172 321 268 336 25 158 -296 25 -190 -322 -158 -49 -291 -204
4823 -204 -9 -274 -71 73 195 -4 174 134 211 343 226 -86 241 121 90 -86 -135 -406 -292 -156 -88 -110
4845 -110 -219 -320 -101 -183 -176 -125 -85 385 -49 -12 65 277 95 262 318 -87 -96 -25 -137 -254 -194 -408 -299 29
4869 29 -226 -190 -67 288 -47 252 -151 14 399 447 224 213 259 -67 -140 -21 -13 -254 -710 -207 -60 -246 -327
4892 -327 -150 -15 -84 138 98 59 340 194 187 258 34 -77 140 59 188 115 -404 -191 -33 -416 -197 -203 -379
$$ packed form
4733b75K0o9J55Lj20M99k38J86K11k72O5j49J10j31K29m68Q9O7r1J05J27m88L62
4756g3P1j21Q8j83M41k99K88JK57m09L45k47N5R3k20j25K15n60M00j92k4j84O1
4779c22L63k70O5P7k7K93K49k54K04k33j50L39o7m70K69J47j45l30M0m28M40j84
4801c94J91j00Q7R6L30k07J36o6R9J49n3O8l11J33m54L21k15j32J64J09k42Q7
4823b04J95k65K03J44J22j99J78m0P7J32j17l12L27j20l1j76m9k71J14J36O8k2
4845a10j09j01K19q2PN1M0M70m34L7P7K12j82J67N6m05rP1j12j17O0k14J09L28
4869B9k55L6J23L55l35K99m03J65L85M8k23j1M6l26p3J19Qk41m56N03J47j86q1
4892c27J77J35o9K22m0l9K81j46pP1k24j11K17q1J29p3n19K13J58l83K19oj76
$$ plain form
4915 -379 -80 135 -63 176 403 132 -94 34 -45 167 232 78 160 6 -264 -183 -21 -13 -270 -350 -34 -86 -184
4938 -184 126 -51 68 143 192 327 105 245 25 221 255 -211 236 68 -152 -14 -34 153 70 -232 46 12
4960 12 -265 -133 -303 172 -8 39 395 70 228 215 13 206 352 142 -243 32 -228 148 -141 -111 -266
4981 -266 -182 40 -56 119 230 30 73 -109 250 277 61 90 19 193 116 -127 -132 -89 -154 -166 -3 103 -123 -125 -77
5006 -77 110 -11 -42 158 231 45 169 361 201 44 295 144 -278 -48 250 -219 -417 69 -135 -241 -394
5027 -394 -80 157 169 -26 138 113 210 181 -44 95 301 124 31 -93 130 -243 -38 -309 -129 76 -215 -340
5049 -340 -282 -45 -32 -194 -303 26 209 -73 195 352 66 200 -119 170 -39 -191 -383 -114 -5 -204 -382
5070 -382 -74 -58 -5 46 314 -151 173 171 383 299 145 245 197 147 85 -20 -86 -11 -81 -254 -95 -113 -212 57 -308
$$ packed form
4915c79K99K15j98K39K27k71k26J28p9K12O5j54Q2j54k70Q1J62Qk57q0L16n2r8
4938a84L10j77J19P5M9J35k22J40k20J96L4m66M47j68k20J38k0J87q3l02K78l4
4960A2k77J32j70M75j80M7L56l25J58j3k02J93J46k10l85K75k60L76k89L0j55
4981b66Q4K22r6J75J11k00M3j82L59K7k16K9p1J74p7k43nM3o5j2J63J06k26kM8
5006g7J87j21l1K00P3j86J24J92j60j57K51j51m22K30K98m69j98M86k04j06j53
5027c94L14K37J2j95J64k5R7k9k25J39K06j77r3j24K23l73K05k71J80K05k91j25
5049c40N8K37J3j62j09L29J83k82K68J57k86J34l19K89k09j52j92K69J09j99j78
5070c82L08J6N3N1K68m65L24kK12q4j54J00m8n0o2j05o6P5p0j73J59j8r9K69l65
$$ plain form
5095 -308 -27 74 -62 281 -155 -266 76 -22 482 53 79 187 220 183 -290 -86 -159 -43 -216 57 -72 373
5117 373 235 -83 -69 -221 15 -110 87 152 40 -27 -127 21 116 132 24 -247 -1 -90 -296 -197 -114 -256 -81
5140 -81 -14 -65 4 251 66 251 130 -56 43 -46 157 22 -41 109 20 -215 -96 -201 -19 -188 92 -71 15
5163 15 60 -145 -88 -187 217 55 -163 31 -45 468 76 30 -114 -51 -19 -11 -41 -11 -259 -133 -246 -3 173 -51
5187 -51 49 -166 39 114 -273 221 -69 18 -126 97 66 -76 -92 -44 -509 -110 -252 84 39 155 244 159 -134
5210 -134 173 182 -214 -47 31 -36 -17 74 -12 -134 -74 0 219 -108 -85 -119 -390 -203 -121 -61 110 238 68 310
5234 310 275 180 87 -146 14 145 -20 180 -54 215 38 23 -38 213 120 214 204 -273 -24 7 62 -128 168
5257 168 -42 70 256 135 136 132 33 -92 54 70 -259 -56 16 338 -171 4 -102 -109 238 -148 -86 153 91 48
$$ packed form
5095c08K81J01j36L43m36j11L42r8N04m29K6J08L3l7m73K04p3J16j73K73j29M45
5117C73j38l18J4j52K36j25J97O5j12o7j00J48R5J6j08k71K46q9k06R9Q3j42J75
5140h1O7n1O9K47j85J85j21j86R9q9K03j35o3J50q9k35J19j05J82j69K80j63Q6
5163A5M5k05N7r9M04j62k18J94p6N13l92m6j44O3L2Ql0L0k48J26j13K43J76k24
5187e1J00k15K05P5l87M94k90Q7j44K23l1j42j6M8m65L99j42L36m5J16Q9q5k93
5210a34L07Rl96J67P8o7J9R1q6j22O0P4K19l27K3l4k71J87Q2O0J71J28j70K42
5234C10l5r5r3k33J60J31j65K00k34K69j77j5o1K51r3R4j0m77K49L1N5j90K96
5257A68k10J12J86j21Jmr9j25J46J6l29K03P2L22n09J75j06pL47l86O2K39o2m3
$$ plain form
5281 48 26 98 111 415 -94 124 203 -170 149 -72 50 -66 -36 -70 70 -91 -239 -46 43 38 15 -287 -79 -182
5305 -182 154 -36 145 -47 22 170 -136 87 -63 -155 66 168 -35 -123 -132 92 -115 18 188 186 51 176
5327 176 -204 -279 -41 351 114 2 -72 -177 259 -3 -62 -241 -238 -215 -44 -122 45 249 172 217 -48 2 -98
5350 -98 262 -2 -111 -8 -332 -89 70 186 340 -93 -164 -40 57 -100 -52 -303 43 144 -68 197 -72
5371 -72 5 33 8 -114 124 43 -3 -19 183 -286 148 84 213 -188 -41 147 -33 -76 78 198 115 18 -58 110
5395 110 -114 252 -63 208 77 -189 17 236 25 -120 -9 -238 32 31 242 106 58 -165 -295 60 -23
5416 -23 145 -142 -152 70 28 -76 101 7 -73 78 -101 -16 237 -231 -3 -168 -115 164 113 -11 -212 50 -82
5439 -82 238 203 -219 -116 202 162 -35 -43 67 164 -114 129 32 382 -26 52 262 -21 111 -184 -14 -267 49
$$ packed form
5281D8k2P2J3L04n09K18P9l73L19k21J22j16L0l4J40j61j48J93Q9nk3l02K08j03
5305a82L36j90J81j92O9J48l06K23j50r2K21J02k03q8rK24k07J33J70kj35J25
5327A76l80p5K38L92k37j12p4j05M36k62n9j79LK3J71p8J67K04p7M5k65N0j00
5350i8L60k64j09J03l24K43J59J16J54m33p1J24R7j57M8k51L46J01k12K65k69
5371g2P7K8k5j22K38q1m6j6K02m69M34o4J29m01J47J88j80m3J54J20q3r7p6J68
5395A10k24L66l15K71j31k66K06K19k11j45J11k29K70jK11j36m8k23j30L55q3
5416b3J68k87j0K22m2j04J77r4q0J51j79Q5K53m68K28j65N3K79n1j24k01K62j32
5439h2L20l5m22J03L18m0j97qJ10R7k78K43r7L50m08P8K10k83J32k95J70k53L16
$$ plain form
5462 49 25 -390 245 195 11 77 -85 254 -24 132 9 -49 -51 15 -61 249 149 178 162 -137 8 -23 29 99 -23
5487 -23 -17 88 -47 197 -127 232 94 -130 -21 169 -190 -25 -25 -5 199 34 13 -34 -56 -301 -162 -124 -125 52
5511 52 -174 -229 -256 29 -199 -42 -139 -84 79 -165 106 -1 175 124 -6 99 -148 -132 -327 44 192 -53
5533 -53 168 182 -139 -7 -118 -90 153 -193 -54 -56 169 59 -204 221 -56 348 -358 -27 2 -31 13 49 -75
5556 -75 -46 -124 -56 -182 -139 114 -13 -102 23 90 -194 134 54 91 334 -180 -223 10 -122 125 -247 -205 -182 -298
5580 -298 12 -31 -64 -139 63 100 16 -102 22 72 -79 25 -39 -17 41 -49 23 167 150 -12 -47 37 184 -86 2
5605 2 -7 299 -145 25 105 177 78 30 -40 196 283 162 134 -273 198 44 -166 133 110 -109 -82 -18 -113 175 162
$$ packed form
5462D9k4m15O35n0j84O6j62L39k78J56j23n8kO6p6L10j00K9j6k99J45l1N2P0j22
5487b3OJ05j35K44l24L59j38k24J09J90l59J65%K0K04j65k1m7k2k45J39L8jJ77
5511E2k26n5k7K85k28J57r7N5J63k44K71j07J76n1j30J05k47J6j95L71J48k45
5533e3K21J4l21J32j11K8K43l46J39kK25j10k63M25k77M04p06L31K9l3M4L6j24
5556g5K9p8O8j26M3K53j27q9J25O7k84L28q0L7K43n14m3K33j32K47l72M2K3j16
5580b98L10m3l3p5K02L7q4j18J24N0j51J04o4K2N8r0P2J44j7j62l5Q4J47k70Q8
5605BrL06m44J70Q0P2r9m8p0K36Q7j21k8m07M71j54k10K99k3k19K7O4r5K88j3
$$ [...]
8191E4
##END NTUPLES=NMR FID
##END=
