##TITLE=1H_Pr SAm OH
 DMSO, 8 sc, 
 3.06.2021
##JCAMPDX= 6.0         $$ Bruker NMR JCAMP-DX V2.0
##DATA TYPE= NMR FID
##DATA CLASS= NTUPLES
##ORIGIN= UXNMR, Bruker Analytische Messtechnik GmbH
##OWNER= root
$$ XWIN-NMR		Version 3.5
$$ Thu Jun  3 12:05:04 2021 Russian Standard Time (UT+4h)  she@DPX200
##.OBSERVE FREQUENCY= 200.131506
##.OBSERVE NUCLEUS= ^1H
##.DELAY= (6, 6)
##.ACQUISITION MODE= SIMULTANEOUS
##.ACQUISITION SCHEME= undefined
##.AVERAGES= 8
##.DIGITISER RES= 18
##SPECTROMETER/DATA SYSTEM= spect
##.PULSE SEQUENCE= zg30
##.SOLVENT NAME= DMSO
##.SHIFT REFERENCE= (INTERNAL, DMSO, 0, 15.7039)
##AUDIT TRAIL= $$ (NUMBER, WHEN, WHO, WHERE, WHAT)
$$ ##TITLE= Audit trail, XWIN-NMR		Version 3.5
$$ ##JCAMPDX= 5.01
$$ ##ORIGIN= Bruker BioSpin GmbH
$$ ##OWNER= she
$$ F:/spectra/data/she/nmr/H-F/1/audita.txt
$$ ##AUDIT TRAIL=  $$ (NUMBER, WHEN, WHO, WHERE, WHAT)
(   1,<2021-06-03 12:03:35.56 +0400>,<she>,<DPX200>,
      <created by zg, POWCHK disabled, PULCHK disabled
       configuration hash MD5:
       00 E9 B6 7A A2 85 ED C7 34 08 36 98 17 FE 4E 26
       data hash MD5: 16K
       4B FC 38 86 18 C3 35 9C 78 FC 7D F7 2A 45 8A A4>)
$$ ##END=
$$ 
$$ hash MD5
$$ 94 07 ED 97 E5 AB 0D 5E E7 11 68 7D CE 24 D2 C8
##$RELAX= 
##$RELAX= 
##$RELAX= 
##$RELAX= 
##$RELAX= 
##$RELAX= 
$$ Bruker specific parameters
$$ --------------------------
##$DU= <F:/spectra>
##$EXPNO= 1
##$NAME= <H-F>
##$PROCNO= 1
##$TYPE= <nmr>
##$USER= <she>
##$AMP= (0..31)
100 100 100 100 100 100 100 100 100 100 100 100 100 100 100 100 100 100 
100 100 100 100 100 100 100 100 100 100 100 100 100 100 
##$AQSEQ= 0
##$AQ_mod= 1
##$AUNM= <au_zg>
##$AUTOPOS= <>
##$BF1= 200.13
##$BF2= 200.13
##$BF3= 200.13
##$BF4= 200.13
##$BF5= 200.13
##$BF6= 200.13
##$BF7= 200.13
##$BF8= 200.13
##$BYTORDA= 1
##$CFDGTYP= 0
##$CFRGTYP= 5
##$CHEMSTR= <none>
##$CNST= (0..31)
1 1 145 1 1 1 1 1 1 1 1 1 1 1 1 1 1 1 1 1 1 1 1 1 1 1 1 1 1 1 1 1 
##$CPDPRG= <>
##$CPDPRG1= <>
##$CPDPRG2= <>
##$CPDPRG3= <>
##$CPDPRG4= <mlev>
##$CPDPRG5= <mlev>
##$CPDPRG6= <mlev>
##$CPDPRG7= <mlev>
##$CPDPRG8= <mlev>
##$CPDPRGB= <>
##$CPDPRGT= <>
##$D= (0..31)
0 1.2 0 0 0 0 0 0 0 0.06 0 0.03 0 0 0 0 0.0002 0 0 0 0 0 0 0 0 0 0 0 0 
0 0 0 
##$DATE= 1622707414
##$DBL= (0..7)
120 120 120 120 120 120 120 120 
##$DBP= (0..7)
150 150 150 150 150 150 150 150 
##$DBP07= 0
##$DBPNAM0= <>
##$DBPNAM1= <>
##$DBPNAM2= <>
##$DBPNAM3= <>
##$DBPNAM4= <>
##$DBPNAM5= <>
##$DBPNAM6= <>
##$DBPNAM7= <>
##$DBPOAL= (0..7)
0.5 0.5 0.5 0.5 0.5 0.5 0.5 0.5 
##$DBPOFFS= (0..7)
0 0 0 0 0 0 0 0 
##$DE= 6
##$DECBNUC= <off>
##$DECIM= 32
##$DECNUC= <off>
##$DECSTAT= 4
##$DIGMOD= 1
##$DIGTYP= 9
##$DL= (0..7)
0 120 120 120 120 120 120 120 
##$DP= (0..7)
150 150 150 150 150 150 150 150 
##$DP07= 0
##$DPNAME0= <>
##$DPNAME1= <>
##$DPNAME2= <>
##$DPNAME3= <>
##$DPNAME4= <>
##$DPNAME5= <>
##$DPNAME6= <>
##$DPNAME7= <>
##$DPOAL= (0..7)
0.5 0.5 0.5 0.5 0.5 0.5 0.5 0.5 
##$DPOFFS= (0..7)
0 0 0 0 0 0 0 0 
##$DQDMODE= 0
##$DR= 18
##$DS= 0
##$DSLIST= <SSSSSSSSSSSSSSS>
$$ [...]
##$SUBNAM2= <"">
##$SUBNAM3= <"">
##$SUBNAM4= <"">
##$SUBNAM5= <"">
##$SUBNAM6= <"">
##$SUBNAM7= <"">
##$SUBNAM8= <"">
##$SUBNAM9= <"">
##$SW= 20.0188882624521
##$SWIBOX= (0..15)
0 0 2 0 0 0 0 0 0 0 0 0 0 0 0 0 
##$SW_h= 4006.41025641026
##$TD= 16384
##$TD0= 1
##$TE= 0
##$TE2= 300
##$TE3= 300
##$TEG= 300
##$TL= (0..7)
0 120 120 120 120 120 120 120 
##$TP= (0..7)
150 150 150 150 150 150 150 150 
##$TP07= 0
##$TPNAME0= <>
##$TPNAME1= <>
##$TPNAME2= <>
##$TPNAME3= <>
##$TPNAME4= <>
##$TPNAME5= <>
##$TPNAME6= <>
##$TPNAME7= <>
##$TPOAL= (0..7)
0.5 0.5 0.5 0.5 0.5 0.5 0.5 0.5 
##$TPOFFS= (0..7)
0 0 0 0 0 0 0 0 
##$TUNHIN= 0
##$TUNHOUT= 0
##$TUNXOUT= 0
##$USERA1= <user>
##$USERA2= <user>
##$USERA3= <user>
##$USERA4= <user>
##$USERA5= <user>
##$V9= 5
##$VALIST= <valist>
##$VCLIST= <CCCCCCCCCCCCCCC>
##$VD= 0
##$VDLIST= <DDDDDDDDDDDDDDD>
##$VPLIST= <PPPPPPPPPPPPPPP>
##$VTLIST= <TTTTTTTTTTTTTTT>
##$WBST= 1024
##$WBSW= 4
##$XGAIN= (0..3)
0 0 0 0 
##$XL= 0
##$YL= 0
##$YMAX_a= 259127
##$YMIN_a= -223693
##$ZGOPTNS= <>
##$ZL1= 120
##$ZL2= 120
##$ZL3= 120
##$ZL4= 120
##$ABSF1= 10
##$ABSF2= 0
##$ABSG= 5
##$ABSL= 3
##$ALPHA= 0
##$AQORDER= 0
##$ASSFAC= 0
##$ASSFACI= 0
##$ASSFACX= 0
##$ASSWID= 0
##$AUNMP= <proc_1d>
##$AZFE= 0.1
##$AZFW= 0.1
##$BCFW= 1
##$BC_mod= 2
##$BYTORDP= 1
##$COROFFS= 0
##$CY= 11.3945322036743
##$DATMOD= 1
##$DC= 2
##$DFILT= <>
##$DTYPP= 0
##$F1P= 15.9154993809931
##$F2P= -4.1035820241983
##$FCOR= 0.5
##$FTSIZE= 0
##$FT_mod= 4
##$GAMMA= 1
##$GB= 0.15
##$INTBC= 1
##$INTSCL= 1
##$ISEN= 128
##$LB= 0.24
##$LEV0= 0
##$LPBIN= 0
##$MAXI= 10000
##$MC2= 0
##$MEAN= 0
##$ME_mod= 0
##$MI= 1.114404
##$NCOEF= 0
##$NC_proc= 0
##$NLEV= 6
##$NOISF1= 3.799351
##$NOISF2= 2.8
##$NSP= 1
##$NTH_PI= 0
##$NZP= 0
##$OFFSET= 15.70392
##$PC= 1
##$PHC0= -11480.99
##$PHC1= 11.60099
##$PH_mod= 1
##$PKNL= yes
##$PPARMOD= 0
##$PSCAL= 0
##$PSIGN= 0
##$REVERSE= no
##$SF= 200.130013532006
##$SI= 16384
##$SIGF1= 3
##$SIGF2= 2
##$SINO= 400
##$SIOLD= 16384
##$SREGLST= <1H.CDCl3>
##$SSB= 0
##$STSI= 0
##$STSR= 0
##$SW_p= 3612.71676300578
##$SYMM= 0
##$S_DEV= 0
##$TDeff= 0
##$TDoff= 0
##$TI= <>
##$TILT= no
##$TM1= 0
##$TM2= 0
##$TOPLEV= 0
##$USERP1= <user>
##$USERP2= <user>
##$USERP3= <user>
##$USERP4= <user>
##$USERP5= <user>
##$WDW= 1
##$XDIM= 8192
##$YMAX_p= 0
##$YMIN_p= 0
$$ End of Bruker specific parameters
$$ ---------------------------------
##NTUPLES= NMR FID
##VAR_NAME=  TIME,          FID/REAL,        FID/IMAG
##SYMBOL=    X,             R,               I
##VAR_TYPE=  INDEPENDENT,   DEPENDENT,       DEPENDENT
##VAR_FORM=  AFFN,          ASDF,            ASDF
##VAR_DIM=   8192,          8192,            8192
##UNITS=     SECONDS,       ARBITRARY UNITS, ARBITRARY UNITS
##FACTOR=    0.0002496,     1,               1
##FIRST=     0,             0,               0
##LAST=      2.0444736,     0,               0
##MIN=       0,             -223693,         0
##MAX=       2.0444736,     259127,          0
$$ Real data points
##PAGE= N=1
##DATA TABLE= (X++(R..R)), XYDATA
0 0 0 0 0 0 0 0 0 0 0 0 0 8 -8 8 -8 8 -16 16 -24 24 -32 36 -40 48 -56 70 -80 90 -104 120 -137 158 -176 200
34 200 -225 254 -285 320 -358 398 -442 491 -544 603 -666 736 -812 895 -987 1087 -1196 1319
52 1319 -1454 1605 -1774 1967 -2186 2439 -2733 3083 -3508 4030 -4698 5581 -6806 8626 -11610
67 -11610 17332 -32196 149345 259127 -223693 -147497 258668 178003 -194047 -78503 178126
78 178126 62237 -133109 -37245 56367 -8549 -63072 -37891 -26674 -3464 -3653 -44162 -35710
90 -35710 35246 27669 -23077 309 45944 31089 21127 20482 3764 25063 57137 -9371 -58869
103 -58869 28987 60964 -66233 -88087 44036 35146 -97047 -60568 54975 7444 -68981
114 -68981 -6452 44315 3474 -3833 20672 14084 28258 42862 -7922 -12929 61942 31867 -68740
127 -68740 -10059 79020 -29236 -107008 28287 66585 -91653 -86138 78408 32663 -110661
138 -110661 -18736 104443 -3710 -79927 44631 86769 -25870 -29859 62415 36988 -30106
149 -30106 3415 33543 -11751 -24255 8747 -3561 -35189 -18318 5321 -12483 -34034 -16815
161 -16815 17481 12347 -30602 -19228 51642 41824 -45485 -19065 88917 43515 -76411 -12198
173 -12198 103500 12097 -99418 515 85991 -26698 -91941 11915 48992 -39386 -52272
184 -52272 13571 15312 -14886 -4595 1137 31 25938 21926 -19432 789 52494 17219 -36789
197 -36789 4116 46710 -2402 -40767 -1084 21297 -12122 -30413 -13657 1124 1301 -14478
209 -14478 -25272 2327 26710 -5077 -27556 18402 41970 -6627 -21020 30005 34649 -14405
221 -14405 -13626 23644 12447 -17859 -10316 3785 -4011 -12050 -12870 -11336 -1176 -1500 -17519 -8955
235 -8955 16873 3041 -18370 10697 30509 -5304 -13058 30468 23992 -22818 -2580 36787 -1895
248 -1895 -35748 10377 27102 -29529 -33519 22769 10675 -42029 -16196 31791 -587 -36586
260 -36586 4985 36056 -4087 -24331 17858 34806 -5339 -18908 19010 29523 -11413 -23920
272 -23920 15490 22860 -23001 -29582 16860 15778 -33191 -24514 24998 8157 -35321 -6223 33287
285 33287 -697 -26764 15507 31257 -11352 -12861 27761 15995 -20270 -307 24928 -4377
297 -4377 -23205 6785 13405 -18610 -18895 9144 4111 -19462 -10554 10687 4150 -11435 -4090 12535
311 12535 10530 -4689 -3487 15202 15054 -6536 -7655 15969 12920 -15408 -12065 15512 5738 -23335
325 -23335 -11670 14904 285 -23811 -6998 16285 575 -18387 -16 19888 4041 -13677
337 -13677 3568 22759 4152 -15172 4738 23284 -2398 -21780 6554 20444 -14572 -25324
349 -25324 12649 15724 -25256 -20205 22105 9330 -29683 -6257 30583 1254 -27060 9408
361 9408 31610 -7704 -21208 19847 23938 -17359 -15252 21644 11077 -23680 -9566 19100 -49
374 -49 -25060 -3281 16877 -6026 -21200 4683 16719 -8366 -14325 13523 16324 -10665 -7839
387 -7839 19026 11375 -14211 -2787 18989 2165 -17891 937 14336 -7848 -17636 4952 8859
400 8859 -13132 -11877 9352 4939 -12148 -3266 12430 3078 -8637 2883 12483 1723 -6266
413 -6266 3776 10241 160 -7862 120 7931 -1183 -11562 -3292 8164 -1742 -14817 -3451 11666
427 11666 -589 -15484 111 16393 302 -14264 4635 18382 -1267 -13180 7143 16803
439 16803 -5232 -12947 8027 11470 -10419 -11796 8602 5763 -14034 -7488 11349 752 -15397
452 -15397 288 14624 -4059 -13937 9496 15944 -9138 -10452 16272 12891 -15397 -7224 19633
465 19633 5352 -20488 -2758 18957 -3075 -21491 2881 16152 -10094 -17215 9798 12011
477 12011 -13368 -9171 15547 7478 -14497 -1199 18256 1237 -14537 4516 16378 -4927
489 -4927 -13970 7620 12572 -10490 -13014 8929 8158 -12898 -9220 9914 4608 -11451 -3768 10222
503 10222 1940 -7558 1639 8685 -531 -4007 4632 5400 -3251 -1814 5157 1386 -5605 -1615 4054
518 4054 -870 -6782 -1955 3897 104 -6449 -3182 5655 3802 -6198 -4430 8881 7712 -7511
532 -7511 -6442 11515 9731 -10799 -8006 13010 8510 -14388 -8457 13601 5337 -15739 -6187 13056
546 13056 1922 -14273 -1464 11968 -1511 -10337 4484 8937 -5398 -4473 9878 4020 -9353
559 -9353 1293 12099 -3455 -12698 6381 12460 -10855 -13551 11944 10926 -16402 -11471 16614
572 16614 7905 -18770 -5733 19364 3546 -17979 735 18783 -1510 -14645 5948 14070
584 14070 -6620 -10310 8796 7263 -10015 -5546 8844 1691 -10627 -1009 8520 -2423 -8834
597 -8834 2678 7390 -3513 -6154 4872 6105 -3513 -3994 4716 4779 -2703 -2700 3457 2620 -2719 -2416
613 -2416 1692 999 -2625 -2140 932 570 -2208 -1829 1521 1355 -2198 -947 3279 2081 -3485 -590
629 -590 6015 1623 -5910 -20 8344 -620 -9470 1531 10336 -3760 -11874 4376 11016 -7195
643 -7195 -11808 7522 10228 -9612 -8651 10618 7318 -10298 -4449 11403 3117 -9629 471 9604
657 9604 -1948 -7904 4367 6066 -6718 -4889 7212 2026 -9765 -1419 9423 -1369 -10739
670 -10739 2593 11211 -4231 -10723 6506 11186 -6565 -9369 8679 9299 -8677 -7492 9715
683 9715 6033 -9781 -4724 8818 2355 -9126 -1562 6901 -681 -6564 1010 4701 -2102 -3698
697 -3698 3144 2910 -2515 -1572 3490 1344 -2634 -218 3025 425 -2649 -369 2452 126 -2876 -745
713 -745 2717 18 -3405 -665 3529 357 -3787 -15 3966 116 -3709 890 4515 -415 -3805
728 -3805 1652 4358 -1686 -3820 2655 3628 -3277 -3668 3257 3271 -4919 -3121 5226 2168 -6383 -1783
744 -1783 6828 525 -6932 762 7739 -1286 -7251 3172 6842 -4114 -5876 5306 4799 -6391
758 -6391 -3874 6551 1846 -7186 -849 6608 -990 -7117 2219 6423 -3597 -5517 4768 4968 -5258
773 -5258 -3567 6895 3021 -6656 -1648 7155 1126 -7073 302 6615 -1215 -6685 1857 5828 -3218
788 -3218 -5587 3422 4185 -3964 -3158 4489 2310 -4336 -1349 4782 563 -3831 190 3882 -687 -3202
804 -3202 1130 2805 -1582 -2441 1563 1618 -1867 -2190 1513 1517 -1684 -1871 1601 2018 -1334 -1691 1947 2072
822 2072 -1828 -1610 2452 1776 -2569 -1659 2935 1611 -3376 -1412 3343 506 -3939 -480 3953 -354
838 -354 -4026 765 4504 -1566 -4370 2398 4046 -2762 -3530 3840 3389 -4231 -2456 4917 1686 -5112
854 -5112 -950 5477 -326 -5963 1118 5283 -2340 -5252 3336 4554 -4269 -3540 5077 3040 -5243
869 -5243 -1795 5574 1042 -5520 279 5903 -1157 -5471 1990 4890 -2765 -4513 3270 3639 -4284
884 -4284 -2927 3887 1852 -4169 -1360 4458 844 -3998 335 3999 -413 -3339 1129 3143 -1536
899 -1536 -2401 1561 1906 -2078 -1882 2088 1393 -2597 -1048 1963 826 -2219 -736 1993 447 -1971
915 -1971 -385 2030 580 -2022 -206 1920 127 -1911 -43 2348 -69 -2286 127 2453 -661
930 -661 -2796 891 2722 -1495 -2749 1702 2563 -2433 -2173 2788 2197 -3156 -1464 3686 733 -3724
946 -3724 -543 3800 -394 -3840 1084 3620 -1555 -3686 1945 3001 -3253 -2598 3428 2021 -3886
961 -3886 -1377 4212 747 -4246 207 4350 -782 -4319 1389 3636 -2308 -3671 2428 3139 -3240
976 -3240 -2238 3301 1642 -3757 -825 3651 -121 -3744 420 3396 -853 -2866 1359 2536 -1633
991 -1633 -2282 2234 2199 -2175 -1601 2568 1216 -2524 -1127 2172 628 -2340 -214 2036 66 -1961
1007 -1961 -86 1724 -224 -1603 282 1590 -250 -1038 553 1195 -546 -1031 622 960 -721 -754
1023 -754 985 621 -1295 -918 1500 797 -1605 -669 1739 590 -2219 -473 2472 349 -2347 -67
1039 -67 2722 -514 -2771 968 3143 -1208 -2798 1564 2489 -2021 -2345 2581 1819 -2567 -1327 2957
1055 2957 536 -2936 230 2907 -779 -3253 1483 2704 -1750 -2499 1996 2143 -2803 -1733 2959
1070 2959 1245 -2794 -765 3390 414 -3190 288 3384 -777 -2911 1272 2655 -1699 -2281 2241
1085 2241 1528 -2173 -873 2237 514 -2398 138 2312 -89 -2396 528 2018 -952 -1683 721
1100 721 1632 -883 -1525 856 1338 -1282 -875 1135 894 -865 -945 1194 857 -607 -783 859 680 -898
1118 -898 -571 798 590 -1019 -289 1258 187 -994 136 1247 -360 -1126 498 1505 -649 -1216
1134 -1216 1172 1127 -1290 -1289 1810 1180 -2138 -1239 2163 847 -2279 -731 2682 257 -2821 145 2912
1151 2912 -759 -2432 841 2299 -1117 -2096 1745 2052 -2066 -1209 2117 755 -2140 -253 2544 -177
1167 -177 -2112 524 2145 -1004 -1993 1408 1713 -1454 -1553 1651 1381 -1790 -961 2128 626 -2014 -260
1184 -260 1918 96 -2008 271 1897 -543 -1819 1075 1394 -1135 -1462 1394 829 -1431 -591 1396
1200 1396 404 -1464 -448 1468 281 -1070 -313 1002 97 -1045 159 1014 30 -1074 132 999
1216 999 -134 -1273 481 1100 -506 -1197 532 958 -557 -1018 837 1063 -1027 -640 1332 430 -1430
1233 -1430 -170 1572 23 -1684 94 1482 -310 -1710 517 1286 -633 -1512 1096 1222 -1230 -1474
1249 -1474 1371 1157 -1673 -635 1701 360 -2026 -526 2319 33 -2006 624 1991 -875 -1927
1264 -1927 1276 1379 -1372 -1228 1424 1048 -1830 -648 1945 424 -1612 38 1686 -464 -1748 407
1280 407 1525 -708 -1139 1103 929 -997 -1080 1158 612 -1253 -574 1457 342 -1466 -150 1392 -163
1297 -163 -1437 13 1136 -384 -1219 900 920 -822 -1076 790 457 -564 -751 656 685 -744 -498
1314 -498 950 523 -557 -263 877 254 -766 -304 982 -29 -859 -189 1032 -76 -1075 232 1005
1331 1005 -399 -1185 506 1110 -1076 -1005 853 850 -1017 -719 1285 441 -1385 -24 1495 -165 -1615
1348 -1615 78 1529 -288 -1429 470 946 -517 -1307 1015 1032 -961 -783 1698 815 -1326 -353 1530
1365 1530 234 -1607 132 1620 -381 -1465 538 1443 -953 -1486 1694 1041 -1465 -361 1339 391
1381 391 -1317 -388 1614 456 -782 -49 1327 -632 -579 734 921 60 -740 412 397 -508 -786 1072
1399 1072 779 -1013 288 809 346 -1122 -377 1190 291 -912 -226 988 -96 -597 492 880 175
1416 175 -612 364 808 -309 -688 722 720 -920 -803 375 493 -698 -821 725 643 -1028 -421 827
1434 827 262 -1376 -115 1166 -168 -1204 134 1286 -378 -1277 583 1055 -868 -916 873 856 -1443
1451 -1443 -650 1186 270 -1274 -258 1646 -144 -1377 259 1168 -732 -828 560 1204 -782 -967 761
1468 761 842 -980 -708 1172 422 -1023 -285 1066 -209 -1130 332 873 -592 -899 224 762 -704
1485 -704 -459 578 697 -1432 -624 555 657 320 73 476 206 -857 383 1161 -157 -788 -337 802
1503 802 75 -457 305 462 -498 -361 424 274 -775 -449 906 1202 -620 -569 1004 -230 -969 506
1521 506 914 322 -958 -205 585 -536 -472 643 975 -384 -859 538 1007 -915 -1046 1156 451 -959
1539 -959 -968 727 402 -1290 -212 1146 295 -1559 -289 1192 141 -1015 74 900 -432 -513 367
1556 367 527 -1534 -229 718 530 -921 -72 727 476 -1177 418 1633 -203 -1207 463 1287 -205
1573 -205 -817 176 936 -318 -560 505 543 -253 -115 423 586 -674 -198 1041 40 -1010 -235 468
1591 468 -311 -881 278 814 -257 -391 829 535 -175 -446 402 421 -393 -409 311 459 -845 -881 206
1610 206 157 -756 -221 807 169 -845 -205 624 -818 -920 156 758 -242 -939 205 518 -907 -525
1628 -525 552 463 -502 452 464 293 -1512 -1015 1007 -529 -943 -261 1306 -338 -1380 45 656 -675
1646 -675 -729 268 267 -772 -641 1273 -26 -1102 20 788 406 -950 131 1119 -322 -662 -445 877
1664 877 -383 -760 928 394 -774 -277 997 513 -891 -354 851 -5 -780 -103 939 -131 -628
1681 -628 2 699 -329 -591 306 524 -578 -387 307 559 -542 -153 747 107 -468 -464 522 415 -407 -73
1701 -73 762 170 -645 18 800 -236 -378 101 485 -255 -475 196 434 -587 -645 621 719 -417 -358 739
1721 739 360 -869 -111 961 224 -672 -112 660 -183 -727 351 714 -306 -771 217 521 -673 -668 558
1740 558 229 -511 -406 881 287 -738 11 562 181 -927 134 471 -287 -635 260 842 -633 -627 706
1759 706 507 -739 -412 655 426 -834 -262 673 -29 -704 157 324 -29 -646 196 613 -462 -529 442
1778 442 509 -446 -316 388 483 -543 -63 516 261 -589 -86 756 416 -481 -41 691 -81 -432 130 662
1798 662 -114 -409 300 432 -268 -305 277 431 -472 -269 332 171 -589 -475 525 173 -754 -269 564 93
1818 93 -792 212 693 -59 -620 66 664 -235 -575 151 539 -504 -444 662 356 -630 -16 642 109 -586
1838 -586 118 781 -104 -675 354 441 -232 -487 647 596 -628 -366 464 289 -685 -297 577 289 -562 -3
1858 -3 600 494 -421 20 713 -458 -347 232 721 -203 -429 170 180 -391 -323 431 200 -445 -192 487 -142
1879 -142 -294 -323 349 54 -245 98 537 162 -291 -78 450 28 -435 -174 482 -148 -427 399 290 -163
1899 -163 12 254 381 -236 -359 389 -15 -511 -413 403 35 -502 19 394 -229 -416 547 537 -429 -526 317
1920 317 427 -244 -147 294 -55 -778 10 329 -19 -724 -19 828 -161 -671 311 29 32 -1018 -33 449 -525
1941 -525 -505 187 160 -551 -267 717 255 -791 -266 727 86 -635 64 452 -150 -462 289 385 -14 -724 83
1962 83 415 -463 -451 613 346 -552 -46 331 190 -390 -431 410 129 -605 75 497 -59 -361 17 143 -113
1983 -113 -530 248 283 -267 -145 93 92 -220 -241 336 9 -438 -290 476 33 -441 -74 88 -44 -206 -193 577
2005 577 -4 -415 137 190 -272 -486 298 181 -355 -506 556 329 -707 -204 423 221 -474 285 605 -272
2025 -272 -409 340 628 -413 -657 379 619 -360 -317 339 129 -568 -123 446 124 -405 -14 530 24 -580
2045 -580 -21 434 -95 -472 117 407 -32 -270 378 88 -285 -288 466 40 -569 -243 383 157 -295 33 386
2066 386 136 -200 71 219 -10 -413 124 230 15 -156 142 273 -158 -66 250 -111 -91 -332 293 -45 -267
2087 -267 -231 306 -4 -905 157 381 331 -545 336 370 -224 112 777 135 -76 -346 348 406 -311 -328 178
2108 178 66 -328 -66 826 -19 -418 184 751 -167 -262 159 334 -183 -425 335 423 -331 -131 477 289 -614
2129 -614 -142 661 6 -494 -74 746 31 -166 293 361 -209 -398 211 559 -597 -360 439 211 -456 -314
2149 -314 312 204 -335 84 417 62 -221 279 300 98 -224 -205 20 -150 -63 356 -110 -157 -286 106 421
2170 421 -207 -19 292 -12 -271 149 227 41 -388 -8 205 -9 -257 87 237 325 -14 224 108 -149 -231
2191 -231 222 314 -180 -169 101 107 -179 -27 271 98 -498 55 622 -56 -388 -308 338 177 -592 86 329 -248
2213 -248 -197 361 368 -438 -305 296 485 -92 -619 -25 545 -422 -17 -40 -676 -537 -488 -141 -223 -501 -156 534
2235 534 -880 -710 177 13 -554 184 -11 98 -13 -171 441 -359 -273 384 428 -299 -380 -45 259 -35 -80
2256 -80 53 62 -223 71 17 17 -257 -47 287 -100 -13 -70 -140 33 70 233 -32 -117 -193 214 -241 -42 -202 170
2280 170 7 -33 -19 373 -31 -338 -210 141 4 -203 -129 -39 169 -30 -101 428 78 -418 -117 283 -245 -398
2302 -398 86 267 -199 -396 184 344 55 -188 220 331 -375 126 550 -10 -561 -11 517 -334 -277 64
2322 64 281 -287 -396 218 282 -302 -129 302 175 -503 -33 414 181 -249 -116 399 -46 -619 110 272 104
2343 104 -501 236 170 -101 0 229 53 -187 -14 284 -115 -218 28 467 -237 -203 -152 860 -77 -774 552
2364 552 -466 -175 -73 228 33 235 -212 106 -82 78 62 180 -88 -47 -15 265 138 85 -232 196 52
2385 52 -184 0 104 79 -171 39 147 31 -181 -70 242 82 -143 112 332 -304 -242 145 180 -143 -380
2406 -380 245 127 -172 12 179 151 -375 121 114 -3 -417 179 235 11 -122 398 289 -50 -16 438 124 -325
2428 -325 -8 347 -221 -133 263 139 -339 -338 94 195 -169 53 286 26 -285 -33 397 46 -201 134 132 -46
2450 -46 130 255 -115 -76 139 160 129 -157 -70 124 -223 -104 254 -145 -121 -211 -22 206 -146 1 111 27 21
2473 21 -291 -109 -89 269 57 -192 57 -32 -221 89 181 32 50 235 160 84 51 353 -15 -81 -409 207 5
2496 5 -245 -81 76 196 -334 168 117 -254 -288 38 168 -263 -243 257 192 -231 -107 245 30 -291 -47 216
2518 216 42 -551 -131 225 -160 -395 18 130 -183 -247 188 51 -230 83 180 116 -258 6 168 -22 6
2539 6 105 152 -297 -157 122 61 -43 145 -25 -217 -56 -268 -92 13 3 -103 -125 57 107 65 118 12 -212
2562 -212 300 213 -163 -364 -78 216 -203 -52 26 -64 -26 -238 237 146 -138 103 95 -4 -80 -56 106 99 95 6 32
2587 32 -55 -98 -59 388 71 -411 -163 265 31 -336 245 119 -91 -270 85 220 21 44 181 122 -394 -209
2609 -209 115 69 -311 7 436 54 -223 79 -93 -65 44 -87 66 -235 24 212 -11 -294 222 429 13
2630 13 -265 59 29 -106 -286 202 239 -69 -6 217 -8 -61 -29 -37 -35 -294 -36 122 -126 -39 -240 135 -111 -71
2654 -71 -8 -88 135 -24 21 25 -424 215 55 -42 71 154 67 218 14 -45 12 102 -41 -76 29 84 72 -115 166
2679 166 -7 -138 -148 186 -48 -155 134 16 -126 16 23 9 -131 -22 164 86 33 17 11 14 -259 157 401 -230
2703 -230 -139 -27 -77 -118 -20 189 -63 -181 -195 214 66 -398 -202 69 -123 -386 0 73 -141 -278 124 222
2725 222 -138 -158 212 -86 -315 -88 14 -203 -243 152 502 -78 -307 69 -9 -241 119 250 -266 -110 -154
2746 -154 221 105 21 -71 151 92 -26 27 61 -9 -11 -106 -194 -87 -199 78 8 -26 188 92 136 -49 -130 197 214
2771 214 285 -66 163 230 84 23 64 -51 -43 41 138 -38 -362 134 -42 200 -68 16 -13 -176 -163 -2 287 -5
2795 -5 -171 -61 -22 -319 101 -38 -89 -136 -271 280 152 -45 126 199 -20 -104 200 39 -197 -448 307 86
2817 86 -238 43 -217 222 -259 -190 97 -168 -57 158 217 -191 -142 188 288 23 -237 212 -56 -207 -94
2838 -94 327 49 54 -15 395 -161 -267 -19 35 -92 -14 378 68 -157 -28 115 98 -21 43 62 -92 -77 -160 114
2862 114 11 -81 273 194 29 -255 88 152 108 -121 -32 -192 91 -183 27 125 -147 -1 261 110 59 74 173
2885 173 344 -77 -477 -16 436 -36 -275 126 -5 -4 23 185 106 -213 332 48 22 -132 108 402 -167 -46
2907 -46 125 49 -154 -32 206 136 -82 -175 206 116 20 111 89 -232 -282 83 83 -83 -223 21 36 -198 -45 38
2931 38 269 55 493 210 26 -225 -180 136 -223 193 239 61 -243 50 429 -288 -301 -42 -41 102 -171 147
2953 147 -127 -61 -21 56 11 -234 5 29 -129 259 -43 218 0 -169 168 94 59 103 401 64 68 335 -33
2976 -33 184 -104 -161 -127 47 -28 275 -55 173 153 -145 100 186 -304 -128 -28 173 -101 -167 271 291 -30 -183
2999 -183 285 262 -670 -184 242 139 18 0 71 34 -62 44 5 -56 -195 169 81 -157 -22 -109 -288 -115 -84
3022 -84 -148 319 -201 196 183 -239 80 90 -246 6 -253 259 194 -92 -104 117 -291 -89 200 3 -268 -145
3044 -145 -101 -108 -47 -139 77 203 201 -188 -117 36 -174 -74 155 147 134 -82 -91 125 48 167 -84 -352 -8 -78 114
3069 114 -160 186 4 -5 72 -49 26 -37 1 -91 -23 161 44 158 28 149 -108 -127 -160 -102 67 72 -249 159
3093 159 8 -210 50 24 -27 4 249 120 -167 -107 140 -188 130 -155 6 -112 -74 339 -64 -116 -175 102
3115 102 84 3 -47 188 -73 -211 -31 63 105 52 83 77 20 -43 169 -54 -106 -88 81 -51 -507 45 77 76 160 8
3141 8 88 -193 284 82 107 -252 47 110 -153 34 -178 126 -74 -134 70 -58 46 84 -28 -45 35 -124 76
3164 76 -74 72 69 -68 -49 -227 -177 70 79 66 84 19 -51 78 30 127 129 157 -86 -252 109 -180 145 116 121 127 -233
3191 -233 88 -255 -116 -46 195 -16 -134 53 -51 22 -90 197 207 -113 -55 354 -132 -77 -116 -97 -140 -80 59
3214 59 -102 54 -201 26 -9 -131 -164 45 27 17 287 360 90 -440 75 -177 53 -44 205 106 59 235 58
3237 58 216 -199 156 51 -78 -89 -40 51 54 -69 -78 193 -35 63 111 267 -4 25 -171 -11 58 231 148 159 -240
3262 -240 -229 35 -226 -147 70 -17 -20 -208 -152 -57 134 36 43 64 41 35 -82 13 118 19 -290 1 -6 321 184 -177
3288 -177 -41 -201 -122 11 71 -149 -125 152 12 220 -122 145 136 -66 41 6 -255 -48 41 -160 -173 58 86
3311 86 -198 115 85 196 2 -102 108 -20 -159 -114 63 -156 29 37 446 -69 -126 239 136 -204 -5 53
3333 53 -86 56 146 284 -248 -16 42 -24 135 -132 -102 176 30 15 -62 126 125 26 87 -94 -129 159 6 281
3357 281 -17 -3 -14 -54 24 358 0 -63 -6 42 151 196 -150 -197 -112 2 -44 60 -139 154 47 -7 -98 269
3381 269 10 -143 17 -266 58 -87 78 23 -225 113 -33 113 152 223 -56 -173 -59 -147 -197 -6 -127 254
3403 254 22 12 -93 187 -22 -165 -36 -145 -138 -61 129 -41 46 50 81 224 -111 107 197 -33 -78 240 270 -119
3427 -119 61 2 221 83 -157 -176 -32 69 139 62 -11 2 162 13 -215 -128 127 -93 -86 -42 -64 -49 -21 245
3451 245 384 -63 -24 -233 25 -26 11 23 11 130 -69 -243 -80 -96 22 28 -89 -98 135 36 -86 -14 69 -113
3475 -113 -112 -20 -41 -215 -109 -82 -101 -283 -44 -89 78 -32 238 21 -28 276 75 140 432 249 -68 -21 -259
3498 -259 -193 219 327 -81 -7 102 220 -107 111 164 -3 258 -108 34 58 7 -127 -233 -52 340 -200 35
3520 35 -31 -228 -36 -89 96 -28 -165 89 157 -52 -100 104 17 -151 66 276 80 95 -138 40 9 60 -127
3543 -127 163 123 -131 -121 -214 -384 0 94 -95 44 -102 -126 123 12 -119 -38 -400 -168 -51 237 -7 134
3565 134 37 130 -149 79 -48 -90 -28 -194 -194 174 -31 -82 -55 -34 87 -109 13 -266 52 -216 -166 269 -159
3588 -159 103 75 -110 208 149 -251 -78 -164 6 384 70 -135 21 47 219 -174 32 228 -138 156 -77
3609 -77 220 88 -49 -311 75 285 317 36 246 -257 3 -93 -177 60 -253 138 337 -138 252 227 -17 -16
3631 -16 201 138 6 -104 88 -72 -173 -43 -136 -122 -164 105 -194 -29 14 10 -85 -63 -6 151 215 245 17 267
3655 267 -241 -230 403 -260 129 -247 -81 197 -142 -197 143 -331 -65 70 -29 125 177 125 298 82 380 365
3677 365 -217 24 -396 306 102 59 -466 -631 226 572 44 -553 -425 79 -215 -35 -169 170 149 -526 100
3698 100 -60 -115 -123 -51 220 -326 123 -207 336 -479 -488 -73 30 -252 -50 -307 -468 192 443 -42 -44 -206 152
3721 152 -170 -38 131 263 12 564 39 -47 -284 293 125 -6 -85 -20 377 -490 -69 296 414 -235 -516
3742 -516 48 -72 -396 -523 354 102 99 574 722 6 393 16 253 157 144 6 -158 47 178 84 -166 281
3764 281 -433 453 402 365 -372 641 -89 457 -345 -567 219 150 -3 72 -341 -643 -687 0 129 209 -104 351
3786 351 -93 -161 90 -380 3 -106 -109 -139 -562 -229 186 -137 326 147 241 -349 101 -100 30 -39 -47 90 190
3809 190 32 -100 -67 -55 191 78 318 40 -254 132 -53 -9 -100 -27 153 92 -6 -65 -67 67 -80 68 61 220
3833 220 26 -62 -138 68 -39 276 130 -85 -158 -31 122 -64 -106 4 169 -151 -68 61 24 -16 -181 -38
3855 -38 37 -151 -137 171 12 10 236 -9 107 182 -177 25 -176 29 -85 15 177 -106 -25 220 -145 -70 -267
3878 -267 154 -18 -33 7 -75 -80 -38 -93 -37 -300 -88 19 -118 -331 21 -84 -303 6 -220 59 -151 -208 268
3901 268 64 79 112 -25 124 -220 128 -2 -82 -119 -134 20 -212 102 -43 -2 -148 215 118 149 12 -44 -263
3924 -263 -208 394 38 205 192 239 105 133 -49 -49 150 -11 -111 284 -73 -224 -60 -110 123 4 -144 352
3946 352 -166 50 93 -21 224 -190 89 79 41 -6 -93 -176 154 -28 242 141 -120 165 -223 270 59 -119
3968 -119 -74 -204 0 128 143 -128 -97 -184 224 84 158 -2 63 -118 30 -57 15 97 3 181 -25 -289 -31
3991 -31 -210 39 -121 -127 -76 -112 -38 268 88 -39 237 -202 51 36 -254 -133 -160 -159 13 87 172 -271 -90 254
4015 254 40 54 -101 31 46 -123 198 -7 -33 244 284 -20 94 -135 111 147 -422 -16 429 116 20 -43
4037 -43 35 54 294 186 -331 -102 491 327 291 -361 415 -323 -268 -200 72 38 -47 -9 246 -441 179 661 250
4060 250 -248 -49 -42 -172 224 -192 459 650 81 91 -42 -198 -52 -115 -129 267 -189 91 -49 16 -58 7 -110
4083 -110 -1 51 -54 -168 -61 -76 -40 144 175 179 43 89 148 40 -233 71 -80 -195 -97 57 -103 -195 6
4106 6 -114 124 95 114 82 183 93 33 -18 -115 -161 318 104 -186 36 -89 -28 -50 5 41 150 -292 -42 162 -16
4131 -16 -235 72 111 83 -164 -46 133 0 -338 -17 141 204 200 97 137 -42 -150 -146 -129 -13 196 -108 27
4154 27 -75 63 182 209 -72 28 -4 -11 15 175 -273 1 122 -108 26 -86 55 102 -89 -121 -150 -160 325
4177 325 -21 94 179 278 -48 -25 -47 -229 58 -5 -98 71 59 266 -277 -673 -436 438 731 -134 128 -20
4199 -20 -23 -84 -111 139 -53 -58 -15 141 95 -23 -16 -69 -25 -184 31 -97 -71 116 51 97 -212 -103 107 62 74 -153
4225 -153 121 -285 54 -103 115 -177 244 42 242 -169 52 45 -91 -155 -91 63 7 101 156 42 -100 -4 79
4248 79 271 72 116 284 -152 -34 -145 -181 31 -79 -236 85 -25 -144 -50 -219 -154 137 165 94 -165 108
4270 108 -124 -15 93 136 -28 -8 -242 94 -67 -56 4 -76 -69 -177 132 -71 -192 50 150 -266 30 77 46
4293 46 -36 81 89 172 -214 112 82 12 -58 131 116 -161 -24 136 -103 -246 -196 -122 29 -169 -83 70 -15 -48 133
4318 133 -134 148 102 114 193 108 -4 20 103 -80 -120 82 -172 54 241 -83 -3 79 71 -77 -141 40 29 180
4342 180 -164 -33 -88 -27 56 36 52 21 -172 96 191 54 30 3 -125 120 204 118 -36 -194 -18 -217 -68 44
4366 44 -52 -247 -225 7 106 147 -126 -40 15 -207 46 -6 -90 48 -76 140 -4 50 258 200 -94 -100 -247 51
4390 51 -46 110 23 135 7 -117 55 -14 214 17 -100 -116 -159 -93 73 -40 -118 -17 21 161 26 404 88
4413 88 39 -29 -47 58 -7 -29 23 25 49 -99 -330 15 207 35 -40 97 157 14 -191 21 32 -97 92 -149
4437 -149 82 -37 -176 -59 -75 -15 39 50 -104 -76 125 76 -176 -14 -103 97 -238 -240 -71 111 188 -64 15 -155
4461 -155 41 179 -46 -21 -123 -162 -96 -100 -64 13 36 -131 -53 144 93 -98 -13 -163 213 55 81 148 -178 20
4485 20 -90 -30 -107 -153 162 10 175 25 -67 232 -242 -138 -135 75 24 -91 61 -286 -83 265 20 -89 -109
4508 -109 111 258 -8 7 -114 58 -118 -129 232 109 96 82 31 172 -33 2 43 -91 13 -72 89 -57 58
4531 58 80 87 -169 -25 238 -124 -50 84 -233 -26 -39 -65 -32 48 131 10 191 -160 -240 -72 53 -243 -299 122
4555 122 70 -120 195 229 226 194 -48 -4 388 180 -133 284 36 -214 62 138 38 357 5 149 162 -119 29
4578 29 260 90 107 105 417 -55 -64 703 595 -344 -234 279 48 -347 -472 -31 119 457 148 -197 -119 -647
4600 -647 305 22 176 373 48 -289 -162 -605 263 137 4 95 -262 -128 -630 -170 338 -298 -707 106
4620 106 539 280 -52 -445 11 319 -411 357 -594 370 574 -682 -358 -106 286 -351 24 531 181 -235
4640 -235 89 -215 1455 -611 -515 -394 528 185 -215 108 -267 432 11 206 -7 -423 -252 -529 -268 316
4660 316 -92 -200 5 259 249 259 17 -441 13 -130 -265 102 -203 20 93 101 -227 -257 37 518 -583 230
4682 230 -28 444 344 -141 55 -596 -131 -83 -68 -339 113 -715 25 -507 688 240 -286 -308 -91 -727 -304
4703 -304 71 36 66 328 274 -341 111 103 162 61 14 88 2 -103 -256 -355 320 -310 57 -73 -284 84 113 8
4727 8 -176 -144 51 -159 -220 -22 185 -36 85 66 137 -99 253 -100 -87 122 3 28 -14 -81 -152 -91 -56 133
4751 133 -63 -24 -94 -31 -300 -152 20 327 -84 210 -113 29 -277 65 15 -109 43 -76 198 -259 -88
4772 -88 -115 -27 -154 -71 118 67 -181 -273 335 980 99 -102 335 268 241 221 -247 98 15 -79 -51 109 -62 156
4796 156 -27 5 76 -491 -195 148 -229 -70 -70 -109 -118 135 -287 -47 55 201 72 73 -11 89 -313 -53 195
4819 195 253 249 37 121 -123 -36 -8 65 80 -35 163 -23 36 -104 -73 108 9 -22 -94 -222 -174 -133 56 137 48 -133
4845 -133 -301 213 157 111 -48 85 178 49 68 123 -103 -149 58 -30 91 61 266 25 -140 -105 77 114 -38
4868 -38 21 -240 49 303 -44 -26 -239 78 125 -185 -298 -191 131 -201 54 37 -136 -96 -171 3 195 59
4890 59 73 69 138 24 76 -119 172 48 -81 -199 -130 -255 -87 255 9 -150 20 59 -259 58 7 -126 211
4913 211 -119 -167 256 -105 81 65 -163 125 79 87 -263 86 115 339 -46 -156 111 -189 -32 -47 264 -88
4935 -88 -45 84 -38 -182 -118 260 -71 155 14 -293 232 -56 71 -100 6 13 -193 -295 30 7 124 -76
4957 -76 67 227 51 114 -11 118 183 -39 -168 95 -16 293 -324 -321 -163 -206 -192 -81 14 86 7 47 -250 38
4981 38 -239 -498 60 73 -247 -45 -24 116 -303 -154 -228 -65 -31 -63 60 -42 195 -134 -132 39 234 3 217
5004 217 -1 -34 -245 211 72 3 36 207 9 -10 -31 22 -77 4 325 -103 143 159 -179 -96 313 47 -284
5027 -284 -59 -153 300 -14 203 71 -89 -14 77 -223 -4 194 -50 -27 -186 209 267 -131 70 2 -178 -90
5049 -90 102 -79 2 33 42 -139 53 157 -125 63 198 -50 -257 67 239 12 30 -78 -119 181 13 47 -218
5072 -218 -90 31 244 -178 50 23 -77 4 -113 106 56 29 -94 434 -124 -207 -517 150 -306 -11 -21 -536
5094 -536 -864 -552 -308 623 -190 -263 210 -402 -156 77 85 69 162 -6 -200 28 -69 -154 -77 -94 -275 29 151
5117 151 -186 -138 46 105 -204 -74 59 62 60 107 -321 -60 -45 11 -185 -101 -105 -49 99 121 122 95 -186 154 -174 -48
5143 -48 -89 -73 -12 -77 -54 49 -225 -205 -153 6 -170 -122 107 7 157 -133 181 11 51 -33 196 -127 5 180
5167 180 26 45 62 190 -31 -86 -21 -79 208 52 198 -113 26 -207 133 -59 32 21 116 161 7 102 -191
5190 -191 -138 148 -66 -102 222 -14 48 -297 127 0 26 2 85 -39 8 336 92 155 24 96 -55 -126 -66 143
5214 143 -137 270 0 192 26 -56 31 -145 -367 -16 20 48 268 193 -78 184 128 -32 -31 137 -269 26 134
5237 134 -132 285 -378 -45 -25 -5 -33 -30 312 93 -8 84 184 11 -263 164 -225 -17 -55 144 201 -285 -89
5260 -89 174 -71 179 15 -152 -252 -129 -73 10 70 13 -120 97 -178 -174 -114 242 -100 -125 72 -461 -157 551
5283 551 274 -777 -210 -127 228 274 127 -1136 -1340 -362 -201 -111 -137 432 -502 -59 83 -268 -45 248 -60
5304 -60 -461 82 -38 313 35 14 167 148 -44 -236 340 126 117 -96 -315 14 -74 -20 -72 -148 44 -175 267
5327 267 138 -57 -115 79 7 196 -32 -87 -105 -30 -158 83 124 -144 131 -4 10 244 82 185 -27 84
5349 84 -168 41 145 -23 105 -12 -44 -130 -91 63 -59 -189 -56 37 42 -260 51 303 -232 -153 -49 254 107
5372 107 -36 -54 43 412 -142 -50 113 -77 56 -139 165 120 -370 -13 97 -273 182 -86 -108 -194 -89 76
5394 76 43 95 -39 296 -218 29 -51 316 -140 184 -1 7 190 212 -263 409 -35 -183 225 -239 -186 -214 -90
5417 -90 -33 157 -51 34 38 83 -22 77 9 194 -167 -105 26 70 259 -156 20 -26 -350 205 199 -128 122 318
5441 318 100 225 -4 73 -73 52 90 64 -30 69 -78 -96 -105 -145 93 -166 -88 -120 -43 78 212 211 -100 -19 -54
5466 -54 93 164 68 88 356 -37 -57 46 -112 -35 30 -22 -64 -70 173 208 121 62 45 -298 6 188 -301 18 -304
5491 -304 -210 128 110 -108 70 -70 66 85 -35 -13 211 95 -17 -78 83 154 -10 254 64 -98 94 -15
5513 -15 233 -49 47 190 12 -80 -63 -186 -29 -33 27 130 134 249 79 212 -79 -83 -61 -88 33 56 173 -311 206
5538 206 -56 -92 35 63 -35 57 -61 -91 -220 100 0 -90 100 -153 286 271 310 -183 25 33 70 69 32 -78 151
5563 151 9 -79 -22 314 -191 46 220 -75 7 90 7 -189 -174 -43 18 -34 -32 258 -47 -209 12 332 -39
5586 -39 -5 -118 -51 87 181 -218 259 8 -218 341 30 -177 -35 70 -288 2 -2 -19 170 147 155 274 -17
5609 -17 38 67 66 66 -95 206 -59 15 4 -27 -24 -18 -140 89 -56 -13 -184 -95 104 144 -360 -93 32 -123 158 47
5635 47 92 -1 -56 175 -28 -205 23 -148 -59 -116 -150 -59 -59 -61 -133 22 -25 -109 89 -76 -179 -55 251 50 60
5660 60 -118 -109 118 -203 -153 -114 -83 -227 -215 233 55 102 -175 104 -11 -403 -4 -10 -123 -132 8 -73 176 -3
5684 -3 41 -124 -368 79 -8 -168 -127 133 57 43 -393 31 -86 -41 -229 150 41 -140 -78 -147 -96 207 111 -73
5708 -73 -86 245 155 -60 67 -99 5 -3 77 90 -133 0 -139 124 100 17 209 7 296 152 -116 47 214
5731 214 -260 -34 -50 15 -51 -192 -140 -21 -160 137 48 325 194 51 38 -152 19 214 -144 -50 10 42 -138
5754 -138 93 -51 67 143 -64 -98 75 198 -128 -268 61 -167 -22 -138 -85 -38 125 111 64 -181 108 128
5776 128 166 252 91 -37 -105 164 204 -48 85 -155 -125 61 -17 -242 186 -35 112 -104 3 72 -76 -138 182
5799 182 226 47 41 -48 -142 -95 130 -41 -296 -208 96 -170 107 65 -28 -36 -177 -58 2 -150 102 -74 -149 -322
5823 -322 -12 -71 -80 -56 189 -42 -58 0 -93 -106 -337 -399 -4 95 -162 37 -36 -50 -190 -79 50 129 72 -196 38
5848 38 -197 -178 181 77 50 155 -61 -250 0 -96 -138 165 20 -101 -138 -140 88 0 -109 -39 18 -308 -214 -38
5872 -38 -332 -100 54 14 112 34 -35 47 174 -117 30 15 -121 -79 -38 97 -60 120 152 140 -74 -88 0 59 179
5897 179 -213 0 -102 8 32 -20 81 -73 1 -211 -187 135 119 -27 99 -33 -230 44 -56 121 83 -201
5919 -201 -93 -131 -157 180 84 81 -55 -60 -153 -16 40 32 202 49 -121 -58 105 -172 -14 211 23 -35 -53 -212 177
5944 177 -111 225 199 -5 -43 -169 -138 -43 -113 149 -100 -5 1 -28 -124 208 125 -85 -18 -108 -130 60 -17 -358 109
5969 109 -26 89 70 -225 203 -119 220 50 -22 -168 75 -20 -16 -134 -97 142 -172 -242 17 -14 -29 153 -63
5992 -63 95 46 -203 130 81 -28 -4 92 -81 145 93 -281 -100 128 -149 80 -136 152 147 -100 132 93 -114
6015 -114 -123 17 9 -123 -102 -62 -97 253 360 112 -73 -76 -12 229 -68 -40 313 251 -89 64 -136 -23 -188 -17
6039 -17 125 -97 -47 -7 34 -26 -77 -70 -84 112 99 -13 -135 -69 -109 -135 200 244 60 -205 25 167 64 -53 48
6064 48 -144 -123 -47 -165 219 -292 318 146 81 -197 36 181 -22 -7 94 -198 425 57 131 -43 79 219
6086 219 -142 51 -140 89 -117 -40 -122 -137 282 -114 158 -91 157 18 0 38 132 198 152 114 104 -67 248
6109 248 -190 -14 84 -56 -51 -98 -27 475 135 -136 109 -75 200 106 28 287 95 -112 182 89 118 182 -116
6132 -116 55 -207 279 154 -64 -19 -220 -132 -132 289 29 148 246 147 106 125 -25 -93 -67 5 161 84 49 -243
6156 -243 -31 123 -31 -1 -142 88 -70 -39 22 -73 70 -21 -250 -39 29 65 -27 -47 -54 -72 -17 174 131 279 -19
6181 -19 294 -256 -18 144 -178 140 -9 -69 -56 -92 68 155 17 26 -347 158 36 -23 -2 -124 46 228 -37
6204 -37 160 -130 13 -130 305 58 -150 5 -52 -133 -28 32 -99 -104 -222 -28 -105 -123 108 124 30 -71 -157 3
6228 3 -119 -71 -113 83 -129 -86 19 -11 53 -167 -95 -118 171 -363 -144 -12 98 77 -306 145 -29 121 87 122
6252 122 235 8 -75 122 207 -188 -53 121 28 -11 -98 -73 47 -185 30 -78 53 -4 103 20 36 43 100 -13
6276 -13 15 219 -122 -75 -36 77 -178 189 6 -21 116 -44 63 -348 90 16 323 1 21 271 33 -110
6298 -110 114 -40 -35 -192 -177 -27 -193 -58 -41 -69 92 113 280 17 -213 -264 107 129 -156 63 -53 -39 154
6321 154 117 24 -155 -38 63 -27 -174 44 -182 -183 -296 -192 84 127 22 97 105 23 216 117 -142 -210 -232 125
6345 125 264 111 244 -14 340 -163 26 103 -39 240 221 122 84 146 -153 -60 138 -66 -178 -9 -385 -65
6367 -65 -123 -72 -142 -111 65 227 217 93 -74 -28 -88 164 -22 -266 113 -206 -89 -28 -167 -72 -159 92 128 33
6391 33 -88 -12 -95 -39 149 1 32 7 14 -15 109 158 -23 26 59 417 107 -107 -72 -117 309 243 221 -213 -336
6416 -336 -228 -29 35 81 323 -474 116 330 311 -135 -551 275 -157 -223 -480 -75 290 -454 -60 84 460
6437 460 74 328 -123 325 -632 -10 -144 -113 -208 885 227 395 371 -340 646 -91 -292 226 2 -380 34
6458 34 -143 371 -105 187 -82 -141 -158 163 -52 -303 -65 -129 -247 -255 474 -32 -499 -121 -121 -260 63 273 738
6481 738 168 -211 174 -109 -492 266 -103 473 571 -4 527 -178 -476 53 18 67 274 -470 27 1304 915
6502 915 298 -525 -250 -39 196 690 -22 46 172 -861 -965 1049 306 443 -113 -476 108 -159 449 -105
6522 -105 622 -208 -93 -187 183 234 69 -135 -335 44 165 733 -182 -223 306 -124 -30 -293 132 84 736 -27
6544 -27 -563 -270 -412 397 511 -480 118 125 -26 283 -442 -44 128 -24 -22 10 304 -16 5 365 11 3 -179
6567 -179 194 -104 -160 123 222 -196 -326 -86 -383 -125 463 -226 -567 83 244 -59 277 -618 -73 -281 -36
6588 -36 224 18 104 371 -16 6 86 -68 316 232 -311 -87 56 33 158 -37 -161 235 341 343 445 -14 241
6611 241 -181 -105 117 125 193 281 4 96 -98 168 77 306 -217 -240 -562 467 -65 -209 116 -402 168 -11
6633 -11 -314 59 222 -159 -130 -315 407 -200 -732 -3 237 -273 -366 443 543 65 340 229 -12 -85 -227
6654 -227 -26 -134 -452 344 1 -449 -323 315 203 -3 -35 585 -97 895 437 136 41 -219 190 641 -840
6675 -840 -607 -262 -286 453 479 -211 268 538 614 594 -187 -569 -51 -394 -175 133 571 -60 181 309 705
6696 705 339 -32 -208 66 13 361 -233 330 215 -107 462 -429 39 -396 561 -55 -217 -314 106 97 206
6717 206 311 -232 632 -112 -236 -332 241 -30 -934 -208 -99 551 306 -96 -251 -114 -335 341 78 -201
6737 -201 247 144 -84 93 -232 51 238 468 -217 -545 -168 -501 -162 526 131 108 386 63 -258 -8
6757 -8 -255 168 -187 122 -14 17 622 204 -134 -477 209 249 31 235 -45 -244 -197 -12 -355 -767 -31 104
6779 104 308 -88 -333 23 -188 196 297 288 238 268 -352 -33 219 -139 -160 -341 -282 -101 21 434 197 -141
6801 -141 -464 216 293 527 -710 129 -142 -85 -604 -292 -1465 -416 946 -419 -877 -154 846 -673
6819 -673 240 670 -65 218 135 1162 -261 231 -221 -932 298 -83 449 -954 178 -198 -132 835 -326
6838 -326 80 -972 252 648 -435 -382 -91 0 -240 139 616 411 -476 156 1096 -628 -133 33 291
6857 291 284 654 -135 191 -308 343 260 -225 -493 -194 266 245 -275 158 -15 -175 -164 130 -436 -106 -226 -172
6879 -172 182 -4 64 -156 374 -54 374 -50 101 58 -234 20 18 168 133 227 -183 -258 103 -218 -614 978
6901 978 601 -330 10 164 0 -12 478 174 -172 -176 671 698 183 58 16 -251 95 108 204 -863 -550 -252
6923 -252 555 103 320 208 -407 520 309 88 224 41 -296 -20 426 158 -256 144 230 -717 342 22
6943 22 457 -337 -240 517 -432 681 -414 -201 -204 -637 -395 -427 23 -100 190 -269 -41 -392 -132 1173 -168
6964 -168 498 60 -562 10 -470 402 -615 -207 1004 90 -181 -154 993 186 1380 290 -459 -87 -137
6983 -137 -108 91 23 25 13 186 -102 293 56 81 236 -69 -14 119 365 55 -139 -257 176 647 202 -556
7005 -556 -369 217 338 45 15 -268 235 -116 262 106 377 467 493 101 -3 243 -57 -341 265 -79 119
7026 119 29 -628 217 245 38 -38 -14 2 90 -105 -98 25 117 -44 17 19 77 -100 247 -143 -134 -68 -117 278 -233 291
7052 291 -14 -43 -4 -27 39 -66 89 31 -43 -161 179 -278 205 221 193 110 130 -44 126 60 -123 34 96 125
7076 125 -64 -94 -142 -292 -33 -117 -256 -46 63 117 266 108 -29 -50 -171 -89 -58 7 -141 -150 51 289 -191
7099 -191 212 -134 -75 36 186 -12 -157 -160 -96 -18 -58 40 71 -94 311 -50 270 -118 -74 -44 204 -96 -386
7122 -386 -49 253 -305 -59 -161 -95 263 47 259 -202 192 90 -184 -180 -285 -171 17 -237 186 -115 -17
7143 -17 -1 455 2 -234 85 63 45 86 -187 -132 79 124 156 -8 -123 24 -75 -101 -333 -63 -281 218 -283
7166 -283 255 21 -110 -371 -206 -718 -155 -33 -8 -114 -315 244 -180 511 230 -62 241 40 68 30 -90
7187 -90 -196 -9 97 19 -276 63 -109 -96 3 138 292 177 12 193 -186 97 137 -39 -104 -60 11 -64 -43
7210 -43 -65 -100 -33 17 209 -23 -1 30 17 -151 -75 -165 -94 -251 15 -86 171 -131 -117 -114 81 10 110 188 59
7235 59 129 121 76 154 -30 -51 82 -15 25 128 -11 159 193 78 -105 -25 -85 -39 143 -91 -94 -45 165 -28 -263
7260 -263 -248 -184 54 104 -170 113 -109 -2 -16 -116 -108 -321 38 201 94 13 -68 -60 80 -49 -93 57 29 -190
7284 -190 -66 -48 157 395 115 174 71 -18 -92 -346 -7 -69 -6 -97 -2 160 -224 -141 -114 -180 2 -81 -75 89 -14
7309 -14 -39 214 313 321 25 5 -9 128 70 75 60 -304 24 61 96 -43 51 295 -73 143 -377 161 29 56 -222
7334 -222 -254 -211 -9 -86 27 69 -50 355 -207 -48 21 -55 -62 175 -26 -71 -87 55 109 8 -3 -50 1 -119 10
7359 10 -120 203 192 9 93 45 247 74 -8 33 78 -221 -131 224 -1 -70 -113 93 -165 194 -248 217 81
7382 81 -195 166 -126 -7 -152 198 46 25 44 -165 10 -134 54 12 2 -109 -24 59 -98 -109 184 244 -235
7405 -235 -84 -311 64 -463 -396 218 53 -115 -48 -558 -453 -114 115 374 169 738 524 729 -316 -67
7425 -67 -329 -133 107 -272 -198 91 94 -347 -122 73 -69 -239 244 237 -107 -17 -148 62 100 35 -56 102 -33
7448 -33 -247 -208 162 18 -6 158 140 48 141 300 -67 -42 -143 111 109 -70 -37 95 38 -41 130 29 243 -81
7472 -81 77 116 -189 16 -280 -18 -120 270 198 -71 -305 77 65 203 -188 61 246 632 -79 -96 -79 188
7494 188 378 204 260 -225 369 96 290 292 108 816 -253 411 343 -324 290 399 19 42 45 -275 129 -87
7516 -87 111 -71 27 234 95 -25 44 323 -245 10 -35 65 -28 -279 36 56 -69 -46 172 -286 73 -41
7538 -41 -32 -190 68 197 -121 48 -130 -151 -154 -148 84 17 200 194 -16 149 149 139 43 -100 60 81 -89 -215 -140 -97
7564 -97 84 109 -207 -17 -26 -36 43 19 -42 192 -67 126 -75 21 100 35 100 194 -36 -254 -5 -166 -121 143 -62
7589 -62 94 -150 -167 -130 -92 -76 -42 20 -39 -13 7 -5 -11 -122 -158 -97 283 -149 -153 93 38 -89 -53 -67 -234 -35 174
7616 174 -23 -101 238 240 -11 99 456 -94 40 -394 125 -240 5 -453 383 -494 -248 -73 -194 -25 557
7637 557 231 -473 -263 -23 -134 161 158 -229 291 -80 106 139 434 -30 -70 -18 274 -100 5 -192 130 81
7659 81 62 -79 -49 -88 184 -175 33 87 8 -99 -34 -129 115 287 200 122 84 84 -30 -219 135 -44 23 -58 -200
7684 -200 196 -292 71 160 92 -48 -35 -207 212 145 134 69 -104 5 151 -49 -130 -116 198 -19 123 97 152
7707 152 41 99 21 -116 -60 -107 258 45 -80 126 114 170 -121 -55 14 170 -294 -216 -106 23 2 -141 -76 -138
7731 -138 -73 7 143 28 -91 -29 78 -68 61 -74 -287 336 -93 150 -81 51 391 -182 -88 -29 -12 -207
7753 -207 -152 -197 135 38 -162 -83 53 76 -75 -94 37 -164 203 -69 -83 157 -126 77 173 120 151 -217 197
7776 197 22 226 -125 286 -119 -109 -28 320 -161 16 53 90 -21 75 272 -107 -99 -97 -51 -361 332 -97 142
7799 142 226 59 -40 -141 -84 46 260 -42 27 261 23 -89 63 138 4 -163 -24 -1 54 -102 -155 190 87
7822 87 216 -18 -218 139 163 286 -514 -155 171 -87 104 22 -13 118 338 120 108 -17 -47 25 127 279
7844 279 412 -24 -81 129 -46 -59 -86 -72 -60 -339 170 30 -116 107 -33 -34 -37 201 94 101 48 37 170 -84
7868 -84 63 183 -220 -241 76 -172 -109 50 147 33 -69 75 134 -46 -22 48 -189 129 -132 -332 107 152 -174
7891 -174 24 -129 263 -271 -25 55 -36 18 8 -305 37 13 172 376 -17 -24 65 -91 57 -5 9 32 -100 144
7915 144 -90 42 -167 6 69 33 59 -47 -36 6 -101 36 123 -136 -128 167 -26 -39 -39 -28 -260 -14 -75 134
7939 134 46 -51 -121 -25 -130 43 6 3 173 -94 -169 -39 -284 49 28 -73 77 -196 125 -115 -105 -337 25
7962 25 30 106 91 113 13 -15 104 -6 -80 -214 103 12 -35 -179 -35 -130 -74 -31 -69 26 109 194 -269 7 95 60
7988 60 -147 -191 171 -24 -121 6 -124 -56 -315 97 -111 -110 -156 89 49 55 69 113 193 11 7 -105 -58 76 23 -108
8014 -108 47 38 -166 26 -43 -444 64 -41 -226 -72 169 -260 -148 87 140 79 172 -67 -35 -130 -140 139 73
8037 73 197 5 238 25 -92 -159 90 84 35 -281 -383 -27 -116 164 -194 -282 -130 54 -68 -25 159 -63 -248
8060 -248 47 178 26 -171 -68 -150 263 -41 25 289 225 -190 -137 -243 -85 -99 -112 -212 -42 228 -12 81
8082 81 95 24 101 184 -150 -197 -63 44 56 142 -38 -11 107 121 89 67 -105 -88 -55 -202 -106 69 -6 -52 18 -179
8108 -179 -11 60 18 179 -112 165 -210 -94 13 11 -137 38 -80 -146 -23 -21 256 -289 133 -318 -122 -105 6
8131 6 -202 -47 110 30 -183 -79 -281 -161 -31 -155 33 21 -64 166 -18 -107 34 -13 -49 50 256 -33 305
8154 305 40 -82 78 73 35 -320 -149 -78 -30 -111 140 -77 290 -40 -74 -149 -104 -88 -40 184 -60 197 169 174 -62
8179 -62 221 267 -17 101 -5 162 -86 62 163 45 -190 -213
8191b13
$$ Imaginary data points
##PAGE= N=2
##DATA TABLE= (X++(I..I)), XYDATA
0 0 0 0 0 0 0 0 0 0 0 0 0 8 -8 8 -8 11 -16 16 -24 24 -32 40 -48 56 -64 72 -87 98 -114 131 -151 173 -197
33 -197 222 -250 281 -318 356 -398 445 -495 551 -611 676 -748 828 -914 1006 -1109 1222 -1348
51 -1348 1484 -1635 1803 -1993 2203 -2444 2720 -3038 3413 -3860 4404 -5083 5957 -7135 8810
66 8810 -11396 15944 -26252 102085 -122896 -222052 211969 136183 -206716 -125426 168645
77 168645 25043 -179484 -61047 87655 -9582 -76434 -24427 21752 22066 21311 -12439 -336
89 -336 60104 54736 -12963 3145 49557 27778 -6799 -2506 -12786 -5885 15467 -30525 -76462
102 -76462 893 43433 -63609 -89937 46124 56388 -73552 -45892 84072 44175 -49897
113 -49897 9159 73727 19639 -9653 22585 17857 8080 17614 -19277 -35296 25438 12297 -79561
126 -79561 -36916 60149 -22313 -105728 19554 82461 -62564 -75672 91310 68107 -85423
137 -85423 -13329 122051 20361 -80965 35603 92366 -31146 -56357 44047 28833 -54418
148 -54418 -25578 21063 -20373 -41381 -583 -233 -30294 -11847 17771 3169 -15882 4782
160 4782 33675 24666 -12508 -4565 51076 40027 -41023 -26089 69375 31655 -86062 -34190
172 -34190 83139 3148 -112622 -16074 84381 -22688 -96670 15000 68665 -26462 -47992
183 -47992 32355 40186 -6849 -318 17539 10830 20421 18077 -18600 -8501 36677 6215 -49689
196 -49689 -12961 34972 -11735 -52675 -6914 23842 -11986 -30062 -3007 15221 9062 -3635
208 -3635 -7725 14531 33706 4521 -20121 18332 41025 -8441 -29568 19164 26861 -25781 -29029
221 -29029 13239 5966 -28261 -18137 4641 -2833 -11846 -6206 -512 7035 8181 -3816 1489 23550
235 23550 12838 -11600 9202 29965 -3866 -20124 18741 18003 -29387 -17294 25371 -5245
247 -5245 -42986 45 26428 -24906 -34269 24200 21519 -32035 -11476 40622 12137 -29434 8566
260 8566 41798 497 -25649 14588 31742 -10773 -27448 10203 21149 -18926 -31464 8347
272 8347 18405 -23816 -30602 16609 20806 -25972 -20258 30837 19273 -26683 -3053 39532 7193
285 7193 -26062 12138 32157 -11487 -21048 19716 13091 -26762 -11406 19068 -6693 -28875 1697
298 1697 14635 -15828 -18252 13194 11549 -13300 -4989 17994 10667 -7144 239 15806 10610
311 10610 -5880 -4641 10977 9370 -11794 -13222 8562 6769 -19282 -16427 11870 5437 -22134
324 -22134 -10826 17842 5996 -18614 -1575 22831 6660 -14012 3231 22405 5316 -14064
336 -14064 1740 19434 624 -19368 -1163 16966 -6203 -25531 960 18121 -13075 -25344
348 -25344 11552 19544 -19195 -17704 25122 16645 -23726 -5078 33199 6792 -26299 6589 31346
361 31346 -7748 -26145 13443 21360 -20467 -21918 17070 10233 -25420 -12887 19274 3205 -23093
374 -23093 -1823 21305 -478 -17428 7634 21332 -4389 -13176 13326 17496 -10708 -10918 15305
387 15305 9429 -17479 -8574 14712 451 -20922 -3204 14235 -6336 -17640 5316 12674 -8783
400 -8783 -9782 12330 10067 -8849 -1964 14791 5234 -8711 1513 11945 -143 -9509 153 7252
414 7252 -3248 -10975 -2036 5778 -2862 -11470 -2257 8974 466 -11432 -358 14483 2970 -12146
428 -12146 2001 17837 2006 -13626 3463 17490 -2245 -16038 3684 14175 -7526 -16525
440 -16525 4767 10452 -10972 -13208 8191 7935 -12016 -6754 13231 4735 -12251 1288 16522
453 16522 -460 -12788 8077 16059 -8547 -12957 13061 11575 -16660 -11087 16402 5124 -21552
466 -21552 -5574 18157 -1251 -20919 2564 18707 -6138 -16024 11069 15895 -10458 -9482 15811
479 15811 9776 -13956 -3677 16854 1704 -16530 1263 14696 -6105 -16896 5213 12173
491 12173 -10402 -13807 9205 9897 -11256 -8287 11943 7754 -9756 -3346 12110 4010 -8171
504 -8171 999 8889 -482 -6160 2582 4447 -4699 -4599 3004 642 -6560 -2524 3990 -548 -5712
519 -5712 -858 5142 1322 -4465 -693 6949 4474 -5031 -3329 8252 6852 -7736 -7159 9229 7738
534 7738 -11572 -9587 10887 7366 -14652 -9481 13112 6358 -14897 -6012 14438 4579 -13425
547 -13425 -940 13974 582 -10098 3767 10233 -4337 -6343 7744 4170 -9370 -1643 10351
560 10351 -3103 -13363 4248 11904 -9529 -13589 11183 12138 -14329 -11012 16798 10097 -17071
573 -17071 -6321 19886 5344 -18024 -930 18765 -982 -16437 3956 14076 -7146 -12978
585 -12978 7017 8299 -9977 -7219 8998 3102 -10176 -1566 9867 -446 -8138 2898 8874
598 8874 -2235 -6164 4535 6640 -3682 -4866 4089 4194 -4004 -3904 2858 2138 -3716 -3205 1874
613 1874 1441 -2505 -1947 1825 1665 -1312 -719 2215 1988 -1286 -781 3049 1889 -2836 -718 4751 808
630 808 -6107 -886 6913 -733 -9391 542 9432 -3308 -11581 3586 11457 -5481 -11201 7841
644 7841 11557 -8285 -9157 10284 8775 -10074 -5343 10718 3733 -10375 -1366 9394 -1690 -9026
658 -9026 2726 6357 -5689 -5894 6767 3580 -8703 -1606 9724 94 -9729 2039 11245 -3190
672 -3190 -10294 5505 11118 -5985 -10146 7784 9494 -9153 -8675 8940 6749 -9878 -5869 9006
686 9006 3384 -9168 -2030 8179 396 -6604 1080 5851 -1481 -4038 2824 3485 -2619 -2072 3304
701 3304 1284 -3274 -744 2543 -3 -3278 -763 2480 -169 -3031 -718 2710 633 -3051 -360
716 -360 3567 828 -3280 105 4351 288 -3788 479 4243 -510 -4021 1151 3709 -1896 -4387
731 -4387 1693 3447 -3127 -3920 3101 3495 -4300 -3091 5184 2730 -5531 -1964 6673 1454 -6701 -230
747 -230 7534 -1075 -7285 2043 7070 -3700 -6834 4420 5270 -5976 -4553 6223 2669 -7470
761 -7470 -1624 7408 25 -6869 1872 6919 -2733 -5832 4656 5534 -5192 -4270 6013 3302 -6697
776 -6697 -2435 6640 1344 -7465 -708 6453 -856 -6644 1582 6490 -2390 -5704 3168 4909 -3611
791 -3611 -3686 4166 3185 -4367 -2029 4300 877 -4021 -434 3910 -775 -3873 947 2997 -1626 -2897
807 -2897 1622 2263 -1813 -1969 1725 1719 -1632 -1431 1832 1926 -1197 -1658 1832 1833 -1687 -1783 1971 1958 -2383
826 -2383 -1914 2431 1637 -3281 -1600 3311 1239 -3814 -701 3924 229 -4083 619 4278 -1114 -3941
842 -3941 2284 3979 -2619 -3592 3533 3384 -4146 -2944 4266 1972 -5139 -1536 5041 204 -5538 831
858 831 5832 -1926 -5581 3031 5163 -3848 -3897 4813 3479 -5289 -2266 5757 1228 -5859 -353 5691
874 5691 -892 -5870 1586 5129 -2564 -4707 3165 3946 -3519 -3205 3922 2375 -4012 -1178 4488 1063
890 1063 -4145 -26 3715 -339 -3675 663 2960 -1571 -2863 1835 2313 -1932 -2283 2084 1424 -2294
906 -2294 -1183 2261 1016 -2069 -322 2269 623 -1612 -158 2015 457 -1829 -264 1942 -33
921 -33 -2121 -556 2260 -121 -2454 153 2382 -102 -2674 670 3146 -1023 -2798 1821 2840 -1825
937 -1825 -2273 2742 2182 -2978 -1709 3321 1161 -3607 -859 4001 -24 -3997 496 3671 -1315 -3530
953 -3530 1830 3510 -2552 -2770 3131 2756 -3713 -1585 4011 1272 -4325 -511 4636 -563 -4023 952
969 952 4016 -2045 -3917 2305 3211 -2834 -2792 3289 1937 -3813 -1469 3710 595 -3781 300 3688
985 3688 -761 -3408 1604 3016 -1428 -2496 2100 2323 -2504 -1561 2502 1338 -2295 -925 2262 710
1001 710 -2217 -330 2133 446 -1662 9 1753 -278 -1454 483 1641 -218 -1186 439 1288 -539
1017 -539 -929 519 884 -810 -977 765 956 -1072 -1024 1057 693 -1662 -352 1630 776 -1803 -372
1034 -372 2259 571 -2572 -185 2916 -396 -2959 553 2803 -1132 -2890 1356 2414 -2170 -2572
1049 -2572 2386 1957 -2682 -1681 2852 880 -2826 -223 2933 -446 -2587 1066 2876 -1412 -2899
1064 -2899 2110 2136 -2504 -1816 2968 1519 -2997 -1155 3033 376 -3246 123 3195 -517 -2974 973
1080 973 2782 -1456 -2226 1846 1858 -2218 -1429 2324 926 -2681 -161 1952 -4 -2358 429 2089
1096 2089 -712 -1880 995 1527 -742 -1457 1249 1455 -997 -1188 900 983 -809 -1040 922 953 -1103
1113 -1103 -735 755 963 -1079 -775 593 699 -1233 -452 1204 374 -989 -61 1106 -173 -1179 363
1130 363 1455 -575 -1131 1071 1536 -1143 -1435 1650 1336 -1675 -1378 1901 1236 -2408 -758 2601 676
1147 676 -2840 -243 3238 -419 -2652 755 2880 -1019 -2257 1611 1841 -1848 -1210 1957 1185 -2268
1163 -2268 -697 2200 67 -2290 115 2241 -897 -1913 1139 1872 -1401 -1457 1548 1357 -1589 -1043
1179 -1043 1948 770 -2019 -526 2167 -49 -2183 141 1839 -599 -1775 574 1542 -1124 -1567
1194 -1567 1242 1163 -1261 -871 1109 545 -1167 -151 1533 419 -1096 -178 1293 176 -1086 103
1210 103 1148 -41 -974 -39 941 -92 -1239 421 1104 -264 -1118 591 1147 -693 -1044 826 886
1227 886 -978 -629 1295 738 -1431 -577 1181 -202 -1743 125 1470 -379 -1594 378 1481 -584
1243 -584 -1534 671 1568 -939 -1472 1380 1207 -1646 -1263 1807 694 -1947 -498 1855 116 -2061
1259 -2061 240 2137 -564 -1869 964 1975 -1520 -1551 1467 746 -1593 -637 1752 347 -1734 -157
1275 -157 1749 -132 -1628 305 1558 -823 -1591 866 1467 -936 -1243 1100 971 -1177 -784 1384
1291 1384 411 -1371 -299 1452 44 -1335 94 1070 -157 -1339 672 1006 -695 -910 609 684
1307 684 -688 -960 510 857 -598 -465 692 601 -699 -328 717 540 -868 -186 978 477 -940
1324 -940 -215 1078 15 -1151 72 990 -611 -1196 659 927 -714 -901 804 913 -1143 -700 1242
1341 1242 696 -1479 -306 1166 -295 -1546 -32 1546 -169 -1387 309 1553 -596 -1124 1030
1356 1030 1074 -1021 -1020 810 708 -1697 -670 1230 206 -1648 116 1517 -52 -1540 924 1334 -898
1373 -898 -1536 1179 679 -797 -987 1338 1021 -750 -543 902 -80 -1057 -389 1466 -205 -914 242
1390 242 1058 -148 -966 415 266 -731 -853 782 489 -934 -767 1038 274 -729 476 636 194 -912
1408 -912 -837 771 -103 -430 470 261 -767 -1232 -167 1248 -316 -1609 156 673 -474 -359 598 809
1426 809 -431 -665 529 396 -887 -962 996 358 -897 -346 1207 266 -1269 58 1054 -410 -1261
1443 -1261 530 979 -846 -889 824 820 -1415 -511 1461 413 -1093 -434 1433 -4 -1478 278 1301
1460 1301 -109 -1167 479 777 -761 -985 959 721 -1285 -522 1107 498 -1088 -333 1212 -189
1476 -189 -990 -96 819 -381 -932 487 1283 -653 -1404 1560 224 -970 -1024 910 698 -681 1079
1493 1079 -58 286 -1165 579 929 -69 -124 -396 712 -93 -564 394 545 -454 -678 -105 191 -669 -1494
1512 -1494 167 353 -390 -534 1043 525 -102 -283 49 471 -1090 635 981 -196 -1576 -33 519
1529 519 -485 -682 255 1104 -261 -988 794 785 -753 -860 1197 610 -1308 -498 969 166 -1116 -1
1547 -1 1253 -109 -938 12 1140 -706 -879 592 551 -764 -523 1017 427 -578 -845 1024 -251 -775
1565 -775 -487 1456 -17 -1184 497 982 -516 -996 474 1021 -690 -773 1201 428 -1244 -650 1352
1582 1352 273 -422 -60 1288 292 -1292 -658 897 -32 -549 493 875 -442 -796 -105 634 -739
1599 -739 -211 1006 746 -1080 -410 602 264 -662 -428 444 -161 -557 -366 469 -144 -858 -216 332 -98
1618 -98 -793 -3 1483 -884 -339 489 1001 -687 -460 1009 433 -712 -510 322 -75 -1262 150 395
1636 395 145 -402 -159 1165 -543 -1180 617 1019 -234 -467 718 862 -1387 -517 821 489 -677
1653 -677 -572 339 960 -993 -322 772 120 -961 324 881 -955 -506 673 665 -701 -624 824 774 -656
1672 -656 -120 673 375 -842 -226 727 -150 -725 123 706 -56 -683 251 807 -182 -470 285 794 -416
1691 -416 -224 534 115 -378 -264 524 202 -665 -355 730 179 -662 -77 987 -121 -486 239 616 -274
1710 -274 -629 552 740 -271 -850 604 614 -364 -475 366 419 -799 -280 531 52 -569 -14 598 -262
1729 -262 -828 95 631 -157 -796 -2 507 -608 -621 491 353 -541 -149 658 346 -906 -191 1015 -61
1748 -61 -922 15 929 -208 -868 358 707 -457 -562 467 120 -735 -351 645 291 -519 -329 611 209
1767 209 -641 -298 700 220 -596 251 567 122 -786 265 636 -325 -423 645 3 -540 -364 387 324 -421
1787 -421 -153 509 272 -518 -339 481 63 -530 -101 423 239 -178 273 755 -98 -584 436 547 -241 -807
1807 -807 189 367 -326 -386 705 164 -595 -120 687 26 -595 95 832 -75 -682 151 609 -392 -736 495
1827 495 528 -537 -577 551 282 -758 -170 635 200 -789 -171 798 -291 -971 166 745 -228 -648 358
1846 358 559 -401 -468 398 491 -517 -529 717 48 -973 -310 440 15 -794 142 497 7 -428 315 614
1866 614 -269 -525 278 399 -404 -75 461 358 -473 -51 208 216 -516 -320 338 28 -283 49 321 43 -225
1887 -225 -89 450 -124 -457 75 482 -146 -302 79 456 8 -288 274 143 -358 -229 382 149 -576 -72
1907 -72 603 0 -523 29 520 -123 -646 253 665 -143 -473 212 316 -195 -499 465 338 -797 -359 686
1927 686 -159 -694 -201 417 -350 -820 81 1042 -435 -293 -200 486 -479 -992 559 281 -501 -89 589 413
1947 413 -602 -100 541 199 -631 44 537 -177 -532 133 361 -269 -235 677 403 -340 -462 563 247 -602
1967 -602 -118 256 313 -449 -109 381 157 -531 67 215 -288 -516 21 435 -79 -576 124 369 -34 -303
1987 -303 415 349 -275 -123 104 140 -408 -350 385 180 -552 -211 415 60 -282 54 198 64 -353 193 524
2008 524 -336 -332 128 362 -286 -208 300 125 -316 -442 422 47 -673 -48 435 -99 -325 167 392 -387 -569
2029 -569 491 570 -384 -331 260 114 -451 -213 508 279 -657 -197 642 -218 -613 213 450 -21 -538 -12
2049 -12 179 -462 -403 256 103 -256 -339 390 166 -334 -152 218 13 -237 -125 161 -167 -573 -155 203 -153
2070 -153 -431 -22 335 -348 -213 331 154 -9 -421 185 -52 -17 -79 398 9 182 -430 480 230 56 -120
2091 -120 656 291 348 51 -194 300 -181 458 6 -71 -556 303 333 -253 -577 495 214 -641 -247 514 31
2112 31 -663 -142 742 -94 -522 140 312 -191 -387 417 475 -207 -449 521 154 -402 -201 257 106 -394 -238
2133 -238 563 79 -598 23 493 -240 -434 268 330 -234 -466 281 256 -265 -438 564 411 -331 -153 269
2153 269 -82 -38 106 311 27 -66 305 -22 -179 -189 246 290 -142 -289 136 79 -277 -2 143 -69 108 -205
2175 -205 90 -101 -228 -135 -66 32 -152 216 236 -15 -234 110 23 49 -106 -105 254 -87 -53 187 140 -128 -239
2198 -239 316 348 -433 -150 380 66 -309 -20 234 -277 -339 295 252 -281 -236 -117 594 -409 -460 119 425
2219 425 -291 -158 81 -302 -767 15 229 13 -968 72 593 -988 -594 101 -187 -457 60 27 33 678
2239 678 -24 149 328 72 -1340 202 415 -637 38 306 189 -442 242 468 -120 -136 293 56 -280
2258 -280 -176 195 138 44 -160 422 5 -120 401 313 -251 -104 197 -10 50 -329 195 206 -76 42 175 -109
2280 -109 -195 -153 15 -5 -218 -363 259 -182 -92 -61 375 -106 -267 39 242 27 -265 25 165 -222 -322 224
2302 224 301 -261 -250 166 214 -157 -306 199 371 -314 13 256 55 -497 17 540 102 -339 179 436 72
2323 72 -252 652 392 -241 30 262 294 -216 -149 198 310 -310 67 218 -61 -493 -47 169 -227 -281 34
2344 34 -56 -257 -188 326 -6 -220 -289 -43 -124 47 75 231 -222 -239 37 404 -17 -834 96 87 -279 86 465
2367 465 302 -212 -284 249 -22 98 -102 149 218 -2 -168 9 209 -147 -15 -85 -199 50 -203 189 -17
2388 -17 -204 217 125 -166 -273 -148 138 -144 -318 3 231 -158 -222 125 144 -250 -150 76 37 -148 -76 253
2410 253 457 -461 -59 299 -192 -298 71 90 -199 -216 230 138 -32 -15 53 214 -29 -17 496 -24 -374 146
2432 146 444 -68 -311 439 119 16 61 39 233 -149 -210 320 -198 -66 179 138 -66 -24 141 115 -90 -355
2454 -355 174 167 -82 37 223 78 -215 247 655 -193 5 -35 310 155 -73 98 173 119 -358 29 -101 195
2476 195 148 128 -5 27 -66 22 119 -32 -77 -28 -41 26 -46 -180 225 29 -112 -26 301 -365 60 233 -110 -9
2500 -9 -431 96 51 -200 -145 104 -259 -346 -92 249 -294 -123 317 118 -368 46 298 -84 -291 52 513 134
2522 134 -155 166 146 100 -354 157 69 -174 -250 192 87 -198 103 220 7 -306 43 358 -96 -105 149 339
2544 339 -250 -159 257 181 222 89 233 -69 -217 116 268 58 -154 87 33 -283 55 62 -143 239 -265 67
2566 67 187 -131 20 261 34 87 -56 -86 11 23 -245 -212 -120 -34 4 267 126 -147 174 -131 -187 -143 -195 243
2590 243 -55 -242 -89 203 4 -211 195 346 17 -136 10 139 9 -123 165 359 -100 -102 114 243 -143
2611 -143 80 182 -34 -229 63 179 -148 -130 439 -209 -233 56 268 -135 -152 60 216 50 -177 -12 438
2632 438 -291 -549 176 75 -184 -25 386 -7 -209 175 335 45 -224 215 197 -104 -192 46 272 121 -425
2653 -425 436 59 -164 -339 357 102 -288 -74 182 -40 -188 283 143 -59 -281 2 -44 5 -76 113 120 112
2675 112 73 55 -65 18 193 141 48 27 11 -91 122 187 -67 140 -22 -129 -47 388 -91 38 19 54 171 -247
2699 -247 -154 335 -138 -273 123 208 -188 -9 -16 179 156 -139 173 222 -94 -168 45 29 -158 172 347 -77 -142
2722 -142 74 212 -425 7 111 236 -342 46 89 -135 -428 2 344 -288 -37 -47 135 -89 -58 231 87
2743 87 -219 -10 162 -123 -236 67 92 -142 -287 -30 249 21 -144 89 190 57 61 -32 23 50 32 135 74
2766 74 -267 -175 33 -259 263 -209 -61 230 -154 33 278 52 -49 -108 139 264 -213 -151 374 225 122
2787 122 -37 87 -79 81 -203 164 44 -141 41 98 -95 -241 156 129 -97 -150 410 26 75 -35 233
2808 233 -42 -258 -171 207 -220 -80 107 122 -305 -165 233 32 -167 -146 23 -72 -265 223 458 109 -307
2829 -307 229 393 84 -43 -523 128 -153 43 180 -113 -221 209 319 -76 -121 -11 250 43 39 -88 147
2850 147 -163 -91 270 -91 -4 -133 6 -203 -8 -2 90 77 6 1 184 27 39 59 71 69 188 -57 105 51 120
2875 120 -41 -172 10 109 -179 -21 40 -138 -20 -1 136 183 105 54 -163 115 -26 -105 -102 -296 -73 22 -374
2898 -374 87 58 -66 -413 -23 464 -131 -243 55 138 -346 -42 166 346 -145 5 25 -26 -148 195 357
2919 357 49 -248 -53 20 -12 -249 251 12 -144 -155 322 -34 -200 152 17 284 -529 84 260 -11 85
2940 85 21 -24 39 -298 -193 217 -134 -61 160 65 -297 92 198 110 -200 97 265 93 -186 349 20 -157
2962 -157 -64 174 52 66 -243 35 -155 -199 -33 53 68 50 192 16 -284 149 -18 -174 94 6 25 -75 -234
2985 -234 -35 -136 -139 287 -217 26 164 115 -203 53 -98 -133 -118 -16 101 165 24 254 182 -46 -194 137
3007 137 -214 -269 -213 181 127 -560 110 400 51 -21 288 386 -203 -20 89 -52 -36 -21 318 -240 -215 249 51
3030 51 -217 -57 69 -22 -83 24 406 237 -226 -276 230 -196 -57 201 377 -33 -157 135 -62 -276 -122
3051 -122 67 160 82 67 376 -56 94 -180 -37 110 -26 -64 180 -105 -57 87 26 148 118 -20 5 35 -28
3074 -28 -19 -169 -190 -60 -18 115 -87 23 172 148 -66 -152 -72 134 99 -78 -115 385 98 46 277 -11 -82 -101
3098 -101 157 228 -102 -207 101 -91 -105 198 55 -118 36 49 -58 -139 107 -235 61 -105 -63 -50 -46 -58 -67 177
3122 177 -313 -312 41 -84 -346 66 -82 58 -36 -86 211 -71 -190 20 266 95 23 -89 25 140 216 84
3144 84 25 -79 5 -13 13 -29 5 119 52 -175 111 60 83 -116 -94 -263 -150 168 -321 -45 -128 -1 -13 -239
3168 -239 149 -41 -60 -13 14 326 81 -35 -105 -11 87 -91 149 -146 2 -68 188 86 -221 -144 -210 140 10
3191 10 -13 -101 89 19 -85 64 -104 97 -50 125 71 144 -144 -99 27 30 -74 -170 66 -24 -182 178 113 20
3215 20 142 -285 -82 -79 32 93 154 -144 66 325 -115 -21 -114 217 227 -112 294 108 -154 -197 109 0 -7 -122
3239 -122 -205 97 -41 -9 -155 -120 226 -274 445 3 -134 231 -155 37 228 -170 -121 -50 -119 260 60 7
3261 7 58 143 185 -50 38 153 60 137 248 -32 208 210 -103 102 171 41 -210 16 13 15 -22 119 82 246 229 -170
3287 -170 228 -47 203 -212 -27 -53 -51 157 2 40 -47 -47 -124 116 -159 221 -71 35 93 -101 -63 -51 208 -133
3311 -133 -206 -68 234 -325 16 62 299 -56 -146 102 -46 -140 -143 -107 10 -39 228 365 -134 45 130 -85 -102
3334 -102 -157 89 -69 28 -191 318 -147 -94 -62 -19 -145 -338 129 -205 -67 -36 92 -119 70 185 90 -224
3356 -224 1 153 23 190 -213 -129 -207 -165 -48 -59 -100 -25 12 -7 -159 -32 -26 134 187 -22 -60 -45 130 18
3380 18 -118 143 88 -205 -112 40 75 -255 4 171 -47 -103 -272 200 -64 141 -413 179 108 70 120 60 -154
3403 -154 -123 -104 62 156 -106 108 -74 -107 -177 109 196 71 -61 -37 -58 -29 205 5 -283 90 -29 116 46
3426 46 -19 229 118 -246 59 46 -17 -77 76 36 20 -218 -9 127 -25 -26 143 117 37 -192 12 -39 -328 -110
3450 -110 -83 35 -64 80 -2 -159 -21 129 -124 -89 -107 313 149 -79 170 79 -69 -74 -52 -271 -175 16 -140
3473 -140 63 -147 -346 198 -130 -126 115 101 63 23 8 -317 -138 182 -118 -89 -61 82 -13 92 -131 -140 68 -69
3497 -69 122 -115 188 37 36 118 -94 39 16 -65 -216 212 11 -199 -234 43 -80 -138 -157 -58 97 47 -149 -45
3521 -45 140 -123 17 -368 16 -12 -153 -182 -9 221 187 -77 67 -201 101 74 -91 82 -46 146 -88 -65
3543 -65 -40 139 -27 -18 -207 -155 74 -87 -93 -74 60 -111 -105 195 -176 86 -35 -120 -116 -97 157 43 94 112 127 -95
3569 -95 267 -71 213 -45 155 162 -48 -260 -100 96 -32 282 -42 228 -191 -238 -139 -222 288 -110 12 -116
3591 -116 -144 -15 -442 -217 -245 14 -225 -219 -220 7 -65 296 -143 58 -125 -56 87 -1 12 -87 242 4 325 -152
3615 -152 -74 178 -176 54 -179 -16 -42 -42 156 -185 138 172 -202 -36 -12 155 -3 -16 69 62 -67 -194 25
3638 25 68 -162 166 -34 -292 -172 -149 -9 -23 247 -371 273 85 -94 -71 -151 90 -84 383 89 -29 510
3660 510 113 383 121 385 -381 -350 391 -184 -350 272 34 177 -180 -85 126 -384 -412 218 155 57 -264 -234
3682 -234 523 81 14 350 166 -252 -7 178 -37 -259 -107 -408 -631 -361 26 -579 -102 -198 -434 -965 -218
3703 -218 181 305 -245 338 -299 -306 596 296 117 276 -455 -212 22 -106 96 59 -136 -4 195 72 -232
3724 -232 247 12 -273 215 -170 -118 230 176 10 377 -40 405 -98 231 -76 291 270 156 316 41 -14
3745 -14 59 565 267 41 84 501 -49 110 249 317 -80 645 -594 74 475 682 -20 278 -247 66 -262
3766 -262 1 -450 163 -135 743 684 703 645 221 22 -200 -294 -545 -392 -160 -156 -52 92 -374 114 -31 342
3788 342 245 -80 110 324 33 -140 -13 220 -89 243 40 -119 217 -201 -250 276 -485 -145 -102 155 -49
3809 -49 139 13 66 183 16 47 73 -2 651 0 -10 -39 -123 -175 61 -54 58 75 12 -55 79 304 -132 26
3833 26 -3 30 -23 202 58 -28 -100 50 -166 142 -141 8 161 -333 -15 121 -46 -196 118 -60 314 -36
3855 -36 116 110 -72 -199 -172 125 -105 -221 133 21 -169 139 2 85 -29 56 20 -74 -41 -166 50 10 80 5
3879 5 39 210 -225 -29 -18 281 32 -77 148 320 122 -82 -16 0 -229 -144 240 -120 -37 74 -179 -290 132
3902 132 -146 -22 -116 -204 56 154 -42 170 163 94 -22 -82 -2 85 -26 -78 -35 -289 31 132 -175 88 -62 -31
3926 -31 45 -68 79 75 -144 -200 15 15 -157 -475 329 -65 -78 -164 -29 83 -61 -21 27 18 139 -109 94 -39
3950 -39 297 -149 59 19 58 53 -177 -101 185 269 -272 -104 74 -5 115 -215 -279 178 -83 -312 -62 32 -64 -140
3974 -140 20 -82 -356 -332 -125 -129 94 80 169 101 -58 123 158 -65 -10 -123 -123 84 203 -42 -115 112 -54 145
3998 145 49 132 71 36 -268 -107 81 101 279 86 144 100 79 -118 -73 260 63 -139 -317 205 -245 98 -27
4021 -27 228 179 -251 -18 -183 248 509 51 -77 52 6 -11 118 -37 182 -87 -108 117 -195 115 162 183
4043 183 350 584 -94 400 413 283 503 -365 92 522 -731 -478 -142 440 -347 726 -447 -651 237
4062 237 -56 -365 -61 196 -154 223 -125 31 -10 -66 -120 -117 -148 174 91 -27 -116 144 -46 -357 -118 -139 -173
4085 -173 -54 -204 33 153 154 113 -8 112 259 35 -127 -60 -81 186 147 -79 92 220 132 23 -203 279
4107 279 -50 -25 -191 1 -158 67 -24 50 -11 -129 120 -138 -133 -98 315 -220 -104 -180 231 78 54 193 -104
4130 -104 189 -97 148 65 -170 190 22 -41 -131 -24 125 65 45 73 130 45 -74 301 -132 -206 242 181 66
4153 66 65 105 -119 62 16 174 6 -79 40 92 6 171 45 -135 1 -46 -6 60 -173 -29 -173 -62 57 84
4177 84 250 18 177 177 168 -26 -120 130 -74 -307 18 6 -311 -51 150 -201 55 106 11 -314 17 14 58 -43
4201 -43 -1 79 39 189 -216 78 53 -6 183 -207 4 21 223 -88 105 23 -192 159 159 185 -25 -337 -16 280
4225 280 -64 115 36 9 -3 -128 331 85 -34 336 122 -199 -63 23 -39 220 21 -19 15 104 -198 130 -147
4248 -147 25 -27 -202 -13 -84 -155 -357 -102 -49 -79 61 78 -119 -158 62 152 -192 -142 -197 -211 -89 46 -10 60
4272 60 -350 302 -170 -81 -308 8 -4 135 42 -36 -51 -52 183 114 -16 -30 -87 140 357 171 28 -85 -108 -10
4296 -10 -99 54 150 -403 79 275 -8 -147 41 185 18 34 -62 201 115 -118 -60 25 -113 6 99 232 -118
4319 -118 -186 18 -45 -66 210 168 -178 -246 71 214 3 26 -109 16 -9 -256 127 190 -77 -309 61 157 -139
4342 -139 65 64 -172 -114 20 -91 -151 42 164 123 -4 85 -80 -37 72 -101 122 303 6 132 6 35 -129
4365 -129 -148 110 29 76 -31 88 -265 -93 -69 -77 -20 -42 13 31 -91 125 117 287 208 -30 -82 -65 193 -120 85
4390 85 222 -132 96 -3 236 -108 207 151 -148 203 -12 237 104 -59 336 11 -35 31 -33 6 -5 -79 -112
4413 -112 185 30 -32 39 104 18 247 155 -89 -163 156 61 -21 141 -169 205 -122 -298 34 185 -144 206 154
4436 154 -12 24 235 -137 98 -86 -120 -179 -111 -92 -155 -18 -181 -38 54 -105 -21 85 -90 137 -181 16 50
4459 50 177 54 108 213 -138 -363 -80 -71 -10 -106 24 -317 -77 -159 60 146 344 66 190 162 284 -84 151
4482 151 -23 -163 -262 36 -125 178 144 160 -18 -73 139 -30 170 37 115 -163 24 134 -126 100 37 -191
4504 -191 200 -103 -9 -130 90 -448 -80 167 -147 69 158 13 74 142 163 -49 32 -157 -61 -18 94 49 -45
4527 -45 166 -34 66 -56 156 60 425 26 64 -77 100 -105 169 -199 -119 -7 -6 67 54 53 76 249 313 -70
4551 -70 146 -28 86 68 -184 -194 9 91 73 6 312 -156 35 51 224 167 -231 -349 -159 182 275 -89 -263
4574 -263 27 -284 23 36 -227 -170 342 114 192 -268 282 168 319 383 -186 282 -337 -151 -40 -518 373
4595 373 85 -415 -6 194 -524 162 395 -38 124 373 -37 -228 -243 -230 -325 124 -6 506 223 -158 -137
4616 -137 116 68 -26 -229 278 -444 700 -44 430 -481 -217 106 -841 -299 -1052 75 -330 645 213 176
4636 176 266 -161 -112 -78 532 -249 -264 -13 -918 202 474 -156 456 -442 -144 38 -23 281 501 262 -173
4657 -173 -115 455 258 -227 107 172 220 17 238 -41 -156 -171 283 -83 88 -307 -149 115 18 -99 442 40
4679 40 464 200 138 147 -158 160 155 -10 11 -528 -290 610 41 -139 -268 -290 177 509 -20 250 -554 -621 -4
4702 -4 320 -345 -582 -383 -390 197 -34 -218 129 166 -10 -390 132 122 -377 -381 75 -55 341 165 -147 -5 -23
4725 -23 -71 -170 -139 -169 -148 -6 -226 63 195 -78 -89 -73 26 -163 31 47 146 -209 -43 100 155 77 266 149
4749 149 140 192 246 -40 -26 23 -88 130 -64 115 -146 111 195 -68 117 -26 123 -131 53 23 -151 -84 -99
4772 -99 -250 117 76 157 32 167 -139 6 519 194 279 -591 346 -136 -246 -429 -274 325 -173 274 -120
4793 -120 48 -58 -53 192 -263 -266 -174 -225 -34 35 -248 -209 -177 -158 -177 -60 -184 -52 -132 -108 138 86 -152 88 -13
4818 -13 194 162 -67 -98 185 41 109 -94 -81 -79 47 190 77 -88 27 140 -47 11 121 -98 1 -126 216
4841 216 -135 -29 148 -104 132 -220 163 93 -64 -297 174 99 -77 -103 -117 141 -100 -30 -87 -45 -73 -35 58
4864 58 -3 -142 -42 -274 -5 85 102 100 -195 37 -156 21 230 -77 -77 13 -46 -51 173 -49 27 -341 44 129 52
4889 52 -158 218 -30 10 158 49 270 133 -149 260 -16 -124 -34 -196 -24 -266 -91 -213 -67 -182 -38
4910 -38 244 -98 206 185 147 22 -125 189 36 26 129 -9 -10 -290 -54 163 -82 -76 -114 37 46 -54 47 -174
4934 -174 -70 -45 66 28 -58 -2 -101 -155 -188 -84 -19 92 18 -114 -185 -77 -312 -245 112 -54 81 -187 -102 134
4958 134 -98 116 -248 -72 123 -10 -81 5 29 8 116 207 120 378 -102 -6 -434 142 -20 367 -8 198
4980 198 -178 17 171 -178 -48 -101 377 107 -162 -19 159 91 154 -179 -64 -96 66 -10 -11 64 -20 -200 9
5003 9 -60 -89 190 101 -191 42 47 142 63 68 151 -49 -224 -43 141 -10 114 266 190 -52 61 -38 164 93 -45
5028 -45 -25 -157 -23 -68 -171 160 -298 -180 191 -101 72 -8 166 259 25 188 64 -143 139 -63 -21 2
5050 2 175 184 -12 5 -214 83 36 -68 104 -152 118 -56 184 -146 192 297 -8 16 -78 -52 162 24 136
5073 136 -213 259 -92 -285 -199 25 152 -206 182 -216 147 42 -64 -307 113 398 -435 -272 -792 -133
5093 -133 -143 370 58 -1075 364 -73 34 -262 -45 -67 -101 -342 259 -192 6 -159 -146 -266 28 79 -269
5114 -269 91 95 68 -26 -97 -84 -15 -140 -9 -116 73 11 -315 224 65 155 119 12 83 -21 -154 115 29 86
5138 86 -16 70 64 -133 117 36 -126 4 -3 194 61 99 -62 238 54 -49 28 -79 55 -26 50 -49 -52 141 59
5163 59 -188 40 -83 -63 33 221 274 -40 -146 198 5 97 117 62 10 -66 -175 -5 -160 51 40 122 12 307
5187 307 -91 -149 -196 -100 -82 200 -23 -42 -68 -127 -104 -124 -44 -28 116 -329 -114 39 199 35 -32 58 -57 43
5211 43 -15 -175 56 -185 120 31 10 23 -100 -73 -226 90 61 -89 -262 31 -78 139 114 -55 -110 -168 -118 -214
5235 -214 19 -24 -63 -54 108 -207 91 -178 -115 -56 115 75 201 -282 -132 -36 189 -9 -187 40 -133 -46 -43 -52
5259 -52 -203 -39 308 148 24 -23 -217 -117 -225 105 -104 -184 -238 111 84 -120 276 317 121 -481 311 288
5281 288 581 76 -24 -96 -450 348 228 -211 -658 -550 224 195 -153 -399 -3 183 252 -61 143 296 -705
5302 -705 149 153 -184 -340 118 -413 0 -88 19 12 29 349 -165 -44 -30 -22 33 -116 -84 -251 -231 -4 44 -56
5326 -56 15 -52 -231 41 -206 2 -88 -151 -89 -46 -185 -162 202 119 -140 -90 -160 -148 -11 -207 102 197 29 234
5350 234 55 -76 -77 76 35 -130 -24 -126 -83 -14 -199 35 210 108 -103 -395 214 -321 -315 272 21 -187
5372 -187 206 -144 163 -161 16 -56 69 -183 162 -50 -304 75 -11 -120 -321 144 198 -103 -228 32 252
5393 252 291 131 -58 170 121 32 59 -111 226 -233 96 -11 -145 -201 108 113 -239 299 322 100 42 178 -78
5416 -78 -139 -3 -57 -28 -246 43 -74 -155 -143 279 131 -331 52 -59 -274 178 143 -87 -125 14 43 124 -36
5439 -36 128 194 264 147 -143 -46 59 142 47 -145 -194 38 -8 36 4 170 -174 19 -54 6 -106 118 112 -136 -37
5464 -37 -212 -65 208 171 114 -48 15 -184 60 12 20 8 -155 27 -21 -65 164 -113 -32 -134 -221 -142 -128 24 104
5489 104 -65 -9 -215 52 331 13 -63 -75 156 103 141 58 55 83 21 -121 -74 -56 -178 -117 101 45 52 0 3 -55 144
5516 144 -33 40 -57 -83 40 1 124 249 22 153 84 317 -199 26 196 -296 -167 17 -179 154 -69 -1
5538 -1 205 355 141 -5 -117 102 42 14 23 163 63 -4 -135 -80 -51 -69 -43 -2 208 60 -83 37 114 89 -132
5563 -132 51 -110 201 133 86 514 206 -247 -229 115 5 221 -235 -17 263 21 261 122 -286 37 -30
5584 -30 -45 -153 -199 132 178 197 85 171 -118 27 64 -88 149 121 22 132 25 39 136 42 -222 -94 2 -39 44
5609 44 81 -39 157 194 -101 -69 -79 39 127 27 69 82 -93 -213 136 -171 25 19 80 158 -184 -9 -142 6
5633 6 -74 21 -278 -165 -228 118 77 77 213 190 16 -381 212 65 135 64 161 74 23 153 -46 -55 209 -151 74
5658 74 -87 -162 0 -96 -169 178 147 264 -97 47 69 41 -135 274 -247 -26 -87 -200 111 85 -80 29 -92
5681 -92 -71 241 187 34 -117 13 228 115 30 -167 -15 -26 -121 -145 19 194 7 171 -235 131 -15 -131
5703 -131 -95 10 96 -228 25 10 142 -23 -406 -147 -97 25 -254 55 -71 131 168 -378 109 -45 -20 217
5725 217 -149 -105 176 134 -112 -61 278 -217 18 -174 96 -206 -70 9 -92 -98 51 74 139 -37 124 72 -246
5748 -246 305 -77 -94 -128 -5 -84 158 81 72 161 -351 -66 69 -131 -209 -50 -4 -87 -85 -110 -20 49 21 -13 -65 -200
5774 -200 -45 204 126 -21 25 120 157 -58 -18 -116 -88 -121 67 -63 -10 -42 193 -15 53 116 -166 119 210 -105
5798 -105 213 -125 35 44 75 -29 170 25 -43 138 -150 158 -251 -95 204 -42 -181 -3 -77 119 -250 26
5820 26 21 -23 153 223 163 144 -250 -49 158 202 -47 -11 66 -357 -86 63 -21 -56 126 -42 -256 184 -67 -105
5844 -105 -167 69 363 -18 25 -42 171 164 167 56 -3 -51 217 -25 -55 -79 -99 -95 53 -252 31 -72 -82 104 -65
5869 -65 101 270 61 14 -201 -31 -53 -5 105 -93 61 197 101 -102 286 65 57 1 53 96 -355 -119 69
5892 69 -128 27 -86 41 179 -114 -208 108 -85 -234 -256 -94 -88 -51 37 206 -137 104 -133 -285 169 32
5914 32 1 324 104 -220 48 117 -137 -84 -130 255 -32 77 -51 84 76 -194 -12 125 -96 -152 177 -49 297
5937 297 -277 -356 -36 -36 222 -50 12 126 90 209 171 208 -32 93 80 -5 -29 -119 114 -85 -86 195 241 99 4
5962 4 -212 44 14 110 -77 110 242 -4 -187 -106 -4 71 -29 -122 -40 67 12 -288 -137 -3 163 -100 -28
5985 -28 145 -274 -115 -60 -87 -164 -176 149 123 140 94 182 -158 -71 -293 133 -179 30 -147 173 -21 -90 -58 178
6009 178 -242 -24 29 56 215 -162 52 -156 156 25 134 70 -103 2 95 131 34 -100 -160 -16 46 140 81
6032 81 35 -45 -93 -31 2 22 -120 34 -145 -151 -12 162 47 223 -34 -337 -132 -34 -19 -167 211 190 -76 -174
6056 -174 -22 -30 39 -31 -37 58 258 -185 59 84 150 -73 192 -48 31 0 67 -206 88 200 76 -70 -53 -141 54
6081 54 37 108 -177 63 58 -36 60 45 1 -220 185 250 212 111 154 185 -65 -108 62 -139 352 41 -354 67 26
6106 26 110 -39 31 143 232 -35 244 -212 -56 29 118 46 -50 144 24 171 161 70 47 -217 -77 221 249 -137
6130 -137 88 -86 134 223 73 -9 90 289 85 94 -5 237 -429 251 91 -92 82 -29 4 -97 -68 121 -231
6153 -231 71 63 -321 148 147 87 45 162 -110 121 -121 33 151 291 81 241 -126 -97 -131 -14 -116 -129 -101
6176 -101 -90 -26 -230 -20 17 -20 -167 -4 -140 -83 76 -162 -17 151 -138 193 -193 59 249 17 -43 75
6198 75 29 25 -131 -13 20 -105 146 -100 142 -14 221 -133 163 130 -56 8 -21 108 57 -135 -43 50 7 -81
6222 -81 205 189 93 -210 -77 71 218 2 20 125 -25 318 -203 -80 3 140 67 20 107 182 24 5 2 -159
6246 -159 -23 31 -17 -18 92 327 -71 -135 46 -126 99 -24 -94 -44 206 -249 109 -242 105 -45 -16 193 -355
6269 -355 399 -162 215 -67 -36 143 -236 102 -188 160 20 -18 23 -51 3 -69 36 0 -79 39 -63 -78 118
6292 118 -10 70 18 -267 6 210 -44 -66 -99 73 154 185 -296 316 156 47 -50 130 132 -241 -51 -1 342
6315 342 -45 116 19 -5 -193 -19 -127 -71 165 -71 11 -11 -46 -197 18 -49 -183 -12 -79 -171 -73 -161 11 -34
6339 -34 142 33 -25 178 76 0 110 -116 -75 -69 -61 -105 165 -7 -27 139 -29 -105 -33 -9 -41 -69 56 214 -47
6364 -47 -95 66 -57 -246 -191 -51 -87 -332 230 -40 -177 91 23 68 33 -77 -14 -11 26 126 -113 -27 -83 229
6388 229 170 54 -127 155 148 -257 -115 -64 4 67 -95 -128 -50 -276 25 -179 -3 -321 205 -221 -99 178 -155
6411 -155 -279 118 180 289 94 -11 -57 -305 304 592 -64 1 -293 468 172 -5 202 171 -299 70 -274
6432 -274 -162 355 623 -41 -152 630 13 275 300 477 -202 533 -120 444 -70 539 335 532 212 275 -133
6453 -133 -170 -494 -168 333 307 125 -166 -10 -456 125 -184 331 -98 -535 140 54 288 122 -13 404 -164
6474 -164 434 -283 -89 -416 398 -143 -88 -41 -104 227 -208 -496 270 -333 -61 164 113 393 -68 35 196
6495 196 -998 -368 65 478 24 -185 787 10 -93 -6 162 -33 -150 -46 347 -276 -320 -751 548 -143
6515 -143 -334 333 56 499 351 126 521 -292 -567 -126 206 240 362 340 306 44 302 -61 60 -132 -86
6536 -86 -948 -355 -3 -196 235 47 -155 225 483 -15 -97 -279 -172 -473 -71 50 205 399 219 -195 34
6557 34 249 -32 265 -94 -319 144 -222 164 83 -193 25 225 301 128 258 218 -181 419 -274 -144 -86 229
6579 229 76 -73 -178 -49 -76 127 -67 -339 7 272 -376 -37 -128 -231 -134 204 -421 270 255 -227 -369
6600 -369 74 -6 -81 220 -252 -164 -97 178 -245 85 -100 -109 94 36 -48 -132 -349 120 62 -62 116 -28 -203
6623 -203 -284 99 -305 215 -179 215 -281 -211 -50 315 -221 -77 320 -461 307 650 -309 82 208 295 -455
6644 -455 366 180 -88 359 403 20 55 262 382 214 504 176 -450 362 -533 -185 175 260 -290 -95 191
6665 191 -552 347 17 171 -321 232 -86 264 -61 265 401 274 -648 136 135 83 42 -167 239 0 378
6686 378 -11 -365 -48 -749 -17 -54 -169 -173 -11 497 82 704 -222 -426 205 -270 -481 565 -357 267 -448
6707 -448 14 507 477 424 551 -32 -597 -274 581 463 53 194 249 -348 -274 -222 -562 69 383 117 -174 283
6729 283 -430 426 -228 137 171 35 779 274 -179 -8 -107 231 224 -396 -77 -393 87 123 351 137 672 297
6751 297 -342 250 -47 0 458 89 -352 -63 0 375 31 -58 317 -158 -219 269 -308 -31 252 -117 55
6772 55 -653 -157 368 -202 485 673 169 -218 -210 65 163 -597 293 333 -117 272 -599 302 393 73 -288 4
6794 4 200 16 70 234 -68 142 -6 -145 7 -210 -227 307 398 -24 1101 -60 27 -195 -565 -1026 -727
6815 -727 -249 -34 -30 -381 201 -107 -199 158 468 56 -207 510 1203 -557 -564 25 151 1079 -37 357 -383
6836 -383 674 -118 -424 18 566 1144 -148 324 -170 319 225 372 5 -233 472 -418 -223 446 713 204
6856 204 36 927 -449 476 -529 193 -48 438 -1105 -785 263 79 24 25 -297 630 80 49 398 -272
6876 -272 110 -73 87 -133 143 284 -214 37 125 1 -154 -268 182 7 91 -452 174 -21 -72 74 437
6897 437 -84 -26 797 331 316 -301 357 319 160 -290 -48 682 329 -201 -503 -111 -127 -14 83 -258 -167 416
6919 416 210 617 414 424 -230 4 -223 -177 26 -68 755 -747 -390 115 -310 90 443 1162 45 286
6939 286 1197 226 -121 -871 -18 38 -835 -552 429 -133 257 111 -573 3 -1 277 -220 -124 45 -267 316
6960 316 67 -532 346 418 -37 88 363 578 -948 199 194 349 -378 428 438 -741 728 47 -130 135
6980 135 -186 530 -515 547 445 384 226 -160 -94 -76 158 445 241 406 -217 -157 -369 393 -38 -100 358
7001 358 426 -43 446 -176 121 852 315 417 -41 58 -146 269 192 -70 451 551 241 195 -61 -670 431
7022 431 -208 -161 -129 -95 -23 -225 -172 90 82 92 250 41 -148 -269 -212 42 -82 -4 -119 286 -125 20 -66 -229
7046 -229 -64 -168 38 25 -48 -4 -174 -19 -46 -197 -242 132 49 -331 -99 -191 8 -176 -234 43 -78 -145 192
7069 192 209 149 -96 129 31 -107 50 -5 -137 159 -159 -69 110 72 -144 90 41 66 -99 -32 185 -243 -47
7092 -47 52 -73 -127 -67 139 -39 26 76 110 337 276 12 -24 178 -56 257 -9 21 212 -189 38 73 89 -41
7116 -41 332 94 145 130 -243 141 224 -276 -235 -119 178 78 -324 22 -286 -184 143 -151 -111 92 -258 318
7138 318 -379 108 -519 -79 -74 105 26 -18 96 485 288 -431 127 75 57 298 215 200 256 -177 147 -151 432
7161 432 303 -372 -316 -522 -124 -60 128 -127 144 87 309 197 59 248 -289 134 57 310 410 -82 54
7182 54 -39 -56 -180 -154 103 23 -25 114 226 -37 -142 14 -22 15 -3 -2 -253 -173 -190 -87 -17 39 47 -151 297 49
7208 49 91 249 -238 155 -41 176 -50 -64 -115 231 -72 114 306 177 -91 27 -147 107 69 -141 78 -82
7230 -82 2 -187 -162 -55 88 -147 -144 -159 19 22 126 -14 9 210 86 -93 20 -113 218 205 -167 124 107 -26
7254 -26 65 -206 12 91 -18 -17 -55 -168 -118 24 -239 -107 31 -249 -100 93 -54 -189 284 -99 17 39 -98
7277 -98 69 -19 -184 -78 -82 -12 -52 29 -96 55 -32 14 101 -147 78 -239 -66 -40 -43 36 -19 110 133 -170 160
7302 160 97 230 -115 -92 -64 -156 112 147 -113 -202 -79 -167 -56 13 -135 53 11 90 -26 95 109 -99 -52 -78
7326 -78 189 99 -269 161 -37 -181 -34 127 139 128 307 -210 266 146 84 79 23 -109 -91 43 -33 -172 443
7349 443 -217 150 1 173 41 -66 74 -3 137 -74 163 -181 127 -191 -110 -34 130 -254 40 -382 -72
7370 -72 238 -102 209 173 274 50 230 38 -139 -42 55 -356 131 39 -241 31 -67 -27 177 142 -12 -36 202
7393 202 -80 -76 -80 -17 -125 -95 11 -135 -19 283 -65 -55 231 -175 -41 108 236 -385 171 121 63 -507 536
7416 536 147 -572 17 884 481 318 271 4 -200 -81 -269 -117 -60 44 10 153 55 34 -175 -1 144 -70
7438 -70 -87 68 -159 -139 -76 -114 187 -213 -122 21 -9 -90 177 81 51 -109 -39 -108 20 93 290 -128 29 -140
7462 -140 198 165 176 64 19 -186 -49 127 16 97 275 262 -31 -44 -22 -31 -86 -57 42 68 102 12 151 -110 -395
7487 -395 -293 -348 -599 375 -466 130 -40 -88 -224 -439 -692 -252 363 -473 -408 469 -139 141 -258 407 534
7508 534 -275 129 -309 126 191 -176 10 145 155 284 -237 -32 2 57 202 200 -348 79 144 281 -16 -57 -25
7531 -25 73 76 -59 45 -10 159 -116 10 379 -300 127 -75 -275 -165 86 16 139 -130 -231 -222 -74 147 -29
7554 -29 31 -153 283 150 11 -4 104 -6 60 342 40 -46 7 5 -97 -207 29 105 -145 7 -139 1 234
7577 234 -223 -80 148 57 -66 20 -84 109 170 149 217 65 -94 261 -107 6 96 72 -64 -159 -95 144 -127
7600 -127 33 -247 -139 31 -130 223 3 -141 -192 27 -24 302 48 119 80 1 303 17 -132 -275 0 -151
7622 -151 -158 15 280 142 -16 165 150 35 87 -118 304 -309 28 175 515 -340 -32 458 228 -189 96
7643 96 457 -292 38 -90 95 162 217 -136 193 -194 102 33 -38 18 157 189 80 363 -22 67 -112 -151 -66
7666 -66 -69 -88 184 126 -4 93 0 -9 -25 -166 -212 -44 -54 -64 -105 91 52 43 164 -1 117 -84 149 -152 224 -345
7692 -345 -88 -53 13 58 -47 -165 37 229 46 -92 419 -11 28 104 -78 181 -52 379 1 -148 -150 -13
7714 -13 -94 268 -142 6 213 107 39 -126 174 -84 -14 -193 -38 -195 -133 25 126 -133 -166 5 -113 -150
7736 -150 -79 151 -30 121 -56 133 8 78 21 -162 -164 246 35 109 -75 102 -100 14 -68 24 116 116 131 -31
7760 -31 159 -43 109 -99 105 -153 42 -101 149 8 -42 91 -97 -185 -126 31 -135 53 -113 -55 -175 -26
7782 -26 70 53 -192 -1 184 -54 141 -8 130 -75 -24 -242 -106 -87 172 -49 126 -47 9 129 109 -79
7804 -79 -48 70 -62 63 -63 53 -37 -16 -39 -132 -21 3 -226 -128 -23 -357 -80 88 -243 56 -92 78 373
7827 373 -24 139 -40 -101 -3 -168 138 -52 33 168 -178 -107 -118 109 -216 67 233 93 254 52 -277 -64
7849 -64 -52 54 43 -17 88 -27 241 182 157 213 39 -66 37 103 -118 -198 29 -92 -42 52 48 -106 116 -100
7873 -100 -93 -163 14 -178 -53 134 100 -38 -48 9 0 -4 199 105 76 100 239 -112 32 -45 27 -19 230 10 -55 167
7899 167 5 -118 -46 17 -17 -114 64 -70 -121 -4 -33 -67 44 153 26 -222 -167 -22 -67 -134 -215 46 -107 -173
7923 -173 38 -143 -28 -153 103 -208 -173 -309 66 -187 -200 -307 35 -48 -81 -39 24 91 -36 8 6 168 -135
7946 -135 106 -294 20 61 61 43 -163 -7 -26 68 -28 -112 -17 -201 56 -222 -66 -296 -187 -103 -13 -21 76 128 51
7971 51 -116 21 -4 389 24 -81 -36 -24 -123 211 -57 174 -68 -19 205 41 121 67 -144 -150 167 -131 -146 -177
7995 -177 -96 172 107 211 222 69 103 -170 -145 52 100 100 -73 -95 -136 -173 287 94 -54 156 -51 14 192 151
8019 151 -149 -90 -62 200 33 66 164 -28 -106 7 -193 16 88 67 -215 123 -159 -133 119 -55 203 -50 -258
8042 -258 108 157 -53 -58 168 -200 -125 209 123 34 84 -61 -73 -33 24 -214 -170 -61 -135 -28 -11 -132 27 -64 -173
8067 -173 2 26 13 -187 149 36 154 122 4 -36 130 92 5 155 180 128 -103 -68 -106 -289 -48 -102 -102 -1
8091 -1 15 156 45 -138 -264 315 -36 145 176 89 -45 -29 -103 -79 -31 40 125 134 17 -112 79 82 250 198 -123
8116 -123 -218 -120 -78 40 -230 -75 164 185 -39 -122 105 -202 -26 -179 -157 109 128 114 63 8 -41 -148 -84 -49
8140 -49 -84 172 238 -281 149 -81 -130 -76 -6 -21 46 131 -126 251 58 -20 -73 29 23 -66 185 -42 -184 125 -20
8165 -20 62 -9 -90 -68 -37 -163 -120 125 -199 -170 191 -62 78 185 105 98 -105 120 -62 -110 198 -230 71 96
8189 96 -78 -225
8191b25
##END NTUPLES=NMR FID
##END=
