##TITLE=1H_Pr SACl
 CDCl3, 8 sc, 
 4.06.2021
##JCAMPDX= 6.0         $$ Bruker NMR JCAMP-DX V2.0
##DATA TYPE= NMR FID
##DATA CLASS= NTUPLES
##ORIGIN= UXNMR, Bruker Analytische Messtechnik GmbH
##OWNER= root
$$ XWIN-NMR		Version 3.5
$$ Fri Jun  4 13:37:19 2021 Russian Standard Time (UT+4h)  she@DPX200
##.OBSERVE FREQUENCY= 200.131506
##.OBSERVE NUCLEUS= ^1H
##.DELAY= (6, 6)
##.ACQUISITION MODE= SIMULTANEOUS
##.ACQUISITION SCHEME= undefined
##.AVERAGES= 8
##.DIGITISER RES= 18
##SPECTROMETER/DATA SYSTEM= spect
##.PULSE SEQUENCE= zg30
##.SOLVENT NAME= CD3CN
##.SHIFT REFERENCE= (INTERNAL, CD3CN, 0, 15.7039)
##AUDIT TRAIL= $$ (NUMBER, WHEN, WHO, WHERE, WHAT)
$$ ##TITLE= Audit trail, XWIN-NMR		Version 3.5
$$ ##JCAMPDX= 5.01
$$ ##ORIGIN= Bruker BioSpin GmbH
$$ ##OWNER= she
$$ F:/spectra/data/she/nmr/H-F/1/audita.txt
$$ ##AUDIT TRAIL=  $$ (NUMBER, WHEN, WHO, WHERE, WHAT)
(   1,<2021-06-04 13:36:17.95 +0400>,<she>,<DPX200>,
      <created by zg, POWCHK disabled, PULCHK disabled
       configuration hash MD5:
       00 E9 B6 7A A2 85 ED C7 34 08 36 98 17 FE 4E 26
       data hash MD5: 16K
       94 7D 5C FC 78 C6 5B D0 CF F5 B5 D8 87 EF C8 BF>)
$$ ##END=
$$ 
$$ hash MD5
$$ 43 6A 47 62 44 A0 84 AD 79 5D 9E 56 99 5E A8 FC
##$RELAX= 
##$RELAX= 
##$RELAX= 
##$RELAX= 
##$RELAX= 
##$RELAX= 
$$ Bruker specific parameters
$$ --------------------------
##$DU= <F:/spectra>
##$EXPNO= 1
##$NAME= <H-F>
##$PROCNO= 1
##$TYPE= <nmr>
##$USER= <she>
##$AMP= (0..31)
100 100 100 100 100 100 100 100 100 100 100 100 100 100 100 100 100 100 
100 100 100 100 100 100 100 100 100 100 100 100 100 100 
##$AQSEQ= 0
##$AQ_mod= 1
##$AUNM= <au_zg>
##$AUTOPOS= <>
##$BF1= 200.13
##$BF2= 200.13
##$BF3= 200.13
##$BF4= 200.13
##$BF5= 200.13
##$BF6= 200.13
##$BF7= 200.13
##$BF8= 200.13
##$BYTORDA= 1
##$CFDGTYP= 0
##$CFRGTYP= 5
##$CHEMSTR= <none>
##$CNST= (0..31)
1 1 145 1 1 1 1 1 1 1 1 1 1 1 1 1 1 1 1 1 1 1 1 1 1 1 1 1 1 1 1 1 
##$CPDPRG= <>
##$CPDPRG1= <>
##$CPDPRG2= <>
##$CPDPRG3= <>
##$CPDPRG4= <mlev>
##$CPDPRG5= <mlev>
##$CPDPRG6= <mlev>
##$CPDPRG7= <mlev>
##$CPDPRG8= <mlev>
##$CPDPRGB= <>
##$CPDPRGT= <>
##$D= (0..31)
0 1.2 0 0 0 0 0 0 0 0.06 0 0.03 0 0 0 0 0.0002 0 0 0 0 0 0 0 0 0 0 0 0 
0 0 0 
##$DATE= 1622799377
##$DBL= (0..7)
120 120 120 120 120 120 120 120 
##$DBP= (0..7)
150 150 150 150 150 150 150 150 
##$DBP07= 0
##$DBPNAM0= <>
##$DBPNAM1= <>
##$DBPNAM2= <>
##$DBPNAM3= <>
##$DBPNAM4= <>
##$DBPNAM5= <>
##$DBPNAM6= <>
##$DBPNAM7= <>
##$DBPOAL= (0..7)
0.5 0.5 0.5 0.5 0.5 0.5 0.5 0.5 
##$DBPOFFS= (0..7)
0 0 0 0 0 0 0 0 
##$DE= 6
##$DECBNUC= <off>
##$DECIM= 32
##$DECNUC= <off>
##$DECSTAT= 4
##$DIGMOD= 1
##$DIGTYP= 9
##$DL= (0..7)
0 120 120 120 120 120 120 120 
##$DP= (0..7)
150 150 150 150 150 150 150 150 
##$DP07= 0
##$DPNAME0= <>
##$DPNAME1= <>
##$DPNAME2= <>
##$DPNAME3= <>
##$DPNAME4= <>
##$DPNAME5= <>
##$DPNAME6= <>
##$DPNAME7= <>
##$DPOAL= (0..7)
0.5 0.5 0.5 0.5 0.5 0.5 0.5 0.5 
##$DPOFFS= (0..7)
0 0 0 0 0 0 0 0 
##$DQDMODE= 0
##$DR= 18
##$DS= 0
##$DSLIST= <SSSSSSSSSSSSSSS>
$$ [...]
##$SUBNAM2= <"">
##$SUBNAM3= <"">
##$SUBNAM4= <"">
##$SUBNAM5= <"">
##$SUBNAM6= <"">
##$SUBNAM7= <"">
##$SUBNAM8= <"">
##$SUBNAM9= <"">
##$SW= 20.0188882624521
##$SWIBOX= (0..15)
0 0 2 0 0 0 0 0 0 0 0 0 0 0 0 0 
##$SW_h= 4006.41025641026
##$TD= 16384
##$TD0= 1
##$TE= 0
##$TE2= 300
##$TE3= 300
##$TEG= 300
##$TL= (0..7)
0 120 120 120 120 120 120 120 
##$TP= (0..7)
150 150 150 150 150 150 150 150 
##$TP07= 0
##$TPNAME0= <>
##$TPNAME1= <>
##$TPNAME2= <>
##$TPNAME3= <>
##$TPNAME4= <>
##$TPNAME5= <>
##$TPNAME6= <>
##$TPNAME7= <>
##$TPOAL= (0..7)
0.5 0.5 0.5 0.5 0.5 0.5 0.5 0.5 
##$TPOFFS= (0..7)
0 0 0 0 0 0 0 0 
##$TUNHIN= 0
##$TUNHOUT= 0
##$TUNXOUT= 0
##$USERA1= <user>
##$USERA2= <user>
##$USERA3= <user>
##$USERA4= <user>
##$USERA5= <user>
##$V9= 5
##$VALIST= <valist>
##$VCLIST= <CCCCCCCCCCCCCCC>
##$VD= 0
##$VDLIST= <DDDDDDDDDDDDDDD>
##$VPLIST= <PPPPPPPPPPPPPPP>
##$VTLIST= <TTTTTTTTTTTTTTT>
##$WBST= 1024
##$WBSW= 4
##$XGAIN= (0..3)
0 0 0 0 
##$XL= 0
##$YL= 0
##$YMAX_a= 392514
##$YMIN_a= -321768
##$ZGOPTNS= <>
##$ZL1= 120
##$ZL2= 120
##$ZL3= 120
##$ZL4= 120
##$ABSF1= 10
##$ABSF2= 0
##$ABSG= 5
##$ABSL= 3
##$ALPHA= 0
##$AQORDER= 0
##$ASSFAC= 0
##$ASSFACI= 0
##$ASSFACX= 0
##$ASSWID= 0
##$AUNMP= <proc_1d>
##$AZFE= 0.1
##$AZFW= 0.1
##$BCFW= 1
##$BC_mod= 2
##$BYTORDP= 1
##$COROFFS= 0
##$CY= 11.3945322036743
##$DATMOD= 1
##$DC= 2
##$DFILT= <>
##$DTYPP= 0
##$F1P= 15.9154993809931
##$F2P= -4.1035820241983
##$FCOR= 0.5
##$FTSIZE= 0
##$FT_mod= 4
##$GAMMA= 1
##$GB= 0.15
##$INTBC= 1
##$INTSCL= 1
##$ISEN= 128
##$LB= 0.24
##$LEV0= 0
##$LPBIN= 0
##$MAXI= 10000
##$MC2= 0
##$MEAN= 0
##$ME_mod= 0
##$MI= 1.114404
##$NCOEF= 0
##$NC_proc= 0
##$NLEV= 6
##$NOISF1= 3.799351
##$NOISF2= 2.8
##$NSP= 1
##$NTH_PI= 0
##$NZP= 0
##$OFFSET= 15.70392
##$PC= 1
##$PHC0= -11121.4
##$PHC1= 12.20101
##$PH_mod= 1
##$PKNL= yes
##$PPARMOD= 0
##$PSCAL= 0
##$PSIGN= 0
##$REVERSE= no
##$SF= 200.130013532006
##$SI= 16384
##$SIGF1= 3
##$SIGF2= 2
##$SINO= 400
##$SIOLD= 16384
##$SREGLST= <1H.CDCl3>
##$SSB= 0
##$STSI= 0
##$STSR= 0
##$SW_p= 3612.71676300578
##$SYMM= 0
##$S_DEV= 0
##$TDeff= 0
##$TDoff= 0
##$TI= <>
##$TILT= no
##$TM1= 0
##$TM2= 0
##$TOPLEV= 0
##$USERP1= <user>
##$USERP2= <user>
##$USERP3= <user>
##$USERP4= <user>
##$USERP5= <user>
##$WDW= 1
##$XDIM= 8192
##$YMAX_p= 0
##$YMIN_p= 0
$$ End of Bruker specific parameters
$$ ---------------------------------
##NTUPLES= NMR FID
##VAR_NAME=  TIME,          FID/REAL,        FID/IMAG
##SYMBOL=    X,             R,               I
##VAR_TYPE=  INDEPENDENT,   DEPENDENT,       DEPENDENT
##VAR_FORM=  AFFN,          ASDF,            ASDF
##VAR_DIM=   8192,          8192,            8192
##UNITS=     SECONDS,       ARBITRARY UNITS, ARBITRARY UNITS
##FACTOR=    0.0002496,     1,               1
##FIRST=     0,             0,               0
##LAST=      2.0444736,     0,               0
##MIN=       0,             -321768,         0
##MAX=       2.0444736,     392514,          0
$$ Real data points
##PAGE= N=1
##DATA TABLE= (X++(R..R)), XYDATA
0 0 0 0 0 0 0 0 0 0 0 0 -8 8 -8 8 -16 16 -16 24 -24 32 -40 48 -56 64 -80 89 -104 120 -140 160 -184 209 -236
33 -236 268 -301 340 -380 428 -477 533 -589 654 -726 804 -890 980 -1083 1195 -1317 1449
50 1449 -1598 1760 -1940 2142 -2370 2625 -2917 3253 -3647 4114 -4678 5376 -6263 7440 -9065
65 -9065 11485 -15440 23044 -42857 202713 392514 -175014 -173351 231185 305302 -40920 -125975
77 -125975 67599 136566 25786 -32610 -101517 -56100 111977 63004 -189848 -107786 180553
88 180553 106183 -128864 -25096 132137 95892 55421 19732 -16411 96094 154773 -18862
99 -18862 -126460 39849 135971 -53112 -171754 -21280 71171 -50974 -126304 -34313 15781
110 15781 -17506 -107 -17450 -52436 65762 100784 -71017 -56785 128718 53851 -125120
121 -125120 -18614 98057 -64649 -135935 24318 18222 -139554 -94652 47957 -14827 -140014
132 -140014 -35085 90070 -24610 -91931 45206 75988 -28108 -13014 54475 14458 -13852
143 -13852 21496 -10267 -35405 16012 -12623 -70436 -13408 16265 -47221 -48192 18826 20221 -27211
156 -27211 -588 53920 28199 3449 46458 58433 11891 18308 69168 24449 -35056 33983
168 33983 57773 -38019 -36562 35839 10034 -29916 -1480 6487 -5003 33615 36588 -26593 7174
181 7174 98089 49546 -45512 6763 106991 51409 -67917 -18688 84391 19910 -70364 -27653
193 -27653 22067 -3869 -29062 -28161 -28500 -139 25599 -21259 -42012 21462 38302 -5782 -16229
206 -16229 2969 16148 11592 -6591 -27285 -26777 6411 4539 -55165 -63411 731 13500 -56158
219 -56158 -70477 7458 20256 -39572 -31873 8458 6136 2694 1316 -10612 -1192 20532 7439
232 7439 -25174 -12924 12352 -6883 -23764 -14316 -10784 -13361 -8067 562 -12504 -21963 20399
245 20399 35595 -15452 -15524 45278 47181 -5289 -6550 37493 37751 7952 -958 2203 20008 26115
259 26115 -8879 -21184 12261 28194 3379 -19486 4895 35185 18539 -2178 9202 26614
271 26614 28288 19265 10190 3561 17951 37857 2041 -30473 10701 33630 -10010 -35536 -7666
284 -7666 18612 339 -26172 -19413 5859 18133 -4361 -27742 -2203 27239 9659 -24404
296 -24404 -19784 19832 16764 -30277 -30872 2516 1453 -21172 -30829 -22591 -9912 -4913 -18300 -37273
310 -37273 -14896 16298 -5758 -32697 -13075 15471 11366 -17847 -21327 6772 14848 -4781 -23783
323 -23783 -16849 11063 10127 -23210 -31476 2565 23650 -11032 -33851 3739 27181 6014 -11340
336 -11340 -2948 20783 27521 6591 -7095 8023 31684 22332 -11125 -6793 24041 25549 -3574
349 -3574 -17192 9780 28336 6726 -9871 -584 19641 28453 5231 -11209 14520 38289 17505
362 17505 -13591 1851 34277 20632 -10213 -9927 12059 21530 -1514 -21011 -5095 14291 8186
375 8186 -14731 -20564 6728 18986 -6188 -22049 -3318 19035 5190 -19506 -12403 5335 7879
388 7879 -7031 -26151 -14095 9750 -2019 -28737 -27434 -57 6983 -20566 -31375 -8714 9376
401 9376 -2415 -26210 -18746 9318 9001 -12873 -23030 -5028 17688 -116 -27500 -14632 11711
414 11711 8481 -17981 -23197 2165 13242 -2152 -17883 -10246 16231 16772 -8974 -12338 10414
427 10414 25689 9403 -13484 643 25787 18869 -4872 -9605 13466 25821 4657 -11807
439 -11807 338 22840 20180 -7587 -8677 19292 25655 5366 -7923 7043 27222 16380 -3618
452 -3618 -1491 15107 22081 3493 -10513 3044 16877 9734 -9907 -11503 9761 12614 -5683
465 -5683 -12541 -2326 10109 5433 -10992 -10072 3560 9104 -2525 -16387 -6491 7599 265 -14637
479 -14637 -17134 -2093 4888 -13043 -21705 -9563 771 -4181 -18610 -16536 -629 959 -10818
492 -10818 -16881 -6890 4934 -3231 -13999 -10218 -944 4295 -6791 -17473 -4688 7163 -1179
505 -1179 -15328 -11128 8285 6821 -11562 -11137 6303 12899 -785 -10671 4297 15713 6526 -3130
519 -3130 -1384 12007 16410 1239 -5550 6548 17930 10365 -7474 -1048 18979 15795 -2145
532 -2145 -5768 12777 23471 4186 -7441 7766 21108 13771 -3847 -2471 15970 17436 1547
545 1547 -7917 2269 18276 9181 -11111 -7946 10775 15988 -5316 -18229 3476 18049 261
558 261 -17257 -7533 13291 7655 -13936 -12528 2163 6953 -3703 -15706 -10059 1902 1207 -9844
572 -9844 -19127 -8603 6450 -3096 -19758 -16087 2477 6541 -13705 -20919 -2461 7832 -3372
585 -3372 -17446 -11798 4681 3692 -9119 -14739 -6713 7472 3016 -14701 -13400 4221 11892 -3935
599 -3935 -17738 -961 16403 5718 -10811 -7438 11811 15263 -1244 -8247 2169 15188 12886
612 12886 -5897 -7788 11981 20130 3680 -12066 1583 24334 13130 -9765 -5432 17750 22458
625 22458 -1623 -10739 10607 22294 7880 -8240 -1162 17646 14507 -3245 -6594 5542 15414
638 15414 6339 -9972 -5055 10967 12337 -5192 -14458 3837 16029 -1212 -15405 -4152 11666
651 11666 4843 -13210 -10414 3725 5079 -5745 -14548 -6532 5046 -816 -13099 -13587 -717 4658
665 4658 -9906 -17024 -4095 3666 -4070 -14360 -9992 2249 -201 -9679 -10823 -4080 2937 -3283
679 -3283 -11725 -6831 1125 1529 -5893 -10345 -1016 5204 -510 -7312 -5470 5670 8039 -4690 -7742
694 -7742 4637 11582 1766 -7981 2113 12813 5453 -2998 -814 7866 11100 2366 -2114 3423
708 3423 10732 10690 -453 -2600 10368 14139 3728 -3640 4301 15554 8743 -2911 -595 9595
722 9595 13599 2424 -7232 2901 14077 7231 -6963 -5603 11149 11853 -5498 -9404 3089 11450
736 11450 1811 -11601 -5168 8319 6231 -7444 -12553 605 9557 -3738 -14793 -6490 5497
749 5497 2223 -12479 -12798 -236 3494 -4726 -14303 -9971 4481 2060 -12605 -14449 -835 7095
763 7095 -6758 -17273 -5087 6107 201 -12180 -11648 2813 5881 -6058 -12231 -3636 8159
776 8159 2811 -11696 -7073 6723 7520 -4072 -8991 2601 10156 2477 -5156 -2698 7451 11158
790 11158 -733 -5845 4530 12859 6746 -5506 -914 12175 10726 -397 -2920 6047 14052 5904
804 5904 -3931 1139 11310 11931 -581 -4810 8019 13143 2686 -4887 1107 11508 7152 -3840
818 -3840 -2754 5116 8825 1596 -7028 -1446 8546 5070 -5919 -7525 3694 7807 -4016 -9484
832 -9484 -2015 5056 1637 -9020 -8706 1643 3299 -5136 -12312 -4767 5187 -1798 -12305 -8793 1031
847 1031 2511 -8210 -12341 -2496 2365 -2726 -9965 -8850 1373 2130 -7273 -10195 -2700 4732 -1268
862 -1268 -10313 -5097 3473 3028 -4664 -8047 400 6887 584 -6570 -2978 6254 7288 -4003 -5360
877 -5360 5004 8751 2427 -5119 989 9817 6408 -1338 -1775 5738 10809 3190 -3394 2881 10243
892 10243 8019 -1232 -1596 8846 10358 2234 -1967 2404 10190 6976 -2333 -1758 6362 9423 1509
907 1509 -5757 1880 9556 3981 -4801 -3882 5851 7095 -3066 -6540 245 5961 1879 -7898 -5527
922 -5527 3850 3224 -5337 -9089 -1598 4690 -2732 -9666 -5580 1403 1468 -7516 -10256 -1527 2438 -3098
938 -3098 -10242 -7465 2145 643 -8516 -9016 -1655 3199 -3262 -10667 -4911 3064 949 -6176 -8442
953 -8442 752 5225 -2866 -7547 -2877 5340 3603 -5991 -4942 3940 5967 -267 -5639 127 8411
968 8411 4291 -3063 -2514 5711 9321 858 -3875 3154 8932 6118 -1915 -1391 8463 9184 1270 -2203
984 -2203 3254 10436 5907 -3045 226 7821 8615 567 -3550 4082 9081 3145 -2813 -1299 6566
999 6566 6786 -2447 -4003 2516 6751 1637 -5905 -2382 5379 3169 -3975 -6159 426 4712 -2250
1014 -2250 -7599 -3611 2315 1261 -6899 -7420 108 2107 -3908 -8383 -4813 2427 -1095 -8065 -6934
1029 -6934 -799 1539 -4659 -8924 -3294 1844 -1475 -6828 -6710 1024 2042 -4819 -6453 -1735 3037
1044 3037 179 -6587 -3994 2734 2910 -2395 -5186 582 5611 621 -3808 -1203 4732 5677 -1516
1059 -1516 -3175 3813 6825 2982 -2465 456 7952 6040 -836 -958 4909 8620 2577 -2367 2594
1074 2594 7773 6121 -258 -1808 5935 8273 1608 -2342 1176 7969 5245 -3248 -1801 5304 6312
1089 6312 252 -4935 1229 6871 1884 -3998 -3494 3466 4888 -3248 -6519 -497 4319 638 -7076
1104 -7076 -5226 2884 2268 -4761 -7857 -1786 3526 -1825 -8617 -5187 1504 1205 -6232 -8363 -984
1119 -984 2337 -3125 -7687 -5618 1822 1090 -6345 -7094 -1044 2998 -1790 -7864 -3606 3635 1262 -4753
1135 -4753 -5588 1008 4607 -1636 -5167 -1283 4122 3745 -3351 -3499 3494 5376 838 -3537 170 6902
1151 6902 4014 -1919 -1230 4444 7547 1334 -2572 2814 7281 4863 -905 -938 6076 6873 1236 -1053
1167 -1053 2359 7098 4518 -1774 -243 5126 6169 805 -3282 2234 6715 2164 -2626 -1494 4359
1182 4359 4530 -2443 -3703 1229 3927 762 -4710 -3090 3147 1968 -3635 -5502 -641 3265 -1653
1197 -1653 -6663 -3301 1406 907 -5423 -6720 -53 1403 -3484 -6853 -4143 1833 -352 -6568 -5466
1212 -5466 -470 1389 -3235 -7273 -2541 2127 -857 -5082 -4966 1035 2930 -3253 -5337 -655 3224
1227 3224 1127 -4622 -2677 3346 3063 -1190 -3678 887 5413 1485 -2827 -834 4628 5287 -470
1242 -470 -2199 3511 6182 2459 -1725 365 6557 5308 -404 -478 3544 6778 2805 -2080 1596 6090
1258 6090 4744 -37 -1565 3691 6192 1211 -1872 821 5064 3751 -2108 -2059 3158 4175 168
1273 168 -3686 -480 4340 1309 -3571 -3298 1072 3300 -2307 -5153 -1288 2106 181 -4904 -5047 1236
1289 1236 1509 -3637 -5765 -2421 2097 -1262 -6461 -4409 -9 400 -3958 -6878 -1745 1586 -1835
1304 -1835 -5613 -4706 1319 1575 -4493 -5267 -394 2486 -618 -5329 -2660 2310 1336 -2633 -3926 765
1320 765 3942 -17 -3917 -847 3597 3518 -2026 -2471 3320 4913 1303 -1907 754 5636 3751 -1000
1336 -1000 -659 4104 5897 1509 -2036 2047 6126 3794 -637 -869 4657 5880 567 -1005 1899
1351 1899 5571 3690 -2019 -796 4181 4287 147 -2577 1392 5212 1095 -2717 -1510 2691 3317
1366 3317 -1958 -3882 260 2733 -26 -4404 -3082 2421 1292 -3846 -4633 -724 2023 -1843 -5636
1381 -5636 -3090 782 336 -4172 -5731 -495 1748 -2392 -5559 -3429 1341 -63 -5136 -4619 2
1396 2 1184 -1949 -5347 -2231 2179 52 -3677 -3987 937 2972 -1857 -3924 -315 2867 1517 -3000
1412 -3000 -2011 2852 3139 -324 -2306 498 4884 2047 -1922 -445 3525 4540 280 -1818 2796
1427 2796 5137 2480 -798 -270 4668 4878 266 -877 2368 5581 2726 -1729 752 4929 3791
1442 3791 -11 -1643 2705 5125 864 -2079 101 3626 3142 -1812 -2472 1918 3054 68 -3408
1457 -3408 -1129 2941 1096 -3062 -2811 138 2565 -1776 -4872 -1549 1275 24 -4185 -4289 447
1472 447 988 -3327 -4896 -2175 1559 -763 -4909 -3559 149 531 -2434 -5412 -1689 1708 -1117 -4343
1488 -4343 -3491 1031 1452 -3079 -3738 -309 1798 -30 -3409 -1863 2438 1881 -1588 -2703 664 3631
1504 3631 583 -2294 61 3413 3058 -807 -1653 2634 4131 1222 -1103 428 4402 3481 -721 -321
1520 -321 3251 4851 1738 -1387 1536 4429 2875 -234 -823 3052 4490 566 -1174 983 3845
1535 3845 2731 -1504 -958 2940 2990 -164 -2129 302 3357 910 -2306 -1785 1446 2137 -1737 -3737
1551 -3737 -295 1880 -628 -3543 -2605 920 799 -2896 -3749 -1174 1311 -1235 -4549 -2722 504 -34
1567 -34 -3205 -4509 -633 1109 -2145 -4046 -2662 676 351 -3649 -3482 -306 1557 -991 -3817 -1592
1583 -1592 1914 329 -2716 -2463 1191 2774 -985 -2807 274 2361 1686 -1579 -1196 2640 3006 527
1599 527 -1423 902 4091 2303 -1425 12 3124 3514 770 -1061 1884 4256 2110 -332 -55 3481
1615 3481 3856 62 -751 1872 3953 2127 -1207 138 3617 2792 -56 -1329 1604 3649 589 -1836
1631 -1836 -302 2286 2166 -1554 -2573 1184 1953 -481 -3003 -1610 2008 755 -2916 -2775 -46 1530
1647 1530 -1131 -3859 -1600 1068 -140 -2862 -3728 -240 733 -2401 -4010 -1990 789 -269 -3759
1662 -3759 -3014 -126 532 -2012 -3977 -1235 1677 -402 -3002 -2436 797 1603 -1977 -3028 -131 1861
1678 1861 486 -2054 -1769 2054 2129 -793 -1653 835 3131 1238 -1516 -121 2584 2609 -105 -1328
1694 -1328 2277 3859 1333 -552 482 3633 2986 -413 -241 2581 3514 1537 -910 770 3892 2282
1710 2282 -96 -720 2156 3318 312 -1160 586 2655 1918 -1297 -1270 1995 2183 -223 -2219 -174
1726 -174 2241 556 -2083 -1302 730 1423 -1379 -3100 -410 1304 -406 -2606 -2508 310 577 -2505
1742 -2505 -3319 -1253 856 -1013 -3774 -2476 311 137 -2407 -3645 -1003 906 -1217 -3217 -2216
1757 -2216 889 748 -2256 -2913 116 1237 -640 -2676 -1411 1868 844 -1719 -1676 717 2441 -71
1773 -71 -2064 235 2315 1747 -749 -1139 2301 2943 255 -1011 870 3288 2303 -631 -227 2611 3205
1790 3205 1153 -767 1433 3362 2118 -97 -108 2621 3317 381 -788 1388 2994 1742 -1154 -229
1806 -229 2419 2148 -369 -1290 586 2518 469 -2185 -872 1372 1691 -1176 -2128 421 1600 -412
1822 -412 -2444 -1714 1206 452 -2233 -2925 -422 899 -1184 -3064 -1678 674 -241 -2706 -3176 -480
1838 -480 647 -2080 -3164 -1835 369 122 -2844 -2471 52 722 -1349 -2868 -1284 1327 6 -2356
1854 -2356 -1722 717 1227 -1110 -2150 -29 1883 854 -1126 -1025 1924 1929 -469 -975 512 2610 1245
1871 1245 -1102 12 2486 2537 633 -727 1581 3152 1004 -616 272 2750 2734 103 -248 1998
1887 1998 2540 1442 -984 412 2875 1877 -379 -538 1324 2394 425 -1278 196 1948 1315 -1116
1903 -1116 -1450 1056 1431 -688 -1603 -436 1716 433 -1868 -1482 353 736 -1198 -2680 -990 706
1919 706 -110 -2799 -2309 84 410 -1976 -2596 -1180 558 -867 -3210 -2051 226 -112 -1641 -2581 -963
1936 -963 1102 -1160 -2397 -1523 578 578 -1827 -2353 229 1046 -240 -1821 -1035 1491 1062 -1169 -1065
1953 -1065 612 2078 543 -1495 342 1943 1810 -359 -732 1633 2585 374 -542 753 2502 1983
1969 1983 -275 191 1988 2554 1173 -616 897 2510 1745 -293 45 1669 2564 366 -724 812
1985 812 2046 1312 -934 -946 1702 1794 -597 -1105 83 1684 213 -1376 -591 737 962 -1066 -2217
2002 -2217 -233 790 -476 -2000 -1542 663 46 -2013 -2089 -405 153 -671 -2949 -1575 376 -592 -1984
2019 -1984 -2401 -416 879 -1106 -2656 -1342 475 166 -1884 -1937 26 859 -1010 -1939 -987 1158 228
2036 228 -1768 -1090 523 1400 -462 -1665 355 1397 861 -654 -773 1617 1957 -130 -614 651 2178
2053 2178 1429 -667 423 2043 1983 428 -457 1087 2501 1444 -397 221 2287 2406 2 -432 1499
2070 1499 2272 1163 -547 47 1960 1253 -460 -641 894 1859 4 -1143 -320 1304 965 -1139 -1642
2087 -1642 622 1050 -335 -1651 -922 864 309 -1974 -1332 -108 488 -1111 -2457 -650 765 -371
2103 -371 -1914 -1916 97 425 -1551 -2518 -880 112 -333 -2110 -1801 229 260 -1109 -2079 -876 1060 -364
2121 -364 -1800 -1093 500 815 -1007 -1404 455 1219 -194 -974 -646 1179 1285 -403 -770 706 1784
2138 1784 758 -1125 194 1807 1444 249 -454 1346 1962 716 -617 534 1907 1543 -436 -344
2154 -344 1616 2192 702 -244 395 2372 991 -225 -151 1156 2007 53 -621 628 1485 1053 -669
2171 -669 -703 1136 1324 -305 -1063 -255 1293 230 -1750 -834 330 997 -754 -2044 -185 706 -646
2188 -646 -1833 -1270 90 283 -1733 -1918 -612 441 -514 -2133 -1616 70 -227 -1480 -1899 -536 909
2205 909 -680 -1752 -1040 286 323 -1104 -1356 152 859 -498 -1397 -763 1084 341 -996 -507 573
2222 573 1233 -45 -1112 361 1452 773 -289 -572 1240 1833 356 -326 744 1721 1211 -618 280
2239 280 1522 1658 685 -332 900 2262 1009 -141 119 1459 1730 131 -530 1101 1531 710 -267
2256 -267 68 1485 1093 -205 -557 325 1502 -151 -1430 -390 781 658 -687 -1318 339 859 -627
2273 -627 -1315 -1033 443 103 -1431 -1528 -310 360 -638 -2090 -865 566 -168 -1688 -1499 -266 411 -1326
2291 -1326 -1712 -610 250 70 -1572 -1331 274 259 -801 -1546 -397 1019 -145 -1088 -947 412 695
2308 695 -317 -1271 182 1428 197 -816 -659 1022 1203 -341 -358 961 1418 799 -472 241 1541
2325 1541 1230 188 -175 835 1839 778 -356 287 1553 1613 -255 -94 1405 1506 876 -154 243
2342 243 1656 926 -294 -184 755 1407 78 -927 176 1170 630 -491 -777 509 699 -812 -848 -321
2360 -321 596 126 -1401 -1065 289 204 -823 -1343 -291 573 -333 -1449 -1416 -252 185 -1515 -1717 -443
2378 -443 132 654 -1461 -1469 264 79 -869 -1522 -534 455 -388 -1288 -613 220 317 -775 -1127 66 688 -377
2398 -377 -811 -347 853 813 -681 -466 794 1190 415 -885 293 1591 1023 -9 -341 927 1398 165
2416 165 -254 696 1408 897 -76 148 1254 1475 265 -459 372 1850 854 -503 71 1048 1571 293
2434 293 -898 453 1409 313 -339 -271 928 652 -300 -422 -55 873 71 -1135 -429 563 509 -572 -1340
2453 -1340 151 347 -508 -1189 -914 -65 57 -1109 -1266 -234 -1 -267 -1584 -1190 378 12 -1345 -1146
2471 -1146 -826 161 -971 -1376 -257 359 42 -1021 -1021 -68 198 -485 -901 -538 730 67 -915 -598 354
2490 354 883 -336 -829 369 893 330 -111 -582 961 1296 -5 -443 364 1271 703 -269 119 1014 1050
2509 1050 168 -314 790 1700 595 -419 484 1291 1145 77 -229 633 975 536 -233 -95 1339 632
2527 632 -408 -118 360 1022 -12 -675 -90 912 385 -552 -893 445 707 -713 -736 -640 399 35 -1197
2546 -1197 -824 -104 2 -641 -1131 -505 347 -470 -1197 -983 -54 206 -844 -1332 -593 41 -214 -1091 -1181 445
2566 445 16 -867 -885 -485 286 -95 -1126 -399 322 60 -499 -993 288 905 112 -694 -286 655 722 -214
2586 -214 -243 498 857 244 -147 186 916 845 111 144 534 1309 459 -278 380 1187 774 -162 -234 965 1058
2607 1058 316 -53 299 1015 900 -446 -104 594 1067 145 -442 545 937 283 -605 -565 507 745 -347
2626 -347 -845 62 646 300 -1099 -614 298 229 -360 -823 -286 362 -408 -844 -643 437 186 -1027 -1017 -232
2646 -232 -17 -678 -975 -574 419 -121 -767 -877 -76 334 -430 -1187 -390 62 -90 -545 -825 263 339 -338
2666 -338 -724 -290 444 399 -288 -271 153 825 212 -658 219 825 375 -253 20 927 838 323 -203 407 1074
2687 1074 741 -26 354 1069 981 309 -350 492 1149 511 -201 278 862 821 -102 -246 519 725 406 -201
2707 -201 -33 757 479 -3 -102 75 608 126 -814 -87 624 461 -268 -730 122 457 -410 -967 -480 97
2727 97 32 -599 -788 -61 289 -347 -1186 -775 221 -247 -993 -957 -513 200 -688 -805 -110 27 -305 -563 -812
2748 -812 196 -26 -561 -968 -125 283 9 -941 -591 587 350 -312 -908 186 671 13 -587 30 658
2767 658 487 -136 -244 677 683 406 -317 -26 1028 675 281 -47 459 907 269 -336 432 811 615 64
2787 64 -51 776 882 97 -103 81 729 529 -42 -84 462 755 -65 -426 -74 652 401 -336 -649 501
2807 501 742 -350 -740 -52 205 -20 -556 -335 316 268 -511 -867 -191 223 -216 -733 -553 176 127 -776
2827 -776 -822 -366 182 -556 -827 -709 36 27 -838 -798 -409 144 -383 -740 -170 338 -123 -487 -767 65 349
2848 349 -87 -503 -280 347 321 -404 -260 368 531 -54 -655 127 770 720 -149 77 618 743 402 -346 358
2869 358 839 612 -184 -310 1079 801 300 160 210 579 144 -147 199 757 738 -57 -442 371 770 161
2889 161 -444 182 726 537 -525 -789 779 396 -135 -236 -54 501 100 -490 -800 -174 -153 -117 -537 -327
2909 -327 -157 -49 -319 -973 -121 5 -192 124 -452 -117 -546 -728 -964 -281 486 -718 -418 -326 476 -443
2929 -443 -863 -771 106 40 -248 -221 -127 106 106 -382 -39 -74 142 164 -448 145 408 306 -110 -45 616 419 -30
2952 -30 27 640 775 285 -198 278 737 513 138 -87 469 826 559 -166 301 913 491 119 14 370 620
2973 620 95 -286 102 807 320 -21 -124 269 411 103 -214 119 541 75 -317 -279 81 285 -248 -568
2993 -568 -426 -89 85 -525 -560 -78 87 -388 -570 -7 -25 -380 -555 -376 -148 -21 -267 -899 -359 140 -284
3014 -284 -735 -440 -89 263 -341 -473 -259 128 -26 -484 -389 23 219 -282 -252 42 450 46 -520 -152 520
3035 520 113 -170 -107 255 418 326 -178 287 728 590 167 29 138 621 400 -379 400 378 471 86 -168
3056 -168 486 244 9 11 342 417 323 -81 98 410 381 266 -246 256 789 187 -314 82 213 319 -164 -431
3078 -431 -264 261 -106 -268 -266 250 146 -286 -406 -262 342 -216 -534 -326 67 24 -359 -736 28 102 -315
3099 -315 -623 -296 52 159 -596 -413 -191 69 28 -676 -252 262 49 -372 -311 -69 59 85 -410 -200 153
3120 153 430 -154 -268 268 35 303 -497 139 349 332 135 -109 206 219 -81 -25 169 562 267 -131 -129 276
3142 276 633 17 88 365 625 592 132 226 390 451 82 79 258 461 229 -137 -165 521 587 -204 -229 132 528
3165 528 23 -306 -67 290 177 82 -368 41 366 -330 -599 -89 -3 -185 -551 -391 -177 126 -241 -460 -218
3186 -218 102 -146 -550 -566 -262 10 -63 -756 -38 22 -95 -130 -426 96 281 -205 -299 -28 187 0 -584 -265
3208 -265 257 316 69 -315 -25 188 124 -183 -33 238 281 106 -227 169 177 195 -66 -85 498 553 99 -265 239
3231 239 497 210 -107 315 796 312 -38 -172 427 300 398 -224 106 414 429 -140 -80 375 354 138 -421
3252 -421 60 345 -94 -98 -326 161 313 -122 -426 129 314 -38 -260 -223 -161 195 -295 -188 -204 88 30 -582
3274 -582 -610 -1 107 -303 -606 -223 299 -169 -487 -341 -57 30 -162 -558 -29 123 -202 -381 -82 283 273
3295 273 -120 -579 33 318 -123 -172 -273 -36 231 -273 -197 229 312 -51 -29 235 338 292 159 -45 58 349
3317 349 374 103 104 512 276 -92 69 396 308 163 -234 28 381 534 88 49 420 492 64 -33 -33 134 285
3340 285 -237 -173 74 309 -186 -127 5 -1 39 -275 -153 62 -9 -192 -241 -252 188 -135 -378 -217 121 56 -421
3363 -421 -371 74 45 63 -400 -18 -192 15 -261 -290 121 -71 61 -511 -355 -180 42 -239 -147 -50 355 -209
3385 -209 -298 60 -24 -41 -207 -85 192 -6 31 -137 -109 278 213 -198 -46 79 377 152 -155 136 351 191
3407 191 -144 315 393 259 -44 -60 143 248 349 -85 -135 264 238 153 28 353 522 217 -182 35 193 281
3429 281 158 -26 195 338 306 -102 71 194 226 -56 -150 -136 106 -61 -304 -59 -112 -178 -48 -207 -93 136
3451 136 -254 -548 -113 -314 -163 -282 -225 85 -129 -267 -336 -282 416 -224 -344 -435 -80 6 -347 -241 -295 48
3473 48 -230 -311 -214 84 -97 -316 -131 4 415 203 -150 -294 49 405 54 -243 188 249 111 -178 -117 350
3495 350 316 -136 -34 213 228 192 44 -17 362 487 -57 -41 301 495 -71 15 -23 165 143 87 164 134 344 -135
3519 -135 -12 136 140 78 -254 229 119 361 197 -517 58 236 -24 -244 -72 -27 236 -329 -360 -60 80 -129
3541 -129 -592 -487 133 88 -416 -83 -86 112 -85 -251 -213 -53 -82 -278 -504 105 -102 -117 -239 22 89 -197
3563 -197 -328 -369 -65 55 -254 -168 -56 -155 42 -97 -526 185 328 70 -312 -8 244 185 -178 -2 249
3584 249 115 56 69 59 359 16 139 48 93 316 -204 -101 212 384 226 -193 39 461 208 74 17 25 43
3607 43 208 11 99 180 408 62 143 171 301 -43 32 -262 189 255 -54 -86 -80 135 191 -234 -89 -192 181 -78
3631 -78 -398 -181 -156 -159 -538 -44 312 86 -271 39 151 42 115 -273 98 -43 54 -227 -344 -90 -59 -109 -399
3654 -399 -100 -49 43 -70 -128 141 229 -244 -169 -36 219 -33 -165 -4 98 228 -81 -86 36 133 244 48 18
3677 18 59 254 -17 80 220 80 8 -81 208 153 471 10 -107 22 357 30 -13 101 424 212 118 121 232
3700 232 -14 -126 -16 12 314 179 -46 17 -124 232 -167 -272 145 201 190 -16 -91 61 179 -540 -91 -101
3722 -101 -149 -93 -151 -513 -202 2 -18 -89 -300 88 -13 -419 29 55 103 -279 -186 87 -205 -16 -277 -140 -236
3745 -236 -192 -10 -229 -82 161 424 -329 -35 287 -93 143 -328 -44 281 21 -377 -98 112 113 -135 -1
3766 -1 207 107 -108 140 108 286 323 -276 -79 58 233 145 -43 166 90 415 81 146 199 112 149 135 129 396
3790 396 -156 11 47 207 246 91 -187 -154 249 182 42 26 87 -153 -197 -121 190 -95 355 -28 -130 -113 189
3813 189 26 -290 35 78 -161 -187 -200 144 -64 -326 -276 -105 74 -210 -331 -44 42 136 -392 -206 7 359
3835 359 -73 -195 -3 14 -105 -339 -35 -42 -101 -21 -125 -356 175 41 -317 -42 -14 97 80 55 100 117 230
3858 230 97 -142 92 131 192 12 -160 299 280 -136 -57 444 250 -15 108 65 42 66 81 5 179 320 106
3881 106 -233 -24 342 -33 -217 320 -159 214 -73 -201 183 63 -56 44 -153 -88 -194 -283 -294 54 254
3902 254 -17 -133 -197 74 -234 31 -431 12 165 -73 -273 -4 174 -337 106 -162 -200 35 -152 30 -180
3923 -180 -22 1 -198 -165 -104 90 -238 181 -116 -36 124 -73 -92 63 262 83 -143 304 146 91 -39 -156
3945 -156 217 14 -274 -90 72 157 368 63 -47 208 93 196 -107 208 297 44 111 -89 -21 43 -39 -51
3967 -51 135 132 -102 -13 158 236 75 265 270 -128 -40 147 -59 268 361 -199 -219 77 -223 225 -213 -347 397
3990 397 -93 327 -216 -263 2 347 -117 154 -349 298 -517 -325 -245 70 79 -21 -375 117 80 -24 -182 -128
4012 -128 -169 -367 -276 -180 -25 -190 224 -204 -132 -71 22 -187 -394 155 -100 3 -179 -216 168 338 -141 303
4034 303 4 -12 4 162 -418 111 518 77 -86 284 184 242 -181 -18 -23 58 200 -229 120 -95 6 10 -219
4057 -219 191 220 212 -211 318 -93 -259 21 -179 248 -332 -111 15 244 -165 -242 -197 144 -2 168 -300 -46
4079 -46 -134 215 -131 -195 -27 -152 -61 -100 -109 -39 -18 -227 -246 17 -30 169 140 -253 -81 52 -286 -134 -90 -188 257
4104 257 -11 -212 129 -406 -254 -67 -9 -79 63 -30 -279 28 -16 63 -146 -136 25 -155 -144 45 86 40 -32
4127 -32 42 89 -121 151 -32 231 -7 298 210 133 145 184 0 -73 142 339 125 -35 -195 95 57 -43 -193
4150 -193 91 10 -12 194 0 237 107 94 131 -10 -37 -247 60 173 -158 282 -112 -191 -77 155 87 56 146
4173 146 -179 91 105 -176 12 11 75 -432 -18 146 140 -184 -36 17 -39 -32 -80 127 -129 -270 33 -403 -151 58
4197 58 -158 -144 137 85 -88 36 -439 -69 298 210 -295 10 -267 -159 86 -75 104 -14 -42 -62 -156 19
4219 19 59 168 -11 -55 74 -106 -87 66 372 106 -68 125 9 49 26 -65 -55 167 116 160 260 -78 -41 -55
4243 -55 32 -82 79 148 -9 435 99 -86 -143 -83 -148 -26 -125 149 94 78 114 -46 314 -40 -57 -216 -83 -104
4267 -104 111 354 -116 -47 180 -152 24 115 -269 -59 255 -49 -134 302 -16 40 -143 51 -76 441 -197
4288 -197 -191 -90 -9 -133 -111 -106 146 122 -67 -119 -188 212 -84 -180 -110 -134 -8 -45 -212 186 37 -405 -5 145
4312 145 109 23 -179 -70 255 273 -59 -43 102 33 -63 86 111 -28 169 227 100 -76 -218 196 214 141 236 427
4336 427 392 -125 338 87 46 -235 51 -135 -78 -12 -12 172 96 -171 205 235 137 31 -18 -343 -153 215 63
4359 63 -8 -4 98 -143 -136 -223 268 -209 97 -121 274 76 163 30 -70 46 172 -159 15 -121 -147 137 -106
4382 -106 233 -206 -16 76 -127 129 -62 0 19 18 124 -81 -110 -356 -270 -157 269 -248 210 -72 57 210
4404 210 -74 46 291 -1 -128 -44 -31 -3 47 84 406 236 100 -70 -51 129 -151 100 194 -84 108 -30
4426 -30 -4 4 5 203 -101 172 -29 151 -180 108 -50 -39 244 -145 -13 13 82 20 -162 -94 99 183 72 -86
4450 -86 -40 33 -64 -307 49 160 -326 62 130 -50 37 166 34 220 -82 22 -200 134 -86 -36 -142 -240 -173
4473 -173 -136 265 -92 28 0 -113 -210 124 -79 -194 -77 184 -41 -128 97 29 -144 84 333 40 20 -119
4495 -119 -135 283 42 -139 85 67 -249 -106 -133 130 187 68 60 76 118 299 32 -7 118 -189 -94 -198 72
4518 72 144 -164 -4 -132 -47 -47 -139 14 88 53 224 133 2 -281 -65 71 -57 200 129 -128 257 -183 20
4541 20 30 -340 152 244 -66 6 262 117 -86 -294 -232 -99 -42 -63 -252 -8 -375 -163 -42 245 6 0 170
4564 170 -117 106 -35 32 121 105 -141 127 -240 -90 7 -239 441 -135 22 98 61 45 -193 126 102 161 183
4587 183 212 -192 247 160 -125 113 256 214 3 -54 196 25 99 -172 132 153 115 336 -44 73 68 -122 -132
4610 -132 83 -85 110 -159 -292 58 221 -139 -322 -54 180 66 80 34 5 266 83 -26 11 -18 -87 86
4632 86 -23 -83 211 -185 -191 73 -12 -31 -77 42 -85 -52 73 36 -277 40 -29 -193 -86 366 -41 -124 -192 17
4656 17 -4 -89 -12 173 17 -12 -14 -132 -58 116 35 -348 73 -123 -110 -122 -119 -86 10 -82 105 -361 -76 29 -14 -4
4682 -4 -144 53 31 -70 -302 -65 -41 -177 -36 76 230 125 152 340 -70 19 293 -77 36 221 -339 166
4704 166 173 45 65 -247 5 -75 -60 20 -377 340 208 351 1 -128 19 53 133 -14 -175 -24 183 -46 166
4727 166 -144 31 -148 68 261 -138 -153 100 -203 69 -76 -34 110 127 268 136 117 -37 248 103 11 77
4749 77 83 -174 50 -125 -72 -126 155 174 144 -48 0 -227 6 41 -143 -94 56 25 -44 65 74 -237 -77 357 217
4774 217 60 69 318 445 243 -6 335 -58 488 -16 -174 -291 478 333 154 265 6 297 120 -100 154
4795 154 228 -188 -211 121 693 346 107 -452 259 -122 -228 201 219 145 -115 52 -158 -265 361 -350 -759
4816 -759 394 -547 -193 318 -216 -86 -43 -14 318 -379 508 43 -446 196 273 379 585 104 -255 -637 -354
4837 -354 302 -282 296 -37 -16 -218 -514 -593 597 144 -458 486 -481 32 140 -179 -243 -229 -232 -308 977 969
4859 969 -427 197 340 378 -559 -51 344 748 -265 -101 -266 637 -273 23 -2 63 -94 -189 -32 123 -528
4880 -528 156 -465 343 369 -511 -358 -182 -42 -102 -475 -5 255 145 -127 53 -586 548 -831 -277 -19
4900 -19 -38 -222 978 -289 152 524 9 318 -304 286 -81 381 103 167 306 84 223 132 157 -952 183
4921 183 181 -141 -149 -184 -338 159 -106 144 435 -38 487 -357 17 192 28 -200 -4 -72 110 -42 315 -131
4943 -131 -449 -79 -276 285 -52 285 -215 -11 711 -224 147 -23 334 -14 -131 44 439 -39 80 -243
4963 -243 315 162 114 308 108 -223 8 -141 60 -144 222 563 50 -125 107 -32 -435 -371 364 -43 -23
4984 -23 -243 -125 -105 135 -126 -110 365 377 443 -65 -34 -306 450 -325 122 452 -89 152 279 -406 -22 -177
5006 -177 -44 526 121 -316 -42 -214 -200 -227 -29 36 2 -6 146 -285 -230 -148 172 -430 149 537 74 315 -758
5029 -758 -67 -138 412 -133 -750 -200 -230 -281 228 -41 293 -19 -305 229 317 -512 184 -9 -572 432 -257
5050 -257 -59 104 486 -884 90 304 -35 154 327 664 -63 -368 -692 182 240 642 195 -128 -576 -132
5070 -132 -107 727 -94 -305 416 463 441 -125 156 -389 -102 341 -191 -114 374 -102 -762 220 -351 458 129
5091 129 -348 -244 346 247 -24 -333 -104 -118 -791 -44 146 409 -193 -112 80 285 -36 -292 85 -563 -60
5112 -60 291 -324 -252 95 -30 252 331 -137 629 -24 -936 -259 563 224 446 72 -112 222 386 -418 -338
5133 -338 -171 125 411 -12 -64 -99 155 399 310 -78 110 125 -25 398 -207 9 19 -39 -133 121 385 -146
5155 -146 478 -44 -52 149 176 -54 147 -46 234 69 13 41 171 -174 -38 -100 7 27 -201 5 58 -203 -115
5178 -115 24 178 -154 -113 62 118 11 -190 -10 144 -112 -17 -242 -132 -163 -110 -49 -168 10 78 20 -123 52
5201 52 73 19 -43 173 -93 -327 -133 36 -51 28 -228 -232 -55 60 -62 -217 14 -123 -130 153 48 -39 27 156
5225 156 32 -45 168 53 -35 77 -138 221 81 -111 -61 91 205 4 -117 132 266 19 -120 -186 -171 -6
5247 -6 188 -254 -17 140 -73 -74 -60 -20 -173 155 25 10 -377 77 -45 -1 125 38 -190 16 158 248 -18
5270 -18 8 125 -19 35 175 -126 5 49 -43 119 117 176 -53 -42 154 17 -121 -195 -137 76 -158 -156 -41 -231
5294 -231 119 98 108 -140 -30 -51 29 17 -468 62 -94 208 19 -145 -39 174 -222 -78 10 -346 69 43
5316 43 290 163 -112 -55 -80 -83 -64 210 27 -20 53 137 85 128 55 37 -55 182 -161 131 32 -58 -44 -70 -273 -25
5342 -25 57 193 -92 138 -224 -29 166 49 -184 -231 137 -264 293 -177 96 144 -154 -132 140 -245 -108 -170
5364 -170 3 123 -145 -14 1 -82 122 -71 256 17 -129 23 -6 -145 -147 -5 43 -253 -59 -63 -62 -103 27 -147
5388 -147 -83 -183 -127 64 46 299 8 -127 -253 -110 283 19 52 94 113 -367 -104 -92 -158 -107 -23 -34 -61 247
5412 247 150 -63 60 -123 109 14 33 37 -15 -91 118 -25 188 -23 -65 36 -71 210 -168 -191 98 -188 -52
5435 -52 18 41 78 -224 152 43 91 -2 -67 -130 -122 190 57 80 17 18 -42 72 100 43 -204 -80 55 129 113 380
5461 380 -106 -224 -89 -86 239 120 -212 -30 -50 -4 -38 -74 -65 88 49 -313 -53 -32 -58 -13 -10 102 21 45 -82
5486 -82 -76 158 -163 87 193 16 56 54 137 278 188 110 -177 52 15 -21 58 262 148 268 86 -217 -122 281
5510 281 395 233 -72 -52 -109 3 219 204 55 59 -27 21 265 -93 102 13 200 81 -33 27 84 149 132 -370
5534 -370 61 -35 -41 -156 -225 105 105 -58 -338 -12 85 -171 -133 -120 -89 163 198 75 -17 146 13 -102 -146 -159 154
5559 154 -1 11 -48 36 47 -48 -87 64 -278 -52 -27 -114 -73 -147 -83 34 -133 -203 209 -64 -86 -5 116 73 -60
5584 -60 103 -50 -20 36 25 -51 68 -5 319 -23 593 132 138 -35 -35 120 151 348 153 -67 72 -39 -48 188
5608 188 -149 99 74 -47 -124 133 -78 93 220 138 -64 124 -191 -42 14 -87 -64 -77 96 118 -80 -17 164
5631 164 124 -71 48 -158 -175 34 137 -61 -3 -90 170 199 -186 -72 -156 -180 121 75 186 130 46 99 170 6
5655 6 -217 -56 -51 -271 -18 -148 -43 66 91 18 31 271 -5 64 -62 121 121 -157 13 -328 241 -181 111
5678 111 -237 246 -125 63 150 399 87 -61 128 -151 181 192 87 -212 133 -30 431 34 226 511 168
5699 168 101 -61 228 66 -611 338 -432 -431 -227 -628 157 -255 232 -252 -316 -530 214 -79 -226 79 -420
5720 -420 346 111 -69 -272 -247 215 -256 27 246 -362 36 275 -85 -696 -743 -280 -200 290 208 234 -250 -432
5742 -432 -232 -420 695 -950 266 -162 489 289 -139 452 -42 -368 -1136 -44 -374 -236 -83 -85 748
5761 748 -138 0 -590 -120 449 -65 -99 520 -7 -694 233 -405 828 394 -314 -166 44 -17 -631 -131
5781 -131 399 172 162 -354 175 -22 -143 -513 -475 117 -382 -88 -137 447 -836 -525 267 -114 430 -392 136
5802 136 -217 -295 127 -544 -16 -223 -49 -154 33 -345 -534 96 230 -190 96 -846 -298 -375 224 308 -77
5823 -77 -566 267 -105 -372 -361 -178 -1105 -323 764 -755 -307 -127 129 -308 -73 69 516 457 409 237 152
5844 152 -114 107 263 63 -158 94 162 -131 -10 56 113 98 434 89 -41 60 139 125 -134 -109 -114 239 -33
5867 -33 99 -94 148 -56 71 261 -133 37 163 -180 118 -319 -19 28 242 15 5 138 -325 -79 -129
5888 -129 299 -118 132 140 21 -10 -29 192 6 320 136 -42 -20 286 110 31 -68 75 -115 -124 43 49 -64 -99
5912 -99 93 -199 -11 42 162 159 -195 -278 -23 -127 -161 -21 110 22 104 118 -6 254 83 -298 -139 94 236
5935 236 49 -56 269 123 -164 -265 -85 -36 30 5 -29 108 111 203 76 128 40 206 136 -15 -42 -52 -64 -112 98
5960 98 216 184 -55 -92 170 120 -150 -159 -145 104 -7 -43 -399 50 27 70 -114 102 106 -56 243 -156 -187 102
5984 102 -45 94 130 -242 -290 284 -158 -57 -234 37 -148 -162 -153 -156 -128 -254 261 -179 0 -85 -38 32 -46 188
6008 188 -143 14 -143 -231 -151 138 135 -194 -119 228 396 -39 92 -121 1 -91 11 -95 -6 45 470 174 -112
6031 -112 96 -46 158 -137 -29 -45 244 28 232 138 -3 -163 -60 108 85 298 221 117 -57 31 -195 345
6053 345 106 239 -43 119 -94 28 132 7 139 121 0 348 109 168 101 104 -196 -84 48 12 -57 -40 -112
6076 -112 48 -129 75 83 -211 185 -166 -28 -93 102 222 -38 -3 62 -85 -15 -52 113 -119 227 62 116 198
6099 198 -188 -93 -223 -79 115 -380 -172 -94 -117 33 -194 -194 127 -98 244 -130 -104 143 -80 -37 -209 -144 262
6122 262 34 196 267 101 -219 -111 -91 154 125 233 160 -31 171 6 -100 -105 242 62 189 95 193 -31 32
6145 32 181 -129 130 183 -5 -115 -61 188 -38 -101 150 115 46 242 -29 10 3 14 19 49 16 19 -3 59 -24 153
6171 153 240 -244 -37 -214 75 -92 -32 -63 -124 -46 -63 -69 -155 -245 58 59 -130 -306 -198 189 -130 -32 12 89 -71
6196 -71 -126 -314 184 -106 -142 -27 11 65 -6 -197 -205 85 -146 -16 110 -2 82 151 -356 19 133 -153 -114 -61
6220 -61 67 39 100 166 -185 10 179 112 168 52 -46 -162 -154 -1 -182 136 64 65 -270 221 181 150 -5 -9 246
6245 246 43 156 52 -46 34 50 -37 79 -50 123 -84 -52 -138 -103 -177 107 -81 -151 102 40 -166 35 31 -30
6269 -30 175 -151 82 -31 117 -274 -220 -132 -291 -184 -142 180 58 -47 -278 -190 -6 -10 85 -3 -106 102 178
6292 178 -88 -128 117 139 1 -27 226 163 -201 156 217 183 -243 -100 154 -130 97 0 -40 -162 18 -82 -66
6315 -66 24 36 -147 27 -6 41 246 -68 110 -99 327 77 15 -284 104 180 -111 39 -70 273 157 94 -177
6338 -177 -179 -26 78 255 313 -304 286 -225 263 256 105 109 -202 170 158 128 67 -23 -278 10 91 127 -133 232
6362 232 -56 175 -126 -7 -202 54 89 -166 -142 231 4 -289 -49 -370 -3 -122 72 185 -90 152 86
6383 86 157 -115 -73 72 -80 -15 -29 -158 47 -246 -111 -226 -83 152 158 127 50 -137 220 -2 303 161 -133
6406 -133 -189 24 84 56 -80 -212 117 -130 67 7 85 23 -20 -9 130 -49 12 -35 209 50 82 140 -4 112
6430 112 -194 183 -58 -94 269 -234 111 48 134 56 -141 187 -93 -62 226 3 97 -95 79 18 -164 -56
6452 -56 -6 152 131 -316 -115 -190 -54 134 -77 -134 -157 -87 -51 -33 -27 -44 165 -37 -239 -205 -133 117 142 -159 -101
6477 -101 51 114 -91 -142 -13 272 77 127 202 -36 75 -74 -52 62 -7 72 -11 -175 173 64 -121 -112 170
6500 170 -75 136 -134 61 345 58 312 -143 -7 130 63 138 -103 27 -77 -138 246 -50 142 -23 -68
6521 -68 51 -35 -98 54 65 -170 38 -252 -97 -165 -85 -141 162 35 -18 75 -24 78 126 125 -137 158 -159 14
6545 14 -35 21 -66 -44 148 123 91 74 126 157 183 -13 -64 139 153 -59 -15 29 133 -40 -75 -70 -39 118 37 73 -8
6572 -8 -36 7 -111 -75 117 131 -176 74 -26 -1 -63 133 138 81 104 -3 76 114 -65 16 61 -52 105 147 -82 -35
6598 -35 40 169 8 -219 41 87 69 -50 -48 -18 -121 89 -83 145 19 141 56 -153 -170 -35 -10 -3 -45 -168
6622 -168 -5 167 32 -107 -108 72 -85 99 38 203 -94 -263 -230 -261 -72 -82 19 108 -62 51 100 195 -118
6645 -118 4 147 -191 -257 -25 201 -142 249 90 -114 -140 -88 -155 -31 -268 5 -103 15 -50 -120 91 -20
6667 -20 -42 -52 130 261 108 -9 96 -134 105 141 18 -125 112 232 -191 116 122 25 -124 -128 -136 20 58 195
6691 195 64 -97 59 -63 -29 105 -51 -208 -137 -1 -38 100 -67 -79 43 75 219 23 5 -197 -14 -18 -66
6714 -66 -153 264 46 -18 38 -22 139 -140 19 -24 -100 15 -221 43 28 80 -59 118 173 -139 -132 50 219 239
6738 239 -104 -62 29 96 -144 -85 -39 34 82 12 -170 239 -87 256 222 -110 -56 76 55 -91 19 54 77 46 -49
6763 -49 -147 115 56 -3 52 131 208 168 -72 45 -16 -67 134 10 -11 192 62 12 125 277 105 -270 -328 -62
6787 -62 65 -21 52 55 240 -191 -80 138 -56 113 145 189 -15 179 -67 36 543 -76 -168 -68 -297 106 -43
6810 -43 -6 -83 -27 -19 184 99 12 33 250 -138 259 -66 56 294 -217 -68 44 -197 64 222 17 225 -67
6833 -67 74 134 27 -272 -151 -152 39 75 137 -109 241 205 4 -41 -25 -39 101 79 172 -156 -93 6 304 -138 -14
6858 -14 320 -83 -8 -145 -15 194 -8 -65 -68 114 63 57 129 139 157 46 131 32 121 12 120 224 91 340 -94
6883 -94 -71 183 -82 22 -128 -55 102 76 -190 316 18 -84 62 -147 13 11 -83 115 62 -43 -94 63 26
6906 26 30 192 -44 -214 -61 16 -54 79 -98 108 -136 91 54 -29 144 -82 42 -128 -22 -39 -62 -12 -176
6929 -176 208 80 -121 284 3 16 -124 136 190 -142 -63 -171 106 -59 49 -318 -110 170 101 -10 -137
6950 -137 182 60 145 -114 -342 167 206 -244 -238 63 82 -195 -77 -59 -21 9 173 -227 -268 147 147 -103 75 -4
6974 -4 73 -30 -345 90 -33 -139 -100 206 35 -134 -11 -38 20 -94 -82 -56 74 -199 -64 -15 -1 -150 246
6997 246 99 99 2 -7 -84 -108 -56 135 -94 157 -234 -96 153 60 204 -73 -58 71 175 -167 -74 142 33 -8
7021 -8 -88 -248 46 -231 -147 -142 -417 -114 -41 -7 -146 -169 -295 -43 -15 158 43 8 -250 45 -54 10 48 56 -40 57
7047 57 183 74 -42 -129 -87 7 -17 -72 -166 183 -327 138 14 136 -3 73 280 -191 -33 64 -62 187 -169
7070 -169 -46 -95 -88 52 222 -103 -15 18 16 188 131 -81 130 245 26 -134 36 -87 -113 67 120 176 -79 -133
7094 -133 50 -4 22 22 27 138 102 136 185 -14 14 65 236 -203 87 -242 67 142 -7 -122 -85 161 108 -28 -144
7119 -144 162 -21 80 110 69 -124 351 39 -62 -223 90 17 102 -320 40 221 230 126 97 143 152 29 -15 41
7143 41 -57 -70 59 -25 143 -21 319 67 -9 46 52 -117 69 63 204 8 78 66 80 126 -88 -226 58 -17 -71
7168 -71 -38 -25 81 80 -108 22 149 303 39 29 -99 74 -47 -40 17 100 6 26 -95 167 54 -217 -11 -18 43
7193 43 86 -103 -4 192 96 -13 -318 -157 84 -96 -260 -5 287 213 71 -88 76 21 -10 -67 72 3 -38
7216 -38 115 -121 -72 28 83 -143 24 -7 -195 -5 160 207 -23 -41 319 19 -146 48 181 -23 51 -131
7238 -131 -109 -38 162 178 116 74 144 59 -28 -46 15 152 -178 -53 -171 138 24 85 96 82 63 -184 -155 -228 -25
7263 -25 122 -90 42 -166 -46 22 204 -157 168 -15 -91 43 -193 109 -182 -138 127 40 41 -78 -192 175
7285 175 -143 17 107 -237 -282 151 54 -32 -407 1 -86 -120 38 -9 -59 -136 -12 -87 38 38 -26 50 -85 244 127
7310 127 28 43 249 179 64 90 -8 -66 156 183 -5 67 24 75 305 -87 -19 -81 -205 128 11 161 -79 -29
7334 -29 -71 14 -58 24 -120 -201 -2 -192 200 9 9 -76 -115 155 -53 109 -78 -40 6 -128 -10 -23 20 45 -15
7359 -15 106 -31 2 -147 -118 -23 204 -7 160 -75 -102 -156 -116 116 -21 179 -224 -27 123 14 99 47 -2
7382 -2 78 -102 55 37 -74 -118 74 -28 -165 -199 173 82 216 -124 -161 -39 -13 0 31 123 133 -41 -4 77 301
7407 301 -2 18 86 1 319 -243 102 -162 -55 57 -148 -128 -90 76 -74 -221 86 129 108 293 300 -15 64
7430 64 -137 33 76 54 4 104 394 -18 114 -98 18 214 113 121 -299 -308 -124 43 162 57 -149 -130 -139 -63
7454 -63 -41 70 -107 -24 64 -128 -19 -255 143 8 -69 -155 -104 74 -76 139 86 -180 -194 72 -33 217 -72
7477 -72 127 -113 -50 83 64 -91 248 56 99 -32 -258 -114 -34 53 -109 -45 66 -83 -64 -27 100 40 -32 66
7501 66 257 -77 19 229 -6 -305 9 -70 -107 123 9 8 -81 -293 -164 48 -277 -178 106 224 36 150 49
7524 49 147 35 -59 -85 182 -13 127 104 -113 -91 -331 14 -177 -258 -137 -8 67 73 -56 -62 -56 -138 23 -48 28 55
7550 55 -78 122 -43 -205 168 -192 210 -75 9 56 66 84 102 42 147 -186 109 23 79 -63 -140 174 142 -108
7574 -108 -22 -159 -142 146 31 49 4 -94 -130 -48 93 95 41 130 150 228 170 151 330 -35 95 149 144 67 163 -207 -104
7601 -104 57 93 142 124 -123 -16 22 -221 -70 -102 131 33 121 127 -283 269 61 79 22 -86 47 174 -78 -71
7625 -71 -278 -85 11 172 47 -77 258 75 -49 -217 186 14 107 -34 159 57 185 -33 -239 -148 209
7646 209 -100 110 -59 198 -47 -168 102 -172 -75 -12 -317 83 126 -19 -198 76 -67 -86 -137 -38 252 71
7668 71 8 218 -14 -139 209 153 0 370 151 4 -220 99 44 -100 228 -80 56 -218 70 -25 128 6
7690 6 -44 32 -57 -20 -72 -9 257 37 184 64 -182 -240 176 46 -55 -16 -7 -42 -161 -17 101 65 92 260 -23
7715 -23 211 24 -121 76 158 -108 15 -82 101 -110 -112 53 150 236 99 223 -102 58 103 174 149 -81 58
7738 58 0 49 97 45 -121 -51 -4 86 60 63 135 -200 66 -149 -183 -96 -186 61 173 127 -104 -13 -186 -162 31 -170
7764 -170 109 -118 149 75 134 -91 208 -241 -168 -190 -207 141 -175 -60 164 -190 -172 -137 -122 89 -158 110 197
7787 197 153 -271 -141 173 145 -4 -29 301 -87 93 -167 230 69 196 -145 56 -19 49 100 74 -126 48
7809 48 75 -113 -31 -203 -9 -159 -7 79 165 191 -151 137 -16 -10 -129 -38 -30 49 423 191 214 -96 14 12 -99
7834 -99 -107 133 53 -49 -128 -207 -35 205 -209 -22 -28 -21 174 -95 -130 64 -149 -18 -84 -240 -90 -199 101 153
7858 153 38 -103 147 -87 93 -229 147 -14 54 -38 -228 -77 -50 -99 112 -77 51 -5 -219 -113 -193 82
7880 82 52 127 -12 40 -63 89 57 -17 26 113 110 214 -172 32 4 -141 35 -43 -71 298 -205 -16 -4 478 -69
7905 -69 -146 -73 44 -69 136 -117 -10 295 -86 -185 364 244 -123 -121 -130 64 -187 62 -200 202 -117 -92 297
7928 297 241 -253 101 -3 -302 -157 29 126 -302 -225 -169 -41 -511 -370 -43 16 130 -120 197 -10 66 -256
7950 -256 162 49 358 -31 -458 -91 -75 169 -548 62 -157 83 241 -223 -431 -36 296 243 -187 -9 -498
7971 -498 88 83 -303 240 -331 -120 75 -185 -459 110 -379 -34 -209 -80 156 -159 -257 186 -476 14 501
7992 501 -579 -43 -150 152 84 225 -304 -27 506 -77 242 -188 -354 482 332 172 -158 151 89 37 -147
8013 -147 -371 415 -24 -127 400 487 142 8 -464 93 -196 44 372 -78 87 -315 -217 63 61 -43 50 -251
8035 -251 -223 6 269 231 -124 206 247 -40 375 -20 62 80 -46 383 -261 -107 -4 82 -177 -149 -19 -46 196
8058 196 -254 52 130 299 168 354 -275 37 -246 106 207 -70 -168 -157 57 -43 90 27 302 32 -213
8079 -213 213 178 -131 194 78 -204 139 29 229 173 -5 -15 -196 21 31 376 62 195 -150 83 -51
8100 -51 -268 99 -47 -35 214 -224 -207 20 135 29 4 -172 58 -274 -42 30 34 107 198 84 -158 31 216
8123 216 86 -475 -72 272 178 349 -18 -169 -5 59 191 71 16 140 321 -187 175 55 -173 -32 -35 156
8145 156 -348 22 -48 -152 172 -34 113 70 96 -6 -105 -273 -22 -153 -110 -240 -55 -133 -178 -67 -30 -105 -147
8168 -147 22 47 311 -90 3 67 10 -1 -5 192 -150 134 -131 -84 92 -9 -379 -86 160 136 -107 341 52
8191E2
$$ Imaginary data points
##PAGE= N=2
##DATA TABLE= (X++(I..I)), XYDATA
0 0 0 0 0 0 0 0 0 0 0 0 -6 8 -8 8 -16 16 -16 24 -32 37 -40 54 -64 72 -87 102 -118 136 -157 181 -206 236 -269
33 -269 302 -341 385 -434 486 -541 605 -677 750 -834 923 -1021 1128 -1247 1375 -1514 1669
50 1669 -1838 2024 -2231 2462 -2721 3008 -3336 3713 -4150 4661 -5272 6019 -6947 8150 -9768
65 -9768 12073 -15647 21965 -36420 141501 -141682 -321768 260137 258454 -180419 -228467 68227
77 68227 55064 -44119 -81821 -124479 -44075 138779 23626 -162767 -40346 184806 106869
88 106869 -97387 -62088 125581 103133 -40423 -74044 -23664 13093 21690 -76649 -181116
99 -181116 -55503 100642 -81745 -234149 -10603 111213 -68497 -107358 23616 45717
109 45717 13526 25590 -10821 -23374 73168 64483 -82204 -64604 72950 22323 -129104 -74376
121 -74376 65595 -28904 -149634 3913 81689 -92779 -79307 117913 58651 -96256 28483
132 28483 155381 13794 -52458 78962 89572 -10798 -11536 34266 21461 -15198 -13211 -2870
144 -2870 -15763 -3346 6594 -22858 -3028 47398 19065 -15823 48173 82878 6390 6989 89501
157 89501 45331 -16311 44213 47861 -23542 -4941 35509 -17654 -54152 4409 21216 -44307
169 -44307 -44841 18126 19496 -20406 -14440 21469 20298 12577 25072 -7512 -16098 58525 33537
182 33537 -82204 -40590 74092 2993 -121504 -50169 53108 -19548 -96610 -43447 12361
193 12361 -691 -34422 -35562 -4108 16258 14216 -9983 -27213 11550 38065 -9133 -41647
205 -41647 -7262 14649 -14998 -31844 -26310 -31221 -5951 10594 -46289 -51148 30867 35872 -35267
218 -35267 -30382 41449 49554 -5221 -9222 31451 37174 15519 1644 5516 12417 14443 10096 -13568
232 -13568 -15269 21678 13288 -20695 449 21907 6661 11342 29030 12702 3450 42753 48027
245 48027 -4366 -1172 47898 39471 -8302 -17094 21369 30887 -11685 -25833 -1185 11348 4286
258 4286 -14718 -21158 5084 26204 2852 -25834 3241 37682 6445 -18104 2880 10735 4672
271 4672 -2439 -18306 -20612 -3272 3041 -26779 -46374 -11393 12051 -22963 -47848 -16614 18351
284 18351 -3750 -36279 -14581 12987 8663 -8418 -24774 -9186 21804 2061 -37332 -25051
296 -25051 15988 5715 -38243 -31040 4297 4118 -16139 -24199 -8656 11907 7784 -5649 -9412
309 -9412 6639 30278 14481 -16354 1251 34025 21436 -13210 -9533 20513 19540 -936 -12180
322 -12180 -5124 22623 22517 -13619 -13433 25190 35750 3657 -13990 19688 43233 17503 -5917
335 -5917 6339 30875 26802 -319 -6707 7960 21770 13618 -18130 -15494 21585 18809 -15273
348 -15273 -19175 9514 22629 872 -15668 -3158 16884 18621 -7923 -20928 6529 20995
360 20995 -3269 -28323 -15727 15400 3013 -33504 -26908 1817 4259 -19001 -30830 -11405
372 -11405 6615 -1412 -21598 -24363 4803 15053 -15308 -26470 -3621 12217 -2050 -25674
384 -25674 -18337 4686 3526 -15590 -25870 -10035 10459 -1204 -22923 -17248 10210 17884 -11229
397 -11229 -20329 9592 23480 5248 -12406 -3674 21585 19854 -6413 -12925 8847 26058 5774
410 5774 -17959 -1187 23812 17322 -7108 -10420 17837 28440 5447 -6384 7278 26803 23680
423 23680 -1492 -5166 18590 29220 7691 -13565 3067 25712 12921 -10454 -10677 10997 21871
436 21871 -1377 -18097 284 19903 11249 -12984 -12512 14456 18176 -5745 -17543 -704 17073
449 17073 1565 -20131 -12353 3541 5150 -11433 -24586 -8747 6628 -5083 -22064 -18256 1940
462 1940 4197 -14717 -19192 -5822 5317 -1861 -18305 -13775 1811 1879 -9638 -18970 -9887 5657
476 5657 -2693 -18369 -15012 1104 6191 -10136 -16425 -1027 8507 2001 -10203 -6886 11375 10566
490 10566 -3557 -5568 4856 13525 5756 -5929 -236 10680 11628 1113 -6676 6432 17188
503 17188 7090 -4523 835 18650 17258 -2933 -1122 17837 19520 4426 -3358 10085 20574
516 20574 8424 -2938 1636 13049 14053 -1146 -6752 6358 14522 5567 -9997 -3774 15927
529 15927 10661 -9538 -9067 9071 15020 -3983 -15736 992 12775 1179 -15635 -11638 6957
542 6957 5483 -12661 -17579 -5678 7011 -2000 -21279 -15354 4888 5783 -14524 -23450 -1469 12210
556 12210 -7715 -23373 -10490 9233 2224 -20585 -16269 2246 3646 -8598 -16924 -8934 4416
569 4416 1339 -10235 -13959 -2186 10896 715 -14170 -7344 10603 12397 -6944 -13376 8164
582 8164 16574 1288 -9844 -1883 14316 11453 -3794 -5520 5413 15895 9665 -6263 -2528
595 -2528 15244 18700 2666 -9010 7835 24530 9613 -6978 -34 17443 17905 -1110 -6639
608 -6639 7151 16761 10129 -6721 -6699 12851 16981 -883 -13659 975 20782 7822 -15929
621 -15929 -8015 14681 14266 -9850 -17352 5277 15299 -3010 -17597 -7788 9731 4438 -15109
634 -15109 -14869 -365 6065 -4090 -18643 -10817 5430 3083 -13514 -19211 -906 10098 -8199
647 -8199 -21457 -6902 7780 -104 -18117 -13107 4175 2566 -9406 -13962 -5135 5946 -585
660 -585 -12520 -8951 3901 7020 -6167 -12078 2418 9977 -108 -8402 -2383 9758 6320 -4453
674 -4453 -3048 5006 9427 3731 -4406 1644 10494 8491 715 -1342 7415 12853 5214 -880 2864
689 2864 11915 12979 -37 -2495 10628 14472 3557 -4645 4315 15289 5863 -4402 575 8956
703 8956 9453 -154 -3983 3111 8483 5675 -3725 -5738 6844 9340 -3500 -9140 -473 8868 929
718 929 -11314 -6656 3847 4296 -6305 -13629 -3161 7175 -2469 -14556 -10966 4710 4663 -13192
732 -13192 -15579 -477 5844 -5338 -16462 -8810 5559 807 -12702 -14307 -891 7128 -6480
745 -6480 -16568 -5162 6422 1270 -12200 -10381 3655 6019 -3965 -9991 -3967 8956 6045 -8596
759 -8596 -7953 6640 11906 -1831 -11094 2886 13837 4646 -6677 -2874 10920 12420 -1161 -5175
773 -5175 5381 14214 7739 -5468 -428 14163 11904 -659 -3493 7883 14729 4186 -3573 1601
787 1601 10222 10715 -336 -5070 6142 12434 4356 -6294 -1636 11554 7803 -5389 -5183 4317
801 4317 9446 624 -9080 -2461 7434 4722 -6853 -10056 3009 7335 -5118 -11715 -3432 5443
815 5443 11 -11355 -8653 885 2075 -5069 -12343 -5859 3913 -1154 -11433 -10530 204 3586 -8076
830 -8076 -12873 -3074 2921 -1701 -10646 -9038 2445 2927 -6129 -10344 -2757 6794 -2 -10550 -4622
845 -4622 5559 4969 -5188 -7679 3184 7816 222 -5068 -1847 7239 7439 -2616 -4200 4694 10269
860 10269 3863 -4681 1058 10790 7622 -385 -2047 6316 12037 3968 -2798 2332 10378 9648 -1619
875 -1619 -2923 8446 10697 2401 -3550 2272 10712 5796 -3157 -1568 5679 8311 473 -5915 1255
890 1255 7985 3201 -4941 -5004 5017 5638 -4050 -6971 -1010 4694 801 -8504 -6672 1909 2564 -4948
906 -4948 -10678 -2995 4287 -2680 -10618 -7446 1171 1775 -8473 -10998 -1568 2460 -3142 -10648 -7345
921 -7345 2826 720 -7950 -9279 -1302 4445 -3266 -10013 -3679 3641 1696 -5827 -7614 1722 5541
936 5541 -1459 -6512 -2258 6407 4747 -4981 -3871 4292 7141 904 -5282 1144 9013 5067 -1837
951 -1837 -2011 6248 9888 1247 -3335 3435 9978 6899 -2124 -836 8736 8721 1621 -2339 3313 10451
967 10451 5205 -2722 -244 6878 8705 169 -4516 3701 8537 3261 -4053 -2795 6315 6042 -3035
982 -3035 -5236 940 6001 1175 -7604 -3811 4438 2717 -4805 -7756 -133 4632 -2868 -8334 -4853
997 -4853 1837 1551 -7387 -8716 -730 1861 -3498 -9476 -5306 2556 -511 -8013 -7709 -1186 2406 -4259
1013 -4259 -9272 -3277 2285 -103 -6684 -6671 1756 3049 -3857 -6457 -1451 4543 1295 -6128 -2903
1028 -2903 3448 4173 -1421 -4954 1782 6437 1880 -2595 -1003 5632 6547 -609 -2063 4168 7368
1043 7368 3880 -2049 708 7770 6266 537 -1139 4785 8901 3137 -1887 2142 7101 6376 -458
1058 -458 -2351 5191 7732 1829 -2713 673 7317 4552 -3118 -1850 4045 5508 -253 -5104 347
1073 347 5048 1569 -4328 -4572 2321 3910 -3525 -6652 -1718 3440 451 -7816 -5929 2043 1601 -4902
1089 -4902 -8309 -2463 3264 -2568 -8757 -5808 754 1437 -6294 -8764 -1458 2371 -2356 -8091 -5901
1104 -5901 2662 1772 -5904 -6895 -323 4163 -1568 -7829 -2746 4033 2249 -4438 -5565 2643 5306
1119 5306 -903 -4639 -652 5588 4394 -3213 -2829 4272 6325 1386 -3889 1088 8011 5059 -1712
1134 -1712 -1017 5410 8181 1144 -2314 3357 7421 5187 -1152 -852 6278 6947 1234 -1728 1700 7716
1150 7716 4221 -2418 -672 4916 5978 168 -3974 1615 5963 1834 -3663 -2542 3873 3926 -2624
1165 -2624 -4434 116 3450 197 -5564 -3555 2304 1590 -3905 -6842 -1562 2993 -2030 -7236 -4669
1180 -4669 965 634 -5854 -6734 -493 1393 -2813 -6814 -4655 1442 50 -5935 -5998 -906 2433 -2440
1196 -2440 -7139 -2713 2584 318 -4765 -4978 1809 3362 -2345 -4808 -1066 4188 1983 -4196 -2488
1211 -2488 3774 4201 -390 -3426 1602 6255 2082 -2103 -447 4871 6224 -59 -2087 3449 6273
1226 6273 3569 -1489 412 6656 5363 -71 -800 3370 6847 2644 -1904 1415 5604 5255 -490
1241 -490 -2286 3535 5949 670 -2669 -290 5031 3665 -2960 -2389 2374 4092 -267 -4680 -1165
1256 -1165 3740 1100 -3754 -4357 768 2983 -3045 -5684 -2099 1804 -112 -5721 -5429 526 667 -3459
1272 -3459 -6422 -2968 2113 -1178 -6138 -4816 214 1191 -4070 -6642 -1251 1695 -1097 -5548 -4343
1287 -4343 1643 1778 -3701 -4755 -483 3105 -7 -4832 -1763 2937 2135 -1954 -3627 1473 4764
1302 4764 486 -2848 -424 4281 4240 -1679 -1866 3749 5329 1612 -1925 860 6276 4115 -593 -559
1318 -559 3748 6367 1781 -1834 1823 5673 4269 -801 -1226 4593 5385 464 -1471 1188 5483 3230
1334 3230 -2395 -1033 3384 4044 -393 -3592 638 4266 643 -3199 -2490 2015 3100 -2814 -4138
1349 -4138 -380 2250 -134 -5205 -3750 1734 860 -3741 -5345 -1456 1983 -2118 -5926 -3198 552
1364 552 257 -4329 -5891 -881 984 -1966 -5337 -3474 1301 276 -4635 -4289 -220 2345 -1525 -5356
1380 -5356 -1846 2193 650 -3167 -3813 1129 3326 -1260 -3473 -112 3670 2396 -2773 -1634 3493
1395 3493 3797 170 -2351 1302 5427 2344 -1381 -142 3824 5358 315 -1615 2992 5244 2974
1410 2974 -700 286 5129 4451 240 -937 2343 5515 2704 -1898 116 4393 3897 -507 -2430 2543
1426 2543 4652 806 -2240 -620 3339 2825 -2334 -2566 1307 2917 -84 -4279 -1845 2686 633
1441 633 -3426 -3997 255 2191 -2288 -4881 -2117 872 -55 -4511 -4552 545 756 -2821 -4975 -2642
1457 -2642 1633 -726 -4823 -3885 51 1055 -2600 -5026 -1743 1876 -385 -4094 -3427 1401 1907 -2505
1473 -2505 -3665 -79 2694 666 -3275 -1325 2839 2376 -900 -2700 1589 4522 1107 -1910 -127
1488 -127 3663 3926 -436 -1464 3058 4473 1801 -1205 577 4880 3605 -341 -370 2959 4819 1533
1504 1533 -1611 1427 4594 3182 -428 -1176 3296 4111 397 -1578 273 3854 2289 -2156 -1183 2369
1520 2369 2858 -254 -3018 105 2924 379 -2857 -2273 773 2007 -2093 -3980 -698 1470 -75
1535 -75 -3979 -3141 908 464 -3229 -4014 -1527 1109 -1552 -4514 -2954 302 372 -3244 -4833 -867 853
1552 853 -1831 -3980 -2689 1303 536 -3379 -3383 -98 1529 -850 -3664 -1064 2340 1002 -2105 -2486
1568 -2486 1249 2962 -438 -1952 250 2926 2132 -1375 -1023 2626 3272 688 -1201 1058 4258 2412
1584 2412 -914 48 3267 4057 492 -1425 2201 4483 2308 -500 200 3657 3852 52 -552 1889
1600 1889 3863 1996 -1706 6 2990 2431 -566 -1678 1417 3325 54 -2213 -1087 2111 1759
1615 1759 -2170 -2702 514 2102 -574 -3421 -1833 1646 670 -2703 -3302 -507 1485 -1926 -4005 -1675
1631 -1675 681 -250 -3335 -3917 -364 700 -2256 -3756 -1968 1045 -383 -3885 -3051 147 805 -1458
1647 -1458 -3753 -1029 1717 -299 -2415 -2145 985 1879 -1404 -2525 173 2224 1045 -2054 -1314 2264
1663 2264 2453 -360 -1674 1130 3759 1300 -1349 362 2793 3401 -70 -1077 2368 3690 1836
1678 1836 -634 297 3767 2991 -215 -336 2143 3784 1591 -1291 734 3420 2203 -88 -1011 2174
1694 2174 3234 265 -1460 213 2501 1811 -1536 -1550 1262 1990 -651 -2360 -838 2052 176 -2518
1710 -2518 -2446 320 1358 -1654 -3395 -1138 570 -528 -3152 -2827 414 354 -2591 -3217 -1348 796
1726 796 -991 -3819 -2411 107 486 -2361 -3550 -695 1004 -1249 -3085 -1889 743 939 -2101 -2592
1742 -2592 -7 1572 -286 -2731 -880 2008 1206 -1313 -1479 984 2740 167 -1628 482 2813
1757 2813 2354 -716 -787 2589 3128 770 -745 718 3498 2333 -452 119 2521 3348 1017 -900
1773 -900 1355 3186 1895 -376 -331 2659 2955 128 -887 1114 2969 1360 -1703 -694 2015 1782
1789 1782 -563 -1929 336 2293 235 -2105 -1144 993 1383 -1634 -2696 -13 1233 -455 -2793
1804 -2793 -1994 933 204 -2531 -2742 -787 718 -1184 -3476 -1719 326 -67 -2625 -3131 -307 874
1820 874 -1627 -2964 -1757 708 31 -2684 -2159 552 712 -1036 -2891 -668 1629 362 -1839 -1699
1836 -1699 959 1701 -859 -1891 289 2020 1119 -1415 -743 2111 2237 18 -856 1009 3069 1321
1852 1321 -854 368 2565 2792 383 -791 1858 3098 1291 -283 43 2973 2551 6 -299 1516
1868 1516 3012 1243 -1140 190 2763 1502 -491 -994 1229 2273 446 -1367 -149 1813 1316
1883 1316 -1754 -1543 700 1179 -337 -2339 -1010 1067 -8 -2212 -1948 159 863 -1542 -3045 -942
1899 -942 366 -753 -2735 -2400 234 292 -2130 -2602 -1356 698 -453 -2931 -1869 135 171 -1521 -2484
1916 -2484 -788 1161 -611 -2281 -1434 952 990 -1534 -1987 424 1332 307 -1633 -740 1689 1242 -747
1933 -747 -844 895 2460 578 -1175 353 2039 2048 -82 -622 1874 2616 893 -407 525 2930 2330
1950 2330 -126 132 1827 2642 964 -776 843 2682 1591 -393 -287 1621 2371 55 -1018 466
1966 466 1997 1195 -1111 -732 1381 1493 -511 -1514 -471 1185 198 -1815 -1439 559 725 -1328 -2227
1983 -2227 -310 1018 -645 -2237 -1984 575 279 -2327 -2240 -911 510 -1044 -2873 -1634 547 -68
1999 -68 -1955 -2642 -661 887 -1256 -2485 -1200 459 241 -1815 -1876 311 1056 -522 -1921 -693 1412
2016 1412 600 -1361 -880 845 1600 -61 -1164 408 1738 1167 -846 -767 1724 2040 504 -441 957
2033 957 2368 1500 -546 169 2091 2146 467 -717 1133 2486 1279 -191 103 2096 2200 -199 -523
2050 -523 844 2079 802 -788 -87 1988 1315 -321 -931 493 1703 -101 -1501 -334 922 798
2066 798 -1111 -1679 601 854 -366 -1773 -903 924 -15 -1764 -1974 -352 657 -1044 -2363 -714
2082 -714 378 -534 -2129 -2288 -193 384 -1428 -2088 -1206 607 -222 -2106 -1723 330 721 -1126 -1829
2099 -1829 -500 923 -8 -1672 -1059 750 1024 -794 -1392 292 1367 426 -1118 -494 1720 1262 -174
2116 -174 -619 680 2092 836 -721 256 1863 1398 143 -209 1346 1941 736 -80 478 2010 1758
2133 1758 -210 -104 1609 2169 1027 -573 685 2273 1141 -325 -558 1152 2100 236 -963 305
2149 305 1116 811 -1128 -1017 1054 927 -477 -1472 -384 1018 34 -1531 -1115 389 538 -1026 -2098
2166 -2098 -188 543 -517 -1550 -1602 -177 72 -1743 -1780 -826 416 -475 -2290 -1301 138 -30 -1425
2183 -1425 -1864 -458 798 -673 -1599 -1025 742 325 -1302 -1523 303 1161 -108 -1328 -505 1208 885
2200 885 -493 -637 923 1500 322 -1013 414 1417 1117 -162 -237 1413 1985 569 -448 574 1999
2217 1999 1301 -542 400 1476 1663 462 -645 638 2033 834 -360 194 1502 1666 -55 -694
2233 -694 1018 1302 753 -729 -228 1257 659 -465 -1096 246 1194 -22 -1353 -538 713 765 -999
2250 -999 -1610 103 551 -815 -1628 -962 293 101 -1712 -1404 -168 311 -663 -2098 -973 104 -842
2267 -842 -1389 -1646 -269 365 -1003 -1739 -954 221 -99 -1284 -1398 236 551 -514 -1483 -335 799
2284 799 -43 -1088 -568 400 845 -317 -1177 503 907 540 -525 -375 1356 1553 -177 -308 554 1701
2302 1701 971 -322 539 1697 1435 368 -426 941 1941 647 -446 75 1462 1530 -352 -340 1111
2319 1111 1067 707 -470 80 1477 757 -315 -504 684 1466 49 -817 23 923 394 -497 -1122 367
2337 367 359 -414 -844 -668 517 -167 -1731 -1058 -19 184 -702 -1801 -792 377 -525 -1330 -1171 -122
2355 -122 242 -1107 -1449 -532 567 -270 -1698 -1247 285 42 -1166 -1386 -293 829 -377 -1282 -840
2372 -840 601 533 -903 -962 341 1104 161 -712 -650 1243 997 -1007 -650 766 1427 359 -759 599
2390 599 1393 1061 17 -313 1168 1351 478 -177 617 1268 1157 -121 -86 1276 1218 388 -238 494 1343
2409 1343 604 -129 178 782 1221 -201 -577 535 940 607 -642 -535 816 658 -430 -853 -95 807
2427 807 -224 -983 -384 91 356 -557 -1313 -108 504 -778 -1178 -1013 231 33 -949 -1214 -126 83
2445 83 -304 -1802 -846 233 -130 -1152 -1309 -365 524 -576 -1207 -366 114 25 -1232 -1165 231 575 -301
2464 -301 -985 -329 992 315 -722 -615 423 869 13 -579 385 1261 676 -263 -447 854 1025 -55
2482 -55 -197 681 1295 880 -248 225 1328 991 357 -210 746 1343 758 1 290 1031 1152 -118 -328
2501 -328 679 1130 623 -367 -181 891 374 12 -545 288 960 65 -877 -272 764 413 -414 -800 111
2520 111 624 -570 -997 -692 188 1 -1408 -975 139 241 -613 -1431 -506 319 -361 -944 -1100 -122 -39
2539 -39 -962 -1222 -191 128 -399 -1352 -732 128 -58 -501 -927 -309 594 -189 -1101 -738 105 552 -543 -609
2559 -609 377 404 163 -201 -506 693 886 -52 -25 572 1023 754 -42 185 1171 898 175 -146 665 1483
2579 1483 337 13 395 996 925 97 -22 916 930 459 -429 -1 1429 824 -432 -28 526 935 -39
2598 -39 -573 263 782 306 -598 -471 336 715 -390 -562 -282 377 64 -1141 -625 164 58 -539 -849 -68
2618 -68 574 -390 -935 -711 -45 187 -899 -1205 -535 -54 -155 -1259 -773 -13 -132 -1177 -893 -216 415
2637 415 -374 -908 -374 167 112 -736 -848 590 309 -180 -499 -400 986 515 -440 -416 777 796 265 -585
2657 -585 194 880 698 -258 115 565 1141 333 -378 582 1228 819 -172 180 861 930 168 -74 526 1235
2677 1235 514 -169 30 677 924 26 -456 531 960 284 -347 -194 892 581 -477 -425 97 729 7
2696 7 -945 -423 369 422 -360 -863 -28 479 -308 -796 -583 114 256 -952 -831 -86 69 -692 -1094 -394 55
2717 55 -420 -694 -937 -324 381 -542 -1026 -535 215 -401 -748 -646 149 308 -475 -789 -164 462 59 -698
2737 -698 -224 214 570 -107 -631 335 647 441 -261 47 740 747 -375 204 74 1070 464 -228 284 925
2757 925 541 293 -296 457 1218 203 -143 22 862 513 -71 -136 698 498 363 -389 86 834 653 -107
2777 -107 -341 619 576 190 -483 -139 295 316 -346 -554 -56 157 -506 -532 -156 71 86 -1188 -861 48 210
2798 210 -470 -977 -466 213 18 -649 -740 -178 -223 -659 -911 -403 101 -408 -813 -779 -25 70 -522 -570 75 142
2820 142 -55 -354 -140 290 206 -133 -655 -61 329 -114 -574 -292 337 249 -92 -174 598 883 335 -191 101
2841 101 507 324 -213 -9 627 621 48 -159 300 920 602 97 -15 778 701 183 -101 618 1000 342 -117
2862 -117 8 689 797 19 -161 199 580 178 -143 -252 373 592 -52 -520 -195 67 57 -385 -350 68 87
2883 87 -330 -637 -6 162 -558 -548 -550 117 485 -705 -860 20 -252 -365 -728 -1206 157 -15 -878 -1230 144
2904 144 571 -464 -521 -340 225 -131 -307 -796 -54 25 -345 -753 -460 356 -133 -445 -82 2 690 36 -498
2925 -498 26 564 520 -226 42 689 258 -84 -180 521 741 295 -45 169 811 428 -6 371 507 693 365
2946 365 -78 16 610 776 -66 80 722 478 301 -111 191 473 171 -436 -264 606 544 229 -399 15 220
2967 220 150 -568 -470 83 269 -237 -664 -235 95 74 -597 -693 -106 -125 -198 -671 -336 150 -375 -574 -645 55
2989 55 -95 -491 -975 -220 -95 -76 -430 -806 -21 75 -448 -666 -53 -94 -100 -466 -230 251 59 -63 -59 490 558
3012 558 41 -69 -174 289 575 -225 -348 598 527 353 -62 163 838 710 -13 231 186 551 265 -243 310
3033 310 455 535 10 -159 478 480 499 117 141 521 519 -104 -118 412 418 146 -231 153 406 178 -433 -253 349
3056 349 201 -350 -364 -146 235 -121 -414 -544 126 102 -104 -524 -281 -4 -189 -388 -396 -41 -110 -387 -559 -196
3078 -196 33 -381 -739 -620 28 -345 -519 -459 76 77 89 -427 -161 30 143 -346 -463 310 278 -238 -236 -250 357
3101 357 336 -237 -240 182 290 -168 -266 126 390 221 1 -114 318 518 -112 -78 123 472 295 23 121 577
3123 577 489 27 -235 270 578 345 -99 -139 436 629 224 93 544 503 296 52 -50 470 283 52 47 169
3145 169 371 34 -497 37 304 -42 -188 -151 26 214 -276 -596 -279 -164 -313 -406 -564 -86 130 -329 -576
3166 -576 -442 -72 -22 -417 -289 -28 -33 -277 -629 -346 82 -11 -348 -425 53 155 -61 -263 -90 162 -4 -379
3188 -379 -250 377 183 -59 -399 230 597 129 97 122 190 578 -149 -185 107 389 474 -156 -66 594 612 70
3210 70 -176 422 520 -46 -35 205 729 265 17 -183 343 523 394 32 174 485 154 38 -152 260 319
3231 319 303 -428 74 390 1 12 -437 103 143 -107 -220 -119 59 199 -445 -381 -124 66 -504 -385 -194
3252 -194 213 -72 -658 -577 -374 -187 -253 -546 -32 7 -181 -512 -302 336 -39 -352 -478 -33 145 -6 -520
3273 -520 -33 414 161 -193 -205 -21 326 151 -281 -28 249 145 -288 -63 124 81 64 -136 57 213 134
3294 134 -85 59 338 441 291 -62 81 200 544 37 71 473 330 192 -76 -117 458 132 -21 69 234
3315 234 192 133 -325 58 233 -41 -142 -81 131 224 -40 -379 -111 184 103 -302 -212 161 -230 -334 -149 -43
3337 -43 18 -87 -463 -226 -63 124 -297 -334 93 115 -147 -547 -264 -193 -63 -556 -472 -138 -29 -202 -526 -173
3359 -173 99 132 -122 -546 -268 191 -322 -225 230 236 361 -93 48 137 44 311 -175 28 370 105 303 -30
3381 -30 228 382 -22 -205 225 526 206 -92 118 403 207 175 -49 88 518 300 -51 0 239 434 389
3402 389 -503 210 178 -333 -124 -158 267 266 -78 -12 -30 154 -133 -112 123 189 -305 -208 -137 -136 296 -47 -547 -325
3426 -325 347 -296 -128 -529 -64 -174 -362 -234 -325 60 26 -613 -370 -199 -64 -179 -338 -298 -74 -220 -191
3447 -191 -365 -145 128 -248 -207 -21 -35 -247 -342 -211 2 268 -136 -287 -77 377 114 -228 8 195 236
3468 236 -34 -483 14 294 139 -199 0 345 152 -132 -83 130 242 303 154 478 174 275 -337 265 214
3489 214 284 213 270 53 120 169 -138 -24 191 45 -118 -88 -58 337 69 -257 -216 -31 199 13 -387 -175 52
3512 52 -130 -220 -465 47 -61 -223 -30 51 -89 55 -135 -312 -131 115 -266 -447 -7 82 -201 -162 -361 -29
3534 -29 -66 -297 -311 -31 -10 -38 -89 32 302 -153 -123 80 -75 -41 -43 -184 -22 247 251 -91 -125 -36 281 202 -55
3559 -55 -83 301 302 -154 -109 111 319 438 -15 290 404 -13 5 -59 172 487 101 -28 172 300 353 62 -39
3582 -39 325 188 -11 -158 188 333 132 -161 158 43 306 -187 98 124 87 15 -51 -45 86 281 -221 -55
3604 -55 -34 228 -130 -243 -242 -35 -62 -214 -206 -287 -172 -148 -310 -178 -138 -178 -109 -75 -83 366 95 -231 -355 219 -18
3629 -18 -100 -114 119 -143 -200 -181 18 286 -41 -228 69 324 107 50 24 149 210 -106 -126 36 154 121 71 -56
3653 -56 -173 120 216 104 111 -10 223 -116 82 207 547 200 101 290 357 11 20 -190 325 213 216 62 251
3676 251 405 183 -53 -110 264 108 324 -146 119 268 120 11 -191 120 145 66 -225 -196 -266 -62 -179 -239
3698 -239 -248 178 -25 -177 80 39 6 -304 -449 -144 -77 25 -243 -272 -23 -88 -192 -82 -221 -75 -234 -349
3720 -349 -44 -4 49 49 -158 -202 6 -112 -189 -91 124 -124 85 -358 60 46 -117 23 14 282 34 97 -125 23
3744 23 190 -135 -89 2 69 228 30 -306 160 122 -58 88 174 50 248 97 72 70 165 2 -25 54 340 96
3768 96 -65 209 59 95 53 -58 82 258 -91 -210 59 246 -36 -99 19 93 71 2 -53 -233 45 33 -59
3791 -59 -113 -134 -246 -227 -216 161 187 -266 -386 -185 86 -7 -137 -191 -7 159 -92 -121 -67 -128 -217 -135 -217 -104 44
3816 44 -148 -350 108 -16 9 18 -69 163 -37 75 -91 -24 20 24 -67 -116 81 -137 151 -140 -50 154 -13 219
3840 219 141 204 -85 199 -6 7 257 -5 -107 55 -12 321 109 -100 182 469 212 -37 179 205 5 72
3862 72 122 21 -91 149 -95 102 -39 73 22 -283 63 287 -112 -298 -43 35 165 -30 -72 49 49 37 -15
3885 -15 -272 -180 43 -254 -94 71 281 -155 -141 -115 203 212 -219 -94 -206 -2 -92 -306 -129 100 -34 -92 -340
3908 -340 -94 -138 -65 145 -38 234 228 -255 -85 -259 -37 126 61 171 20 173 -99 38 209 30 -1 -190
3930 -190 -96 69 239 182 33 116 192 318 -20 195 175 284 37 179 202 279 5 -68 39 263 -252 -409 85
3953 85 25 182 22 -212 -141 56 -33 -307 195 163 -81 -179 -43 -121 -123 -313 -178 -10 81 27 -194 -181 188 54
3977 54 2 -469 -259 65 -338 149 -190 -92 247 -18 -22 -115 42 -95 -6 53 -176 181 42 -165 26 -193 -4
4000 -4 112 8 -125 94 -95 -324 10 -132 -56 -322 203 46 -231 -167 25 153 19 171 88 247 -42 149
4022 149 -355 -125 471 181 -69 238 92 435 -127 90 150 100 -101 87 213 -433 299 227 213 -41 290
4043 290 211 -46 -422 128 200 319 -30 -136 34 122 -94 -229 -118 68 149 -79 119 -147 -199 -24 -108 25
4065 25 -156 50 -243 -117 212 107 -246 -72 48 -308 -140 -143 -148 -210 146 -10 -20 -125 123 -35 -291 -62
4087 -62 50 12 -244 63 -152 121 77 -30 -254 172 16 62 54 214 207 163 -34 202 103 271 150 279 116
4110 116 158 154 44 -67 58 183 54 -114 4 102 29 -292 341 141 254 33 140 144 -14 267 87 -16
4132 -16 64 2 200 64 65 26 90 -254 -186 284 -32 -207 198 -2 -143 89 -71 -35 238 -92 -190 24 117 -79
4156 -79 -332 -177 31 317 55 -66 -196 -168 80 126 -10 -47 -105 28 -134 -124 -112 -186 -265 -253 -5 14 300 -102
4180 -102 -334 -41 -56 -155 63 211 -53 -79 -204 -250 -34 96 -80 130 53 118 48 132 91 259 -124 -116 -87 245
4204 245 52 76 -14 -195 83 -133 48 50 71 58 33 -189 49 136 153 115 -32 -32 67 -259 48 60 -44 70 -3
4229 -3 68 140 52 284 -153 -253 63 -1 49 -140 79 -54 -87 -180 -35 4 219 -16 69 -31 47 -142 -152 21
4253 21 -4 -168 -175 136 -22 -17 79 -28 -184 112 45 -113 137 21 329 74 -151 -65 -154 24 25 -141 -263 34
4277 34 5 -105 182 143 -82 -129 -58 111 199 141 180 470 40 -52 -19 166 357 185 171 299 250 320 113 -2
4301 -2 1 366 -174 257 123 37 117 -244 -258 36 374 46 34 -187 94 -143 30 -160 68 51 -105 59 -60
4324 -60 -204 292 126 -101 98 98 -3 -188 8 -215 -195 -181 56 20 161 7 -82 52 19 33 -351 -170 163
4347 163 264 63 -31 -81 125 -70 -223 -189 -56 -130 -40 211 -158 9 275 60 37 -218 39 -95 189 -101
4369 -101 20 -94 -5 -57 -83 -35 83 62 42 63 -19 -308 136 345 -24 -142 -276 -369 2 141 -17 -4 24 -116
4393 -116 -16 248 -29 224 -194 -113 -189 -63 -83 131 -130 -62 256 33 -44 30 95 -167 -58 -126 -118 312 73
4416 73 142 256 39 -33 86 -1 105 -16 6 -354 -257 138 -5 -294 3 74 69 86 -72 -41 331 -39 -36 -33 -129
4441 -129 -62 -125 -92 -229 -246 -184 -207 -88 -34 -8 -138 -128 -60 -67 154 -257 -102 -12 -182 226 -165 -95 77 207 62
4466 62 -163 -5 100 -73 6 -288 -11 -77 41 -130 -207 64 117 91 196 3 146 -11 37 -60 107 45 -140
4489 -140 -77 387 116 -127 304 -20 54 168 124 174 128 233 97 89 148 -183 -189 -217 -412 109 92 78 268 5
4513 5 -73 99 -100 -108 -170 -135 -323 -165 -163 5 -40 -423 -193 34 38 -218 -80 202 -113 -20 -75 -134 98 16 61 -88
4539 -88 -168 -168 -305 -178 -1 -15 229 52 25 -81 87 -55 22 -161 -33 44 -151 -277 94 60 48 -124 46
4562 46 -140 122 -240 -135 46 -23 -6 41 -52 129 42 -70 198 -71 455 72 -24 -87 240 -37 -143 -111 154
4585 154 -136 -50 -151 240 -128 -34 -13 -156 35 170 1 -191 238 57 345 -111 -66 221 1 280 153
4606 153 87 169 -202 20 129 -100 50 -252 99 -153 -129 -6 70 -43 37 64 -86 8 -239 31 -136 -27
4628 -27 77 -414 81 -248 -106 -9 -48 -159 -295 -26 102 27 -62 77 174 -59 81 315 109 242 53 -161
4650 -161 -207 147 56 34 -62 -125 25 158 104 97 -79 115 -372 -102 138 -57 -101 35 169 172 254 -9 181 68
4674 68 109 -251 141 0 111 -107 4 -144 29 235 -289 -82 94 -92 -100 -212 -100 -184 -98 -27 -204 102
4696 102 -226 -1 -176 -123 -134 33 -252 -90 92 20 45 0 118 74 -209 -29 -104 9 119 3 72 23 38
4719 38 -214 -241 -137 17 70 24 -236 151 -58 28 24 7 -75 -78 -92 -313 -129 -62 33 -83 6 81 -41 108 222
4744 222 -161 57 -11 -16 116 131 5 -134 -106 136 -216 -78 -200 25 123 272 -74 -107 -52 176 40 7 -141
4767 -141 -191 -232 102 -1 127 -126 179 -224 -57 -53 414 -229 -334 -37 -40 -158 -161 216 329 202 66 477 -13
4790 -13 375 -417 -25 -26 61 -338 -5 -145 -344 111 -679 -416 336 -14 -688 -377 -182 374 -79 14 -339 702
4812 702 53 1 -950 219 -97 -665 21 -780 355 -336 553 -119 12 167 -27 -226 -198 206 154 -253
4832 -253 188 -392 532 52 19 465 709 576 -175 156 -551 367 455 -726 184 176 -341 10 91 -204 237
4853 237 -21 -1146 -359 -249 -559 -165 405 83 -387 346 -74 85 -458 -68 43 209 -586 -139 -349 -384
4873 -384 375 -21 -166 -403 -100 -461 -49 444 -37 42 -378 398 262 61 28 298 -355 -254 -137 188 -565
4894 -565 1 -377 622 -198 -981 -244 501 516 -313 -457 -332 -140 -760 409 83 299 -73 -594 107 -668
4914 -668 -493 -388 -372 -36 432 -61 220 -180 -412 -412 -98 -67 579 51 46 -695 304 -99 9 -28 -366 101
4936 101 58 -7 -181 60 495 335 -169 105 81 -113 -242 -646 -48 -33 -178 -638 343 2 -74 -121 55 -37
4958 -37 -361 442 297 -909 -60 -103 21 -190 -465 214 333 -217 -244 185 258 145 75 442 -343 -286 -46 199
4980 199 328 223 147 -261 20 -226 -85 242 80 5 -456 -196 106 -50 -197 257 -134 -366 -585 -173 -91
5001 -91 -234 182 -2 161 206 38 200 390 116 -154 -88 177 -172 -40 -42 234 36 78 340 1 305 211
5023 211 -251 -266 -237 -56 -218 140 470 443 424 -45 660 143 -132 206 -527 386 506 -509 56 -132 257
5044 257 436 239 -401 -492 -37 -234 -223 -434 -165 -275 8 -198 -377 46 501 -49 -262 84 256 22 -296
5065 -296 -333 124 -81 740 -387 -22 164 98 -35 -375 -18 -1149 224 -290 455 -268 -621 -77 -268 -363
5085 -363 -312 -553 -285 -413 -216 -685 -50 119 -378 -26 -484 7 -64 -285 -143 -186 -88 -473 243 96 -275
5106 -275 -576 -50 -93 -438 203 450 69 281 473 -59 -154 453 -326 204 301 -261 -565 149 31 -247 -522
5127 -522 150 -90 -6 195 -131 129 98 279 -21 203 -334 298 130 40 -235 -236 -297 184 -438 290 87 230
5149 230 46 298 -108 123 101 -59 -242 98 -14 -405 -194 -264 263 -78 -76 57 -335 -514 -30 191 -153
5170 -153 -78 -116 -280 77 -148 46 -225 164 -70 -49 158 -3 78 -260 -102 -35 22 102 -153 -94 66 71 -36
5193 -36 -15 121 -16 102 -120 54 17 -66 211 9 216 167 155 -113 -136 -187 30 319 -22 -39 32 228 138 20
5217 20 60 -144 51 66 26 45 -59 -47 -4 165 -130 124 25 -20 -88 336 134 -109 131 -51 93 -116 -110 -6
5241 -6 -89 -153 -33 -28 -142 -20 -21 -172 134 113 -16 -51 80 167 -93 -329 -27 -34 201 41 39 117 -78 -100 -180 -109
5267 -109 -39 71 -119 -239 -59 -92 -159 142 48 53 -98 250 93 -30 237 1 -23 -19 101 -62 50 -269 90
5290 90 -92 -81 -92 227 102 181 -187 -93 86 -12 -1 37 -43 166 89 -111 216 154 10 80 -57 -155 19 70 -178
5315 -178 201 322 281 -127 37 96 -69 -104 -237 -58 133 -58 262 -33 15 36 89 38 -108 -46 2 67 50 -8
5339 -8 -21 73 59 181 -124 31 -57 -206 -40 12 -155 39 -81 -174 -58 -343 -94 -18 -42 -12 17 -3 176 -191
5363 -191 138 -6 -63 -24 -181 -85 147 135 -68 73 14 -27 -71 -161 146 -16 319 -99 -76 -103 -177 -60 -206 73
5387 73 162 383 16 176 -69 -101 -20 150 123 48 38 96 134 62 -106 5 -136 -33 -60 28 201 48 78 82 218
5412 218 22 89 500 -36 35 246 -21 32 348 181 237 -114 262 -128 -210 -43 -49 151 -301 -324 21 64 -10
5435 -10 -12 212 -126 147 -120 -102 67 96 133 -309 -27 -193 -200 9 -318 0 72 -159 215 -88 0 -96 -269 -304
5459 -304 0 -227 -228 26 -5 51 -219 -146 191 161 -39 25 -299 70 -162 55 19 130 17 105 58 57 -9 -236
5483 -236 -167 -202 77 118 -241 -86 52 111 71 -49 69 -56 -128 50 230 35 -26 -79 44 -185 272 -113 158
5506 158 -113 43 160 -289 196 83 -6 -8 152 -92 205 286 -60 54 108 -165 -170 -8 279 -106 149 -277
5528 -277 54 144 64 -123 -169 5 -164 -72 -58 30 90 -77 -59 34 70 109 -19 151 -136 -15 61 211 80 32
5552 32 -106 -6 53 80 -185 -74 179 -212 186 146 36 316 202 55 53 161 144 143 44 122 26 72 -79 -19 133
5577 133 150 -73 90 -27 -82 -2 -79 63 -117 -62 -35 103 -121 31 -114 161 61 58 18 154 -67 223 -30
5600 -30 -125 -24 -248 -64 -55 -113 -111 -36 -103 130 91 121 -98 -241 -159 10 -243 36 -162 -106 111 58 -207 42 -104
5625 -104 -200 -174 -114 60 -233 197 -245 -340 137 141 -8 -64 -30 296 28 -224 -177 95 -213 43 -19 -161 172
5648 172 -95 -57 9 -87 97 46 202 145 111 228 9 16 23 -55 -454 -99 82 -366 -277 -130 62 -217 104 -37
5672 -37 -133 183 -219 -6 -286 157 -5 -30 -198 155 56 175 199 103 326 -477 221 81 -125 -207 -378 -145
5694 -145 202 -308 -63 -365 -116 123 -390 -305 -333 -146 -118 0 -46 252 -359 362 208 -104 151 -271 -168
5715 -168 -179 -344 -645 -229 397 -740 163 94 203 -238 -287 -380 -377 -367 18 -199 -216 185 -410 195 -118 287
5737 287 237 76 113 -351 325 -10 -443 -648 -351 -29 -756 364 -174 50 383 55 -83 195 -17 -198
5757 -198 -364 -298 -252 -447 -223 -169 440 -95 52 -8 340 -404 -577 580 77 365 -50 -1141 -144 -265 204
5778 204 242 -294 488 -57 99 -72 514 -286 294 -325 -15 -98 152 289 -358 43 -535 132 -26 34 -254
5799 -254 -209 -268 276 -170 -82 -82 596 -41 -57 226 186 -6 -152 -120 -129 -924 195 -733 -72 -146 -264 -513 -749
5822 -749 -960 -67 -43 501 -313 -124 644 -421 269 -781 -220 -600 -321 131 303 7 -500 88 -24 -717
5842 -717 -428 199 101 -101 87 98 -51 252 178 -153 182 35 -281 271 132 -94 -128 -145 303 143 158 89
5864 89 -40 217 -35 -81 13 3 121 84 34 -135 78 12 -165 25 -207 67 67 -43 -94 192 -225 -18 108
5887 108 70 31 188 18 -269 -214 -63 119 -103 -6 -2 -110 -102 38 -51 -212 92 -84 39 -161 -130 1 -74 33
5911 33 -56 -46 -83 -237 -134 42 -217 -86 88 -87 225 94 -181 -25 32 4 14 165 32 -52 82 100 282
5934 282 32 -84 78 113 145 -264 33 -7 -136 5 -7 27 147 -172 -152 35 127 -61 -122 -148 139 -105 -252
5957 -252 77 -182 210 -86 -47 1 95 185 132 134 -69 144 138 -26 124 13 330 113 77 18 -38 -92 44 -115
5981 -115 71 146 167 -70 -44 -55 -129 15 -68 -7 -12 -88 27 -131 -123 -94 -260 112 -3 233 -20 -130 220 -56
6005 -56 -38 64 -250 -194 -63 -19 -76 62 -47 -255 9 139 85 5 -72 49 -289 -247 5 -203 21 -43 279
6028 279 44 6 121 140 91 65 -16 -25 138 40 177 50 157 -130 42 -67 69 34 -68 -81 95 -66 78
6051 78 158 32 140 166 -219 21 47 -26 189 44 -103 178 -171 2 -121 192 89 21 118 -90 102 103 -18
6074 -18 -14 112 -58 -57 -150 28 168 79 154 -24 -110 126 -2 -319 5 -262 95 -150 -167 -119 -147 -7 -143 -60
6098 -60 -74 52 -348 113 53 320 106 -35 -92 -54 -4 -86 100 126 70 90 98 132 -361 -11 3 254 214 111 101
6123 101 78 29 227 33 -29 117 338 238 -4 -76 97 -143 -8 106 8 33 1 -13 -181 188 211 -28 -144
6146 -144 14 11 -74 -264 -206 -29 -46 -55 117 -70 87 151 -109 -1 -3 38 87 47 101 34 121 -234 66 -168 6
6171 6 19 -328 -42 73 -182 111 99 -122 146 44 -20 -78 19 -146 -12 148 34 35 87 -156 12 -136 -156 -85
6195 -85 140 -7 -90 -228 -47 98 -190 215 53 57 1 71 -94 -10 142 -118 41 66 3 27 -222 300 -6
6218 -6 -81 13 29 -194 -390 70 -89 21 -137 61 78 104 100 0 238 242 199 135 45 -142 -72 52 55 163 71 19
6244 19 48 152 -44 144 -80 -11 33 9 -242 -146 -127 184 51 -228 -220 -19 85 -45 83 43 128 270 88 77
6268 77 122 112 72 170 -277 -109 -71 -161 152 145 -47 137 -23 7 -131 -266 -156 27 -86 59 158 -28 -298 52
6292 52 -38 186 88 -52 103 -251 -2 8 -51 -202 131 157 231 -224 -35 125 -97 48 220 54 -100 -228
6314 -228 60 -143 -9 28 -140 -89 150 102 -101 172 -275 80 -131 -116 325 -257 119 194 -88 -95 -201 48
6336 48 -95 -127 221 103 -59 -21 -97 -42 185 -27 207 -153 79 -139 -167 110 159 30 245 243 52 162 237
6359 237 199 12 -25 102 -57 24 -366 -293 -85 -29 8 8 -211 -146 122 121 11 51 48 -84 153 -27 -189 -50 224
6384 224 -17 -16 -36 346 37 -358 -68 202 175 52 3 172 126 63 36 62 -29 122 -130 92 143 9 -199 30
6408 30 172 -95 236 179 248 19 -142 -29 14 -19 18 67 -52 -32 -259 160 55 22 90 -311 117 -234 -168 -146
6432 -146 11 -99 -142 -41 -293 24 -82 121 -80 -67 181 -225 -34 -200 -60 50 -290 86 24 -108 -165
6453 -165 -34 84 -188 -48 4 160 -185 -229 -94 -151 224 80 -43 35 -302 85 81 87 228 55 -234 179 -105
6476 -105 -102 66 21 39 -53 203 12 -47 221 36 33 -157 -45 194 -134 -99 123 146 -27 187 135 155 -129 58
6500 58 433 -40 48 67 25 -88 -246 224 123 -59 79 23 42 -289 -121 -265 -158 111 -125 -279 193 -58
6522 -58 -195 -156 -247 41 -160 34 313 192 86 109 84 17 -100 -225 17 -27 -164 151 -110 -63 -60 -178 -35
6545 -35 92 5 -133 -3 -3 -53 80 -100 3 -114 -7 -208 -16 21 158 141 -154 118 -71 -83 76 250 83
6568 83 8 48 -189 -120 173 128 -99 183 229 -78 -54 140 78 -51 318 -100 169 456 13 92 78 126 -284 157
6592 157 -61 219 -287 224 35 -190 83 -214 -84 0 -89 -251 -60 -110 92 -79 109 -106 -20 174 46
6613 46 9 303 -301 -173 368 -122 -106 200 -76 210 10 -152 -198 -35 37 -211 35 -135 3 -114 164 -105
6635 -105 -310 146 -30 -196 10 -177 -23 118 13 193 -68 -135 171 -8 95 -136 293 30 -4 -147 40
6656 40 -249 210 -47 -118 121 -33 88 -17 -27 140 63 -113 -95 46 163 -92 101 -42 -83 86 282 -98
6678 -98 100 45 -20 53 103 81 41 -138 -72 28 190 201 92 115 15 152 -147 -35 106 -107 190 -68 131
6701 131 -66 32 -25 111 170 -157 4 111 -66 22 10 90 -5 112 226 0 130 30 -69 36 -4 62 17 63
6725 63 -159 2 -103 79 100 -198 -28 122 39 46 127 -170 58 193 151 70 -100 17 199 130 217 87 -73
6748 -73 38 95 -86 -45 113 10 346 55 -270 -145 242 24 67 220 -127 0 152 -139 -1 -206 166
6769 166 -119 -63 -103 149 -157 -239 -245 220 114 -153 159 47 -89 -45 -100 -86 -99 -76 -51 -54 -80 -179 99 97 113 182
6795 182 87 -208 -215 -280 -1 -46 118 38 -111 -19 -383 10 -63 252 -198 119 -24 25 -186 76 220 -37 129
6818 129 -119 57 -114 -160 -124 -71 150 23 74 169 -141 -34 99 62 263 -16 271 67 -202 220 49 65
6840 65 -152 126 203 21 107 27 79 0 127 34 47 -9 -30 14 135 -155 225 -45 219 104 267 -68 -272 27
6864 27 -45 -112 84 165 -17 230 -335 -124 -144 77 -45 -155 -203 -8 -59 7 -79 -157 17 83 2 145 -58 31
6888 31 -63 142 64 -121 -149 21 -17 -152 -65 -7 -43 62 1 218 -97 65 -158 260 33 -201 142 232 -106
6911 -106 55 73 -63 -6 275 324 71 -122 -95 -95 240 167 83 156 -22 -122 232 -136 161 56 -208 -130 -65 -125
6935 -125 49 -143 120 -48 121 -139 177 -17 -174 -140 51 200 -49 68 -15 -50 -23 -189 178 205 129 88
6957 88 -14 74 71 67 -27 209 -155 -104 145 -71 113 166 188 -96 60 -51 158 169 73 -21 -13 199 127 -80 57
6982 57 -21 11 -130 113 135 197 -9 -99 -43 21 26 106 361 72 131 39 128 182 -232 97 129 238 94 13 38 -164
7008 -164 -180 106 167 47 -23 91 226 -132 -17 -4 214 158 75 -142 182 232 286 39 -3 116 70 78 69 120 130
7033 130 58 159 -63 87 -341 -91 209 24 -1 179 103 -22 -114 -90 221 -156 -97 -10 -73 -294 -110 -116 -69 66
7057 66 -204 -306 -195 188 -98 46 -105 -238 74 27 59 119 11 -15 -11 143 -84 71 72 -151 -9 145 -139
7080 -139 -131 125 75 119 -115 82 -54 -48 -236 72 -39 -111 -36 118 148 -52 -29 -64 154 113 193 171 43 38 22 -65
7106 -65 167 13 -14 55 121 -165 -153 -79 -51 30 -68 150 -158 -150 -27 -41 6 118 73 -226 0 21 -177 163 -158
7131 -158 45 82 -11 25 -116 100 116 -343 58 -40 -7 50 63 51 -78 146 -76 33 -87 -181 32 68 40 16
7155 16 245 162 32 -28 -68 -82 181 31 4 92 -30 -25 221 -199 -41 12 -380 0 -100 43 17 -195 -117 -181
7179 -181 -123 81 -86 -26 59 285 -186 159 -20 -287 161 -15 -8 118 29 -144 75 152 -69 -109 60 -53 -113
7202 -113 149 238 56 333 -4 -98 97 15 57 116 -194 -115 361 -169 -40 147 -193 154 175 76 215 -57 99
7225 99 128 -169 -237 42 -196 -44 235 140 59 23 131 -64 64 -95 -118 -126 -27 31 223 34 -31 -75 77 -221
7249 -221 115 -62 173 -75 -100 -161 152 -233 -272 -192 -123 -41 -76 142 49 277 -35 133 71 -52 -22 -57 -196 129
7273 129 85 -30 8 127 32 -12 -180 -82 -5 -69 -162 67 -90 210 6 -18 -270 300 -47 138 -49 -300 -3
7296 -3 -211 109 31 107 29 -5 12 65 -127 68 295 -143 -163 -53 121 -86 -18 -64 -114 0 -197 -329 50 -13
7320 -13 -372 132 111 37 -73 -163 48 -69 -8 122 -54 -89 127 34 77 -32 113 -32 47 -130 -132 -70 -311 260
7344 260 -12 -149 -48 -42 -24 67 0 41 167 -141 85 13 93 55 104 117 185 -51 98 -176 41 41 178 -345 -60
7369 -60 169 -35 -14 253 63 -248 266 -78 154 9 22 257 -33 69 55 -188 -32 -83 -60 -85 9 -196 17
7392 17 -34 -228 208 125 -217 -167 -47 -95 -99 34 -80 -167 56 -14 190 227 110 200 54 -1 164 -111 41 19
7416 19 -208 -64 28 -49 -6 -31 95 -116 97 -352 11 224 74 -60 -121 -61 181 15 -40 -215 160 106 -64
7439 -64 -3 97 34 -8 -93 246 73 -74 -17 57 -34 -9 141 0 -126 97 -204 -77 -50 64 126 118 -343 -71
7463 -71 -259 -36 -1 22 140 3 -1 -169 -177 290 20 59 211 -112 191 127 10 4 196 122 -72 -224 191 4
7487 4 -31 154 -30 -213 -136 -46 -157 90 197 -35 -38 58 -238 55 -76 15 -113 141 111 145 -135 163 -144 -146
7511 -146 -5 -61 -10 71 38 202 -78 -146 147 -25 82 -67 -39 170 -161 -23 -111 -144 125 336 105 5 -63
7534 -63 -87 59 217 240 -32 -153 -72 36 -225 -205 26 16 -391 35 51 106 -223 -45 44 -56 26 -337 -76
7557 -76 0 114 -8 63 -154 137 226 -174 -35 188 207 33 -54 -103 -231 -229 120 106 8 -225 -47 3 -134 174
7581 174 -118 157 137 -70 81 -65 -19 188 203 -121 142 18 48 -105 -81 82 65 188 -48 -138 -35 160
7603 160 251 37 -143 -6 146 10 -9 -45 15 60 201 -60 91 -200 -187 -157 -3 -179 122 121 -76 -113 -126 -8
7627 -8 143 23 -109 -261 73 -94 -58 181 -234 -5 -227 60 18 11 85 225 139 -123 155 -1 -38 109 100 23
7651 23 -82 -129 -26 28 41 24 112 100 -20 -152 15 28 -58 52 -55 45 -219 46 -34 -71 100 -286 91 66
7675 66 57 -224 75 -111 -88 23 -54 -54 -15 50 160 176 294 128 14 -100 -128 23 -32 72 198 39 146 226
7699 226 -44 -45 -134 -75 40 -99 -281 -124 213 -108 -233 35 -147 -64 274 89 7 10 -167 -242 28 -153 114
7722 114 -42 -183 262 37 172 -8 -276 -58 -69 68 -115 -68 55 -97 55 -36 17 -87 -1 30 -28 -133
7744 -133 -97 -208 -94 267 20 -140 131 21 -49 239 293 -78 -99 -29 -33 -68 109 -221 -205 -232 -175 -286 -140 -73
7768 -73 -103 214 16 -319 31 -93 -108 -129 -195 236 59 161 207 421 -96 72 -201 -32 -15 -247 -103 -39 352
7791 352 -95 -137 -142 -396 -393 14 -296 -46 380 -7 -126 -63 125 44 -186 -182 -113 215 -239 -235 -56 -26 -32 102 -12
7816 -12 -339 144 -63 -15 92 -199 -143 -216 133 141 186 76 -173 153 215 34 34 -199 -294 -74 102 -91 79 -60
7840 -60 239 -36 -8 57 86 -45 -23 57 -200 -129 49 330 -53 -121 -189 -155 296 22 42 -110 51 -46 -53 16 124
7865 124 361 -56 278 20 -119 163 -40 -202 410 -127 208 -125 363 -72 122 174 -22 82 -141 -34
7885 -34 -268 78 13 353 86 -117 -26 79 138 -217 -45 126 -213 -4 214 17 38 84 193 -322 -122 -274
7907 -274 -16 -252 -111 -81 -105 360 -140 -547 -150 136 -54 -314 66 -342 -259 79 57 73 -225 157 387 -277
7929 -277 -34 239 -186 261 73 -304 -134 -385 -249 -130 262 -178 -334 302 471 184 -365 -122 -228 421
7949 421 94 203 529 -140 -256 388 112 -611 -111 191 -81 -358 81 -79 72 -83 93 -41 722 261
7969 261 123 -74 -294 -93 426 266 -86 -150 105 38 -135 7 332 9 -428 -575 280 296 81 134 57 10
7991 10 -315 -16 -321 381 -378 29 -765 -255 0 -109 55 96 -3 105 181 -18 246 -162 72 9 163 -22
8013 -22 402 -192 -19 -354 91 -341 202 -70 -146 -67 -62 -218 130 -153 7 15 -143 249 -2 -122 2 14 59
8036 59 66 -29 28 260 241 -63 -94 -185 -271 -155 103 -93 462 241 -171 -232 299 -129 -121 355 -32 -243 183 -85
8060 -85 155 87 29 55 -197 200 80 117 -1 -304 -195 81 156 -14 -323 -142 316 35 -188 199 77 -284
8082 -284 49 -73 -384 -61 -370 -122 54 212 -249 20 -67 47 -88 42 -98 126 117 -22 197 -114 296
8103 296 80 158 -1 -21 27 -41 31 -70 164 147 -57 160 90 -92 150 53 -48 47 -201 -85 146 65 49 -107
8127 -107 13 -138 152 182 -108 -14 -40 105 -144 -50 -9 -30 74 48 81 127 -280 -23 137 152 -65 -24 165 -13
8151 -13 47 54 -25 -210 35 105 -96 -29 10 -218 158 50 73 -12 -115 -2 57 -31 -295 242 85 -13 -113 18
8175 18 17 77 -28 5 -144 -148 169 -165 43 188 -36 -96 77 -146 -155 105
8191A05
##END NTUPLES=NMR FID
##END=
