##TITLE=1H_Pr SA2
 CDCl3,8 sc, 
 6.04.2021
##JCAMPDX= 6.0         $$ Bruker NMR JCAMP-DX V2.0
##DATA TYPE= NMR FID
##DATA CLASS= NTUPLES
##ORIGIN= UXNMR, Bruker Analytische Messtechnik GmbH
##OWNER= root
$$ XWIN-NMR		Version 3.5
$$ Tue Apr  6 14:35:46 2021 Russian Standard Time (UT+4h)  she@DPX200
##.OBSERVE FREQUENCY= 200.131506
##.OBSERVE NUCLEUS= ^1H
##.DELAY= (6, 6)
##.ACQUISITION MODE= SIMULTANEOUS
##.ACQUISITION SCHEME= undefined
##.AVERAGES= 8
##.DIGITISER RES= 18
##SPECTROMETER/DATA SYSTEM= spect
##.PULSE SEQUENCE= zg30
##.SOLVENT NAME= CDCl3
##.SHIFT REFERENCE= (INTERNAL, CDCl3, 0, 15.7039)
##AUDIT TRAIL= $$ (NUMBER, WHEN, WHO, WHERE, WHAT)
$$ ##TITLE= Audit trail, XWIN-NMR		Version 3.5
$$ ##JCAMPDX= 5.01
$$ ##ORIGIN= Bruker BioSpin GmbH
$$ ##OWNER= she
$$ F:/spectra/data/she/nmr/H-F/1/audita.txt
$$ ##AUDIT TRAIL=  $$ (NUMBER, WHEN, WHO, WHERE, WHAT)
(   1,<2021-04-06 14:33:29.96 +0400>,<she>,<DPX200>,
      <created by zg, POWCHK disabled, PULCHK disabled
       configuration hash MD5:
       00 E9 B6 7A A2 85 ED C7 34 08 36 98 17 FE 4E 26
       data hash MD5: 16K
       A6 22 C7 A6 12 98 50 C5 59 2A A0 04 B2 CB 77 6E>)
$$ ##END=
$$ 
$$ hash MD5
$$ E7 0A C2 20 C0 CD 77 A9 DE DB DB 2B 2D CE 4D 4A
##$RELAX= 
##$RELAX= 
##$RELAX= 
##$RELAX= 
##$RELAX= 
##$RELAX= 
$$ Bruker specific parameters
$$ --------------------------
##$DU= <F:/spectra>
##$EXPNO= 1
##$NAME= <H-F>
##$PROCNO= 1
##$TYPE= <nmr>
##$USER= <she>
##$AMP= (0..31)
100 100 100 100 100 100 100 100 100 100 100 100 100 100 100 100 100 100 
100 100 100 100 100 100 100 100 100 100 100 100 100 100 
##$AQSEQ= 0
##$AQ_mod= 1
##$AUNM= <au_zg>
##$AUTOPOS= <>
##$BF1= 200.13
##$BF2= 200.13
##$BF3= 200.13
##$BF4= 200.13
##$BF5= 200.13
##$BF6= 200.13
##$BF7= 200.13
##$BF8= 200.13
##$BYTORDA= 1
##$CFDGTYP= 0
##$CFRGTYP= 5
##$CHEMSTR= <none>
##$CNST= (0..31)
1 1 145 1 1 1 1 1 1 1 1 1 1 1 1 1 1 1 1 1 1 1 1 1 1 1 1 1 1 1 1 1 
##$CPDPRG= <>
##$CPDPRG1= <>
##$CPDPRG2= <>
##$CPDPRG3= <>
##$CPDPRG4= <mlev>
##$CPDPRG5= <mlev>
##$CPDPRG6= <mlev>
##$CPDPRG7= <mlev>
##$CPDPRG8= <mlev>
##$CPDPRGB= <>
##$CPDPRGT= <>
##$D= (0..31)
0 1.2 0 0 0 0 0 0 0 0.06 0 0.03 0 0 0 0 0.0002 0 0 0 0 0 0 0 0 0 0 0 0 
0 0 0 
##$DATE= 1617705209
##$DBL= (0..7)
120 120 120 120 120 120 120 120 
##$DBP= (0..7)
150 150 150 150 150 150 150 150 
##$DBP07= 0
##$DBPNAM0= <>
##$DBPNAM1= <>
##$DBPNAM2= <>
##$DBPNAM3= <>
##$DBPNAM4= <>
##$DBPNAM5= <>
##$DBPNAM6= <>
##$DBPNAM7= <>
##$DBPOAL= (0..7)
0.5 0.5 0.5 0.5 0.5 0.5 0.5 0.5 
##$DBPOFFS= (0..7)
0 0 0 0 0 0 0 0 
##$DE= 6
##$DECBNUC= <off>
##$DECIM= 32
##$DECNUC= <off>
##$DECSTAT= 4
##$DIGMOD= 1
##$DIGTYP= 9
##$DL= (0..7)
0 120 120 120 120 120 120 120 
##$DP= (0..7)
150 150 150 150 150 150 150 150 
##$DP07= 0
##$DPNAME0= <>
##$DPNAME1= <>
##$DPNAME2= <>
##$DPNAME3= <>
##$DPNAME4= <>
##$DPNAME5= <>
##$DPNAME6= <>
##$DPNAME7= <>
##$DPOAL= (0..7)
0.5 0.5 0.5 0.5 0.5 0.5 0.5 0.5 
##$DPOFFS= (0..7)
0 0 0 0 0 0 0 0 
##$DQDMODE= 0
##$DR= 18
##$DS= 0
##$DSLIST= <SSSSSSSSSSSSSSS>
$$ [...]
##$SUBNAM2= <"">
##$SUBNAM3= <"">
##$SUBNAM4= <"">
##$SUBNAM5= <"">
##$SUBNAM6= <"">
##$SUBNAM7= <"">
##$SUBNAM8= <"">
##$SUBNAM9= <"">
##$SW= 16.9725357007746
##$SWIBOX= (0..15)
0 0 2 0 0 0 0 0 0 0 0 0 0 0 0 0 
##$SW_h= 3396.73913043478
##$TD= 16384
##$TD0= 1
##$TE= 0
##$TE2= 300
##$TE3= 300
##$TEG= 300
##$TL= (0..7)
0 120 120 120 120 120 120 120 
##$TP= (0..7)
150 150 150 150 150 150 150 150 
##$TP07= 0
##$TPNAME0= <>
##$TPNAME1= <>
##$TPNAME2= <>
##$TPNAME3= <>
##$TPNAME4= <>
##$TPNAME5= <>
##$TPNAME6= <>
##$TPNAME7= <>
##$TPOAL= (0..7)
0.5 0.5 0.5 0.5 0.5 0.5 0.5 0.5 
##$TPOFFS= (0..7)
0 0 0 0 0 0 0 0 
##$TUNHIN= 0
##$TUNHOUT= 0
##$TUNXOUT= 0
##$USERA1= <user>
##$USERA2= <user>
##$USERA3= <user>
##$USERA4= <user>
##$USERA5= <user>
##$V9= 5
##$VALIST= <valist>
##$VCLIST= <CCCCCCCCCCCCCCC>
##$VD= 0
##$VDLIST= <DDDDDDDDDDDDDDD>
##$VPLIST= <PPPPPPPPPPPPPPP>
##$VTLIST= <TTTTTTTTTTTTTTT>
##$WBST= 1024
##$WBSW= 4
##$XGAIN= (0..3)
0 0 0 0 
##$XL= 0
##$YL= 0
##$YMAX_a= 509994
##$YMIN_a= -579046
##$ZGOPTNS= <>
##$ZL1= 120
##$ZL2= 120
##$ZL3= 120
##$ZL4= 120
##$ABSF1= 10
##$ABSF2= 0
##$ABSG= 5
##$ABSL= 3
##$ALPHA= 0
##$AQORDER= 0
##$ASSFAC= 0
##$ASSFACI= 0
##$ASSFACX= 0
##$ASSWID= 0
##$AUNMP= <proc_1d>
##$AZFE= 0.1
##$AZFW= 0.1
##$BCFW= 1
##$BC_mod= 2
##$BYTORDP= 1
##$COROFFS= 0
##$CY= 11.3945322036743
##$DATMOD= 1
##$DC= 2
##$DFILT= <>
##$DTYPP= 0
##$F1P= 15.9154993809931
##$F2P= -4.1035820241983
##$FCOR= 0.5
##$FTSIZE= 0
##$FT_mod= 4
##$GAMMA= 1
##$GB= 0.15
##$INTBC= 1
##$INTSCL= 1
##$ISEN= 128
##$LB= 0.24
##$LEV0= 0
##$LPBIN= 0
##$MAXI= 10000
##$MC2= 0
##$MEAN= 0
##$ME_mod= 0
##$MI= 1.114404
##$NCOEF= 0
##$NC_proc= 0
##$NLEV= 6
##$NOISF1= 3.799351
##$NOISF2= 2.8
##$NSP= 1
##$NTH_PI= 0
##$NZP= 0
##$OFFSET= 15.70392
##$PC= 1
##$PHC0= -11124.62
##$PHC1= 16.80092
##$PH_mod= 1
##$PKNL= yes
##$PPARMOD= 0
##$PSCAL= 0
##$PSIGN= 0
##$REVERSE= no
##$SF= 200.130013532006
##$SI= 16384
##$SIGF1= 3
##$SIGF2= 2
##$SINO= 400
##$SIOLD= 16384
##$SREGLST= <1H.CDCl3>
##$SSB= 0
##$STSI= 0
##$STSR= 0
##$SW_p= 3612.71676300578
##$SYMM= 0
##$S_DEV= 0
##$TDeff= 0
##$TDoff= 0
##$TI= <>
##$TILT= no
##$TM1= 0
##$TM2= 0
##$TOPLEV= 0
##$USERP1= <user>
##$USERP2= <user>
##$USERP3= <user>
##$USERP4= <user>
##$USERP5= <user>
##$WDW= 1
##$XDIM= 8192
##$YMAX_p= 0
##$YMIN_p= 0
$$ End of Bruker specific parameters
$$ ---------------------------------
##NTUPLES= NMR FID
##VAR_NAME=  TIME,          FID/REAL,        FID/IMAG
##SYMBOL=    X,             R,               I
##VAR_TYPE=  INDEPENDENT,   DEPENDENT,       DEPENDENT
##VAR_FORM=  AFFN,          ASDF,            ASDF
##VAR_DIM=   8192,          8192,            8192
##UNITS=     SECONDS,       ARBITRARY UNITS, ARBITRARY UNITS
##FACTOR=    0.0002944,     1,               1
##FIRST=     0,             0,               0
##LAST=      2.4114304,     0,               0
##MIN=       0,             -579046,         0
##MAX=       2.4114304,     509994,          0
$$ Real data points
##PAGE= N=1
##DATA TABLE= (X++(R..R)), XYDATA
$$ [...]
$$ plain form
1719 -16 -131 -472 -318 221 -803 -420 63 -513 -153 30 -432 -212 497 -402 -199 358 27 -247 148 218
1739 218 -308 382 -54 -410 451 526 -476 309 476 -282 507 343 -201 357 693 78 297 447 -187 202
1759 202 844 -6 -205 1044 113 228 866 185 304 541 14 -203 661 100 -324 623 -41 -315 106 52
1779 52 -541 158 -4 -753 186 59 -709 -69 200 -722 -631 188 -551 -464 -110 -440 -389 -48 -278 -372 179 -410
1801 -410 -560 261 -257 -460 214 -247 -432 293 -62 -518 164 294 -667 373 435 -625 170 358 -108 504
1821 504 328 -245 135 571 -176 52 614 -129 -9 810 -89 -65 548 93 -71 571 -62 38 680 101
1841 101 36 342 125 -87 282 225 -200 447 259 -414 9 232 -217 166 159 -365 -61 174 -544 -104 136
1862 136 -621 -344 188 -302 -548 229 -374 -633 139 -232 -522 90 -356 -305 -8 -242 -365 63 -38 -278
$$ packed form
1719a6j15l41J54N39j024L83M83n76L60J83m62K20P09q99K03N57l31k74L95P0
1739B18n26O90m36l56Q61P5j002P85J67p58P89j64n44N58L36o15K19J50o34L89
1759B02O42q50j99J249r31J15O38o81J19K37n27k17Q64n61m24R47o64k74M21n4
1779E2n93O99j62p49R39j27p68O40K69r22R1Q19p39Q7L54l30N1L41k30r4N51n89
1801d10j50Q21n18k03O74m61j85P25l55m56O82J30r61J040O2j060P95J88m66O12
1821E04j76n73L80M36p47K28N62p43J20Q19q99K4O13m55j64O42o33J00O42n79
1841A01o5L06k17k12L69n7m25O47j88o73M23K23m49L83pn24L04K35p18M40K40
1862A36p57K77N32m90k46P77o03k59P72l71k90O12m46N1K97k34j23M28j01k40
$$ plain form
1882 -278 40 67 -554 169 -102 -48 -15 417 -558 112 336 -154 473 465 182 129 393 -153 13 412 150 232
1904 232 595 352 177 346 153 -48 786 140 -2 353 261 -158 651 372 -168 604 162 -232 150 101 -85
1925 -85 111 144 -386 -134 350 -115 -344 382 -325 -348 68 -608 -553 213 -296 -576 333 -374 -678 164 -401
1946 -401 -817 17 -89 -429 -9 5 -583 105 -352 -723 -273 -4 -374 9 -69 -277 -69 22 -307 67 169
1967 169 -199 134 297 21 -138 367 293 -95 382 191 203 207 348 -107 184 259 3 389 492 103 372 510
1989 510 218 292 432 142 94 531 -359 -68 569 -251 -364 440 -206 -276 383 -183 -207 161 -469 -222 102
2010 102 -239 -429 73 -288 -390 -101 -456 -124 -257 -459 -427 6 -138 -336 -183 -280 -438 -403 -200 -204 -519 -188
2032 -188 -25 -202 -89 -265 -32 92 25 -196 267 190 -98 512 62 124 218 125 71 195 191 -175 220 387 -130
$$ packed form
1882b78L18K7o21P23k71N4L3M32r75O70K24m90O27qk83n3K64n46J66L99k62Q2
1904B32L63k43j75J69j93k01Q34o46j42L55r2m19Q09k79n40P72m42l94L82m9j86
1925h5J96L3n30K52M84m65k29P26p07k3M16o76N5P66n09k80R09p07l04Q42n65
1946d01m16Q34j06l40M20J4n88O88m57l71M50K69l70L83p8k08K08R1l29L74J02
1967A69l68L33J63k76j59N05p4l88M77j91J2MJ41m55K91P5k56L86J03l89K69J38
1989E10k92P4J40k90m8M37q90K91O37q20j13Q04o46p0O59n66k4L68o30K47L24
2010A02l41j90N02l61j02K89l55L32j33k02L2M33j44j98J53r7j58L5K03ml15L31
2032a88J63j77J13j76K33J24o7k21M63p7k88O10m50O2R4r3n4J24ml66L95J67n17
$$ plain form
2055 -130 440 221 -171 434 330 -147 361 461 186 201 259 -51 237 463 77 313 437 -254 175 86 -132
2076 -132 88 144 -70 -101 208 -42 -117 -24 -64 -302 44 -109 -215 -91 -187 -220 -267 -376 -428 -79 -211 -391 -225
2099 -225 -106 -473 -589 104 -273 -379 83 -160 -428 315 -141 -183 85 -189 -313 97 -250 -278 158 156 96 203
2121 203 -16 -124 396 192 -56 181 326 63 259 320 39 647 194 119 260 66 17 242 323 68 421
2142 421 348 -64 301 359 15 -35 29 20 177 30 -256 -20 132 90 -186 67 2 -86 -295 146 -306 -395 -22
2165 -22 -373 -86 -96 -182 -499 -45 -498 -571 207 -200 -275 -115 -403 -218 36 -175 -281 90 -354 -294 39 -38
2187 -38 -37 130 -64 -279 -45 -87 29 232 -71 -58 103 -32 97 183 5 225 221 151 119 279 289 331 149 0
2211 0 408 86 0 236 94 137 69 202 17 125 -10 92 313 -156 -144 -11 -19 -80 -154 -51 167 20 -384
$$ packed form
2055a30N70k19l92O05j04m77N08J00k75J5N8l10K88K26l86K36J24o91M29q9k18
2076a32K20N6k14l1L09k50p5R3m0k38L46j53j06J24r6l3m7j09n2L49j32j80J66
2099b25J19l67j16O93l77j06M62k43k68P43m56m2K68k74j24M10l47k8M36ko0J07
2121B03k19j08N20k04k48K37J45k63J96O1k81O08m53p5J41j94m9K25Q1k55L53
2142D21p3m12L65N8l44n0O4rJ57j47k86K36J52m2k76K53o5q8k09M41m52q9L73
2165b2l51K87j0q6l17M54m53p3P78m07p5J60k88J85K54k11j06L71m44O0L33p7
2187c8JJ67j94k15K34m2J16K03l03J3J61j35J29Q6j78K20mp0l2J60J0M2j82j49
2211@M08l22q6K36j42M3o8J33j85J08j35J02K21m69J2J33qo1p4J03K18j47m04
$$ plain form
2234 -384 256 28 -367 -120 -108 -160 -200 -85 -357 -28 155 -497 -200 125 -420 -253 81 -481 -265 -104 69
2255 69 -188 73 -509 -71 104 -433 -383 -129 -224 -229 40 -99 268 -136 -5 242 -2 14 4 267 109 196 144
2278 144 56 309 -33 415 31 25 263 345 -97 196 460 -90 349 188 61 38 202 112 388 149 -199 190
2300 190 269 -220 263 199 -83 -22 -134 -330 251 -10 -395 0 -215 -247 -254 -17 -211 87 -87 -144 -73 -161 -540
2323 -540 -194 -138 0 21 97 -189 14 -644 -103 127 -168 -27 14 -250 -250 -38 -174 -19 -247 -21 91 45
2345 45 45 -95 8 33 98 -104 -180 216 243 177 297 273 58 397 43 59 293 -36 -54 193 15 214 370 342
2369 342 120 279 -4 -31 188 -64 -53 452 152 99 333 -121 73 100 -225 169 17 -99 -46 -68 -138 -127 -56
2392 -56 -380 -89 -402 -287 -123 -120 -155 8 -155 -109 -90 -292 152 -89 -298 27 -70 -276 -140 -166 -481 -314 367
$$ packed form
2234c84O40k28l95K47J2n2m0J15k72L29J83o52K97L25n45J67L34n62K16J61J73
2255F9k57K61n82M38J75n37N0K54r5nK69j39L67m04J31K47k44J6j0K63j58Q7n2
2278A44q8K53l42M48l84oK38Q2m42K93K64n50M39j61j27k3J64r0K76k39l48L89
2300A90P9m89M83o4k82O1j12j96N81k61l85L95k15l2pK37j94K98j74n7P1q8l79
2323e40L46N6J38K1P6k86K03o58N41K30k95J41M1k64%K12j36J55k28K26J12m6
2345D5%j40J03K5O5k02p6L96K7o6J20k4k15L39l54J6K34l29j8K47j78J99J56k8
2369C42k22J59k83k7K19k52J1N05l00n3K34m54J94K7l25L94j52j16N3k2p0J1P1
2392e6l24K91l13J15J64Ll5J63j63M6J9k02M44k41k09L25r7k06J36k6l15J67O81
$$ plain form
2415 367 -210 -190 35 -204 -336 -52 -143 -3 75 31 82 131 -41 147 399 49 41 238 -114 142 230 -33 25
2438 25 261 -405 277 156 168 447 252 22 173 330 172 248 -111 -286 150 176 111 293 179 6 4 -147
2460 -147 -282 223 -285 -200 -69 -196 -161 -161 -399 -116 -5 -176 -27 -332 -389 -113 -392 -517 -136 -121 -370 -45
2482 -45 -79 -221 -31 -189 -255 -73 92 -33 -8 -273 -80 252 52 -197 165 62 -341 79 105 -160 357 157
2504 157 162 29 84 -7 191 137 272 -11 -35 170 152 199 37 286 16 263 -60 151 337 88 -63 163 33
2527 33 -56 201 -38 -170 162 52 -362 9 -94 -264 20 -351 -73 72 -155 -509 -76 -243 -76 -63 -328
2548 -328 -311 185 -156 -321 63 -243 -270 150 -349 -157 20 -91 -206 78 74 -115 230 -166 -214 146 -38 116
2570 116 -33 -19 -109 -65 -42 189 156 28 125 162 182 152 105 377 123 -106 1 -13 -79 144 282 102 404 131
$$ packed form
2415C67n77K0K25k39j32K84r1J40P8m4N1M9j72J88K52l50qJ97l52K56Q8k63N8
2438B5K36o66O82j21J2K79j95k30J51J57j58P6l59j75M36K6o5J82j14j73kj51
2460a47j35N05n08Q5J31j27L5%k38K83J11j71J49l05n7K76k79j25L81J5k49L25
2482d5l4j42J90j58o6J82J65j25K5k65J93L32k00k49L62j03m03M20K6k65N17k00
2504A57Nj33N5r1J98n4J35k83k4K05j8M7j62K49k70K47l23K11J86k49j51K26j30
2527C3q9K57k39j32L32j10m14L71j03j70K84l71K78J45k27l54M33j67J67J3k65
2548c28J7M96l41j65L84l06k7M20m99J92J77j11j15K84mj89L45l96m8L60j84J54
2570A16j49J4r0M4K3K31l3j28R7L7K0l0m7K72k54k29J07j4o6K23J38j80L02k73
$$ plain form
2594 131 -55 335 227 91 288 245 -57 311 266 114 108 229 75 -83 108 -161 -188 93 -64 13 -54 -158
2616 -158 267 103 -170 -283 -2 -184 -80 130 -96 -161 -139 -160 -182 -118 -4 -454 7 7 -238 20 -188 117
2638 117 -296 -103 -33 -145 254 -99 59 -56 121 211 52 -52 -178 96 158 18 138 200 -267 35 63 204
2660 204 142 175 86 156 172 -52 260 259 12 63 5 100 183 103 283 135 143 -61 258 16 -69 244 -53 110 33
2685 33 16 130 -55 -93 -83 -120 129 128 -64 -176 175 -73 -207 -77 -144 60 -100 -281 77 -31 -345 -134 -142
2708 -142 -168 -176 28 -177 -337 -18 -169 -421 -5 -137 -157 126 -214 -88 -130 145 -61 214 -247 79 -37 -150
2730 -150 188 -11 66 -67 505 136 227 407 424 -1 41 51 116 136 18 -45 -68 176 248 0 180 132 -161 195
2754 195 30 -57 147 76 150 -13 53 28 127 -37 -136 51 245 -7 143 11 -70 140 53 -440 -236 53 -317
$$ packed form
2594A31j86L90j08j36J97m3l02L68m5j52oJ21j54j58J91k69k7K81j57P7o7j04
2616a58M25j64k73j13K81j82J04K10k26o5K2k1k2O4J14m50M61%k45K58k08L05
2638A17m13J93P0j12L99l53J58j15J77R0j59j04j26K74O2j40J20O2m67L02K8J41
2660B04o2L3q9P0J6k24L12jk47N1n8R5Q3q0J80j48Qk04L19k42q5L13k97J63p7
2685C3j7J14j85l8J0l7K49jj92j12L51k48j34J30o7K04j60j81L58j08l14K11q
2708a42k6qK04k05j60L19j51k52M16j32k0K83l40J26m2K75k06K75m61L26j16j13
2730a50L38j99P7j33N72l69R1J80J7m25M2J0O5K0j18o3k3K44P2k48J80m8k93L56
2754A95j65q7K04p1P4j63O6k5R9j64r9J87J94k52J50j32q1K10q7m93K04K89l70
$$ plain form
2777 -317 -247 -258 78 -150 -292 -153 -98 111 -11 -68 123 -21 66 84 36 -44 -24 19 -123 4 2 53 -30 -43 195
2802 195 123 21 145 225 217 267 69 -177 184 -20 167 159 191 284 87 241 168 194 -270 365 67 -120 273 69
2826 69 29 219 159 84 269 -177 -75 132 53 -159 98 -177 -354 141 84 -69 -14 86 -175 -142 -202 37 117
2849 117 -225 -208 32 -235 77 -9 104 84 -352 -276 52 -5 -194 -82 -88 -203 -64 -20 34 -34 36 -8 29 -129
2873 -129 -94 -1 -133 111 230 -92 -50 144 212 33 301 67 154 141 -154 -43 207 147 207 282 147 91 184 132
2897 132 1 396 -29 223 257 158 332 -5 -300 19 31 41 -99 130 -170 37 73 3 39 -80 62 163
2919 163 40 23 -10 25 -41 -205 55 17 123 43 37 93 -56 -73 171 -163 -87 -212 -33 13 105 -151 23 -23 -43
2944 -43 31 169 -139 -123 48 -141 62 -73 91 -35 52 147 38 -110 46 83 237 -215 185 332 -105 422
$$ packed form
2777c17P0j1L36k28j42J39N5K09j22n7J91j44Q7J8m8q0K0M3j42J27kN1q3j3K38
2802A95p2j02J24Q0qN0j98k46L61k04J87qL2R3j97J54p3K6m64O35k98j87L93k04
2826F9m0J90o0p5J85m46J02K07p9k12K57k75j77M95n7j53N5J00k61L3o0K39Q0
2849A17l42J7K40k67L12q6J13k0m36P6L28n7j89J12oj15J39M4N4o8P0m4L7j58
2873a29L5R3j32K44J19l22M2J94O8j79K68k34Q7j3k95J11K50o0O0P5j35n6R3n2
2897A32j31L95m25K52L4r9J74l37k95L19J2J0j40K29l00K07L6p0L6j19J42J01
2919A63j23j7l3L5o6j64K60l8J06q0oN6j49j7K44l34P6j25J79M6R2k56J74m6k0
2944d3P4J38l08J6J71j89K03j35J64j26Q7R5j09j48J56L7J54m52M00J47m37N27
$$ plain form
2966 422 376 -46 94 119 36 243 199 116 279 45 -86 203 -133 107 147 294 280 -18 123 132 141 3 -20 89
2990 89 -111 54 -38 -38 75 -26 -199 -38 -8 -32 -136 -165 -155 234 -90 -142 227 -170 -159 13 -160 -153 -155 21 -141
3015 -141 -12 169 -163 -136 -118 -271 -124 -63 -142 255 -282 -255 -60 137 -169 -17 -238 51 -19 315 -81 228
3037 228 65 -73 249 141 199 114 -112 315 287 26 460 -14 -61 -142 63 288 151 146 -133 89 30 -18 56
3060 56 159 133 80 -138 -193 -103 -50 110 -48 20 -51 77 21 23 163 -48 -350 160 -189 -129 -276 -177 74 -23 -7
3085 -7 -150 -127 -581 -214 -65 -118 -261 202 -240 267 125 -307 45 169 -115 -30 58 -27 -132 7 -170 94
3107 94 101 -44 187 149 222 77 160 222 29 14 202 77 179 -116 31 112 219 229 149 208 108 168 407 5
3131 5 -82 119 -34 0 70 318 12 10 -20 -44 59 38 -127 128 -50 75 68 232 -218 20 69 -242 -119 21
$$ packed form
2966D22m6m22J40K5q3K07m4q3J63k34j31K89l36K40M0J47j4k98J41RRj38k3J09
2990H9k00J65r2%J13j01j73J61L0k4j04k9J0L89l24n2L69l97J1J72j73PkJ76j62
3015a41J29J81l32K7J8j53J47O1p9L97n37K7J95J97l06J52k21K89p0L34l96L09
3037B28j63j38L22j08N8q5k26M27k8k61M34m74m7q1K05K25j37nk79K22n9m8P4
3060E6J03k6n3k18n5R0N3J60j58O8p1J28n6KJ40k11l02N10l49O0j47R9K51r7J6
3085gj43K3m54L67J49n3j43M63m42N07j42m32L52J24k84Q5Q8q5j05J39j77K64
3107I4Pj45K31l8P3j45Q3O2j93j5J88j25J02k95J47Q1J07J0q0N9j00O0K39m02
3131Eq7K01j53L4P0K48l06kl0k4J03k1j65K55j78J25pJ64m50K38M9l11J23J40
$$ plain form
3155 21 -429 -179 -140 -179 -163 -200 -74 -160 105 -93 -7 -61 -114 -245 -41 17 -248 10 144 0 -41 59 11 99
3179 99 107 -42 107 2 14 -196 -45 108 216 124 280 16 -94 165 161 -143 15 289 334 221 -85 133 235
3202 235 97 236 -123 -48 -100 286 -74 7 229 9 57 -39 -78 -127 -94 -172 -255 -53 -302 12 -247 -365 -19
3225 -19 -33 83 48 -68 -14 -184 -97 -406 -91 -127 17 -131 94 -144 -36 274 -188 -50 -130 73 -259 184
3247 184 14 -74 -43 -45 -86 -59 29 -186 -18 189 -23 65 369 -6 36 213 121 163 8 -113 -56 289 109 146
3271 146 180 62 234 -76 83 96 135 22 94 217 126 34 126 304 17 122 120 59 51 62 -28 92 67 -225 110
3296 110 162 -100 198 33 -86 29 8 -243 -264 -17 61 17 -41 -63 -158 28 152 96 -37 17 102 -147 -53 139
3320 139 -135 -214 -229 -189 -173 -61 97 163 -61 100 38 -29 8 -133 100 96 212 86 -83 102 187 -45 81 -28
$$ packed form
3155B1m50K50L9l9J6l7J26q6K65j98Q6n4n3j31K04N8k65K58J34j44m1J00m8Q8
3179I9Qj49J49j05J2k10J51J53J08r2J56k64j10K59ml04J58K74M5j13l06K18J02
3202B35j38J39l59P5n2L86l60Q1K22k20M8r6l9m9L3p8q3K02k49L14k59j18L46
3225a9j4J16l5j16N4j70Q7l09L15l6J44j48K25k38J08L10m62J38q0K03l32M43
3247A84j70q8L1km1K7Q8k15J68K07k12Q8L04l75M2J77r2M2j55j21N7L45j80L7
3271A46L4j18J72l10J59J3L9j13P2J23r1r2R2J78k87J05ko1qJ1r0J20k5k92L35
3296A10N2k62K98j65j19J15k1k51k1K47P8m4n8k2r5J86J24n6j33N4Q5k49R4J92
3320A39k74p9j5M0J6J12J58O6k24J61o2o7L7j41K33mJ16j26j69J85Q5k32J26j09
$$ plain form
3344 -28 28 81 28 74 -100 27 51 295 57 35 100 -28 45 -63 61 189 202 248 -95 -37 -69 -62 198 110 34 51
3370 51 -162 47 -313 185 -123 -201 73 88 64 -9 174 -244 90 -20 -4 -10 -382 113 176 90 -146 -27 -121 -228
3394 -228 -158 -261 -175 13 105 152 -133 -55 18 20 -35 -198 235 181 16 215 84 -6 -12 234 67 -34 -199 78
3418 78 39 2 60 9 177 399 137 138 -143 -9 163 22 -102 213 20 -39 -107 337 221 34 177 -118 -9
3441 -9 159 -18 -26 25 147 41 -22 -250 183 -218 -49 -117 13 -73 -53 -242 -117 -97 -265 124 -147 -74 -232 -98
3465 -98 131 147 120 -5 -55 58 -118 -101 2 -15 -171 -99 -235 -59 -74 -56 -125 -33 -73 231 123 -237 53 -30
3489 -30 -25 134 -88 -77 -12 82 222 205 116 47 -163 75 304 -18 -10 172 143 9 113 52 -86 179 -2 -218
3513 -218 226 218 112 142 -36 -210 39 -132 -56 -24 31 -210 14 -17 -356 -22 -212 -65 67 40 140 -81 15
$$ packed form
3344b8N6N3n3M6j74J27K4K44k38k2O5j28P3j08J24J28J3M6l43N8l2PK60q8p6J7
3370E1k13K09l60M98l08p8K74J5k4p3J83m18L34j10J6ol72M95O3q6k36J19r4j07
3394b28P0j03Q6J88R2M7k85P8P3Kn5j63M33n4j65J99j31r0oK46j67j01j65K77
3418G8l9l7N8n1J68K22k62Jk81J34J72j41j24L15j93n9o8M44j16j87J43k95J09
3441iJ68j77qN1J22j06o3k28M33m01J69o8J30q6K0j89J25K0j68L89k71P3j58J34
3465i8K29J6k7j25n0J13j76J7J03j7j56P2j36J76j5J8o9R2m0L04j08l60K90q3
3489c0NJ59k22J1O5R4J40j7q9o9k10K38K29l22QJ82k9j34J04o1j38K65j81k16
3513b18M44qj06L0j78j74K49j71P6L2N5k41K24l1l39L34j90J47J32k7J00k21R6
$$ plain form
3536 15 8 -329 -361 -133 -172 60 46 131 -65 -316 21 -249 -27 -131 -36 -238 -61 -129 427 -44 -120 -143 -95 -97 -47
3561 -47 100 126 377 186 -100 160 273 41 90 316 78 116 143 152 108 329 180 84 79 -55 145 196 -214 136
3585 136 164 -52 121 -302 -305 184 -93 -185 -44 -39 65 109 -70 -103 -66 -33 -116 -135 -222 -181 -50 6 -138 -63 -9 -224
3611 -224 -26 -367 47 103 -232 -281 89 -71 -60 -76 29 -80 9 -88 84 -96 -154 134 15 -146 -256 172
3633 172 -241 69 -164 -27 252 228 253 73 36 16 -11 12 10 203 148 30 128 18 341 250 22 26 126 188 15
3658 15 122 90 70 17 -42 214 153 -16 122 -69 165 192 111 36 116 -21 -225 -18 -25 29 52 -144 41 -110 -70
3683 -70 -75 25 -51 165 106 90 -235 59 -290 -188 7 38 -388 -110 -91 103 34 -185 -263 -31 -73 -78 -20 -238 145
3708 145 44 156 -97 -216 145 289 81 -77 33 98 26 130 141 121 -286 53 53 122 -5 135 188 218 275
$$ packed form
3536A5pl37l2K28l9K32j4Q5j96k51L37k70K22j04R5k02J77o8N56m71p6k3M8kN0
3561d7J47K6K51j91k86K60J13k32M9K26k38L8K7Rm4K21j49r6nj34K00N1m10L50
3585A36K8k16J73m23lM89k77r2J41NJ04M4j79l3L7L3q3j9q7M1J31N6j44P5N4k15
3611b24J98l41M14N6l35m9L70j60J1j6J05j09Q9r7J72j80n8K88j19j61j10M28
3633A72m13L10k33J37K79k4K5j80l7k0k7K3kJ93n5j18R8j10L23r1k28MJ00O2j73
3658A5J07l2k0n3n9K56o1j69J38j91K34K7q1p5Q0j37k04K07pN4K3j96J85j51M0
3683g0nJ00p6K16n9j6l25K94l49J02J95L1m26K78J9J94o9k19p8K32m2nN8k18L83
3708A45j01J12k53j19L61J44k08j58J10O5p2J04J1k0m07L39%O9j27J40N3L0N7
$$ plain form
3731 275 172 59 204 200 0 -23 126 155 168 32 91 6 12 -52 158 -108 -185 20 54 15 -315 -71 28 4 -15
3756 -15 -181 87 178 -359 -158 -196 -67 -30 -13 -159 21 -98 -97 110 -63 -18 148 206 63 -92 37 -54 -165
3779 -165 198 39 -74 3 63 291 45 96 158 -86 145 37 115 362 100 201 120 -160 101 168 -64 50
3801 50 141 -32 106 91 300 -54 76 211 86 153 -203 -180 67 -75 -159 111 -125 -170 161 83 92 -215 -2
3824 -2 -87 -136 -231 -147 -7 4 -13 108 -186 -46 -8 31 102 -304 -163 -117 -115 -37 -266 -283 -108 -244 -72 25 -167 43
3850 43 39 -98 95 169 -84 -244 -230 117 70 -245 -161 49 0 -1 6 -90 55 -101 -59 175 152 89 11 145 186 -130
3876 -130 211 199 278 200 137 190 46 33 163 16 84 185 138 36 183 -21 -13 13 220 -156 56 4 83 -43
3900 -43 71 -44 190 -30 -57 -8 -55 -297 83 -120 -30 -245 -80 -22 73 -14 -114 -265 70 48 -227 -13 -108
$$ packed form
3731B75j03j13J45mk00k3J49K9J3j36N9q5Oo4K10k66p7K05L4l9l30K44R9k4j9
3756a5j66K68R1n37K01l8J29L7J7j46J80j19JK07j73M5J66N8j43j55J29r1j11
3779a65L63j59j13P7O0K28k46N1O2k44K31j08P8K47k62J01q1k80K61O7k32J14
3801E0R1j73J38j5K09l54J30J35j25O7l56K3K47j42q4K70k36m5L31p8Rl07K13
3824bq5m9r5Q4J40J1j7J21k94J40L8L9P1m06J41M6KP8k29j7J75j36J72R7j92K10
3850D3mj37J93P4k53j60J4L47m7l15Q4K10m9jPr6J45j56M2K34k3o3p8J34M1l16
3876a30L41j2P9p8o3N3j44j3J30j47O8J01m7j02J47k04QK6K07l76K12n2P9j26
3900d3J14j15K34k20k7M9m7k42L80k03R0k15J65N8R5q7j00j51L35k2k75K14r5
$$ plain form
3923 -108 -329 -185 -153 170 133 -344 -47 -144 86 -55 -12 -123 51 -153 217 -132 9 -135 -8 48 -142 -55
3945 -55 88 -36 99 83 79 -5 361 314 359 -156 -144 189 155 212 -3 68 19 269 171 336 180 326 -110 -120 14
3970 14 111 123 185 -72 -172 -192 111 -110 -86 118 17 114 -55 -137 -327 -241 -311 39 -64 -222 -84 208 157 -207
3994 -207 -122 -205 -275 -4 -270 55 21 38 5 -59 -27 36 126 -29 -25 5 -17 -59 309 -43 165 -182 148 194 94
4019 94 157 237 -16 -100 441 39 51 320 -245 47 -160 277 274 -69 176 84 63 -130 430 -74 -161 181 -42
4042 -42 148 -68 74 -74 36 -96 177 60 -44 -37 135 23 -138 44 56 -76 146 -98 -196 -38 -47 79
4064 79 44 37 0 -109 -39 -16 -43 -115 28 -114 -1 -68 -153 -77 -115 -33 -62 -51 66 129 -77 -155 15 149 -141 87
4090 87 86 128 -171 -144 -71 89 -223 -53 224 0 234 -133 10 -132 258 43 285 14 188 109 77 -48 284
$$ packed form
3923a08k21J44L2L23l7m77K97r7K30j41M3j11J74k04L70l49J41j44J27N6j90Q7
3945e5J43j24J35j6mq4L66m7M5n15J2L33l4N7k15P1m9K50r8J65j56J46m36j0J34
3970A4R7J2O2k57j00k0L03k21K4K04j01R7j69q2j90Q6p0L50j03j58J38K92n1l64
3994b07Q5q3p0K71k66L25l4J7l3o4L2O3R0j55ML0k2m2L68l52K08l47L30M6j00
4019I4O3Q0k53q4N41m02J2K69n65K92k07M37ll43K45r2k1j93N60n04q7L42k23
4042d2J90k16J42j48J10j32K73j17j04PJ72j12j61J82J2j32K22k44r8J58rJ26
4064G9l5pl7j09P0K3k7p2J43j42J13o7q5P6l8Q2k9J1J17O3k06p8J70J34k90K28
4090H7jM2k99K7P3J60l12J70K77k24K34l67J43j42L90k15K42k71J74p9l2j25L32
$$ plain form
4113 284 125 132 -37 304 79 -76 168 -181 21 -144 227 -26 -108 4 209 22 -112 -164 -156 -169 12 -137
4135 -137 -51 -145 -120 103 -145 72 -57 67 -94 -110 145 228 -49 152 -222 9 -161 -223 -41 -108 -171 -19 -129
4158 -129 -224 104 273 41 66 44 -336 -273 54 -39 -206 105 46 -53 160 151 57 -88 -28 -49 -124 33 -35 208 149
4183 149 97 50 179 29 327 -58 -115 -164 -74 92 86 57 -72 -115 196 -56 -34 92 -48 -5 165 -65 -41 -11
4207 -11 6 215 101 160 -211 26 35 113 21 -150 -208 -83 -163 -178 -103 71 63 -193 37 12 77 -111 36 -93 -279
4232 -279 -27 143 9 179 -200 -73 -81 100 340 4 236 139 33 129 -37 26 -51 -69 9 2 -211 14 31 72
4256 72 162 68 -19 -60 -166 251 -2 -80 306 136 -92 91 39 -153 176 75 -26 252 65 -166 -155 -79 -32
4279 -32 -138 -117 -138 -36 108 93 -76 -89 99 -128 99 76 -227 -55 -108 61 145 -101 -96 243 26 34 126 150 162
$$ packed form
4113B84j59Pj69L41k25j55K44l49K02j65L71k53q2J12K05j87j34n2Qj3J81j49
4135a37Q6r4K5K23k48K17j29J24j61j6K55Q3k77K01l74K31j70o2J82o7o3J52j10
4158a29r5L28J69k32K5k2l80O3L27r3j67L11n9r9K13rr4j45O0k1p5J57o8K43n9
4183A49n2m7J29j50K98l85n7m9R0J66ok9j29m3L11k52K2J26j40M3J70k30K4L0
4207a1J7K09j14N9l71K37RP8r2j71n8J25q0j5P5J74qk56K30k5O5j88J47j29j86
4232b79K52J70j34J70l79J27qJ81K40l36K32r7j06R6j66O3p7j8P8pk13K25J7M1
4256G2R0r4q7m1j06M17k53p8L86j70k28J83n2j92L29j01j01K78j87k31J1P6M7
4279c2j06K1k1J02J44j5j69j3J88k27K27k3l03J72n3J69Q4k46NL39k17QR2K4J2
$$ plain form
4304 162 163 -39 -34 111 23 -107 127 62 78 -16 133 -136 69 161 -84 18 1 22 -67 -18 261 -6 2 82 125 -49
4330 -49 -98 -59 182 7 150 98 4 -33 -169 -236 45 -49 -51 -143 13 19 196 13 -256 -176 -73 190 233 81 15
4355 15 25 149 51 4 184 -95 232 -322 -137 -102 -42 -27 -220 -7 44 -34 12 -228 148 -24 105 -61 72
4378 72 -33 56 -43 -136 86 -83 97 80 7 4 -26 -147 373 -35 150 -74 35 -29 60 -139 52 -172 166 -2
4402 -2 -15 89 -27 72 -126 -55 137 163 -212 60 -38 82 -21 -248 -1 16 -48 -38 -66 3 434 250 26 46
4426 46 -94 -274 -96 -23 39 -50 91 -421 -169 248 -27 -46 -228 72 -104 30 -192 -31 27 -4 176 -95
4448 -95 -158 153 69 -190 -124 -108 86 2 -193 285 -77 77 -74 308 -29 115 -64 -86 151 -63 -179 -14
4470 -14 -20 -30 -55 -17 88 27 49 -47 219 -26 48 38 167 51 158 243 126 85 46 221 -63 32 21 6 -55 64
$$ packed form
4304A62Jk02NJ45q8j30K34o5J6r4J49k69K05R2k45J02j7K1q9M9K79k67QQ0M3j74
4330d9m9L9K41j75J43n2r4l7j36o7K81r4kr2J56OJ77j83k69Q0J03K63M3j52o6
4355A5J0J24r8m7J80k79L27n54J85L5O0J5j93K13N1p8M6k40L76j72J29j66J33
4378G2j05Q9r9r3K22j69J80j7p3ll0j21N20m08J85k24J09o4Q9j99J91k24L38j68
4402bj3J04j16R9j98P1J92K6l75K72r8J20j03k27K47J7o4J0k8O9M31j84k24K0
4426D6j40j80J78P3O2q9J41n12K52M17k75j9j82L00j76J34k22J61N8l1J80k71
4448i5o3L11q4k59O6J6J94q4j95M78l62J54j51L82l37J44j79k2K37k14j16J65
4470a4oj0k5L8J05o1K2r6K66k45P4j0J29j16J07Q5j17m1l9J75k84R5j1j5o1J19
$$ plain form
4496 64 54 174 198 157 97 163 -219 46 -127 68 -156 -228 -73 137 112 -209 39 55 -43 185 -30 -81 -202 -46
4520 -46 -129 -23 -310 -127 81 -70 -167 -150 54 40 37 295 260 32 51 96 10 -148 110 48 87 15 -51 16 -123
4545 -123 -5 55 -15 193 -171 147 -304 59 -85 150 102 70 -43 -59 136 163 117 57 74 156 27 16 134 -32
4569 -32 -7 155 -16 -77 -124 163 149 40 39 -69 219 -55 57 -247 125 -73 -13 -150 -53 -198 -93 81 -138
4592 -138 85 -75 -13 -75 93 -54 -128 -54 -63 25 -34 85 172 140 -128 197 136 -204 -166 -10 75 77 8 -43 84 -99
4618 -99 69 176 124 37 -49 81 128 -57 260 -72 -108 211 1 275 -93 105 -24 203 -162 299 208 -83
4640 -83 64 -140 32 -268 -70 170 -13 119 59 329 39 -88 68 5 1 26 137 -9 43 -14 -110 -4 -77
4663 -77 103 239 63 -4 -150 -252 -86 108 81 -184 -110 58 -290 -92 190 146 -100 -22 155 -183 -237 -49
$$ packed form
4496F4j0J20K4m1o0O6l82K65j73J95k24p2J55K10k5l21K48J6r8K28k15n1j21J56
4520d6q3J06k87J83K08j51r7J7K04j4lK58l5k28J9M5q6j58K58o2L9p2o6O7j39
4545a23J18O0p0K08l64L18m51L63j44K35m8l2j13j6J95K7m6o0J7Q2j29j1J18j66
4569c2K5J62j71o1m7K87j4j09jj08K88k74J12l04L72j98O0j37R7j45J05J74k19
4592a38K23j60O2o2J68j47p4P4rQ8n9J19Q7l2k68L25o1l40L8J56Q5Ko9n1J27j83
4618i9J68J07n2q7q6J30M7j85L17l32l6L19k10K74l68J98j29K27l65M61r1k91
4640h3J47k04J72l00J98K40j83J32o0K70k90j27J56o3mK5J11j46N2n7r6J06p3
4663g7J80J36j76o7j46j02J66J94k7k65P4J68l48J98K82m4k46P8J77l38n4J88
$$ plain form
4685 -49 -76 103 198 32 94 -73 -174 34 -12 264 96 107 8 32 151 -230 179 99 -150 81 81 -46 287 -25
4709 -25 -82 302 -19 81 -116 -53 -33 -14 157 350 40 -221 -60 -89 278 88 -210 -169 42 -282 117 -113
4731 -113 69 -78 -108 67 -51 -258 -182 -136 57 60 6 151 -47 -48 -41 -164 82 -22 250 75 -128 202 -45
4754 -45 50 -100 31 0 -69 -30 144 -74 -6 55 -56 -11 -33 10 -9 -11 110 -10 65 23 231 419 -105 75 -141
4779 -141 83 266 -7 -312 -303 -42 -39 -70 -36 179 -29 -216 -374 -161 239 150 -200 151 -13 -61 -175 -278 -63
4802 -63 65 -197 -104 -142 -79 16 -10 52 -15 34 131 -90 183 -184 -49 -53 -15 132 10 -92 132 -61 49 30 -210
4827 -210 -107 -225 160 66 -69 7 86 -55 -55 40 8 296 15 61 73 63 -285 -67 206 120 -85 62 -87 -152
4851 -152 -101 208 17 116 118 264 -9 20 216 -4 -41 -193 -154 -173 -64 78 -62 -11 -67 -191 -5 93 32 -58
$$ packed form
4685d9k7J79R5j66O2j67j01K08m6K76j68J1r9K4J19l81M09q0k49K31%j27L33l12
4709b5n7L84l21J00j97O3K0J9J71J93l10k61J61k9L67j90k98M1K11l24L99k30
4731a13J82j47l0J75j18k07P6M6J93Ln4J45j98jPj23K46j04K72j75k03L30k47
4754d5R5j50J31l1o9L9J74k18O8O1j11M5k2M3j9kJ21j20P5m2K08J88n24J80k16
4779a41K24J83k73l05RK61Ll1L4K15k08j87j58K13M00q9l50L51j64m8j14j03K15
4802f3J28k62R3l8O3R5k6O2o7M9R7k21K73l67J35mL8J47j22j02K24j93J10j9k40
4827b10J03j18L85r4j35P6P9j41%R5l2K88k81M6J2j0l48K18K73q6k05J47j49o5
4851a52N1L09j91R9KJ46k73K9J96k20l7j52L9j9J09J42j40N1n6j24J86R8o1r0
$$ plain form
4875 -58 -138 20 -228 0 69 178 -110 2 138 -149 23 -100 41 24 -133 -32 -45 117 136 -154 217 -140
4897 -140 72 -43 211 96 14 76 -93 -17 48 -224 180 31 -162 -189 -162 -80 -104 -99 -86 -78 78 -90 -46 -5 -50
4922 -50 116 36 -61 -98 -120 39 -46 99 -109 -126 27 3 110 173 48 -214 37 70 -79 -76 -157 10 -313 -36
4946 -36 169 20 168 26 26 40 77 97 133 20 -83 -19 -142 84 247 -21 123 -50 -182 2 8 -52 77 19
4970 19 61 106 132 0 -199 82 66 121 141 -9 -29 -111 -63 -133 -46 57 80 7 84 432 -63 -57 96 -167 -24 145
4996 145 -25 -183 -33 -222 171 360 -25 184 -138 11 -180 46 169 -34 -159 -166 -21 -103 -48 -13 -33 82
5018 82 34 99 39 256 -5 -56 -14 -137 -27 -49 39 10 -96 -55 -198 -7 -147 -124 103 68 -169 -112 68 -100
5042 -100 231 66 -4 188 -168 -61 27 -8 7 -16 -19 -99 110 -12 -163 52 -51 38 143 0 -2 97 -189 -71
$$ packed form
4875e8q0J58k48K28O9J09k88J12J36k87J72j23J41j7j57J01j3J62J9k90L71l57
4897a40K12j15K54j15q2O2j69P6O5k72M04j49j93k7K7Q2k4NJ3QJ56j68M4M1m5
4922e0J66q0r7l7k2J59q5J45k08j7J53k4J07O3j25k62K51L3j49Lq1J67l23K77
4946c6K05j49J48j42%J4L7K0L6j13j03O4j23K26J63k68J44j73j32J84Oo0J29n8
4970A9M2M5K6j32j99K81j6N5K0j50k0q2M8p0Q7J03K3p3P7L48m95OJ53k63J43J69
4996A45j70j58J50j89L93J89l85K09l22J49j91K26J23k03j25pJ45q2N5L5k0J15
5018H2m8O5o0K17k61n1M2j23J10k2Q8k9j06M1j43J91j40K3K27l5k37N7J80j68
5042a00L31j65p0J92l56J07Q8l5J5k3lq0K09j22j51K15j03Q9J05j43kR9k86J18
$$ plain form
5066 -71 -11 -201 13 -167 -53 15 95 -183 118 112 45 130 -154 -126 185 8 165 139 -40 66 -115 -107 -89 134
5090 134 -150 61 275 -136 171 -26 -31 246 -9 139 -42 -39 -27 103 -45 34 90 29 157 -51 332 -89 118
5113 118 -128 24 -201 -54 -24 -205 -47 95 22 116 -35 -71 100 31 -54 72 74 33 -13 -3 44 -93 -58 -43 -85
5138 -85 -110 55 -366 -8 -108 -174 23 160 116 -3 152 56 -128 -143 -103 -88 -41 73 -62 5 54 55 88 -159 -14
5163 -14 33 114 260 -106 -3 161 -8 -16 228 74 78 123 186 -123 51 14 35 110 -142 -45 -85 188 -72 -53 -127
5188 -127 -58 -194 -100 -4 9 -90 -8 -172 92 -236 -187 -39 -74 -166 42 181 -39 -37 165 72 -407 -66 -105 208
5212 208 -155 -58 3 -19 54 92 20 306 117 -79 20 203 -174 138 -227 -9 46 279 -11 -66 106 109 -47 330
5236 330 -45 -263 -22 -68 179 133 -4 10 19 30 -159 -258 85 -5 -39 52 204 110 -94 -271 84 24 257 -17
$$ packed form
5066g1O0j90K14j80J14O8Q0k78L01oo7Q5k84K8L11j77J57k6j79J06j81QJ8K23
5090A34k84K11K14m11L07j97nK77k55J48j81LJ2J30j48P9N6o1J28k08L83m21K07
5113A18k46J52k25J47L0j81J58J42p3R4j51l6J71o9q5J26Km1m6J0M7j37L5J5m2
5138h5k5J65m21L58j00o6J97J37m4j19J55r6j84j5M0J5M7J14j35O7M9JL3k47J45
5163a4M7Q1J46l66J03J64j69qK44j54MM5O3l09J74l7K1P5k52R7m0K73k60J9p4
5188a27O9j36R4R6J3r9Q2j64K64l28M9J48l5r2K08J39k20KK02r3m79L41l9L13
5212B08l63R7O1k2P3L8p2K86j89j96R9J83l77L12l65K18N5K33k90n5J72Lj56L77
5236C30l75k18K41m6K47m6j37J4RJ1j89r9L43r0l4R1J52r4k04j77L55o0K33k74
$$ plain form
5260 -17 13 16 -21 -48 -129 -56 56 -117 49 65 -17 -20 -298 172 66 15 -219 105 14 -173 -194 -18 -234 -91 -16
5285 -16 112 54 53 -14 12 -23 -135 -38 -8 -87 -107 -190 -82 188 219 301 -56 160 -273 38 58 -159 -96 -153 289 -119
5311 -119 277 -12 37 71 33 42 163 -226 -44 120 54 -198 -67 207 -63 76 -46 194 84 82 -66 -392 66
5334 66 -14 -24 -58 -3 -204 -173 150 -45 205 96 -13 -42 53 72 -104 -185 158 -49 -154 -107 108 -110 -54 -209
5358 -209 -176 74 -4 56 -46 -69 125 91 21 -219 -4 109 -112 56 -52 -98 72 -172 56 38 -3 -38 76
5381 76 33 -21 39 221 22 135 109 93 -44 54 179 13 -177 -32 29 98 -70 43 201 -49 70 92 26 -82
5405 -82 386 -96 -200 -104 261 -71 5 -22 11 -34 -52 -14 64 81 -317 -99 -104 91 -68 -17 210 -17 137 237
5429 237 -231 -337 -35 -85 -55 78 -15 -18 -126 -26 158 80 17 46 -134 -76 -180 -128 -207 187 -62 117 47 52 7
$$ packed form
5260a7L0Ll7k7q1P3J12j73J66J6q2lk78M70j06n1k34L24r1j87k1J76k16J43P5
5285a6J28n8jo7K6l5j12R7L0p9k0q3J08K70L1Q2l57K16m33L11K0k17O3n7M42m08
5311a19L96k89M9L4l8RJ21l89J82J64o6k52J31K74k70J39j22K40j10kj48l26M58
5334F6q0j0l4N5k01L1L23j95K50j09j09k9R5J9j76q1L43k07j05M7K15k18N6j55
5358b09L3K50p8O0j02k3J94l4p0k40K15J13k21J68j08m6J70k44K28j8m1l5J14
5381G6m3n4O0J82j99J13k6j6j37R8J25j66j90J45O1O9j68J13J58k50J19K2o6j08
5405h2M68m82j04R6L65l32P6k7L3m5j8L8P8J7l98K18nJ95j59N1K27k27J54J00
5429B37m68j06L02n0L0J33r3lj08J00J84p8o3K9j80N8j04N2p9L94k49J79p0Nm5
$$ plain form
5454 7 -93 128 57 158 244 72 61 36 -94 105 103 -69 -115 141 277 264 84 -80 -13 179 144 68 15 -25 -19 211
5480 211 131 35 30 -10 -204 -31 -119 -143 -201 -281 34 51 264 -34 -80 38 77 -79 153 -103 280 177 -145 85
5504 85 -73 -24 146 334 -33 -203 -251 -198 -195 18 -267 -167 -16 29 182 -76 162 144 150 133 -65 80 60 -223
5528 -223 95 132 335 -58 99 -43 -232 124 62 188 165 -156 53 13 327 6 -25 195 -127 154 -49 -28
5550 -28 -123 -138 106 109 -29 -207 122 -11 241 -170 -118 5 89 -249 25 118 -121 143 78 -78 -196 -385 -218
5573 -218 -191 237 73 170 -79 -73 223 88 -170 -28 -143 4 -83 -114 83 315 -38 -443 7 174 -105 60
5595 60 -14 -114 -272 -10 -160 -95 -114 27 192 36 77 95 -113 63 61 93 288 -8 36 -79 -117 -39 -285 -8
5619 -8 0 -145 2 179 104 -194 -83 -74 1 -119 87 -79 -4 58 143 -223 -173 -146 28 47 83 -107 -150 29 -118
$$ packed form
5454Gj00K21p1J01Q6j72j1k5j30J99kj72m6K56J36j3j80j64O7J92l5p6n3m0OK30
5480B11q0r6nm0j94J73q8k4n8q0L15J7K13k98m6J18L9j56K32k56L83j03l22K30
5504H5j58M9J70J88l67j70m8N3LK13k85J00J51M5J53k58K38j8Oj7j98J45k0k83
5528b23L18L7K03l93J57j42j89L56o2J26k3l21K09m0L14l21l1K20l22K81k03K1
5550b8r5j5K44Lj38j78L29j33K52m11N2J23Q4l38K74R3k39K64o5j56j18j89J67
5573b18K7M28j64R7k49OK96j35k58J42j15J47q7l1J97K32l53m05M50J67k79J65
5595F0p4j00j58K62j50O5j9J41J65j56M1J8k08J76kL2J95k96M4j15l8P8k46K77
5619hQj45J47J77p5k98J11RP5j20K06j66P5O2Q5l66N0K7J74J9L6j90m3J79j47
$$ plain form
5644 -118 54 -46 262 86 -162 -192 44 -316 19 -77 51 13 -85 103 -94 -127 144 -63 -154 120 -114 -63
5666 -63 -10 -23 -100 168 -55 9 -64 -159 -16 -157 275 -148 15 228 6 -79 205 64 158 -24 -227 45 -34
5689 -34 -190 -54 28 254 79 179 143 75 27 22 111 152 24 148 134 131 -44 63 -206 -123 -21 -202 -146 -26 48
5714 48 207 -377 -150 75 -157 -129 132 71 -106 -221 -194 -73 37 -48 5 42 -92 145 49 50 117 58 -150 -302
5738 -302 -255 -96 158 44 -24 -60 311 117 3 202 -15 90 -89 -35 -41 -131 -24 -139 23 62 15 38 -228
5761 -228 177 -393 -37 -188 131 120 5 -131 192 -226 -132 115 71 38 123 -19 74 -133 -67 -341 221 -52
5783 -52 -105 49 -62 -26 108 156 100 53 89 154 33 23 -71 -48 32 -10 8 2 -88 -236 207 -140 130 -109 27 -142
5809 -142 177 36 -159 24 -203 -112 -38 97 -104 -131 32 58 -12 -3 38 -16 -68 -16 145 -61 89 -146 -19 137
$$ packed form
5644a18J72j00L08j76k48l0K36l60L35r6J28l8r8J88j97l3K71k07r1K74k34N1
5666f3N3j3p7K68k23O4p3r5J43j41M32m23J63K13k22q5K84j41R4j82k03K72p9
5689c4j56J36Q2K26j75J00l6o8m8nQ9M1j28J24j4lj75J07k69Q3J02j81N6J20P4
5714D8J59n84K27K25k32K8K61o1j77j15K7J21J10q5N3L7j34K37r6JO7n9k08j52
5738c02M7J59K54j14o8l6L71j94j14J99k17J05j79N4or0J07j15J62L9m7K3k66
5761b28M05n70L56j51L19j1j15j36L23m18R4K47m4l3Q5j42R3k07O6k74N62k73
5783e2n3J54j11L6J34M8n6m7L6O5j21j0r4K3Q0m2J8or0j48M43l47K70k39J36j69
5809a42L19j41j95J83k27R1P4J35k01k7J63K6p0RM1n4n2N2J61k06J50k35J27J56
$$ plain form
5833 137 162 -96 -128 76 3 -120 53 -212 85 -115 94 6 38 160 165 198 -3 -3 187 -66 74 -121 94
5856 94 -198 -1 -268 199 53 95 193 -232 -239 -271 -50 21 144 -99 180 -41 -157 156 176 -45 -47 -154 -133 179
5880 179 72 -215 41 -100 -181 87 -274 -133 47 127 39 258 18 -80 -69 -194 -218 156 -51 30 66 -113 163
5903 163 21 277 18 -294 -113 27 20 49 48 -38 -120 -90 71 -40 89 -24 32 68 26 155 29 -47 -265 149
5927 149 0 235 -36 81 -113 -14 31 142 -113 36 66 -120 57 -78 184 94 -135 -157 229 21 -190 7
5949 7 -226 143 -207 -214 -31 80 -121 48 190 -167 -246 -284 -3 22 -70 64 199 -121 -134 50 8 -286 82
5972 82 -153 -85 -3 -270 -38 -107 -42 -122 187 -76 112 114 185 99 -98 -7 34 104 38 -80 175 197 -50 141 214
5997 214 -94 173 171 41 128 -74 -45 -214 34 -155 82 181 227 -207 -8 -45 262 -97 -170 168 139 -13 -15 138
$$ packed form
5833A37K5k58l2K04p3j23J73k65K97k00K09q8L2J22NL3k01%J90k53J40j95K15
5856I4k92J97k67M67j46M2R8m25pl2K21P1J23k43K79k21j16L13K0k21kj07K1L12
5880A79j07k87K56j41q1K68l61J41J80Q0q8K19k40r8J1j25k4L74k07Q1L6j79K76
5903A63j42K56k59l12J81J40pK9jq6q2L0J61j11J29j13N6L6m2J29j26p6k18M14
5927A49j49K35k71J17j94R9M5J11k55J49L0j86J77j35K62r0k29k2L86k08k11J97
5949Gk33L69l50pJ83J11k01J69J42l57p9l8K81K5r2J34J35l20j3J84m2k94L68
5972H2k35O8Q2k67K32o9O5q0L09k63J88KP1q6j97R1M1P0o6j18K55K2k47J91P3
5997B14l08K67kj30Q7k02K9j69K48j89K37R9M6m34J99l7L07l59p3L38k9j52kJ53
$$ plain form
6021 138 -45 -44 -102 41 159 -45 -54 -112 -49 -118 -88 -27 17 -115 -82 47 42 42 11 135 -16 -189 -58 186 -209 173
6047 173 30 -92 -109 156 -78 -164 -58 167 129 -94 79 -123 -186 60 130 90 -198 68 46 31 -130 9 -64
6070 -64 260 105 -110 67 -11 -201 106 -248 -41 71 97 76 80 -10 178 -128 15 14 -143 -11 -74 -53 161 -210
6094 -210 40 -48 19 11 -209 -28 128 -72 37 -76 186 178 -27 58 -191 -62 133 -47 71 -43 53 -100 165
6117 165 -119 -132 -36 45 -177 104 94 90 38 154 -57 129 -138 70 96 133 -65 142 -81 -198 35 192 24
6140 24 -10 76 -110 -245 -202 -53 66 20 24 114 60 115 74 94 116 -4 91 -116 3 -9 -320 -297 -11 19 -12 169
6166 169 -74 198 114 -164 100 -90 82 -184 210 82 -43 -145 188 -99 -73 55 42 160 -165 10 71
6187 71 46 -36 55 18 132 -117 -73 -124 -150 115 -182 16 -92 186 82 60 83 -15 94 -114 193 123 90 149 -45
$$ packed form
6021A38j83Jn8J43J18k04rn8O3o9L0O1M4j32L3J29n%l1J24j51j73J31K44l95L82
6047A73j43j22j7K65k34q6J06K25l8k23J73k02o3K46P0m0k88K66k2j5j61J39p3
6070f4L24j55k15J77p8j90L07l54K07J12K6k1Mr0J88l06J43jj57J32o3K1K14l71
6094b10K50q8O7qk20J81J56k00J09j13K62qk05Q5k49J29J95j80J18j14R6j53K65
6117A65k84j3R6Q1k22K81j0mn2J16k11J86k67K08K6L7j98K07k23j17K33J57j68
6140B4l4Q6j86j35M3J49J19m6MR0n4N5m1K0K2j20R5k07J19j2l11K3K86L0l1J81
6166A69k43K72q4k78K64j90J72k66L94j28j25j02L33k87K6J28j3J18l25J75O1
6187G1k5q2R1l7J14k49M4n1k6K65k97J98j08K78j04k2K3r8J09k08L07p0l3N9j94
$$ plain form
6212 -45 62 139 -151 234 -307 51 -83 129 80 -230 -79 4 2 186 -84 -162 105 3 -138 26 23 -157 64
6235 64 -22 -80 46 93 -137 -23 -71 74 51 -187 92 130 -145 336 -207 -126 -113 25 -21 13 -2 -103 -62 -111 39
6260 39 -214 -98 109 240 -26 -13 -242 -38 -108 -208 -87 199 128 121 194 22 165 34 4 72 64 131 -119 7
6284 7 9 2 -100 190 -67 114 -88 -85 117 81 -191 160 183 -127 -141 199 184 -24 123 -34 -197 -56 -97 55
6308 55 13 68 106 119 -41 240 -23 -70 9 -285 -50 214 -201 -176 -28 -50 -38 -184 36 40 -120 -71 23 70 -101
6333 -101 71 -13 41 -269 -101 74 -89 69 -121 -166 95 -369 67 -11 165 -44 -78 -118 -36 62 20 16 42 -96
6357 -96 62 -26 8 240 188 10 16 194 -149 -80 -206 68 -173 72 -309 71 -138 151 18 158 -27 -33 -56
6380 -56 66 142 75 137 -146 -68 19 -88 -21 -92 -141 -70 -147 189 274 162 -91 -44 232 -169 123 -2 -80 -144 121
$$ packed form
6212d5J07P7k90L85n41L58j34K12m9l10J51Q3kJ84k70p8K67j02j41J64lj80K21
6235F4q6n8J26M7k30J14m8J45k3k38K79L8k75M81n43Q1J3J38m6L4j5j01M1m9J50
6260C9k53J16K07J31k66J3k29K04p0j00J21K86p1pP3j72J43j31l0O8qO7k50J26
6284GKpj02K90k57J81k02LK02l6k72L51K3l10j4L40j5k08J47j57j63J41m1J52
6308E5m2N5L8J3j60K81k63m7P9k94K35K64m15K5J48k2J2j46K20Mj60M9R4M7j71
6333a01J72q4N4l10J68J75j63J58j90m5K61m64M36p8J76k09l4m0Q2R8m2mK6j38
6357i6J58q8L4K32n2j78OJ78l43O9j26K74k41K45l81L80k09K89j33J40j85ok3
6380e6J22P6o7O2k83P8Q7j07O7p1m9P1p7L36Q5j12k53M7K76m01K92j25p8o4K65
$$ plain form
6405 121 98 234 117 -31 280 -125 15 -43 217 144 174 6 6 204 -44 -2 298 -26 -88 262 35 54 75
6428 75 115 -4 -100 189 -34 63 7 15 40 -153 187 96 13 -63 21 -107 276 135 -208 22 -45 186 64 -4 123
6453 123 74 -131 121 113 127 68 -10 201 -129 129 61 33 -6 50 248 12 346 7 276 -3 -41 89 -292 -27
6477 -27 -222 -6 -128 175 -68 24 62 21 -200 76 -119 -162 -200 2 -208 -136 -103 -30 58 -37 -78 55 -44 -155
6501 -155 -2 -11 26 -90 25 197 -98 -52 62 84 60 202 16 105 59 129 -21 85 34 -146 -32 101 1
6524 1 168 -58 -152 321 -180 98 196 -66 -25 161 161 245 70 42 -123 220 -79 72 -56 -233 29 -68 106
6547 106 198 -175 -12 -198 -26 5 55 -190 -9 -20 13 -73 87 -53 -155 184 118 5 -47 167 173 -12 222
6570 222 6 -160 70 -52 206 234 -51 3 14 -84 145 68 -150 50 -234 119 195 47 -99 -45 72 -52
$$ packed form
6405A21k3J36j17j48L11m05J40n8K60p3L0j68%J98k48M2L00l24o2L50k27J9K1
6428G5M0j19r6K89k23R7n6QK5j93L40r1q3p6Q4j28L83j41l43K30o7K31j22o8J27
6453A23m9k05K52qJ4n9p8K11l30K58o8k8l9N6J98k36L34l39K69k79l8J30l81K65
6477b7j95K16j22L03k43R2L8m1k21K76j95m3l8K02k10P2L3P3Q8r5m1J33r9j11
6501a55J53rL7j16J15J72k95M6J14K2k4J42j86Q9m6P0j50J06n1j80J14J33j00
6524AJ67k26r4M73n01K78R8k62M1J86%Q4j75k8j65L43k99J51j28j77K62r7J74
6547A06R2l73J63j86J72L1N0k45J81j1L3q6J60j40j02L39o6j13n2K14Oj85K34
6570B22k16j66K30j22K58K8k85N4J1r8K29p7k18K00k84L53P6j48j46N4J17j24
$$ plain form
6592 -52 -72 29 -32 -100 -53 -72 -11 -242 40 -167 94 -63 -10 225 -40 153 105 -56 -5 61 116 -1 160 118
6616 118 -47 66 187 39 -122 43 156 226 139 -102 89 33 29 -76 117 -142 -19 -117 -122 -237 44 39 76 -66
6640 -66 -9 82 -151 41 -124 -101 -40 59 143 -14 -199 -63 -47 -63 -115 -205 168 44 -233 -57 -143 -332 52 -33
6664 -33 -160 242 108 -295 256 -7 -90 153 -18 336 -162 23 86 56 33 -208 129 -48 -98 23 -30 116
6686 116 1 -120 59 4 -10 -82 11 57 6 -237 -102 53 36 -57 147 49 190 -225 -115 -210 -61 -22 121 -157
6710 -157 46 -125 -184 -41 169 76 -72 2 39 -81 -237 137 -89 -200 -221 -148 -195 91 15 83 14 198 133 171
6734 171 27 -119 18 -129 76 143 -83 131 -30 -203 -153 36 -101 37 15 -124 27 -323 132 128 -188 84
6756 84 5 -77 -47 -3 -115 5 -156 41 -146 49 31 -269 -52 184 20 248 221 -16 -8 -152 -184 -166 -173 113
$$ packed form
6592e2k0J01o1o8M7j9O1k31K82k07K61j57N3K35k65J93m8j61N1O6N5j17J61m2
6616A18j65J13J21j48j61J65J13P0q7k41J91n6mj05J93k59J23r8nj15K81nL7j42
6640f6N7R1k33J92j65K3O1R9Q4j57j85J36J6j6n2r0L73j24k77J76q6j89L84q5
6664c3j27M02j34m03N51k63q3K43j71L54m98J85O3l0k3k41L37j77n0J21n3J46
6686A16j15j21J79n5j4p2R3M6n1k43J35J55j7r3K04r8J41m15J10r5J49L9J43k78
6710a57K03j71n9J43K10r3j48P4L7j20j56L74k26j11k1P3m7K86p6O8o9J84o5L8
6734A71j44j46J37j47K05O7k26K14j61j73N0J89j37J38k2j39J51l50M55ml16K72
6756H4p9q2L0M4j12J20j61J97j87J95j8l00K17K36j64K28k7k37Qj44l2J8pK86
$$ plain form
6780 113 -4 -164 146 -171 -51 53 -125 -3 -33 178 81 -79 -93 -92 174 -161 -220 198 -82 36 139 116
6802 116 79 285 -56 -131 -321 -198 70 199 133 -32 48 72 -140 -18 198 -12 10 18 85 -142 -166 -72 -3 -168
6826 -168 -29 115 -232 -149 214 241 -49 -16 22 -13 53 -121 -48 -156 -49 5 182 164 -118 -91 -24 3 -84 338
6850 338 -226 -13 101 -78 -45 82 -59 21 -153 77 -84 -11 182 -42 12 48 -197 96 78 -12 -85 -186 -128
6873 -128 -93 -57 118 187 -277 157 -151 83 -207 -111 -208 124 290 0 -1 -22 -2 -93 -27 248 156 -48 -95 129
6897 129 306 127 28 -165 13 -86 177 32 83 5 -136 77 -34 84 -72 99 1 14 -171 -155 199 69
6919 69 -7 -175 -134 102 275 -264 143 60 22 11 -189 74 -83 13 -64 227 229 86 -230 148 -95 59 140 59
6943 59 51 210 -46 -37 -109 125 40 -57 -99 -314 -104 1 -165 75 63 17 -29 -75 -67 164 23 315 40 -76 -92
$$ packed form
6780A13j17j60L10l17J20J04j78J22l0K11r7j60j4JK66l35n9M18k80J18J03k3
6802A16l7K06l41p5j90J23K68J29o6j65Q0K4k12J22K16k10K2QO7k27k4R4O9j65
6826a68J39J44l47Q3L63K7k90L3L8l5O6j74P3j08J07N4J77j8k82K7O7K7q7M22
6850C38n64K13J14j79L3J27j41Q0j74K30j61P3J93k24N4L6k45K93j8r0p3j01N8
6873a28L5L6J75O9m64M34l08K34k90R6r7L32J66k90jk1K0r1O6K75r2k04m7K24
6897A29J77j79r9j93J78r9K63j45N1p8j41K13j11J18j56J71r8J3j85J6L54j30
6919F9p6j68M1K36J73n39M07q3l8j1k00K63j57R6p7K91Kj43l16L78k43J54Q1q1
6943E9qJ59k56Rp2K34q5r7m2k15K10J05j66K40j2m6m6m6QK31j41K92k75j16j6
$$ plain form
6968 -92 -238 -324 38 114 58 3 94 338 117 2 -59 -54 -126 206 -133 -70 -46 17 -161 109 68 -115 195 -70 -34
6993 -34 -162 -27 172 -13 -70 241 -2 218 29 -82 145 -75 -97 30 -218 2 -8 130 42 -99 -39 -44 -55
7016 -55 136 -19 -293 65 -148 39 45 -14 -89 195 72 -133 -117 51 215 46 22 191 202 103 1 27 -147
7039 -147 18 -48 -268 226 -14 -68 99 71 -235 16 -6 1 -156 62 169 216 10 -204 61 -85 92 -118
7061 -118 -9 112 166 9 126 15 112 -24 59 -147 137 15 -30 -84 25 42 -334 -105 -43 -32 -180 28 86
7084 86 -44 -36 -192 8 -158 67 110 -29 20 -22 52 -175 -80 -152 91 15 268 -59 128 75 37 -6 -12 75 71 -102
7110 -102 -48 -95 -193 7 -146 145 94 286 -126 10 -89 10 -113 38 91 -73 -73 92 -185 110 74 -83 -71 -7
7134 -7 94 62 -161 152 53 121 -160 -20 -278 -7 106 -53 -120 43 87 177 -62 -137 126 -32 35 -12 -65 -7
$$ packed form
6968i2j46q6L62P6n6n5R1K44k21j15o1Np2L32l39O3K4O3j78K70m1j83L10k65L6
6993c4j28J35J99j85n7L11k43K20j89j11K27k20k2J27k48K20j0J38q8j41O0nj1
7016e5J91j55k74L58k13J87On9p5K84j23k05J6J68J64j69k4J69J1r9j02K6j74
7039a47J65o6k20M94k40n4J67k8l06K51k2Pj57K18J07M7k06k14K65j46J77k10
7061a18J09J21N4j57J17j11R7j36Q3k06K84j22m5n4J09J7l76K29O2J1j48K08N8
7084H6j30Qj56K00j66K25M3j39M9m2P4k27R5p2K43p6K53l27J87n3l8m3oQ7mj73
7110a02N4m7r8K00j53K91n1J92m12J36r9R9j23J51N3j64%J65k77K95l6j57J2O4
7134gJ01l2k23L13r9O8k81J40k58K71J13j59o7J63M4R0k39p5K63j58O7m7n3N8
$$ plain form
7158 -7 -20 146 199 -247 -7 -97 -116 -190 -173 -112 281 -24 30 33 -44 134 -201 -79 86 11 27 91 14 -44 80 27
7184 27 -4 -81 -27 99 -132 -29 59 67 -178 29 46 -14 -112 -25 -17 -192 137 -100 77 -100 65 1 -75 278 116
7209 116 47 99 129 33 264 98 44 -11 -120 192 64 -172 164 18 -80 73 46 -151 -70 -140 86 8 130 -84
7233 -84 41 66 -34 129 -45 130 31 -79 -71 81 -143 -68 286 -218 -89 -109 -155 -76 -18 46 114 -9 -38 46 -6
7258 -6 -94 -149 205 -94 317 79 -24 33 65 -75 209 -127 98 -31 46 -114 -153 365 -117 -35 -95 -186 16 -95
7282 -95 140 -82 -228 58 57 -175 85 -64 -96 115 -27 106 -8 36 -134 205 42 198 187 -16 130 -91
7304 -91 152 30 -203 -70 -15 -141 -60 -87 -43 201 0 -29 51 -9 -37 76 109 -159 -82 -1 184 -177 23 -159
7328 -159 79 64 -27 -119 5 58 38 65 -123 164 -29 -137 7 42 -40 -7 189 -49 -193 78 75 124 147 -103
$$ packed form
7158gj3J66N3m46K40r0j9p4J7O1L93l05N4Lp7J78l35J22J65p5J6O4p7n8J24n3
7184B7l1p7N4J26k31J03Q8Qk45K07J7o0r8Q7Qj75L29k37J77j77J65o4p6L53j62
7209A16o9N2L0r6K31j66n4n5j09L12j28k36L36j46r8J53k7j97Q1p0K26p8J22k14
7233h4J25K5j00J63j74J75r9j10QJ52k24P5L54n04J29k0m6P9N8O4O8j23k9Q4n2
7258fq8n5L54k99M11k38j03N7L2j40K84l36K25j29P7j60l9N18m82Q2o0r1K02j11
7282i5K35k22j46K86jk32K60j49l2K11j42J33j14M4j70L39j63J56j1k03J46k21
7304i1K43j22k33J33N5j26Q1k7M4K44k01k9Q0o0k8J13L3k68P7Q1J85l61K00j82
7328a59K38j5r1r2J24N3k0K7j88K87j93j08J44L5q2L3J96k38j44K71lM9K3k50
$$ plain form
7352 -103 -136 -22 75 -10 -43 58 -165 54 -57 60 -185 106 87 -103 243 -51 -40 -1 -167 138 -15 78 -33
7375 -33 -40 -24 201 -118 19 -231 -195 -104 -54 -199 -41 174 -27 -67 -140 -120 -51 57 105 75 83 223 185 -323 100
7400 100 61 -29 197 -104 -108 90 80 -146 -140 57 -66 -33 230 -141 -33 -128 223 182 -78 235 -21 14 -39 34
7424 34 -57 -155 100 24 68 56 29 83 98 12 83 13 -30 -8 -265 200 -159 -105 84 -95 -103 15 38 116 -65 -134 -12
7451 -12 39 66 -254 -71 345 -162 78 -101 82 207 -120 -372 97 16 -126 88 106 -278 -80 110 -46 -41
7473 -41 145 64 -175 132 -11 -201 -81 -111 -141 72 -38 64 138 135 125 96 -4 -27 -27 -25 -92 -37 -134 163 16 -56
7499 -56 -114 -73 112 -139 11 -13 110 -25 -19 19 -59 -283 -101 -116 109 106 -212 -37 -22 71 -121 70 136 -18 -7
7524 -7 23 -66 181 -10 -50 -120 -20 -71 158 -147 -29 -24 -61 137 38 -43 -65 -14 -268 68 106 -48 137 -63 19
$$ packed form
7352a03l3J14R7q5l3J01k23K19j11J17k45K91j9j90L46k94J1L9j66L05j53R3j11
7375c3pJ6K25l19J37k50L6R1N0j45J58K15k01m0p3K0O9J08M8l0QJ40l8n08M23
7400A00l9r0K26l01mJ98j0k26OJ97j23L3K63l71J08r5L51m1k60L13k56L5n3P3
7424C4r1r8K55p6M4j2k7N4J5q6P1p0m3K2k57M65l59N4J89j79qJ18K3P8j81o9J22
7451a2N1K7l20J83M16n07K40j79J83J25l27k52M69q1j42K14J8l84J98J90j56N
7473d1J86q1k39L07j43j90J20l0l0K13j10J02P4lj0k9j00k3%Ko7N5r7K97j47p2
7499e6n8M1J85k51J50k4J23j35OL8p8k24J82j5K25ll18J75J5R3j92J91O6j54J1
7524gL0q9K47j91m0p0J00n1K29l05J18Nl7J98r9q1k2N1k54L36L8j54J85k00Q2
$$ plain form
7549 19 -296 -159 68 96 52 209 -183 -84 40 -174 -175 -27 -164 80 44 325 -83 8 121 -56 62 -76 -16
7572 -16 30 -68 -306 61 140 -5 2 -43 -17 86 67 154 155 -29 107 119 164 36 36 -39 3 -232 65 -81 168 -149
7598 -149 -120 85 -242 -145 93 60 5 79 -83 178 -194 -97 -172 -96 142 76 -70 51 -292 160 208 -191 30
7621 30 -201 -64 30 -234 -119 34 183 61 39 123 -46 -192 -100 -181 -41 171 -123 -208 -65 -28 44 -47 -54 -179
7645 -179 0 55 336 64 122 26 -101 47 -23 160 -53 70 -74 46 215 264 33 -245 38 16 181 -56
7667 -56 79 -64 -72 36 -78 -60 -2 -33 135 49 -30 -5 213 46 122 -130 -58 -107 -54 25 42 -84 -201 96 -13
7692 -13 88 -69 -180 268 259 11 15 81 -65 82 -69 -117 -71 -72 175 -173 -49 -161 -3 -101 -17 -253 -156 -45
7716 -45 63 -130 222 116 -216 -4 -42 114 -161 57 -26 61 130 -57 -65 -96 -54 -97 21 12 8 48 17 -18 -84 218
$$ packed form
7549A9l15J37K27K8m4J57l92R9J24k14jJ48j37K44l6K81m08R1J13j77J18j38O0
7572a6M6r8k38L67P9j45Pm5K6J03j9Q7Jj84J36J2M5j28%p5M2k35K97j46K49l17
7598a49K9K05l27R7K38l3n5P4j62K61l72R7p5P6K38o6j46J21l43M52M8l99K21
7621C0k31J37R4k64J15J53J49j22k2Q4j69j46R2q1J40K12k94q5J43L7P2r1pj25
7645a79J79N5K81k72N8r6j27J48p0J83k13J23j44J20J69M9k31k78K83k2J65k37
7667e6J35j43qJ08j14J8N8l1J68q6p9K5K18j67P6k52P2m9N3P9J7j26j17K97j09
7692a3J01j57j11M48rk48MO6j46J47j51m8M6jK47l48J24j12J58r8Q4k36R7J11
7716d5J08j93L52j06l32K12l8J56k75K18q3Q7O9j87ql1M2m3J18rmM0l1l5o6L02
$$ plain form
7742 218 -53 11 -234 -145 -81 142 87 -111 -51 37 68 238 -2 -120 -24 -85 22 136 96 -34 146 150 147 184 -162
7767 -162 3 152 49 60 -115 -52 96 155 -104 -28 -187 30 -166 -40 -128 92 42 42 -74 25 226 -90 -161
7790 -161 34 -22 -143 328 32 -112 142 3 14 -58 -106 34 46 126 93 -103 178 119 -248 27 -195 32 -265
7813 -265 4 -13 126 101 -25 -206 -63 -80 -73 204 123 9 -20 -83 93 -55 115 334 -178 -67 2 -117 4
7836 4 37 -107 138 28 -109 10 -28 44 123 9 28 195 206 -162 142 103 22 -81 -52 -101 -138 -135 -182 452 58
7861 58 -204 -189 241 7 -180 -6 -104 -191 -68 5 6 -128 158 -200 -12 -186 59 253 -146 103 89 -54 55
7884 55 -17 -153 78 158 -80 -1 209 -23 130 64 161 70 103 -85 -80 -8 280 -59 29 107 -52 2 -180 -105 -15
7909 -15 -41 172 -207 -231 15 -109 54 -47 92 73 -31 -5 105 9 -134 -265 -4 -74 -118 -129 4 169 -117
$$ packed form
7742B18k71O4k45Q9O4K23n5j98O0Q8L1J70k40j18R6o1J07J14m0j30J80MlL7l46
7767a62J65J49j03J1j75O3J48N9k59P6j59K17j96J26q8K20n0%j16R9K01l16p1
7790a61J95n6j21M71k96j44K54j39J1p2m8J40J2Q0l3j96K81n9l67K75k22K27k97
7813b65K69j7J39k5j26j81J43j7PK77q1j14k9o3J76j48J70K19n12J11O9j19J21
7836DL3j44K45j10j37J19l8P2P9j14J9J67J1l68L04l9q1j03K9m9l7Lm7O34l94
7861E8k62J5M30k34j87J74r8q7J23P3Jj34K86l58J88j74K45J94l99K49j4j43J09
7884E5p2j36K31Q0k38P9K10k32J53o6R7r1L3j88NP2K88l39Q8P8j59N4j82P5R0
7909a5k6K13l79k4K46j24J63j01J39j9j04K6J10r6j43j31K61p0m4j1J33J65k86
$$ plain form
7932 -117 110 -281 -10 193 -20 35 127 97 -48 -144 213 0 33 -14 101 -167 -124 -106 26 232 -116 -97 84
7955 84 209 -17 -41 4 -42 130 17 -145 -88 36 266 87 33 166 199 -3 -100 60 113 51 24 36 7 22 99
7980 99 29 26 -61 47 86 -155 59 -79 -121 131 246 -248 -31 86 -157 -31 -181 -51 233 74 -143 -106 65
8003 65 -29 -96 2 -131 -97 -14 -35 115 342 10 -58 -125 246 -41 30 214 12 10 -205 -121 -79 -225 -190 -19 -98
8028 -98 84 9 -34 103 96 27 -42 75 183 2 -67 -184 -161 27 199 205 -174 -51 -75 -19 126 -60 -128 -254 -18
8053 -18 -243 -68 83 58 166 204 -7 13 71 -282 52 -131 -89 -264 -433 98 90 38 -33 85 -2 -22 -82 -84 27
8078 27 -138 -46 -7 44 58 78 -195 -193 -48 55 91 -8 -94 54 195 -122 36 24 75 -187 118 -62 -2 40 114
8103 114 82 -275 -45 -196 -46 -207 -33 -113 153 24 32 -54 53 -143 -65 192 184 32 12 -136 39 -31 2 -129
$$ packed form
7932a17K27l91K71K03k13N5R2l0j45r6L57k13L3m7J15k68M3J8J32K06l48J9J81
7955H4J25k26k4M5m6J72j13j62N7J24K30j79n4J33L3k02r7J60N3o2k7J2k9J5P7
7980I9p0lq7J08L9k41K14j38m2K52J15m94K17J17k43J26j50J30K84j59k17L7J71
8003F5r4o7R8j33L4Q3k1J50K27l32o8o7L71k87P1J84k02kk15Q4M2j46L5J71p9
8028i8J82p5m3J37po9o9J17J08j81o9j17K3J88J72Ol79J23k4N6J45j86o8j26K36
8053a8k25J75J51k5J08L8k11K0N8l53L34j83M2j75j69N31qn2p1J18q7k0o0kJ11
8078B7j65R2L9N1J4K0k73KJ45J03L6r9q6J48J41l17J58j2N1k62L05j80O0M2P4
8103A14l2l57K30j51J50j61J74q0K66j29Qq6J07j96P8K57qj52k0j48J75p0L3j31
$$ plain form
8127 -129 110 298 24 75 -81 -207 -97 -108 -82 165 190 24 194 -185 86 167 89 -134 -82 -106 209 -93 -126
8150 -126 -73 -125 20 -77 -219 -72 208 80 47 -37 256 152 48 42 116 84 -65 -67 89 120 70 -404 163 -284
8174 -284 89 -25 14 -109 191 260 -96 -2 -10 -81 6 -11 71 -109 -171 -116 70
$$ packed form
8127a29K39J88k74N1j56j26J10j1K6K47K5j66J70l79K71Q1p8k23N2k4L15l02l3
8150a26N3n2J45r7j42J47K80j28l3q4K93j04j04oP4l2j49kJ56L1n0m74N67m47
8174b84L73j14L9j23L00O9l56R4qp1Q7j7Q2j80o2N5J86
8191G0
$$ Imaginary data points
##PAGE= N=2
##DATA TABLE= (X++(I..I)), XYDATA
$$ plain form
0 0 0 0 0 0 0 0 0 0 -8 8 -8 8 -8 16 -17 24 -25 32 -41 55 -64 77 -89 105 -127 150 -174 200 -230 265 -304
31 -304 350 -398 448 -510 575 -647 725 -811 904 -1008 1123 -1247 1382 -1528 1690 -1868 2059
48 2059 -2272 2499 -2754 3034 -3344 3687 -4067 4495 -4978 5532 -6167 6910 -7785 8843
62 8843 -10145 11796 -13963 16943 -21324 28429 -42420 129493 -438939 -13567 509994 -493664
74 -493664 -546 460340 -406375 -69492 457372 -359860 -85486 396579 -271474 -121138
84 -121138 347258 -205009 -123009 268803 -125827 -125770 195863 -63437 -106632 109928 -903
95 -903 -85485 33865 42477 -48548 -45081 81465 -11954 -111770 105538 30486 -171143 120640
107 120640 72014 -218459 126353 111346 -254830 125588 143746 -277056 116899 171155 -289783
$$ packed form
0@%%%%%%%%qJ6j6J6j6K4l3M1m9N7p3R6j19J41j66J94k32K77l24L74m30M95n69
31c04O54p48Q46r58J085j222J372j536J715j912K131k370K629k910L218l558L927
48B059m331M771n253N788o378P031p754Q562r473J0510j1699J3077j4695J6628
62H843j8988K1941k5759L0906l8267M9753p0849J71913n68432M25372N23561j003658
74d93664M93118M60886q66715L36883N26864q17232K74374M82065o68053J50336
84a21138M68396n52267Q2000L91812l94630N7L21633k59300m3195K16560j10831
95i03q4582J19350Q612r1025L467J26546r3419r9816K17308p5052k01629K91783
107A20640m8626k90473L44812j5007l66176L80418J8158m20802L93955N4256m60938
$$ plain form
118 -289783 106649 190264 -291427 94956 200206 -284115 82589 203103 -271562 72802
128 72802 198395 -255402 66761 186283 -235644 61366 171532 -215822 59212 153445
138 153445 -197501 59848 133708 -178177 59746 114902 -161055 59396 97443 -145151
148 -145151 59309 80574 -128247 55745 65813 -111614 49887 53471 -94563 42814 40535
159 40535 -74425 32085 28263 -52163 19717 15971 -28123 6968 666 -981 -6314 -15801 28264
172 28264 -18598 -33882 57280 -27441 -55260 86133 -33481 -77638 113530 -35697 -100694
183 -100694 135806 -32570 -123755 154508 -25543 -145412 167397 -14414 -164172 173553
193 173553 571 -179813 172980 18051 -191121 166710 35846 -196536 153354 53773
$$ packed form
118b89783L96432Q3615m81691L86383J05250m84321L66704J20514m74665L44364
128G2802J25593m53797L22163J19522m21927K97010J10166l87354K75034R4233
138A53445l50946K57349P3860l11885K37923N5156k75957K20451L8047k42594
148a45151K04460K1265k08821J83992J0068j77427J61501L584j48034J37377k279
159D0535j14960J06510l822q0426P1880l746m4094L5091o302j647n333r487M4065
172B8264m6862j5284R1162q4721k7819J41393j19614m4157J91168j49227o4997
183a00694K36500j68376r1185K78263j80051j19869L12809j81811j49758L37725
193A73553j72982j80384L52793j54929k09172L57831j30864k32382L49890r9581
$$ plain form
203 53773 -196525 135165 70576 -190662 113088 84313 -176825 86869 94258 -157641 59002
214 59002 99766 -133650 31490 99001 -104072 4183 92946 -71272 -20356 81272 -37446
225 -37446 -40464 64082 -2283 -56752 43063 30705 -67849 19198 60952 -72968 -6895 87466
237 87466 -73727 -32762 109572 -70041 -57441 125515 -62126 -80799 137302 -51283 -100846
248 -100846 143916 -39607 -116678 145244 -25719 -129138 142278 -12069 -137047 135947
258 135947 696 -140067 126175 13216 -139237 113805 23879 -134758 100338 31747
268 31747 -125731 84748 38113 -113660 68836 42467 -99727 53215 43014 -82599 37162
279 37162 42371 -64278 22406 39540 -45966 8635 34319 -26537 -4398 28579 -7824 -15891
$$ packed form
203E3773k50298L31690o4589k61238L03750k8775k61138K63694P389k51899K16643
214E9002M0764k33416J65140O7511k03073J08255Q8763j64218N0916J01628j18718
225c7446l018J04546o6365n4469R9815j2358r8554Q7047M1754j33920O6073R4361
237H7466j61193M0965J42334j79613J2600J82956j87641j8673K18101j88585m9563
248a00846K44762j83523p7071K61922j70963j03419K71416j54347j24978K72994
258A35947j35251j40763K66242j12959j52453K53042q9926j58637K35096o8591
268C1747j57478K10479m6635j51773J82496k6369j42194J52942j0201j25613J19761
279C7162N209j06649Q6684J7134q5506N4601K5684o0856K2139L2977l6403q067
$$ plain form
291 -15891 21339 9706 -25172 12722 26364 -33522 3861 41642 -40119 -4673 54294 -44266
303 -44266 -14253 66081 -47404 -23331 75679 -49296 -31578 82755 -48595 -39761 88344
314 88344 -47325 -47357 92003 -44751 -53575 92461 -39956 -58761 91707 -34231 -63412
325 -63412 89143 -28322 -65316 83375 -20221 -66564 76186 -12108 -66120 67895 -4517
336 -4517 -63592 57480 3553 -59578 46365 11203 -54082 34594 17001 -46672 22309 22877
348 22877 -38226 10408 27241 -29418 -649 29634 -19203 -12033 30986 -8789 -21963 31237
360 31237 1144 -30512 29489 12012 -37730 26572 21929 -43587 22596 30604 -47567 16783
372 16783 38749 -49928 10479 46349 -50840 3295 51602 -49199 -4396 55654 -46395 -12062
$$ packed form
291a5891L7230j1633l4878L7894J3642n9886L7383L7781q1761L5446N8967r8560
303d4266L0013Q0334j13485K4073R9010j24975J7718J14333j31350Q834J28105
314H8344j35669l2J39360j36754q824J46036j32417j8805J50468j25938k9181
325f3412J52555j17465l6994J48691j03596m6343J42750q8294n4012J34015p2412
336d517n9075J21072n3927o3131J05943l5162o5285Q8676j7593o3673O8981N68
348B2877o1103M8634J6833n6659K8769L0283m8837P170M3019l9775j3174N3200
360C1237l0093l1656O0001j7477m9742O4302m643o5516O6183Q008p8171O4350
372A6783K1966q8677O0407L5870r7189N4135M8307j00801M4803O0050j02049L4333
$$ plain form
384 -12062 58351 -42300 -19076 58308 -36193 -25708 57227 -29020 -31343 54172 -21529 -35781
396 -35781 49091 -13815 -38663 43144 -5266 -40488 36229 2323 -40290 28366 9596 -39066
408 -39066 19834 16149 -36826 11790 21391 -32498 3453 25973 -27753 -4782 29267 -21850
420 -21850 -11753 30578 -15220 -18772 31581 -8025 -24347 31003 -1460 -28462 28647 5893
432 5893 -31956 25622 12782 -34174 22078 18360 -34519 17056 23023 -33859 12035 27319 -32509
445 -32509 7194 29691 -29738 1253 31629 -26249 -4170 32381 -22462 -8501 31519 -17827
457 -17827 -12994 29885 -13071 -16659 27945 -9047 -19024 24553 -4100 -21148 20776 435 -22368
470 -22368 17051 4397 -22823 12268 8111 -22592 7784 11374 -21491 3901 13896 -19359 -452
$$ packed form
384a2062P0413j00651K3224P7384r4501J0485Q2935q6247k323Q5515p5701j4252
396c5781Q4872o2906k4848Q1807m8410l5222P6717l3906m2613O8656j8770m8662
408c9066N8900l685n2975M8616R601n3889L5951K2520n3726K2971L4049n1117
420b1850J0097M2331m5798l552N0353l9606j6322N5350l2463k7002N7109k2754
432E893l7849N7578j2840m6956N6252l718n2879N1575N967n6882M5894J5284n9828
445c2509L9703K2497n9429L0991L0376n7878K2079L6551n4843J3961M0020m9346
457a7827M833M2879m2956l588M4604l6992r977M3577k8653j7048M1924k0341k2803
470b2368L9419j2654k7220L5091m157l0703L0376L590l2865K5392R995l3255J8907
$$ plain form
483 -452 16225 -17143 -4658 17614 -14534 -8387 18258 -10925 -11288 18391 -6919 -14431 18345
496 18345 -3201 -16305 16965 847 -17949 15578 4707 -19218 13795 8132 -18852 11006
508 11006 11380 -18430 8343 13905 -17463 5510 15984 -15403 2039 17266 -13667 -1367 18244
521 18244 -11630 -4086 18071 -8813 -6797 17834 -5798 -9347 16692 -3044 -11262 14661 -113
534 -113 -12586 12131 2557 -13754 9893 4434 -13779 6595 6873 -13729 3705 8705 -12872
547 -12872 607 9509 -11446 -2386 10265 -9678 -4827 10592 -7740 -6912 9884 -5137 -8822
560 -8822 9152 -2842 -9857 8328 -480 -10331 6738 2088 -10432 5185 4136 -10333 3736
573 3736 5260 -9172 2104 6999 -7764 389 8206 -6730 -921 8423 -4631 -2317 8972 -2824
$$ packed form
483d52J6677l3368J2485K2272l2148O147K6645k9183l63K9679k5310p512L2776
496A8345k1546j3104L3270j6118j8796L3527j0871k3925L3013n663k6984K9858
508A1006L74k9810K6773N562l1368K2973J0474l1387J7442J5227l0933J2300J9611
521A8244k9874P544K2157k6884K016K4631k3632l549K6039j9736q218K5923j4774
534a13j2473K4717r574j6311K3647n459j8213K0374K78k0602J7434N000k1577
547a2872J3479Q902k0955R060J2651j9943M851J5419j8332Q28J6796j5021l685
560h822J7974j1994p015J8185q808r851J7069m650j2520J5617j049j4469J4069
573C736J524j4432J1276M895j4763Q153P817j4936N809R344j3054K314J1289j1796
$$ plain form
587 -2824 -3417 8860 -1588 -4069 8385 -160 -4664 7428 1339 -5146 6731 2442 -5038 5194
601 5194 3509 -5219 3894 4111 -5039 2801 4605 -4544 1156 4664 -4058 -541 4744 -3561 -1503
616 -1503 4473 -2804 -2879 4058 -2121 -3707 3624 -1262 -4410 2363 -109 -5449 1736 742 -5397 935
632 935 1343 -5432 -24 2435 -5239 -1094 3317 -4655 -1568 3237 -3918 -2623 3685 -2690 -3586 4081
648 4081 -1556 -3912 3632 -28 -4040 3586 1191 -4443 3202 2327 -4380 2586 3749 -4043 1875
663 1875 4842 -3729 1035 5429 -2850 -223 6059 -2084 -1440 6280 -1073 -2219 5807 259 -3213
678 -3213 5229 965 -4103 4844 2116 -4454 3365 3315 -5349 2214 3928 -5137 957 4719 -4836 -932
694 -932 5234 -4133 -2454 5291 -3437 -3924 5083 -2449 -5375 5092 -1488 -6244 4587 -603 -6855
$$ packed form
587b824n93J2277j0448k481J2454q545m504J2092o089o485J1877m289p480J0232
601E194j685q728R113K17r150P840J804r149N700L508q722L517N285q305K058
616a503N976p277p5O937o179j586P331m886l148O773k472n340P185r94o139O332
632I35M08o775N408K459p674M145M411p972L087M805p155J295O308o375q96P667
648D081n637k356P544l660m012P626k395n634P645q75o707O966J163p792N918
663A875K967q571M764M394q279K627O282q143O44P720p353j146Q026n548l472
678c213Q442m264n068Q947k728o570P819n0q664P563J714r065O094L762r555L904
694i32O166r367J679P745q728m87R007p532k926J0467o580m756J0831n190o252
$$ plain form
709 -6855 3536 1062 -7561 2997 2285 -7439 1870 3517 -7369 595 4594 -7002 -67 5596
723 5596 -6142 -808 5898 -5141 -2276 6819 -4169 -3015 7001 -2779 -3706 6881 -954 -4450
737 -4450 6629 242 -4915 6282 1715 -5330 5077 3189 -5554 4509 4440 -5514 3170 5410 -5116
752 -5116 1712 6364 -4822 306 6811 -4182 -1109 7331 -3581 -3057 7733 -2836 -4610 7464
766 7464 -2000 -5720 7194 -559 -7335 6333 300 -8059 5656 1397 -8847 4544 2737 -9515
780 -9515 3508 3958 -9524 2379 5146 -9336 908 6340 -9024 -803 7014 -8260 -1833 7515
794 7515 -6749 -3353 8011 -5698 -4576 7862 -3674 -5438 7235 -1641 -6261 7145 604
807 604 -7220 6199 2372 -7180 4943 4331 -7407 3272 6123 -7122 2355 7505 -6342 288
$$ packed form
709f855J0391k474q623J0558p12r724R309J647j0886P964L999j1596O935N663
723E596j1738N334O706j1039K865R095j0988J154J0016r780r27J0587p835l496
737d450J1079o387n157J1197m567p045J0407j888q743J0063o9r954Q684K240j0526
752e116O828M652j1186N128O505j0993L073Q440j0912N24J0790j0569j774J2074
766G464r464l720J2914p753o776J3668o033q359J3715m259j0244J3391j807j2252
780i515J3023M50j3482J1903K767j4482J0244N432j5364Q221P817j5274O427R348
794G515j4264L396J1364j3709J122J2438j1536j764J2673q876m620J3406o541
807F04p824J3419l827r552J2123o12j1738J0679K851j3245R477N150j3847O630
$$ plain form
821 288 9047 -5654 -1652 9763 -4849 -3287 10181 -3504 -5087 10734 -2720 -6440 10357
834 10357 -1210 -8016 9872 245 -9215 9150 1262 -9944 7994 2432 -10518 6475 3732
847 3732 -11004 5298 4538 -10472 3744 5193 -9762 1651 6246 -9068 160 6479 -7826
860 -7826 -1238 6318 -6251 -2927 6494 -4625 -4578 6124 -2741 -5532 5425 -965 -6592 5045
874 5045 1214 -7295 4019 3407 -7565 2960 5342 -7817 1549 7151 -8427 626 8734 -7544
888 -7544 -779 10064 -7200 -2160 11329 -6657 -3554 12128 -5402 -4963 12594 -4496 -6148
901 -6148 12687 -3255 -7150 12116 -2014 -8281 11567 -772 -8911 10463 532 -9128 8625
914 8625 2242 -9303 6889 3029 -9049 5145 4008 -8479 2967 5105 -7589 660 5757
$$ packed form
821B88Q759j4701M002J1415j4612J562J3468j3685j583J5821j3454l720J6797
834A0357j1567o806J7888r627r460J8365p888j1206J7938n562j2950J6993k743
847C732j4736J6302p60j5010J4216J449j4955J1413M595j5314R228O319j4305
860g826O588P556j2569L324R421j1119M7J0702q865k791J0957o390n627J1637
874E045l831q509J1314o12j0972J0525K382j3159R366N602j5578R053Q108j6278
888g544O765J0843j7264N040J3489j7986L103J5682j7530M39J7557j7090j652
901f148J8835j5942l895J9266j4130o267J9848j2339q139J9374r931r660J7753
914H625o383j1545J6192l860j2078J4194j137j2487J1446K138j2694Q249N097
$$ plain form
927 5757 -6309 -1648 5988 -4782 -3461 6190 -3380 -5207 6277 -1618 -7101 5550 205 -8682
941 -8682 5154 2333 -9782 4315 4320 -10506 3287 6270 -10603 2222 8012 -10614 1164 8910
955 8910 -9758 -449 10399 -8835 -1880 11274 -8054 -2676 11380 -6621 -4448 11316 -5303
968 -5303 -4947 11331 -3558 -5665 10233 -1865 -6408 9644 -260 -6342 8178 1145 -6537 6604
982 6604 2665 -6855 4781 3870 -6260 3117 4406 -5450 1438 5079 -5135 -429 5715 -4336
996 -4336 -2190 5924 -3464 -3641 6283 -2495 -5333 6224 -1388 -6684 5832 132 -7482 5450 1236
1011 1236 -8547 4656 2190 -8970 3803 3864 -9538 3365 4824 -9426 2060 5752 -8914
1024 -8914 1032 6991 -8989 311 7629 -8035 -889 7743 -6791 -1775 8408 -5863 -2512 8382
$$ packed form
927E757j2066M661P636j0770J321R651r570j827J1484p895n483J2651n345q887
941h682J3836k821j2115J4097Nj4826J3793K983j6873J2825N790j8626J1778P746
955H910j8668R309J0848j9234O955J3154j9328N378J4056j8001K173J5764j6619
968e303L56J6278j4889k107J5898j2098m543J6052r904o082J4520p033p682J3141
982F604l939r520J1636r11j0130R377J289r856O888L641j0214M706O144j0051
996d336K146Q114r388j77R924q778k838J1557p612n296J2516n700p614J2932m214
1011A236r783J3203k466j1160J2773O1j3402J2903J459j4250J1486L692j4666
1024h914R946N959j5980R300P318j5664P146Q632j4534N016J0183j4271L351J0894
$$ plain form
1038 8382 -4521 -3368 8325 -3143 -4109 7796 -1766 -4941 7450 -474 -4907 6339 1408 -5629
1052 -5629 5305 2703 -5527 3913 3894 -5391 2076 5164 -5143 643 6098 -4472 -1010 6530 -3618
1067 -3618 -2662 6998 -3003 -4404 7132 -2031 -5933 6714 -605 -7203 6757 344 -8251 6158
1081 6158 1481 -9056 5346 2954 -9550 4397 4072 -9657 3423 4801 -9336 1904 5671
1094 5671 -8925 923 6338 -8265 -376 6826 -7175 -1401 6963 -5795 -2365 7267 -4538 -3164
1108 -3164 6329 -2961 -3996 5901 -1225 -4469 5222 267 -4513 4534 1711 -4501 3331 3374 -4653
1123 -4653 2035 4277 -4190 604 5146 -3669 -359 6092 -3053 -1732 6133 -2293 -2812 6483 -1637
1138 -1637 -4506 6340 -805 -4903 6150 -187 -5776 5674 454 -6228 5160 1284 -6682 4521
$$ packed form
1038H382j2903J153J1693j1468r66J1905r562l175J2391p924m433J1246m931p037
1052e629J0934k602q230R440j9r285P467L088j0307N786N455j0570L462P540j0148
1067c618R56R660j0001j401J1536r163l902J2647p319o598J3960o413q595J4409
1081F158m677j0537J4402k392j2504J3947l25j3729J3080J378j4137J1240L767
1094E671j4596R848N415j4603P889P202j4001N774Q364j2758L430R632j1805J374
1108c164R493r290j035R897p126l244R691m955m780R047k823o212P832M3q027
1123d653O688K242q467M794M542q815L310O451r145J321P865q426n19R295q120
1138a637k869J0846p145m098J1053o337n589J1450n220o682J1388l876p966J1203
$$ plain form
1152 4521 1991 -6993 3534 2430 -6912 2631 3076 -6884 1505 3560 -6521 957 3865 -5759 -100
1167 -100 4282 -4967 -1153 4076 -4229 -1862 4332 -3504 -2542 3596 -2102 -3049 3497 -787 -3353 3390
1183 3390 -46 -3525 2846 1229 -3916 2437 1765 -3901 1858 2784 -3644 1098 3683 -3462 566
1198 566 4497 -2951 -54 4749 -2650 -804 5187 -2115 -1667 4989 -1629 -1949 5005 -835 -3063 4661
1214 4661 -453 -3508 4402 360 -3763 3692 1080 -4215 3127 1488 -4510 2319 1703 -4563 1563
1229 1563 2620 -4548 607 2928 -4239 -190 2893 -3815 -979 3349 -3289 -1954 3448 -3010 -2506
1244 -2506 3375 -1942 -3193 3352 -1509 -3828 3218 -691 -3568 2974 404 -3863 2617 1004 -3991
1259 -3991 1730 1780 -3775 1311 2632 -3389 645 2875 -2845 7 3083 -2212 -478 3541 -1616
$$ packed form
1152D521k530q984J0527j104r342R543M45r960Q389K055j0081P478K908r624N659
1167a00M382r249L814N229q305K367O194p836R62O138n698r47O546m284k566O743
1183C390l436l479O371j617n145O353o72n666N759R26o428M742K585p145M028
1198E66L931p448K897M803p399J846N991p302M48O656o618l20O954n840k228P724
1214D661n114l055P910m042m123P455k612n295P342j639n998O829o16o266O126
1229A563J057p168N155K321p167M049L083o708K836M328o638J335N402o458N04
1244b506N881n317j251O545m861k319P046l909k877O542k570m267O480j613m995
1259c991N721N0n555N086J321o021M034K230n720K852L076n295J734M019n157
$$ plain form
1274 -1616 -1033 3806 -1068 -1328 3858 -320 -1966 3595 630 -2369 3334 1038 -2881 2626 1773 -3233
1290 -3233 2455 2131 -2917 1827 2068 -2924 902 2495 -3065 587 2695 -2976 -276 2647 -2587
1305 -2587 -806 2729 -2117 -1478 2586 -2146 -1780 2413 -1517 -2210 2061 -1101 -2525 1767 -608 -2242
1321 -2242 1424 -125 -2813 1035 355 -2480 650 828 -2522 132 1180 -2242 -162 1735 -1696
1336 -1696 -344 1797 -1464 -879 2218 -667 -1036 2340 -560 -1159 2426 152 -1393 2464 359 -1421
1352 -1421 2480 418 -1344 2066 1122 -1851 1905 1464 -2023 1828 1351 -1632 1324 1615 -1748 1050
1368 1050 1608 -1377 572 1569 -1186 63 1744 -1576 -312 1442 -1386 -544 986 -1025 -1000 1230
1384 1230 -829 -1253 1190 -585 -1466 361 -232 -1921 357 205 -1797 115 499 -1899 -134 765
$$ packed form
1274a616N83M839m874k60N186m178j646N561k965k999N703k296l919N507q53n006
1290c233N688l24n048M744K41m992L826J593n560L652K108n671K700K923n234
1305b587J781L535m846O39M064m732L66M193l930o93M271l162j424M292k375j634
1321b242L666j549k688L848o80k835L130J78l350K654J048l422K080J897l431
1336a696J352K141l261N85L097k885l69L376k900n99L585k274j545L857k105j780
1352a421L901k062j762L410r44k973L756m41l487L851m77k983K956K91l363K798
1368A050N58k985J949R97k755J249J681l320J264J754k828Q42J530k011K5K230
1384A230k059m24K443j775q81J827n93j689K278j52k002J912L84k398J765Q99
$$ plain form
1400 765 -1944 -514 1125 -1526 -353 1514 -1372 -1088 1297 -938 -1041 1662 -521 -925 1490 -203
1416 -203 -1254 1398 24 -1286 1379 400 -1277 1199 392 -1248 1425 1050 -1184 1145 883 -738
1432 -738 860 1266 -718 517 1324 -590 445 1263 -620 242 1134 -513 99 1337 -310 -452 1215
1449 1215 161 -761 729 97 -611 199 -41 -588 207 43 -1078 -34 175 -1172 -209 317 -1284 -671
1467 -671 440 -1035 -633 530 -1178 -807 394 -755 -956 630 -702 -963 629 -599 -673 686 -264
1484 -264 -1190 580 -235 -846 587 -190 -598 565 488 -439 527 493 -583 415 827 -428 405 657 -191
1503 -191 321 684 -207 269 606 230 -203 903 441 202 954 281 201 672 263 -113 771 367 -139 239
1523 239 576 48 354 635 -533 68 543 -228 -197 355 -242 -557 266 -481 -643 286 -606 -689 290 -549
$$ packed form
1400G65k709J430J639k651J173J867k886K84K385k235j03K703k183m04K415j693
1416b03j051K652j374j310K665r79j677K476q07j640K673l75k234K329k62j621
1432g38J598M06j984J235Q07j914J035Q18j883Q62Q92j647O12J238j647j42J667
1449A215j054r22J490o32p08Q10k40n47P95j64j121J044K09j347R63N26j601O13
1467f71J111j475M02J163j708L71J201j149k01J586j332k61J592j228p4J359r50
1484b64r26J770q15o11J433p77m08J163p7r27R66l4j076R98M12j255Q33K52q48
1503a91N12L63q91M76L37l76m33J106m62k39P52o73q0M71m09l76Q84m04n06L78
1523B39L37n28L06K81j168O01M75p71L1N52n97l15Q23p47j62R29q92q3R79q39
$$ plain form
1543 -549 -634 -23 -371 -870 134 -320 -735 4 -117 -646 -15 -114 -526 -216 -34 -287 -171 271 -432 -16
1563 -16 266 -192 -49 399 -206 -337 446 295 -201 579 250 -178 404 307 21 479 395 -209 559 389 -126
1584 -126 348 697 -121 464 812 347 314 635 121 335 1089 70 -106 595 80 -137 379 62 -340 292
1604 292 75 -486 28 -218 -303 -17 53 -476 -26 -11 -414 -248 -88 -377 -470 25 -678 -560 -4 -531 -548 -102
1626 -102 -356 -584 3 -412 -591 57 -384 -869 76 -366 -637 146 127 -349 124 44 -383 145 222 -382 259
1647 259 391 -149 396 459 2 77 583 -121 211 842 23 -18 907 164 197 812 54 105 798 552 -315 432
1669 432 331 -298 494 417 -220 255 480 -151 177 472 -483 -54 297 -593 -303 304 -512 -301 514 -781
1689 -781 -462 189 -601 -591 200 -398 -735 -138 -407 -1007 -22 -58 -546 29 -306 -781 -212 -84 -577 -16 -97
$$ packed form
1543e49q5O11l48m99J004m54m15P39j21n29O31r9m12L10J82k53J16M42p03M16
1563a6K82m58J43M48o05j31P83j51m96P80l29m28N82r7k86M58q4o04P68j70n15
1584a26M74L49q18N85L48m65l3L21n14K14P54j019j76P01n15k17N16l17m02O32
1604B92k17n61N14k46q5K86P0n29M50J5m03J66J60k89r3M95p03J18N56n27j7M46
1626a02k54k28N87m15j79O48m41m85R45m42k71P83j9m76M73q0m27N28P7o04O41
1647B59J32n40N45O3m57P5N06p04L32O31q19m1R25p43L3O15p58N1O93k46q67P47
1669D32j01o29P92p7o37M75K25o31L28K95r55M29L51q90K90O07q16K11Q15j295
1689g81L19O51p90J0P91n98l37N97k69o00R85l6m88N75l35m75N69J28m93N61q1
$$ plain form
1710 -97 -636 -420 184 -461 -63 312 -511 -127 351 -481 140 550 -37 174 606 -147 110 542 114 -256
1730 -256 721 444 -80 687 312 -217 794 251 -236 586 407 -140 576 598 16 182 652 -154 188 516
1750 516 -294 -37 430 -193 -327 620 -245 -346 385 -202 -436 433 -359 -580 250 -184 -416 123 -256 -879
1770 -879 75 -265 -848 -172 -27 -627 -184 -243 -845 -178 63 -649 -303 412 -555 -245 262 -464 -317 229
1790 229 -308 -216 469 -112 -281 336 321 -179 199 -208 -380 342 364 55 341 282 -417 671 468 -96 484
1811 484 712 -130 183 615 -132 22 728 27 56 546 -151 -175 416 257 -179 634 -164 1 284 -133 -399
1832 -399 657 -371 -348 453 51 -515 -94 317 -559 -41 -64 -541 -89 193 -636 -195 9 -481 -295 283
1852 283 -501 -172 98 -362 -725 120 -270 -421 -62 -426 -267 125 -65 -524 298 -46 -402 236 144 -404
$$ packed form
1710i7n39K16O04o45L98L75q23L84M78q32O21M10n87K11M32p53K57M32m28l70
1730b56R77k77n24P67l75n29J011n43m87Q22j79n47P16K2n82J66M70q06L42L28
1750E16q10K57M67o23j34R47q65j01P31n87k34Q69p92k21Q30m34k32N39l79o23
1770h79R54l40n83O76J45o00M43n9o02O67K41p12L46P15r67L10N07p26J47N46
1790B29n37R2O85n81j69O17j5n00L78m07j72P22K2l09K86n9o99J088k03n64N80
1811D84K28q42L13M32p47J54P06p01K9M90o97k4N91j59m36Q13p98J65K83m17k66
1832c99J056j028K3Q01m02n66M21M11q76N18k3m77M52K82q29M41K04m90J86N78
1852B83p84L29K70m60l63Q45l90j51L59l64J59L92j90m59Q22l44l56O38r2n48
$$ plain form
1872 -404 113 173 -277 337 354 -383 514 467 -173 311 612 -199 288 551 -55 222 886 -108 281 747 -60
1893 -60 236 552 -42 318 426 138 182 311 7 -391 436 34 -181 249 -11 -565 50 -140 -404 230 -179
1914 -179 -489 67 78 -542 -4 316 -406 -328 -33 -554 -256 135 -455 -453 -55 -319 -360 146 -91 -654 -54 -123
1936 -123 -633 211 -82 -600 210 48 -687 396 118 -397 184 282 -458 254 392 -428 405 405 -54 272 243
1957 243 -260 203 391 -54 90 575 -127 66 499 172 67 472 313 98 345 284 142 252 340 -33 213
1978 213 143 -170 194 276 -325 -159 318 -157 33 263 -411 -181 153 -461 -475 15 -345 -257 142 -488 -451 148
2000 148 -305 -667 -145 -516 -572 -57 -310 -660 -41 -282 -809 116 -309 -249 156 -278 -323 -17 35 -253 -13
2021 -13 86 -299 -67 72 -210 118 236 -103 166 77 200 173 424 149 101 286 178 241 491 525 42 464
$$ packed form
1872d04N17O0m50O14J7p37Q97m7o40M84L01q11M87K63o06K77O64r94L89M66q07
1893f0K96L16n94L60J08k88M4J29l04l98Q27m02k15M30k60n54O15j90k64O34m09
1914a79l10N56J1o20N38L20p22P8K95n21K98L91n90KL98k64m1N06k37n63O00o9
1936a23n10Q44k93n18Q10j62p35J083k78n15N81R8p40P12J38q20Q33%m59L26k9
1957B43n03M63J88m45J44M85p02J93M33l27j05M05j59k15K47o1j42J10Q8l73K46
1978B13p0l13L64Q2o01J66M77m75J90K30o74K30L34o14j4M90l60Q8L99o30L7N99
2000A48m53l62N22l71n6N15k53l50O19k41n27R25m25O0M05m34m5L06N2k88K40
2021a3R9l85K32J39k82L28J18l39K69q9J23k7K51k75m8J85j08O3K50L4m83M22
$$ plain form
2043 464 229 -50 210 441 23 107 337 -34 293 343 -18 225 285 -191 -113 404 -234 41 229 -424 -265
2064 -265 222 -46 -351 85 -548 -186 89 -249 -223 81 -194 -421 -164 -400 -341 128 -400 -198 4 -356 -444
2085 -444 -151 -405 -37 -323 -86 -213 -185 -19 -41 -369 49 -25 -230 242 285 170 253 258 -131 265 69 138 341
2108 341 230 57 273 500 19 155 365 -223 232 476 130 374 296 20 272 79 138 120 561 -16 62
2129 62 186 -247 110 232 -128 -64 60 -123 -117 -128 -272 70 54 -150 -298 -379 -160 -293 -325 -103 -94 -224 -98
2152 -98 -164 -321 -437 -419 -190 -129 -154 -368 -197 -116 -241 -5 -155 -161 -66 17 -280 80 -12 -399 96 181 -5 293
2176 293 -54 -85 504 159 147 282 136 -84 255 81 -145 197 40 359 292 101 253 294 8 -162 358
2197 358 373 142 510 6 78 296 97 328 -62 8 -60 45 47 -81 126 -48 -140 -74 -73 -62 -187 -235 72 8
$$ packed form
2043D64k35k79K60K31m18Q4K30l71L27N0l61K43O0m76P8N17o38K75J88o53J59
2064b65M87k68l05M36o33L62K75l38K6L04k75k27K57k36N9M69n28K02K02l60q8
2085d44K93k54L68k86K37j27K8J66k2l28M18p4k05M72M3j15Q3Nl89L96j96O9K03
2108C41j11j73K16K27m81J36K10n88M55K44l46K44p8k76K52j93N9j8M41n77P8
2129F2J24m33L57J22l60O4J24j83Oj1j44L42j6k04j48q1K19j33l2K22Rj30J26
2152i8o6j57j16J8K29O1k5k14J71Q1j25K36j50oR5Q3k97L60r2l87M95Q5j86K98
2176B93l47l1N89l45j2J35j46k20L39j74k26L42j57L19o7j91J52M1k86j70N20
2197C58J5k31L68n04P2K18j99K31l90P0o8J05Kj28K07j74r2O6JJ1j25m8L07o4
$$ plain form
2221 8 -36 -45 -147 -83 -38 -273 -459 -158 -246 -384 37 -50 -538 135 -381 -379 97 -162 -257 78 -331 -306 79 -205
2245 -205 159 111 126 -209 86 -359 -155 273 -110 189 32 183 33 209 78 350 469 173 379 291 40
2266 40 394 235 -50 328 256 -1 274 104 251 105 148 22 65 39 103 140 25 204 1 -239 124 47 -109
2289 -109 -50 213 -400 -29 -2 -278 46 -25 -209 -92 83 -450 -161 -392 -346 -320 -40 -301 -242 -31 -400 89
2311 89 -310 -295 -81 -218 -301 -63 51 -286 -82 -5 -284 134 198 -282 236 50 -40 144 145 41 220 38 197
2334 197 178 17 326 332 284 254 578 121 213 333 78 114 325 -49 218 236 259 152 248 11 159 228 -62 263
2358 263 -40 -142 208 44 -73 159 60 -106 -103 70 -405 -245 115 -554 -65 -232 -348 62 -339 -163 79
2379 79 -240 -176 191 -152 -508 -184 -40 -229 -109 -268 -107 129 -149 30 -71 -154 198 -32 -81 -9 141 -42
$$ packed form
2221Hm4rj02O4M5k35j86L01q8j38M21q7m88O73n16KM76k59r5L35m09K5L85k84
2245b05L64m8J5l35K95m45K04M28l83K99j57J51j50J76j31K72J19k96K06q8k51
2266D0L54j59k85L78p2k57K75j70J47j46M3j26M3k6O4L7j15J79k03k40L63p7j56
2289a09N9K63o13L71K7k76L24p1j84J17J75n33K89k31M6K6K80k61N9K11l69M89
2311H9l99J5K14j37q3K38J14l37K04P7k79M18O4m80N18j86r0J84Jj04J79j82J59
2334A97j9j61L09Om8l0L24m57R2J20k55L6K11l74K67J8K3j07R6k37J48O9k90L25
2358B63l03j02L50j64j17K32r9j66LJ73m75J60L60o69M89j67j16M10m01J76K42
2379G9l19O4L67l43l56L24J44j89J20j59J61K36k78J79j01q3L52k30m9P2J50j83
$$ plain form
2401 -42 136 46 202 9 188 35 249 114 -126 427 91 62 277 -69 49 110 51 210 284 136 22 523
2423 523 26 -38 280 394 205 247 119 -214 131 -44 65 522 -74 -141 178 7 -88 186 -189 -312 -194
2444 -194 -390 -134 -51 -197 -396 -253 -62 26 -278 -324 9 -284 -50 -35 -347 -648 -21 -125 -64 -60 -328 -330 -31
2467 -31 -270 -175 180 -309 -161 -345 -215 168 91 -134 67 188 71 316 179 -148 163 51 121 125 122 229 413
2490 413 279 70 243 171 90 368 464 141 272 181 139 52 35 76 -215 53 -43 394 -84 45 -146 -100 245
2513 245 111 -216 77 0 -307 -117 -151 -273 59 -168 -193 86 -121 -359 -52 -74 -399 -267 -42 -184 -71
2534 -71 -212 -278 22 -62 -67 10 -186 -322 83 71 128 -2 270 -227 241 158 -136 -14 -91 -280 97 148 -130 74
2558 74 187 121 45 285 169 76 80 185 54 198 210 11 178 204 146 135 -70 272 70 307 183 271 1 -117
$$ packed form
2401d2J78r0J56j93J79j53K14j35k40N53l36k9K15l46J18O1n9J59P4j48j14N01
2423E23m97o4L18J14j89M2j28l33L45j75J09M57n96o7L19j71r5K74l75j23J18
2444a94j96K56Q3j46j99J43J91Q8l04m6L33k93K34J5l12l01O27j04O1Mk68kK99
2467c1k39R5L55m89J48j84J30L83p7k25K01J21j17K45j37l27L11j12P0MlJ07J84
2490D13j34k09J73p2q1K78R6l23J31r1m2q7j7M1k91K68r6M37m78J29j91M6L45
2513B45j34l27K93p7l07J90l4j22L32k27k5K79k07k38L07k2l25J32K25j42J13
2534g1j41o6L00q4nP7j96j36M05j2N7j30K72m97M68q3k94J22p7j89L77N1k78K04
2558G4J13o6p6K40j16r3MJ05j31J44J2j99J67K6n8j1k05L42k02K37j24Q8k70j18
$$ plain form
2582 -117 85 -110 275 -51 301 36 -62 403 28 -173 210 -16 -416 112 -225 -366 -116 -112 -182 -172 -179 -294
2604 -294 99 -146 -161 192 -213 -198 -65 -265 -42 -172 -46 -283 -65 -12 -266 -108 -158 -78 60 175 -305 -237
2626 -237 -86 -106 89 133 -29 -51 -49 106 -21 346 53 -33 188 205 87 -2 257 178 132 92 158 357 366 249 103
2651 103 30 153 77 165 65 338 270 72 307 114 -209 247 -61 -105 -87 206 -428 63 -213 -39 48 -143
2673 -143 -458 27 -21 -453 -195 87 -173 -252 -59 -186 -270 -14 -343 -281 -105 -217 -304 -164 -207 46 -111 -110 -3
2696 -3 -35 -181 -39 -149 47 54 93 -33 -48 104 189 33 -155 128 -91 -65 320 -124 -55 378 144 86 335 297
2720 297 -30 255 15 143 239 53 94 100 -177 218 14 74 99 223 309 1 -1 32 55 -136 144 -22 -158 -101
2744 -101 -45 -157 -155 -114 -101 -132 20 -234 -19 7 -178 -82 -23 -315 -45 159 -450 -196 -27 -84 -295 -130 -67 -205
$$ packed form
2582a17K02j95L85l26L52k65r8M65l75k01L83k26m00N28l37j41K50Mp0J0pj15
2604b94L93k45j5L53m05J5J33k00K23j30J26k37K18N3k54J58n0Q0J38J15m80O8
2626b37J51k0J95M4j62k2KJ55j27L67k93q6K21J7j18q9K59p9m6m0O6J99Rj17j46
2651A03p3J23p6Q8j00K73o8j98K35j93l23M56l08m4J8K93o34M91k76J74Q7j91
2673a43l15M85m8m32K58K82k60p9J93j27q4K56l29O2J76j12q7J40m3K53j57JJ07
2696cl2j46J42j10J96PL9j26j5J52Q5j56j88K83k19K6L85m44O9M33k34n8K49l8
2720B97l27K85k40J28R6j86M1Ok77L95k04O0K5J24Q6l08kL3K3j91K80j66j36N7
2744a01N6j12KM1J3l1J52k54K15K6j85R6N9k92K70K04o09K54J69n7k11J65O3j38
$$ plain form
2768 -205 -12 -164 -23 147 -351 -36 23 145 -251 237 -147 109 192 103 -15 83 112 -100 288 24 48 208
2790 208 114 88 241 296 -134 -11 131 78 314 144 178 -65 70 208 146 -101 210 155 80 146 -31 4 208
2813 208 -19 176 172 -127 -105 26 -251 131 -150 -50 -71 -10 -92 83 -67 -381 89 281 -202 27 -70 -295
2835 -295 -199 -215 -272 -123 -215 -264 -27 -80 -191 -85 -92 -443 143 -274 -168 -14 -40 -166 155 -169 -36 62 29 7
2859 7 -57 -27 -12 -74 130 23 173 36 461 174 9 33 164 71 1 295 -205 131 168 101 351 157 -138 257
2883 257 222 -61 319 188 -163 195 51 97 266 -49 87 34 -45 -250 290 200 -68 -51 38 -114 304 -188
2905 -188 -96 85 -183 -254 -79 -90 -49 -33 110 -418 -52 -207 107 -163 -148 -303 28 -191 -207 -103 -291 -51
2927 -51 66 -89 16 9 114 198 -88 91 289 74 -168 387 -88 31 293 303 137 207 -81 255 173 67
$$ packed form
2768b05J93j52J41J70m98L15N9J22l96M88l84K56Q3q9j18R8K9k12L88k64K4J60
2790B08r4k6J53N5m30J23J42n3K36j70L4k43J35J38o2k47L11n5p5O6j77L5K04
2813B08k27J95mk99K2J31k77L82k81J00k1O1q2J75j50l14M70J92m83K29r7k25
2835b95R6j6n7J49r2m9K37n3j11J06pl51N86m17J06J54k6j26L21l24J33R8l3k2
2859Go4L0J5o2K04j07J50j37M25k87j65K4J31r3p0K94n00L36L7o7K50j94k95L95
2883B57l5k83L80j31l51L58j44M6J69l15J36n3p9k05N40r0k68J7Q9j52M18m92
2905a88R2J81k68p1J75j1M1J6J43n28L66j55L14k70J5j55L31k19j6J04j88K40
2927e1J17j55J05pJ05Q4k86J79J98k15k42N55m75J19K62J0j66P0k88L36q2j06
$$ plain form
2949 67 -13 88 128 172 103 -104 22 212 168 -76 221 5 262 192 122 473 119 -143 123 103 -160 63 277
2972 277 -298 -86 -117 -48 88 30 -199 -11 -181 -151 208 -116 -371 -106 -155 -169 155 -31 -397 -43 -271 -227
2994 -227 53 118 -107 -8 -259 -29 -12 -204 -107 169 -100 -19 41 -162 44 141 4 -113 72 146 81 95 100 85
3018 85 11 -96 137 54 1 148 70 -58 52 187 95 268 143 62 -71 -34 58 45 -77 63 161 -179 152 257
3042 257 -3 157 221 157 -281 130 -154 -109 -127 -150 -153 27 -214 -57 292 -52 69 -168 -291 -125 -120 -194 -334
3065 -334 -108 -279 -38 73 -117 -40 107 -140 104 -157 -277 261 -12 -70 -7 5 -65 16 155 -24 -128 -174
3087 -174 28 114 35 -11 96 140 124 141 105 101 144 22 206 221 -111 39 404 135 157 153 -55 24 277 290 108
3112 108 238 58 36 274 -144 -157 119 -154 61 -231 18 -2 -100 -70 -53 -21 -326 119 -173 72 19 -148 0
$$ packed form
2949F7q0J01M0M4o9k07J26J90m4k44K97k16K57p0p0L51l54k62K66k0k63K23K14
2972B77n75K12l1O9J36n8k29J88j70L0L59l24k55K65m9j4L24j86l66L54k28M4
2994b27K80O5k25R9k51K30J7j92R7K76k69Q1O0k03K06R7j37j17J85P4o5J4Nj5
3018H5p4j07K33q3n3J47p8j28J10J35r2J73j25q1j33L7R2j3j22J40R8l40L31J05
3042B57k60J60O4o4m38M11k84M5j8k3lJ80k41J57L49l44J21k37j23J66Np4j40
3065c34K26j71K41J11j90P7J47k47K44k61j20N38k73n8O3J2p0Q1J39j79j04m6
3087a74K02Q6p9m6J07M4j6J7l6mM3j22J84J5l32J50L65k69K2mk08P9K53J3j82
3112A08J30j80k2K38m18j3K76k73K15k92K49k0r8L0J7L2l05M45k92K45n3j67J48
$$ plain form
3135 0 -233 -84 -208 21 -242 -236 -174 -60 -234 -206 -8 -300 -118 -223 159 19 -116 -167 52 -434 -199 23
3157 23 -104 -25 198 -270 -154 56 -25 32 230 48 -79 77 -32 -143 63 147 41 -5 27 -130 124 280
3179 280 148 46 -3 180 37 65 -59 97 -58 393 -147 330 218 -113 -80 58 -229 -228 -25 112 -237 93
3201 93 159 15 -73 -21 -43 137 -258 -273 295 -199 55 -73 -338 171 13 -137 -45 87 -32 -140 -123 -184 77
3224 77 220 -17 -87 211 -13 -48 -332 -240 48 105 -194 125 -28 -177 -10 24 81 -104 215 214 -81 409 35
3247 35 68 85 63 -101 148 97 186 123 80 0 134 77 14 57 266 86 110 401 -358 7 155 -361 152 127 -97
3272 -97 -215 -40 -119 85 -28 49 -166 -125 -47 78 -40 -97 -92 7 -27 -113 -180 -155 -158 -259 -187 -74 -55 80 -92 99
3298 99 128 -321 21 -103 -147 12 100 -92 65 -1 155 -67 55 303 -178 -81 -96 105 -42 -52 -111 146 66
$$ packed form
3135@k33J49j24K29k63OO2J14j74K8J98k92J82j05L82j40j35n1K19m86K35K22
3157B3j27P9K23m68J16K10q1N7J98j82j27J56j09j11K06Q4j06m6L2j57K54J56
3179B80j32j02m9J83j43K8j24J56j55M51n40M77j12l31L3J38k87JK03J37l49L30
3201I3O6j44q8N2k2J80l95j5N68m94K54j28k65N09j58j50R2J32j19j08J7o1K61
3224G7J43k37p0K98k24l5k84R2K88N7k99L19j53j49J67L4N7j85L19jk95M90l74
3247C5L3J7k2j64K49n1Q9o3m3q0J34n7o3M3K09j80K4K91p59L65J48n16N13k5k24
3272i7j18J75p9K04j13P7k15M1P8J25j18n7NR9l4q6o7K5lj01P2J13J9J35j72J91
3298I9K9m49L42j24m4J59Q8j92J57o6J56k22J22K48m81R7j5K01j47j0n9K57q0
$$ plain form
3321 66 -225 -45 189 -36 44 151 98 340 231 159 1 115 129 -34 106 42 266 -159 23 7 -204 120
3343 120 4 -82 110 74 -35 238 -225 30 -131 -148 -22 -64 -145 30 -178 -101 -232 -22 -227 -367 -170 -85
3365 -85 -1 -142 -140 35 -238 -122 61 -61 4 -38 -275 -24 -9 -21 119 -191 147 -27 -49 -141 -96 95 7 22
3389 22 229 80 -15 112 -75 -263 -85 57 -92 247 -32 169 46 8 119 270 158 -44 179 -95 22
3410 22 113 272 -132 138 28 110 249 57 63 23 -22 152 -140 -138 -4 -14 -4 172 -65 -11 -36 -91 -166 32 296
3435 296 -18 72 -285 -112 -333 -172 -258 120 -259 -198 -216 72 -242 -137 -14 105 -50 -208 145 -134 221
3456 221 -282 -146 -20 -182 -26 -81 -66 -5 154 -335 251 -123 -114 149 93 -206 -48 142 161 -68 276 108
3478 108 61 35 44 91 -75 226 196 91 172 212 -79 225 240 -14 -98 -264 49 -23 -50 -34 163 193 -18 17 92
$$ packed form
3321F6k91J80K34k25Q0J07n3K42j09p2j58J14J4j63J40o4K24m25J82j6k11L24
3343A20j16q6J92l6j09K73m63K55j61j7J26m2q1J75k08P7j31K10k05j40J97Q5
3365h5Q4j41KJ75k73J16J83j22O5m2k37K51J5j2J40l10L38j74k2r2M5J91q8J5
3389B2K07j49r5J27j87j88J78J42j49L39k79K01j23l8J11J51j12k02K23k74J17
3410B2R1J59m04K70j10Q2J39j92Om0m5J74k92KJ34j0J0J76k37N4k5n5p5J98K64
3435B96l14R0l57J73k21J61q6L78l79O1j8K88l14J05J23J19j55j58L53k79L55
3456B21n03J36J26j62J56n5J5O1J59m89N86l74RK63n6k99J58J90J9k29L44j68
3478A08m7k6RM7j66L01l0j05Q1M0k91L04J5k54q4j66L13p2k7J6J97L0k11L5P5
$$ plain form
3503 92 -305 18 -83 -103 21 -95 30 6 -273 -329 -64 -160 -240 97 -23 -105 308 203 -92 159 -48 -44 -83
3526 -83 -297 -23 -58 67 -305 86 -91 97 21 -48 112 -83 -141 193 -148 -78 105 114 -87 -38 75 159 1
3549 1 134 102 85 122 105 8 -212 -106 78 84 263 109 24 34 111 -14 203 -2 -124 185 144 207 28 134 -105
3574 -105 82 -197 -164 73 169 -70 -283 -70 81 -404 -106 -21 5 35 -71 -164 -90 -304 -189 81 -51 -280
3596 -280 -208 -78 -190 -88 -145 57 -165 -81 58 -171 -92 59 198 -272 -78 -209 -78 305 70 55 -3 -5 140
3619 140 242 -64 88 114 14 34 67 119 83 285 183 244 122 32 59 305 84 118 169 -61 55 -66 44
3642 44 135 320 -216 -17 14 152 123 -84 -41 125 -105 -22 87 -106 -37 -60 74 11 -14 -212 -59 -127 -251 -75
3666 -75 -131 -188 -80 -66 31 54 -51 -83 5 -217 -43 -74 -179 -188 -88 -102 -90 -92 162 -11 -140 -49 -133 80 -41 -131
$$ packed form
3503I2l97L23j01k0J24j16J25k4k79n6K65r6q0L37j20q2M13j05k95K51k07Ml9
3526h3k14K74l5J25l72L91j77J88p6o9J60j95n8L34l41P0J83Rk01M9J13Q4j58
3549AJ33l2j7L7j7r7k20J06J84OJ79j54q5J0P7j25K17k05j22L09m1O3j79J06k39
3574a05J87k79L3K37R6k39k13K13J51m85K98Q5K6L0j06r3P4k14J15K70j32k29
3596b80P2J30j12J02n7K02k22Q4J39k29P9J51J39m70J94j31J31L83k35j5n8kJ45
3619A40J02l06J52K6j00K0L3N2l6K02j02O1j22r0K7K46k21L4N1k30J16j21J10
3642D4R1J85n36J99L1J38k9k07M3J66k30Q3J09j93O9k3J34o3k5j98J53o8j24J76
3666g5n6n7J08J4R7K3j05l2Q8k22J74l1j05rJ00j4J2kK54j73j29R1q4K13j21r0
$$ plain form
3692 -131 157 -6 106 261 -17 22 -90 31 100 186 78 -115 158 38 20 214 176 217 67 81 4 -127 -10
3715 -10 36 10 61 23 -21 65 -135 -102 -190 147 140 -172 80 -164 -177 -24 -28 105 -182 -52 -118 -170 -129 17 -123 77
3741 77 -49 -104 -24 -132 250 -91 94 76 6 -212 305 47 -204 -160 -326 -87 68 -280 62 30 -243 21
3763 21 -58 -15 4 -11 326 262 197 121 113 -111 58 -3 91 215 63 -24 123 196 147 296 193 -54 265 118 71
3788 71 -40 111 -89 15 59 27 -4 105 244 -139 74 231 12 -97 306 -42 -218 111 -119 34 81 -86
3810 -86 -180 -303 99 -306 73 -329 -133 -51 -208 -279 -365 -409 9 -25 15 -10 -259 21 -358 58 -125 -39 -91 -35
3834 -35 -96 -171 -167 -65 71 -126 -147 42 130 -11 -24 34 -113 23 0 -93 57 -29 -222 -7 128 -209 -199 10
3858 10 83 236 -221 62 73 -64 80 9 325 -70 -25 115 287 195 -234 -111 267 -24 -80 26 -56 -158 -15
$$ packed form
3692a31K88j63J12J55k78L9j12J21O9Q6j08j93K73j20j8J94l8M1j50J4p7j31J17
3715a0M6k6N1l8m4Q6k00L3q8L37pl12K52k44j3J53mJ33k87J30o6n2M1J46j40K00
3741G7j26n5Q0j08L82l41J85j8p0k18N17k58k51M4j66K39J55l48L42l2k73K64
3763B1p9M3J9j5L37o4o5p6qk24J69o1R4J24j52q7J47P3m9J49j03k47L19j47m7
3788G1j11J51k00J04M4l2l1J09J39l83K13J57k19j09M03l48j76L29k30J53M7j67
3810h6r4j23M02m05L79m02J96Q2j57p1q6m4M18l4M0k5k49K80l79M16j83Q6n2N6
3834c5o1p5MJ02J36j97k1J89Q8j41j3N8j47J36k3r3J50q6j93K15J35l37J0K09
3858A0P3J53m57K83J1j37J44p1L16l95M5J40J72r2m29J23L78k91n6J06q2j02J43
$$ plain form
3881 -15 -95 -211 114 -216 19 -8 140 85 -344 -61 -128 9 -60 27 -174 213 -97 -63 159 64 146 160 -75 57
3905 57 -123 -115 1 -38 82 -47 126 188 -329 -44 24 -175 -169 142 210 148 -41 9 2 29 188 154 24 -198 54
3930 54 79 80 -5 146 53 262 -2 124 62 140 251 -226 10 159 78 -35 179 69 52 -143 76 73 -53 -145
3954 -145 -250 18 -40 -315 53 140 -78 -150 -69 -201 -50 -89 54 -34 -294 151 -117 44 -213 -10 -83 -39 66
3977 66 -253 -18 -62 -61 -211 38 -9 -43 60 105 -325 -23 104 73 49 147 35 -107 331 -189 -269 18 -13 54
4001 54 91 -238 -142 193 124 -238 25 6 327 143 207 -143 85 92 62 -99 70 126 265 5 99 113 -117 -151
4025 -151 -25 200 120 159 -84 -37 -94 245 205 -21 -38 -327 -68 -144 -26 -283 -309 -87 -353 -52 -66 -174 -42
4048 -42 -62 -326 236 144 -91 -184 -161 -176 -378 36 64 -62 196 32 48 -11 27 34 -31 154 -67 103 -115 -182 19
$$ packed form
3881a5q0j16L25l30K35k7J48n5m29K83o7J37o9Q7k01L87l10L4K22r5Q2J4k35J32
3905E7j80QJ16l9J20j29J73O2n17K85O8j99OL11O8o2j89N0pK7J59l4j30k22K52
3930E4K5Jq5J51r3K09k64J26o2P8J11m77K36J49q1j13K14j10j7j95K19lj26r2
3954a45j05K68n8k75L68Q7k18p2Q1j32J51l9J43q8k60M45k68J61k57K03p3M4J05
3977F6l19K35m4Jj50K49m7l4J03M5m30L02J27l1k4R8j12j42M38n20q0K87l1O7
4001E4L7l29R6L35o9l62K63j9L21j84O4l50K28Pl0j61J69N6J39k60R4J4k30l4
4025a51J26K25q0L9k43M7n7L39m0k26j7k89K59p6J18k57k6K22k66L01j4j08J32
4048d2k0k64N62r2k35r3K3j5k02M14K8j26K58j64J6n9L8Po5J85k21J70k18o7K01
$$ plain form
4073 19 180 76 250 -42 204 -202 -135 186 184 -138 175 96 -207 117 169 83 163 -219 51 -175 145 -63 112
4096 112 128 261 149 -131 140 -141 124 209 -222 47 -19 -70 -81 -239 118 195 -13 -45 -228 66 53 -11 2
4119 2 116 -11 -121 -364 -5 -117 -191 71 -61 54 -104 191 -35 -99 152 11 122 354 119 17 339
4140 339 195 -170 -6 10 256 -34 64 -151 110 68 44 180 -49 256 20 57 102 13 100 92 6 110 203 12
4164 12 76 105 189 30 42 90 -209 -58 -185 29 44 308 28 154 -115 -17 77 -127 173 -94 221 -122 -160
4187 -160 91 -210 56 -250 -175 41 -190 -66 -81 91 -163 -180 -139 35 -84 129 -67 -284 -177 -308 -121
4208 -121 -257 -324 -339 127 -345 -169 -7 -153 72 155 96 -203 296 -144 47 5 147 -235 152 -128 148 256
4230 256 -16 38 -68 -23 -3 68 202 86 -145 -100 -109 177 -67 -23 86 -118 257 -57 85 28 24 50 2 -43 23
$$ packed form
4073A9J61j04J74k92K46m06O7L21kl22L13p9l03L24N2q6Q0l82K70k26L20k08J75
4096A12J6J33j12k80K71k81K65Q5m31K69o6n1j1j58L57P7k08l2j83K94j3o4J3
4119BJ14j27j10k43L59j12p4K62j32J15j58K95k26o4K51j41J11K32k35j02L22
4140C39j44l65J64J6K46k90R8k15K61m2k4J36k29L05k36L7M5q9Q7qq6J04R3j91
4164A2O4K9Q4j59J2M8k99J51j27K14J5K64k80J26k69R8R4k04L00k67L15l43l8
4187a60K51l01K66l06P5K16k31J24j5J72k54j7M1J74j19K13j96k17J07j31J87
4208a21j36o7j5M66m72J76J62j46K25Q3n9k99M99m40J91m2J42l82L87k80K76J08
4230B56k72N4j06M5K0P1J34j16k31M5rK86k44M4J09k04L75l14J42n7mK6m8m5O6
$$ plain form
4255 23 -24 153 198 204 141 -129 219 137 -5 -21 -32 153 -99 100 -172 -3 142 159 81 2 -65 -32 47 -161 80
4280 80 -257 35 -3 34 -90 -11 -146 -232 13 -97 -138 172 107 -133 -425 -133 -100 293 101 -94 56 160 -10
4303 -10 119 -122 -232 52 88 82 183 84 185 -32 -133 -27 45 -41 144 52 89 159 85 69 17 69 215 -1 118
4328 118 26 98 -115 -66 27 -194 -61 -73 106 -243 73 -143 20 -124 -20 -128 -101 154 -70 66 -146 -167
4350 -167 -54 -131 -82 -53 73 -72 124 132 -71 -101 -177 -129 72 -69 -95 -116 -153 286 -29 -107 -72 29 -104 15
4374 15 -48 -74 34 -1 246 124 -100 -159 50 -42 113 190 -32 -68 67 -27 236 106 -231 162 -7 154 -65
4397 -65 -22 220 -115 -113 120 -69 -58 229 152 -58 250 -80 -67 189 174 95 -29 10 -46 177 -101 63 86 117
4421 117 140 -32 -14 6 114 33 94 37 -31 -5 -7 31 40 -131 -10 -30 -113 6 -290 13 134 -59 -403 -256 182
$$ packed form
4255B3m7J77M5Oo3k70L48q2j42j6j1J85k52J99k72J69J45J7p8p9o7L3P9k08K41
4280H0l37K92l8L7j24P9j35q6K45j10m1L10o5k40k92K92L3L93j92j95J50J04j70
4303a0J29k41j10K84L6oJ01r9J01k17j01J06P2q6J85r2L7P0p4j6n2N2J46k16J19
4328A18r2P2k13M9R3k21J33j2J79l49L16k16J63j44J04j08K7K55k24J36k12k1
4350a67J13p7M9K9J26j45J96Qk03l0p6M8K01j41k6k1l7M39l15p8L5J01j33J19
4374A5o3k6J08l5K47j22k24n9K09r2J55P7k22l6J35r4K63j30l37L93j69J61k19
4397f5M3K42l35KK33j89J1K87p7k10L08l30J3K56j5p9j24L9n6K23k78J64K3L1
4421A17K3j72J8K0J08q1O1n7o8K6kL8Rj71J21k0q3J19k96L03J21j93l44J47M38
$$ plain form
4446 182 10 -10 -27 -113 2 89 -40 -142 -101 140 76 125 21 42 -156 -86 382 -283 26 131 -218 -86 200
4469 200 -214 44 -49 -249 25 -188 -38 26 19 -43 88 32 43 154 -35 28 21 82 206 36 127 40 322 204
4493 204 -11 -27 144 57 137 -134 -139 -96 -2 -177 89 -129 79 -84 166 -205 -205 -106 -139 157 -221 103 -90 15
4517 15 134 -138 235 125 -231 -27 240 117 -41 -453 -183 92 8 81 -190 114 45 -32 -154 279 174 104
4539 104 -27 156 -66 253 -47 134 41 -111 -25 18 -94 112 8 125 -234 73 -53 -74 230 41 43 -115
4561 -115 -9 -50 70 131 71 2 -78 88 119 56 -108 -128 -96 15 130 -64 161 -46 -70 -82 -184 -19 178 -11
4585 -11 0 -70 -291 8 124 -86 -12 192 56 154 -77 -162 -178 18 41 141 166 -126 -41 98 -255 -51 -253
4608 -253 68 -1 239 155 114 -67 -29 42 201 63 -11 259 -36 50 -9 94 179 49 -53 -61 -47 178 78 -68
$$ packed form
4446A82j72k0j7q6J15Q7j29j02M1K41o4M9j04K1j98P0M68o65L09J05l49J32K86
4469B00m14K58r3k00K74k13J50O4po2J31n6J1J11j89O3pO1J24j70R1q7K82j18
4493B04k15j6J71q7Q0k71nM3R4j75K66k18K08j63K50l71%R9l3K96l78L24j93J05
4517A5J19k72L73j10l56K04K67j23j58m12K70K75q4P3k71L04o9p7j22M33j05p0
4539A04j31J83k22L19l00J81r3j52Q6M3j12K06j04J17l59L07j26k1L04j89Kj58
4561a15J06m1J20O1o0o9q0J66L1o3j64k0L2J11J15j94K25k07k4j2j02J65J97j89
4585a1J1p0k21K99J16k10P4K04j36R8k31q5j6J96K3J00K5k92Q5J39l53K04k02
4608b53L21o9K40q4m1j81L8P1J59j38p4K70k95Q6n9J03Q5j30j02qJ4K25j00j46
$$ plain form
4632 -68 -15 73 104 -1 -111 -225 -15 -116 119 -17 -32 28 -36 36 -166 3 20 54 86 98 -111 390 54 -196
4656 -196 -138 -179 107 -109 36 -65 -159 138 -314 -57 -119 73 198 98 -37 30 50 -100 186 90 88 -114 71
4679 71 61 249 -2 117 -57 -139 187 -77 193 -22 -2 268 132 6 -56 114 84 172 67 110 -75 -85 -21
4702 -21 -78 254 135 117 231 -17 64 -67 162 58 -15 -81 132 -144 -110 -117 18 306 -29 18 -38 77 73 -34
4726 -34 -245 250 -78 62 -85 -29 102 158 238 -195 -119 32 -4 53 153 249 82 -29 199 -86 -169 -300 98
4749 98 242 144 -49 150 -97 81 -4 -67 -120 32 217 106 129 0 294 -232 73 291 30 34 -11 31 -74
4772 -74 -59 -344 -160 175 145 242 -28 134 -114 -180 -201 84 -16 30 191 94 56 204 -407 126 -88 -75 -56 -53
4796 -53 23 -9 78 55 -123 184 90 3 136 -141 98 -203 -213 -172 -53 3 -23 25 97 -111 -162 -99 95 -86 122
$$ packed form
4632f8N3Q8L1j05j10j14K10j01K35j36j5O0o4P2k02J69J7L4L2J2k09N01l36k50
4656a96N8m1K86k16J45j01r4K97m52K57o2J92J25j00j35O7K0j50K86r6kk02J85
4679G1j0J88k51J19j74q2L26k64K70k15K0K70j36j26o2J70l0Q8j05M3j85j0O4
4702b1n7L32j19j8J14k48Q1j31K29j04p3o6K13k76L4pJ35K88l35M7n6J15mj07
4726c4k11M95l28J40j47N6J31N6Q0m33P6J51l6N7J00R6j67j11K28k85q3j31L98
4749I8J44r8j93J99k47J78q5o3n3J52J85j11K3j29K94n26L05K18k61Mm5M2j05
4772g4J5k85J84L35l0R7k70J62k48o6k1K85j00M6J61r7l8J48o11N33k14J3J9L
4796e3P6l2Q7k3j78L07r4q7J33k77K39l01j0M1J19N6k6M8P2k08n1O3J94j81K08
$$ plain form
4821 122 100 -83 258 45 -36 -65 -65 -87 81 17 21 -43 123 225 90 116 -40 254 -13 -53 -89 -77 123 -89 -155
4846 -155 46 50 55 -90 57 -57 -124 98 -106 57 21 -92 339 -309 218 -75 -171 44 -58 192 138 -21 -141
4869 -141 -185 24 17 -176 116 -162 -9 -196 -8 -40 -48 -8 -281 -169 79 21 -96 -152 274 -107 -88 10 -90 -150
4893 -150 -77 92 -28 244 -58 143 54 -79 -84 17 181 32 -184 -161 114 -76 -43 27 87 181 139 -37 1 88
4917 88 -62 65 113 130 -36 7 256 205 146 44 10 -114 -46 -100 205 -9 26 -51 33 100 35 -56 -112 -164 -18 220
4943 220 90 -34 -27 0 -38 -237 -263 -15 83 -60 -170 -9 -159 -152 -214 101 -126 -144 -226 -200 125 60 197 -280
4967 -280 -10 -87 -290 90 -34 0 -37 130 222 34 85 19 197 229 91 432 226 -63 11 -27 -33 210 170 -70
4991 -70 70 43 -142 66 71 -132 40 13 -49 -1 -93 76 96 -43 209 83 -12 -76 173 68 -73 -125 25 -35
$$ packed form
4821A22k2j83L41k13q1k9%k2J68o4Mo4J66J02j35K6j56K94k67m0l6J2K00k12o6
4846a55K01MNj45J47j14o7K22k04J63l6j13M31o48N27k93r6K15j02K50n4j59j20
4869a41m4K09pj93K92k78J53j87J88l2qM0k73J12K48n8j17n6M26l81J9R8j00o0
4893a50P3J69j20K72l02K01q9j33nJ01J64j49k16K3K75j90L3P0O0R4m2j76L8Q7
4917H8j50J27M8J7j66M3K49n1n9j02l4j24O8n4L05k14L5p7Q4O7o5r1n6n2J46K38
4943B20j30j24PK7l8j99k6K48R8j43j10J61j50Po2L15k27j8q2K6L25o5J37m77
4967b80K70p7k03L80j24L4l7J67R2j88N1o6J78L2j38L41k06k89P4l8oK43m0k40
4991g0J40k7j85K08Nk03J72k7o2M8r2J69K0j39K52j26r5o4K49j05j41n2J50o0
$$ plain form
5015 -35 10 -162 118 -93 19 -162 -349 -44 25 -96 -107 -74 -255 -109 -167 68 -18 245 -26 -82 -194 40 -159
5038 -159 -151 -49 -35 -87 232 -4 -145 36 -201 140 -89 48 40 -43 207 -24 -226 299 97 49 -251 193 -98
5061 -98 135 28 27 73 91 33 112 44 -167 -67 -74 224 147 -5 -6 -127 -76 -115 -158 -82 -60 32 -27 60 49 -20 -58 155
5089 155 86 101 69 20 -223 -96 5 95 -155 -94 267 -163 -47 -101 -115 24 33 -12 -214 -5 94 -150 51 12
5113 12 -115 13 111 -124 -204 -64 202 -80 -124 -62 23 79 76 -260 -11 -353 208 127 133 54 64 -42 211 -156 136
5138 136 -64 -29 91 99 -22 100 -44 18 145 26 173 53 -25 15 -25 71 164 255 74 -124 -82 -7 15 34 145
5163 145 71 -11 10 -21 -42 13 -106 80 128 17 -96 64 44 84 25 -286 73 -145 93 135 -129 -94 -155 -127 16
5188 16 -14 170 -13 170 55 -69 -5 32 234 -273 -1 -100 2 -119 73 -126 -65 69 126 42 191 -40 93
$$ packed form
5015c5M5j72K80k11J12j81j87L05O9j21j1L3j81J46n8K35q6K63k71n6j12K34j99
5038a59QJ02J4n2L19k36j41J81k37L41k29J37qq3K50k31k02N25k02m8l00M44k91
5061i8K33j07jM6J8n8P9o8k11J00pK98p7j52jj21N1l9m3P6K2R2n9Q7j1o9l8K13
5089A55o9J5l2m9k43J27J01R0k50O1L61m30J16n4j4J39Rm5k02K09R9k44K01l9
5113A2j27J28R8k35q0J40K66k82m4O2Q5N6ll36K49l42N61q1Op9J0j06K53l67K92
5138A36k00L5J20Qj21J22j44O2J27j19J47j20p8M0m0R6R3R1j81j98M2P5K2J9J11
5163A45p4q2K1l1k1N5j19J86M8j11j13J60k0M0n9l11L59k18K38M2k64L5o1K8J43
5188A6l0J84j83J83j15j24O4L7K02n07K72r9J02j21J92j99O1J34N7q4J49k31J33
$$ plain form
5211 93 -41 212 291 -166 89 188 -135 -155 77 123 155 -149 -38 -58 375 129 -80 44 224 184 -92 -12 254
5234 254 6 -187 101 32 -53 92 -75 12 -34 37 151 108 -64 -139 -137 70 -149 17 9 227 -111 101 -71 -296
5258 -296 4 2 -52 5 -63 -106 25 89 41 -131 48 -221 -27 34 151 21 -153 -88 161 -83 189 -96 -112 26
5282 26 35 -66 49 261 44 -14 32 37 -28 21 -35 -6 -97 279 -51 149 6 -242 17 -73 23 60 33 72 48 248
5308 248 101 144 -4 21 62 -101 -183 -48 -300 31 -48 98 -46 197 -142 191 11 27 98 -67 -108 -176 195
5331 195 -111 -29 -188 -185 -165 -54 -24 -6 272 108 26 159 -141 -84 -119 53 -263 7 136 78 -237 20 57 40
5355 40 107 188 -46 -241 -82 117 146 216 -10 68 -12 24 -79 -56 7 44 -137 -125 -44 -46 244 119 -73 109 286
5380 286 -21 -46 81 42 14 7 -44 131 -224 -103 -128 181 75 -85 22 -24 -196 145 127 -122 1 18 -62 -77
$$ packed form
5211I3j34K53P9m57K55R9l23k0K32M6L2l04J11k0M33k46k09J24J80m0k76Q0K66
5234B54k48j93K88o9q5J45j67Q7m6P1J14m3j72p5KK07k19J66qK18l38K12j72k25
5258b96L00kn4N7o8m3J31O4m8j72J79k69J94O1J17j30j74O5K49k44K72k85j6J38
5282B6Rj01J15K12k17n8M6No5M9n6K9r1L76l30K00j43k48K59r0R6L7k7L9k4K00
5308B48j47M3j48K5M1j63q2J35k52L31p9J46j44K43l39L33j80J6P1j65m1o8L71
5331A95l06Q2j59LK0J11L0J8K78j64q2J33l00N7l5J72l16K70J29n8l15K57L7j7
5355D0O7Q1k34j95J59J99K9P0k26P8q0L6j03K3O3L7j81J2Q1kK90j25j92J82J77
5380B86l07k5J27l9k8pn1J75l55J21k5L09j06j60J07m6j72L41j8k49J23J7q0j5
$$ plain form
5404 -77 -37 95 -100 -243 146 -116 9 -218 12 -36 101 -52 -172 131 -79 -47 -20 -144 -186 161 -175 33
5426 33 53 231 89 -114 141 -37 71 203 -52 360 155 -262 170 2 31 135 1 231 18 -26 -91 -185
5448 -185 -150 -83 1 48 -44 -208 -61 -29 -24 119 -115 -59 -14 -307 -98 109 -65 -25 21 -12 52 24 -113 -17 76 146
5474 146 -82 -141 114 -16 210 -151 33 -77 -23 -165 -325 -114 -25 250 -118 180 43 -125 64 -2 -186
5495 -186 -113 114 23 -169 -135 -19 -70 -165 -191 -167 62 83 -118 21 144 -46 -79 209 -86 -51 108 54 4 192
5519 192 68 130 -61 189 166 141 -6 105 198 -61 -180 -29 58 42 29 125 19 67 122 233 120 98 -96 -121
5543 -121 84 -193 19 34 -33 -242 -97 0 67 -167 23 14 -35 -179 105 258 -65 175 -157 82 -305 -49
5565 -49 71 33 -179 -29 40 83 -145 -146 117 -53 -81 164 87 -50 55 101 73 -245 -103 -207 43 -72 -196
$$ packed form
5404g7M0J32j95j43L89k62J25k27K30m8J37j53j20L03k10L2K7j24m2L47l36K08
5426C3K0J78j42k03K55j78J08J32k55M12k05m17M32j68K9J04j34K30k13m4o5r4
5448a85L5O7Q4M7r2j64J47L2NJ43k34N6M5k93K09K07j74M0M6l3O4k8j37R6R3P0
5474A46k28n9K55j30K26l61J84j10N4j42j60K11Q9K75l68K98j37j68J89o6j84
5495a86P3K27r1j92L4J16n1r5k6K4K29K1k01J39J23j90l3K88k95L5J59n4n0J88
5519A92j24O2j91K50k3k5j47J11R3k59j19J51Q7j6j3R6j06M8N5J11j13k2j94k5
5543a21K05k77K12J5o7k09J45R7O7k34J90rm9j44K84J53l23K40l32K39l87K56
5565d9J20l8k12J50O9M3k28jK63j70k8K45p7j37J05M6k8l18J42j04K50j15j24
$$ plain form
5588 -196 -101 33 -86 -56 -16 120 -148 -160 74 83 -103 164 70 -170 -72 115 3 97 -129 196 -2 -279 194
$$ packed form
5588a96R5J34j19L0M0J36k68j2K34Rj86K67r4k40R8J87j12R4k26L25j98k77M73
$$ [...]
8191G
##END NTUPLES=NMR FID
##END=
