##TITLE=1H_Pr SA
 CDCl3,8 sc, 
 5.04.2021
##JCAMPDX= 6.0         $$ Bruker NMR JCAMP-DX V2.0
##DATA TYPE= NMR FID
##DATA CLASS= NTUPLES
##ORIGIN= UXNMR, Bruker Analytische Messtechnik GmbH
##OWNER= root
$$ XWIN-NMR		Version 3.5
$$ Mon Apr  5 13:45:16 2021 Russian Standard Time (UT+4h)  she@DPX200
##.OBSERVE FREQUENCY= 200.131506
##.OBSERVE NUCLEUS= ^1H
##.DELAY= (6, 6)
##.ACQUISITION MODE= SIMULTANEOUS
##.ACQUISITION SCHEME= undefined
##.AVERAGES= 8
##.DIGITISER RES= 18
##SPECTROMETER/DATA SYSTEM= spect
##.PULSE SEQUENCE= zg30
##.SOLVENT NAME= CD3CN
##.SHIFT REFERENCE= (INTERNAL, CD3CN, 0, 15.7039)
##AUDIT TRAIL= $$ (NUMBER, WHEN, WHO, WHERE, WHAT)
$$ ##TITLE= Audit trail, XWIN-NMR		Version 3.5
$$ ##JCAMPDX= 5.01
$$ ##ORIGIN= Bruker BioSpin GmbH
$$ ##OWNER= she
$$ F:/spectra/data/she/nmr/H-F/1/audita.txt
$$ ##AUDIT TRAIL=  $$ (NUMBER, WHEN, WHO, WHERE, WHAT)
(   1,<2021-04-05 13:43:52.81 +0400>,<she>,<DPX200>,
      <created by zg, POWCHK disabled, PULCHK disabled
       configuration hash MD5:
       00 E9 B6 7A A2 85 ED C7 34 08 36 98 17 FE 4E 26
       data hash MD5: 16K
       A5 B0 B8 97 6F 47 EA 1B DF 22 02 8B AF 25 70 24>)
$$ ##END=
$$ 
$$ hash MD5
$$ F1 33 6E 9E CC D4 1C 4B 18 6B C4 27 B8 56 92 37
##$RELAX= 
##$RELAX= 
##$RELAX= 
##$RELAX= 
##$RELAX= 
##$RELAX= 
$$ Bruker specific parameters
$$ --------------------------
##$DU= <F:/spectra>
##$EXPNO= 1
##$NAME= <H-F>
##$PROCNO= 1
##$TYPE= <nmr>
##$USER= <she>
##$AMP= (0..31)
100 100 100 100 100 100 100 100 100 100 100 100 100 100 100 100 100 100 
100 100 100 100 100 100 100 100 100 100 100 100 100 100 
##$AQSEQ= 0
##$AQ_mod= 1
##$AUNM= <au_zg>
##$AUTOPOS= <>
##$BF1= 200.13
##$BF2= 200.13
##$BF3= 200.13
##$BF4= 200.13
##$BF5= 200.13
##$BF6= 200.13
##$BF7= 200.13
##$BF8= 200.13
##$BYTORDA= 1
##$CFDGTYP= 0
##$CFRGTYP= 5
##$CHEMSTR= <none>
##$CNST= (0..31)
1 1 145 1 1 1 1 1 1 1 1 1 1 1 1 1 1 1 1 1 1 1 1 1 1 1 1 1 1 1 1 1 
##$CPDPRG= <>
##$CPDPRG1= <>
##$CPDPRG2= <>
##$CPDPRG3= <>
##$CPDPRG4= <mlev>
##$CPDPRG5= <mlev>
##$CPDPRG6= <mlev>
##$CPDPRG7= <mlev>
##$CPDPRG8= <mlev>
##$CPDPRGB= <>
##$CPDPRGT= <>
##$D= (0..31)
0 1.2 0 0 0 0 0 0 0 0.06 0 0.03 0 0 0 0 0.0002 0 0 0 0 0 0 0 0 0 0 0 0 
0 0 0 
##$DATE= 1617615832
##$DBL= (0..7)
120 120 120 120 120 120 120 120 
##$DBP= (0..7)
150 150 150 150 150 150 150 150 
##$DBP07= 0
##$DBPNAM0= <>
##$DBPNAM1= <>
##$DBPNAM2= <>
##$DBPNAM3= <>
##$DBPNAM4= <>
##$DBPNAM5= <>
##$DBPNAM6= <>
##$DBPNAM7= <>
##$DBPOAL= (0..7)
0.5 0.5 0.5 0.5 0.5 0.5 0.5 0.5 
##$DBPOFFS= (0..7)
0 0 0 0 0 0 0 0 
##$DE= 6
##$DECBNUC= <off>
##$DECIM= 32
##$DECNUC= <off>
##$DECSTAT= 4
##$DIGMOD= 1
##$DIGTYP= 9
##$DL= (0..7)
0 120 120 120 120 120 120 120 
##$DP= (0..7)
150 150 150 150 150 150 150 150 
##$DP07= 0
##$DPNAME0= <>
##$DPNAME1= <>
##$DPNAME2= <>
##$DPNAME3= <>
##$DPNAME4= <>
##$DPNAME5= <>
##$DPNAME6= <>
##$DPNAME7= <>
##$DPOAL= (0..7)
0.5 0.5 0.5 0.5 0.5 0.5 0.5 0.5 
##$DPOFFS= (0..7)
0 0 0 0 0 0 0 0 
##$DQDMODE= 0
##$DR= 18
##$DS= 0
##$DSLIST= <SSSSSSSSSSSSSSS>
$$ [...]
##$SUBNAM2= <"">
##$SUBNAM3= <"">
##$SUBNAM4= <"">
##$SUBNAM5= <"">
##$SUBNAM6= <"">
##$SUBNAM7= <"">
##$SUBNAM8= <"">
##$SUBNAM9= <"">
##$SW= 16.9725357007746
##$SWIBOX= (0..15)
0 0 2 0 0 0 0 0 0 0 0 0 0 0 0 0 
##$SW_h= 3396.73913043478
##$TD= 16384
##$TD0= 1
##$TE= 0
##$TE2= 300
##$TE3= 300
##$TEG= 300
##$TL= (0..7)
0 120 120 120 120 120 120 120 
##$TP= (0..7)
150 150 150 150 150 150 150 150 
##$TP07= 0
##$TPNAME0= <>
##$TPNAME1= <>
##$TPNAME2= <>
##$TPNAME3= <>
##$TPNAME4= <>
##$TPNAME5= <>
##$TPNAME6= <>
##$TPNAME7= <>
##$TPOAL= (0..7)
0.5 0.5 0.5 0.5 0.5 0.5 0.5 0.5 
##$TPOFFS= (0..7)
0 0 0 0 0 0 0 0 
##$TUNHIN= 0
##$TUNHOUT= 0
##$TUNXOUT= 0
##$USERA1= <user>
##$USERA2= <user>
##$USERA3= <user>
##$USERA4= <user>
##$USERA5= <user>
##$V9= 5
##$VALIST= <valist>
##$VCLIST= <CCCCCCCCCCCCCCC>
##$VD= 0
##$VDLIST= <DDDDDDDDDDDDDDD>
##$VPLIST= <PPPPPPPPPPPPPPP>
##$VTLIST= <TTTTTTTTTTTTTTT>
##$WBST= 1024
##$WBSW= 4
##$XGAIN= (0..3)
0 0 0 0 
##$XL= 0
##$YL= 0
##$YMAX_a= 67965
##$YMIN_a= -63551
##$ZGOPTNS= <>
##$ZL1= 120
##$ZL2= 120
##$ZL3= 120
##$ZL4= 120
##$ABSF1= 10
##$ABSF2= 0
##$ABSG= 5
##$ABSL= 3
##$ALPHA= 0
##$AQORDER= 0
##$ASSFAC= 0
##$ASSFACI= 0
##$ASSFACX= 0
##$ASSWID= 0
##$AUNMP= <proc_1d>
##$AZFE= 0.1
##$AZFW= 0.1
##$BCFW= 1
##$BC_mod= 2
##$BYTORDP= 1
##$COROFFS= 0
##$CY= 11.3945322036743
##$DATMOD= 1
##$DC= 2
##$DFILT= <>
##$DTYPP= 0
##$F1P= 15.9154993809931
##$F2P= -4.1035820241983
##$FCOR= 0.5
##$FTSIZE= 0
##$FT_mod= 4
##$GAMMA= 1
##$GB= 0.15
##$INTBC= 1
##$INTSCL= 1
##$ISEN= 128
##$LB= 0.24
##$LEV0= 0
##$LPBIN= 0
##$MAXI= 10000
##$MC2= 0
##$MEAN= 0
##$ME_mod= 0
##$MI= 1.114404
##$NCOEF= 0
##$NC_proc= 0
##$NLEV= 6
##$NOISF1= 3.799351
##$NOISF2= 2.8
##$NSP= 1
##$NTH_PI= 0
##$NZP= 0
##$OFFSET= 15.70392
##$PC= 1
##$PHC0= -11125.34
##$PHC1= 21.20092
##$PH_mod= 1
##$PKNL= yes
##$PPARMOD= 0
##$PSCAL= 0
##$PSIGN= 0
##$REVERSE= no
##$SF= 200.130013532006
##$SI= 16384
##$SIGF1= 3
##$SIGF2= 2
##$SINO= 400
##$SIOLD= 16384
##$SREGLST= <1H.CDCl3>
##$SSB= 0
##$STSI= 0
##$STSR= 0
##$SW_p= 3612.71676300578
##$SYMM= 0
##$S_DEV= 0
##$TDeff= 0
##$TDoff= 0
##$TI= <>
##$TILT= no
##$TM1= 0
##$TM2= 0
##$TOPLEV= 0
##$USERP1= <user>
##$USERP2= <user>
##$USERP3= <user>
##$USERP4= <user>
##$USERP5= <user>
##$WDW= 1
##$XDIM= 8192
##$YMAX_p= 0
##$YMIN_p= 0
$$ End of Bruker specific parameters
$$ ---------------------------------
##NTUPLES= NMR FID
##VAR_NAME=  TIME,          FID/REAL,        FID/IMAG
##SYMBOL=    X,             R,               I
##VAR_TYPE=  INDEPENDENT,   DEPENDENT,       DEPENDENT
##VAR_FORM=  AFFN,          ASDF,            ASDF
##VAR_DIM=   8192,          8192,            8192
##UNITS=     SECONDS,       ARBITRARY UNITS, ARBITRARY UNITS
##FACTOR=    0.0002944,     1,               1
##FIRST=     0,             0,               0
##LAST=      2.4114304,     0,               0
##MIN=       0,             -63551,          0
##MAX=       2.4114304,     67965,           0
$$ Real data points
##PAGE= N=1
##DATA TABLE= (X++(R..R)), XYDATA
$$ [...]
2069i51J62J882o91j810J121J818j465j472J623J127j670q97J722O01j993m2K167
2086A232n28j982Q61J676j166j473J464J234j443j458J693J062j852m94J774M69
2102A069k127J9K038k41j973M55J803o16j838J140J611j604j199J755J024j758
2118d42p72K048K81k269L19K114n28k047J002J666j150j651J426J374j655q45
2134a129J712Q01k175j38J960q4k067L35J876p51j471P67J672j289j530J741Q93
2151A123j265j298K011N19j800k90K048j75k270Q34J628q59j599J162J396j384
2167b19j109J701O85j711o88K050M15k076pJ956n47j626P89J638j307j214J052
2184b18J393j549q37J732N73j697m54J898K46k038K95J611l99j782R52J537j095
$$ y = [-951, -789, 1093, 402, -1408, -287, 1531, 66, -1406, 217, 1344, -326, -1223, 499, 1100, -893, -935, 1232, 704, -1278, -417, 1259, 93, -1380, 84, 1318, -125, -1583, 110, 1172, -680, -1174, 600, 1069, -1058, -1039, 999, 758, -1215, -760, 1043, 427, -1411, -271, 1340, -264, -1463, 292, 1316, -442, -1214, 834, 1115, -1154, -835, 1279, 751, -1296, -294, 1372, 222, -1429, -3, 1371, -284, -1129, 583, 1384, -791, -929, 1031, 947, -1120, -785, 1091, 340, -1131, -364, 1308, 19, -1511, 230, 1123, -142, -1440, 571, 1090, -710, -1000, 1048, 873, -1397, -563, 1065, 206, -1393, -231, 1165, -219, -1328, 373, 1058, -653, -1341, 709, 1124, -952, -959, 997, 450, -1176, -387, 1251, -56, -1270, -218, 1175, -374, -1211, 521, 1094, -603, -1057, 841, 1087, -951, -656, 955, 556, -1226, -274, 1263, 168]
2201A68j332J553R11j313q81J515O02j747l50J708R2k069O15J938j141j490J049
2218a72J319j269o88R70R03j264r53J913K56j975K29J626k94j632M71J902j116
2235B26j366P02J768j438j031J410O51j425o82J986K6j862L96J527m27j398O79
2252b58J540j094j138Q46J093j127r31J271Q36j470n66J561L13j939M40J562k95
2269F44j750Q15J499j123j198J225Q55j087p93J485M76j736r1J768n60r59J1J542
2287A023n50j431J116J032r68j235J377R33j707p42J755N61j747k01J762k91j458
2304g71N7J803o46j405P54J193j279p47J206O83j447n02J601J99j455O8J763o18
2322D57j627Q40J356j042r80P39J412j456q26J154O88j226m49J556L7j510N1J723
$$ y = [168, -1164, 389, 1300, -13, -894, 621, 1223, -524, -874, 834, 926, -1143, -528, 1410, 269, -1221, -172, 1147, -122, -810, 160, 1063, -201, -1154, 759, 1015, -960, -731, 895, 601, -1031, -560, 1342, 226, -1140, -438, 1330, -108, -1139, 271, 922, -503, -1185, 801, 827, -1035, -639, 888, 461, -937, -258, 1282, 188, -950, -104, 989, -138, -1069, 202, 1038, -432, -998, 563, 876, -1063, -623, 939, 644, -1106, -291, 1208, 85, -1113, 112, 967, -120, -913, 572, 1048, -688, -779, 989, 429, -530, -519, 1023, 473, -958, 158, 1190, 222, -1013, 364, 1297, -410, -1152, 603, 1164, -583, -784, 978, 687, -771, -714, 1089, 443, -962, -208, 985, -294, -1041, 165, 848, -599, -1101, 500, 699, -756, -688, 1075, 457, -1170, -330, 1026, -16, -996, -257, 1155, -301, -1127, 27, 715, -511, -960, 596, 633, -877, -826, 897]
2340H97n15j099N30J130r14j124J319Q78j081r13J199M59j398J8J144K70j680
2357h80N66J290l25j648J081J237j353r60J141R55j129q84J410K59j203l26J485
2374G16k22j282K88J376p02r64P44J095j148q45J240N60j361k64J368J24j489
2391g66M8J408l96j070M27J309r73r10O99R70q80q63J008Q11j161n15J496J6j405
2410g47R2J435l66j276M65J154m12r68N72Q25j020o33J269L80j375l07J710l96
2428D02q46p7J469o12j179O77J049q85r28R03Q70j141m15J145M34j476j46J485
2446G29k26j162K69J205o24j242Q43R40q60p92R89O27j072k85J125J77j318J93
2464d84J096l80p44K59R31p27r65J386L60j025o87J241K05j085l51J320M02j716
$$ y = [897, 382, -717, -187, 943, 29, -1095, 224, 1102, 21, -892, 307, 766, -632, -614, 530, 800, -880, -314, 976, 651, -997, 84, 1321, -32, -992, 149, 1104, -25, -909, 501, 760, -443, -769, 716, 494, -788, -500, 876, 174, -790, -46, 1049, -99, -944, 296, 856, -505, -769, 599, 723, -766, -718, 690, 294, -776, -349, 960, -13, -923, -224, 746, -134, -997, 11, 822, -339, -854, 642, 658, -747, -655, 780, 414, -862, -397, 757, 345, -623, -51, 774, -246, -879, 390, 770, -605, -912, 798, 402, -444, -521, 948, 336, -843, -166, 883, -2, -930, -27, 843, -298, -713, 432, 866, -610, -756, 729, 503, -659, -390, 815, 191, -1051, -208, 732, -128, -920, 69, 696, -376, -661, 464, 641, -677, -484, 612, 232, -512, -253, 678, -49, -1014, 372, 732, -293, -980, 261, 466, -619, -970, 350, 752, -964]
2482i64N02R91l28p62L47J177r27r89J057O17q83o05J074L82r99l80J309k2j306
2501g09K99J053l65j015O09J040j064n83R38O46q82m83O42Q33j530J03J079l76
2519B35p22J77J056l38j037M52J020j050q12J161M76j014k60Q58K31q75j17J272
2537G13l60q78M80P59n21r12O10P47r56n94J161M95j116k77J176j31j032M58O42
2556D64o6q35K68O92o62p46J015M86q67n26J150J0p13j78J134r6q62J35P71j55
2576D19j109O95N45o53n13R67O28j218l34Q39L98j301K29J072m85q34M71Q38m05
2595B49r66Q27N46n79n04Q20K99j004j91O03K35o32LQ69k73r37L65R97l70j007
2615f50O61O76j092l32J013K47j107K4P87J09r72L50Q08j94q68L04Q65o28o39
$$ y = [-964, -462, 529, 201, -561, -214, 963, 36, -953, 104, 721, -162, -767, 307, 689, -310, -690, 619, 597, -709, -410, 643, 278, -737, -128, 912, -152, -735, 203, 849, -33, -516, 126, 959, -571, -468, 611, 235, -487, -310, 746, 408, -629, -177, 843, -207, -1019, 142, 618, -396, -656, 202, 433, -442, -559, 713, 353, -525, -45, 714, 193, -719, -109, 638, -318, -912, 249, 744, -372, -649, 527, 396, -636, -178, 464, 398, -437, -169, 523, -139, -885, 130, 616, -251, -777, 373, 383, -330, -508, 626, 530, -332, -197, 574, 419, -690, 5, 550, -103, -616, 351, 979, -239, -573, 266, 664, -637, -408, 664, 179, -655, -184, 654, 249, -717, 110, 656, 77, -427, 393, 692, -312, -503, 100, 335, -297, -294, 575, 302, -635, -270, 727, 357, -650, 11, 687, -405, -737, 276, 523, -584, -560, 227, 336, -636, -286, 522, 328, -540, -236, 629, 1, -638]
2634f38Q17N36r97j50O94K75j057o3J071l33q28M88O51k7j125O09P86p76o77P66
2654B2O53r09l20J018K92j464L90P93k31r57O31N88l30q23M93O51n64p39Q35O02
2674F31r41j71Q65j85o48J93P98k5j167M42O78k71p58O04N76r67l34Q70K41q88
2694d57j53R00Q3o57j50R64l24r16O96N73m88r37P83P18q36m92Q03O54j007k40
2714d83P90K68j086K88R13n40l56J51N49n80l06Q65L22r90l59P79K78r69n1J117
2734F00k31j054M16P00j92n28K29M37l13n49R41p2o03l46J074k47n70J25P15l69
2754A63p29M17N86m65m56O94J97n32m22P09L56o71k12Q85j32r76J29R04j28p61
2774d44K28Q47n51o96O17J81l17l78P17J90q62j0P87R2q62N02N49p36m28N92M45
$$ y = [-638, 179, 715, -282, -432, 262, 537, -520, -583, 488, 155, -673, -185, 466, 439, -686, -77, 709, -67, -744, 22, 675, -234, -554, 464, 756, -708, -318, 475, 244, -713, -82, 506, 176, -647, -154, 497, -67, -806, 29, 631, -310, -481, 384, 199, -449, -256, 542, 517, -650, -208, 470, 199, -559, 45, 621, -346, -680, 190, 431, -457, -610, 290, 373, -284, -434, 530, 206, -710, -14, 559, 71, -866, -83, 635, -201, -693, 110, 764, -243, -483, 307, 575, -511, -223, 690, 150, -206, -55, 494, -86, -392, 473, 795, -195, -554, 225, 503, -466, -517, 600, 369, -685, -269, 431, 239, -289, -60, 377, 64, -485, 456, 384, -219, -565, 509, 262, -308, -183, 532, 163, -566, -149, 437, -28, -484, 210, 407, -125, -547, 162, 518, -153, -365, 520, 388, -588, -459, 445, 317, -444, -216, 631, 80, -616, 1, 182, -135, -513, 204, 394, -468, -478, 309, 401, -461, 41, 590, -146, -574, 18, 463]
2795D63n25l87P04O5l90l97Q10J2p38K08M84k27n40N98M67n89o13Q76Q3o33k51
2816e20R30p5o32J04O24oq08J96P41l28p59M21P19o66k14K18M60q71NP49Q6n95
2838b21k67P03j28k62q9Q90n84p57P83J30l09n01J049l1q15j89Q52R1q40L96N51
2859D52n02k44K01L78k51n16M62N06p52j76N25P87j295N8P69m2p57K04M65k01
2879G1o48K26J120q25m49Q44L10p43m19P42K36r24Q5O42k9q62L35P31L7r49K36
2900b33P86o19l17O37L19q53J0O41j93o66K94M24J6o91L14P86o53l92N23K26o05
2921b46k8L58K38o49r2P08J00q86O4N27Q4p18N56L08n53l22P85R3p05j03M59L90
2943C68n98k80J245m12p44J13O95k85l61K24M20l06l52N42Q9n43k64Q84N6q78
$$ y = [463, -62, -449, 255, 320, -70, -467, 343, 355, -383, -175, 309, 82, -458, 140, 607, 18, -595, 281, 364, -269, -520, 410, 335, -297, -193, 431, 425, -383, -187, 554, 226, -533, -112, 607, -59, -273, -55, 405, -466, -461, 288, 374, -221, -488, 215, 87, -175, -264, 626, 42, -715, 68, 198, -111, -612, 437, 406, -409, -598, 254, 345, -495, -99, 452, -50, -294, -93, 285, 34, -482, -20, 486, -266, -442, 83, 870, -425, -367, 402, 360, -397, -193, 272, 71, -577, -351, 769, -56, -505, 339, 649, -94, -513, 229, 465, -459, -374, 268, 239, -623, -288, 443, 480, -469, -233, 553, -66, -383, 254, 573, -280, -270, 371, 178, -488, -194, 230, 246, -445, -131, 655, 2, -390, 133, 359, -246, -274, 84, 322, -327, -419, 289, 389, -497, -433, 94, 178, -540, 16, 324, -229, -551, 234, 327, -378, -481, -22, 368, -230, -510, 735, 323, -421, -308, 387, 102, -259, -35, 385, 79, -273, 269, 358, -185, -449, 435, 491, -387]
2963c87J80P82m97n13K98N64l64p18P91N17o30l73N07M84r01m20J080n4o52k18
2983e24R67m48o55N58M49l82k65K60N27n97k73O03K07q37o0O07K37o25M0O80n12
3004d3k67K43N03o55k51O67K89o07m41Q30J02r70K24Q04l49l97M10M36j30o65
3024b67K71M00k29n53N17J89m64j34P67j98p59J89N91J23p84L77L95l55m09L97
3044F4L79m11m55M70M59n71l12N17J50n99l2P82l49l74K48N49o76n22O84L67o68
3065c00J06M29O2o20j94R60k69n89K21N14l81n22N31N77n13p21P98K74p33m7O83
3086B66Po79J20O25l97j80J81L22k75o53Q10K31m27m03O69K27p58J43M90Q0p92
3107c93J78N10O2r27P54J97n10k10M16L95m36l39O96J76p24j19O52k15n74L55
$$ y = [-387, -207, 575, 78, -435, -137, 427, 63, -655, 136, 653, 23, -350, 157, 641, -260, -680, 400, 346, -306, -524, 443, -5, -660, -102, 347, -35, -300, -40, 487, -110, -383, 220, 427, -410, -470, 137, 374, -251, -211, 469, -43, -310, -67, 436, -219, -470, 197, 486, -121, -562, 268, 370, -600, -376, 428, 79, -318, 92, 528, 398, -267, 4, 404, 175, -378, 139, 328, -136, -270, 497, 299, -460, -271, 320, 443, -341, 36, 431, 76, -333, 64, 443, 32, -423, 47, 506, -65, -377, 140, 290, -309, -341, 441, 92, -282, -34, 515, -161, -683, 1, 368, -300, -194, 235, 297, -323, -517, 443, 174, -415, -194, 320, -61, -583, -52, 525, 12, -709, 89, 363, -370, -417, 266, 273, -406, -286, 339, -58, -238, -57, 265, -10, -663, 147, 378, -49, -452, 217, 444, -314, -171, 319, 399, -393, -215, 295, 357, -570, 184, 381, -129, -339, 77, 472, 36, -303, 393, 569, -155, -274, 378, 163, -411, -56]
3127e6L74m33m75P60K15n06l05L64M66n70k55O92P7j003N53P14o28m43M14N36
3147D91m30q45R23M33p21k70L53M83n29j82N15L1o03J94L28L0n75J46M11k09m48
3168d74O10J90n11j20M14J98m75jL95J12o62K88J87N3r79R55L94m57n55O08L45
3189E15o14o05R28P1o98j01Q59k17n95L99M89l07o34N80M52n42l97N83J48m15
3209a01j78N77R8o01j15O48j29n51J02N86n38l24N40M11n61j99M25M55o31m44
3229e30P06J03m88qO24r2o81J89N01m16j74L23L38n52j84N91J70n50j96R06l59
3250B21m53P0N83l92m49M75L79o25l43Q47Q0m91j04K70J93n17P5L76P7q62L74
3271b16O35k02m44K46K54m83r1L23L52p01K81L35J08n88o0O30k00p07O03K21n38
$$ y = [-56, 318, -115, -590, 170, 385, -121, -426, -62, 404, -166, -421, 271, 348, -655, -102, 612, -16, -459, -45, 491, 61, -784, 139, 572, -149, -419, -66, 417, -112, -294, 221, 252, -351, -157, 171, 201, -374, -228, 183, -26, -474, 136, 326, -185, -305, 109, 307, -168, -169, 226, 338, -324, -36, 151, 204, -775, 180, 574, 117, -438, 170, 515, -99, -704, 224, 295, -403, -504, 355, 138, -457, -58, 431, 124, -510, 70, 522, -20, -417, 166, 314, -101, -279, 298, 396, -205, -320, 328, 199, -352, -250, 336, -202, -526, 14, 425, -136, -335, 90, 545, -86, -530, 176, 279, -209, -217, 407, 315, -366, -177, 324, -92, -266, 57, 395, -157, -341, 250, 420, -130, -326, 580, 221, -232, -162, 421, 29, -420, 55, 434, -191, -534, 313, 393, -98, -202, 68, 261, -256, -181, 195, 272, -590, -216, 419, 217, -227, 19, 273, -210, -301, 22, 374, -327, -46, 289, 397, -191, -251, 379, 179, -528, 75, 296, -242]
3292b42k49N36L08k98l27P69j9q16k76Q41K4p71J27Q87l02p17O91L36o16k98O94
3313B82J93p75l15R67O1p33J64N16l59l86M36K12k25m97N92o0k65j84O05Q5m87
3334a73nL33L00p40J0Q65k94n56L35M44k70p21M62N14m42o29P37J09p43k8O55
3355A63J78o01l5N62k33k67J39M32k72o58Q12J91m24m60O81K7o14j7P18q4o32
3376c94R1Q92n12m35K55L50l85k06M52L39p03J40L30K14p49J35N49j1p88K78M50
3397B92l24o54M34O93l48l10K84N17q33j83N19M43p05o4N73k66l71L69L22k66
3417A22o07O65M33o29n39Q44J20p10K1Q91l65n48K03N81k74p26O12K92l44l80
3437c38K72M38n69j31K36N93p05j11O11j66n79K74N77m37m64O30K08l68m08O59
$$ y = [-242, -491, 45, 353, 55, -272, 497, 478, -338, -614, 227, 251, -520, -393, 494, 192, -525, 166, 502, -114, -412, 282, 475, -300, -615, 352, 413, -320, -156, 360, 1, -385, 51, 263, 38, -459, 133, 73, -192, -376, 229, 314, -173, -178, 155, 455, -285, -275, 590, 296, -260, 75, 519, 249, -472, -10, 504, 62, -567, 170, 279, -464, -492, 163, 341, -260, -295, 267, 34, -233, -94, 338, 66, -592, 220, 411, -13, -473, 208, 235, -379, -396, 322, 238, -394, -303, 589, 77, -358, -103, 247, -138, -344, 108, 447, -256, -116, 214, 428, -321, -186, 363, 352, -436, -158, 292, -32, -686, -252, 441, 93, -217, 67, 584, -249, -432, 87, 530, -175, -239, 334, 68, -303, 66, 388, 122, -485, 180, 613, -16, -555, 289, 409, -301, -280, 611, 246, -302, -99, 482, 208, -518, 94, 386, 42, -338, -66, 372, -197, -328, -92, 501, -204, -315, 296, 130, -449, -175, 402, -35, -499, 131, 339, -29, -437, 222]
3457B22J57o52j21M04N1j09r2L36M2o98K46O42j45o67N81L80o16l74N78K70n20
3478h5m60J024l00k72n4L75Mn15K68M56l99n02M84M57o43q1L90Mk82j99N02K6
3500A98n69M12K22j37n93K39N70k62k57L74J89m76k57N94J18p18j4O36q4l49k82
3521d46R65l80m70L52L65m64j57O75o8n85k14P58k3p99K85M29K5m02M7M5J42k28
3543a48K72J74l80l42M78J65m34o8N67J65j014M34J83L52m84K71L50n97m43N05
3563FN37o51l46O54lk66l17P36j44n44L69M74j66n90J68O00m58m57K12O83p15
3584b18q6M75K70o26J46K61j10m36K08L70l31o24P39J53k83m79P48K10n60l1L38
3605A34K20n96J78L05j17o81L73L79k6n44K87M91l19m76M23R5o08J49O87j17m94
$$ y = [222, 379, -273, -394, 10, 61, -48, -140, 196, 238, -460, -214, 428, 283, -384, 197, 577, -39, -413, 165, 435, -85, -545, 479, 179, -93, -147, 228, 232, -283, -15, 441, 42, -460, 24, 481, -162, -243, 147, 151, -131, -330, 172, 198, -371, 41, 263, 126, -467, -228, 342, 80, -177, 197, 386, -90, -347, 247, 365, -353, -367, 269, 185, -164, -446, 519, 139, -331, 21, 386, -78, -235, 440, 372, -213, -427, 331, 308, -491, -206, 223, 248, -154, -107, -62, 80, -148, 124, 298, -82, -424, 54, 219, -215, -283, 284, 449, -565, -131, 52, 404, -80, 191, 541, -56, -499, 6, 543, -108, -454, 200, 197, -69, -386, 350, 206, -338, 31, 505, 339, -251, -83, 517, 59, -398, -186, 497, -218, -304, 171, 441, -185, -39, 222, 112, -324, -116, 254, -77, -701, 38, 191, -92, -571, 177, 387, -173, -204, 134, 354, -242, -64, 241, 124, -557, -184, 195, 169, -375, -88, 403, 84, -392, 31, 126, -482, -333, 354, 237, -257]
3626b57k2N14j87j76RN48m38k57K81N32o80k55P67m1o62K07M42N4m80L9M08j61
3648A85n34K88N25p56j08M40J50m15n2N43j13k14j57N45k47m04J31P36l91n16
3668c64L94L00o07k48P80j0o32K12N43k01k81p8N56j21l37k2O53k31o43O12j93
3689H2l79j17O18k7m48J38N86m68l76M60M07n65R0P2J07k53k48J98L70n27l1L89
3711G8L00n10m18P97j19l97RN34n29m04N86K65k26n13M20O16o78j22P39p1o67
3732c10K51L92q9k96j21N97l54l26M38K16l86k24L83L2m69n1K43L19l04l01N76
3753B16k61l89M45M1R8n40K46P01n34m8K27K70m83l69O39j8k64l68P76k72m61
3774c48L37M62m33l59M03M60o89j73M72j45r5k27M78J51n00N8L84Q0n19J79L84
$$ y = [-257, -279, 235, 48, -128, -119, 429, -9, -266, 15, 547, -133, -388, 379, 338, -324, -117, 325, 379, -101, -62, 346, 185, -349, -61, 464, -292, -400, 40, 190, -225, -277, 266, 153, -61, -218, 327, 80, -324, -193, 543, 152, -364, 30, 330, -277, -525, 255, 245, -387, -175, 368, 167, -114, -192, 364, 243, -94, -116, 537, 306, -337, 275, 82, -297, -414, 204, 177, -271, -133, 453, -15, -391, 69, 476, -89, 1, 73, 180, -73, -321, -123, 247, -280, -311, 78, 378, -132, -550, 247, 128, -269, -260, 274, -255, -659, -73, 192, -34, -547, -127, 489, -189, -311, 428, 357, -310, -59, 333, 244, -52, -173, 424, 70, -256, 182, 398, 12, -212, 171, 203, -266, -317, -74, 245, -59, -360, 216, -45, -434, 11, 52, 150, -390, -144, 557, 23, -25, 202, 472, -11, -380, 259, 241, -23, -391, 385, 113, -348, -11, 451, 18, -341, 62, 522, -167, -340, 132, -13, -108, -335, 143, 294, -206, -148, 236, 316, -203, -24, 360]
3795C60m67q8J42L50n41O8N67l38k53j29R06l17m65K38J66j84o17M05L42m41m8
3816c44N77n3m75ql5O10o67M46L46k67n79M88L5N1m41K66L81m81j30K34L80o30
3838b96J75J79J1n18N17N48q40k78N63K81o41R2L80N7m41j10P18n7p10K49J75
3859E4O3m26K26M87n12j77J82N02m05k81M45K4j31j68M85L1m63L2M64k83l14O6
3881i9L75l61j74M22J41m08o2K38L31n82j22O36l09k23J27L72j93l70K18J50k3
3902H4l53L16P0k0k40L6L59l94O0K99j68j95j60N05k37n2J82J46l61l18O79J93
3924D31q32p8P01P1n60J46K96j71l47K63L82j08l08M09O0m17j35L29L33q71J81
3945b25L99O3m03K6M81m20j7Q6M79l58l36J35N11p01q8O05N0o88K71L71j24m90
$$ y = [360, -107, -195, -53, 297, -244, -176, 391, 53, -200, -329, 577, 260, -205, 33, 199, 15, -602, -197, 145, -296, -344, 233, 180, -295, -303, -338, 272, -395, 51, 397, 130, -449, 39, 74, 125, -316, -50, 331, -150, -280, -46, 334, -296, -121, 58, 69, -449, 68, 616, -224, -502, 61, 342, -299, -207, 173, 230, -211, -321, 397, 340, -370, -121, 54, 117, -309, -83, 404, -108, -285, -103, 399, -6, -287, 158, 182, 51, -117, 368, 399, -64, -32, 432, 149, -165, -99, 276, -85, -259, 163, 304, -104, -166, 72, 403, -179, -301, 335, 26, -197, -70, 302, 109, -261, -43, 107, 84, -269, 47, 117, 97, -143, -107, 252, -142, -82, 217, 49, -146, -306, 199, -38, -90, 92, 238, -123, -441, 238, 431, -401, -479, 222, 293, -267, -121, 175, 4, -343, -80, 302, 194, -114, 295, 355, -62, -197, 132, 465, -406, -225, 174, 237, -166, -140, 341, -79, -96, -10, 469, 111, -225, -90, 421, -280, -368, 237, 287, -401, -130, 241, 117, -373]
3967c73Q9L73j16j30P3L42n08J64J10J82n32K2N27l42j8K6K36N3l64o9O70o89
3989b74J14K2L29j52j75J14K94k95l44M50N0n89J91O41k89m71J17P51m21m26M09
4010D6K66n56j91O81l7l16K4L33k94l68K94M28j84n35J61O09j23o18N13J09m51
4031b09j5K94j22l04O0N50k38m33M29j2m2l77L16K08j30k82K43M25n18k69O18
4052A92l15j91K4L97k88k83M27K12j82k12L39J31k19j21K70j02n33K36J50K06
4072A38l68M6M29J6q31M32O56l03o19K48L71k49K2K13L42n74j10J88J99l33m4
4093a31L00k4m67%O65o72L2L66Q8k76j74M73J40l28l92Q51k36m54J97J09M7m03
4115b89R3O43o50J32J46K36m73L1K85k3l67J15N07q5l87J6J58j50m43O97p5L9
$$ y = [-373, -284, 89, -27, -157, -84, 258, -250, -86, 24, 206, -326, -304, 223, -119, -137, -111, 125, 178, -186, -255, 415, -274, -160, -138, 191, 39, -136, -22, 272, -23, -367, 83, 133, -456, -265, 376, 87, -384, -267, 484, 63, -363, 46, 312, -244, -435, 246, 209, -107, -83, 250, -44, -412, -118, 310, 126, -409, -248, 361, 238, -380, 133, 242, -209, -224, 70, -52, -356, -296, 254, 16, -417, 12, 0, -42, -419, -103, 105, -25, -307, -64, 361, -157, -426, 192, -123, -314, -290, 107, -181, -464, -37, 175, -7, -219, 120, 251, 32, -89, 181, 79, -454, -218, -68, 138, -230, -184, 245, 261, -570, -138, 518, 215, -404, -156, 215, -34, -12, 201, 543, -31, -141, 47, 246, -87, -131, 169, 145, -322, -322, 343, -329, -297, 69, 157, -119, -293, 180, 320, -8, -400, 451, 215, -239, -42, 67, 114, -289, -196, 447, -203, -71, 75, 311, -162, -131, 154, 131, -236, -121, 386, 301, -86, -70, 88, -62, -505, 192, 117, 156]
4137A56m20M66K27k55m24N41j27o01K51L93l77k27L15L87k91o55P77J2k43k79
4157c74L67K24l57M8K59r1l19O0N06mp39M78J66j09m42N26K31l91j56L49r2o4
4179G6j31M03l37j29J6L67k00l41J40M02k50k64N43j28l96p3L09K30l85J7J26
4200en1j55L12J57j10k71J66K71m12l34M19L06l68o5M52k02o71M90K69j27l72
4221c01L17M09l63m89N03J22l84j01K57O9j09k65M53j39k56J03N64l53l97o7N58
4242A31l4nj53K34j03l59M52J56k91k80N58k32k97L05N5J1p04Q14m8k85nN3K59
4265B32l04j04M77q4n19K75K1K18k88k50O77q0l06K01N1l30k15N48J2l55k8K94
4287A43o3k19j17L83J71n55K94R9j29l29L01L38l24k70N13j11o4m85N64J97l55
$$ y = [156, -264, 202, 429, 174, -250, 291, 164, -437, -186, 207, -170, -397, -82, 305, 14, -641, 136, 148, -95, -374, -7, 217, -140, -92, 167, 76, -243, -183, 323, 319, -420, 58, 224, 115, -327, 199, 430, 39, -117, 232, 140, 76, -55, 348, 11, -118, -102, 265, 65, -276, -136, 266, 16, -248, 295, 167, -229, -302, 7, 237, -148, -131, -5, -56, -211, 101, 258, 148, -123, 43, 314, -98, -432, -13, 293, -75, -140, 312, 110, -561, -71, 198, 71, -301, 16, 425, 62, -427, 76, 198, -186, -287, -30, 39, -70, -335, 118, -21, -277, -174, 390, 37, -360, -427, 131, 97, 92, -61, 173, 70, -289, 163, 319, 28, -252, 306, 74, -223, 82, 137, 148, -556, 258, 210, -75, -80, -27, 232, -72, -176, 301, 217, -302, -27, -6, 212, -76, -326, 351, 271, -35, 166, 217, -113, -328, 220, 232, -123, -151, 143, 80, -139, -256, 127, 298, -257, 37, 136, 7, -322, -21, 317, -7, -277, 236, 125, 61, -424, 140, 337, -18]
4308a8pL35k79k4m5K34k4n70M30K26l74k01N53K33o42k7J66L29m34K71J82k40
4330G4p5j75O93k57n18J78K24j00n5L95j77l31j18L38J23n47J39K45n7k77L15
4351C7L0j31k23L53l6J0m19N27l0m31R2K61Q2m57L15Q8J25q8o8M5j63l22N31J32
4375B60m65L03J21j69p5o1J75R5n85L86M19l33k64L16Q4l40o1K21J56m27o5N60
4397B51j58l25J28L60k01o32P58j45j26k92L07J70l81K15J41J5j77QJ09J82m99
4418b92L33K52l1n27P5O70o83KL11K51l73m1L53k75j8r7M04j96m49J62M00k07
4440B4j86J05K57m52%J46K87o25K79M06j12l55L30Q3j99k28j8N99l68k45L73J58
4462B59n24j3O71j28m08o4M27J09o07L22L26k41k44L01R8k94l32M19J48m10k32
$$ y = [-18, -25, 310, 31, 7, -38, 196, 172, -398, 32, 258, -116, -317, 236, 469, -173, -200, -34, 295, -139, 132, 314, 74, -1, -176, 517, 260, -258, -80, 144, 44, -11, 384, 207, -124, -242, 96, 219, -328, -189, 56, -1, -278, 37, 67, -64, -287, 66, 30, 40, -379, 148, 118, -313, -221, 40, 122, -335, -20, 68, 193, 105, 37, 82, -81, -403, 128, 260, -205, 98, 219, 50, -25, -86, 89, 184, -401, -15, 404, 71, -193, 123, 207, -133, -194, 27, 183, -244, -309, 251, 93, -232, -104, 256, 55, -577, 181, 36, -90, -382, -75, 95, -286, -71, 70, 85, -92, -84, 25, 207, -292, 41, 293, 262, -265, -190, 480, -203, -201, 110, 361, -12, -53, 300, 25, 7, -90, 314, 118, -331, -169, 231, 24, -162, -57, 200, -252, -252, -106, 181, -444, -165, 241, 129, -226, 104, 187, -12, -240, -258, 341, -27, -272, 101, 259, -265, -278, 393, 265, -143, -207, 220, 329, -278, 44, 370, 129, -115, 186, 284, -10, -342, 77, 225, -185, -417]
4483d17N45O6l83K14K46J00n87k0M30l48k22L57K67k46r4N1K33l91K5K22J34j43
4505C9l92K51J79j68k88O31r5l41K29K96m18k45L77L5p8j49K30N7l42J76L31j77
4527A38m20L24J30j01m55J93J50j43j25J57L98m92k4L18p8j10p8O50n73r0J98
4548c3k3M5j47M04k2j88m54N62J07j82K9k3j66q5KL80Q7m69K69O1k10j41L47L84
4572E34n65rK45On78K16L51N5n55J20M20j43l80K79L6pj77M6L51k48J36k78J12
4595c3k53l2M02l9j74k4L71j26k11L44J20k88k70M72n1k40j13K45J81k21k07L09
4617A62p1m16R2M52k71j06K12J89l47M7N5L08l43m1J42K06m62J24L42k6j64o9
4639A5P0m9k60K33K20n60M9L31J90m18J10K20k3k67k10N85o2k50j03N87k18l08
$$ y = [-417, 128, 194, -189, 25, 271, 371, -216, -236, 194, -154, -376, -19, 248, 2, -92, -41, 192, -199, -174, 48, 182, 39, -353, -102, 77, -91, -379, 252, 157, -184, 45, 341, -77, -322, 55, 90, 12, -137, 93, 150, -192, -16, 315, 138, -282, 42, 172, 71, -384, -191, -41, -184, -309, -152, 246, -246, -270, 48, -30, -140, -218, 432, -141, -231, -33, -56, -11, -158, 246, 224, 36, -418, 144, 251, 69, 98, 75, -91, -176, -174, 206, 293, -176, 93, 154, -56, -197, 150, 534, -31, -40, 205, 211, -367, -151, 200, 255, -300, -180, 240, 97, -283, -4, 32, 25, -152, -106, 245, -3, 133, -145, -33, -286, -318, 84, 45, -129, -153, 218, 92, -119, 225, 345, 57, -213, 259, 208, -32, -145, 100, 281, 60, -147, 162, 91, -325, -233, 219, -52, -158, 54, 243, -104, -57, -2, 306, -37, -78, 64, 270, -192, -68, 274, 248, 84, 15, 85, 36, -224, 9, 229, -331, -282, 49, 239, -179, -69, 151, 128, -139, -349, 236, 174, -76, -179, 408, 190, -118]
4661a18K87p1n4k67J37J54m08j25P49j52k3k01L34j34k01R4J22M9m24K59j13j18
4683b24J41M8K65n80mM69J81m96j8N92m41J4j53L53l56j35O10k81j4r8K79j14
4705C8k35K59M2O1l04K62j7l25K17k03L33l47K90k7N3M1n17K87K54j36j84J63
4727EJ3m25L57K35m68K68K4k5k54o4L89n2j32M2K20j07j64K05J80l32j47K8M52
4750B48l48k71L74K84k81k59L68J12l49p4K36j8j97O2L84k31k68K14J46p1m73
4771d12M25J95m60K33J47j27q7J04K36j34l62P5L97j02l89J59J45k5j88M48l36
4792e8q1oN6K02l35L59Mj03J7LN8P3k62L05k00l8r9J17J58k68o3K52l6k10K01
4817D6K72k45l89N70k57j65J33K0J37m46K64K14j95j23O5k4O9k3K12k19J8k60
$$ y = [-118, 169, 98, 44, -223, -86, 68, -340, -465, 284, 132, 109, -92, 242, 108, -93, 1, 123, 172, -252, 7, -106, -224, -83, -35, 230, -350, -354, 115, 296, -200, -218, 374, -67, -53, -206, 147, -209, -344, 266, -15, -29, -127, 152, 38, -197, 62, 104, 165, -139, 123, 106, -219, -2, -205, 128, -219, 71, 44, 97, 138, -379, -92, 162, 26, -158, 5, 18, -407, -50, 185, -283, -15, 9, -16, -270, -334, 55, 3, -129, -87, 133, 26, -138, 67, 247, -85, -232, -204, 248, -100, -371, 3, 287, 6, -253, 115, 227, -122, -196, 40, 22, -175, -113, 271, 40, -228, -14, 132, 61, -412, 13, 208, -252, -19, 128, 1, -86, 18, 254, 120, -242, -167, 230, 128, -261, -102, 43, 18, -170, 278, -58, -139, -145, -89, 113, -222, 137, 141, 38, 55, 58, 116, 189, -73, 232, 32, -6, -105, 12, 170, -98, -161, 91, 55, -155, 46, 318, 73, -316, 254, -3, -168, -35, -15, 122, -324, -60, 154, -41, -164, -99, -123, -54, -77, 135, -84, -66, -326]
4839c26O06k73q7J81k43K82l26J22O8J46k65O9J87l07J65q5J22q4l9P8J94k07
4861b2p3J24M7l01K28J74l49N1K54p5Qj28L97j20k87N6K03kl05J96P0j52k60M0
4885b26N90o13R8J71K61l41J7K60L0m56o8K76J48k99j69N63k81l5r1J07J76k60
4907a42J05K53l41l8K12J2l31K17L46j30j13j29L85kk81k0K92l65k01K80Jj18
4929a08o8L81j06m95K69J60J54j22kL8j54n0J31o7j99J48J9J59j43k63L78m4j01
4952h5lM17j86k39K70J86l26r4K12K1k02j28K46Jk29k1K12Q4k96J2M60k39l92
4975c19K20J15M2l61J42K44k28m0J64J03n9j99L52p8k51M2L52l53l35L15L06j91
4997a7K5j88L90n05L35J89k16L8k66M49j3k82j35L08m6j51K49J39l04r3K69j41
$$ y = [-326, 280, 7, -80, 101, -142, 140, -186, -64, 4, 150, -115, -46, 141, -166, -1, -86, 36, -48, -87, -9, 185, -22, -95, 29, 76, -225, 3, 177, -172, -121, 133, 58, 66, -62, 335, 215, -72, -16, 187, 185, -120, 76, 146, -6, -266, -226, 364, -249, -151, 20, 281, -60, -43, 217, 247, -209, -277, -1, 147, -152, -321, 242, -39, -74, -165, -58, 118, -142, -37, 216, -125, -163, 49, 61, -270, -53, 293, 163, 50, -79, 306, 304, 23, 3, 295, -70, -271, 9, 10, -108, -176, 205, 99, -396, -127, 33, 187, 65, 63, 101, -53, -103, 28, -39, -238, -90, -71, 88, -55, -318, 60, 16, -85, -88, 329, 143, -96, 174, 360, 34, -60, 152, 173, -29, -157, 89, 90, -139, -160, 52, 136, -160, -148, 312, 73, -319, -99, 16, 58, -303, -161, 83, -145, -185, -21, 82, 23, -176, 176, 98, -153, -111, 241, -112, -447, -132, 174, -17, 8, -180, 210, -295, 40, 229, 13, 51, -215, 234, 221, -61, -196, 112, 66, -85, 164, 303, -1, -94, 175, 34]
5019C4qj13J69k34J55k70K76J2k05K34J38k26L7q7N73m30k06K5L39l72J1L09q9
5042G2l0J59J6l00k9J33N6k14J39J56L70n73m8J46l3l47M33k12M27o30K17K76
5064A84n1k28O8L27k42lr6j0j62n6N35r3k62q8K32j05k51J49M46k63k52K87J65
5087B31l04J56l7K1k37J1J00J86ol00M52k55k24Q1J72Q4j11j41K28k95P0J93j23
5110d8k95L06M5J88l49j65L77M7k63K21k7k56Q1M11m4k19q7j24N70m39j56J69
5132e7Q0k72J38P6k4kL13r1k05k46K72J37m16J47L63K01m10j60K63j07k10J03
5154a07J88Qk98M07j41k49J12K53%l48l2K75j8p2l8J42J5k18N2J06Lj62J55j23
5178i0K54m92J72M09j40k24K00k89P0j36O83m07r3L11o4j95j06J47J7j60J34j19
$$ y = [34, 26, -87, 82, -152, 3, -267, 9, 21, -184, 50, 188, -38, -1, -88, 485, 55, -151, -126, 213, -159, -148, 161, 72, 42, 201, 217, -83, -112, 21, 77, -137, 2, 158, 528, -45, -93, 53, 20, -327, 106, -106, 321, -309, -92, 184, 133, -95, -27, 300, 58, 55, -41, -51, -213, -269, 266, 173, -89, -177, 55, -50, -301, -152, 294, 31, -221, 66, 231, -73, 83, 46, 67, -170, -159, -59, 127, 121, -179, 273, 18, -206, -125, 47, 131, 20, -121, 107, -188, -118, 75, -48, -343, -37, 8, 196, -153, -318, 59, 106, -157, 64, 37, -219, -138, 273, 229, 10, -77, -201, 369, -70, -226, -57, 23, -249, -111, -35, -59, -61, 252, 161, -44, -290, -18, 119, -297, -150, 213, 414, 4, -156, 107, 0, -210, -107, 81, 89, -209, 198, 57, -192, -80, 173, 173, -175, -207, 68, 50, -22, -60, 82, 97, -121, -69, 37, 40, -122, 33, -90, 164, -328, -156, 253, 113, -111, 89, -200, -130, -266, 417, 10, -83, 228, 164, -31, -137, 10, 27, -133, 1, -118]
5200a18L95n22K63K74l23q1J19J69j5j27r3J77k01m0L5K77l6l09K26J65l89K18
5222F4J17J02m03J16L26m78k3L28l59K25n7L9J57k80J33K1L72n06J63L4o8k69
5244b46R9K65j91K5P0L16k78k54N26k64j59R7K3k27q9M10Q9k73l9K65L3k40J20
5267G8j97L49k38k57N01j13j54N5Oj35k20K76K77k08j48o4O04n12k11M12L2k26
5289i3p1K00q6j26p9L42L6k21j58K38J30k70J03K06l1J65l30N69n80PJ71r8j54
5312a30K16K07l22j52p0M63j34k36P0K57k03p9P1j8Lj8M4K12l55P2J82j26j0K66
5336B10J01k77k5RJ39j08j61P2K76m07LL1J53n7K8k3J55m65K81K15j04j7O2J60
5360B51l65pL13j21j97K78j27j70R8p3K46k06l6J9L85n39J69K22o4k51J40K62
$$ y = [-118, 277, -245, 18, 292, -31, -112, 7, 176, 161, 34, -59, 118, -83, -123, -88, 189, 153, -156, 70, 235, -154, 64, 181, 283, -120, -4, 322, -156, -179, 149, -210, 15, -42, -3, 154, -126, 7, 28, 400, -106, 57, 91, 23, -246, -147, 118, -73, -48, 22, 338, 60, -194, 332, 68, -91, 6, 29, -198, -287, 123, 212, -61, -100, 165, 198, -42, 78, -119, 230, -8, -265, 236, 123, -31, 24, 30, -105, -325, -49, 228, 20, -128, -192, 412, -100, -311, 101, 133, -93, -164, 36, -50, -176, -255, 87, 123, -98, -256, -18, 112, -158, -55, 151, 120, 285, -45, 524, -56, -49, 122, 24, -130, 86, 293, -29, -181, -251, 212, 78, -158, -88, 169, -34, -113, -42, -60, -57, -75, -31, 181, -174, -102, 80, -46, -56, 210, 311, 34, 9, 18, 157, 49, -112, -40, 236, -171, -168, -137, 16, -41, -13, -36, 119, -346, -65, 150, 46, 29, 91, 251, -114, -121, 192, 71, -126, 152, 25, -145, -47, -120, 126, -80, -116, -97, 288, -251, -82, 140, 76, -175, -35, 227]
5382B27j78N3k16l5J26o1P6N2m6Ro8L12m78L8L72k18j3m8J35L35m31p7K60M3k79
5407a10K02J6j56p3K28m3k21K0K29J40m14J0N16k16k58J27J18j35j79L13J97k89
5429B2k50L48Q9k37j20L23k56m3k6L56k45JJ68o8oj55J42J04r4j35Q5J45N3m02
5453b01L25P2n43Q1M45m5k84J65N2K0l00K86J36j19j02r7L37J4k99K27j17R9l01
5476a49J82q4k73J66K96o7p7n4K70k70m6K00K1l02J89J75p2l12K15K72l52j10
5498a82n3M68k31J9k70M66l76%J36n5j7J0J42J6j14Q4J77l83J14K7N3%l13M26
5522A44P3m71J18o3K25j87P3K74j60k81J68J86J34l28J31K54l44j36K20j04j56
5543b30O6L32j31m02L25L88j61l56K46J67k10j74K35j72L8j60L38K17m88l1K16
$$ y = [227, 49, 102, -114, -149, -23, -84, -8, 44, -2, 7, -61, 251, -227, -189, 183, -35, -48, -96, 39, 374, -57, -134, 126, 169, -110, 92, 108, -48, -121, 107, 64, -157, -137, 92, 232, -182, -172, 344, 128, -130, -3, 115, -20, -199, 114, 311, 22, -228, 120, 209, -28, -148, 175, -81, -124, -150, 206, -39, -38, 130, 62, 56, -99, 43, 147, 53, -82, 3, 148, 201, -201, 124, 196, -347, -266, 179, 134, -150, 15, 67, 87, -213, 73, 209, 90, -12, -109, 228, 242, -57, 170, 53, 152, -149, 33, -51, -324, -158, 138, 71, -6, -60, 210, -60, -106, 94, 115, -187, 2, 177, 105, -207, 8, 280, -72, -182, -235, 233, 2, 21, -249, 217, -159, -159, -23, -78, -95, -85, 57, 73, -41, 43, 220, -163, -49, -22, 31, 31, -282, 144, 217, -254, -136, -199, 26, -161, -88, 186, 26, -255, -87, 99, 233, -95, 36, 290, -54, -190, 30, -74, -230, -164, 168, 37, -365, -40, 348, 187, -169, 77, 244, 34, -140, 95, -77, -39, -199, 139, 356, -132, -163, 53]
5564E3O7m29K26K83l86J24n5L47Q8q20M19L18j58mj29J71k80J65K76k88j86K82
5586H4Qo4j40K34L7l23K14J39j47o1K79k99O2k77K45P1N5p2p4J82r6j89J24J82
5610A74j39n9K06q5j52PO2J90m13K69J2J68m91J39J74k38M82m41K82k60l0M91
5632C48l10j56J08J25p0O6k64K16M2l03K40L65n01K99j02O6L2m74L91J60m68K75
5654H5K15k12j73J39L2l40M25j72K4K0k29M09j43j72J29R1Q1k10j37M03j68J45
5676B42k59R3L8k07K22K37m15RK53j37j50mL23M7k46K6k43J67k7o1K22k36Q6Q5
5700F5J23k28j44P5J48k01J9J9J15O2j3L5K5p5R2j52j35K56r1R4m93M66j74J12
5724@l71K20K75J20m19K41j44m7R9N0o7j79K55J57k18j39K74rq3j68K28K88n53
$$ y = [53, 120, -309, -83, 200, -186, -62, -117, 230, 318, -502, -83, 235, 77, 73, -56, 115, -165, 0, 276, -12, -198, 84, 92, 28, -112, 122, 159, -164, 50, 189, 42, -19, 260, -39, 23, -254, -9, 62, 117, 45, -29, 153, 57, -132, -8, 174, 35, -24, 182, 97, -55, -48, 14, 204, -209, 60, 72, 240, -251, -112, 62, -176, 306, -135, 147, -113, -143, 348, 38, -118, -10, 115, 45, 111, -153, 63, 105, -198, 42, 407, -94, 205, 103, 169, 201, -273, 118, 278, -190, 85, 300, 88, -85, 54, 86, -254, 171, -1, 23, 43, -186, 223, 80, -92, 37, 128, 209, -1, -138, 265, 97, 242, -17, 76, 114, -93, 129, 366, -49, -40, 213, 76, -74, -78, 245, 292, 46, 72, -171, -4, -31, -92, 130, -106, -20, 65, 188, -40, -184, -109, 39, -162, -143, -124, -9, 53, 40, 75, 100, 25, 117, -35, -170, 86, -5, 89, -404, 62, -112, 0, -371, -151, 124, 244, -175, 66, -78, -125, -26, 24, -43, -222, 33, 190, -28, -167, 107, 98, 15, -153, 75, 363, -190]
5747a90J2K71pKk89M78r7m96K29J62j37K4k75N68j99j62P3k6J39j93J29L19l73
5770c8R5M2l3P1j64L90l40j89j35M25j89j28K52J06j14k68M03R5k55p1L13j08
5792A60l73N8K61P5l71N5J40p7J28l14N36j37j83o8J81q5P8Lq4j31J86j09J39
5815F8m4Ol6J3J0k1o7l8O4J26K7l63K76Q0k32p4J96L8o6K60l00m0J80k0q0J29
5841I2m6k81J06K30j27J9j44L48o26N88j08q6r3J5K90j14k46K75j20J5j38L35
5863A84M4m20KK49k04n6K27J60L3m02M1L39j80k59J84k3K73j32R6ok36O9k38K37
5887a8j3j64J52k3p4L64p8n9P2k15J26m5n4J36k76N5J64J2P4j27j0L65n16r1K39
5912dJ27j09j48K6J67k51J04N7J04q1q1L34l60j42L22Jj0k21J46O1k27K45j80
$$ y = [-190, -178, 93, 86, 88, -201, 277, 180, -316, -87, 75, -62, -38, -313, 255, 56, -106, -33, -59, 80, -113, 16, 335, -38, 57, 99, 66, 137, -27, 363, 23, -166, -301, 124, -65, -193, 59, 165, 51, -217, 186, 281, 26, -45, 268, 160, -213, -155, 106, 181, -190, -135, 5, -72, 56, -258, 278, 141, -42, -110, 71, -14, 64, 67, -17, -148, 38, -71, 68, 24, 30, -6, 7, 17, -4, -71, -109, -45, 81, 108, -255, 21, 101, -131, -205, -9, 29, -37, 223, -77, -117, 63, 43, -37, 92, 46, -235, -129, 101, -26, -7, -151, 197, -429, 159, 51, -35, -128, -113, 177, 63, -183, 92, -28, -13, -151, 184, 228, -192, -190, 59, -145, -201, 26, 186, 219, -183, -142, 197, 17, -242, -58, -81, 192, 60, 156, 150, -86, -17, -255, -18, -31, -195, -43, -66, -140, 224, 146, 87, 159, -56, 70, 25, -29, 107, -169, -114, 50, 62, 136, 9, -1, 364, -152, -243, -4, 123, 14, -134, -108, 59, -192, -88, -31, 73, -8, -89, 245, -115, -257, 65, 66, 56, -165, -19, 42, -185, 60, -120]
5935a20R7N4k25J76Q8k41N43l15k85J00J04J98k24j08M58j30l21J88J97j49j57
5956g2K00R3o4m52L71ql5j39M9O9n9j3J52J7k37K44pj66j90K13J89j12l3K3J82
5981B15l64n3M36j11l58L9J73J13k55oR9P1J68k09J81o1P4k10J57O0m08Q0N08
6004C39m15j81L13l0K7k86K82J13m37L42R7j74m0K2J81j71r7m6M22p9j50N8R0
6027A80k43m6J92j44J7Q5J88j65j74L02k56j43J85l4J41o4K18ll12L05k30RJ8
6050B6j18P3J14j87Q1J9N3J16k34J33J14l09J07k29K73l13P5N30k73j14J35r1
6072a9J70p5P3J11l53L22j92qj09J26M4k41k5L02l7l7l07J83o6R3OK62j72Q5j46
6097a0P5N9k6Q3J9l7m7j28J08k72Q3J1K31P9k38J88l6k53K29J00n5k58K36J40
$$ y = [-120, -23, 31, -194, -18, 70, -171, 372, 57, -228, -128, -24, 174, -50, -158, 300, 170, -151, 37, 234, 85, -72, 128, 221, 157, -295, 76, 68, 33, -106, -57, 12, -47, -60, 92, 109, -128, 116, 109, -57, -247, -34, 155, 43, 10, 33, 215, -149, -202, 234, 123, -235, -196, -23, 90, -165, -171, -72, -1, 167, -42, 139, 78, 152, -58, 99, 159, -249, -169, 339, -76, -257, 56, 26, 53, -233, 49, 162, -275, 67, 164, -10, -50, -28, 153, -18, -115, -161, 261, 182, 32, 90, 180, -63, -109, 83, -61, -44, 41, 229, 64, -110, 192, -64, -207, -22, -56, 85, 21, 239, 236, -76, 229, -1, 8, 26, -92, -19, 95, -92, -11, 8, 61, 177, -57, 76, 190, -119, -12, -241, 32, -281, -206, 324, 51, -63, 72, -19, 151, 76, 149, 260, -93, 229, 37, 29, -80, 46, 90, -151, -176, 126, 89, 52, -255, -72, -138, -45, -39, 223, 51, 136, -10, 65, 124, 98, 181, 200, 163, 116, -12, 96, -176, -93, -82, 149, 228, -10, 178, 142, -111, 118, 218, 163, -95, 141, 281]
6121B81j32k00j21K41M9k97J35J18j82P2R9j70L54L5m00o2O2J23j20L3r2M24j63
6144H7n4j0kq2KK79k57J14j43j74N4M32l75N2L12k62M5r5L10n4r4M6j37J49k80
6169a37M2J43r3%J56j07J32r3K0Rk32k54N66j59J1K0O2j96K46K3k69J78j33o2
6193a27K3l3J02J34Pl08K61J29k71N9J80j02L9n3P7N7m0k08L89k41k97K53P7j9
6217H8k63L73j97k03L00k32K28l33m0M27k36j33O6RL48p4Jj72K54l11R1K41j57
6240G5m02M26n7k55J32J1N7K0j19J60n4qQ9mo9q3J27No6j35K24o9j19j8N3J38
6266E9J44j2p4k72J47K05n9m15K21J96k71l5J82Rj20O3L1J32j21k31K34L15j62
6289A66l63K07J06J12j54J26l96L8O3m3K53l77K19n1L21n95M08J08m42K75L2J99
$$ y = [281, 149, -51, -172, 69, 118, -179, -44, 74, -108, -36, 63, -107, 247, 282, -118, -180, -118, 5, -115, -82, -174, 250, 87, 33, 23, 21, -61, -59, 220, -37, 77, -66, -240, -186, 246, -129, -77, 235, -27, 18, -77, 233, 179, 85, 131, -6, 143, -137, -95, 48, -45, -45, 111, 4, 136, 43, 63, 72, -160, -414, 152, -7, 4, 24, 86, -110, 136, 159, -110, 68, -65, -127, -104, -137, -35, 99, 106, -202, 59, 188, -83, -24, 156, 54, 93, 40, 117, 174, 134, -74, 315, 74, -223, 30, 107, 88, -175, 198, 1, -202, 98, -134, 94, -239, -279, 148, -88, -221, -155, -146, 202, 128, 129, -43, 211, -100, -9, 232, 75, -327, 99, 42, -213, -81, -70, -13, 7, -112, 48, -6, -14, 75, 71, 2, -81, 46, 51, -15, -150, 74, 5, -114, -132, -79, 59, 203, 191, 117, -155, -8, 197, 138, -277, -56, 140, -131, -166, 16, 25, -95, -32, -1, 131, 10, -221, 13, 328, 166, -197, 10, 116, 228, 74, 200, -196, -158, -95, -138, 115, -262, -43, -94, 227, -368, 40, 148, -294, -19, 13, 212]
6311B12m97Q0N08j49j32k01J31M7L4j57K10J66n05M70j95k21M02j27j14l3k3j52
6333b46L66k16K6J99j35r1J57J47j72o9K88q7l56J43J9%j90r5L22Rk2N9m6N5j29
6358f4l3J74r3k13L47j20k4L0N2J64j47k8q1o6L05k33J67j48k63J46K69k68r3
6381b20K20m6j40K33L15n78K0J88L32k85n0L2k5Q4j87K49l02K94k33J72L5K4j99
6404f7J04j05J87k97L43o5O1J2j7J7j31K16k56j31k52N28k4r3j39K49j01k12J34
6427c9J40n6k30m2J59j00j46N24l04j1j50L80j05j66n2K20j6L9j26P3K5k18K02
6450Ak6N9N9j07L28k76Q0j3o6R5j79J86l24J51K5R5k68p1K57o0K7OJ39K5j50L9
6476C2L8q2j30J45R7j62j30K14OJ05l29P2K11Q1l36L31k41L5J29O7j41j52P7L72
$$ y = [212, -285, -205, 303, 154, 22, -179, -48, -1, 33, -124, 86, 252, -253, 217, 22, -199, 203, 76, -38, -71, -94, -246, 120, -96, -70, 129, -6, -97, 60, 207, 35, -34, 254, 167, -189, -46, -27, -27, -217, -312, 10, 19, -3, 56, 10, 65, -64, -97, 77, -16, -229, 118, -2, -26, 4, 56, 220, 73, 45, -36, -102, 203, -30, 137, -11, -274, -128, 141, -127, -220, 0, -46, -186, 47, 362, -216, -196, -8, 324, 39, -11, 21, -4, 80, -107, 142, -160, 134, -99, 73, 108, 132, -67, 37, -68, 119, -178, 165, 100, 161, 173, 156, 173, 42, 258, 2, -129, -381, 147, 123, 30, -109, 140, 39, -173, -39, 101, 45, -185, -227, -68, -168, -314, 210, -94, -105, -255, 125, 20, -146, -198, 22, 6, 45, -81, -8, 17, -201, 1, -25, 34, 93, -14, 314, 38, 118, 105, 39, 134, -45, 141, -183, -32, -7, 88, -180, -251, 6, -54, -27, -21, 118, 143, -7, 32, 70, -12, -142, 3, 100, -62, -192, 22, 28, 133, -196, -124, 87, 168, -168, 163, -78, -43, 86, 153, 12, -140, -63, 309]
6500C09n20l5L14j9O8m21M77j27k58L19j21m9J02j2m6J11n5J4K10j34k65j0J03
6523d5k24L08J73k08o5r8N3J12j67R0K0P2Q4l79O3K58k7j9j7j88L13L6M6m07O7
6548a49J80K80l06l54N37N3j95K3j79j08J07oP1N4J23P2N9l70O6K5J37k41J38
6571A7k19J50J94j75J30k21J78L61o09K80j43k53N61m88J26L25j56p3j22M65m38
6592a10K8O3L56k59l82M56k80J78j35J53K34m33O9M4P0j1k1K59l76m1RK45k11
6615i5j0K02O6p4k97K77k83L5K25k36J91j07J74J25r1j34n5L92m39N2j0K07q8
6638B7r2K51l38NJ79L3L55l28k71L61l38l3K34o8k27J83K76k40j95P1J01p1J30
6661EM2Q1k8m38L85o5k8q0J16L25j68o5J8j87J16N3m0K06m66J78K19j71nJ92o3
$$ y = [309, -211, -246, 68, 49, 117, -304, 173, 46, -212, 107, -14, -63, 39, 27, -19, 92, 37, 51, 261, 127, -138, -148, -45, -269, 39, 212, 4, -61, -159, -106, 6, -161, -71, -51, 21, 105, -274, -211, 47, 20, 1, -16, -204, 109, 145, 191, -216, -149, 31, 311, 5, -349, 188, 241, 46, 69, -110, -218, -111, -117, -46, 8, 131, 203, 262, -108, -42, -17, 120, -121, 17, -202, -52, 142, -33, 97, -124, 54, 415, -194, 86, -57, -310, 251, -237, -111, 214, 58, -15, -137, 328, -110, -82, -19, 337, 78, -304, 152, -128, 50, -85, 68, 302, -131, -62, -18, 52, 41, 20, 279, -97, -138, -129, 116, -95, -105, 97, 163, 89, -208, 69, -214, -179, 46, -190, 1, -106, 68, 193, 102, -32, -87, 305, -134, -82, -92, 115, 27, -65, 186, -152, -147, 32, 65, 420, 92, -179, 182, -156, -189, 45, -23, -250, -67, 209, -31, -226, -155, -54, -125, 5, 47, 128, 100, -338, 47, -18, -46, -126, -10, 315, 147, 82, 100, -87, 29, 82, 42, 248, -218, -40, 179, 8, 3, 195, 132]
6686A32L6j04K08k4j27k39R6m3J0r3P9K96m15MK45k30K64K2J06j15j55n0K02j96
6710i1J36n8J42k14o9J73j49J68j15K23J70m41P9J29j51j47J21Jo8J94M4J9l12
6733b16n7L73J6j74J12j41J97j94L2L35k91j87M89o9j07J1m12L64l74K71J64o1
6755H1l16q8M38j36l0J99p7J02k12L4K5j75l3J87k6l39K77J80L4j33j44J42n9
6778f9J6j20K97j28q5J62j05m7K03o1p4J39o10N07p7l0OJ11R7p7M2k34L00k92
6802a29K54J83m00J3K35k04p0p0K48Mj82J23j32o9J79RL2J03m85L52J97k67nP1
6826a0J37m50M54k73J87j48Q1j5k00J72r9L22l65J31M3K38r4l52L73p3j54N4N
6849c6n7J83O5j45j27J65j08M1K42l71L1K24M8j05n4j37J15n0m1K17l63J93K25
$$ y = [132, 168, 64, 272, 248, 121, -118, -22, -65, -55, -148, -69, 227, -188, -184, 61, -169, 95, 117, 223, 108, -47, -97, 105, -91, 45, -13, 129, -85, -154, 19, -130, 38, -77, 146, 316, -125, -46, 83, -68, -215, -94, -93, -161, 33, 77, 96, -216, -273, 100, 116, -58, 54, -87, 110, -84, -52, 283, -8, -195, 294, 225, 118, 129, -283, 81, -293, -22, 142, 81, -235, -323, 115, -21, -51, 148, 71, 173, -39, -5, 20, -155, -188, -1, -27, -366, -89, 91, 125, -8, -152, -10, -69, -53, -173, 124, -4, -89, 73, -32, -79, 124, 63, -11, 128, -482, 25, -52, -82, -76, 35, 132, 55, 97, -137, 163, -129, 125, 308, -92, -79, 156, -48, -118, -188, 60, 64, -118, 5, -127, -196, -17, -8, 24, 127, -358, -6, 191, -76, -81, -10, 127, -323, 131, -142, 45, -103, -22, -37, -237, -65, -164, 158, -207, -76, -33, 205, 111, -241, 132, 59, -95, -41, -36, -93, 90, 155, 10, -117, 48, -60, -19, 223, -148, -117, 107, 155, 50, -4, -141, -26, -76, -117, 100, -263, -70, 155]
6872A55o0j49J55L2j18j11J11m1Kj76L79k25J62k88L29L2k01k6O3J02k4Q2l53
6895a68P1Q4J82n5l9rrJ13m01L32o2j31L6J24o8j22J74K77m05n1K16J3Kq1J5R3
6921A31q6P8q5q6k6Qk05M66k27k06L77k22j6j42K91p9R4p7K15k34Kj00K69j90
6945e0k5L9L06k98r3L84m36PJ50J3l3K72k25j81K10j32K19j10%o1q8M85m01j52
6969b00J35K64j83L5J52k75N2mJ54r4j09P3K17m8j74P9K07j18k97J94j71JO2K53
6993B05j76N4k54K12j83K42oo6P8pk15k54O6K75J23j62j4O3K57l58N2L7K4k1q7
7018a15O4n2J7O2J88k35n6K5L80k59J81q8j21L0j2j69oj53L1K26R1j33j32J61
7042g5J70l02J82J01m1j5l87L65J43j12J85j89M7k68L20j81LK48j39j12J53J30
$$ y = [155, 95, -54, 101, 133, 15, -96, 15, -26, -24, -200, 179, -46, 116, -172, 157, 189, -12, -38, 25, 127, 103, 185, -168, -97, -13, 169, 114, 75, 66, 57, 170, -231, 101, 39, -92, -56, 68, 0, -122, 52, 329, -76, -127, 89, 102, 104, 23, 38, 131, 45, 123, 38, -48, -74, -66, -271, 195, -32, -238, 139, -83, -99, -241, 50, -29, 65, -12, 203, -31, -29, -129, 140, -50, -75, -36, 270, -28, -121, 263, -173, -166, -16, -3, -36, 236, 11, -170, 40, -92, 127, 17, 17, -44, -132, 353, -48, -200, -65, 199, 16, 51, 203, -72, -20, -24, 130, 36, -73, 0, 217, 169, -5, 74, 281, 163, -134, 60, -111, -110, -48, 205, 29, 83, -171, 41, -142, 100, 94, 28, 106, 99, -116, -370, -304, -29, 94, -68, -82, -19, 238, -120, -68, -31, -7, -28, -115, -51, -103, -86, -24, 164, -71, -127, -102, 278, 19, 200, 112, -9, 21, 9, -160, -166, -319, -288, -62, 29, -104, -236, -75, 95, -207, -25, 76, 35, 20, -367, -2, 141, 29, 214, 25, 72, -196, 124, -57, -54, 194, 55, -57, 96, 226]
7064B26j22m7j96J11N6j3O9lj06n5K61q7k14j46K64j12n4N2K17k13J35o6k82K73
7088e2l6L99k96KK4l2J43m14K33L7J43J2k41P2J55k16m3K23k02j5Q7K27j16j13
7112a9Qn0J55k08L10j9k89L0J19j05L19k78KR3j97R2N7j68O5K49K7j24o1p4o9
7137a35M55l38j2J62l07N5L23k66K11k44J33J07k46Nr5J05L1J53k46KJ85J13j11
7160D0N8o33N44n5J14k02j37M58j0q6j38J19K0j44L08j84j88J66RJ5j82N2J84
7183A28k05jJ53K35l13j36K77o1j00j9O3l6k22K44j32j6M5o3J26Q6M6k25K36j22
7207a2j25M28l28j40J54o5K97l13J60L27j95j38j97L22j90K13l55L25m7Q2j99
7228Dl5j89nJ76K50m4m9k22O9J00K3k41L3J88N6j4j44K1m5R3J1k9n5L7P8k2K56
$$ y = [226, 104, 57, -139, -28, 28, 15, 84, 81, -25, -80, 181, 94, -120, -266, -2, -114, -168, -116, 101, -112, 23, -43, -325, -52, -88, 311, 15, 17, 41, 9, 152, -262, -29, 8, 151, 163, -78, -6, 149, -67, -110, 113, -89, -104, -17, 210, 94, -19, -11, -61, 94, -114, 196, 177, -112, -82, 37, -68, 251, -27, -25, 68, -129, -37, 20, -148, -83, 166, 193, 69, 8, -66, -135, 320, -18, -30, 132, -175, -120, 203, -63, 148, -96, 37, 144, -102, -97, -192, -87, -56, 97, -149, -147, 38, 151, 40, 98, -535, 9, -46, 68, -134, -271, 187, 177, 91, -47, 72, 92, -52, 256, 72, -116, 50, 59, 74, -108, -56, 128, -77, -78, 75, 310, -3, -139, 138, 77, -23, -42, 21, -15, -237, 7, -125, -141, -96, -159, -33, 53, 99, -126, 110, -12, -137, 291, -37, -177, -23, -88, 209, -104, 56, 383, 188, 50, -147, 175, -15, 198, -157, 168, 121, 203, 4, -31, -220, -225, -49, 201, 157, 108, -114, -45, 55, 78, -163, -130, 58, 114, 100, -44, -23, -68, 25, 36, 7, -48, -11, 67, 45, 301]
7255C01k86O1l14M9J01j13J58J04j66J91N8J5j25l58N26j91p1J12J28k73N2Q2
7277D1k25J76LJ93k93R8J63l60M4n1P9j62K79k7r0J8k6R4L1L21k35k15J75o9K7
7302a1J82n2k28m9J80l1k76K16J91l9O8j64p9J86l6l6K34K9l03m7K1K20j46j00
7326g0q7m2R8o4J41r9J42j27j8J06m1J37J08p5k59j72K83J24L7j07J55k85K79
7349A64k42O8j57J46m3Q3J7P1q8k64M46k76j88L93j77J12n9k09M36j63j19J96
7371A47j77l3K01j78o8P7o7J79M2J1j14p3P2n7j02P3L8j93J54R9J87k64K14l7
7395A31Pl15O42l52o6j74J14K94k82o0RJ82m82J98J21o8R7k08M14j74Q0j43K07
7418A72k19j4p3K90k14k36K40K10j55J37p7p9J19l80J65Q8J97l39M09l31J91%
$$ y = [301, 15, 76, -238, -189, -88, -201, -43, 61, -105, 86, 144, 159, 34, -324, 202, 11, -60, 52, 180, -93, -41, 41, -184, -8, -5, 188, -105, -7, 156, -204, -160, -211, -132, -294, -15, -42, -132, -114, -140, -46, -15, 306, 71, -144, 31, -38, -11, 171, 119, -109, -158, 22, -9, -285, -69, 122, 83, 151, -13, -92, 94, 58, 22, 256, 285, -18, -65, -44, 176, 30, -70, -157, -199, -101, -165, -24, -123, 19, -108, -126, -20, -61, 76, 184, 109, -150, -322, -39, 85, 122, 15, 170, -115, 164, -78, -10, -167, -21, -64, 19, 36, 107, 19, -245, 201, -75, -263, 130, -47, 65, 6, -203, 233, 70, -49, 147, -30, -63, 138, -40, -108, -31, -98, 81, 123, 134, 20, -53, 19, -38, -140, -67, -29, -222, -68, 31, 218, -46, 168, 131, 138, -177, 465, 113, 47, -127, -13, 281, -1, -61, -52, 130, -352, -154, -33, -101, -4, -212, 202, 28, 108, -35, 172, -47, -61, -134, 156, -58, -294, -54, 156, 1, 138, 61, -18, 101, -279, -114, -26, 171, -168, 241, -90, 101, 101]
7440A01l7n4p2J31L6l23J33K69k45q3K07K2N1l20L89L9l92K41J10k30J48k38J27
7463A0q2J15o6L2k29J11n2J66j72J18R8l2K3J25k59L16j36k83M35k35J12j64J91
7486A42K21k02n1j37l5j17J69q1K72j32r2M08l50l25J39K73k17q6K03q1R3O4r5
7509a7r4j2J19j02K42k41K41o0k02r4K44m2j06L43m22L83l12J53k0k1o7L06k32
7532a3j29K20j81P7l68M62o6k3N7j02J17J22j68j71L46k22p2P6l9l3J20J66N1
7555B27k64K04j74K39l49N1J30j98P1N1J96j53j14J41J68q2j94k5N5q2N8l4on0
7579a34L49j50p8n2K96l49J75O6l88L88k40k42M22j27k0m24O56K5j01k65L06j53
7601d0k57N72m50J03k02O03k40R3q4J11n5k44L6O8q3J11J44o5j52j20j02J96J55
$$ y = [101, 64, 10, -62, 69, 105, -218, -85, 184, -61, -144, 63, 85, 136, -184, 205, 244, -148, 93, 203, -27, 121, -117, 10, -72, 43, -23, 9, -220, -109, -161, 5, -167, -49, 49, 17, 40, 165, -94, 222, 86, -197, 238, 3, 115, -49, 142, 363, 161, 110, -27, -62, -179, -10, -91, 181, 49, -43, 365, 15, -310, -171, 102, -115, -201, 2, -79, 14, 78, -17, -111, -123, -4, -106, 136, -105, 136, 76, -126, -220, 24, -18, -124, 219, -203, 180, -132, 21, 1, -20, -87, 219, -13, -142, 78, -103, -26, -394, 68, 2, -21, 36, -66, 51, 173, 5, -166, 180, -42, -114, -38, -77, -110, 10, 176, 227, -37, 167, -7, 232, -117, -66, 64, -134, -63, -12, 184, 31, -83, 58, 226, 144, -50, -75, -20, -102, -44, -78, -84, -134, 215, 65, -13, -65, 231, -118, 57, 123, -265, 123, -117, -359, 63, -64, -84, -508, 148, 173, 72, -193, 113, -40, -297, 275, -175, -72, -274, 329, 89, 182, 98, 209, 154, -90, -54, 14, -69, 42, 186, 121, -31, -151, -253, -57, 98]
7624I8k12K01J17k00l68M71N7k25j59J85J21j09K32r7j89L4J68o2J22k40K19j39
7646B5m5J59k49N3l2r5K46n4J54j30o6K07k27L77m42K33j90J73l7J47l16p9K59
7669G1k98J16J47j35j09R1Q3J60q6P0j77j89M19%P6k52k30L55J67j90k65J72L7
7692C3ml2N4n6n7K11j80j59J4K09qj22P3j6J37j42j30M34q8j57j52J63R6l25K27
7717B3K3j30J86l0q3o8J16J42k48k28L02p5N5j05K06M4m63J62J03J38l12J57R7
7740A2k30L81l47M2M0m9K34K8J7k5j05J04n7o2L9M9p4k83K79J77l6k59J20J4k91
7765b82K46l4p3Q8J49k2j37K00k97K21K9j40L2J79l5j07K87j00k04L07K7j32k36
7788c4J2j7j9J61K7m4k32p0M0K66j15K0j4J01N8J40k51j17J9O9n7j35J92r0lL26
$$ y = [98, -114, 87, 204, 4, -364, 107, 164, -61, -220, -35, 86, -23, 209, 112, -77, -43, 125, 63, 185, -55, 164, 25, -20, 139, -110, -57, -89, -184, 62, 8, 162, 32, -34, 173, -54, 323, -119, 114, -76, 97, 60, 207, -109, -188, 71, -227, -111, 36, -99, -208, -117, -34, 126, 40, 110, -67, -256, 163, 163, 239, -13, -243, 112, 279, 89, -176, -4, 33, 29, -3, 51, -5, -62, 149, -31, -190, -176, 33, 25, -97, -24, -40, 97, -45, -175, 259, 171, 14, -138, 25, 121, -204, 23, 46, -84, 102, 72, -11, -79, 37, 179, -69, -297, 5, -70, -15, -120, 86, 130, -333, -171, -68, 70, -242, -85, 12, -218, 163, -184, -142, -102, -151, 83, 111, 128, 103, -2, 102, 45, -17, 22, 71, -3, -286, -7, 170, 134, -125, -5, 9, -282, -36, -70, -143, -55, 94, 72, -65, 135, -162, 59, 88, -52, -20, 159, 124, 17, 304, 204, 0, 307, 334, 202, -34, -22, -39, -58, 103, 130, 86, -146, -216, -176, 90, -25, -5, -19, 82, 140, 280, 29, -88, -69, 0, -57, -192, 0, -90, -93, 233]
7814B33p9rj12K48m06J86j10j12N1N6L25l79O5K0J18m1j04K24k64k8k46N00j93
7837e7K32j77j75O6J0K99l95M37j82r9q6L04q3k63J09J39J9j30j5n4J16j13P5
7860b3Nm6J53k70L26k53L3o9Q4L8L7O0q6j51K9K26l8lj16J17K5Q8k00M2J2K7j14
7887f7J25L36n07P1J67L4m44K25J46j83q4L44j26N7r0n1R3J51j41l3Q8r5K94r2
7911B18k93N6J75n7J49k40k19J51q6J28L4l8K46k99L48l00j72r5J83K76k14N4
7933Ek6j19Q6J92j04k37L27k49K43o2J5R9P6m76K42m8J05l76J64J71n2L9j71K34
7957G8m27M63j33rO6P8P0r4k04J85J56k66J1l8J36Lj89K40J1l00L97j74J08j92
7981b4J75r4Q9k04n8L20k96Q1K81m66P2QJ49p2R9o1K15j34j74pJ23J49k93K88
$$ y = [233, 154, 145, 33, 281, -125, 61, -49, -161, -110, -54, 271, -108, -43, -23, 95, 54, -50, 174, -90, -118, -364, 136, -57, 175, -2, -177, -111, -101, 198, -197, 240, 58, -41, -127, 177, 94, -169, -60, 79, 98, -32, -47, -101, 15, -98, -23, -18, -64, 89, -181, 145, -108, -75, -144, -60, -22, 15, 75, -11, -162, -133, 93, 55, 52, -64, 53, 78, 166, -34, 8, 20, 47, -67, 58, 394, -113, -42, 125, 159, -285, -60, 86, -97, -181, 163, 37, 94, 4, -47, 46, 197, 56, 23, 111, 16, 310, 218, -75, -19, 156, 99, 248, 8, -211, -60, -146, -18, 16, -22, 224, -75, 273, -27, -199, -294, -111, 165, -49, 5, -21, -140, -54, 138, 34, -203, 124, -125, 118, 56, 71, 170, 246, -230, 12, -36, 69, -307, -143, 28, -24, 15, -156, 78, -349, 114, -19, -28, 38, 116, 186, 92, -112, 73, 229, -37, -26, -64, 72, 75, -114, 126, 137, -163, 234, 60, 168, -24, 151, 57, 146, -58, -116, 204, -92, -11, 270, -196, -124, -116, 33, -39, 60, -1, 214, 80, -94, -101, 22, 171, -122, 166]
8005A66q1j67m0Q2K75k36J0j54J71Qo6J23j62m2Q9K79o7l28J93l30M66P1r3j76
8029iR2J9l5j43K4J4P3q5o3L72k80L5k01j20K33J65k00K56k84k2m8K31lK0J63
8054B04P2k43l6q3N3m5r6K09j00m3j7qJ24o0m7M9K66m0l99R6J66j92K90k36J6
8079a00J47k25L16k99J53L01k86j56J57J88J11l84QJ40k80K35j21J72k34J33K44
8100B20k88L23k30LP9l36L52j48K00j95L2N1L8r8R2J79j25j55j05K54n4k03J41
8123B7Q9l86K22L4j56k6L46m3k40P4j4M60k81k48p9K57m39K26L19k59L53j58M8
8146A26jj55j20J22Pm4M59l23r0j32J71j69J24P1Q8Lk67J83K34l08m2J53O6j0
8170A46m02J70J86J8J28J26m49q4J53J29J59j39n9o9j03j5J58j49J08j55J75
$$ y = [166, 85, -82, -122, -40, 235, -1, 9, -145, 26, 34, -32, 91, -71, -113, -24, 255, 188, -140, 53, -277, 189, 260, 167, -9, 83, 102, 67, -76, -52, -38, 35, -50, -113, 259, -21, 14, -187, -307, -74, 91, -109, 147, -137, -159, -207, 24, 21, 41, 204, 276, 33, -3, -86, -33, -78, -174, 35, -65, -108, -125, -133, -9, -69, -116, -67, 199, 159, -240, -144, 22, -170, 120, -116, -100, 47, -178, 138, -161, -8, 293, 7, -149, 8, 196, 307, -77, -69, 71, -209, 26, -95, 77, -157, -24, 220, -68, 255, 25, 28, 107, -229, 123, -25, 175, -20, 12, 63, 101, 3, 95, 274, 149, -6, -111, 143, 89, -114, 27, 116, -270, -48, -14, -170, -196, 150, 107, -133, -59, -73, 387, 106, -142, -221, 36, -403, -177, 142, -117, 236, 78, 126, 125, -30, -150, -28, -21, -65, 394, 71, -19, -151, 20, -149, -25, 46, 134, 137, -130, 53, 287, -21, -63, 90, 156, 146, -256, -86, 100, 118, 246, 372, -77, -161, -8, 121, 280, 141, 82, 13, -90, -105, 53, -96, 12, -143, 32]
8191C2
$$ Imaginary data points
##PAGE= N=2
##DATA TABLE= (X++(I..I)), XYDATA
0@%%%%%%%%%%%%%%%%kJ0j6J6j6J6j8K6l2L3m1M9n7O5p4Q5r4J08j24J40j57J76
38I3j99K23k47K74l04L37l76M16m57N04n55O12o75P45q22R05r98J103j222J357
58G14j513J694j906K164k481K882l408M137n220P015j0725L6076o8111j0721J12085
73F2682k9496q8364K9963Q7786m6680p6679N2958P4500p3468n6753P8902M3729
85E9080q8203k6485Q9796J0898r1898N309Q9774k2176q4477L7756P3078m6600
97E852o6135N7936N4607o4141m5942P2571L5000q0608j8939Q4222L126q4201J4059
110c2593P9775k8348p0299L7532O5131m7832n5977N6568M7327o4065l6215P1930
122B2934K2488p3614j0504P7379m500p5051J9334O9101k9936o2644M0771N3515
$$ y = [0, 0, 0, 0, 0, 0, 0, 0, 0, 0, 0, 0, 0, 0, 0, 0, 0, -2, 8, -8, 8, -8, 8, -10, 16, -16, 17, -24, 25, -32, 33, -41, 44, -50, 58, -66, 74, -83, 93, -106, 117, -130, 144, -160, 177, -199, 217, -240, 264, -291, 321, -354, 391, -431, 474, -524, 579, -643, 714, -799, 895, -1011, 1153, -1328, 1554, -1854, 2283, -2937, 4078, -6647, 29429, -38682, -49403, 62682, 33186, -55178, -25215, 62571, 15891, -60788, -7830, 66670, -6798, -63551, 15351, 59080, -29123, -55608, 34188, 45086, -46812, -41503, 48271, 26095, -58382, -20626, 52452, 5852, -60283, -2347, 52260, -11881, -57823, 14748, 49748, -30860, -49799, 34423, 37549, -46652, -32593, 47182, 18834, -51465, -13933, 51198, 3366, -52611, 3957, 51284, -12781, -48996, 22934, 45422, -28192, -38696, 38683, 34183, -40868, -21534, 47567, 17631, -45013, -4242, 49273]
134D9273m7073m5769N3686L7778o0890k6597O4567J6123o8990k669O8578j0701
146B7316o5221K1667O0431l3215n2701L9882M4948m6001l8778N2623K9136n7366
158a7279k1042O2084Q698o3877L012O2329j4058o0664K6143N2927l4340m6019
170d2086M0707L8931m6764l0632N0430K3528n6169j2942N8743K270n8651Q434
182b4201N7766k0070n1859K8583M6169l6028l8625M2300L0687m4576k4608N0014
194A5552J6391n2979o563N4515k484n4741J4075N0917k2176m6201L0702L9880
206C6888l7178l1961M0878K6340m5398j8440M8305J0762n0738k486N2399q451
218B0920m9885J7078M6466k5714m1607L3065L3878l7366k8288M1778K0206m4349
$$ y = [49273, 2200, -43569, 10117, 47895, -12995, -39592, 24975, 41098, -27892, -30561, 38017, 27316, -37905, -16238, 44193, 10978, -41723, -1841, 43107, -2894, -41672, 10951, 40087, -17279, -38321, 23763, 32461, -31416, -28404, 33925, 19867, -40797, -14654, 38273, 3933, -42086, -1379, 37552, -9212, -39844, 10586, 34114, -22055, -34997, 23746, 26016, -32635, -24201, 33565, 13495, -38364, -9781, 36388, 360, -38265, 4035, 34722, -9854, -34462, 15552, 31943, -21036, -27599, 26916, 24432, -30309, -16234, 34683, 12507, -33694, -2992, 36888, -290, -32251, 8627, 34967, -10431, -28871, 19434, 30196, -20542, -23028, 29371, 20920, -28965, -11887, 34579, 8865, -32742, 323, 34201, -3165, -31453, 10325, 30531, -13818]
230a3818j3600M6007O726m9421L023M8019j1779m6465K0389M1887k8421l5576
242c3029L3231K9648l8385k2352M0632J5806m2628r817M5271J787m5865O084M5456
255B5839j5036m1830K2950L6828k8248l1885L4196K4752l6932j8089L9275J2820
267B4640m1756n116M2598j280m3110R540M1965j7713l7493K4307L3339l0396k6546
280b7021L4366K0197l6194j4902L9106Q080l9704k310M1154n040m0516J2941L7660
293B7817j9738l4170K6151K8131l0567k2549L3434J6605l6216j0142L6468N033
305B0257l8278J387L7978q231l6741J4328L4491k1828k9642K6588K3897l0246
317f040j8740L2884J2409l3841p910L5553J887l6038M389L4996j0389l3936J7658
$$ y = [-13818, -27418, 18589, 25315, -24106, -21083, 26936, 15157, -31308, -10919, 30968, 2547, -33029, 202, 29850, -8535, -30887, 9745, 25551, -17077, -26894, 18377, 20164, -25701, -19617, 25839, 10803, -31027, -8077, 28751, 503, -31382, 2814, 27566, -9366, -27455, 11820, 24640, -17116, -22232, 20366, 19086, -24024, -14484, 27481, 9768, -27725, -3418, 29921, -475, -27021, 7345, 27542, -8652, -23554, 15552, 23632, -16072, -18382, 22772, 17732, -22784, -9843, 27817, 8079, -26091, 60, 28191, -2376, -24925, 8509, 25114, -11102, -21244, 15224, 20257, -18021, -16634, 21344, 13113, -23628, -9300, 25191, 3363, -26279, 309, 24206, -6040, -24780, 8104, 20513, -13328, -21238, 14315, 16202, -19836, -15447, 19549, 9160, -24776, -7118]
330g118L0152k3000k5553K7234K0699l0677j3879L1940R413l3536l780L4009j494
343A4410l3416P154L2951j3323l0361J9257K7187k4306k2217K8677J5945k9687
355g729j1138L1850N492l1969j85L1539m086l1739J0195K9849j5505k7503K0730
368a99K3931k5816j8055K7827J2945k9838p643L0238K631l0380J960K9996p104
381A0493k9373J2088K7243j7087k4989K2075J9994k5660j4956K8031R364k9029
393a1806m603K8610M37k9468N029K8290r452k7326J4132K5404j9284k1344K2888
406A507J7256k6236j1693K8214O276k8074k116K8460l108k6989O742K7124j1520
419E843k5173J6870K1677j9796j8890K4197J4001k6065q809K7199M193k7560J333
$$ y = [-7118, 23034, 34, -25519, 1715, 22414, -8263, -22142, 9798, 19211, -14325, -18105, 15904, 14410, -19006, -11852, 21099, 7776, -22585, -3328, 23859, -447, -22664, 6013, 21958, -7729, -18867, 12983, 18475, -13494, -13679, 17860, 13774, -17965, -7770, 22079, 6574, -20929, -199, 23732, -2084, -20139, 7688, 20633, -9205, -16848, 13390, 16021, -14359, -12399, 17597, 10493, -18880, -6792, 20451, 3364, -21625, 450, 20444, -5216, -20172, 7859, 17223, -11806, -16409, 12201, 12638, -16830, -11801, 16489, 7037, -20289, -6157, 19247, -37, -21381, 1507, 18763, -7473, -19166, 9048, 15324, -12750, -14866, 13594, 10486, -16503, -9761, 17363, 5843, -19330, -2460, 19217, -579, -19469, 4728, 18729, -7336, -16145, 11054, 15247, -12313, -10980]
432a0980K6079m633k5696Q818K5091j3558k2414J7208K0030k1508j5587K4164
444G014J0764k5948o046K6721Q60k5954K833K5513o810k4809J0915K2600j4822
457B831k0827J8890J7070k2449j2730K4197Q130k5893k716K5061j174k4904N252
470i262K3658r131k2178J2160K0945j6346j8035J9840J4004k2215j0004K4264
482G700N238k4422p78K3908k988k3308O840K1793r447k0860J4022J8260j7005
495a047j5326J9799J2216k2487p276K3342L474k3841J174K3468n002k1648Q084
508e070K0727j1624j8903J4932J6585j7826j3576K0876R127k2078n419K3185Q28
521A1764k2636L036K1386o306k0428R472J8510j2454j6911J5322J4603j8374j1116
$$ y = [-10980, 15099, 10466, -15230, -6412, 18679, 5121, -17293, -85, 19945, -1563, -17150, 7014, 17778, -8170, -14216, 12505, 13365, -12589, -9756, 15757, 8947, -15862, -4947, 17653, 2831, -17996, 894, 17964, -4485, -17215, 6982, 15112, -10781, -13497, 11564, 10390, -14514, -9262, 14396, 5265, -16913, -4753, 16192, -154, -18189, 1651, 15655, -6560, -16564, 7700, 12938, -11484, -12262, 11646, 8658, -14650, -7810, 13983, 4536, -16324, -2302, 15958, -1047, -16373, 3426, 15642, -6845, -14121, 9221, 12695, -11146, -9972, 13496, 8494, -13154, -5070, 15657, 4033, -14870, 62, 16647, -1179, -14755, 6121, 15248, -6830, -12249, 10936, 11764, -10872, -7836, 13550, 7244, -13184, -3712, 14798, 2344, -14567, 755, 15358, -3016, -14132]
534a4132K0090P481k2055l268K2266j283k1062M017K0421q078j8327J0440J6914
547A3424j3363j5336J6332J2291j8371r634K0908N397k1715r41K0931k571j9935
560a2583N694J9162r050j7216J1912J5326j4043j3178J6144J1278j9054o890K0254
573G756L099k0394L52K0476m390j8684P274J7461r605j5875J2475J3721j4424
586g58j1433J6665Q918j8928n048J9666J484k0080K692J8929n878j7174P873J6176
600A3104j0997j4222J2847J2269j5295r741J7410O462j8534l567J9324p09j8676
613a0325L654J7806o843j6512R472J4319j1443j2853J3664J0496j5389q181J6813
626D678N476j8482j484J8428j793j7915N116J6719q148j4704R887J3468j2078
$$ y = [-14132, 5958, 13439, -8616, -11884, 10382, 9099, -11963, -7946, 12475, 4397, -13930, -3490, 13424, 61, -15275, 1057, 13348, -5023, -14657, 6251, 11648, -10067, -11008, 9923, 7352, -12583, -6889, 12273, 3223, -13993, -2081, 13245, -798, -13976, 2168, 13446, -5608, -12498, 7756, 10855, -9539, -9187, 11289, 6899, -11785, -4511, 12950, 3345, -12530, -55, 13666, -758, -12191, 4474, 13392, -5536, -10584, 9082, 10566, -9514, -6822, 12107, 6229, -10945, -3072, 13104, 2107, -12115, 732, 13001, -2294, -12035, 5375, 11837, -6697, -10264, 9060, 8351, -10325, -6671, 11135, 4292, -12220, -2748, 11571, 128, -12725, 939, 11435, -3954, -12135, 4678, 10154, -8328, -9812, 8616, 6823, -11092, -5976, 10743, 2595, -12109, -2222, 11246, -832]
639h32j1585J4305R041j5523o777J7583L110j7431l68J8197l648j6760O799J4862
653A0973q148j3912J0828J1499j2040r722J4017P900j5968m750J6786J867j7511
666h181J629J7154n048j5460P367J4009r538j2270J1485J0102j2766q592J4647
679D538N968j6090l161J6422L05j6696L177J5555o006j4422Q098J2928j0581j0916
693a0881J1934R085j3502o853J4456M501j5451j784J6037j722j5306L965J4639
706I118o774j3032Q896J1247j0242r741J1913P674j2962n685J4267L479j4888
719f730o47J5012k126j4899N238J3872p714j1718R543J0192j1052q407J2155O825
733I544j3361m455J4354J934j4631O97J4801l492j3943N900J2679q103j1088J0081
$$ y = [-832, -12417, 1888, 10929, -4594, -11371, 6212, 9322, -8109, -8477, 9720, 6072, -10688, -3889, 10973, 2825, -11087, -259, 11240, -800, -10522, 3495, 11395, -4573, -9323, 7463, 9330, -8181, -6552, 10602, 5554, -9906, -2539, 11470, 1932, -10338, 1147, 11249, -1517, -10109, 4538, 10506, -5584, -8745, 7677, 7982, -8714, -5537, 10018, 4012, -10410, -2312, 10616, 35, -10881, 1053, 10138, -3364, -10217, 4239, 8740, -6711, -8495, 7542, 5820, -9486, -5521, 9118, 2344, -10688, -1792, 9455, -787, -10528, 1385, 9059, -3903, -9588, 4679, 8158, -6730, -7377, 7635, 5509, -9390, -4152, 9720, 2006, -9712, -169, 10023, -1029, -9436, 2719, 9544, -3817, -8272, 6082, 8016, -6615, -5918, 8883, 5391, -8552, -2652, 10027, 1924, -9164, 917]
747I17Q781j1057p134J2344N058j3237k999J3684R65j4273K067J3626m717j2746
761h721O677J1301q732r424R867P923j1445o180J2299L918j2558k429J3812m20
775E888j4154L110J2789n245j1861P784J0092r275q498J0531P012j1738n140J2513
789C808L070j2825p38J2674r41j2798L423J2504o264j0794Q045R378r430p676
803h564J0962N455j1140l789J1875K179j2374j2J2491k159j2281N015J0743o471
817A930j0107Q748Q032r659o240J0473M767j1401l011J1686J143j1992J107J2002
831G478l243j1909N639J0560p893q532Q923O804r813n637J0701L798j1446j633
845f203J1419j64j1673K195J1420m474j0928O676R075p603p905R104O140j0085
$$ y = [917, 9698, -1359, -8493, 3851, 8909, -4328, -7327, 6357, 7322, -6951, -4884, 8742, 4025, -8721, -2044, 9257, 525, -8899, 968, 8891, -2554, -8734, 3565, 7483, -5075, -7504, 6308, 5888, -8266, -5156, 7633, 2388, -9473, -1689, 8403, -872, -9370, 1161, 8173, -3565, -8705, 3808, 6878, -5947, -6685, 5989, 5048, -7750, -4327, 8177, 1913, -8881, -836, 8542, -888, -8564, 2398, 7853, -3287, -7076, 4799, 6978, -5396, -5408, 7083, 4924, -7357, -2342, 8401, 1930, -8177, 571, 8603, -1056, -7296, 3177, 7944, -3457, -6468, 5218, 6361, -5631, -4524, 7478, 4235, -7674, -2035, 8525, 632, -7900, 1023, 7827, -1986, -7623, 3078, 6876, -4570, -6203, 5216, 5052, -6621, -4426, 6994, 2520, -8408, -1732, 7343, -260, -8165, 939, 7079, -3006]
859c006m252J0493K616j0514j202J0987o57j1500L054J1141n450r671O806Q447
873G292q181o781R725M598r710l162J0351J573j0707PJ0949j753j0731M084J0024
888G578n753q896P452P417q739n551R517L714r784k580J0420O25j0268J008J0226
903F386k826j0026M776Q942o215q252Q274O240q950m865R458K867r755j330R799
918D523L8j0305J861J0039l435r310M685Q707p106o872P907N881r021m427R765
933B930K159r313j156R899p38r834K454R560m019r183N766P885p238o263Q534
948A443M696r070k883R351J537r270n05R841j764r080L091Q950m757p932O472
963A20O802p696n529Q863L650r059k298R481M29r050Q55R150k163r172L736Q526
$$ y = [-3006, -7258, 3235, 5851, -4663, -5865, 5122, 4465, -7035, -3981, 7160, 1710, -7961, -1155, 7292, -889, -7670, 2055, 6653, -3057, -6219, 4132, 5705, -5002, -4995, 5954, 4201, -6530, -2446, 7578, 1825, -7071, 381, 7798, -941, -6492, 3025, 6739, -3045, -5625, 4795, 5420, -4848, -3840, 6386, 3560, -6466, -1690, 7252, 1037, -7215, 1059, 7299, -1651, -6516, 2942, 5809, -3946, -5276, 4523, 4561, -5744, -3883, 6156, 2721, -6589, -1904, 6803, -303, -7175, 732, 6613, -2408, -6835, 2930, 5089, -4224, -5380, 4519, 3781, -6053, -3599, 5961, 1942, -7241, -1475, 6410, -828, -7091, 1443, 6139, -2931, -5814, 3537, 5074, -4196, -4701, 5140, 3376, -5704, -2613, 6337, 1580, -6352, 120, 6922, -774, -6303, 2560, 6210, -2849, -5147, 4334, 4763, -4287, -3432, 5718, 3555, -5617, -1881, 6645]
979F645n441p632P044N986p777m685Q602K963r250j257R059K9q802J166Q646k803
995B493q418M187Q003o043o980P340N421q319l709Q747J989q739o06Q712p57q628
1011e307K132Q189l527p346M736O897o083o297P803M382q354k827Q532J981r058
1026d147J32Q443j582p930K655P931l858p401N598O284o588n227P622L699q049
1041b418k071Q209J181q796P90Q211k051p983L329P320m422o672N917N448p081
1056a089m195P692L027q487j469Q733m7q421J287P865k583p442L820O742m929
1071E04o084O000N139p285l381P653K058q300l61P990r64p823K435P332l633o855
1087e575M438O340n544n273O210M364p488k707Q188J106q055K69P679j238p483
$$ y = [6645, 1204, -6428, 616, 6602, -1175, -5860, 2742, 5705, -3545, -4802, 4257, 4286, -4516, -3350, 5296, 2493, -5925, -1738, 6265, 222, -6758, 582, 6003, -2316, -6025, 2722, 4711, -4028, -4634, 4078, 3321, -5307, -3175, 5014, 1487, -5859, -1123, 5774, -309, -6606, 1197, 5579, -2775, -5602, 2930, 4911, -4147, -4015, 4428, 2846, -5084, -2429, 5502, 1644, -5757, -159, 6125, -463, -5690, 1932, 5631, -2418, -4489, 3720, 4901, -3895, -3105, 5106, 3055, -4928, -1599, 5721, 1299, -5373, 544, 5992, -1089, -5284, 2408, 5435, -3052, -4521, 4212, 4165, -4256, -2969, 4896, 2313, -5129, -1309, 5433, 504, -5580, 420, 5559, -1726, -5107, 2546, 4604, -3696, -4057, 3933, 2969, -4854, -2419, 4913, 1280, -5575, -1137, 5203, -341, -5614, 596, 4960, -2528, -5235, 2953, 4059, -3996, -3727, 3952, 2714, -4769]
1102d769K560O987l323p056N203N712n850m941O993L812p883j897P836Q30p882
1117c668N65P716j830p317L239O591m084o010N209N295o311m089O939K633p413
1132b535j684Q039j03p579J355P187k629o619L644N933m204n905N554M499o241
1147a288l547P133K046p603m98P427q08p166J825O716k973o161L959N464m768
1162b42m976N888M032o596l075P423J355p363l0P177j241o865K390O691l493n867
1178d792M325N156n151m295N961L424o749k122P017Q45p227P21P170k008o276
1193d001K898N871l840n446M892M726n477l892O144K761o685j491P007O5o979
1208c447J112O973k875n818L260N755m514m700M629M319n847k835O059J979o863
$$ y = [-4769, -2209, 4778, 1455, -5601, -398, 5314, -536, -5477, 1516, 5328, -2555, -4452, 3384, 4214, -3668, -3103, 4613, 2783, -4534, -1295, 5296, 1212, -4798, 411, 5706, -605, -4694, 2245, 4878, -2535, -4219, 3820, 3717, -3862, -2507, 4680, 2051, -4568, -924, 5009, 805, -5100, 454, 4953, -1288, -4835, 2298, 4344, -3259, -3757, 3670, 2862, -4304, -2479, 4237, 1264, -4897, -938, 4526, -242, -5218, 670, 4702, -1894, -4969, 2454, 3809, -3554, -3584, 3593, 2352, -4513, -2123, 4568, 1075, -4792, -467, 4689, -462, -4757, 1204, 4628, -2121, -4243, 2774, 3619, -3608, -2887, 4283, 2275, -4001, -1103, 4768, 928, -4518, 374, 5100, -377, -4269, 1875, 4636, -2049, -3540, 3467, 3532, -3447, -2335, 4638, 1763, -4055, -795, 4960, 446, -4254, 375, 4694, -1153, -3988, 2071, 4050, -2813]
1223b813p49P060r69o645J790O536l044n624L656N123m608m348N052L705n797
1238a675k582O266J336o707k59O893j311o277K311N999l248n346M077M839n038
1253g22l939N738L048o199j779O480P21o576M82O897j823o209K750N535l636m713
1269c945M055M279n012l156N422K299o103j053O172L06o555J090O368k410n706
1284c949L127N087m091m155M648L685n293l123O026J531o075o15O443l98o470
1299c622J856N615k515n649M053M121m135l945M869K895n273k274O070J194o126
1314b866m92O410j078n894J801N920l161n196M375M206m785l438N499K264n166
1329a601j734N378P54n969O41N808j371n605K459N291l393m410M067L890m745
$$ y = [-2813, -3562, 3498, 2529, -4116, -2326, 4210, 1166, -4458, -802, 4321, -287, -4635, 417, 4122, -1675, -4257, 2009, 3345, -3362, -3621, 3272, 1961, -4316, -2005, 3994, 746, -4600, -523, 4316, -722, -4661, 1077, 4125, -2074, -3853, 2627, 3348, -3228, -2746, 4151, 2328, -3881, -1131, 4404, 768, -3945, 110, 4389, -623, -3779, 1643, 3942, -2161, -3214, 2958, 3264, -3291, -2201, 4167, 1757, -3949, -822, 4265, 174, -3981, 667, 4352, -941, -4064, 1962, 3493, -2582, -3197, 3246, 2848, -3622, -1766, 3849, 1334, -4315, -262, 3859, -276, -4221, 648, 3543, -1730, -4004, 2066, 3260, -2866, -3358, 3052, 1974, -3920, -2119, 3801, 640, -4556, -181, 4025, -760, -4198, 1301, 3565, -1601, -3335, 2043, 2797, -3172, -2531, 3277, 1906, -3699, -1240, 4051, 658, -3752, 315, 4205, -540]
1344e40l181N328K043n514j209N877K25n958P46N929k017n338L087M558l480m022
1360c466M133L148m662k610N322J639n587o67N679M7o267J741N320k511n134L385
1376d90M499m437l271M423K787n168j800M997J425n565k28N699q03n771J898N287
1392C482k710m679L404M109m514k972M759K341m892j719N329Q54n512J84N439
1407B903j227m955J938N046l211m229L993L228m028k926N097J405m960j233N496
1422B337L64n533J065N522j988n279L290M351l722l568L903L263n027k098M899
1437A779J245n032o13N372k85n452J106N200k272m482K793M203l728l439M295
1452F90K567m750j858N190N80m763k12N092o18n152J857M589k668m424L454L710
$$ y = [-540, -3721, 1607, 3650, -1864, -3073, 2804, 3029, -2929, -2183, 3746, 1729, -3609, -522, 4036, 556, -3466, 667, 3815, -847, -3457, 1865, 3504, -2083, -2750, 2929, 2976, -3291, -1550, 3770, 1259, -3875, -490, 4009, -428, -3699, 724, 3511, -1657, -3457, 1540, 2965, -2600, -2828, 2871, 2068, -3703, -1805, 3482, 772, -3907, -503, 3606, -908, -3880, 879, 3220, -1672, -3391, 1938, 2792, -2720, -2536, 2903, 1676, -3279, -1341, 3705, 494, -3735, 258, 3486, -542, -3468, 1629, 3034, -1926, -3159, 2337, 2701, -2832, -1767, 3755, 1767, -3512, -222, 4129, 407, -3161, 742, 4005, -1022, -3120, 1779, 3024, -2008, -2621, 2751, 2466, -2986, -1880, 3320, 1048, -3434, -641, 3562, -166, -3605, 690, 3257, -1493, -3351, 1839, 2419, -2344, -2556, 2536, 1918, -3234, -1377, 3212, 544, -3880, -426, 3284]
1468C284l927l191M656J983m521j309M939O40m883KN257j413m808K264M259k646
1484E86l979L577L024l971k545M803J504m741q39M836J22m758Q57M377j333m619
1500c099K344M129l049l496L881K631m240k051M358J577m968k53M676o46m194
1515b400Q72M529j813m022K489L527l112l268M004K351m489j526M499Q30m575
1530b104J03M339q47m251J575L851j989l887K907L176l275k820M190J653m197
1545a576j084M360J51m107K15M525j147m631K215L716k195l892L316L152m046
1560a028k029M296J554m682n43M534j57m093O46M367j591l763J926L706k801k948
1576b606L235K542m053j815M361R31l965n73M255k93m235R32L826j476l690K241
$$ y = [3284, -643, -3834, 822, 2805, -1716, -3025, 1914, 2554, -2329, -2327, 2930, 1517, -3291, -1027, 3232, 586, -3393, 184, 3208, -763, -3308, 1495, 2999, -1742, -2581, 2255, 2377, -2381, -1524, 2853, 1520, -3099, -755, 3374, 325, -3171, 710, 3341, -899, -2950, 1408, 2985, -1983, -2236, 2440, 1794, -2400, -1528, 3001, 1188, -2834, -345, 3182, 70, -3198, 806, 3157, -1332, -2858, 1641, 2471, -2104, -2001, 2338, 1491, -2760, -1185, 2666, 677, -3210, -303, 2873, -402, -3222, 968, 2621, -1576, -2660, 1700, 1851, -2256, -2041, 2484, 1337, -3294, -1079, 2637, 442, -3450, -134, 3018, -1028, -3057, 1239, 2793, -1889, -2432, 2102, 1945, -2148, -1502, 2865, 1274, -2489, -563, 3143, 342, -2606, 629, 3171, -882, -2697, 1664, 2595, -1370, -1943, 2312, 2019, -2216, -1284, 2542, 1066, -2624, -383]
1592c83L187k941k736L748J982l905j202L923N20m242L58L924r15l835J399L734
1608B616k178l303K587K999l224k242L700J243l767q70L886L97m040L42M041j157
1624A030l727J825L219k078l036K891K361l139j950L641J066l872k44M045m63
1639A569l690Q48L703j419l210J765L318k766k917L248K182l187j888M135M54
1654B145l808LL772n48l483J115L270j681l192K226K981k769k669L278K162l725
1670i23j200M101K40l732J26L594j028l565J689L021j970k885K249K756l019k214
1686b760L502J467l602p57L440M31l648K74L650j183l232J625K883j989k630K539
1702A0K305l233j573L501Q23l455m24L622Pl515P99L581j901k830J947K637k207
$$ y = [-383, 2804, -137, -2873, 875, 2857, -1048, -2250, 1673, 2193, -2049, -1691, 2233, 1318, -2517, -1118, 2616, 438, -2865, -278, 2721, -503, -2745, 955, 2198, -1569, -2439, 1447, 1844, -2196, -1854, 2187, 1030, -2697, -872, 2347, 269, -2767, 124, 2485, -654, -2604, 1037, 2103, -1769, -2013, 2032, 1569, -2121, -1273, 2430, 1011, -2199, -434, 2884, 118, -2799, 449, 2631, -556, -2444, 1691, 2145, -1663, -1660, 2112, 1564, -1919, -804, 2466, 785, -2407, -181, 2800, 31, -2638, 640, 2802, -923, -2123, 1978, 2218, -1514, -1388, 2206, 1178, -2387, -698, 2323, 353, -2532, -283, 2473, -546, -2760, 742, 2209, -1393, -2150, 1290, 1721, -1927, -1653, 1997, 814, -2418, -793, 2090, 101, -2529, 10, 2315, -918, -2491, 1010, 1833, -1622, -2046, 1576, 1583, -1932, -1133, 2448, 547, -2283, -336, 2301, 94]
1719I4k465L049J720l269j283L571O48l313l68L646o24l429J083L283j511k804
1735a972J889K344k439j996K795J592k985j133L542J57l311l53M124r40l263J404
1751e45K507j591k521K228K078k515j663K799J345l332r54L539K69l497L48L347
1767A842j112l008J647K714k059k207K335J940k581j762L268P53k954o65L269
1782A420j75l291Q66L116j242k921J918K563k241k146K525J708k860j232L112
1797A120R02l388Q7L028l22l233J049L046j837k090J569K170k063j841K706R94
1813A897k770p50L090K25l206L13L039q86k907J589K367j750k305K072J992k603
1829e93j139K352J156k726n97K826J08k881L39K940j382k570J645K502k166j826
$$ y = [94, -2371, 678, 2398, -871, -2154, 1417, 2065, -1248, -1616, 2030, 1406, -2023, -940, 2343, 832, -1972, -83, 2261, -178, -2174, 621, 2213, -772, -1905, 1637, 1794, -1517, -1870, 2254, 1314, -1949, -545, 1962, 371, -2150, 78, 2156, -359, -2022, 777, 2122, -1210, -2164, 1375, 1644, -1853, -1505, 1842, 730, -2278, -631, 2083, 24, -2183, 152, 2092, -489, -2251, 1017, 1770, -1184, -1849, 1420, 1245, -2046, -1180, 1936, 694, -2227, -309, 2254, 13, -2133, 392, 2100, -760, -1992, 1120, 2022, -1366, -1279, 1749, 1427, -1806, -757, 2289, 452, -1638, -69, 2101, 38, -1803, 903, 1897, -873, -1623, 1467, 1692, -1514, -1201, 1838, 952, -1955, -366, 2001, 251, -2054, 18, 2010, -593, -1732, 620, 1776, -950, -1547, 1279, 1387, -1494, -1155, 1785, 403, -2167, -522, 1980, -186, -2012]
1845b012K360J270k392r78K551O98k836m55L223m04k769Q10K677j270k525J777
1861b75K027j869j900K340J315k226j243K678P09l034L43K746n87k811J282K619
1877B114j649k306J914K109k649j144K471Q18k235q18K718j25k803Q47K423o59
1893A026k857J603K135j528k081J886J764k635q72K292N30k260l37K514k22k509
1909a551M15K347r04k268J697K010k159j506K172J430k486n93K261M69k741J17
1925a290K384j61k460N59K341r50k348J820J764j964j438K286R23k351k82K136
1941I69J26k340L48K324n58k453J322K081j747j757K023J331j891j133K125R24
1957A694k278p55K521l7k231J32K536o78k418J395J922j849j825K463J076k084
$$ y = [-2012, 348, 1618, -774, -1752, 799, 1497, -1339, -1794, 1429, 1025, -1744, -934, 1743, 473, -2052, -275, 1752, -117, -2017, 323, 1638, -588, -1831, 847, 1556, -1478, -1135, 1611, 1024, -1787, -505, 2114, 465, -1841, 73, 2182, -467, -1611, 860, 1678, -557, -1375, 1343, 1218, -1585, -738, 1685, 1026, -1831, -228, 1907, 379, -1702, 184, 1948, -687, -1559, 733, 1263, -997, -1334, 1180, 958, -1551, -1136, 1211, 307, -1961, -264, 1746, -413, -1919, 253, 1683, -803, -1396, 865, 1334, -1407, -1290, 1094, 933, -1527, -968, 1373, 423, -1925, -105, 1659, -305, -1743, 543, 1466, -885, -1167, 969, 1095, -1245, -897, 1427, 869, -1584, -262, 1819, 72, -1685, 338, 1669, -222, -1355, 770, 1694, -584, -1339, 1182, 1145, -1086, -954, 1582, 904, -1514, -119, 1803, -46, -1871, 592, 1668, -416]
1973d16r55K224L57k275j3K504m82k257N68K270r58k477J762J880j807j398K293
1990H20O65k064j163K387O86k790N86K151l71k429O42K358j267j988J820J845
2006A888k158j528K494J002k644l30K401m2k102K20K109p96j765J007J800j567
2022a1j601J830J498k104j011K226N19k271JK325l58k028K64K074q12k014J280
2039a93J861j562j634J821Q99j562q69K126L62k447M39J943m02k156Q21K085j183
2056C49j672J060J450j532r58J707R04k065p34K433J0j988J18K046m06k044O48
2073f74J926j000j809J770J232j598j304J993P75k083l39J921L27k424L81K275
2089A369q59j946J214J573j085j523J361J480k140p47K129O22k253j57J790L31
$$ y = [-416, -1371, 853, 1210, -1065, -1078, 1426, 944, -1313, -745, 1525, 567, -1910, -148, 1732, -75, -1473, 820, 1485, -579, -1742, 645, 1331, -1459, -873, 1278, 907, -1522, -880, 1478, 211, -1777, 43, 1888, -270, -1798, 696, 1698, -946, -1276, 1125, 1083, -1019, -799, 1310, 514, -1251, -244, 1556, -11, -1612, 218, 1716, -388, -1399, 827, 1346, -925, -924, 1401, 1043, -985, -721, 1353, 541, -1473, -193, 1668, 106, -1528, 293, 1192, -370, -1239, 887, 1249, -1198, -759, 1184, 782, -1374, -553, 1532, 349, -1323, -263, 1187, -345, -1303, 404, 1308, -757, -1491, 942, 952, -1036, -918, 1128, 722, -1322, -674, 1252, 252, -1557, 213, 1445, -153, -1457, 536, 1311, -772, -1111, 810, 1137, -1287, -906, 1369, 510, -1436, -222, 1351, 266, -1257, 104, 1584, -556, -1303, 826, 1448, -805, -962, 828, 1159]
2105A159k134L72J999j046j595J113J482j076j482J905O71k036n41K149J53j874
2121g81k42K078o05j373L81J705r30j606J266J434j385j142J470J198k288m87
2137a307K319j8k081p5K253k58k047J034J463j121j490J069J369j563q84J904
2153E67N28j995k27K017j4j791K82J897r45j653Q67J587j188j097J483R91j894
2170e85p11J943L71j631j00J967o02j790Q58J691p97j470O70J340r15j260J256
2187B35R54j612l12J878J49k146M2K007m92j786P16J584j045j259J203R38j178
2204a24j044J794N81j835l41J918j44j996M19J980p44j780P18J824j078j398J304
2221E4Q83j330p20J409O62j766k55J838N8k071M69J887q93j434Q73J637j115j531
$$ y = [1159, -975, -603, 1396, 350, -1245, -132, 1350, 274, -1208, 697, 1368, -668, -1209, 940, 1093, -781, -1023, 1055, 450, -923, -542, 1163, 233, -1373, -107, 1327, -58, -1200, 270, 1468, -820, -1307, 1012, 994, -1087, -1162, 1091, 833, -1214, -180, 1283, 162, -1328, -259, 1110, -453, -1337, 567, 1095, -900, -1127, 890, 876, -915, -633, 1264, 319, -1334, -467, 1120, -68, -1165, 318, 1309, -585, -1296, 647, 1018, -613, -713, 1254, 652, -1138, -280, 1411, 614, -856, -186, 1154, 239, -1021, 235, 1189, -423, -735, 1143, 1292, -854, -812, 1195, 703, -1083, -367, 1217, 172, -1087, 116, 1054, -124, -1168, 626, 1207, -628, -969, 949, 805, -1191, -772, 1208, 464, -1316, -598, 1226, 148, -1250, 54, 937, -393, -1113, 296, 958, -808, -1063, 775, 833, -1238, -769, 1118, 225, -1209, -336, 1301, 186, -1345]
2239a345J341J228j925n85K110K02j739l08J999k04j889N77J641o32j614J202
2255E9Q22j070j171J556J275j857n24J527K40j765J4J736k29j574M39J741q77
2272C42j604J140J252j107p09J145P33j838j58J454J65j568p1J828m91j422O66
2289b43J143o52j312J016J136j487o75J466L74j466M2J296k23j427N02J426p62
2306A54j291P89J352r84j063J166P67j159o45J362J52j087k41J309L3j589N20
2323d55J252l84j283Q84J132j148j044J338O71j580l37J734k2j091k96J605j22
2340H54j696O01J161p90j262J280Q82j405m60Q99R79j641l84J629r0j429L19J507
2358I54m59j554N89J609j132j076R36J071j260m57R70N96j499p3J572n1j718L91
$$ y = [-1345, -4, 1224, -701, -1286, 824, 1026, -713, -1021, 978, 774, -1115, -538, 1103, 471, -1143, 59, 881, -189, -1360, 196, 1471, -386, -910, 617, 857, -908, -894, 842, 613, -961, -522, 1219, 342, -1262, -122, 1130, 23, -686, 459, 1192, -646, -804, 650, 815, -753, -824, 1004, 513, -909, -243, 900, 248, -1064, -48, 1088, -399, -1074, 392, 766, -700, -658, 638, 415, -1012, -510, 916, 154, -1137, -348, 1004, 20, -1043, 123, 890, -269, -914, 448, 600, -487, -728, 581, 614, -975, -455, 797, 413, -870, 14, 1146, -2, -1046, 292, 963, -617, -954, 780, 758, -333, -629, 976, 854, -842, -241, 920, 130, -1132, 148, 1030, -375, -835, 64, 1043, -598, -982, 647, 557, -872, -553, 954, 495, -1059, -470, 1139, 7, -1069, -133, 938, -322, -779, 191, 787, -712, -785, 787, 736, -982, -591]
2376e91J348m77j429O84J317p79j168J417M85j229m91J281K50j541L68J320jj541
2394g77N25R90n15j146R51J058j305o86J257M41j307k50J389M49j617p5J512l31
2412E63j527P54J184r06q51P19J025j266n81J143O42j344k47J345k33q73K9J311
2430H87l42j293N88R46o78r15Q95O05r65k81R42L89j181k79J230j19j316O22J117
2449H52k92j702P69J338j006q60J160O06j182n20J046Q05j535j24J417l07j281
2466h16K65J218l47j111O58R23r93p61J406K41r28l72J231lj306L19Q77J19j356
2485g36L54J349q65r59P18Q77q82p82J318L58j041m11J269k8j157K5J077k27r39
2504f82M39J146o08j229P74R45r77n27J029J64j098l8J192j10r80K10J120l54
$$ y = [-591, 757, 280, -1149, -465, 852, 73, -1095, 322, 807, -422, -913, 368, 618, -923, -555, 765, 764, -777, -252, 738, 223, -923, 28, 1086, -219, -905, 352, 793, -514, -764, 625, 1074, -543, -618, 894, 563, -964, -210, 974, 68, -783, -64, 961, -305, -886, 257, 899, -445, -692, 653, 420, -453, -424, 887, 545, -748, -160, 786, 108, -807, 88, 693, -272, -553, 389, 778, -403, -682, 548, 429, -887, -265, 852, 560, -1142, -373, 965, -41, -901, 259, 865, -317, -837, 209, 1014, -521, -645, 772, 465, -816, -551, 667, 320, -791, -133, 790, -203, -964, 442, 683, -245, -617, 614, 611, -695, -376, 501, 620, -736, -382, 967, 102, -857, -139, 738, -144, -926, 392, 750, -291, -702, 567, 539, -618, -593, 484, 257, -682, -243, 903, 295, -934, -160, 785, -192, -719, 310, 474, -624, -662, 530, 420, -560, -350, 770, 416]
2522D16j192Q10P08m33j234J276M04q75o47J097K37j082k14J187R2j475N49R71
2540E95m08q04O87O92r43o43J023M85n65o17R59Q2r01j36J067k01j046L84J074
2559G84n70q97M98Q31p20m54R62K77j011l76J181o1o71k37J040k74p66L79J017
2578I32o85j206J216O74j038n01R43K74j113P7J185n56p80K71P74l37r14Q33P11
2597G60p57o15O21O08q14m14Q23K45j012J60J127l16r09J40R01n33o49M79Q03
2616F48o32p22P33M37q48k07J230j82j007j0J262l53j052N37N31l19o00P97M46
2635F89q48n85Q46L97r10j22R68M0j105K38J115m84q54N51R90p77p10O54O18q00
2655h9n66J155j80q31N2R23k59p64M55O14k30r49N57P64o08p48O52O26q05l35
$$ y = [416, -776, 34, 742, 309, -925, 351, 755, -120, -767, 330, 567, -515, -729, 458, 550, -925, -376, 595, 187, -617, 70, 762, -181, -824, 199, 684, 119, -498, 461, 543, -358, -494, 573, 372, -674, -290, 784, 214, -683, -185, 646, -74, -528, 434, 711, -300, -676, 505, 444, -227, -464, 576, 302, -464, -85, 932, 247, -959, 257, 931, -107, -608, 335, 609, -504, -427, 758, 202, -578, -307, 467, 130, -784, 49, 760, 3, -612, 9, 617, -197, -611, 212, 457, -555, -395, 732, 416, -493, -353, 548, 15, -634, -155, 648, 16, -706, 27, 464, -384, -591, 639, 457, -550, -560, 702, 349, -703, -166, 365, 46, -554, 243, 689, -159, -744, 102, 499, -411, -533, 435, 475, -630, -392, 723, 239, -615, -64, 926, 149, -561, 93, 711, -89, -655, 500, 320, -511, -459, 464, 205, -559, -104, 510, 280, -669, -112, 652, 44, -704, -52, 574, -231, -566]
2675e66R78k5r63J71R21j32q29J39R27k89p38N32L01n34n52P85N38r96j44J017
2695E41R1j391J39J204k96m49mP22n68o31N04P74o18n11R26K8q25m3Q36J06p36
2716b01m8Q86n44n88N73N20n30o09M82M71m48l45M78M52r94K45R36n00q20N02
2736h2P89o54m26K19P62n33p57P29L89n02m91P71K68r51K7R02m43o43M49P11n71
2757c7m94N40N56n61n30P86K74p49q6M84J61q26l3R23l45n83N25M85o44q6L74
2778A34M09q29j38Q28o0q01K02P32o9q42R1O95j69o15L97M45m17l63N12J15l99
2799a42j31L36K83n88q2O07l25j22K8N06l91l76M67N09n93k79M58j81m11J60P18
2820D51j29r41J70R56k47p01J04P59n31l46M62O10o90n02Q27K01j007J61P97K5
$$ y = [-566, 412, 387, -576, -405, 516, 384, -445, -306, 621, 332, -406, 126, 427, -107, -659, 126, 664, -332, -476, 541, 632, -759, -620, 584, 288, -161, -165, 557, -11, -642, -138, 636, 18, -493, 433, 461, -364, -407, 429, 535, -201, -249, 637, 93, -495, 78, 598, 68, -541, -59, 412, -36, -381, 97, 549, -445, -200, 736, 236, -584, -82, 707, 53, -373, -154, 608, 75, -682, 47, 436, -66, -557, 214, 482, -469, -442, 460, 17, -626, -177, 534, -37, -531, 9, 565, 4, -526, 260, 534, -215, -301, 183, 344, -482, -515, 408, 63, -520, 5, 490, -154, -240, 134, 543, -286, -424, 404, 344, -457, -255, 477, 408, -434, -343, 352, 183, -432, -35, 410, -7, -370, 142, 257, -142, -273, 63, 346, -242, -324, 283, -42, -164, -136, 370, -21, -397, 70, 579, -14, -293, 165, -16, -427, -267, 451, 322, -619, -449, 507, 260, -441, -337, 422, -109, -455, 7, 617, -73, -575, 252, 453, -554, -393, 404, 429]
2840D29r84K65Q63n09o04L06P09l77l73L91L57p87K0L27L18o53l2O73q6m85J25
2861a07O50n69k26M88N70o44p28P80L87q03J8M92ro01J81O14k97n57L20P98p06
2882E1m97M41N38q23j80N46K68m76p8M66j87o54K67J011m63r23Q73K70p30l71
2902f51O72L06n50l13O92J32q65J62P21j8o39L98N23l99p05M65N34o28m27N97
2922GM21p29r7Q80k97l58j28O43l14m78M48L53l82m32P06K09n57k28O40K84j004
2943d13j15R89j62n81K84L60j66n57N57N49p70k90N61L04q13j89L37N39n77j82
2963c35O39m6n93K69L86l16n80N78O68o44n53N63M70o51j08N53n2o55J27O56J0
2984C86o87K25M90m34o36O42O05o35l62N35M11p62j53O54j74n43L42M47j88n42
$$ y = [429, -555, -290, 573, 64, -540, -234, 475, 98, -275, 116, 473, -314, -294, 33, 351, -302, -334, 339, 253, -232, -107, 543, -26, -252, 236, 806, 162, -566, 214, 601, -202, -184, 308, 299, -302, -121, 493, 196, -361, -41, 757, 51, -446, -5, 533, -290, -470, 76, 344, -132, -210, 256, 69, -585, -318, 693, 230, -693, 180, 450, -280, -651, 21, 327, -223, -536, 156, 288, -577, -415, 306, 288, -351, 47, 570, 171, -534, -69, 465, -163, -590, 7, 428, -301, -398, 482, 185, -173, -301, 342, 28, -450, -2, 351, -31, -463, 243, 452, -105, -333, 307, 591, -413, -528, 461, 299, -282, 2, 362, 196, -361, 196, 745, -25, -315, 246, 550, -263, -452, -115, 424, -153, -335, 304, 258, -335, -66, 320, 4, -576, 2, 670, 26, -527, 36, 506, -145, -253, 300, 248, -407, -280, 376, 386, -301, -76, 414, -20, -656, -14, 591, -44, -406, 129, 540, -222, -375, 279, 105, -438, -96, 351, 163, -379]
3004c79L30L53j83n20L49L14k70o20J050j22p80L08L27n1m23J08P72m36p13N44
3024d2N12m01k57L05L69q25j03O33L5m92j01P75j08q94O80K87m12p23P70L80n22
3045a34J6J53M84n84j62N13q7o21L29N48k61p11L72P33p61j83M38J81m79l18O90
3066A56O1n34o8Q50l30m87L14M06j21p22N51L33n74j80O51K8o76J73N37j38m71
3087b41k08R31k22n76J42N32k18n06J44M97m10l95P04J30n77n1Q30l29n14k6N88
3108B25k5q29M99O20m52l45M32K05m09k61K40P28q49j26N44J04m79j21P16k28
3128A89m37M52J38m00l94O23L68o48k14M37P8n43L7N33K09j057L50P04l89m69
3148d33M00L31l47j71K24M41q57O8O28p7p89O0R61l63n39K71R37n32m88K08M19
$$ y = [-379, -49, 304, 121, -399, -50, 264, -6, -626, 424, 302, -478, -170, 157, 106, -317, -209, 563, 127, -586, -42, 470, 69, -188, 117, 486, -339, -442, 191, 226, -266, -367, 408, 300, -594, 86, 373, -39, -762, 8, 388, -134, -118, 35, 519, -65, -227, 286, 199, -422, -93, 455, 194, -517, -145, 588, -173, -356, 82, 263, -216, -534, 156, 217, -317, -385, 465, 135, -352, -38, 368, 247, -475, 76, 409, -165, -345, 306, 334, -342, -169, 368, 230, -241, -449, 482, 260, -316, -174, 358, 140, -366, -222, 275, -135, -530, 174, 304, -273, -324, 506, 177, -337, -363, 225, 200, -629, -130, 490, 38, -307, 125, 330, -79, -340, -100, 628, -221, -347, 197, 301, -178, -299, 417, 189, -248, 204, 342, -58, -452, 171, 539, -109, -323, 114, 192, -351, -314, 219, 428, -629, -279, 425, 36, -433, -33, 298, -49, -220, 4, 445, -412, -344, 284, 207, -582, -522, 439, 76, -463, -192, 745, 213, -275, -67, 352]
3169C52l95l01P53Pp04m9O60k8q13K33N89m37l35N16M62n54m38L48M67l91m54
3190e12P14M4n45j05O58k17l05J4R46o54n26K99L96j83k85M3O66m83k96O56J57
3211D82n97j50Q10l50o71L08N09m35m50P43J83l10l47L23M94q23j00N26O9l85
3231a71q0K94K69q40M72K00j94l02M92L47n60k01L69L31p77r0P75q6n83K31L56
3252B52j30n05L40M63l60n28P30J30o22k13O46J08o96K02M67k07l63K67L68m26
3272g7l60N26N38q18k88N87J38m53o5N97J60j204L42N99L5p99O09L70m68n28N37
3293b2L61l28m37M75L73p08p5O12J68p04J68L29j05m76K80P40o00l75L33N90p22
3314a23j49M83Nl11J03K66j63o14L25O44l37l11K05K36k55l99M05L15n83k85P05
$$ y = [352, -43, -344, 409, 416, -288, -337, 323, 295, -518, -285, 304, -133, -468, 48, 510, -44, -482, -134, 333, -58, -512, 202, 246, -299, -404, 254, 37, -268, -254, 692, 38, -488, -189, 207, 24, -261, -218, 448, -35, -331, 325, 482, -115, -265, 545, 195, -476, -168, 341, -94, -544, 199, 382, 72, -275, 48, 542, -281, -381, 145, 214, -171, -251, 43, 312, -528, -56, 144, -50, -352, 140, 487, -73, -274, 95, 426, -351, -441, 334, 248, -335, -104, 252, 122, -383, -43, 420, 60, -468, 262, 392, -230, -443, 203, 311, -385, -183, 284, 77, -286, -19, 349, -77, -437, 89, 627, -191, -479, 108, 246, -207, -272, 325, 485, -719, -377, 222, 257, -542, 67, 437, -31, -559, -22, 339, 11, -426, 49, 422, -286, -361, 251, 419, -285, -117, 212, 107, -369, -89, 651, 51, -324, 9, 599, -123, -272, 211, 216, -95, 8, 274, 111, -503, -178, 466, 129, -182, 23, 259, 4, -395, 10, 325, -258, -543, 162]
3335A62K0m87J32M98j17m79n1P49k61m98J52Q00o30l12N90p3m98l3N74r8n85j76
3357f21Q47j8n23O8N73k27l20M11j25k45l63O70L47r19r8Q77j73l69K47L65k50
3378A54m76K54L73l51m16M89M28m16o97R20l9n24Q4N84P9o75K54K07q8n42L50
3399d8L18k28k07M11K64o44p3N74K51r35J38N57o61j83K94M68j74n10L50N22m85
3420ao55Q48mm78k9Q07k18o63K67N66l59m84K55M54l53l46O45J09m96k04L89J40
3442A90n06R0L21j58j86J5N77o7n31M6N96l34n09M64N04r22K22N07lo39j3O97
3464C61j50o74L92L86k09n27N04L20m15k90M66L01o07n8L78j26l41j29Q08j65
3484B25n26J70L48j99l32P5N45l24m19N22J33m72K3N24l5o57l5Q28k08o58M38
$$ y = [162, 182, -305, -173, 325, 208, -271, -322, 427, 166, -332, -180, 620, -10, -322, 268, 195, -303, -336, 238, 140, -445, -621, 226, 208, -315, -247, 326, 99, -221, 190, 65, -180, -543, 127, 474, -445, -543, 334, 161, -208, 39, 404, 154, -322, -68, 305, -46, -462, 27, 455, 39, -658, 262, 223, -301, -217, 367, 446, -229, 25, 232, 144, -398, -48, 270, 42, -165, 246, 510, -134, -207, 367, 618, -317, -179, 378, -283, -466, -172, 296, 122, -388, -38, 484, -1, -656, 192, 188, -290, -319, 488, 270, -393, -126, 440, 81, -403, -148, 306, -47, -393, 252, 361, -135, -339, 50, 190, -316, -226, 95, -63, -249, -234, 343, 276, -255, -209, 387, 53, -456, 8, 512, -410, -188, 319, 316, -323, -336, 361, 211, -463, -71, 315, 106, -421, 83, 403, -12, -302, 164, 465, -142, -200, 178, 52, -289, -418, 390, 225, -301, -131, 217, 18, -314, -239, 306, -18, -437, 85, 218, -254, -231, 293, 258, -399, -434, 394, 186, -472, -34]
3505c4K17M0o25L06K84l37n6N34qm99J2N9K08k88M1M72j26n39K11O45m85l62L69
3528C9M11m33m36O07J38q78N19K72j86l03K80K72k44n05L76M12n66j76M68K28
3548B95n21j92Q70j01n70K4M11J27p71J96O58k54l89L04K35o21j16N85J58n88
3568b60k2P15l09n07L3Q27l78l46K3N36l71o16O96M73n40l07L75K7l61R2N77M3
3590D00q21K26K98R3n58L74M60o11m49P91J28k73k80L85O5p95K05O63k12n47L03
3611a55N92r0r62P34K71l94j75M12R3l16k28M65J77o50J90L39j22o96M83L75l05
3632C8m30L31L46l57l80N61L87o43k5M98j78l72k9M75j17l85K08L30l59k86M79
3653I2M8j08l18J35N48o66J5M80o6m67K10N10o77j67L73L44j82m10L41L45m27
$$ y = [-34, 183, 223, -402, -96, 188, -149, -205, 329, 321, -178, -166, -107, 101, -187, -146, 326, 200, -339, -128, 517, 32, -330, 39, 450, 17, -419, 188, 326, -552, -33, 239, 53, -250, 30, 302, 58, -447, -71, 341, -225, -401, 67, 295, -226, -418, 452, 351, -219, -195, 216, 343, -428, -232, 426, 172, -217, 87, 322, -299, -415, 170, 328, -260, -282, 433, 124, -383, -350, 477, 99, -247, -224, 312, -59, -675, 21, 494, -46, -353, 22, 49, -312, -220, 357, 400, -421, -195, 103, 196, -362, 12, 472, -139, -588, 203, 331, 58, -222, 163, 228, -567, -362, 301, 89, -458, -155, 437, 347, -615, 119, 390, -4, -179, 233, 326, 10, -218, 247, 424, -226, -36, 303, 181, -515, -32, 343, 38, -392, -61, 285, -72, -452, 109, 496, -147, -172, 326, 148, -224, -253, 222, 105, -280, -72, 258, -101, -387, 92, 140, 32, -286, -151, 397, -269, -254, 226, 160, -307, -97, 413, -264, -431, -58, 286, 104, -306, 35, 380, -47]
3674d7q0K86O6m62p5O55k02l66L89L07k57p40O58J80k12l58M74J43m07j72O99
3695D79j38o11J42L27J82p63O56Kk55l91J02M07m29J73J94K93n45j73O85j88l37
3716a88K52L16k32o75M09M50k34m57O45j41m13j24Q07l32n03P5M42Q2l14k91P92
3737C66k53l61K77J98l85l7J85K24k20o4J33K30m64l06Q94l37m60K77L48l61l67
3758d83N18L07m55q9N17j58m27l9O06Lm69oM25j53n39N68K25l07l51N47o2m01
3780b23j47O61J6n39OK70J3j66K9M56l20j37j21M82j33m38K61L04o30L9N91j71
3802A03o29L65M99np36M22M21l51o54Q32Rn33l0K38L45l48j1K80M6m98RM70j44
3825A00m83J58N68k64m19K81N15o60k91O30J40l57j34M90J03o23M05j12P4j35
$$ y = [-47, -127, 159, 225, -237, -312, 343, 141, -225, 164, 471, 214, -526, 132, 312, 100, -258, 216, 359, -48, -220, 479, 341, -270, -128, 199, 381, -382, 274, 276, 21, -370, -268, 139, -290, -117, 77, 370, -175, -348, 337, 149, -188, 64, 380, 148, -527, -118, 332, 98, -359, 286, 145, -268, -392, 415, 83, -420, -345, 97, 179, -135, -426, 366, 113, -248, 29, 227, -158, -195, -10, 214, -6, -70, 63, 293, -171, -477, 417, 80, -380, -103, 245, -116, -483, 35, 342, -113, -202, 315, 157, -270, -309, 297, 300, -169, -175, 250, 97, -442, 126, 351, 44, -307, 240, 178, -223, -370, 291, 307, -232, -226, 44, 57, -109, -80, 376, 56, -81, -202, 280, 147, -291, -30, 274, -356, -317, 274, 103, -526, -161, 338, 333, -403, 19, 440, 89, -565, 267, 276, -257, -287, -49, 296, -52, -63, 217, 263, -235, -226, 244, 100, -383, -225, 343, 79, -340, -59, 456, -204, -495, 135, 275, -82, -216, 274, 377, -246, 159, 47, 121, -14]
3845a4J97J80m48m88P30R4n13N6K43L06n93M9J51J07r2n4K23K28o59L72q3j65
3867a73j07O17k79j76k9L54K41m74M2J75n5k84J31J07j71l11L93K80k07k83L91
3888A82J69l98k35L46L61o91J34L71m2m22P2L67l07j01L53J60k95l2L45l9k58
3909D0k33M86j88j61l5K97o5m19N15m1j21j97M36N0l34m07N89K2o37K41N34P3
3931D45p70J14M49j71m98O27R1Mo45L83K81m27LL21J83n66L28J38k96k82J98J11
3953B1J38l55O6L73l26l40O04M8o06J65K28K76o21p9P69j37o22N45J76l13l47
3974c37J32O07l1p81M18L48m87R2K12L1n18L01M30j89m33K93K25m01r3L57L45
3995E21q32LM97rn13N3N05k77K24p2N2j59j88J17L26j61m58O05j47J6k12O8L76
$$ y = [-14, 183, 363, -85, -573, 157, 251, -262, -206, 37, 343, -250, -201, -50, 57, -35, -89, 134, 362, -297, 75, -8, -173, -280, 337, 58, -118, -147, 207, 448, -26, 16, 191, 136, -148, -17, 90, -81, -392, 1, 281, 74, -209, 182, 351, -47, -282, 64, 425, -266, -132, 239, 197, -225, -153, 214, -93, -194, 159, 319, 24, -8, 337, 298, 40, -193, 293, 105, -56, -91, 206, 141, -278, 237, 196, 75, -122, 314, 364, 30, -377, 212, 234, -403, -162, 372, 445, -325, -211, 238, 67, -431, 196, 287, 291, -354, 29, 310, -117, -114, 207, 390, -176, 152, 290, -6, -288, -90, 21, 159, -196, -130, 243, -83, -423, 181, 229, -377, -212, 16, 292, -329, -408, 361, 224, -398, 147, 323, 10, -337, -205, 402, 371, -410, 8, 356, -131, -39, 173, 204, -314, -13, 417, 228, -205, 88, 313, -88, -181, 176, 521, -311, -308, 189, 180, -333, -280, 225, -52, 172, 100, 152, -7, -195, -78, 248, 87, -371, 234, 87, 103, -109, -41, 335]
4018C35m74Q0K03n6n49K21P66m68l65M03K25l99l6K63l8l90k5O06l38l05m5O10
4040B24k59k87K42N50m28k59M32J54m25k92N07N6m04k62M92L63q09M20J41j44
4060A2l43K59M31l54k31L7N13o81R9M86J7n37M31ol35P3k7O05m81r7J62M6q9l67
4084c77N22L1l32R2J87M6k27r4O17j08o76J77M33m84j78M95L2j35m75P30R1n14
4106a47k48O52j22n05K42L63j49l43P1M42j88l42K22J41j68j13K20M04m29k59
4126b56M35K4m63J98J03pk57O3M29k92qj7K25m11L18J65J69o51n5O42l09n21J61
4149c15P45k69m18L36L25l50L8K22l7m34k13L55K58n12J65M52k12k29J13K91l59
4170d8l07L47K33J77o20M20L6l14n6J65k7l06L20J18j6m62M00K60m36n2J25M13
$$ y = [335, -139, -59, 144, 88, -461, -240, 526, 58, -307, 96, 321, -78, -114, 149, 111, -279, -304, 302, -36, -341, -386, 224, -35, -322, -80, 470, 42, -217, 215, 369, -56, -348, 159, 215, -189, -451, 41, 404, -405, 15, 156, 12, -331, -72, 359, 5, -226, -189, 324, -357, -258, 228, 245, -292, 139, 133, -202, -129, -156, 449, -32, -129, 33, 79, -10, -377, 145, 176, -156, -64, 123, 169, -58, -152, 465, 357, -319, -142, 291, -193, -371, 124, 156, 21, -454, 276, 367, -147, -395, 257, 135, -370, -128, 235, 86, -257, -186, 256, 68, -274, -52, 89, -79, -192, 28, 432, 3, -256, 179, 203, -260, -62, 41, 34, -223, -160, 269, -23, -31, -48, 177, -234, 84, 249, 418, -233, -288, 354, 45, -476, -315, 430, 161, -257, 79, 404, 54, 92, 314, 277, -157, -370, -15, 243, -269, -104, 348, 136, -93, 20, 311, -48, -355, -8, 225, 402, -218, 202, 238, -76, -132, 33, 6, -300, 20, 138, 122, -340, 60, 320, -116, -168, -43, 370]
4192C70k12k94J11M04o41J13J53J12l12J34M58n26k86M48J4k36R7K17J4l70K0
4213b12L49j03m2n12Q42J1o18J54L48k54k63L94K01j66m37L94o1j26j73L08K01
4234B35l35NN20k56k09j60K40k53p9J93L53n56JL57j98j64K86K36L3o54K57L63
4256B15q0m25K15J89j63m6K03M3m05J51q4L32m29K09L67l23rL4K47l30j16J93
4278a2L10k17k35K11K78l98p8L68j06m17R0M83j45k64J33j12K6k52L30J26l63
4299b44j90N90N9k15Q0k4K81o39K8M45j84l86M28L70k76m43J52N58n87q5N62l5
4321B45n04j05L79J70l84r6O21l94M5K3J10j31j98M35r0j82J55r5J57k05l08N69
4343B17R8n64K82J21o0j95O7K0J68j50l4K24k4l02J77j52n4n3K90j71j44M80n3
$$ y = [370, 158, -136, -25, 379, -262, -149, 4, 116, -196, -62, 396, -130, -416, 32, 46, -190, -93, 124, 138, -232, -212, 137, 34, -8, -520, 322, 333, -285, -131, 217, -37, -300, 94, 295, 129, -308, 86, 25, -101, -274, 34, 235, -100, -95, 425, 169, -40, -200, 40, -213, -292, -99, 254, -302, -301, 56, -142, -306, -20, 216, 249, -405, -148, 215, 135, -290, -75, 114, -49, -95, 108, 151, -254, -103, -187, 145, -284, -75, 292, -31, -40, -6, 241, -89, -205, -12, 298, 81, -154, 57, 335, -63, -141, 227, 121, -296, -206, 277, 132, -132, 1, -111, -85, -337, -7, 119, -244, -434, 156, 215, 0, 80, 56, 337, -302, -274, 171, -13, -399, 29, 399, 123, -320, -168, 390, -197, -282, 280, 245, -259, -364, 15, 185, -199, -295, 326, -68, -23, 0, 110, -21, -219, 216, 126, -56, 99, 4, 161, -44, -352, 217, 315, -249, 33, 154, 94, -101, -34, -14, 154, 4, -30, 194, 170, -132, 45, -107, -161, -214, 76, -95, -239, 241, 188]
4366A88p4j78m8L71j68k89N43j39j75k12L06n9r8k25N21N4l56J69q3p5k66L42
4388D9J59k10k16N01l7l08P4L23j9m23n3L26J19l26n3K86j76k11L80J1k71o8O3
4411h0L89n62K5L90K02o30J74J61j64p8J92J29J0l14J68J84l57j23M26J47n76
4432b87J29K84J42o06K24K42j60q8L19L7k85n2K2L25n84M3M15P4m35R7L22j78
4454@j89K28L33k71l04J06M50j90l96J35L61m91J95J22K24l30l8L46j94j74P8
4475Aj88K23k74L49K45j27l58j7K70m12k8L28L24m97L0M23j12j55n3j21J6J63
4497C0J00O3l06m25P39j66p8m01N35Q0l28K35R5o6l43Q5M23o5n49L48K72m40j95
4520c57P40j91n10J82L99l19l9P7K26j00m97L41J06j70k55M22L31n02K12q8P4
$$ y = [188, 114, -64, -112, 259, 91, -198, 345, 206, 31, -181, 125, 66, -32, -257, 264, 318, -38, 131, 48, -27, -293, 49, 208, -2, -218, 283, 246, -62, 12, 335, 316, -107, -160, 166, 285, -41, -94, 192, 16, -195, 185, 196, -75, -143, -80, 309, -253, -228, 162, 364, -266, -92, 69, -95, -173, 19, 148, 158, -156, 12, 196, -161, -284, 142, 289, -287, -158, 126, 268, -338, -114, 128, -32, -120, 199, 236, -49, -101, -79, 246, -338, -295, 120, 194, -241, -144, 178, 0, -189, 39, 372, 101, -203, -97, 353, 163, -233, -98, 263, -228, -33, 89, 313, -17, -55, 291, 97, -77, 1, -187, 36, -238, 111, 356, 229, -129, -146, 124, -288, -316, 12, 336, -161, -131, 292, 180, 25, -28, -149, -133, 30, 130, 193, -113, -538, 201, 35, -43, -444, 91, 171, -157, 78, 173, 107, -236, -151, 272, 207, -342, 6, 278, -162, -357, 383, 192, -318, -136, 263, -56, -95, -18, 208, 108, -389, -48, 58, -112, -367, 55, 386, -116, 96, 8, 82]
4541H2l28L4j3M42l91lJ93Rk16J1N14n36j32K71L33l04j87K67M4k75oM90n71j27
4565c99K52N20m80m9r4N92l56k56N18j54j09o1M4K83k55j50K77o0m90N07K98m70
4587i2k01L41J2J5l56K04J78j09j52K35r6m6K41M4rj87nK67j49m47O98j97l02
4610a13l4M35l87J49r9K44J66p57K14L27k58r1J88j4NO5n1J26n6l28J79J70j70
4633i0o3K30k30K36j28R4m5k47K91P3j37m8o7K66k33M3Q4K65l30j48L46l6k59
4656a33N8J75J1m31K10K32k97j46L28K8j78L3J17j55k13K98m2J05m52L29M30m40
4678a33k7K13J56l72J54K21m7j64r9J89j4l06L36K57m25k24L36J70l30L4K32M4
4700B01j61P7J09j62k64J4K06n0L9p2L97m26r8K59M3j23j24L15j72k52O3J48K26
$$ y = [82, -246, -212, -225, 217, -174, -177, 16, 25, -191, -180, 334, -202, -334, -63, 270, -34, -221, 46, 90, -185, -191, 299, -272, -399, -147, 373, -107, -156, -250, 342, -14, -270, 248, 94, -15, -76, -32, 251, -4, -154, 123, 63, -427, 80, 378, -92, -293, 48, 60, 75, -281, -77, 101, -8, -160, 75, -21, -67, 174, 218, 209, 22, 17, 284, 135, -312, 386, 189, -113, -147, 288, -99, 50, -49, 195, 361, -396, -182, 145, -113, -204, -16, -30, -25, 40, -11, 115, 59, -269, -90, 80, -90, -153, 77, -153, 83, -45, 49, 4, -243, 48, 121, -16, -64, -131, 135, -98, -55, 29, 294, -36, -184, 162, 126, -133, -75, 100, 111, -320, -110, 122, -175, -321, 7, 35, -143, -110, 7, -148, -361, -63, -105, 0, -452, -123, 307, -133, -160, 53, 209, -163, -9, 212, 165, 1, -98, 91, 77, -229, 107, 364, -61, -285, 51, 221, -109, -75, 157, 201, 40, 117, 226, 64, -200, -186, 20, -30, 9, -63, 334, -92, -190, 69, 112, -11, -135, 180, 8, -244, -181, -33, 193]
4723A93n90N3N22j44k81K12k2K55m36N7K54j44p4J09K34l43k90N78l2k39O4K84
4745B20pl25Q9K85r2m59L53P1k16j53M18j33k75J03J84m9k95K63K69k93l1K7M56
4768D10m96J5K72Mq0l78M81k34j42J17J96n8k77O6K53l47P2K17N6m17Q0J96K64
4791B70l85k14K71K2j94L38J60l11j34L48M8q8l50K23L21m24Nm0P6P7K4p2J93
4814A64n02R4K54p2lL4K89o23P3N45Qk23k65M76k28J00l55N5M12l25N4J80Ok54
4838a06K1L56k12j69J28J05j73q3J26R8k12O6J94jl96K97J1p4j44R5M08m05l1
4861a01P3K20l9k89K67kl63J14J84m5j5q3j40L66l37K03K24m45LJ91J93k59j28
4884b08M68j48j76K05O7k88J28j15J97l11m0K13K42l34r5L75J61p60L28K82k36
$$ y = [193, -397, -344, 178, 34, -247, -35, -57, 198, -238, -181, 73, -71, -145, -36, 198, -145, -435, 143, 111, -128, -64, 220, 213, -112, -23, 262, 170, -289, 64, 135, -81, -234, 184, 51, -224, -121, 63, 14, -281, -18, 251, -42, -73, -46, 410, -86, -71, 201, 205, 125, -253, 228, -6, -148, -31, 165, 107, -170, -104, 149, -198, -126, 91, 147, -270, -190, 6, 270, -115, -329, -58, -36, -230, 108, 268, -43, -177, 171, 219, 131, -219, 4, 325, -99, -94, -134, -58, 19, 43, -29, 164, -338, -244, 10, -62, -65, -31, 258, -365, -292, 253, 261, 38, -227, 249, 21, 121, -234, -179, 233, -92, -38, 142, 148, -106, -85, 271, 59, -110, 18, 123, -50, -133, -7, 91, -121, -55, 139, 138, -258, 39, 50, -24, -168, -73, 335, -70, -101, -28, 192, 153, -136, 131, 129, -234, -120, 64, 19, 4, -79, -219, 147, -190, 13, 237, -208, -205, -14, 179, -80, -208, 260, 112, -64, 141, 208, -80, 48, -67, 130, -181, -221, -8, 234, -100, -195, 180, 341, -419, -91, 191, -45]
4905d5Nr1M08k52j95K6Q1K46m02K63P0j53O7j09o7L4N9L74k05k43R8J76j21l8
4929a4O7K14m64j1L56L6l86j3N09l66k4j09L12j77k32N43j63j01l05N19k9j69
4951gj50L20N9m49K61J29l0j17m1J23j38j8K07N8l51J36K40M1n18L01J38j76k52
4974b34p7N86m13l2J22M23m40N9R6J22m64K53J64j5k59j2K41l7l97L16Q7k68M7
4997a32M06r0o2k31J87K21n17J96L6Q6l4j40K40j28k02K28l44J0J93J60K22p0
5019B35m55L50l7j09j25K36M5j61m3J87p1j8j54J88j05l22K96K74k97n4J12L17
5041B89l40K44K20j36m48L9L12j04k39o2L34k71m3J09J97l12j33M03O6l31K46
5062D0J99k51k15PN98m20N0r2M35m76J46q8K87j98p5L70k96j47j53M33k8l08K15
$$ y = [-45, -40, -131, 277, 25, -170, -144, -63, 183, -219, 44, 114, -39, 28, -81, -148, -114, -55, 319, 114, -129, -31, 145, 24, -14, 53, 267, -197, -208, 148, 184, -202, -215, 294, -72, -96, -205, 107, -70, -302, 241, 78, -23, -328, 191, 162, -7, -157, 163, 222, -227, 34, 163, 133, 16, -25, 98, -40, -58, 149, 207, -144, -8, 232, 273, -245, 56, 194, 18, -234, -311, 275, -138, -170, -48, 375, -65, -6, 90, 212, -252, 1, 165, 150, -109, -121, 120, 83, -314, 2, 89, -179, -132, 274, 184, 122, -109, 78, 299, -218, -22, 14, 100, 66, -74, 166, 38, -164, 64, -280, -270, -77, 83, 305, 235, -220, 130, 93, -16, -141, 95, 140, -21, -64, 123, 52, 34, -120, 68, -37, -359, -63, 211, -86, -140, -28, 289, -51, 193, 413, 277, -171, -132, 180, 76, -163, -225, 109, -162, -205, -96, 101, -211, -344, 59, 125, -206, 40, 239, -12, -227, -220, 378, -42, 8, -84, 351, -125, 21, -67, 220, 22, -53, 317, 21, -126, -279, 154, 126, -182, 33]
5085C3j9j95O8l9L79m12N4O5K10k31j1L69l66K7l83Q37l66l11M96k54J85k14K35
5108A57K00m03K97j79K4R7j93J99j10k74n7J89N8n3j9M82n03J78k24J94o3r8K26
5131A25n8l07NL09K3k09QM33l82k03K07K86l90KM01k75j25j2L41J56o79L72L43
$$ y = [33, 14, -181, -113, -152, 227, -185, -131, -66, 144, -87, -98, 271, -95, -68, -451, 386, 20, -291, 205, -49, 136, -78, 157, 357, -46, 251, 72, 96, 193, 0, 199, 89, -185, -242, -53, 5, -48, -67, 415, -88, 90, -134, 60, -3, -101, 125, 67, -240, -235, 74, 97, -112, -104, 329, -53, -256, -49, 237, -153, -151, 250, -25, -150, -162, 179, 335, -344, 28, 371]
$$ [...]
8191a47
##END NTUPLES=NMR FID
##END=
