##TITLE=1H_Pr SA-per
 DMSO, 8 sc, 
 8.06.2021
##JCAMPDX= 6.0         $$ Bruker NMR JCAMP-DX V2.0
##DATA TYPE= NMR FID
##DATA CLASS= NTUPLES
##ORIGIN= UXNMR, Bruker Analytische Messtechnik GmbH
##OWNER= root
$$ XWIN-NMR		Version 3.5
$$ Tue Jun  8 11:01:31 2021 Russian Standard Time (UT+4h)  she@DPX200
##.OBSERVE FREQUENCY= 200.131506
##.OBSERVE NUCLEUS= ^1H
##.DELAY= (6, 6)
##.ACQUISITION MODE= SIMULTANEOUS
##.ACQUISITION SCHEME= undefined
##.AVERAGES= 8
##.DIGITISER RES= 18
##SPECTROMETER/DATA SYSTEM= spect
##.PULSE SEQUENCE= zg30
##.SOLVENT NAME= CDCl3
##.SHIFT REFERENCE= (INTERNAL, CDCl3, 0, 15.7039)
##AUDIT TRAIL= $$ (NUMBER, WHEN, WHO, WHERE, WHAT)
$$ ##TITLE= Audit trail, XWIN-NMR		Version 3.5
$$ ##JCAMPDX= 5.01
$$ ##ORIGIN= Bruker BioSpin GmbH
$$ ##OWNER= she
$$ F:/spectra/data/she/nmr/H-F/1/audita.txt
$$ ##AUDIT TRAIL=  $$ (NUMBER, WHEN, WHO, WHERE, WHAT)
(   1,<2021-06-08 11:00:26.59 +0400>,<she>,<DPX200>,
      <created by zg, POWCHK disabled, PULCHK disabled
       configuration hash MD5:
       00 E9 B6 7A A2 85 ED C7 34 08 36 98 17 FE 4E 26
       data hash MD5: 16K
       45 6F 04 B6 C0 F9 98 FD CE B3 76 95 29 5C C8 D0>)
$$ ##END=
$$ 
$$ hash MD5
$$ B4 5F 52 2C F1 A2 38 37 0F F9 5B 64 F2 02 00 6A
##$RELAX= 
##$RELAX= 
##$RELAX= 
##$RELAX= 
##$RELAX= 
##$RELAX= 
$$ Bruker specific parameters
$$ --------------------------
##$DU= <F:/spectra>
##$EXPNO= 1
##$NAME= <H-F>
##$PROCNO= 1
##$TYPE= <nmr>
##$USER= <she>
##$AMP= (0..31)
100 100 100 100 100 100 100 100 100 100 100 100 100 100 100 100 100 100 
100 100 100 100 100 100 100 100 100 100 100 100 100 100 
##$AQSEQ= 0
##$AQ_mod= 1
##$AUNM= <au_zg>
##$AUTOPOS= <>
##$BF1= 200.13
##$BF2= 200.13
##$BF3= 200.13
##$BF4= 200.13
##$BF5= 200.13
##$BF6= 200.13
##$BF7= 200.13
##$BF8= 200.13
##$BYTORDA= 1
##$CFDGTYP= 0
##$CFRGTYP= 5
##$CHEMSTR= <none>
##$CNST= (0..31)
1 1 145 1 1 1 1 1 1 1 1 1 1 1 1 1 1 1 1 1 1 1 1 1 1 1 1 1 1 1 1 1 
##$CPDPRG= <>
##$CPDPRG1= <>
##$CPDPRG2= <>
##$CPDPRG3= <>
##$CPDPRG4= <mlev>
##$CPDPRG5= <mlev>
##$CPDPRG6= <mlev>
##$CPDPRG7= <mlev>
##$CPDPRG8= <mlev>
##$CPDPRGB= <>
##$CPDPRGT= <>
##$D= (0..31)
0 1.2 0 0 0 0 0 0 0 0.06 0 0.03 0 0 0 0 0.0002 0 0 0 0 0 0 0 0 0 0 0 0 
0 0 0 
##$DATE= 1623135626
##$DBL= (0..7)
120 120 120 120 120 120 120 120 
##$DBP= (0..7)
150 150 150 150 150 150 150 150 
##$DBP07= 0
##$DBPNAM0= <>
##$DBPNAM1= <>
##$DBPNAM2= <>
##$DBPNAM3= <>
##$DBPNAM4= <>
##$DBPNAM5= <>
##$DBPNAM6= <>
##$DBPNAM7= <>
##$DBPOAL= (0..7)
0.5 0.5 0.5 0.5 0.5 0.5 0.5 0.5 
##$DBPOFFS= (0..7)
0 0 0 0 0 0 0 0 
##$DE= 6
##$DECBNUC= <off>
##$DECIM= 32
##$DECNUC= <off>
##$DECSTAT= 4
##$DIGMOD= 1
##$DIGTYP= 9
##$DL= (0..7)
0 120 120 120 120 120 120 120 
##$DP= (0..7)
150 150 150 150 150 150 150 150 
##$DP07= 0
##$DPNAME0= <>
##$DPNAME1= <>
##$DPNAME2= <>
##$DPNAME3= <>
##$DPNAME4= <>
##$DPNAME5= <>
##$DPNAME6= <>
##$DPNAME7= <>
##$DPOAL= (0..7)
0.5 0.5 0.5 0.5 0.5 0.5 0.5 0.5 
##$DPOFFS= (0..7)
0 0 0 0 0 0 0 0 
##$DQDMODE= 0
##$DR= 18
##$DS= 0
##$DSLIST= <SSSSSSSSSSSSSSS>
$$ [...]
##$SUBNAM2= <"">
##$SUBNAM3= <"">
##$SUBNAM4= <"">
##$SUBNAM5= <"">
##$SUBNAM6= <"">
##$SUBNAM7= <"">
##$SUBNAM8= <"">
##$SUBNAM9= <"">
##$SW= 20.0188882624521
##$SWIBOX= (0..15)
0 0 2 0 0 0 0 0 0 0 0 0 0 0 0 0 
##$SW_h= 4006.41025641026
##$TD= 16384
##$TD0= 1
##$TE= 0
##$TE2= 300
##$TE3= 300
##$TEG= 300
##$TL= (0..7)
0 120 120 120 120 120 120 120 
##$TP= (0..7)
150 150 150 150 150 150 150 150 
##$TP07= 0
##$TPNAME0= <>
##$TPNAME1= <>
##$TPNAME2= <>
##$TPNAME3= <>
##$TPNAME4= <>
##$TPNAME5= <>
##$TPNAME6= <>
##$TPNAME7= <>
##$TPOAL= (0..7)
0.5 0.5 0.5 0.5 0.5 0.5 0.5 0.5 
##$TPOFFS= (0..7)
0 0 0 0 0 0 0 0 
##$TUNHIN= 0
##$TUNHOUT= 0
##$TUNXOUT= 0
##$USERA1= <user>
##$USERA2= <user>
##$USERA3= <user>
##$USERA4= <user>
##$USERA5= <user>
##$V9= 5
##$VALIST= <valist>
##$VCLIST= <CCCCCCCCCCCCCCC>
##$VD= 0
##$VDLIST= <DDDDDDDDDDDDDDD>
##$VPLIST= <PPPPPPPPPPPPPPP>
##$VTLIST= <TTTTTTTTTTTTTTT>
##$WBST= 1024
##$WBSW= 4
##$XGAIN= (0..3)
0 0 0 0 
##$XL= 0
##$YL= 0
##$YMAX_a= 326650
##$YMIN_a= -304002
##$ZGOPTNS= <>
##$ZL1= 120
##$ZL2= 120
##$ZL3= 120
##$ZL4= 120
##$ABSF1= 10
##$ABSF2= 0
##$ABSG= 5
##$ABSL= 3
##$ALPHA= 0
##$AQORDER= 0
##$ASSFAC= 0
##$ASSFACI= 0
##$ASSFACX= 0
##$ASSWID= 0
##$AUNMP= <proc_1d>
##$AZFE= 0.1
##$AZFW= 0.1
##$BCFW= 1
##$BC_mod= 2
##$BYTORDP= 1
##$COROFFS= 0
##$CY= 11.3945322036743
##$DATMOD= 1
##$DC= 2
##$DFILT= <>
##$DTYPP= 0
##$F1P= 15.9154993809931
##$F2P= -4.1035820241983
##$FCOR= 0.5
##$FTSIZE= 0
##$FT_mod= 4
##$GAMMA= 1
##$GB= 0.15
##$INTBC= 1
##$INTSCL= 1
##$ISEN= 128
##$LB= 0.24
##$LEV0= 0
##$LPBIN= 0
##$MAXI= 10000
##$MC2= 0
##$MEAN= 0
##$ME_mod= 0
##$MI= 1.114404
##$NCOEF= 0
##$NC_proc= 0
##$NLEV= 6
##$NOISF1= 3.799351
##$NOISF2= 2.8
##$NSP= 1
##$NTH_PI= 0
##$NZP= 0
##$OFFSET= 15.70392
##$PC= 1
##$PHC0= -11491.82
##$PHC1= 17.40101
##$PH_mod= 1
##$PKNL= yes
##$PPARMOD= 0
##$PSCAL= 0
##$PSIGN= 0
##$REVERSE= no
##$SF= 200.130013532006
##$SI= 16384
##$SIGF1= 3
##$SIGF2= 2
##$SINO= 400
##$SIOLD= 16384
##$SREGLST= <1H.CDCl3>
##$SSB= 0
##$STSI= 0
##$STSR= 0
##$SW_p= 3612.71676300578
##$SYMM= 0
##$S_DEV= 0
##$TDeff= 0
##$TDoff= 0
##$TI= <>
##$TILT= no
##$TM1= 0
##$TM2= 0
##$TOPLEV= 0
##$USERP1= <user>
##$USERP2= <user>
##$USERP3= <user>
##$USERP4= <user>
##$USERP5= <user>
##$WDW= 1
##$XDIM= 8192
##$YMAX_p= 0
##$YMIN_p= 0
$$ End of Bruker specific parameters
$$ ---------------------------------
##NTUPLES= NMR FID
##VAR_NAME=  TIME,          FID/REAL,        FID/IMAG
##SYMBOL=    X,             R,               I
##VAR_TYPE=  INDEPENDENT,   DEPENDENT,       DEPENDENT
##VAR_FORM=  AFFN,          ASDF,            ASDF
##VAR_DIM=   8192,          8192,            8192
##UNITS=     SECONDS,       ARBITRARY UNITS, ARBITRARY UNITS
##FACTOR=    0.0002496,     1,               1
##FIRST=     0,             0,               0
##LAST=      2.0444736,     0,               0
##MIN=       0,             -304002,         0
##MAX=       2.0444736,     326650,          0
$$ Real data points
##PAGE= N=1
##DATA TABLE= (X++(R..R)), XYDATA
0@%%%%%%%%%%qJ6j6J6k4L2l2M0n0N8p2Q8j04J20j44J70j94K24k60L00l44L93m45
$$ 0 0 0 0 0 0 0 0 0 0 0 -8 8 -8 8 -16 16 -16 24 -26 32 -40 48 -56 64 -80 90 -104 120 -140 160 -184 209 -236
33b36N04n68O40p21Q08r04J008j122J248j385J533j697J875k068K281k515K770
$$ -236 268 -300 340 -381 427 -477 531 -591 657 -728 805 -892 983 -1085 1196 -1319 1451
50A451l049L361l707M088m515M998n545O173o903P762q789J0046j1624J3671j6448
$$ 1451 -1598 1763 -1944 2144 -2371 2627 -2918 3255 -3648 4114 -4675 5371 -6253 7418 -9030
65i030K0443k6710L7992o4390K34163R0520n86990J56264M74388j40642m25801
$$ -9030 11413 -15297 22695 -41695 192468 282988 -304002 -147738 326650 186008 -239793
76b39793J76232K87812j53503k14466J32653J03139r6175o5016N5533O732j5504
$$ -239793 -63561 224251 70748 -143718 -11065 92074 -4101 -69117 -13584 -6852 -22356
87b2356j065j5811j0240M1334M34l3650J0107K7674l944J6260m614l4852M4923
$$ -22356 -23421 -39232 -49472 -8138 -7704 -41354 -31247 -3573 -7517 8743 4129 -30723 14200
100A4200O8049p9970o2381J23148N2829j49313k4392J53982r631j47717K8387
$$ 14200 82249 2279 -60102 63046 115875 -33438 -57830 96152 86521 -61196 -32809
111c2809J11948n2407q5795M4933L9468m1105j4597R246j2004K4736J4338o5784
$$ -32809 79139 26732 -59063 -14130 25338 -15767 -30364 -21118 -33122 -8386 5952 -59832
123e9832L983J06180l5856j21842R4320J27684j40106r3227J93371N5325k13384
$$ -59832 -55849 50331 14475 -107367 -13047 114637 -25469 -118696 74675 130000 -83384
134h3384M561K22554n5405k04551R8969J70501j32325j31544J40798P7376j45912
$$ -83384 -78823 143731 88326 -116225 -17256 153245 20920 -110624 30174 107550 -38362
145c8362l7676J21948r537j00581L2381O2835n2076l4413N5878J2523n3588K83
$$ -38362 -76038 45910 36373 -64208 -31827 31008 -21068 -55481 397 12920 -40668 -40385
157d0385N7411N644n9323n810Q2603J7633j00527j0885J32572N613j53210J2895
$$ -40385 17026 22670 -36653 -42463 40140 57773 -42754 -53639 78933 84546 -68664 -55769
169e5769J71886l4382j81157N5297J74867q2488j65620R6305J33482j12749j03055
$$ -55769 116117 81735 -99422 -44125 130742 48254 -117366 -21061 112421 -328 -103383
180a03383J05486N8803r2613k5004O1081k119k4223J5465j0008j0970M2563M765
$$ -103383 2103 60906 -31707 -56711 4370 2251 -21972 -6507 -16515 -27485 15078 19843
192A9843n4881J5010O4387k3450n6129L8206M8221m0676l0708M0706J1728l3606
$$ 19843 -35038 -20028 44359 20909 -35220 2986 51207 10531 -20177 20529 32257 -1349
204a349L998J6947k1418j541K3651k3313k5778L5304J2096m7170l001M3963p212
$$ -1349 2649 19596 -1822 -3363 20288 -3025 -28803 6501 18597 -28573 -31574 12389 5177
217E177l9298J1866L2294p911k4841O070K6544L866k5333l610L4906P400l8528
$$ 5177 -34121 -22255 10039 2128 -22713 -16643 9901 13767 -11566 -15176 19730 27130 -11398
230a1398j781M8745l928n5927J5706O0752l4215o3264N1173N3004p4848l9594
$$ -11398 -13179 35566 31638 -24289 -8583 52169 17954 -45310 5863 58867 -15981 -55575
242e5575Q6704J1273r6447J3256R0980m1655p9560O1792O1368p4949l9067Q4044
$$ -55575 31129 42402 -54045 -40789 50191 8536 -71024 -9232 52136 -22813 -61880 22164
254B2164K0995q3408J139Q4279j3781p5688L0155O9230l6360n7861M1342M9653
$$ 22164 43159 -40249 -39110 45169 31388 -44300 -14145 55085 18725 -39136 2206 51859
266E1859m1718m4205L8531M0589m0531m2686L9195L9699m6524l9301M8707L0443
$$ 51859 10141 -34064 4467 45056 4525 -38161 1034 40733 -5791 -45092 3615 34058
278C4058n4313k1924N3891J0142n1112J798M5341q567l4907J7498K6791j8291
$$ 34058 -20255 -42179 11712 21854 -29258 -27460 17881 9314 -25593 -8095 18696 405
290D05j2977K1436M360j6583O752J0863j0662k206J0680o381p446J1155k958j4389
$$ 405 -12572 8864 13224 -3359 3393 14256 3594 1388 12068 5687 -1759 9396 6438 -7951
304g951J0384P850k0682j993K3661j0413k6872K0164K4860l1321j9871M0974J2811
$$ -7951 2433 10283 -10399 -12392 11269 856 -26016 -5852 19008 -12313 -32184 8790 21601
317B1601m6757j045N3091q931n1337K2492N0624l0151m3776L9283L8095m3694
$$ 21601 -25156 -26201 26890 17959 -33378 -10886 39738 9587 -34189 5094 43189 -505
329e05l1459M7171K5234n1412k0184N3335J2643n9502o713O0638l777o4535J2390
$$ -505 -31964 15207 40441 -10971 -31155 22180 34823 -24679 -31392 29246 25469 -39066 -26676
342b6676O3483k4915o2160L6524N7656m7577m9919N9031M1937o6866k7667P4600
$$ -26676 36807 11892 -50268 -13744 43912 -3665 -53584 5447 47384 -19482 -47149 27451
354B7451J4682p4680K030P3447j4643o6517K6832N8045l5116m7932L8846L6461
$$ 27451 42133 -32547 -30517 42930 28287 -38230 -11398 46647 11531 -36401 2445 38906
366C8906m1048k8237L8523J8267l7674j2766L1996P273k8775n782K4003M772k0588
$$ 38906 -2142 -30379 8144 26411 -11263 -24029 7967 15240 -13535 -19317 4686 9458 -11130
379a1130m270J9041N473j6697m676J7697N718j6047l896J7560M454j6471k841
$$ -11130 -15400 3641 9114 -7583 -12259 5438 11156 -4891 -8787 8773 13227 -3244 -6085
392f085J6168K808j6356k723J6188J234j8273p46J8697k889k1918M737K2562j0290
$$ -6085 10083 12891 -3465 -6188 10000 11234 -7039 -7785 10912 8023 -13895 -9158 13404 3114
406C114k4360J5112K4451k2700k2493L0649J8860l7056j2476M4814N722m8089
$$ 3114 -21246 -6134 18317 -4383 -26876 3773 22633 -14423 -26899 17915 23637 -24452
418b4452M656N1972j4247n0979K5790M8637l5521m3180M4918L4966n2389k6061
$$ -24452 -19796 32176 17929 -33050 -7260 41377 5856 -37324 7594 42560 -9829 -35890
430c5890N5906J4563n8654m976N7724o792n6336J5083N2488k4453m7701L1462
$$ -35890 20016 34579 -24075 -29051 28673 21881 -34455 -19372 33116 8663 -39038 -7576
442g576M2041l7958l4774M3473K7135m5187j7960M6898J1917m5821l750M4669
$$ -7576 34465 -3493 -38267 5206 32341 -12846 -30806 16092 28009 -17812 -21562 23107
454B3107k290m0821Q401L7118j4440l1795J8391K4967k2103j8266K1441J1521
$$ 23107 20817 -20004 -11603 25515 11075 -20720 -2329 22638 535 -17731 3710 15231
466A5231k1776o885J9069K395j7482l29J5377j828j2993J800J2093o46j0111o85
$$ 15231 -6545 -13430 5639 8034 -9448 -9777 5600 3772 -9221 -7421 4672 4026 -6085 -6770
480f770J0370M679j0610o906J3480J0440j7243j1165K2086J0630k5580r579K8403
$$ -6770 3600 8279 -2331 -9237 4243 14683 -2560 -13725 8361 18991 -6589 -16168 12235
493A2235O793l0621n093L1644R02l3480L109L2567r462l1255J5584K6851k1210
$$ 12235 19028 -11593 -16686 14958 15860 -17620 -14511 18056 8594 -22661 -7077 19774 -1436
506a436k1241K5849J4763k9014p090L2096P67l3377P239L5969j4833l5779K3534
$$ -1436 -22677 3172 17935 -11079 -18169 13927 14694 -18683 -11444 24525 9692 -26087 -2553
519b553L4414l1514l0288L8742K3942m4187j7286M6945R371m8431k811M7274m489
$$ -2553 31861 347 -29941 8801 32743 -11444 -28730 18215 27586 -20845 -23656 23618 19129
532A9129m6525J1150M3402j9028l9046K5879L2679l1204k4232L4179J6842l4349
$$ 19129 -27396 -16246 27156 8128 -30918 -5039 27640 -3564 -27796 6383 23225 -11124
544a1124q850L2826M213l0335J60K8633k346k7442O399K4631r139k1084J0345
$$ -11124 -19974 12852 17065 -13270 -13110 15523 13177 -14265 -7866 16765 7626 -13458 -3113
557c113J6755j1249j1786Q807Q203p009p503N178O055m825n517M732M534n075
$$ -3113 13642 2393 -9393 -586 7617 608 -6895 -1717 4338 -487 -6004 -1272 3262 -1813
571a813k738N086J621m066j191M305K911n084m554R096N779j3001n564J8059L614
$$ -1813 -4551 535 2156 -1910 -3101 1204 4115 -969 -5523 3573 9352 -3649 -9213 8846 12460
586A2460k1727j400K4818j603k7693L486K9778o702l2591J0428L3617j5992l3631
$$ 12460 -9267 -10667 14151 12548 -15145 -11659 18119 11417 -21174 -10746 22871 6879 -26752
599b6752K2111K9655k6510k4837L0759J7606l1689j0530L2309M344l1078K062
$$ -26752 -4641 25014 -1496 -26333 4426 22032 -9657 -20187 12122 16466 -14612 -12550
611a2550L0668q566k9072J6502K5756k3343k1061K9112J5023l2932q785L4391
$$ -12550 18118 9552 -19520 -3018 22738 -605 -21666 7446 22469 -10463 -19248 15143
623A5143K806l5258J476L5316o474l5552J1641L3908j6972l1190K1629K6441k5442
$$ 15143 17949 -17309 -15833 19483 13009 -22543 -10902 23006 6034 -25156 -3527 22914 -2528
636b528k0174K7640J3878k6858q137K5668M151k3924jK2109k955k0070O551J6928
$$ -2528 -22702 4938 18816 -8042 -16179 9489 13640 -10284 -10285 11824 8869 -11201 -4650 12278
650A2278q705j3692R901R351r228o211N904M823l421n122J167O455o04p853N61
$$ 12278 3573 -10119 -218 9133 -95 -6306 -402 4421 1000 -4122 -2955 3500 2896 -4957 -4396
665d396Q723j335q516Q15R680o49j0926J747J2844m000j3357Q013J3251j2914
$$ -4396 4327 2992 -5524 -4709 4971 4322 -6604 -4857 7987 3987 -9370 -1357 11894 -1020
679a020j0205J6496O893j8480m039K0056O77k1309J779K3325o203k5426J0633
$$ -1020 -11225 5271 12164 -6316 -10355 9701 10378 -10931 -9152 14173 7970 -17456 -6823
692f823K7177j6977k7087K3503K3601k8437j8791L1489J3760l3292q006L3959
$$ -6823 20354 3377 -23710 -207 23394 -5043 -23834 7655 21415 -11877 -19883 14076
704A4076L346l4465K541L4231q009l3271J5280K9765k1848k3801K7230J5765k9636
$$ 14076 17422 -17043 -14502 19729 11720 -21551 -6271 23494 1646 -22155 5075 20840 -8796
717h796q303K9533K023k8092K204K6223o240k5294J0250K3521j4685k0538J8798
$$ -8796 -17099 12434 14457 -13635 -11431 14792 8552 -16742 -6492 17029 2344 -18194 604
730F04J5915k0659j1111K0764O555j8580l177J6111K044j4730n30J3942j001j3021
$$ 604 16519 -4140 -15251 5513 12068 -6512 -9689 6422 8466 -6264 -6794 7148 6147 -6874
744f874K850J1525m164q801M258N978l571l904J497K898O50l822k553N632L064
$$ -6874 -4024 7501 3337 -5464 -1206 4772 1201 -2703 -1206 1692 2342 -1480 -4033 1599 4663
759D663q237k368R694J749j0594j611J2328J208j4578R45J6867l875j8514Q941
$$ 4663 -3574 -5942 3752 5501 -5093 -6704 5624 6832 -7746 -6801 10066 6191 -12323 -3382
773c382J8563j3744j6709J8259J3177k1483q999K3094M755k4490o27K5356l917
$$ -3382 15181 1437 -15272 2987 16164 -5319 -14318 8776 13531 -10959 -11586 13770 9853
786I853k6333Q861K6207j5142k3340J9983J9199k4070j4270K6576Q935k7117m578
$$ 9853 -16480 -7619 18588 3446 -19894 89 19288 -4782 -19052 7524 16459 -10658 -15236
799a5236K7982J54k7875M675K7360r530k5540J4578K2501j8975j8064K2178J2608
$$ -15236 12746 12900 -14975 -10300 17060 7530 -18010 -3432 19069 94 -17970 4208 16816
812A6816k3585p536K3273K904k2353N51K1291l967k0080P641J7794j0768j4328
$$ 16816 -6769 -14305 8968 11872 -10481 -9930 11361 7394 -12686 -5045 12749 1981 -12347
825a2347J3021R930j4056n556J3005K339j0842j08Q527l41o975R26N430o72m584
$$ -12347 674 10604 -3452 -9008 3997 6336 -4506 -4614 3913 3572 -3403 -2477 2953 2281 -2303
840b303J390L231j419j330k18K67K303n45m797J726O450m305o472O592O135q963
$$ -2303 -913 2318 899 -431 -649 -382 1921 1376 -3421 -1695 4755 450 -6022 570 6705 -2258
856b258n022J0424L532j1419k365J3247P91j4958J389J6681m887j7356R417J6851
$$ -2258 -7280 3144 6676 -4743 -7108 6139 6930 -8028 -6639 10042 5155 -12201 -2784 14067
870A4067j3982j4080J7539J0516j9621p337K0762M359k2469n77K3421l612k4016
$$ 14067 85 -13995 3544 14060 -5561 -12898 7864 12223 -10246 -10823 12598 8986 -15030
883a5030Q705K2824j3802k0446J8384J6236k1656j1385K3406O726k3981j807K3350
$$ -15030 -6325 16499 2697 -17749 635 16871 -4785 -16170 7236 13962 -10019 -11826 11524
896A1524j950k2612O018K1537j0094j9275J3969J5669j6623j1597J8167P229j8616
$$ 11524 9574 -13038 -7020 14517 4423 -14852 -883 14786 -1837 -13434 4733 11962 -6654
909f654l067J7712l42j5771K096J4358l793j3253N961J1373p881r003R050O111
$$ -6654 -9721 7991 7649 -8122 -6026 8332 4539 -8714 -2753 8620 739 -8264 786 6897
923F897r175l459Q360J281o524k54N090k78l257j27K425M14j341j395P54K076
$$ 6897 -2278 -5737 2623 3904 -2620 -2874 2216 1938 -1319 -1446 979 1393 52 -1343 -589 1487
939A487K62l640m29N405o03o769J665Q574m719q492O860Q545r994o629J1732N365
$$ 1487 1749 -1891 -2320 3085 2482 -4287 -2622 5952 1233 -7259 -399 8146 -1848 -8477 3255 8620
955H620j3902k816J4774P66j6484K804J6919o324j6596J0112J5311j3847j2532
$$ 8620 -5282 -8098 6676 7442 -9042 -6238 10681 4357 -12239 -2127 13184 -663 -13195
968a3195J6161R772j8415n960J9833K146k0190J022K0504m786k0275Q963J8336
$$ -13195 2966 12738 -5677 -11637 8196 10342 -9848 -8826 11678 6892 -13383 -4420 13916
981A3916j2384j5772J5626J2140j7685q860J9492M515j9677o77J9274k577j8428
$$ 13916 1532 -14240 1386 13526 -4159 -13019 6473 10988 -8689 -9366 9908 7331 -11097
994a1097O323J6637r435j4366J2194J1226j3665q032J4433M926j4438k094J3478
$$ -11097 -4774 11863 2428 -11938 256 11482 -2183 -10215 4218 9144 -5294 -7388 6090
1007F090n05j2080K397J0569l952q635M792O504n169m478M814K745m134j278K944
$$ 6090 5585 -6495 -4098 6471 2519 -6116 -1324 5180 11 -4467 347 3092 -1042 -2320 624
1022F24O14j718j31J37Q90M91j091j379K035J820l317j544M287J364n922j3P064
$$ 624 1238 -480 -611 -474 416 907 -184 -1563 472 2292 -1025 -2569 1718 3082 -2840 -2853 4211
1039D211j558p918K999Q689n170q825P615Q056j0055o504J1906M833j3917k314
$$ 4211 2653 -5265 -2266 6423 1253 -7572 43 8099 -1956 -8460 3446 8279 -5638 -7952
1053g952J5314k75j6053L292J6038o537j5228R871J3628j2799j1318J5176Q493
$$ -7952 7362 7087 -8966 -5674 10364 3827 -11401 -1530 12098 -701 -12019 3157 11650
1066A1650j7252m836J7921J403j8329K436J7655n739j6601R066J4604j1881j1989
$$ 11650 -5602 -10438 7483 8886 -9443 -7007 10648 4909 -11692 -2626 11978 97 -11892
1079a1892J3867Q838j5003n527J5667K052j5221O78J4776l383j3603N764J1980
$$ -11892 1975 10813 -4190 -9717 5950 8002 -7219 -6541 8235 4852 -8751 -2987 8993
1092H993q061r161R089O911r966m703J0593K150j0175m13R635j432q207K684O433
$$ 8993 932 -8229 860 7771 -2195 -6898 3695 5845 -4330 -4743 4892 3460 -4747 -2063 4370
1107D370l167n280L716L179l174j756K129J372j272q31m1M51J637o83k724J589
$$ 4370 1203 -4077 -361 2818 -356 -2112 17 1389 117 -714 -755 -304 1333 650 -2074 -485
1123d85L406k674m203M122M524o186l272P506K074q834l84R650j417r802L217
$$ -485 2921 247 -3956 166 4690 -1496 -4768 2738 4812 -4022 -4406 5244 3827 -5975 -2758
1138b758R592n650q659P911P650j0065o437J1848M219j3241j197J3998j641j4019
$$ -2758 6834 1184 -7475 436 8086 -1979 -8416 3432 7651 -5590 -6787 7211 5570 -8449
1152h449M336J3856p525j2235R521J0895j1784r079J4178O221j5570l082J6252
$$ -8449 -4113 9743 2218 -10017 -496 10399 -1385 -10464 3714 9935 -5635 -8717 7535
1165G535l3j6235L204J5074o427j2927Q739J0741j0378q657J1571O431j2736l365
$$ 7535 7502 -8733 -5529 9545 3118 -9809 -1070 9671 -707 -9364 2207 8638 -4098 -7463
1179g463J2719Q60j2674K165J1352m653q874N678P101o655n044O659L231o140
$$ -7463 5256 6116 -6558 -4393 6959 2306 -6568 -890 6211 -444 -5488 1171 4402 -1738
1193a738k372O267J393o280P15M899j410m210K277K716k375j396J930K90r22K85
$$ -1738 -4110 2157 3550 -2730 -2015 2884 1474 -2736 -459 2257 -118 -1514 416 706 -216 69
1209F9n85J76J425p48j649P54K352j438l048K105M267l548m521M954M767p503
$$ 69 -516 -340 1085 337 -1312 -558 1794 356 -2692 -587 3680 132 -4389 565 5332 -2171
1225b171l022Q590J450r652R85R667k902r605M520R376o184q533P882P362j0353
$$ -2171 -5193 3397 4847 -4805 -3820 5847 2945 -6660 -2140 7236 1052 -7481 401 7763 -2590
1240b590n347J2307K983j3394J64J3125l266j2101N555J1082p454r570R386P562
$$ -2590 -7937 4370 7353 -6041 -5877 7248 3982 -8119 -2564 8518 1064 -8506 880 8442
1254H442j0839n996J2148L957j3125j092J3243j781j2573M172J1327o330r288
$$ 8442 -2397 -8393 3755 7712 -5413 -6505 6738 4957 -7616 -3444 7883 1553 -7735
1267g735P668P430q305o114R218M418r796k533R982J94r724K346Q454m362o121
$$ -7735 -67 7363 -942 -7056 2162 6580 -3216 -5749 4233 4427 -5297 -2951 5503 1141 -4980
1282d980N046M502n107l023M724J882m351j160M186K40l774P88K945j599j519
$$ -4980 66 4568 -539 -3562 1162 3044 -1307 -2467 1719 1959 -1815 -1027 1918 319 -1200
1297a200J682k08r11J168j87j849K054J033l150N2L258l63l863J163M435k160
$$ -1200 482 274 -637 531 344 -1505 549 1582 -1568 -1516 1742 1379 -2484 -1321 3114 954
1313I54m642L099N007m553m692O384L880q489j871R312j60r133J855Q832l978
$$ 954 -3688 -589 4418 -135 -4827 1557 5437 -3052 -4923 4389 4229 -4904 -3049 5783 1805
1328A805q049M869Q147o485p503Q274O520j0338m287J1875J362j2238J137J2025
$$ 1805 -6244 -1375 6772 287 -7216 1058 7578 -2760 -7047 4828 6190 -6048 -4911 7114
1342G114l968j0576N623R244p045q108Q585O656r984m863J1359K161j1570L44
$$ 7114 3146 -7430 -1807 7437 392 -7716 869 7525 -2459 -7322 4037 6198 -5372 -5028
1356e028J1526l260j0028N127P957o239n750O355M584o906l296P193K238p507
$$ -5028 6498 3238 -6790 -1663 6294 55 -5695 660 5244 -1662 -4958 2235 4473 -3034
1370c034n46P249j071o479K536N306l613l555M066J462l002j138K444Q27k099
$$ -3034 -3580 3669 2598 -3881 -1345 3961 348 -3207 859 2321 -681 -1819 625 1452 -647
1385f47l20J532r1j174O36O66q99L01N05j398N28J831j616k232L432J361m251
$$ -647 -967 565 474 -700 -64 602 -297 4 509 -889 -361 1470 -146 -2378 1054 2415 -1836
1402a836m77M915n04n429J826N219k666n464M060N545o042m715P597L185q691
$$ -1836 -2313 2602 2098 -3331 -1505 3714 1048 -4416 -356 5189 -853 -5568 2029 5214 -3477
1417c477j067R115p07r056K535Q758m762p694N892O923p331n998R005M418r929
$$ -3477 -4544 4571 3864 -5192 -2657 6101 1339 -6355 -463 6460 -871 -6869 2136 6554 -3375
1432c375k479J0818l62j0521K518J0069m756q586N785P670p250n966Q022M717
$$ -3375 -5854 4964 4602 -5919 -3401 6668 1912 -6674 -889 6781 -469 -6435 1587 6304
1446F304r108k607R395O90r580J501R029l506p476M831N868n612m413N752L411
$$ 6304 -2804 -5411 3984 4674 -4906 -3405 5624 2118 -5358 -527 5341 -271 -4684 1068 4479
1461D479o352j634N702O31n627P88N114j854m138K833K330l139q51K693j53j788
$$ 4479 -1873 -3507 2195 2826 -2801 -2013 3101 1247 -2891 -58 2272 -867 -1718 975 822 -966
1477i66P56Q92m96m11K98o3n95P03Q74j726j62K383p35k979K024L144l474k386
$$ -966 -210 682 186 -225 73 10 -585 118 992 -734 -896 1487 752 -2227 -203 2941 -533 -2919
1495b919M598R22n063J59N255j142n522K338N301l027n505M785M926o241m085
$$ -2919 1679 2601 -2462 -2303 2952 1810 -3712 -1374 3927 900 -4605 180 5106 -1135 -5220
1510e220P733K359q627m39Q972j683q563L375P794m740o925O156O049p352m979
$$ -5220 2513 4872 -3755 -4194 4778 3095 -5468 -2093 5701 961 -5964 192 6241 -1111 -6090
1525f090Q763K803r347r74R966j487r401L622Q134m835p277O404N159o699l921
$$ -6090 2673 5476 -3871 -4845 5121 3634 -5767 -2145 5989 1154 -6123 281 5440 -1259 -5180
1540e180P336K486p713q92P558o20p351K543O394l764m832M370L557m686k377
$$ -5180 2156 4642 -3071 -3963 3595 2975 -4376 -1833 4561 797 -4035 335 3892 -794 -3171
1555c171M844J180m704k5L908m40l580R98K741j557j764J861R05j690l2J552j141
$$ -3171 1673 2853 -1851 -1876 2032 1592 -1988 -990 1751 194 -1570 291 1196 -494 -526 1026 -115
1572a15n33J060m30q68J106O73j731j87K107K5l052P86L476j891l105K876L183
$$ -115 -648 412 -18 -886 220 893 -838 -1025 1082 1107 -1945 -1159 2317 426 -2679 197 3380
1589C380m485k112N590M25n527M10N679j566n762K948N651m549m997N833M137
$$ 3380 -1105 -3217 2373 2798 -2729 -2319 3360 1794 -3968 -1020 4631 82 -4915 918 5055
1604E055o944k582P662Q37q194R31Q127k487p437L862O462n336n573O337M628
$$ 5055 -1889 -4471 3191 4028 -4166 -3235 4892 2405 -5032 -1170 5292 -44 -5617 720 5348
1619E348p194l188P919J365q331N53P917j926p417L541O496m709n315N756L554
$$ 5348 -1846 -5034 2885 4250 -4081 -3528 4389 2463 -4954 -1413 5083 374 -4941 815 4369
1634D369n808k852O621R01o088pO147j282n376K657L977l252l160L691J808l301
$$ 4369 -1439 -4291 2330 3231 -2857 -2864 3283 2001 -3375 -718 3259 7 -3153 538 2346 -955
1650i55j057L654k55k855Q89K002j353j462J671O40j226j89J335q23r72J533n6
$$ -955 -2012 1642 1387 -1468 -579 1423 70 -1392 279 919 -307 -496 839 16 -956 577 521
1667E21j419O54J468j508j083K107O50k877J74L392j301l294J995L532l145l008
$$ 521 -898 -244 1224 -284 -1367 740 1390 -1487 -1313 2079 778 -2516 -521 3011 -134 -3142
1683c142L980K250m819j284N355M42n728O59O056k187n829L502N239m600m830
$$ -3142 838 3088 -1731 -3015 2340 2782 -2946 -2287 3769 1582 -4247 -745 4494 -106 -4936
1698d936O076L415o781j747P158L51p647J454P058k352o909L980N953n135m885
$$ -4936 1140 4555 -2226 -3973 3185 3536 -4111 -2657 4401 2049 -4860 -880 5073 -62 -4947
1713d947O320L104o878j629P152J24o923J217O378k312n697L400M826m432l736
$$ -4947 1373 4477 -2401 -4030 3122 3246 -3677 -2460 3918 1606 -4091 -691 4135 -297 -4033
1728d033N117K391n272j195N265o6m588R41M222k286k869K170K290k412j924K942
$$ -4033 1084 3475 -1797 -2992 2273 2207 -2381 -1440 2782 496 -2373 -203 2087 -325 -2249 693
1744F93Q84k917L09K535j059j649J327R38j490M3J350p75j084J229M68j337k17
$$ 693 1577 -1340 -1031 1504 445 -1204 123 1061 -429 -386 964 189 -895 334 802 -535 -752
1761g52J833r32j775J616J491k059j307L284K56l679Q42L549j691l604K903L279
$$ -752 1081 149 -1626 -10 1481 -578 -1885 1399 1655 -2024 -1182 2367 676 -2928 -25 3254
1777C254m072k412M464J661n043o61N696l76n819J231O077k902n530M455M639
$$ 3254 -818 -3230 1234 2895 -2148 -2809 2887 2511 -3308 -2077 4000 1098 -4432 23 4662
1792D662n605l368N787K379o153j360P135p12o470J595O631l233n865M480M542
$$ 4662 -943 -4311 1476 3855 -2298 -3658 3477 2765 -3705 -2110 4521 1288 -4577 -97 4445
1807D445n304l414N926K067n836q68N796o02n333J387M985k091m460L052L501
$$ 4445 -859 -4273 1653 3720 -2116 -2984 2812 2210 -3123 -1736 3249 1158 -3302 -250 3251
1822C251l836k577M313J288m297O2L848p42l408J460K281j684j794K054J126k046
$$ 3251 -585 -3162 1151 2439 -1858 -1796 2052 1310 -2098 -638 1643 -41 -1835 219 1345 -701
1838g01n4J636m14j723J165P33q51p39J811n38j538J723M70j511k30J744n95j979
$$ -701 -755 881 467 -1256 -91 642 -209 -948 863 325 -1213 510 980 -531 -761 983 388 -1591
1856a591J280J916j799j776K421J544l267l28L223O7l983J305L720k360l630L728
$$ -1591 -311 1605 -194 -1970 451 1995 -1272 -1600 1623 1690 -2293 -988 2732 372 -3258 470
1872D70K571l928k307M948J090n113k05N504j120n497K134N372l376m845M830
$$ 470 3041 -887 -3194 1754 2844 -2269 -2474 3030 1910 -3587 -1453 3919 543 -4302 528
1887E28L604n386k656O301J082o196k4N991q50n904K058N334l296m458L971L569
$$ 528 4132 -1254 -3910 2391 3473 -2723 -2747 3244 2394 -3510 -1452 3882 586 -3872 99 3668
1903C668m599k365N247J077n295K85M440q98m056J524L347k223k658K851J952
$$ 3668 -931 -3296 1951 3028 -2267 -1982 2458 1560 -2496 -972 2375 152 -2506 345 2297
1918B297l009j215K957J62k499M67K364j001j833J663R85k007k96J507O4j142
$$ 2297 -712 -1927 1030 1192 -1307 -840 1524 523 -1310 353 1338 -669 -965 542 606 -536
1934e36K43J226j119p55J836k04j570P23J402j446r98K204l3k404P37K144j265
$$ -536 -293 933 -186 -941 895 691 -879 -156 1246 -200 -1198 1006 973 -1431 -694 1450 185
1951A85j972K034J348j927j336K524J150l450j80L906j312l671J900L816l165
$$ 185 -1787 247 1595 -332 -1668 856 2006 -1444 -1624 2282 970 -2701 -801 3015 -150
1966a50k790L808K226m758j219N076J64m894L74N523j813m963K369M968l621m212
$$ -150 -2940 868 3094 -1664 -2883 2193 2357 -2537 -2163 3360 1547 -3416 -1047 3921 300 -3912
1982c912M721K838n067j719N022J064n338L28M889j012n011K247M215k832l641
$$ -3912 809 3647 -1420 -3139 1883 2947 -2391 -2063 2826 1814 -3197 -950 3265 433 -3208
1997c208L738K289m159j221M274J42l761O26L290j361k605J698K129j906j600
$$ -3208 530 2819 -1340 -2561 1713 1855 -1906 -1280 2010 649 -1956 -258 1871 -35 -1635
2012a635J971J231k464j53K218n89j844J327J256j707m48J822o69j212O67P47
$$ -1635 336 1567 -897 -1050 1168 579 -1265 62 1318 -389 -837 985 316 -896 -229 518
2028E18q93m60J091M35j350Q0J590p96j643J779Q38j854o99K454k69k416J170
$$ 518 -375 -835 256 691 -659 -579 1011 215 -1428 351 1189 -665 -1364 1090 821 -1595 -425
2045d25K093j541j882K176J550k659j557L554O06l939M15L908j451l760K462L620
$$ -425 1668 127 -1755 421 1971 -688 -2245 1309 1915 -2024 -1609 2299 848 -2912 -450 3170
2061C170l714k414M206J569m711k92M242L4m679R81M365j494m394K848L646l900
$$ 3170 -544 -2958 1248 2817 -1894 -2186 2056 2090 -2589 -1608 2757 1263 -3131 -283 3363 -537
2077e37k792M316J932m636o27M263K63m226O05L988j479l897K148L591k822k729
$$ -537 -3329 987 2919 -1717 -2344 1919 2182 -2044 -1439 2549 1070 -2827 -679 2912 90 -2639
2093b639L136J861l524o90L155k07k617Q01K012q73j500J265J016j483n41J429
$$ -2639 497 2358 -1166 -1856 1299 1092 -1525 -724 1288 415 -1085 180 1196 -287 -828 601
2109F01Q4j923Q36J473j403p31J835L9j781O60J416j342p05J557J49j470P8J643
$$ 601 685 -1238 -402 1071 -332 -1063 772 811 -970 -310 1106 -236 -941 616 765 -705 -627 1016
2127A016k75j951P86J676j348j369J820J207k487r8K612j116k198J390K312k046
$$ 1016 741 -1210 -424 1252 -96 -1465 355 1562 -925 -1023 1589 473 -1725 -335 1977 -69
2143f9j708K478J014k971n54L306J23l700R81L742j967l492K994K557l406k070
$$ -69 -1777 701 1715 -1256 -1810 1496 1619 -2081 -1100 2642 675 -2817 177 2734 -672 -2742
2159b742M084J082m251j81M279l53m293J204L779j875l813L077L016l479k686
$$ -2742 1342 2424 -1827 -2008 2271 1918 -2375 -1171 2608 733 -3080 -3 3013 -466 -3152
2174c152M286J417m086q07M374n15l558R05L304j459k904J962K356k239j914K769
$$ -3152 1134 2551 -1535 -2342 2032 1517 -2041 -1136 2168 709 -2195 -233 2123 -116 -2030 739
2190G39O63k366k3K436r17j652P95J532j336m50R87L92j156NJ061k93j060Q76
$$ 739 1402 -964 -987 1449 532 -1120 -325 1207 -129 -579 408 800 -356 -351 710 417 -643 233
2208B33O01j472j11J432k56j361J108Q76j575m89J859l41j270O42J354q02j850
$$ 233 834 -638 -749 683 427 -934 174 1050 -525 -1014 845 504 -766 -124 1230 428 -1422
2225a422J535J404j775j272K677L38k657J37K529r45k440J892J937k447j492K916
$$ -1422 113 1517 -258 -1530 1147 1485 -1172 -1035 1494 549 -1891 1 1938 -509 -2001 915
2241I15P95l374m2L517m26l360Q34L567k237k713K865K116l589j426M041O91l857
$$ 915 1710 -1664 -1706 1811 1385 -1975 -1141 2426 189 -2524 341 2457 -1132 -2558 1483 2174 -1683
2258a683j33L942o77l590J097L616k152l176K664K700l187j858L421P54l194l6
$$ -1683 -1816 2126 1449 -2141 -1044 2572 420 -2756 -92 2608 -579 -2437 984 1738 -1456 -1492
2274a492L307q10k576O98K576j126k294J980J129j868r35K323J34k118N21J505
$$ -1492 1815 1005 -1571 -873 1703 577 -1717 263 1392 -476 -1411 912 1046 -1072 -551 954
2290I54q66j002R65N55j214J17J021l04p69N55Q17j204k90J394k87j410Q86J260
$$ 954 88 -914 51 606 -608 -491 530 226 -543 12 829 -375 -665 729 442 -968 -82 1178
2308A178j202j114J702M78j757j24K129q09j755Q40J828j278j470J706J029k233
$$ 1178 -24 -1138 564 1042 -715 -839 1290 481 -1274 -434 1394 116 -1354 352 1381 -852
2324h52m35K562k56k539P40K397j491k072K221J847k571j338K863P35l268j84
$$ -852 -1287 1275 1019 -1520 -780 1617 126 -1946 275 2122 -449 -1787 1076 1811 -1457 -1641
2340a641L277p34l168J221L388k046k553K659J995l387j222L515M60l478J09L603
$$ -1641 1636 902 -2266 -1045 2343 297 -2256 403 2398 -989 -2211 1304 1764 -1714 -1605 1998
2356A998q19l408J563K927k434j947K693J405k692j195K924L60k910L88K432o00
$$ 1998 1179 -2229 -666 2261 -173 -2120 573 1978 -714 -1909 1015 1375 -1535 -1147 1285 685
2372F85k363J344J480j248j059J602M82j485O7J236n38r03O29Q54j110j76J076
$$ 685 -1678 -334 1146 -102 -1161 441 923 -562 -495 741 203 -700 -71 783 -327 -503 573
2389E73j71q68J47R96p75q86J376L89j359R6J331r07r57J145J082j671n62J780
$$ 573 402 -466 -319 677 -98 -984 392 781 -578 -482 849 -58 -1015 130 1212 -459 -1021 759
2407G59K93j860J01K176p92k010J173J790j896j208K253N69k144l33K759r79k027
$$ 759 1052 -808 -707 1469 677 -1333 -160 1630 -266 -1474 779 1348 -796 -1129 1630 651 -1376
2424a376R14K099j492k084K137J728k954o31K917L33l286L40L012r86k558J594
$$ -1376 -462 1637 145 -1939 198 1926 -1028 -1659 1258 1591 -1695 -1355 1657 671 -1887 -293
2440b93K088k004j791K360J612k699q31K869J7k985N84K830j125k650J696K146
$$ -293 1795 -209 -2000 360 1972 -727 -1558 1311 1328 -1657 -1073 1757 632 -2018 -322 1824
2456A824j885j493J953R23k012m68K225n25j554N32J505o77j271J265N98j544
$$ 1824 -61 -1554 399 1322 -690 -1158 1067 542 -1012 -480 1025 348 -923 342 940 -604
2472f04j68J365j43j156L51J148r20l54O12K04r82K21R93m89q28Q54R53j370l25
$$ -604 -772 593 450 -706 -355 793 -127 -481 131 335 -647 -426 567 78 -750 104 1057 -313 -638
2491f38J523l16j517R90J413j731q79J527M75j498k96K150k79k046L86K257j251
$$ -638 885 569 -948 42 1455 -276 -1155 372 847 -651 -947 1203 924 -1122 -736 1521 270
2508B70j691J340J662k021p65K053N99k701N16K311r36k257J140K314j891j623
$$ 270 -1421 -81 1581 -440 -1205 848 1447 -1254 -738 1573 637 -1620 -480 1834 -57 -1680
2524a680K212J195k596p92K820j59k661P93K592j447k114J810J857k084j318K368
$$ -1680 532 1727 -869 -1661 1159 1000 -1661 -868 1724 277 -1837 -27 1830 -254 -1572 796
2540G96N37k398k12K465j98k299P33K130j409j585J513J292j905q44J689M36j517
$$ 796 1333 -1065 -1277 1188 990 -1309 -576 1554 145 -1440 73 1365 -540 -1384 305 741 -776
2557g76K21J309n90r60O39J068q77n74O59L08q35K36R58q61l75L67O20p08k18
$$ -776 -555 754 164 -796 -157 911 34 -540 119 427 -408 -172 786 -75 -450 -83 537 -171 -389
2576c89P44R4j191O53R67j168k54Q21L26j281K14J247l84j450J292Q80j552o62
$$ -389 355 449 -742 -89 878 -290 -544 277 603 -678 -464 783 399 -1051 241 1121 -431 -1093
2594a093J662L54j745j30J794k71j715O84J590j221j457J982J282k533k38K182
$$ -1093 569 923 -822 -952 842 571 -1144 -460 1130 -91 -1548 434 1716 -817 -1055 1127
2610A127p2k292O00K028r40k105J498J683j773j449K378R34k564l39K701k54k656
$$ 1127 1055 -1237 -637 1391 451 -1654 -156 1527 -246 -1695 683 1617 -947 -1286 1415 1161 -1495
2627a495N96K516j525j552J384J613j898r28J913P13k376j95K239m22j906J145
$$ -1495 -899 1617 92 -1460 -76 1537 -361 -1289 624 1337 -1039 -1234 1005 583 -1323 -178
2643a78J383j274j303J891N84j554k06J346j65r55K92Q97o63q34J008K11n73m14
$$ -178 1205 -69 -1372 519 1103 -451 -657 689 524 -431 -139 758 95 -739 269 480 -93 -507
2661e07R89l54o83L86O30p47l41J245j73q56K16N31m88n04O09P68j315k9J180
$$ -507 482 128 -555 -169 461 -286 -627 618 445 -411 -195 336 -152 -656 -47 721 -594 -623 557
2680E57L2j391K23J623j008j351J535P11j463n12J701K64j800K42J614m46j807
$$ 557 589 -802 -579 1044 36 -1315 220 931 -532 -1044 657 921 -879 -637 977 531 -1276
2697a276J038J807j711j276J988Q66k469M1J940l70j686P21J728j137j477J613
$$ -1276 -238 1569 -142 -1418 570 1436 -1033 -992 948 578 -1108 -387 1341 204 -1273 340
2713C40J006j524r84J821N00k276M19J803p41j394Q63J188j107j111J481R42j721
$$ 340 1346 -178 -1162 659 1159 -1117 -698 1105 364 -1030 -167 1021 -86 -1197 284 1226 -495
2730d95o63J837l3j451J15J562o25j119R82P95j049j151J755K20j153J02R47n02
$$ -495 -1158 679 646 -805 -690 872 247 -872 110 905 -144 -1295 460 680 -473 -371 576 74
2748G4m57N36L88n91l13N29J68q18J97P34n38m52Q52K04q81j39R34j14p95O55
$$ 74 -383 153 541 -50 -363 166 334 -484 -287 447 -91 -543 309 513 -368 -507 427 313 -482 173
2768A73M23o77n72J144K44j262k22J342l78j253J052J227j412o54J479M25j565
$$ 173 596 -81 -653 491 735 -527 -749 593 215 -1038 14 1241 -171 -825 654 1079 -486
2785d86n52J986k32j691O36J343q35j444J445J090j467r90J863N62k034j27K187
$$ -486 -1038 948 716 -975 -339 1004 169 -1275 170 1260 -207 -1197 666 1228 -806 -933 1254
2802A254n99j711R96J315j496q00J435P38j662o93K113K3k018L72J783n70j702
$$ 1254 655 -1056 -60 1255 -241 -1041 394 1132 -530 -1223 890 913 -1105 -733 1050 480 -1222
2819a222J160R60r94p57J366L39j450O7J226j99r66K39J144j080p72J064O60j015
$$ -1222 -62 898 -96 -853 513 852 -598 -531 695 496 -470 -231 913 -167 -939 125 785 -230
2837b30J58N03j18o63K88N71q16M4O05j4n08k1P43l92o73L83O62r48r4Q89k49
$$ -230 -72 431 313 -350 -62 509 -307 -263 342 328 -180 -201 542 150 -523 -140 522 -426 -520 369 120
2858A20n43M41P27o17j176J260N28j343P5R82L45j781M65J450q43j257J139J138
$$ 120 -423 18 745 128 -1048 212 740 -603 -528 454 799 -982 -517 933 90 -1167 -28 1110
2876A110j488n15J545J92j584K97J090k59j449J072J100j073j062J265J036j804
$$ 1110 -378 -893 652 844 -740 -443 647 388 -1061 11 1111 38 -1024 241 1277 -527
2892e27n42J824J93j919K95J751n82j641J050J007r54r91J273P96j522m55J785
$$ -527 -1069 755 948 -971 -676 1075 493 -1148 -98 909 -45 -1036 237 1033 -489 -944 841
2909H41l97j352O50J048m88j248J198O15j018o46J288m4r83j04J130k65q59M43
$$ 841 444 -908 -258 790 302 -946 252 867 -151 -797 491 447 -536 -640 490 225 -634 -191
2927a91R15o20n67N14L64q88M45O45o52m50N05L39m31l82O89l34l44K92O50o49
$$ -191 724 104 -463 51 415 -473 -28 617 -35 -485 20 359 -72 -454 235 -99 -443 -151 499 -150
2947a50l03R52k65n80J27O24k49q13N12Q69r66m03R95M50j340J5J272k52j361
$$ -150 -453 499 234 -346 -219 405 156 -657 -145 724 -242 -645 350 800 -540 -525 747 495 -866
2966h66Q90R79q53j114J167O98j295m74J448J70j667L06J417n43j013O16J316
$$ -866 24 1003 150 -964 203 901 -394 -868 580 750 -917 -611 806 263 -750 -134 1182
2983A182j411n93J603o2j669j01J860j97j475M31J390q88j052Q83J022j263m13
$$ 1182 -229 -822 781 719 -950 -1051 809 612 -863 -432 958 70 -982 -99 923 -340 -753
3000g53J069L04j002m15J588n02r44L55J148r86n30Q83M38r84l14J156l39m24
$$ -753 316 620 -382 -797 791 289 -655 -300 848 -138 -668 215 653 -331 -645 511 172 -252
3018b52J8N92o81n09R01M35q03j09M26q3m78O79M66q82j49O86l3n29K35N18n89
$$ -252 -234 358 -323 -832 69 504 -299 -408 18 -65 -543 136 602 -280 -429 257 224 -305 -70 448 -141
3039a41l68N59M69p44l56J077k18j187Q17N24l62r32P54P99r14m35J098K29j151
$$ -141 -509 50 519 -225 -581 496 278 -909 -92 432 70 -862 -108 691 -223 -658 440 669 -482
3058d82q8J120m2j347P43P78o24p95J158K39j222J68R58r7j103M37J249q16r70
$$ -482 -570 550 508 -839 -96 682 58 -737 421 660 -562 -394 564 467 -636 -199 1050 234 -736
3077g36P99Q11j219m23J125J56j286O9J451l34j226O89R05n77r65R82O08j385
$$ -736 63 874 -345 -768 357 513 -773 -704 747 413 -813 -124 781 204 -761 221 829 -556
3095e56l2J396l74q66J48Q21l65o03K70O30m99k99N33M19j093J87L92J72o87L92
$$ -556 -588 808 434 -432 -284 537 172 -431 -161 469 -30 -329 204 623 -470 -283 109 281 -406 -14
3115a4L35k70l93O72Q7j255Q95K45j87o31O41K62r71M75O03l08p31M42Q98q74
$$ -14 321 51 -342 330 417 -838 57 302 115 -516 125 387 -584 -109 494 186 -545 -103 795 -79
3135g9m34O38K53r45J12J028k60r18M54P83p05o22R62K43o60m70J083N8j361O90
$$ -79 -513 125 378 -567 -455 573 313 -605 -151 632 -73 -695 267 510 -150 -620 463 521 -840 -150
3155a50R19n65j072R13O67q37n18J246j3j321J56J239j29j397Q03Q73o56q99R64
$$ -150 769 204 -868 45 712 -125 -643 603 590 -731 -575 664 535 -862 -59 814 158 -741 223
3174B23N41j374J16J000l9j103L17J103q82m16O42K09n29p73J103N83j002J15
$$ 223 764 -610 -494 506 467 -636 -319 784 -98 -514 128 337 -192 -965 138 721 -281 -166
3192a66P14l08o79L78L92k99m50M18L10n12l94R26j11n94J73N67m90l12N02K40
$$ -166 548 240 -439 -61 331 32 -418 0 310 -202 -596 330 219 -375 -202 365 -125 -437 65 305
3212C05o52L44K40k99k76M20L84n67l17N63r9k69K58M48m53p71P25P11j020l35
$$ 305 -347 -3 237 -62 -338 82 466 -101 -418 145 46 -223 35 483 30 -741 -16 695 -325 -660
3232f60J016Q6j096L21R82o59o54O99M31m93p73J131K56j083J3J137k80r76N83
$$ -660 356 442 -654 -333 649 -10 -664 35 466 -27 -800 331 587 -496 -483 654 374 -602 -19
3251a9R47r99q99J299J90j069n4J086J77j194J88P77k06q99O76P91o20p79J053
$$ -19 928 -71 -970 329 519 -550 -604 482 659 -535 -347 430 224 -675 1 792 172 -607 446
3270D46L39j335l5J089l02p49P54M67n50o44O45M09r10j41R10j09o67O6J054p70
$$ 446 785 -550 -585 504 202 -547 207 674 124 -520 125 534 -376 -517 393 284 -383 -317 737 -33
3290c3k33L87L01l39l33O06q3k72J9K08O2o64M79R5j24m27P24k61l79K22L76m55
$$ -33 -266 121 422 83 -250 356 273 1 20 228 290 -374 105 200 76 -351 373 112 -267 -45 331 -124
3312a24j99N22O6q24J81R05k88n45M16J76n93l88Q55L78p26j14R23m79n79L48
$$ -124 -323 199 265 -559 -378 527 239 -306 110 286 -307 -695 160 538 -188 -302 621 142 -437 -89
3332h9N93m98m87N27N16r00k40J201j06j179L01J023o06p56P67O10q04n87J137
$$ -89 504 6 -481 46 562 -338 -578 623 517 -662 -361 662 56 -700 67 677 -127 -714 423
3351D23N5q12o1Q37J25q91J43O45m09r62J182M57r08k06P38j94o03R0Q62m46l38
$$ 423 478 -334 -395 442 567 -324 -181 464 55 -907 275 732 -176 -382 356 162 -441 -351 511 65 -273
3372b73J82M57k57m52P07j18l74Q4L12j36m98J59O37n60r0L96P5m29n7M38M0n17
$$ -273 -91 366 109 -343 364 246 -128 -44 268 132 -366 -207 430 -130 -220 176 251 -178 -235 203 243 -274
3394b74M36R9k52l48M24J46n46K93M47k86o14N41K24m43k14L46K71o06L44M85
$$ -274 162 261 9 -339 85 231 -315 -22 425 139 -475 66 290 -153 -367 -21 250 -356 -12 473
3414D73l68n57N63M44n57n11O72J56r75M90M86j93p03N85N64o54m02Q17K12q57
$$ 473 105 -452 111 555 -2 -513 159 315 -660 -170 316 123 -580 5 569 -85 -487 330 542 -315
3434c15m9Q25r4r36N82N76o35o23R73J51q86J73N84L57j049j16O96J02r75N47
$$ -315 -364 461 367 -569 13 589 -46 -669 304 455 -431 -258 326 683 -366 -482 214 316 -659 -112
3454a12N91m42m83M66L04l34m53P88j58p22K93P43k67o50O10Q4l25k91O06Q9o39
$$ -112 479 37 -446 20 324 -10 -463 325 167 -555 -262 481 214 -436 174 258 -67 -358 248 337 -302
3475c02L87N0j18l51M23L31p60J98J82k3l04J57K92n3L4mJ59m95k67O14N3m68
$$ -302 85 135 17 -334 89 420 -340 -142 40 17 -287 -130 162 109 143 139 298 -197 -464 150 203 -265
3497b65M00J78m40k44O07j28l29NO27k19o11K65O14l25o21M77O10q42l52J027
$$ -265 135 313 -127 -371 236 108 -221 -216 411 192 -419 -154 460 135 -486 -9 601 -241 -593 434
3517D34o4r73K08Q97j93p72O15L75l73m90M61M01j010J40Q37k29j004N92P21l99
$$ 434 370 -603 -395 502 309 -463 152 527 154 -336 125 526 -484 -344 493 264 -740 -148 573 174
3537A74p86P24L83o55k04Q51p7o15K5N76k08q89P88O06r05l25R28k84k28j09M64
$$ 174 -612 112 495 -160 -364 487 410 -205 -180 396 188 -701 87 693 -212 -537 391 107 -121 -230 234
3558B34j86j81j47N84j23k67J99J05l89j79Q53j74n00j23N79j50n26K49O22n94
$$ 234 48 -133 -280 304 181 -86 113 218 -171 -350 503 329 -171 -294 285 135 -391 -142 480 -114
3578a14j22O67l23n87N52M04o20j41M91p1m89K07M04J1m85P4L81l96k34O74J41
$$ -114 -236 431 108 -479 73 477 -143 -284 207 136 -353 -146 258 269 -216 -142 239 -157 -391 283 424
3599D24r12L30L18o0n35P39L08o70o50Q80P7n62J0Q98j19r22M27N88k80r24J013
$$ 424 -488 -158 160 100 -435 304 612 -58 -708 172 249 -313 -303 595 476 -446 -19 569 289 -635 378
3620C78J49n47l62N51K24q76J55Q61l25m62M06O04r08l25N45M37p61k47O07K53
$$ 378 527 -20 -382 169 393 -483 -328 533 208 -254 152 756 -152 -477 68 505 -256 -503 104 357
3640C57p73K45L77K31p41L31N84p04k38O04J52o92j20N79K0n25K76N68p76o0L79
$$ 357 -416 -171 206 437 -304 27 611 -93 -331 273 425 -267 -387 192 212 -313 -37 531 -245 -305 74
3661G4J79n84K49O12m04n30O25j33l88J30L79j88m21J89M44q6m56M17Pk16o6K05
$$ 74 253 -331 -82 530 126 -404 221 88 -300 -170 209 21 -400 -211 233 147 -309 108 115 -101 -167 38
3683C8rn90L42M65l74l58N36J49l62n7M04k9n35J50O37m27n51O28N27r45o9R15
$$ 38 29 -561 -219 246 -128 -486 50 199 -163 -220 184 155 -380 -230 407 -20 -571 57 584 -361 -430 485
3705D85l55m40J82M26l55p66N91P95o84k64L97K62n74J22O82q3j088M86N19j40
$$ 485 130 -310 -128 298 -57 -823 -232 563 -121 -385 12 274 -300 -178 504 421 -667 -181 338 198
3725A98n67L31N61p61J18J91K38k87j57L95j72k78lN26l66j35L22M23q22J00N98
$$ 198 -369 -38 523 -238 -120 71 309 22 -135 260 88 -190 -193 333 -33 -168 154 577 -245 -145 453
3746D53k88m94L32M29l44n03M43Rj58j14Q85n26m48N14Rk35j41K15L39n96Q6K77
$$ 453 165 -329 3 432 88 -415 28 37 -121 -235 650 124 -324 190 199 -36 -177 38 377 -219 -133 144
3768A44j78l75K87N15n96rN38or13N49K09p5p28O96L88n05L8K76J3m68j31P57
$$ 144 -34 -409 -122 393 -203 -212 326 320 -593 -44 165 90 -638 58 446 -59 -21 255 268 -200 -331 426
3790D26j28m94k61N48r7n20O44J57m47k00O45j18n87k4O42r2m94M41L49m24l52
$$ 426 298 -196 -457 91 -6 -526 118 275 -172 -372 273 155 -432 -456 186 94 -400 41 390 -34 -386
3811c86N39P6m82o6N53K3o30M75J12J4k75K81M2l62k16N80j14l92K8P68m89k25
$$ -386 153 229 -253 -319 234 257 -373 102 214 228 -47 234 276 -86 -302 278 164 -228 -200 568 79 -146
3833a46K12R7k06l45M27p2k77J87K09j79k09K19M72o57j45O18J0l26j81L01J62
$$ -146 66 163 -43 -388 39 -33 -310 -123 86 -93 -302 -83 389 -268 -413 205 215 -111 -292 9 171
3854A71m84M50n7k97j08N62r2l34J26K88j79k61L15K38m51j46O89J15q11K12M20
$$ 171 -313 137 80 -217 -325 237 145 -189 -63 225 46 -215 100 338 -113 -259 430 545 -266 -54 366
3875C66k36k86M96N8m72k77M84Q7k81k58P79l15n61L94L40k67o52O72N94q73N1
$$ 366 130 -156 340 398 -74 -351 133 220 -61 -319 460 145 -416 -22 318 51 -601 71 665 -208 -157
3896a57M50j03o58J48Q03l33n30O32o4m78k98N72M04q49K41O47l59l41K39J46
$$ -157 293 190 -468 -320 483 150 -380 252 188 -290 -588 -16 388 -461 -220 427 68 -273 -34 112
3916A12k59k48M65O3k28n4N28n1n95N4N42j11o09L68K31m19q0L82p7m26K33K97
$$ 112 -147 -395 70 133 -95 -149 379 328 -267 -213 329 218 -391 -23 208 -211 -291 91 14 -412 -179 118
3938A18j9k00L43P8l75J45K18j96l92M11O8j57j86L12J93n13n0M92l48n9M4J12
$$ 118 99 -101 242 320 -55 90 308 112 -280 131 199 42 -144 168 361 -152 -202 290 -58 -117 -73 39
3960C9k48o0M39n4o23L21N16p1j87l44O93l91p35Q93R3n09O0M29Q4p08K8P54l67
$$ 39 -209 -269 170 116 -507 -186 330 259 72 -272 421 30 -705 188 281 -228 -168 261 345 -363 -335 419 52
3983E2o59M38O77o01k66M13L95p87q2P69j36l92j9M17m23k50M53K32m49p2L81
$$ 52 -607 -169 508 -93 -359 54 449 -338 -420 349 213 -179 -198 219 -204 -454 -1 231 -218 -290 91
4004I1J50n21j3Q22n19n44O43J68o71Q2N26j81Pm0L09k16l96K83N49q45M20p9
$$ 91 241 -280 -293 529 10 -534 109 277 -394 -312 214 33 40 0 309 93 -303 -20 529 -316 104 25
4026B5J42l77M0K81r7j45RM25m52q6N04o5o04K45K39j38l12J89M58n87K78L69
$$ 25 167 -210 -170 111 14 -131 -122 303 -149 -235 269 204 -400 -155 84 -54 -366 -177 281 -306 -28 341
4048C41k84k57j85O86l41j41K05L76o80q0L99K79n19r0O11j35m46L34M83n51k63
$$ 341 57 -200 -385 301 -40 -181 24 400 -280 -360 39 318 -201 -291 320 185 -261 73 556 5 -258
4069b58O23K7n78jN26k54k98J84N28n76o4K84nj16o70P32J92m96j46Q73m57k48
$$ -258 365 392 -186 -187 339 85 -213 -29 499 -77 -141 143 138 22 -648 84 276 -220 -366 507 50 -198
4091a98J30L23j12m87P4M89k05k67N89K10p40J13M21l61m06O49J07m09k83L30
$$ -198 -68 255 143 -344 -270 219 14 -253 336 546 -194 -81 340 -21 -427 222 329 -80 -363 -33
4111c3J02k88J43L37k37o9n8M73n02J02J64J35n43J27N33m08q6L23J7l88k42O96
$$ -33 69 -219 -76 261 24 -45 -103 370 -132 -30 134 269 -274 -147 386 -22 -108 215 232 -156 -398 298
4133B98l01j86L54N2k93j23L11K6l45J23L45j67m67L69K46m77L3K68j3r6j83L80
$$ 298 -3 -189 165 217 -76 -199 112 138 -207 -84 261 94 -373 -4 242 -235 -202 66 53 -43 -226 154
4155A54Ln65J96O60j42o03M33k8j68j05O59j64m47k72Q14l97m84L27N68k15m37
$$ 154 157 -408 -212 448 306 -297 136 108 -60 -165 494 330 -117 -389 425 28 -456 -129 439 224 -213
4176b13M50J75l85k09P26n47q8J43L58n27JJ78K48m81j32O24l74o7j12M15k63
$$ -213 237 412 27 -182 544 -3 -91 52 410 -117 -116 62 310 -171 -303 321 -53 -120 -232 183 -80
4197h0n8J62M55o25J73J7K26n24M06J0r5J38j46J47j51n10O27P4n50L34L1j69
$$ -80 -138 24 479 -146 27 44 270 -254 152 162 67 205 59 206 55 -455 172 246 -304 30 61 -108
4219a08J39k23J89Qj50L51k19j42p9M18l34N2m3K97K2m36O30m70j54Q5M98k25
$$ -108 31 -192 -3 5 -145 206 -13 -155 -234 184 -150 -98 -141 156 178 -258 372 -98 -252 -167 331 106
4241A06k94J32M13k77j61l2L96k23k84M84j26n78K53N14l53k08L23M3m13O9M39
$$ 106 -188 -56 357 80 -81 -113 283 60 -224 260 134 -444 -191 323 -30 -238 85 128 -285 -216 223
4262B23j18k58RL64k3o91N15J00k42l40M68J78o43M08M66l54l34J97K61r4m97
$$ 223 105 -153 -144 220 197 -494 21 121 -121 -461 7 185 -458 -50 416 62 -272 -75 186 92 -405
4283d05M41l9L6k45r4R3L61k89M62j38l12K39K6K4m41L34Q7l28Q7L64l63l2J08
$$ -405 36 -3 33 -212 -306 -213 148 -141 321 183 -129 110 136 160 -281 53 140 -188 -101 263 -100 -132 -24
4306b4K64l53J10K19k41j17j73O54n08qJ02K33l59j9J63K0j44J06L46k94k28L07
$$ -24 240 -113 -3 216 -25 -142 -315 339 -169 -177 -75 158 -201 -220 -57 -37 -181 -75 271 -23 -251 56
4328E6K17m01oK60J44o01R7N47k55j68K62Pj78k08M97m1m18J26L61o7m95L56Q7
$$ 56 273 -128 -134 126 270 -331 -234 313 58 -110 152 159 -19 -227 270 229 -189 -63 298 231 -264 92 179
4351A79j57m37O08K93o39p2K73Ok46j36O49m9o57K28L80m59j95Q28r8p55K14N93
$$ 179 22 -415 193 486 -153 -225 48 54 -192 -328 321 272 -385 -157 223 -236 -431 397 299 -456 -242 351
4373C51k63k75K58L3j53j5O3K65k85j08K92k39j22K48K44m45j4J40j5k44J79L20
$$ 351 88 -187 71 104 -49 -64 -1 264 -21 -129 163 -76 -198 50 294 -151 -165 -25 -40 -284 -105 215
4395B15j93m16M39L74o08K25lR2j57k38N93j00m48L28J1n5k60N47m11%n4K2K47
$$ 215 22 -394 45 419 -189 36 33 125 -32 -270 323 223 -225 103 114 59 -201 346 -65 -65 -119 -97 150
4418A50n74M16J49O9m89M80p5l42J37K53k61K9J09J6p1k21J96j6J36o3R5K05m73
$$ 150 -424 -8 141 210 -279 201 126 -216 -79 174 -87 -58 51 67 -4 -225 -29 -45 91 28 123 328 -145
4441a45m5L66k0o28N51J37l67l61O20O6l61M8K16N6l97L05J47k51l32M45Jo6k25
$$ -145 -190 176 156 -472 79 216 -151 -512 108 174 -187 -139 77 133 -264 41 188 -63 -395 50 51 -15 -240
4464b40L53P8m97R7L03mk34J24J87j47j22O73o44j08J83K37K2m72M30k81J31r6
$$ -240 113 191 -306 -209 94 90 -144 -20 167 20 -102 571 -73 -181 2 239 261 -211 219 -62 69 -27
4486b7j8K41m08M3N39o32K49J21J45l46N4L60k67k32n5L91j69l34N61J1k25l03
$$ -27 -45 196 -212 -169 370 -262 -13 108 253 -93 -39 321 54 -178 -233 158 -11 -345 216 227 2 -301
4508c01M95n2l37P2M46l71k20K14M61o10j20N19j9l82k4M15R7n40K19J80m48K8
$$ -301 194 142 -195 -123 323 -48 -268 -54 407 -203 -323 196 177 -205 -229 186 283 -257 -38 142 -306 -278
4530b78L28K80o02K30K40J60o14J27L16k94k21M94J06n36K47O8R1k01j9M78l71
$$ -278 50 330 -272 -42 198 358 -256 -129 187 -107 -328 166 272 -264 -17 51 142 -59 -78 400 29
4551B9l67N77j09l48m7M72m76Q0M2M50j27l73L9M45k24k07M20J76o91J57J54j29
$$ 29 -338 239 130 -218 -265 207 -269 -189 -147 303 176 -197 -158 287 63 -144 276 452 -239 -82 72 -57
4573e7j19J91L90o84J8K34J56m69L42N0k60J77k3L71o17o1L58J31l73J70J52r6
$$ -57 -176 15 405 -279 -261 -27 129 -340 2 52 -208 -31 -54 317 -300 -361 -3 128 -245 -75 77 -19
4595a9j45K50K10n98QM97j94j40PL65m9n58K38J89j30j75M8N37m32k76P52j48
$$ -19 -164 86 296 -302 -294 203 9 -131 -124 241 192 -366 -128 61 -69 -244 -196 341 -91 -367 385 237
4617B37m92J06N45l18k32J77Q7l03k32M76L03l90k41L28N5m51K74L71m59j36N84
$$ 237 -255 -149 396 78 -154 23 110 -193 -425 51 354 -36 -277 51 106 -345 -71 300 -159 -295 289
4638B89j32j16k00L94K1k52k86M99k09k7M8J36m20L8M38%l80m2K14j18J7K89j11
$$ 289 157 41 -159 235 256 4 -282 217 8 -19 29 165 -255 -217 221 221 -159 -201 13 -105 -88 201 90
4661I0k92K14LKl28J64K90j42j42K06j48k62M52l3P7l56j6K39Q4k58K95K0k07
$$ 90 -202 12 15 17 -311 -147 143 1 -141 65 -83 -345 107 74 151 -205 -221 18 102 -156 139 159 -48
4684d8k82M92Q2l76J87O5o5m2J03O7P9m85L22k89J9n4M58j78l20K89K45k78J24
$$ -48 -330 162 244 -132 55 120 55 13 116 183 262 -223 99 -190 -171 -225 233 55 -265 24 269 -9 115
4707A15j01J32k80j63L81R7n75L67K27l24r3J89K68m49LN28j98j99j26P5L80m90
$$ 115 14 146 -134 -297 84 181 -394 -27 200 -124 -217 -28 240 -209 -206 322 124 -75 -201 -126 254 -236
4729b36L43K78m87J93K71j90n01K38q9M5P9LK90k80k35J31J46q0j5L65m14j71
$$ -236 107 385 -102 91 362 172 -329 -91 -180 -135 -56 -53 237 -43 -278 -147 -1 -81 -96 269 -145 -316
4751c16K90R9p3j96K93j15k23p3N65j06m24K77J93n6l05J95j48P5l6L4J59k68
$$ -316 -26 73 0 -196 97 -18 -241 -314 251 145 -279 -2 191 135 -170 25 -123 -48 -84 -50 109 -159
4773a59K74j8j9j6m1Qj00j65N17l26l23M07J85j23k75K79R7m53K74K49n62O6L81
$$ -159 115 97 78 62 21 29 -71 -236 281 -45 -368 39 224 101 -174 105 202 -251 23 272 -290 -224 157
4796A57n4j80k67N28J21q7k45J36R2n04J80L90l91l12M69K48m04j30N42l6l76
$$ 157 103 -77 -344 184 305 218 -27 109 201 -303 -123 267 -124 -436 33 281 -123 -253 289 253 -123
4817a23k10P32j7m81J07L45k67l95N27P1m66P3L51m32q7K23PJ02k85K23N31n78
$$ -123 -333 399 382 -99 8 353 86 -309 218 289 -177 -104 247 -185 -272 -49 -42 60 -225 -2 529 -49
4839d9r6L52k41k10J66L21j89j72L56K9m18P4K79m90J59L15J9j87k20M71J97m66
$$ -49 -145 207 -34 -244 -78 243 54 -118 238 267 -151 -77 202 -288 -129 186 205 18 -202 269 466 0
4861@k38L70J51m65M84j25j1n13L56J30j95j84L76L4k36oK39K28n65o3L40j67
$$ 0 -238 132 283 -182 302 177 166 -347 9 139 -56 -240 136 170 -66 -72 167 395 -170 -233 107 -60
4883f0m09M94L59n30J73K52l10m18L93L58o09J77L33p8k00j4L86j51l10J74K29
$$ -60 -469 25 384 -146 27 279 -31 -449 -56 302 -307 -130 203 125 -75 -89 297 146 -164 10 239
4904B39m39p2N96k54N1k94K85p2l41L89K46l89K6K89P9o03P8J52J33l21j8L84
$$ 239 -200 -272 324 70 121 -173 112 40 -301 88 334 -55 -29 260 339 -264 -186 -34 99 -222 -240 144
4926A44qo5P3j08j49j8J51J77l17M7L02l77J9J30P3j92j48L39J12k87J87L06n35
$$ 144 136 71 144 36 -113 -131 20 197 -120 -73 229 -148 -129 1 74 -118 -266 73 185 -102 85 391 -144
4949a44o4K85Pom8R4k57j35K12k6J68j15N9m8J33k73K22Mj32J28j12L41m81O0
$$ -144 -208 77 84 78 30 124 -133 -268 -56 -82 86 -29 30 -18 115 -158 64 68 -64 64 -48 293 -188 -128
4973a28L03l57OK38J44l55qL93q0q77P44L71l60l33N14J92m48k14L57J31l03J8
$$ -128 175 -182 -176 62 206 -149 -157 236 156 -721 23 394 34 -299 215 407 -41 -255 102 233 -70 -52
4995e2K96k79k88L87J43m91j9M62J84o04Q9N05k65l13K82L47m15j26K19K88n16
$$ -52 244 -35 -323 64 207 -284 -303 159 343 -261 -172 333 68 -245 37 384 -31 -157 62 350 -166
5016a66J70K02j27j59J13L9k08j37L05K60l08j93J24J1J47l44L46N3n6l0J81l42
$$ -166 4 206 79 -80 33 72 -136 -273 32 292 -16 -209 -85 -74 73 -271 75 128 72 42 223 -119
5038a19j45J67r0p3M12J85l45j26K60K53m31J03J07J00o11K44M01k08m6k41J29
$$ -119 -264 -97 -187 -260 152 337 -8 -134 126 379 -52 51 158 258 -353 -109 292 84 38 -203 -74
5059g4N4j88L30N9m62J2L11O3j65J82j25j94O9K51N7l11J91K1J9l63J59K16p0
$$ -74 -20 -208 122 181 -281 -269 42 105 -60 122 -3 -197 -128 123 180 -131 60 81 100 -263 -104 112 42
5082D2l46P8L82m25J37K98r7m27L32K59k41k50n8N15l32n8N67k97j85J76M41m62
$$ 42 -304 -226 156 -269 -132 166 69 -358 -26 233 -8 -258 -316 199 -133 -191 376 79 -106 70 511 49
5104D9k74K32K41k89j80O10k07m82k1M50j42O0K02J75n81n9J16k37K73j96L70
$$ 49 -225 7 248 -41 -221 389 182 -300 -321 129 -13 47 249 424 -157 -216 -100 -337 -64 -260 110
5125A10k34Q0K6O6l9j09J93k2l21L89k52L07m08M18k47l1J33j9K37n17OO24k71
$$ 110 -124 -44 -18 48 9 -100 93 71 -250 139 -113 194 -214 204 -43 -74 59 40 277 -240 -234 390 119
5148A19m11J98K73j54l57K66K86k60j63L14r6J41j96M63n64M6J83K94p72J26K52
$$ 119 -292 -94 179 25 -332 -66 220 -40 -203 111 15 156 -40 423 -141 -95 88 382 -390 -264 -12
5169a2M2k8j31K77Pm19L64J63m29j02L52r8n3j15L16lk78K88L5R9m95J74J80l14
$$ -12 30 2 -129 148 155 -264 100 263 -166 -268 84 -14 -67 -182 134 131 -147 141 176 275 -220 -46 134 -180
5193a80K43K45j88k64k7L53k69O7N6K39n16K90J83q0l20K16J65j3m47J43L16k60
$$ -180 63 308 120 -144 -171 182 -87 -20 36 275 -241 49 232 152 -168 48 213 200 -247 -104 212 -48
5215d8j15L64n0m25Q6L10r4k24M40N5l78o2J01J64k73k09L92r9j73K05K17q2k59
$$ -48 -163 201 151 -274 -188 122 28 -196 244 299 -79 -141 -40 124 -149 -358 34 -65 -238 -33 184 102 -157
5238a57N78l49l15K26J30j09J9k54N08k35p4N0J8j66n0L48k17k63L68J12k83J95
$$ -157 421 72 -243 -17 113 4 23 -231 277 42 -32 18 36 -130 -180 168 -49 -312 56 168 -115 80
5260H0o3j39j11J93O8O8j79J26K32l67k14K66L69l61k12N53k24m28Q9M91J36k99
$$ 80 17 -122 -233 -40 28 96 -83 43 275 -92 -306 -40 329 -32 -244 309 85 -343 -254 237 373 74
5282G4L9J4k45j53L11K06l19r7M03l2m14J16K86k11j08L32l89j98M12J11j19j83
$$ 74 113 127 -118 -271 40 246 -73 -170 233 201 -213 -97 189 -22 -130 202 -187 -385 27 138 19 -164
5304a64L3K86j84k48L79j02k17N7K26l78J17P8L78m24J45L0m4m4J80j72O5l02
$$ -164 -131 155 -29 -277 102 0 -217 -160 66 -312 -195 -117 261 -163 -18 12 -32 -76 104 -68 -3 -305
5326c05L16K61m60%k1K01k00Q6L74k60k19J59L42q1l20m2L57j41o2L48j36m03
$$ -305 11 272 -188 -188 -209 -8 -208 -122 252 -8 -227 -68 274 193 -127 -169 188 47 -15 333 197 -206
5348b06K05K15k76k07K17P6M6m21L18K02l40n4L43k6l04N7M79m00k5K1K69j23
$$ -206 -1 214 -62 -269 -52 24 70 -351 -33 169 -171 -225 118 92 -212 -155 324 -76 -101 -80 189 66
5370F6l15M85j32k90J66M87m17k22L33p6k6j11o8L00j32J03m3q2k38K98P1k30
$$ 66 -249 236 104 -186 -20 467 50 -172 161 85 59 -52 -120 180 48 151 108 26 -212 86 157 -73
5392g3p0L61l83M45l63J61o3k01J73J76k38j08L10j70j05o2K61k40k25L03L80
$$ -73 -143 218 -165 280 -83 78 15 -186 -13 163 -75 -183 127 -43 -148 -210 51 -189 -414 -111 269
5413B69k50k14M00k04l01K60j5P2l03K23L93l68j21M32m3m68Q8L62j50k98L20
$$ 269 19 -195 205 1 -300 -40 -55 17 -286 -63 330 -38 -159 273 230 -238 -150 212 62 -236 84
5434H4m9k65K00J48k6p4j74M43q4l30L08J83k12l80K66M45o43M1L22j8l67L5N6
$$ 84 35 -230 -30 118 92 18 -156 287 203 -127 181 364 152 -228 38 483 -160 -119 203 185 -182 -147 -91
5457i1Oj90M99M3k99j57M15J7m81K10K62Kl68K60P6k06l39O15J25o88J5L92k48
$$ -91 -85 -275 224 267 -32 -189 226 243 -238 -28 234 236 -132 128 204 -2 -341 274 399 -289 -274 118 -130
5480a30L7mR6j33j49M26j63m2J60j3Jm66N55J47j86j08K07l48N8j71J92k3Jj29
$$ -130 -93 -97 -1 -134 -283 143 -20 -62 98 85 86 -380 175 322 136 28 235 -113 -55 -226 -34 -57 -56 -185
5504a85K70n5l69N82O0o86N66J35l34k90M08J52o24K07J13K17l70J17J85R2o45
$$ -185 85 30 -339 243 303 -383 183 318 -16 -306 102 254 -370 -163 -50 167 -203 -86 99 191 -454
5525d54Q09j49j68j37L14k94j10K17k1J17k77p5K60J28o11K92M31j91k63J79J47
$$ -454 355 206 38 -99 215 -79 -189 28 7 124 -153 -228 32 160 -451 -159 272 81 -182 -3 144
5546A44k51R5K95k30r6J26j2mj84L40nk92n7L81j05k47j32O51n26N3K99j10k92
$$ 144 -107 -12 283 53 -43 83 71 67 -117 223 218 -74 -131 250 145 -102 -234 417 -109 -56 243 133 -159
5569a59J38K33j93j25M6J26j8r8j98N61n95K2K47L1R1o4K61k26j09M2R5k70J9
$$ -159 -21 212 19 -106 -60 66 48 -50 -248 313 -282 -260 -13 18 109 45 306 80 -29 13 108 -162 -143
5592a43J29J9j00J07J19Rl81M68Ln58L70j28K18k01k34N23j20k18J74K18n21o
$$ -143 -14 5 -95 12 131 140 -241 227 230 -328 42 -86 132 -69 -303 220 100 -118 56 274 -247 -253
5614b53K99K34l33o2K47j74k70M02J89n48J02L23j06q2l53Q12o00l2J44j92J46
$$ -253 46 280 -53 -115 132 -42 -312 90 279 -269 -167 156 50 -32 -385 427 -173 -205 -61 -253 -107
5635a07kJ53L8n7k43L57n2pj13Q8nl77M04j6j78M7n6K38k83j02N06j11n28N94
$$ -107 -109 44 82 25 -218 139 87 80 -33 55 50 -327 77 61 -117 -70 -126 112 -171 -273 233 122 -406 188
5659A88O1m35K99o2j37j84J75J34J01k22L45n7k84J16R6j07j42M7J82R0k92L4
$$ 188 249 -186 113 51 -86 -270 -95 39 140 -82 263 206 -78 38 134 27 -115 -68 114 204 -88 -54
5681e4J83k49L2J15J0k91J8Q5K78m22K90K22k31k46N25q0n38K47J32J27j6j95
$$ -54 129 -120 -88 27 37 -254 -236 -151 127 -295 -5 217 -14 -260 265 185 -353 -106 26 153 137 -58
5703e8L62l41j16Q7p1P4K0J29j45k52L11K00k44k58K55K32n8l13N58j51l18K27
$$ -58 304 -37 -153 -66 -137 -63 -43 86 -59 -311 0 200 -44 -302 -47 185 127 -186 372 221 -97 130
5725A30K68n15l09M37J58j18k19J60J88l92j3M29j11k39N4L61n48K42J88m2j24
$$ 130 398 -117 -426 11 169 51 -168 -8 180 -212 -225 204 93 -146 -92 269 -279 -37 151 109 -15
5746a5l8K13P5m92K71P0j01Q6KL44l90p9J89J51l82K01m3m1r9Q2K04m86L64l0
$$ -15 -53 160 235 -257 14 84 -17 69 71 415 25 -54 135 286 -96 105 62 21 -78 4 208 -278 86 56
5770E6n5M9rj09J75l31N01m2k46j21J27K89n08P1K68j29o3K45J10n05K73J55j07
$$ 56 1 50 41 -68 107 -224 277 235 -11 -132 -5 284 -224 -153 115 -14 -77 168 278 -227 46 201 94
5793I4m17K81J40n4k37J6L95l89k9P9M12n43j5M99n5r9N8m5k14K3O2M15m27L3
$$ 94 -323 -42 98 44 -193 -177 218 -171 -200 -121 291 -252 -267 232 177 78 136 91 -123 -100 -38 377 -50 -17
5817a7K65l72J45kK31m12j92O80k5l01j76K56k79J90j70K77l23Q2P5J70l48J91
$$ -17 248 -124 21 19 250 -162 -354 326 301 0 -176 80 -199 -9 -179 98 -225 -143 -68 102 -246 -55
5839e5M6J53j81k6K86l32j26K18L21m68j6M17o7l01J36L02j55m17M33M1j91j3
$$ -55 -9 144 -37 -63 223 -109 -235 -17 304 -164 -180 237 170 -131 5 307 152 -265 168 209 18 5
5861Eo0J99l84K59o1N2j34m5J86l47K38K15m09j18K04M20k10mMkj63N1K88r5J00
$$ 5 -55 144 -240 19 -42 10 -124 -169 17 -330 -92 123 -286 -404 -200 220 10 6 10 8 -155 -104 184 89 189
5886A89j42K84l46l5J18N6k2j9N4oj96p0M14j99o34O41K93l34l43J43J99j44J20
$$ 189 47 331 -15 -50 68 124 102 83 137 131 -65 -135 279 80 -554 87 380 46 -297 -154 45 -99 21
5909B1n8J93m36M24N4l8m40J23K51l7m26N92Nk80N1J32n5l25L49J36m32K33L09
$$ 21 -37 156 -280 144 198 160 -280 -157 94 57 -369 223 228 -52 -1 131 76 -249 100 236 -196 37 346
5932C46l99j72P0O29n18r8J46o3pL8j21K13j52J36J47j57j35j14N68m57O4J0L45
$$ 346 -53 -225 -155 474 -44 -142 4 -59 -66 -28 -149 64 -88 48 195 38 -97 -211 357 -100 -36 -26 319
5955C19m78j32M67j79J6j25K79l40M04l33L01j26j42N0p9m8J69L94n02j37K06
$$ 319 -159 -291 176 -3 13 -112 167 -173 231 -102 199 73 -69 -19 -98 -146 23 417 -85 -222 -16
5976a6M27n02Q3J8Q6m60J78K93k30L7J5L36m47L1J72J15L7l77K93m7k55K83J45
$$ -16 411 -91 -8 10 96 -364 -186 107 -123 -86 -71 265 -182 -151 21 136 173 -204 89 42 -213 70 215
5999B15m07o7J96J71j06j28L03p6l15K42O1j45o3K0K35j88r5M51k53l5j48J91
$$ 215 -192 -259 -63 108 2 -126 177 101 -214 28 89 -56 -119 -99 136 -52 -147 304 51 16 -132 59
6021E9N6m18N19k5j70m15N83J12m97R9J85o6k72L14J23l62J92J99r8m73K96K21
$$ 59 115 -303 216 191 21 -394 189 301 -196 -97 88 22 -250 64 187 -175 17 216 118 -355 -59 162
6043A62k8l98M31o2j47J06J04l7j48J4K08j33m8j99L54o8j88K17K4m90K49L60
$$ 162 134 -264 167 105 -42 64 168 131 -17 -3 205 72 24 -175 179 111 -77 140 164 -326 -77 283
6065B83k77k72J67L95l56k98K31N8j58O5L02l27q2k2N43j17k58L24L5o9l70L15
$$ 283 6 -266 -99 296 -60 -358 -127 -69 -227 -162 140 -187 -269 -291 252 135 -123 201 236 167 -203 112
6087A12k09J47P1J8l00K15J22M3m14J14Q1J49k65J21q3q8J30J34k4P2j23J34r
$$ 112 -97 50 121 139 -161 54 176 219 -195 -81 0 149 -116 5 -78 -166 -36 98 74 146 23 157 148
6110A48l54q0J85K02k02J34K37m33J37L19Jm73J70J03K4o3p4P1k12M1Q7kn5k8
$$ 148 -206 -286 -101 101 -101 33 270 -163 -26 293 294 -179 -9 94 118 55 -19 52 -160 -119 -32 -34 -89 -117
6134a17J93k17J52r9K74j59K0Q5Oj26j99L03k63R0J32L12o72K06M17j59k6j36
$$ -117 76 -141 11 -88 186 27 47 132 138 12 -187 116 -147 -57 75 387 -285 -79 338 179 153 17
6156A7L65k58l28K76K5P9l11J87K37m68j5L53L0k08j56J62K49n03K77O4j42k53
$$ 17 382 124 -204 72 97 176 -135 52 289 -179 -194 159 189 -19 -175 -13 236 -267 10 74 -68 -321
6178c21N82j94j7j2n3M4n8r2K71j83k8N6K08l14R7R4j93O8k22L13j60o5J39K59
$$ -321 261 67 50 38 -15 29 -29 -121 150 -33 -61 -5 203 -111 -14 80 -113 -45 -267 46 -114 -179 -40 219
6202B19m47L10j91K32j87q7K49k93M02j8M3n52J29L50M9j19j95P3L4O3P4m8m7
$$ 219 -228 82 -109 123 -64 -151 98 -195 207 189 232 -320 -191 159 208 89 -106 -33 1 64 138 90 43
6225D3j04K39r7k56J85K83k72J2j70K38j62j55M21R1l77p2J73J89l72q8N40k53
$$ 43 -61 178 81 -175 10 293 21 33 -137 101 -61 -216 205 296 -81 -153 20 209 -163 -251 289 36
6247C6j36K59l5r4j42J80m8j49K65L2k45p8J13QJ1j97J26Q9j64J07J72Nl97K07
$$ 36 -100 159 124 30 -112 68 20 -129 136 168 -77 -155 -42 -34 -23 -220 -94 -5 -169 -62 110 115 -282 -75
6271g5J58j88O8p8L68j90j11K04o0o6O5K68m97k5R5K35k76P2K04k49j1P1K18j64
$$ -75 83 -105 -37 -115 253 63 -48 156 96 30 95 363 -134 -159 -64 171 -105 -33 171 -78 -89 -18 200 36
6295C6Q9R8j47j65n4K29J29k20n9kN3j31K82q4r5k77M55n1l08J88J72K0j80K14
$$ 36 125 223 76 -89 -143 86 215 -5 -64 -66 -13 -144 138 54 -41 -318 137 86 -222 -34 138 158 -22 192
6319A92q0L8q4j78Q5O1J7J36k24q0O4L30o75K26M39m59K55m2R5q5j70J06L68m34
$$ 192 112 150 66 -112 -27 34 51 187 -37 -117 -53 277 -398 -172 267 -192 63 21 116 31 -139 -33 335 -99
6343i9k13L87k85n0K02J03O2m02K39J54p2m2J38j89j07K31J70k25j18K9J53k7
$$ -99 -312 75 -210 -260 -58 45 107 -295 -56 98 26 -16 122 -67 -174 57 227 2 -116 -87 66 39
6365C9M0m0J30k57J8K6K20k65j1L13n20K38j2K03m72M00L01p1m26L40k51j42j80
$$ 39 79 39 169 -88 -70 -44 176 -89 -100 213 -307 -69 -81 122 -350 50 351 280 -146 194 -57 -199 -379
6388c79O80k03K2N4j63r0j00M8R9K8j78L22j2l03J55N3j67j09K26j0L4q7J02L05
$$ -379 301 98 120 174 11 -79 -179 -131 -32 -4 -182 140 128 -175 -20 33 -134 -243 -17 -27 7 -80 22 327
6412C27k24k70L98n69K79L1J21j73l5M3J08k9J14p1L06m82K7J65k7J16j74L54
$$ 327 103 -167 231 -338 -59 -28 93 -80 -115 -72 36 7 121 50 356 -126 -99 66 39 155 -19 335
6434C35j97k57L21j45l39M6L41L8j97J96O8l43lK41j5j46N1J85j59l27J87L31
$$ 335 138 -119 202 57 -282 -236 105 143 -54 142 210 -133 -136 105 90 -56 -5 180 21 -306 -119 212
6456B12l37j39K56L1J79j98J41J40m72K72J21J22l97N7j01O1j28L18J09k95J10
$$ 212 -125 -264 -8 23 202 4 145 285 -187 85 206 328 -69 -12 -113 -52 -180 138 247 -48 62
6477F2k68R3M8J07p1kj84M99l87O8K72j24j70P0k8K51j57J73l46K65q2j31J28
$$ 62 -206 -113 -65 42 -29 -31 -215 284 -103 -35 237 113 -57 13 -15 236 79 252 -94 171 89 -42 86
6500H6j77m4P5M1k8Q6R8pm98J96K79J33m14J44J29k19J4M0k7Q6K4q0L00l36K38
$$ 86 -91 -135 -60 -19 -47 39 137 130 -368 -172 107 240 -174 -30 99 -120 -106 -66 -93 -7 17 -63 237 -99 139
6525A39J22m04J07K57J97m22m9J94j07k65J09K51j74o4K73J6l38J99J08J9n43
$$ 139 261 -143 -36 221 418 -4 -53 141 34 -231 -122 129 -45 -109 164 180 -158 41 149 168 -375
6546c75K90J31k21j69L07K75l42%J80J34j89r0M71l25mJ93r8n17M22R4N1l73J75
$$ -375 -85 46 -175 -344 -37 238 -104 -104 76 210 21 -69 402 77 73 266 168 -349 73 167 218 -155 20
6569B0M8k10P3J49J13j11l6n0j1N4j27M4J79k75K06l0j33P2P4K17l99K44j4K5
$$ 20 68 -142 -69 80 193 82 46 -4 -15 39 -88 -44 135 -140 66 36 -97 -25 49 266 -133 111 97 122
6593A22j33M9K76n19K23K08nm18J19q2J83j06k8J83p0q5J49n8k4lP0kj35K97m2
$$ 122 -11 38 314 -205 18 226 221 -197 -78 -160 23 -83 -111 72 2 -83 66 8 -16 -19 51 49 -86 211 169
6618A69m32L1p9N12m12L06J64k23p0L7K02k78j76K17J53k56K6O0K53m61L35r9
$$ 169 -263 -232 -311 201 -211 95 259 36 -34 3 205 -73 -249 -32 121 -135 -109 -49 204 -257 78 -21
6640b1J39k08r3M98l97p2J13K32o2l85K61J22l32Q0l7K12j10n3J56q3k9J35m8
$$ -21 118 -90 -183 315 -82 -154 -41 191 129 -256 5 127 -205 -125 -162 50 -60 -113 43 -40 -69 66 18
6663A8k17L23k02L3Kq0M07m14k7J41J56k82n9K24Q1r6J71l8l24J59L1J98l38r8
$$ 18 -199 124 -78 -45 -43 -123 284 -130 -157 -16 140 -142 -201 23 104 8 179 141 -183 -24 7 205 -133 -231
6687b31L17J15k51K45j73j07j07L51r5j50J10J95k71m0J53Rj13P6MM49m23k79
$$ -231 86 201 -50 195 22 -85 -192 159 64 -86 24 219 -52 -92 61 70 -43 33 37 486 63 -216
6709b16N62k65k72M8J96J39m34K86N7o2l1K05k09l25N42q2k02O5J29J0k01j47
$$ -216 346 81 -191 -143 53 192 -242 44 101 39 8 213 4 -321 221 139 -63 2 131 141 -60 -207
6731b07L82k36r7K65Q7k88NjK38l65J57M8Q9j92J30n0K72k07j5J70j40Q5K76m37
$$ -207 175 -61 -158 107 194 -94 -89 -90 148 -217 -60 -12 77 -115 15 -35 237 30 15 185 45 130 406 -31
6755c1J84k73K07J3k18K43O2n07M8L95J1J7o2p7P1k08n1M25m62K18J70k52O5j6
$$ -31 153 -120 87 100 -118 125 187 -320 -272 123 134 151 89 12 83 -125 -176 249 -213 5 175 -77 -12 -28
6779b8L11n05l5K11Q8j3k0%K77m60N7J67k8m46K83L59m20j74M64m7k07Q9j75R5
$$ -28 283 -222 -257 -46 42 29 9 9 286 -174 -117 50 22 -424 -141 218 -202 -376 88 41 -166 -77 -252 -157
6803a57l8K96J12l65P9%O1q6J30J89n4m81L11J38j94j7J74L8j62J5l8Q8j89j0
$$ -157 -195 101 213 -152 -73 -73 -12 -98 32 221 167 -314 -3 135 -59 -76 98 136 -26 -11 -49 39 -150 -160
6827a60K64l11j51J79K00l6L20k86o7j15P2K1J32l68J87J60P6m21L77Q3k87K75
$$ -160 104 -207 -358 -179 21 -15 305 19 -48 -163 -91 -70 62 -306 -119 41 117 -304 73 156 -131 144
6849A44J29L1l92L7J33k27R3J42J64k74N1K5k7r6J07P0j66j34P4P7n8k45L14j63
$$ 144 273 304 -88 -51 82 -145 -52 90 254 -20 31 56 29 -67 40 110 -56 -190 -116 -39 -97 -342 -28 -191
6873a91O2M02j56O3j93J01j18J5j21O2J94N7l54M31m65n4L08K11j73k85L57k4
$$ -191 -129 273 117 180 -13 88 -30 -15 -136 -74 120 177 -177 254 -211 -265 43 254 81 -204 153 129
6895A29l53L1N55l54j66J12o0J33r9K27j61k36M0K49R2l71J93L1Q6Q2j3j71J78
$$ 129 -224 -193 362 8 -158 -46 -106 27 -72 155 -6 -242 -202 47 139 -232 -39 -8 78 160 147 -24 154
6918A54NOj11l02K35L63l08RJ62m3l62K93j77M0l23N02j9k40j68M00j39j20j58
$$ 154 159 165 54 -248 -13 350 42 51 213 170 -192 101 -76 -36 -359 143 124 -116 -284 116 -23 -143 -301
6941c01L43j7m20L91J64k77M6J65N2k58J40J67l67L7M4m7jP7jJ70j67M5p6K05
$$ -301 42 25 -395 -4 160 -117 -71 94 146 -112 28 195 -172 -135 -91 -138 -139 -62 -63 107 -60 -15 -91 114
6965A14j58kQ6J46k9J60q4p6j20J61j90k97J97K03mj74J99l09P9O5r8K52ll09
$$ 114 -44 -46 40 186 157 317 233 157 37 198 8 -289 -92 111 107 -67 132 -177 -98 -33 -131 121 118 -191
6989a91N44m09M3R8j01J4J16j34M0j38J85k02M32m64J78K45r6j11k10K27n0j45
$$ -191 353 -56 -13 85 -16 -2 114 -20 20 -118 67 -135 297 -167 11 256 160 49 -161 66 16 -129
7011a29J71J55l10Q5J67kk12l5O0M8j38K95P4k79J26O0j91j71j16O10k24r9K06
$$ -129 42 197 -113 -28 139 137 -75 -110 -50 -2 -140 155 229 -50 76 136 -55 -226 -342 268 44 -55 151
7034A51K06m89M28k35j03k49M18%j18q9J00K6J97j09M0l44KL73k3j37j8j4P7j41
$$ 151 357 -132 296 61 -42 -291 127 127 9 -80 20 46 243 134 174 -170 -168 205 182 45 27 13 90 -51
7058e1k44N53k49k9o0K6N5j34Q9K10j71J19J28k32k24J04L68k09q8K77j36j61
$$ -51 -295 258 9 -20 -80 -54 1 -133 -44 166 -5 114 242 10 -214 -110 258 49 -39 238 102 -59
7080e9P0L9o7J17j56M44j99m8l50K81q1j96J30q5J00j08L83r0l34J32L14k33j49
$$ -59 11 50 -17 100 -56 388 189 141 -209 72 -9 -205 -75 -160 -60 -168 215 125 -209 -77 237 4 -145
7103a45N7j5j1K54J11k14j34o6M44k44j74O9J23k33R4J78Q3l84J43P4L5k91K24
$$ -145 -88 -103 -114 140 251 37 -97 -163 281 37 -137 -68 55 -178 -84 94 177 -207 -64 10 45 -246 -22
7126b2O0j99R6J7M33j15j86J39j63N2j13Q0r0j08J52j6o3J79j27m6k36M70j7j10
$$ -22 38 -161 -65 -48 385 270 84 223 60 112 -1 79 -11 -119 33 17 -46 133 6 -40 -276 194 177 67
7150F7m18M98J80m93L31l40K63p1J62j75qk15N1N50k21l36M64j71k42L56ql31
$$ 67 -351 147 327 -166 165 -175 88 17 179 4 -4 -219 -168 382 161 -175 289 118 -124 232 224 -107
7172a07j68K71J77l27J83r0o8J88m1K7p5l3P9O6p0r1L26k79K21r4j36P1k5j16
$$ -107 -275 -4 173 -154 29 -61 -129 59 18 45 -30 -63 16 82 12 -79 247 -32 189 95 -41 30 5 -111
7196a11K90m45K25L93p2k43J01n7l23K46j04J93q7k18M36n9j14KJ47l00j5J44
$$ -111 179 -266 -41 352 280 37 138 81 -242 4 -100 93 6 -212 224 165 51 53 200 -100 -115 29
7218B9p2K67l65M01k53j84Q3P3K4k14M06j9j41j51J83j25l10M63K63l31j55J23
$$ 29 -43 224 -141 260 7 -177 -94 -21 3 -211 195 176 35 -116 67 -58 -368 95 358 27 -128 -5
7240eJ58q0k60M91j10j44k18L62k92J1J0K76j57j76L26m9m46M07j45J80m63N62
$$ -5 153 73 -187 304 194 50 -168 194 -98 -87 -77 199 42 -134 192 143 -303 104 -41 139 -324 238
7262B38k59j58J8M07j49j37oK12k10n5lJ09J30l86L11R6m13J65K25l19j79L44
$$ 238 -21 -179 -161 246 97 -40 -46 166 -44 -99 -102 7 137 -249 62 158 -255 -90 135 -184 -363 -19
7284a9J0n7K4L5K22k54j50J00M27m67K41J34k74r6K56j49j98L98p6Qk47K7L20
$$ -19 -9 -66 -42 -7 215 -39 -189 -89 338 -129 112 246 -28 -124 132 -17 -215 183 107 115 -132 -105 215
7307B15l48J23j38L27j66n5Q3P7n1k60K84J20q9k86K79j6o2J11m1k36o1J35P6
$$ 215 -133 -10 -148 179 13 -42 41 118 67 -193 91 211 122 -164 115 99 37 148 107 -129 -190 -55 21
7330B1o1j14L28k27j26J88K06k31m6K66k78o7M2N29o68J27lJ84r2P7J09l0j50
$$ 21 -40 -154 174 -53 -179 9 215 -16 -62 204 -74 -141 -99 430 -238 -111 -114 70 -22 55 164 134 -16
7353a6N8n6N2M1k09KM1J90j28J03l19R7K52J71l12K02r1%k16P4K91l76J87o0N6
$$ -16 42 -14 38 79 -130 -128 -87 103 -25 78 -241 -144 108 279 -33 169 78 78 -138 -64 227 -149 38 -22 34
7378C4l5J32J39k60j91l9M31l86J42N4M8k81K78J8N2j21j10L40j5k92n8P5j70
$$ 34 -1 131 270 10 -181 -220 211 -175 -33 21 69 -212 66 84 136 15 -95 245 230 -62 -120 -45 -215
7401b15K34K03k17j03J39J12l84j57N59l1l95J45K03J95n94L22J22p7l09L68l3
$$ -215 19 222 5 -98 41 153 -231 -388 171 140 -255 -110 93 288 -306 16 138 61 -248 120 87
7422H7l7J51j64J93k27k39L51n0j15J11o7k50K03M01j85k62LK16j16k11J95J86
$$ 87 50 201 37 230 3 -236 115 65 -50 61 -6 -256 -53 348 163 -99 -96 120 4 -207 -12 174
7444A74l28M4J82J17j58m4K32r1j8j86k1K13l15K21K65j02l39O0J33k02J05L08
$$ 174 -154 -110 72 189 31 -13 219 128 110 -76 -97 116 -199 22 287 185 -154 -94 39 -163 -58 250
7466B50j13l39K97o1j27l8O6J89l15J19J87j01J3J0L4M2k20K95l22J67J44k8p30
$$ 250 137 -202 95 34 -93 -131 -65 124 -191 -72 115 14 27 37 71 113 -107 188 -134 33 177 149 -581
7489e81L61J89J69m16K77K70k00j14L37k71k92J40K17j99MO5J39Q0k70J28o0O2
$$ -581 -220 -31 138 -278 -1 269 69 -45 292 21 -271 -131 86 -113 -109 -44 95 175 -95 33 -27 35
7511C5j97K02J31j96j17J05j51J23j21pM94k10M3m8k24k1L75k36L1j24O4J7k30
$$ 35 -162 40 171 -25 -142 -37 -188 -65 -186 -193 301 91 134 86 -138 -159 216 -20 11 -113 -49 -32 -262
7534b62K25J85k70N4J55N2j33j6J07l59J81K65J06k85j2J80m4q7j48J11o1J00
$$ -262 -37 148 -122 -68 87 139 6 -10 97 -262 -81 184 290 5 -7 173 129 42 -106 5 -56 44
7556D4k26N60m55P4L43l80Q7k76J18J35n3j15R7N3M9n3J66j77j76P3L0O8pL43
$$ 44 -182 378 -77 -3 340 -40 47 -229 -111 24 -29 -144 -47 6 55 2 168 -9 -185 -112 -82 -14 -21 322
7580C22l46k70K64M05n18P6J30k44L3R8R7j11Q3j38J15j4p4K9L90l69J22J44l05
$$ 322 -24 -294 -30 375 -143 -67 63 -181 -148 -50 47 -64 19 -119 -4 -18 -92 -63 327 -42 80 224 -81
7603h1n4K08J5r3r7J39O2n7m58M70R6k65J42M3J10j73M7J31k68o8J16o2P7O1k8
$$ -81 -135 73 88 -5 -102 37 99 42 -416 54 150 -115 27 70 180 7 54 185 -83 -151 -35 -97 -20 41 13
7628A3Mj16p8L36o6M1m38M67k66K66j29j31L7J8p5l2q0K34j8m99L17Q8K89K4n8
$$ 13 17 -99 -177 159 93 134 -304 163 -103 163 34 -97 -60 -42 -117 -149 -229 5 -13 -512 -195 -107 182 206 148
7653A48n1J28j67j44J06j09K62j09p7R1L9n8j30J60M6Q7j35M8P2q8j30P3k2k57
$$ 148 97 225 58 -86 20 -89 173 64 -13 78 117 59 -71 89 135 222 87 135 207 119 -11 62 40 -217
7677b17K07J84j3j53r2K30k42p0K19J70o1k96J59o7J83k23R8j47J70o9J36j96
$$ -217 -10 174 161 8 -84 146 -96 -166 53 223 162 -134 25 -42 141 -82 16 -131 39 -30 106 -90
7699i0k5L3K29j0p9n4K63l93J10M11n35J25J72Jj45J31j22j03O2j14J83R0j03
$$ -90 -115 -82 147 137 58 4 267 -126 -16 395 -140 -15 157 158 13 144 22 -81 -19 -133 50 140 37
7722C7j21J60j8M0l9j75j35K83q2Q2P6m66M83j96K75J39l17l8M3L3j70k33K11
$$ 37 -84 76 58 98 59 -116 -251 32 -50 32 108 -358 125 -71 204 343 26 -12 31 64 -106 -339 -128
7745a28R8J20k4L6L9nj94K06P6n6J5m6k25P2K8J41l10N1J30J10j78Q9R4j33m6
$$ -128 -30 90 66 102 141 136 -58 148 224 168 183 137 -88 -16 12 153 -157 -106 24 134 -44 45 139 6 -40
7770d0k60N66l28j06K15%j08kK09j46N7p0J9O3j6m1qj51J96k8J14k27J82o1o2
$$ -40 -300 266 -62 -168 47 47 -61 -63 146 0 57 -13 6 69 53 12 4 -147 49 21 135 -92 90 29 -33
7795c3K26j68j46Q9m5Q6J1l1L0O4j37j62J08J17j31j09J97J89k14J36j04j99O
$$ -33 193 25 -121 -32 -77 9 20 -11 19 83 -54 -216 -108 9 -122 -231 -34 155 -59 77 -27 -226 -220
7818b20M11j24L7l77K21J82k01J11N2l03L28J0O1l28j86J91Q8M2p1J22N9j56J60
$$ -220 191 67 104 -273 -52 130 -71 40 92 -211 117 127 188 -140 -326 -135 -47 -5 -76 46 105 -51 109
7841A09l0kK0P4j62l5r1J39j10q5L0J55M5k80N19l79Q1o5J42QK0l85M07k16o9
$$ 109 79 77 97 171 9 -26 -117 22 -88 -173 -143 12 57 -223 296 -83 -2 -67 75 83 103 -282 125 -91 -160
7866a60J57L31l74N1J75j25k2m8P8k24j7K35p1k45r7N49l18L1J71J33k24J11j9
$$ -160 -3 328 -46 5 180 55 33 -15 63 -161 -178 57 -14 -259 -356 193 -125 -94 77 210 -14 97 78
7889G8J64m11J98L4p7k38O1J81L5j23J39K61k45k59J86l5j73L12L9j79j69K69
$$ 78 242 -169 29 63 -14 -252 -191 -10 25 -98 41 302 57 -202 -16 -51 -224 88 127 -52 -221 48
7911D8oj22m4L52j93r1k69M40K7j3j38%Nn3j52M32j30j46J03M7L8j84jkQ7J38
$$ 48 42 -80 -124 228 35 -56 -325 115 142 129 -9 -9 -4 -57 -209 223 93 -53 50 97 135 -49 -50 -52 35 173
7937A73R6l98N8L94l66j23M36k20j71J13K66k45J8r6L04l91m1K65o0J00m8m3p1
$$ 173 269 -129 -71 323 -43 -166 270 50 -121 -8 258 13 31 -65 239 -152 -193 72 12 112 64 21 -50
7960e0L12J41m44K3Mj02L52j66N8l36K00J16q7J48j99p8J2K27j49k30N05l58j9
$$ -50 262 403 -41 -18 -14 -116 236 70 128 -208 -8 108 21 169 -30 -108 -96 131 -18 -248 257 -101 -120
7983a20j29K02K99n94K33oMM4m5J86j06l28J87L42k16J42p6K3k75J89j9Q1j02
$$ -120 -249 -47 252 -342 -109 -115 -111 -67 -112 74 -32 -360 -173 169 -47 95 19 42 -233 -44 -63 18 -84
8006h4k57N68n0k5j41L5q0j5n5O4j05R9M3q0N3J06j15k7q0J84j12p4L31k14L7
$$ -84 -341 227 177 152 11 46 -34 -49 -104 -40 -145 -46 -3 -83 -30 76 -39 -66 -146 38 -74 -148 183 -31 6
8031Fl7J6R4o2K0Q6m9k81KJ89J96l73M20j51j05l44O68j77k86K68j10O5J12pj83
$$ 6 -31 -15 79 17 37 123 74 -207 -205 -16 180 -193 227 76 -29 -373 295 118 -168 100 -10 55 167 160 -23
8056b3n5O6jq6J39j50J95l95L75J9o0j85J27K21k18P7J72j9k01L8k32K97N5j46
$$ -23 -78 -12 -13 -99 40 -110 85 -310 65 84 24 -161 -34 187 -31 46 218 199 -2 36 -196 101 156 10
8080A0J24p3J16l23j2K72k82L93k71j4k3K9L95l96o9K16n3k9n8J57j33J96J46
$$ 10 134 61 177 -146 -158 114 -168 225 -46 -60 -83 -54 341 -55 -124 92 39 10 -48 109 -24 172 318
8103C18m36j33K11K71k83q8J58jPn7J66M5l36M7L02k93p5k0J14J71k5j76K5LJ70
$$ 318 -118 -251 -40 231 -52 -140 18 17 24 -33 133 178 -158 -111 191 -102 -177 -197 -83 88 63 -113 -88 -85 85
8128H5R9m04J32j30K46ok7l19L97q7P5Q1n0l7R8j20N7l25K98J5k71J18j09J23
$$ 85 184 -220 -88 -218 28 22 -5 -324 73 -14 61 142 92 55 153 33 90 -235 63 78 -193 -75 -184 -61
8152f1RQ1J99k10RO2J36o14N43j23q6L0j29K52J0M9j04Q0j7j3J33k23l3k27L17
$$ -61 -52 29 228 18 27 89 225 -389 154 31 -55 -25 -154 98 108 157 53 133 116 103 236 13 -20 -247 70
8177G0j11k06J76k9J42n7L41l57j65K25L8l3k07M15
$$ 70 -41 -247 -71 -100 42 -15 326 -31 -196 29 67 34 -173 242
8191B42
$$ Imaginary data points
##PAGE= N=2
##DATA TABLE= (X++(I..I)), XYDATA
0@%%%%%%%%%%%Qj6J6j6K4l2L2m0N1n9P2q8J04j21J45j69J93k25K60k99L42l90
$$ 0 0 0 0 0 0 0 0 0 0 0 0 8 -8 8 -8 16 -16 16 -24 27 -32 40 -48 56 -65 80 -89 104 -121 139 -160 182 -208
33b08M43n02N66o37P16p98Q90r94J107j229J364j512J672j847K037k245K475k726
$$ -208 235 -267 299 -338 378 -420 470 -524 583 -646 718 -794 878 -969 1068 -1177 1298 -1428
51a428L001l308L650m029M451m931N478o104O835p700Q742j0026J1653j3794J6754
$$ -1428 1573 -1735 1915 -2114 2337 -2594 2884 -3220 3615 -4085 4657 -5369 6284 -7510 9244
66I244k1136K8386m3167J25461k72386n3686M95986j40300l78834J49438L18386
$$ 9244 -11892 16494 -26673 98788 -173598 -227284 268702 128402 -250432 -100994 217392
77B17392k09442k23741J68643J62939j46052q8948Q5286N6294l5771p291o462
$$ 217392 7950 -215791 -47148 115791 -30261 -119209 -33923 22371 -13400 -20691 -27153
88b7153Q217M0897J2370m4528Q122L7830k66p360J06k8041K5278N2361o3684p3497
$$ -27153 -18936 21961 34331 -10197 -2075 35755 35489 28129 28235 194 25472 77833 14149 -59348
102e9348R8999N6257j40611m4811J49826K815j55596J7636J29099m4260r9719
$$ -59348 39651 95908 -44703 -89514 60312 63127 -92469 -74833 54266 10006 -89713
113h9713N0616O3530m3603k3714K8802K976J0386J8965m1853m036R0156j4205
$$ -89713 -39097 24433 -19170 -42884 -14082 -11106 -720 18245 -23608 -27644 62512 48307
125D8307j14185O5864J28865j16753j13254J67654P5194k08542k8020K18248l3608
$$ 48307 -65878 -14 128851 12098 -101156 66498 141692 -66850 -94870 123378 89770
136H9770k19501P5603J86321j21089j54271J36845J02866j46619n7472J35882
$$ 89770 -129731 -54128 132193 11104 -143167 -6322 96544 -50075 -107547 28335
146B8335J3484j11242K4094Q3851m1520m4936N8002K4860n2427k265N7286L719
$$ 28335 41819 -69423 -45329 38522 -2998 -47934 10068 34928 -17499 -19764 37522 41241
158D1241n5774m554P0905J1356r1369j6022J14985P628j45679M14J60810k5625
$$ 41241 -14533 -19087 51818 63174 -28195 -44217 70768 78396 -67283 -66869 93941 68316
170F8316j80006M2495J77567p1057j72847Q9122J50326j05619j18476J11817Q2101
$$ 68316 -111690 -69195 108372 37315 -135532 -46410 103916 -1703 -120179 -8362 73739
181G3739r9369l8916Q0097J2272m0959J2647Q378j2582K8641J0065m9344N220
$$ 73739 -25630 -64546 15551 27823 -13136 -489 7889 -4693 23948 34013 -15331 -10111
193a0111O1347k0136o2679L0500N1432m1833m1661L9535J9347l9895n484K4784
$$ -10111 51236 31100 -31579 -1079 50353 8520 -33141 6394 25741 -14154 -19638 5146
205E146j4754j0892K3094j1625k5676L0511K0519m1138o799M8335j009m0518J2152
$$ 5146 -9608 -20500 2594 -9031 -34707 -4196 16323 -24815 -31614 16721 15712 -24806 -12654
218a2654L7345q649k6509P895K5741K47k5414m209K9418N644l7657o402M2253
$$ -12654 24691 16042 -10467 -2572 23169 23416 -1998 -6207 23211 28855 -8802 -15204 27049
231B7049j970n4237P928N7618k5978o4297M1497N8461o4311m7304Q1561K6539
$$ 27049 25079 -29158 -21230 36388 10410 -53887 -12390 46071 -18240 -65544 16017 42556
243D2556r2435K319R5622k6851q4694N3783P2474o7855m8930Q1465L0646q3491
$$ 42556 -49879 -47560 48062 21211 -63483 -9700 62774 -5081 -54011 27454 58100 -25391
255b5391r193Q4459q059q0678K2009P2240l4654o4940L8321N2188m3199m7444
$$ -25391 -34584 49875 41816 -38862 -16853 55387 20733 -44207 -5886 46302 3103 -44341
267d4341L8594M1062l9917m2031L8664M1272m2563l9779M8202L6499n1521k5434
$$ -44341 -5747 35315 -4602 -46633 -7969 33303 -9260 -49039 -837 35662 -15859 -41293
279d1293N5765J6914n1631l088M9683m434l9465J3952L1470j8630j9667K0133
$$ -41293 14472 31386 -20245 -23333 26350 21916 -17549 -3597 27873 9243 -10424 9709
291I709Q145k0010O42J3435j0148q168J0324l341j0201Q334J685j3824O623J1260
$$ 9709 17854 -2156 -1514 11921 1773 -6395 3929 588 -9613 -1279 406 -13418 -6795 4465
305D465j5801m989K2746l011k5243J5932K7250k5196k1531L7363J7444m3472o410
$$ 4465 -11336 -16325 6421 3410 -21833 -5901 21349 -3847 -25378 11985 29429 -14043 -20453
318b0453N0385l282n2363J5669N1104k7019m7914L4360M0477m2432l5695M4740
$$ -20453 29932 26650 -25713 -10044 41060 14041 -33873 487 40964 -1468 -37163 7577
330G577K7415n0098k3508N1805J6274n6970j0167O0541J954o2382Q192O4915j8006
$$ 7577 34992 -15106 -38614 13191 29465 -27505 -37672 22869 24823 -37559 -29367 35548 17542
343A7542o2270L1271O1004m1290n3554N4497M6445o3049l4406P0982K1246p4950
$$ 17542 -44728 -13457 47547 6257 -47297 7200 53645 -9404 -43810 27172 48418 -26532
355b6532o749P4329r388p1139K0966O1653l1956n3629L6342M1645m0553l2734
$$ -26532 -33281 41048 31660 -39479 -18513 43140 11184 -42445 -6103 35542 -5011 -37745
367c7745M0154K2835l8307j5435L5413J0276l0175n867K7163N697k1853l814K0321
$$ -37745 2409 25244 -13063 -28498 6915 17191 -12984 -18851 8312 14009 -7844 -11658 8663
380H663N525j7457m611J7311N430j7355m650J6653L662j7078m081J5629K628j7299
$$ 8663 14188 -3269 -7880 9431 14861 -2494 -7144 9509 13171 -3907 -7988 7641 10269 -7030
394g030l397J5971J371j7695r86J8055r93k0292L445K2732o811k3510J3090K5002
$$ -7030 -10427 5544 6915 -10780 -11766 6289 5296 -14996 -11551 11181 4370 -19140 -6050 18952
408A8952j8095k3227K6947K1479l3544j5555M1586R434m6925o59N0605r831n2098
$$ 18952 857 -22370 4577 26056 -7488 -23043 18543 27977 -18948 -19607 30998 21167 -30931
421c0931J9996M9472l1389m6724M0205L8836m9051l1060N3896K0144n7797r601
$$ -30931 -10935 38537 7148 -39576 629 39465 -9586 -40646 13250 33394 -24403 -34004
433c4004N8154p33n7018J1263N4945j9684m9926K8392M5869l4742l7780M0970
$$ -34004 24150 23417 -33601 -22338 32607 12923 -37003 -8611 37258 2516 -35264 5706
445E706L1038m4234k2469M6740J4653m6489q026M4971P15m3490N116L8906j1857
$$ 5706 36744 -7490 -29959 16781 31434 -15055 -23081 21890 22605 -20885 -15769 23137 11280
458A1280l4910J6329K7733k0613k1792K1868J4985k2099q909K0789M451j8095
$$ 11280 -23630 -7301 20432 -181 -21973 -105 14880 -7219 -16128 4661 9112 -8983
470h983o48J6976r00j3732K103J2956j019j0854K25J0233K980j0556o122J1955
$$ -8983 -9631 7345 6445 -7287 -5184 7772 6753 -4101 -3876 6357 9337 -1219 -7341 4614
484D614Q785j6019j1004J9478J0722k4141j0621K6985Q083l0189n902L0861L010
$$ 4614 13399 -2620 -13624 5854 16576 -7565 -18186 8799 16882 -13307 -19209 11652 14662
497A4662l2388J256L3029o272l1505J2415K9736j8262k3977K4027J8554k7698
$$ 14662 -17726 -16470 16559 10287 -21218 -8803 20933 2671 -21306 2721 21275 -6423
509f423j0816L0599M505l2919L043L4914j0807l6184J8844L4980k7547l3102L4934
$$ -6423 -17239 13360 17865 -15054 -12011 22903 12096 -24088 -5244 29736 2189 -30913 4021
522D021K7138m2177k0730M5608J3038m7951n835M8098j025m6842P918M5471j5037
$$ 4021 31159 -11018 -31748 13860 26898 -21053 -26888 21210 20185 -26657 -18739 26732 11695
535A1695m1148K2457L6623k8596k8403L3216K0435l4078j2632L3273O818l1632
$$ 11695 -29453 -6996 29627 1031 -27372 5844 26279 -7799 -20431 12842 19660 -11972
547a1972k201K9464j757k7855M132K5844p830k3307R706J8633j1095j4004R670
$$ -11972 -14173 15291 13534 -14321 -10189 15655 7825 -15482 -5776 12857 1762 -12242 -2572
560b572J0159q027p575O210O518m648n956M697N888m751l783N363K635m801j128
$$ -2572 7587 -440 -8015 -1805 4713 65 -5891 -1194 4694 -57 -3840 1523 4158 -643 -1771
575a771M250J790m335m024P005N297j0828o497J5616M525k0303k770K3206j06
$$ -1771 2479 4269 -66 -4090 2915 8212 -2616 -9113 6503 11028 -9275 -12045 11161 11055
589A1055k6404K586K8555n019l1369Q619L3149j2850l3772J9153L1968k4159k7192
$$ 11055 -15349 -12763 15792 10773 -20596 -11977 21172 8322 -25450 -6297 25671 1512 -25680
602b5680K8997K1383l1232j4196L2356P532l1850j036L1013n713k9777J2304K7529
$$ -25680 3317 24700 -6532 -20728 11628 19160 -12690 -13726 17287 11574 -18203 -5899 21630
615B1630j9930k3781K5958J7921l1303j1782L3755N564l5067m91L5395m555l4973
$$ 21630 1700 -22081 3877 21798 -9505 -21287 12468 18032 -17035 -17526 17869 13314 -21659
628b1659R215L4629j3901l2521J9323K9056k3483k3149K6699J6987k6920j1139
$$ -21659 -12444 22185 8284 -24237 -4914 24142 659 -22490 4209 21196 -5724 -16863
640a6863K6588N968k5202j903K3247j836k1454N021J8740q331j5324R604J1019
$$ -16863 9725 15693 -9509 -11412 11835 9999 -11455 -6434 12306 3975 -11349 -1745 9274
653I274r771p543P558N264m877m776K269N848o40p217R37Q318o17q574J297Q701
$$ 9274 -497 -8040 -482 4782 -95 -4871 -2602 3246 2606 -4611 -3674 4644 4027 -4547 -3250 5451
669E451l31j0330J160J1492k301j3148N712J2992j0147j1807J4513Q556j7787
$$ 5451 5120 -5210 -4050 7442 5141 -8007 -2295 10697 550 -11257 3256 11812 -5975
682e975n322J9317J658k0639J040K1971l935k4348P920K6634j3512k7247K0505
$$ -5975 -11297 8020 9678 -10961 -9921 12050 8115 -16233 -8313 18321 4809 -22438 -1933
695a933K5415k5835k1308L0273J6312l2577j0421L3453N847l4415o66L4856n235
$$ -1933 23482 -2353 -23661 6612 22924 -9653 -20074 13379 19226 -15189 -15855 19001 13766
708A3766l4180J1560L1704j8875k6706K4689J9454k8837j1922K9682M942k8996
$$ 13766 -20414 -8854 22850 3975 -22731 1958 21412 -7425 -19347 10335 15277 -13719
720a3719M71K7374m331k5973Q232K4698j2643k1854J6687J8502j9775j3466K1106
$$ -13719 -13248 14126 9795 -16178 -7946 16752 4109 -17745 -1058 17444 -2331 -15797 5309
733E309Q610j9750m920J7584K379j5555p97J4209m66j3433J837J2277l516j0304
$$ 5309 13919 -5831 -10751 6833 9212 -6343 -7140 7069 6603 -6830 -4993 7284 3768 -6536
747f536M237P467m104n074K542L134j13l098j981M780K907o964k431Q665K313
$$ -6536 -2299 5168 1064 -4010 -1468 1666 1553 -1545 -3526 1254 4161 -2803 -5234 3431 5744
762E744r818j763J1419J606j3356p84J6139k443j8054O693J8799j1672j7948J6521
$$ 5744 -4074 -5837 5582 7188 -6168 -6952 9187 6744 -11310 -4617 14182 2510 -15438 1083
776A083J4706j9904j1150K2312O930k4028k824K4800j078k6468O447K6762j2115
$$ 1083 15789 -4115 -15265 7047 13977 -10051 -12875 11925 10847 -15621 -9174 17588 5473
789E473k4954J7550K1377k2103j6419K5544J1567k7248o393K7707K210k7761K253
$$ 5473 -19481 -1931 19446 -2657 -19076 6468 18035 -9213 -15606 12101 14311 -13450 -11197
802a1197K7335p101k6594J2330K4112j7074k0317K0636J5354k3253r851K3495
$$ -11197 16138 9037 -17557 -5227 18885 1811 -18506 2130 17484 -5769 -15620 7875
814G875N144k2954j205K1702k424k0354O373J8526r431j6140J2848J1827j3992
$$ 7875 13019 -9935 -11140 10562 8138 -12216 -5843 12683 3252 -12888 -40 11787 -2205
827b205p402J3218M134j2123r05R835j90p651J33O270m95n205Q02L903j088k193
$$ -2205 -9607 3611 7745 -4378 -5283 4552 4362 -3289 -3156 3114 2619 -2586 -1784 2119 1031 -1162
843a162J81J000J155n03l336P87N889k918p091N838O608p909n506R856M077j0856
$$ -1162 -981 19 1174 671 -2665 -1878 4011 1093 -5998 -160 6448 -1461 -6967 2889 6966 -3890
859c890l111J2499J766j4204L6J6154l055j7287P197J6924j1537j5675J5868J2537
$$ -3890 -7001 5498 7264 -6940 -6904 9250 6195 -11092 -3895 13029 1492 -14183 1685 14222
873A4222j8602r215K0197N998k1712k429K2568j377k3511O132K3413j1209k1827
$$ 14222 -4380 -13595 6602 12600 -9112 -11541 11027 9650 -13861 -7729 15684 4475 -17352
886a7352J6578J7988k0254j3471K2541Q866k3607l816K3501j75k3227M257K2114
$$ -17352 -774 17214 -3040 -16511 6030 14896 -8711 -12527 10974 10799 -12428 -8171 13943
899A3943q203k0417J1838J7935j5524j3910J7827R201j8422n216J8035J573j6960
$$ 13943 5740 -14677 -2839 15096 -428 -14338 3489 12690 -5732 -10948 7087 8660 -8300
912h300J219J5362l329j3733N335J2074p190r840Q554P536r164m709Q815K120
$$ -8300 -7081 8281 4952 -8781 -3446 8628 1438 -8402 152 7688 -1476 -6185 2630 4750
926D750p185q57N549m5l715L0K786K77j908n55O59J381n8l031k7M312j66n990
$$ 4750 -2435 -3292 2257 2212 -1503 -1473 1313 1590 -318 -873 -214 1167 1109 -1922 -1949 2363 2197 -3793
944c793J076P966l478q450N780Q891q794p610J0788O361j3019m265J4375K358
$$ -3793 -2717 5249 1771 -6679 -899 7992 -802 -8412 2376 8737 -4282 -8547 5828 8186
958H186j5920J180J6560m523j7122Q565J5737j1936j3716J4869J1292j7641p967
$$ 8186 -7734 -6554 10006 5483 -11639 -3074 12663 727 -12989 1880 13172 -4469 -12436
971a2436J9305M293k0291q94K0919l170k0437O662J9697j0796j7314J4233J4140
$$ -12436 6869 11162 -9129 -10023 10896 7726 -12711 -6049 13648 2852 -14462 -229 13911
984A3911j6507j0701J8507O717j9128l043J9459q18j8781M348J7582p831j5793
$$ 13911 -2596 -13297 5210 11927 -7201 -10244 9215 8397 -10384 -6036 11546 3715 -12078
997a2078J1217J2645j3091r663J4146O404j4419l305J3939L36j2534J713J0870
$$ -12078 -861 11784 -1307 -10970 3176 9580 -4839 -8144 5795 6131 -6403 -4690 6180
1010F180l038r384M234P386m836n210M874L536m482j754L180J000j972l36P68
$$ 6180 3142 -6242 -2008 5378 542 -4668 206 3742 -740 -2494 686 1686 -286 -622 146
1025A46N45l8r42q65J586J547k798j825L741J874n182j040O887q30p692K272Q259
$$ 146 691 653 -289 -1154 432 1979 -819 -2644 1097 2971 -2211 -3251 3636 2806 -4886 -2614 5645
1042E645m023q747O545Q223q496p497J0984N875j2985l637J4265J587j6009K091
$$ 5645 1622 -7125 -580 7643 -853 -8350 2634 8509 -4476 -8113 6152 7739 -8270 -6179
1056f179J6400n580j5303Q031J4473j1477j2208J3762J0022j6196o945J7762L127
$$ -6179 10221 4641 -10662 -2631 11842 365 -11843 1919 11941 -4255 -11200 6562 9689
1069I689j8253L49J8292m300j7322P736J5887j0477j3544J2826J0701j4505p500
$$ 9689 -8564 -8215 10077 5777 -11545 -3809 12078 1601 -11943 883 11584 -2921 -10421
1082a0421J5525M222j5857r64J5211k071j4070M572J2966p175j0706Q890Q025
$$ -10421 5104 9326 -6531 -7495 7716 5645 -8425 -3853 9113 1938 -8768 122 8147
1095H147r354o034J0141L406j0463j181R778m18q838J952P722l381n646L602M045
$$ 8147 -1207 -7241 2900 6306 -4157 -5338 4440 4022 -4816 -2864 4858 1477 -4169 -567 3478
1110C478l535k543L209J104j484j001L81P57P40q18j708Q39L252k141l845L267
$$ 3478 -57 -2600 609 1713 229 -772 -391 366 1106 288 -1420 -581 2671 530 -3315 -48
1126d8M100n199l570O631L118q433j196Q874l59r542K485R496m659r096O689Q676
$$ -48 4052 -1147 -4717 1914 5032 -3401 -4597 4277 3918 -5624 -3139 6357 1698 -7398 -709 7967
1142G967r255p003J1357M991j2754k455J3684k03j4011K989J3797n947j3103Q589
$$ 7967 -1288 -8291 3066 8057 -4697 -7152 6532 6329 -7682 -4693 9104 3157 -9946 -1357
1156a357J1720j0720j0117J2772P833j4657m871J5960J622j6088J719J5288m862
$$ -1357 10363 -357 -10474 2298 10131 -4526 -9397 6563 8185 -7903 -6184 9104 4242
1169D242j4131P554J2022r451r497J0698P471j1978n060J2879K356j3187Q23J2038
$$ 4242 -9889 -2335 9687 236 -9261 1437 8908 -3070 -8130 4749 7105 -6082 -5259 6779
1183F779l351j0328N333Q267o556o104P059L827o342l298P015J206o171k77N824
$$ 6779 3428 -6900 -1567 6700 144 -5960 1099 4926 -1416 -4714 2301 3507 -2664 -2941 2883
1198B883q82n100K415L312k591j826K264N00j108j87J02mJ023m38j499O59K131
$$ 2883 2001 -3099 -684 2628 37 -1789 475 975 -133 -320 -218 -222 801 363 -1136 -477 1654
1215A654j062k816J871L208k404m682M588M402o033l871P868K178r145j50R686
$$ 1654 592 -2224 -353 2855 451 -4231 357 4759 -1274 -5145 2723 4901 -4244 -4394 5292
1230E292j856r676L548R582n476q973P477Q032r335o415J1260M085j2789j222
$$ 5292 3436 -6240 -2692 6890 1414 -7559 -82 7950 -1385 -7800 3460 7545 -5244 -6466
1244f466J3260j654j3082M695J1719o590j0447Q438Q914j0218p091J1843M737
$$ -6466 6794 5140 -7942 -3247 8472 1882 -8565 -127 8787 -1431 -8522 3321 8058
1257H058j2750k312J3160m85j2814L008J1874n686j0216P438Q036p833p014R359
$$ 8058 -4692 -7004 6156 5671 -7143 -4135 7739 2053 -8163 -725 7311 -522 -7536 1823
1271A823M952r679l218J0171Q66r883J747Q690l319p580M831N521n177l767M941
$$ 1823 6775 -2904 -6122 4049 4915 -4968 -3221 5469 2150 -5430 -599 4922 -255 -4022 919
1286I19K310m582j170M385L04m039L20L281j075j867J422M91j296P17J18j395
$$ 919 3229 -1353 -2523 1862 2166 -1873 -1553 1728 653 -1214 208 699 -597 120 238 -1157
1302a157J306J464k542o77L164P8l815Q01L848j272m636K429M956l970m438N504
$$ -1157 149 1613 -929 -1606 1558 1636 -2179 -1378 2470 1198 -3438 -1009 3947 -23 -4461 1043
1318A043M163p223l045Q574P76r128J089Q949k602q471M051Q120n437p967P493
$$ 1043 5206 -2017 -5062 3512 4288 -4840 -3751 5198 2596 -5875 -1824 6296 859 -7108 385
1333C85O904q924n709J0972L288j2243j08J2076k612j1263M836R981o275q736
$$ 385 7289 -1635 -7344 3628 6916 -5327 -5435 6641 4029 -7234 -2398 7583 1308 -7428
1347g428P278P869r120o163J0619L447j1027j125J1673j766j1105M528R151o215
$$ -7428 -150 7719 -1401 -7564 3055 6502 -4525 -5650 6023 4257 -6848 -2320 6831 616
1361F16p067O854M892o681m002P309L053p781j081P326j85p350K002N989k971
$$ 616 -6451 403 5295 -1386 -5388 1921 4974 -2807 -3888 3438 3253 -4097 -2095 3894 923
1376I23m572M175K431l879j430L110R76k463m69J973K55j805K35J272p79k44P68
$$ 923 -3649 526 2957 -922 -2352 758 1734 -729 -1198 775 1030 -775 -540 732 -47 -291 477
1393D77p42m10J946r41k370K699J717l850r62M778Q1n249J104N287k339n263L413
$$ 477 -265 -675 1271 330 -2040 659 2376 -1474 -2436 2342 2423 -2826 -1722 3565 1226 -4037 -624
1410f24N096m477n077O568L912p884k422Q852J67r389K035R067m023q117N205
$$ -624 4472 -5 -5082 1486 5398 -2486 -4908 3944 4111 -5278 -3243 5824 1801 -6316 -1111
1425a111P667o497o808P991N410r513l277J0473J083j0963J204J0581l824r012
$$ -1111 6556 59 -6749 1242 6652 -2861 -6138 4335 5418 -5545 -4341 6240 2416 -6596
1439f596N407P841o532o726P597N333q531l771R347J905r919M51R482k533q262
$$ -6596 -1189 6652 120 -6606 991 6324 -2207 -5978 3369 5274 -4645 -4194 5288 2755 -5507
1454e507M136O595n238m758N361L835n973k086N822J264n887N7N449j384m627
$$ -5507 -1371 5224 -14 -4772 589 4424 -1549 -3635 2187 3451 -2436 -2379 3070 1686 -2941
1469b941K504K938l126j544L003L53j837M7J460n14o90O20l59k71L52P34j223
$$ -2941 -437 2501 -625 -2169 834 1187 -650 -603 857 343 -347 273 -86 -357 -5 729 -494
1486d94l40J852m90k578J617K963k677k934M304J614m951m87N177n46n063J335
$$ -494 -834 1018 528 -2050 -433 2530 -147 -3081 1223 2837 -2114 -2601 2576 2030 -3033 -1698
1502a698N637l066n052L886N098n366m730P346K960q062j470Q632o01q846K977
$$ -1698 3939 873 -4179 -293 4805 -561 -5291 2055 5015 -3047 -4517 4115 3514 -5332 -2355
1517b355Q115m508p091N667O220o619n395P857M193r120k225R702j18r899K601
$$ -2355 5760 1252 -5839 -172 6048 -571 -5966 1891 6084 -3036 -5261 4441 4323 -5576 -2975
1532b975Q868m417p512N925N900o437m891P229L405p561j763P689Np664K075O626
$$ -2975 5893 1476 -6036 -111 5789 -648 -5539 1690 5095 -2466 -4229 3460 3465 -4199 -2124 4502
1548D502l359n622M247M423m848k917M958J455m595m67M126j32l753O79L406j561
$$ 4502 1143 -4479 -232 4191 -657 -3574 1384 2839 -1756 -2223 1903 1771 -1982 -1303 2103 542
1564E42k584K166J627k445k48J603p7j109O90J85r81O17R60j668j70J898L5k696
$$ 542 -2042 124 1751 -694 -942 661 584 -525 165 350 -631 -14 946 -722 -892 1006 1041 -1655
1582a655L87L133j414l034K367L240l603k617N338Q01n449P1N933j442n912K532
$$ -1655 -1268 1865 451 -2583 -216 3024 -579 -3196 2142 2943 -2506 -2435 3498 2056 -3856 -1324
1598a324N470l469n473N164M481o322l242O998K281q079k84P784j017p886L142
$$ -1324 4146 677 -4796 368 4849 -1473 -4715 2283 4564 -3515 -3799 3985 2968 -4918 -1776
1613a776P142m536o253N462N342o713l929P729K321q055o42Q154j294p817L038
$$ -1776 5366 830 -5423 39 5381 -1332 -5261 2468 4789 -3266 -3908 4246 2952 -4865 -1827
1628a827P237m787n458N015M569n877l200O151J819o167l66O087r37n648K088
$$ -1827 5410 623 -4835 180 4749 -1128 -4328 1823 3642 -2525 -2891 3196 2259 -3389 -1301
1643a301M618k949l665L877K269l774j599L995N44l455L59K362q11j909J226J389
$$ -1301 3317 368 -3297 580 2849 -925 -2524 1471 2015 -1440 -1081 1281 470 -1439 -213 1176
1659A176j647n09J723l49j310J112L51j289L57J429j289j110J860R68k576q7K899
$$ 1176 -471 -980 743 394 -916 196 547 -742 -385 1044 -245 -1355 505 1473 -1103 -1190 1709
1676A709m67l469J538L609k847l231L490L152m472k373N464P71n555K29N917j536
$$ 1709 1242 -2227 -689 2920 73 -3158 332 3484 -988 -3361 2103 2874 -2681 -2452 3465 1929
1692A929n938K982N355m228m908N818L718o551k545P127J069p567O33P685k557
$$ 1929 -4009 -1027 4328 100 -4808 1010 4728 -1823 -4368 2759 3828 -3739 -3106 4579 2022
1707B022o595L355N926m435n336N955L965o632k295O709R59o823K61P018k028
$$ 2022 -4573 -1218 4708 273 -5063 892 4857 -1775 -4070 2639 3598 -3225 -2964 4054 2026
1722B026o346L226N270l987m165M705K835n156j861N220R80n249N20M620j438
$$ 2026 -4320 -1094 4176 189 -3976 729 3564 -1592 -3453 1767 2747 -2502 -1982 2638 1200
1737A200l928K286K916k676j684K325J328k868j33K681n91k102J082J178j227
$$ 1200 -2728 -442 2474 -202 -1886 439 1767 -1101 -1234 1447 856 -1246 -164 1014 -213
1752b13p25J402m56o05M73R23q77o44J522m79j943J469J919k504j005K713M73
$$ -213 -938 464 8 -597 -124 799 -78 -722 800 321 -1622 -153 1766 -738 -1743 970 1443
1769A443l087j61M406j718l711K396L551l550k760M105K313m976j343N438O06
$$ 1443 -1644 -1805 2601 883 -2828 -432 3119 -431 -3191 914 3227 -1749 -3092 2346 2952
1784B952o140J032N785k097n779L558N276m794m295O044K932o605j500O475J53
$$ 2952 -3188 -2156 3629 1532 -4247 -689 4587 -207 -4502 1542 4474 -2131 -3631 2844 2997
1799B997o489R11O704k432o235L891N183m917l925N228K922n875j642O428j99
$$ 2997 -3492 -2581 4123 1691 -4544 -653 4530 -387 -4312 916 3838 -2037 -3679 2749 2550
1814B550n556R27N298k003m526K689L980l470l053L898K064m023q51M003n02l398
$$ 2550 -3006 -2079 3219 1216 -3310 -621 3359 -111 -3164 734 2798 -1225 -2076 1927 1425 -1973
1830a973J265K793k238j723K266Q85j804n72J975q1j866Q65J340j175q67J296
$$ -1973 -708 2085 -153 -1876 390 1275 -529 -1101 874 793 -1073 -208 1132 -43 -910 386
1846C86K7j572J116J030j339o49J756m3j897P30J889j270j783J971J452k491j242
$$ 386 413 -1159 -43 987 -352 -1001 755 712 -1185 -455 1434 164 -1619 352 1804 -687 -1929
1863a929L274J85l625P29M208k098l698K825L374m116k334M817J476n404j60N154
$$ -1929 1345 1530 -2095 -1366 2842 744 -2954 -129 3245 -871 -3205 1612 3088 -2316 -2476 2678
1879B678l06n680J805N316l082m912M221M019m690l618N956J995o293m47N918
$$ 2678 2372 -3308 -1503 3813 731 -4181 40 4059 -631 -4249 1707 3702 -2591 -3038 2880
1894B880j94n991J603N330k529n170L838M124m446l011N003J589n085m87M771
$$ 2880 2686 -3305 -1702 3628 1099 -4071 -233 3891 -555 -3566 1437 3026 -2059 -2546 2225
1909B225l78m218J125L474j605l093K309K563l015j707L499M73l025K43K995j451
$$ 2225 1847 -2371 -1246 2228 623 -2470 -161 2402 -613 -2320 1179 1652 -1373 -1130 1865 414
1925D14j879J623J109j735n25J547Q6j635N56J192n66j141J289N88j971K52J898
$$ 414 -1465 158 1267 -468 -993 554 640 -995 -439 753 187 -954 335 923 -1048 -796 1102
1942A102q93j569J868R50k399MK357j320j555J321J743j994j474K758J076l130
$$ 1102 209 -1360 508 1458 -941 -937 1420 100 -1455 -134 1609 -385 -1859 899 1975 -1155
1958a155p47L831l85m149J852L710k630l741M113K458m487j749M949Q18m941K0
$$ -1155 -1902 1929 1544 -2605 -753 2957 327 -3414 699 3157 -1330 -3079 1870 2688 -2253 -2233
1974b233M942p18n098J875M946l224m757M510L606n200k350N553J148n259l11
$$ -2233 2709 1991 -3107 -1232 3714 490 -4267 243 3849 -1351 -3701 1852 3000 -2259 -2570
1989b570N097n78m808J561M463k630l810L173L185l863j983M140J012m370M09
$$ -2570 2527 1949 -2859 -1298 3165 535 -3275 -102 3083 -780 -2763 1377 2389 -1981 -1572
2004a572L703j268k701J313K377j783j840K173J332k423o63K359k20j832Q19J424
$$ -1572 2131 863 -1838 -525 1852 69 -1771 402 1734 -689 -1352 1007 787 -1045 -226 1198
2020A198j349q26J579jj550O89J087o70p96P06P53j036n05J348K01j958Q49J361
$$ 1198 -151 -977 602 601 -949 -260 827 157 -639 67 820 -216 -721 627 828 -1130 -281 1080
2038A080j500j233K406M28k528O53K419j453k194K084J572k283j340K669P56k968
$$ 1080 -420 -1653 753 1181 -1347 -694 1725 272 -1922 162 1734 -549 -1889 780 1536 -1432
2054a432k42L850j067l672J999L707l151l026L807K132m629q67M549M67m844N07
$$ -1432 -1674 2176 1109 -2563 -564 3143 -8 -3034 773 2905 -1724 -2591 1958 2425 -2419 -1912
2070a912M926j570m462K252M473l666l510M200K557m711j361M494N60m468L80
$$ -1912 3014 1444 -3018 -766 3707 41 -3469 731 3288 -1423 -2784 1710 2270 -2198 -1818
$$ [...]
8191H2
##END NTUPLES=NMR FID
##END=
