##TITLE=1H_Pr SAPip
 CDCl3, 8 sc, 
 3.06.2021
##JCAMPDX= 6.0         $$ Bruker NMR JCAMP-DX V2.0
##DATA TYPE= NMR FID
##DATA CLASS= NTUPLES
##ORIGIN= UXNMR, Bruker Analytische Messtechnik GmbH
##OWNER= root
$$ XWIN-NMR		Version 3.5
$$ Thu Jun  3 11:30:33 2021 Russian Standard Time (UT+4h)  she@DPX200
##.OBSERVE FREQUENCY= 200.131506
##.OBSERVE NUCLEUS= ^1H
##.DELAY= (6, 6)
##.ACQUISITION MODE= SIMULTANEOUS
##.ACQUISITION SCHEME= undefined
##.AVERAGES= 8
##.DIGITISER RES= 18
##SPECTROMETER/DATA SYSTEM= spect
##.PULSE SEQUENCE= zg30
##.SOLVENT NAME= CD3CN
##.SHIFT REFERENCE= (INTERNAL, CD3CN, 0, 15.7039)
##AUDIT TRAIL= $$ (NUMBER, WHEN, WHO, WHERE, WHAT)
$$ ##TITLE= Audit trail, XWIN-NMR		Version 3.5
$$ ##JCAMPDX= 5.01
$$ ##ORIGIN= Bruker BioSpin GmbH
$$ ##OWNER= she
$$ F:/spectra/data/she/nmr/H-F/1/audita.txt
$$ ##AUDIT TRAIL=  $$ (NUMBER, WHEN, WHO, WHERE, WHAT)
(   1,<2021-06-03 11:29:12.82 +0400>,<she>,<DPX200>,
      <created by zg, POWCHK disabled, PULCHK disabled
       configuration hash MD5:
       00 E9 B6 7A A2 85 ED C7 34 08 36 98 17 FE 4E 26
       data hash MD5: 16K
       DF D8 A1 75 0B 48 48 25 73 3B 64 20 2E D0 A6 B2>)
$$ ##END=
$$ 
$$ hash MD5
$$ 69 20 9F A8 4C B8 BF E4 8B 4F 26 BF 95 93 B1 20
##$RELAX= 
##$RELAX= 
##$RELAX= 
##$RELAX= 
##$RELAX= 
##$RELAX= 
$$ Bruker specific parameters
$$ --------------------------
##$DU= <F:/spectra>
##$EXPNO= 1
##$NAME= <H-F>
##$PROCNO= 1
##$TYPE= <nmr>
##$USER= <she>
##$AMP= (0..31)
100 100 100 100 100 100 100 100 100 100 100 100 100 100 100 100 100 100 
100 100 100 100 100 100 100 100 100 100 100 100 100 100 
##$AQSEQ= 0
##$AQ_mod= 1
##$AUNM= <au_zg>
##$AUTOPOS= <>
##$BF1= 200.13
##$BF2= 200.13
##$BF3= 200.13
##$BF4= 200.13
##$BF5= 200.13
##$BF6= 200.13
##$BF7= 200.13
##$BF8= 200.13
##$BYTORDA= 1
##$CFDGTYP= 0
##$CFRGTYP= 5
##$CHEMSTR= <none>
##$CNST= (0..31)
1 1 145 1 1 1 1 1 1 1 1 1 1 1 1 1 1 1 1 1 1 1 1 1 1 1 1 1 1 1 1 1 
##$CPDPRG= <>
##$CPDPRG1= <>
##$CPDPRG2= <>
##$CPDPRG3= <>
##$CPDPRG4= <mlev>
##$CPDPRG5= <mlev>
##$CPDPRG6= <mlev>
##$CPDPRG7= <mlev>
##$CPDPRG8= <mlev>
##$CPDPRGB= <>
##$CPDPRGT= <>
##$D= (0..31)
0 1.2 0 0 0 0 0 0 0 0.06 0 0.03 0 0 0 0 0.0002 0 0 0 0 0 0 0 0 0 0 0 0 
0 0 0 
##$DATE= 1622705352
##$DBL= (0..7)
120 120 120 120 120 120 120 120 
##$DBP= (0..7)
150 150 150 150 150 150 150 150 
##$DBP07= 0
##$DBPNAM0= <>
##$DBPNAM1= <>
##$DBPNAM2= <>
##$DBPNAM3= <>
##$DBPNAM4= <>
##$DBPNAM5= <>
##$DBPNAM6= <>
##$DBPNAM7= <>
##$DBPOAL= (0..7)
0.5 0.5 0.5 0.5 0.5 0.5 0.5 0.5 
##$DBPOFFS= (0..7)
0 0 0 0 0 0 0 0 
##$DE= 6
##$DECBNUC= <off>
##$DECIM= 32
##$DECNUC= <off>
##$DECSTAT= 4
##$DIGMOD= 1
##$DIGTYP= 9
##$DL= (0..7)
0 120 120 120 120 120 120 120 
##$DP= (0..7)
150 150 150 150 150 150 150 150 
##$DP07= 0
##$DPNAME0= <>
##$DPNAME1= <>
##$DPNAME2= <>
##$DPNAME3= <>
##$DPNAME4= <>
##$DPNAME5= <>
##$DPNAME6= <>
##$DPNAME7= <>
##$DPOAL= (0..7)
0.5 0.5 0.5 0.5 0.5 0.5 0.5 0.5 
##$DPOFFS= (0..7)
0 0 0 0 0 0 0 0 
##$DQDMODE= 0
##$DR= 18
##$DS= 0
##$DSLIST= <SSSSSSSSSSSSSSS>
$$ [...]
##$SUBNAM2= <"">
##$SUBNAM3= <"">
##$SUBNAM4= <"">
##$SUBNAM5= <"">
##$SUBNAM6= <"">
##$SUBNAM7= <"">
##$SUBNAM8= <"">
##$SUBNAM9= <"">
##$SW= 20.0188882624521
##$SWIBOX= (0..15)
0 0 2 0 0 0 0 0 0 0 0 0 0 0 0 0 
##$SW_h= 4006.41025641026
##$TD= 16384
##$TD0= 1
##$TE= 0
##$TE2= 300
##$TE3= 300
##$TEG= 300
##$TL= (0..7)
0 120 120 120 120 120 120 120 
##$TP= (0..7)
150 150 150 150 150 150 150 150 
##$TP07= 0
##$TPNAME0= <>
##$TPNAME1= <>
##$TPNAME2= <>
##$TPNAME3= <>
##$TPNAME4= <>
##$TPNAME5= <>
##$TPNAME6= <>
##$TPNAME7= <>
##$TPOAL= (0..7)
0.5 0.5 0.5 0.5 0.5 0.5 0.5 0.5 
##$TPOFFS= (0..7)
0 0 0 0 0 0 0 0 
##$TUNHIN= 0
##$TUNHOUT= 0
##$TUNXOUT= 0
##$USERA1= <user>
##$USERA2= <user>
##$USERA3= <user>
##$USERA4= <user>
##$USERA5= <user>
##$V9= 5
##$VALIST= <valist>
##$VCLIST= <CCCCCCCCCCCCCCC>
##$VD= 0
##$VDLIST= <DDDDDDDDDDDDDDD>
##$VPLIST= <PPPPPPPPPPPPPPP>
##$VTLIST= <TTTTTTTTTTTTTTT>
##$WBST= 1024
##$WBSW= 4
##$XGAIN= (0..3)
0 0 0 0 
##$XL= 0
##$YL= 0
##$YMAX_a= 820770
##$YMIN_a= -468133
##$ZGOPTNS= <>
##$ZL1= 120
##$ZL2= 120
##$ZL3= 120
##$ZL4= 120
##$ABSF1= 10
##$ABSF2= 0
##$ABSG= 5
##$ABSL= 3
##$ALPHA= 0
##$AQORDER= 0
##$ASSFAC= 0
##$ASSFACI= 0
##$ASSFACX= 0
##$ASSWID= 0
##$AUNMP= <proc_1d>
##$AZFE= 0.1
##$AZFW= 0.1
##$BCFW= 1
##$BC_mod= 2
##$BYTORDP= 1
##$COROFFS= 0
##$CY= 11.3945322036743
##$DATMOD= 1
##$DC= 2
##$DFILT= <>
##$DTYPP= 0
##$F1P= 15.9154993809931
##$F2P= -4.1035820241983
##$FCOR= 0.5
##$FTSIZE= 0
##$FT_mod= 4
##$GAMMA= 1
##$GB= 0.15
##$INTBC= 1
##$INTSCL= 1
##$ISEN= 128
##$LB= 0.24
##$LEV0= 0
##$LPBIN= 0
##$MAXI= 10000
##$MC2= 0
##$MEAN= 0
##$ME_mod= 0
##$MI= 1.114404
##$NCOEF= 0
##$NC_proc= 0
##$NLEV= 6
##$NOISF1= 3.799351
##$NOISF2= 2.8
##$NSP= 1
##$NTH_PI= 0
##$NZP= 0
##$OFFSET= 15.70392
##$PC= 1
##$PHC0= -11483.18
##$PHC1= 15.80099
##$PH_mod= 1
##$PKNL= yes
##$PPARMOD= 0
##$PSCAL= 0
##$PSIGN= 0
##$REVERSE= no
##$SF= 200.130013532006
##$SI= 16384
##$SIGF1= 3
##$SIGF2= 2
##$SINO= 400
##$SIOLD= 16384
##$SREGLST= <1H.CDCl3>
##$SSB= 0
##$STSI= 0
##$STSR= 0
##$SW_p= 3612.71676300578
##$SYMM= 0
##$S_DEV= 0
##$TDeff= 0
##$TDoff= 0
##$TI= <>
##$TILT= no
##$TM1= 0
##$TM2= 0
##$TOPLEV= 0
##$USERP1= <user>
##$USERP2= <user>
##$USERP3= <user>
##$USERP4= <user>
##$USERP5= <user>
##$WDW= 1
##$XDIM= 8192
##$YMAX_p= 0
##$YMIN_p= 0
$$ End of Bruker specific parameters
$$ ---------------------------------
##NTUPLES= NMR FID
##VAR_NAME=  TIME,          FID/REAL,        FID/IMAG
##SYMBOL=    X,             R,               I
##VAR_TYPE=  INDEPENDENT,   DEPENDENT,       DEPENDENT
##VAR_FORM=  AFFN,          ASDF,            ASDF
##VAR_DIM=   8192,          8192,            8192
##UNITS=     SECONDS,       ARBITRARY UNITS, ARBITRARY UNITS
##FACTOR=    0.0002496,     1,               1
##FIRST=     0,             0,               0
##LAST=      2.0444736,     0,               0
##MIN=       0,             -468133,         0
##MAX=       2.0444736,     820770,          0
$$ Real data points
##PAGE= N=1
##DATA TABLE= (X++(R..R)), XYDATA
$$ [...]
2162B274k149n07J079j101j602K58J527j99o52J885J099j110m75P03k12j982j121
2179b285K314o74j012P81K466j654o43K412Q21l550j127K676r71k107L77K357
2195A81L25j298J252K283j826j572R45N68k345r31J709O42j727R28K836k92j989
2212c11J274J028k017k092J785P80k670N46K539K24j178O03J909j273k327J123
2228e7Q45k125j201K238J100j533K70K911l75k608J242Q30j934j694J084J336
2244C29j545l26K336J179j668kJ568n28k777K78J831k136r22K154J327j181o4
2261a47K302J47k879K50J101j142k044R94J978j055p21K022J516k321j98J566
2277A369o78k623m9K144j266j196K224J946j578l88J999j84k646j95J272j089
$$ plain form
2162 2274 125 -382 697 -404 -2006 -1748 -221 -420 -1072 813 1912 802 327 1030 818 -1164 -2285
2179 -2285 29 -645 -1657 -876 1590 -64 -707 1705 2526 -1024 -2151 525 -446 -2553 -2176 181
2195 181 506 -792 460 2743 917 -655 290 858 -1487 -2418 -709 -67 -1794 -866 1970 1678 -311
2212 -311 963 1991 -26 -2118 -333 447 -2223 -1677 862 1086 -92 511 2420 1147 -1180 -57
2228 -57 788 -1337 -2538 -300 800 -733 -463 2448 2073 -535 707 1537 -397 -2091 -1007 329
2244 329 -1216 -1542 794 1973 305 303 1871 1343 -1434 -1156 675 -1461 -2383 -229 1098 -83 -147
2261 -147 2155 2302 -577 -327 774 -368 -2412 -1418 560 -495 -1216 806 2322 1 -197 1369
2277 1369 691 -1932 -1981 163 -1103 -2299 -75 1871 293 -95 1904 1720 -926 -1121 151 -938
2293i38j637J618J708q26m51J901J013k065j100J425m15k151J46J564k13p25J526
2310C80K111j420o66J060m80j604r06J192l2j019M92J948R3p79Q81R38j569j384
2328g64O45J05j618m0J323P98n74P47J478k89j850K05N40j294j140O74J239r32
2346g47K27J755M02j328L53P78j224j591J03P53q07m58J706J053k92m76Q60O73
2364A740k240l06P76j018j199J172J282k09l55J510P27j449n46M36l91j352j09
2381a531R46r2o20J096J716m29q09O26L16j659j077R87j44o56L36J754P2m86P79
2400A125R77j097j827R34j36j465o85J956P71j090O85J888l17j761N20N18j627
2417f31j170J126R13r97K46J822O07j204K8J141r61k884R42J642k395l75K053
$$ plain form
2293 -938 -2575 -957 751 -75 -526 1375 2388 323 -777 648 233 -1918 -1772 -208 -421 -1146 380
2310 380 2491 1071 405 1465 985 -619 -1525 -333 -365 -1384 -892 1056 1149 370 1251 2189 620 -764
2328 -764 -119 -14 -1632 -1672 -349 449 -125 622 2100 1811 -39 166 706 -588 -1728 -1054 185 -747
2346 -747 -520 1235 1637 309 662 1440 216 -1375 -1272 -519 -1326 -1784 -78 975 683 207 1067 1740
2364 1740 -500 -806 -30 -1048 -2247 -1075 207 -2 -357 1153 1880 431 -115 321 -70 -1422 -1531
2381 -1531 -585 -677 -1297 -201 1515 1086 277 903 1219 -440 -1517 -530 -674 -1330 -994 760 832 346 1125
2400 1125 2102 1005 -822 112 -24 -1489 -2174 -218 553 -537 148 2036 1719 -42 478 996 -631
2417 -631 -1801 -675 238 -759 -513 1309 1916 712 740 1881 920 -1964 -1022 620 -1775 -2150 -97
2434i7J266j327M47J668m65j950J31P51j179j620J561J065m46l10K005R62k146
2451C16m32J282j007k391J048J073j116m15J991J006j088j17J435m48k167Q2Q37
2468a11p50j387J415J791q80m08J576R07k284o23J767j260j970J078Q40m70m49
2485a218J953J142j245o96J242k69j929p31J678j91j478J424J921o98o35J318
2501A588L53j997n56P99l44j548M95J353O01j141J206J372j577j044R19j6k079
2518a616m2J620J29j041R97J877n88j041P80L04j413j359R30K61j176L9J753Q9
2536E03k52M75N15p33j318N16M2j296m4J167O91n55M78J278k89j024K22j0q20
2555d54q02L31M37m4k09J481N89r25J99O3k98j612O6Q26n34j68P32J089m1l97
$$ plain form
2434 -97 1169 -158 289 1957 1492 -458 -327 424 -755 -2375 -814 251 -195 -505 1500 2462 316
2451 316 -116 1166 159 -2232 -1184 -111 -1227 -1642 349 1355 267 150 1585 1137 -1030 -948 -111
2468 -111 -861 -2248 -833 958 78 -330 1246 2153 -131 -754 1013 -247 -2217 -1139 -299 -769 -1218
2485 -1218 735 1877 632 -64 1178 909 -1020 -1751 -73 -264 -1742 -318 1603 905 270 1588
2501 1588 1941 -56 -612 187 -157 -1705 -1210 143 744 -397 809 2181 604 -440 479 463 -1616
2518 -1616 -1658 -38 91 -950 47 1924 1336 295 1075 1379 -34 -1393 -463 -202 -1378 -1339 414 503
2536 503 251 726 1241 508 -810 -294 -252 -1548 -1592 -425 266 -289 189 1467 1178 154 376 366 -454
2555 -454 -1256 -925 -488 -532 -741 740 1329 404 603 666 368 -1244 -1178 -352 -886 -1054 -322 767 726 329
2575C29R74Kr12r24M83k24j002L01J086M62p37M44J537j087r35M10l3j064m24
2594a314P33M93o94R01R76N46j105M52M99j254j219O34L09j208L04J507N72q91
2612B41J51J105q43j369M00L36r65q56J172J058r42J23J901j73j234j6P69j069
2630b11j326O55J007q64k20J510N14p67P7O19l51j866k22J510j218n94J279J833
2648A365j315k37J475K37j862K39O41p71j392P72J359m54p76J742O84j098p94
2665a85R18m44j500k49J433m68r76J722J238j001n73J297L17k299k52J348n26
2682b00j200O25J748n00o50J119J047j638q86Q68k05j782J16J816k96j195J714
2699E01J111j097n14R80k87j656j46J289l81r09O30J468j46j190J251O00j606
$$ plain form
2575 329 1303 1305 393 -531 -48 -272 -1274 -973 113 575 -162 282 1819 732 -203 207 174 -890 -1314
2594 -1314 -581 -88 -782 119 1095 1641 536 988 1487 233 -986 -352 -43 -1251 -947 560 1132 241
2612 241 392 1497 654 -715 -315 21 -944 -1800 -628 430 -512 -389 1512 1339 105 89 858 -211
2630 -211 -1537 -882 125 -739 -959 551 1065 298 375 994 643 -1223 -1445 65 -1153 -1747 -468 1365
2648 1365 50 -187 1288 1525 -337 -98 543 -228 -1620 -848 511 57 -719 1023 1707 609 -185
2665 -185 733 289 -1211 -1460 -27 -495 -1471 251 1489 488 -85 1212 1529 -770 -1022 326 -200
2682 -200 -1400 -775 973 473 -177 942 1989 351 -535 333 128 -1654 -1538 278 -18 -1213 501
2699 501 1612 515 1 981 694 -962 -1108 181 -200 -1109 -479 989 843 -347 904 1504 -102
2716a02j136J154k14j400L99J620k65n66J026Q43o91r48M46J55j261l86J056N58
2734B88q81L66J615l04j120O75L04j155r41O61K03r95L93J068K10j39j52J168
2752A264n38j271M34N5n81j94P06O13p06J56J332r6j132K02K00o66q50L13P22
2771c7m98j59J112P32p67r1N31k35j341J79N71l40l54N82R73n71K04M50P1j040
2791b8l78O00m50n21j09O04R3J76L20Q98n39p64M1J11o44o82Q96M03m68K20R35
2812G14J2o05J50M11n93o59P0K68o30k10J080O63p39mR64m64j232L84M46r13m95
2833a382J006M88K0j85J057j70o64l90J087q66j141K75J276o35n60J267M16p31
2851A68j27R67l61j748L99O96j26q77Q52J317n79n36Q49L48j086m38P84l90r37
$$ plain form
2716 -102 -1238 -84 -298 -1698 -1299 321 56 -510 516 1359 668 -280 166 321 -940 -1326 -270 288
2734 288 -593 -227 1388 1084 -36 639 943 -212 -1153 -492 -289 -1284 -891 177 387 248 96 1264
2752 1264 726 -545 -111 -56 -637 -831 -125 488 -218 -62 1270 1174 42 244 444 -222 -1072 -759 -37
2771 -37 -535 -694 418 1150 383 292 823 588 -753 -574 -3 -343 -697 -115 858 287 491 941 1012 -28
2791 -28 -406 194 -256 -777 -886 -282 -189 -13 307 1205 666 -98 -57 54 -590 -1272 -376 27 -441 -221 714
2812 714 726 121 271 682 89 -570 -500 -232 -862 -1072 8 671 -68 -72 892 428 -804 -420 26 -887 -1382
2833 -1382 -376 112 132 -53 1004 834 170 -220 867 1 -1140 -865 411 -224 -784 483 899 168
2851 168 41 1008 647 -1101 -702 -6 -132 -1009 -157 1160 581 45 894 1242 156 -282 502 112 -825
2870h25nJ329k16j003R90R25j149j99N29l1j231l32J062J19j014J061J119o16
2888E13o69R07K96j414k29N26L07j167L85J290o95o87J095L65o80o33N99J4r17
2907g94m93J188L05j174R53J128q32p32J027L58j344m08R93J20j023J77J440n5
2925H34q76m0Q95n03j256N66O94j153r9R04L82q92O44J069m02r98N96K84q09o60
2945h20R43M92q29j02J212O2j162N52N18q02q63N22N92j080j19J226K48n78L72
2964C84K66k18o51rP96o39n18O18M19j88o63R56K20q47K13K78n37o25M59J71K4
2985i1o03O07O74m03j04L52j49n81r3J25p7l12O42L66j06l53J50K53m52n69O72
3006e2Q3r09J60P08j87k48K87N13j21l99L50M15o16m20K53K90m37J90R05j49n02
$$ plain form
2870 -825 -830 499 283 -720 270 1195 46 -153 376 345 -886 -1218 -156 -37 -1051 10 1129 513
2888 513 -156 751 1047 -367 -596 -70 237 -930 -545 745 50 -637 458 823 143 -490 109 123 -794
2907 -794 -1287 -99 206 -968 -15 1113 281 -451 576 934 -410 -818 175 295 -728 -551 889 834
2925 834 -42 -82 813 310 -946 -380 314 -839 -938 -34 348 -544 100 1169 767 -231 365 649 -160 -820
2945 -820 123 615 -214 -316 896 958 -204 348 866 64 -799 -277 315 -765 -884 342 590 12 384
2964 384 650 432 -219 -228 568 -71 -589 29 448 260 -403 553 773 -74 139 417 -120 -745 -286 -115 -91
2985 -91 -694 -87 587 184 80 432 283 -298 -391 -266 -343 -655 -13 353 247 -106 44 297 -155 -724 -52
3006 -52 31 -878 -718 -10 -197 -445 -158 355 234 -165 185 600 -16 -436 -183 107 -330 -140 765 616 114
3027A14J93M87q04l13k59P08m25l49M31L59j42k71Q97j17n52O2J20N1m32J69M75
3048D02m06m67J048K06q37J85L50j00q91J09K33R8m64L50Q40o90l94Q66j31l10
3068cp84P02J65q74N23Q68m33p02J070K00q22l46J007n58o53q4O63K43j239Q35
3088b22Q20p43l71P22R0n85j97P27q2o91M88N47l71l30N76M47p41o00P72q1j015
3109h40K04J018m4j061M91R73n31q61R83K23j041k49J053P9p00j3J036j97q48
3128c25Q73L27q23q16P68O14j266K3J031l41m20L15O89m32p07P24K75q26j79P75
3148B79L7m36j13Q59j45p76J50P33n18n93M69K61o21l9N23L92p70p9P56l43m15
3169c89j60Q43n92l94N90N68p78k20J310j08n70j56P52o01o01M03L56m48l85O31
$$ plain form
3027 114 307 794 -10 -323 -582 126 -299 -648 -217 142 0 -271 626 509 -43 19 139 190 -242 -73 402
3048 402 -4 -471 577 783 -54 131 481 381 -510 -401 -168 -70 -534 -184 656 -34 -428 438 307 -3
3068 -3 -787 -85 80 -794 -271 597 164 -538 532 732 -90 -436 571 13 -640 -724 -61 182 -1057 -222
3088 -222 598 -145 -516 206 296 -289 -486 241 159 -532 -44 503 132 -198 378 825 84 -516 256 175 -840
3109 -840 -636 382 338 -723 -232 741 210 -651 332 555 -486 -735 318 397 -303 -316 720 523 -325
3128 -325 548 875 52 -764 4 618 -648 -625 406 65 -355 -40 649 217 -490 234 509 -317 -496 279
3148 279 316 -120 -233 626 481 -295 -145 588 70 -523 -54 207 -414 -453 70 462 -308 -387 369 26 -389
3169 -389 -549 294 -298 -692 -102 466 -312 -532 778 670 100 -56 696 95 -506 -103 253 -195 -580 51
3189E1J09l70M6K76J66q05J9M56j01l62M15M47m25L6N12L58o88m24Q97r5j100
3210e82O21J29l01k47M30M05m34O2j93J72j72j14J30N6l22j22J087n93j99L72
3230A85L18J71j052L50O24o00j52N08m14L56N3J76j66q05m9Q92o71m12n76J414
3250A50m87Q84r10Q39p24J14L66j15q29L31L22r9l13M28P32l48k19k28M2n29k7
3271f20R34o24r99Q2J449j334N82Q54J12m28L8M94l4j460O64J258j093m57n4J156
3291E20j199L84L37M47r93j15N93l1o88M76M99K0l45J91L64j96p89J044K3q41
3311b99o3Q18j41n09O40O0j32m25J30L01q91j03M56N6k88j03R80o6n03L20M66
3332G04o15n52M68M65q12N0K49J34m69O24L00k21p42J27N48r27j42O24L02r18
$$ plain form
3189 51 160 -210 -164 112 278 -527 -508 -52 -153 -515 -100 347 -78 -42 470 828 140 -284 613 518 -582
3210 -582 39 168 -133 -380 50 455 21 83 -110 62 -110 -224 -94 -38 -360 -482 605 12 -187 185
3230 185 503 674 -378 -28 596 -4 -156 352 -62 294 347 523 357 -448 -497 395 -276 -688 -1264 150
3250 150 -337 547 -363 476 -248 -134 232 117 -712 -381 -59 -158 -471 -43 689 341 122 -106 -64 -593 -620
3271 -620 314 -310 -1309 -1227 222 -1112 -530 324 436 8 46 540 506 -954 -290 968 -125 -582 -636 520
3291 520 -679 -295 42 489 -504 -619 -26 -57 -745 -269 230 250 -95 96 460 264 -525 519 542 -299
3311 -299 -362 456 315 -194 446 506 374 -51 79 380 -511 -614 -158 -102 -390 -493 487 421 -82 238 704
3332 704 89 -463 5 470 -342 -292 -43 91 -378 246 546 325 -417 -290 258 -669 -811 -187 115 -803
3352h03O68P03q5q11L32O16n25o88N31J94l45n7Q16j3p14L31L67j83q84M69L27
3373B46n53n05O47K06o42L49Q25jo94R7M35j08p76N37J37l35r3O13J17l35j23
3394D4P53n62p96L54J00j21n38N81L60k12O0N27q9o19k22L42K21p62L90N17n17
3415a89M8J72O46l76q0M7K44r77n0L88M8k90K36L59k10p2K55K04l08l03J26J60
3437G8n39O9N65j5l25M48J93l59j45j96J36l83m22O87o1NK72K1M17o52K10L27
3459C31k66m79J60K36j93L4M42J88l33%K04M3m81k07M92m08l74K84O13l94M3J88
3481A23K15k14l26L95j37m75R4M31k35j40N80J41k68k00O10k1r66R8L17k92n43
3502h13N80P54m75j76M79L24q44l62N90p7n19J05M66J52m23O00L60q4o16K56j45
$$ plain form
3352 -803 -135 568 483 -328 4 620 95 -593 -62 132 -213 -270 546 533 -181 150 517 334 -550 -81 246
3373 246 -307 -812 -165 41 -601 -252 573 572 -122 -25 410 302 -474 63 200 -135 -228 385 502 167 44
3394 44 797 235 -561 -207 -107 -228 -766 -185 175 -37 23 550 461 -158 -380 -38 183 -579 -189 328 -189
3415 -189 -141 31 677 301 221 268 512 -465 -515 -127 -79 -369 -133 226 16 -56 199 403 95 -208 -82 78
3437 78 -461 -392 173 158 -167 281 474 115 -30 -226 -90 -473 -895 -208 -269 -264 8 29 446 -206 4 331
3459 331 65 -414 -254 -18 -211 -177 265 453 120 120 324 367 -114 -321 171 -237 -611 -327 286 -108 -65 123
3481 123 338 124 -202 193 56 -419 -325 106 -129 -269 311 452 184 -16 594 573 -393 -295 22 -270 -813
3502 -813 -233 521 46 -130 349 673 -171 -533 57 -20 -539 -434 32 184 -239 361 721 637 21 277 132
3523A32n51l03P38l5n57P28K04j70l09L24M22r00k17J74L03o61O2J038N2q69L95
3544@Q68n93p26K63K46k33m00N54j98n8J06O45j15n77K81L06p88j92L77K50l33
3565c17J62M21L59n53Q1M00k55n64L38K58q98Q7Q13R0n14J32L16J17p43Q4M15
3586B29l71m81K65O21l43k57R02K41o90R3N61o49n31K76N2k30J36K82L91m97M7
3607D7J97q8o09J42K87l16m04L75O07j59J93J98L8j48n9l70l3k34k32Q48l04l94
3629d18N29L90j64l35l8K05l76k54J98M42j562J299p0L70o3L81q03K69n01j71
3649f72Q27j384J229l00M59p0K5O65n66j23M06o07m41l9N64m3j00j43O46K72m04
3670B01J78n2l09l65J66K37J42k89L43J37j08l5K35j71m90o0J76m6n70L34L91
$$ plain form
3523 132 -419 -722 16 -19 -576 152 356 186 -123 201 623 -277 -494 -320 -17 -678 -616 422 474 -395 0
3544 0 868 275 -451 -188 58 -175 -575 -21 -219 -277 -171 474 359 -218 63 369 -419 -611 -234 16 -317
3565 -317 -155 266 625 72 153 553 298 -266 72 330 -568 -481 332 422 -92 40 356 473 -270 -186 229
3586 229 -142 -623 -358 263 -80 -337 565 806 116 209 770 121 -410 -134 -82 -312 -176 106 497 0 47
3607 47 244 156 -453 -311 -24 -340 -744 -369 238 79 272 470 508 360 301 -69 -102 -336 -568 280 -24 -418
3629 -418 111 501 337 2 -36 169 -207 -461 -263 179 -1383 -84 -154 216 153 534 -269 0 -501 -672
3649 -672 155 -1229 0 -300 159 89 114 779 213 90 496 -111 -552 -591 -27 -70 -170 -313 333 605 201
3670 201 379 327 18 -347 -181 56 198 -91 252 389 281 246 481 310 -180 -240 -64 -110 -680 -346 45
3691D5Qr1K87K69j91n33M26l12k89K27K97m46M16j02O00j43o55N44j91k36n29
3712e99N11j51k90K55O12l12j49L96R9k63m06L46M4q40M12M45j69k06O61M84l68
3733E12o06J12J54o46R8J05J57k31J7N68J19n73M08K66k60o96K70K03j78l44O90
3754A45K94o1q1K57l56l53J6K16l19k61N45p7k15R3O01r6m52R8L55m48n33O39
3776GM25m09k59O93J33l91P5J04k89n22L47N5k11m12O84J7j73K73J01q6m33J97
3798g4L48m66k15J79N37k91j36L60K34k19k64K78q9k50o02P58k88k13K83M63p3
3819B60m45N12m8l44k74L85k34l2M3N40k58l48N87J53k26l51K40o2m62O4M02j64
3841f2l15L21N72J34p80M22Pn89j84N60j20k36Q4M66K87n68K25M10m65m46K43
$$ plain form
3691 45 53 -38 249 518 327 -206 220 -92 -381 -154 143 -303 113 11 611 468 -187 357 166 -70 -599
3712 -599 -88 -239 -529 -274 338 26 -123 273 372 109 -297 49 93 -747 -335 110 -59 -265 396 880 512
3733 512 -94 18 172 -474 -376 -271 -114 -345 -328 240 359 -214 194 460 200 -496 -226 -23 -201 -545 145
3754 145 439 378 297 554 198 -155 -139 77 -242 -503 42 -35 -250 -157 444 348 -104 -6 349 -99 -632 7
3776 7 432 23 -236 457 590 199 274 378 89 -433 -86 -31 -242 -654 30 47 -126 147 248 162 -271 -74
3798 -74 274 -192 -407 -228 309 18 -118 242 476 257 -7 271 182 -68 -670 88 -200 -413 -130 333 260
3819 260 -185 327 279 -65 -339 46 -188 -220 -177 363 105 -243 344 497 271 -80 160 98 -364 -300 102 -62
3841 -62 -377 -56 516 650 -130 292 299 -290 -474 86 -34 -270 -186 280 567 -1 224 634 169 -277 -34
3862c4K29n14p9M51P1M2K3Q7j46j17j22M9k43k8l6O24k25q5N86j46k89j72K92
3885B18L2m89m52O79p72K07P39J91m96Q89q15M92L28j471N52j14N33n69j05J014
3905E91j337Q07J044j004n77Q06L08j087P72l02j35n40N82O94N4p96J242j043
3923G9j3p66Q01l30k17P98q49O33l69L94P29j089n48J166p48L43k94O55o11M51
3943B15m42P20Q2p66jL35l03m41Q03o3j40qL08K25m27k5J12k72n31J69L38J39
3965B7j11L29n0k82K76P8k18k80L4K0J68k63n4L69j88L0K66K80l62k32K75p6l44
3988c08J7L18j30j51K82L85l17N3R2j08m49j43M86l08k48L49L79j40RK15L40o85
4010f2k77M52k41l12K61M25m0n94Q78%p6m41K46k14n79K19K39j27P6J41J93K4
$$ plain form
3862 -34 195 -319 -398 53 124 166 189 276 130 13 -109 -60 -303 -331 -367 257 32 -53 533 387 98 -74 218
3885 218 250 -239 -691 -12 -784 -577 162 353 -143 746 -69 423 751 -720 -168 -282 251 -318 -423 591
3905 591 -746 61 1105 101 -476 330 638 -449 323 21 -114 -654 -72 622 676 -120 1122 79
3923 79 66 -700 101 -229 -446 352 -497 136 -233 161 890 -199 -747 419 -329 14 -280 375 -236 215
3943 215 -227 493 575 -191 -192 143 -160 -601 202 139 -1 -9 299 524 97 72 184 -88 -619 -450 -112 27
3965 27 -84 245 195 -87 189 267 49 -231 -197 -177 -9 -272 -326 43 -145 -115 151 431 69 -163 112 36 -308
3988 -308 -291 27 -103 -254 28 413 96 149 241 133 -316 -459 27 -281 -529 -180 199 59 68 283 623 -62
4010 -62 -339 113 -128 -440 -179 246 206 -388 490 490 414 -27 219 5 -574 -355 -116 -243 -167 -26 167 191
4032A91k40K27R3m78r4K44nm7j06M59Jl27J63L58k11k05j5L3l02n4K57K1pN4L30
4057C40j96J05k35L44m88j83L74k44n8K1L05K09k16J27m8j1l77R6l7J80m21M77
4079F4Q8l80L03n2K47m52K15J93j63n37kN97j75p26Q91K96m9m48L10k68k57n9
4101c64L57J04j82J22P35p54l4N84l5m70N83o60r1J53o86J021J45N1n55L32j58
4122A98J02n02j12L45m23J30J39Q5K11K84m62OJ71P5k90j88J00K72m06K44L95
4143C74o9m65L98L71o09L6J28K9l95k27N55n6j39j08M77N6n27p1M11j57l69L48
4165iK18l36l1N37k6k8k85jj3j09j88J49q8j30L17J83j2q1L33j63m48K89k11l5
4189a68l67N58ml7j69L62O9m48Q2K42P6j72j90L26j19j27M70J7l25k50L98m4k30
$$ plain form
4032 191 -49 178 271 -207 -301 -57 -62 -109 -215 244 245 -82 81 439 228 23 8 41 -261 -315 -58 -37 -44 10 340
4057 340 144 249 14 358 -130 -313 61 -183 -241 -220 85 294 78 205 157 146 -231 -135 -172 8 -413 64
4079 64 152 -228 75 23 270 -182 33 226 63 -474 -476 121 -54 -780 111 407 358 -90 220 -48 -305 -364
4101 -364 -7 97 -85 37 772 18 -16 568 533 63 646 -14 -105 48 -638 383 528 579 24 356 198
4122 198 300 -202 -314 31 -392 -262 -123 -38 173 457 -5 1 172 247 -43 -231 -131 141 -265 -21 374
4143 374 305 -160 238 609 0 36 164 193 -202 -429 126 70 -69 -177 300 356 -171 -242 169 12 -357 -9
4165 -9 209 -127 -158 379 353 325 40 39 26 -83 -271 -122 -210 -340 -23 160 148 67 400 237 -211 78 -133 -168
4189 -168 -535 23 19 -18 -187 175 244 -204 -122 120 196 24 -166 160 41 -86 384 401 76 -174 224 180 -50
4212e0k47J9L74l71J41L78j45o4K77M7j97n8o6q8l68N77Q0l14Mq4Q5J69k79J55
4236b5K54n42p5J23M8R8K77j91M30p48L02L97m39m8L05O6m41J88K11k72o9R1L48
4259B88k9l04j3L80m94j67L67J29j80O1J95R2o18L89J55l40k89M62j50j36J17
4280h5K53l3J63K7J92j85l81L05n64J20k36L99J79p3k95L14m8l95N39l80L30n27
4302c81M78M1k9j51nN6K7NJ85K08m91m9K50p5k57k34L35P2j12M10j36L6k79L31
4326B35j58m94K42K45n7k96K74M32l15m92M34J9l38l4K49P0k89J63K11n0n8K55
4348B48R4l47k00R1kJ18P9J86k37j50L85J22j11n97J22K13n9k96L25P0m16K62
4370a00K30o2J13%q9k11j82K59L37O5o01L64J97m36N5L78o2j96j79K68j00l11
$$ plain form
4212 -50 -297 -278 96 -275 -134 244 99 35 312 359 162 104 38 -50 -418 159 239 -75 -71 -155 -70 99 -180 -25
4236 -25 229 -313 -388 -265 -217 -119 158 -33 397 -351 -49 348 -91 -139 166 232 -209 -21 190 -82 -151 -60 288
4259 288 259 -45 -58 322 -172 -339 28 157 -23 38 233 325 -293 96 251 -89 -378 84 -66 -202 -85
4280 -85 168 135 298 325 517 332 -49 256 -308 -188 -424 -25 154 81 -214 100 52 -343 196 -184 146 -381
4302 -381 97 138 109 -42 -47 9 36 41 226 434 -57 -106 144 69 -188 -422 -87 -15 -127 283 147 183 -96 235
4326 235 77 -417 -175 70 13 -283 -9 423 108 -384 50 69 -269 -303 -54 16 -273 -110 101 51 -7 248
4348 248 342 -5 -205 -114 -116 2 81 267 30 -120 265 387 276 -321 -199 14 -45 -341 -16 54 -362 -100
4370 -100 130 68 181 181 92 -119 -301 -42 295 360 -241 123 320 -116 -61 317 255 59 -120 148 48 -263
4392b63M42K01k80l39M54J21l45m5M77n99j93K74R1K40m89O58r8k16l50N02l34
4413i1p5N9J39K1l53R9K33ok59L41l6l18J78L38j41n27M29N1l8k10L25k3k73J37
4437@J96k59j51L8M54J5m54J75J41p3j49J52p0Mk84K83J86l15J59K29k6l50K12
4460A13J4j36j93R3M44k14k66J98Pj22l09J81L30j83mJ18R2j98N9M02n77k07K74
4483h4L37k45nK64n0m05K45N9j01l56M60k08l2K14R4k89Q4J5J05j63k19K24J40
4506H4l20J41O1J70n1L3j00N3l04L36j65l9k08K76K18k16j61J57J02k01k10J88
4528a56K83l89J31J93k0pK01L5p7l19J70j08J13l16M88r1k94k2K89p6j46J4N44
4551D40m23l9r0J94l01J77L38J82m72nK38N3m34L31j26l36j85O60j37r5M3k27
$$ plain form
4392 -263 179 380 100 -239 215 336 -9 -54 423 -176 -369 -95 -4 236 -253 405 307 91 -259 243 -91
4413 -91 -166 -107 32 53 -300 -201 32 26 -233 108 72 -246 -68 270 129 -398 31 82 44 -166 159 136 -137 0
4437 0 196 -63 -214 -176 278 293 -161 14 155 82 -67 85 15 19 -265 18 204 -111 48 277 251 -99 113
4460 113 127 -9 -202 -109 335 121 -145 53 60 -62 -371 -190 140 -43 -47 71 163 -35 24 426 -151 -358 -84
4483 -84 253 8 3 267 217 -188 57 116 15 -341 119 -89 -121 93 187 -102 -18 -3 102 -61 -280 -56 84
4506 84 -236 -95 -34 136 85 118 18 71 -233 103 -62 -101 -309 -33 185 -31 -192 -35 67 -134 -344 -156
4528 -156 127 -262 -131 62 42 35 236 271 194 -125 45 -63 50 -266 222 131 -163 -185 104 28 -118 -104 440
4551 440 17 -22 -112 82 -219 -42 296 478 6 1 239 292 -142 189 63 -273 -458 202 65 -30 13 -214
4573b14L12j45M4O6j65l05J71J92j01j97N43O8k01j40K02l6j23j14M14p7l71L00
4595A23Q3j53o10N81l8k13L78n7m5k96J30L69l82j67N49j27k10J08K14k22O2l54
4617b77L58j91M0r3L54k95j11K29J64K88m06n7K29o57K02K66k09q3J8M41j04m64
4639c58J84m6J38K94n16L6j8L36J40k83L23j33k94L31o05N94j45j82kM14l9l53
4661a84L57J79m19N1K39l57j51k62N31N48q01J96N00k61j69K64j59l44l0K84j60
4682a48K95n27N38r5j35J0K69k47r1r8J85K72j17n10L92R5J37n6j99O7rJ60j44
4705D4r1k11M88o45K23K96K64k31l39L56M1m28K97J02j49j77kM22j10j66j4N09
4727D79k06m88L44k27j82J89J10R7j11N5L46k75k36L56j33j78l3J92Ql41J28K32
$$ plain form
4573 -214 98 -47 -3 63 -102 -407 -236 -44 -145 -342 201 269 68 -72 130 94 -29 -143 271 194 -177 123
4595 123 206 53 -557 24 -14 -227 151 94 49 -247 -117 252 -130 -297 252 125 -85 23 237 15 77 -277
4617 -277 81 -110 -70 -163 191 -104 -215 14 178 466 60 3 232 -425 -223 43 -166 -249 -231 210 106 -358
4639 -358 -174 -220 -82 212 -304 -268 -286 50 190 -93 230 97 -197 134 -471 123 -22 -204 -206 208 169 -184
4661 -184 173 352 -67 -16 223 -134 -285 -547 -16 532 -269 -73 427 166 -3 261 102 -242 -272 12 -148
4682 -148 147 -380 158 63 -72 -62 207 -40 -131 -229 -44 228 111 -399 -7 88 225 169 -30 37 28 188 44
4705 44 -47 -258 230 -415 -192 104 368 137 -202 154 195 -233 64 166 17 -160 -162 260 150 -16 -30 479
4727 479 273 -215 129 -98 -280 -91 19 116 5 60 406 131 -105 251 118 -60 -93 99 107 -234 -106 126
4749A26l27L31J41P4o01K26J36j48k72K62q5Q8k52K17N07n46r9J61J17r5j34J35
4771c8K70m65N08k47K23j47m7jl0l18J57L76l53r2M79k59M5r4K29k38k46J38K55
4794A05o9k11j4J84J92l04L00J25m21J57o1J65k75k47L76j25K1O8L59j85j94M65
4816D11m63j67LK38k2m18N23K43l22l5L95k39j62j57K89Rk86J67Q3l0j33J31O01
4839F59p55K0J25O5j23l7P1Q5k61J99O3qO2k2j33m03K26J07J48m24K38L43k62
4862a7M16k22j47N2l22L27M6l30J84j95N41j32j16K15l5J54l58J61l19j06p3K70
4884fj96J3M77R2j09k98J94j53j74L6L60m44k3K09M63l46K6o1L4l29L06k34p8
4907b41m32L90M96l95M93J05k00k12k5M29k71k89m5K76j52j67J71J05J16k80K38
$$ plain form
4749 126 -201 130 271 345 -256 -30 106 -42 -314 -52 -137 -49 -301 -84 423 -123 -222 -61 56 -39 -173 -38
4771 -38 232 -233 275 28 251 104 57 56 26 -292 -135 241 -112 -204 275 16 61 -33 196 -42 -288 -150 105
4794 105 36 -175 -189 -5 187 -117 183 308 -113 44 -17 148 -127 -374 2 -123 -102 -34 325 140 -54 411
4816 411 -52 -219 -216 22 0 -418 105 348 26 -9 386 147 -15 -172 117 126 -160 7 90 60 -73 58 659
4839 659 -96 -76 49 114 -9 -46 25 110 -151 48 111 103 165 143 10 -393 -167 -60 88 -336 -98 245 -17
4862 -17 399 177 30 82 -240 87 133 -197 -13 -208 333 201 85 300 265 419 61 222 -97 -203 -276 -6
4884 -6 -202 -189 288 380 271 -27 167 14 -160 -124 236 -208 -231 -22 441 95 121 60 94 -235 71 -163 -241
4907 -241 -673 -283 213 -182 311 416 216 4 -21 408 137 -152 -197 79 -73 -240 -69 36 152 -128 110
4928A10L67o13j74J61Q2n7L8K64q0k0L7j33J15k26O2O6l93k4M65J03k86J58pP9
4952I4j29J66R5j53n02M03N8j49k24N57j21m9j64L56l09J0l4o7J03l02N25J45
4974C09k48j79N80l23j49K37o2j19l66M57j42j30J68M1J13k17J80L9j75l12K42
4995e6K44k74j4L1J39j4o4J8K86l81j17J67j51l12M20p6K77l10L10J99k39J12
5017A95m44K56k59K32R1j34J02N0K01j19n9l26L89K1m37L69k4p5j14K48Q4l61
5039a14nj83M0j16M85k05j8k0J17P9j90J44L5K07l55K68O5m19Q5K65j83j44J52
5062a0K81P0l85P9J4k23m3L99l04O4l9J69J63k84L6K15j68J9k09L01j06l99O14
5085B54n0j46j1L1k5j72K02k28J38O4k08R2K3j86J23J46n4M1q7j5j11J04K27k45
$$ plain form
4928 110 477 -136 -310 -149 -67 -124 -86 178 98 78 115 -18 97 -129 -67 -1 -394 -418 47 150 -136 22 15 94
4952 94 -35 131 226 73 -429 -26 32 -117 -341 216 95 46 -118 238 -71 -61 -95 -162 -59 -361 164 309
4974 309 61 -118 462 139 -10 227 165 46 -320 137 -5 -135 33 74 187 -30 150 189 14 -298 -56
4995 -56 188 -86 -100 -69 70 56 -8 10 296 -85 -202 -35 -186 -498 -78 -154 123 -187 123 322 83 195
5017 195 -249 7 -252 -20 71 -63 39 89 290 171 112 -214 175 196 -241 128 104 29 -85 163 247 -114
5039 -114 -119 -302 -262 -378 107 -98 -116 -136 -19 60 -130 14 49 256 -99 169 234 -185 -100 165 -18 -162 -10
5062 -10 271 341 -44 35 49 -174 -217 182 -122 -58 -97 72 235 -49 -13 202 34 53 -156 145 39 -360 254
5085 254 204 58 47 78 53 -119 83 -145 -7 57 -151 -59 -36 -222 -99 47 -7 34 -53 -68 -179 -75 152 -93
5109i3n6Q2M0M2J11j09M95n74P8j22Q2k8j5K23j34p6K28J07k40k43L94j96l04
5132c08J58RL26k00n7M37r3l66K62j47k33J38OR0L7j57K62r2k60M13J03l24j02
5155i8J37j38j43J31K33J42k03P0J89j36K77m27J07j79j38N8J51N3k71M10k20
5176Ek5L77j23j39l47P17o17j19q1K40j21J92N6j23j08K85R8k1O4k01o6K2P8J20
5200A63p8Q4P0k32j63N57n54j51L41l35K66L0J88j87k48N83q9l95K9M1K42m31
5222b69J71K69k74k00L55J12q4j1O9J29m30K23l6Q0l98K80k3J80j43O7Ll58M4
5245b44J65R7k29O8O9K04l09J94L05R5r06O07J3k47j30J2Q1J2N2K53J3j51j62
5268a38j05Q6J38k10M53n85K94R3k19L2K67m4r0J80j86k34J17j51J61J88L7m4
$$ plain form
5109 -93 -149 -67 -27 15 126 17 512 -62 16 -106 -24 -52 -67 156 22 -54 174 281 41 -202 192 -4 -308
5132 -308 -150 -141 185 -15 -72 365 272 -94 168 21 -212 -74 -68 22 59 -98 164 72 -188 225 328 4 -98
5155 -98 39 -99 -242 -111 122 264 61 131 320 184 461 34 141 -38 -176 -118 33 86 -185 225 5
5176 5 -20 357 234 95 -252 465 -152 -271 -352 -112 -233 -41 15 -108 -216 69 167 146 210 9 -57 -35 43 163
5200 163 85 169 239 7 -156 401 -153 -304 37 -298 -32 -2 186 -1 -249 334 245 -150 -121 -80 162 -269
5222 -269 -98 171 -103 -303 52 164 80 69 138 267 -163 60 24 104 -294 -14 -37 143 0 67 70 -288 -244
5245 -244 -79 18 -211 -143 -74 130 -179 15 320 415 -491 116 129 -118 -248 -236 -155 -143 -91 162 175 24 -138
5268 -138 -243 -157 -19 -229 224 -361 -67 26 -193 -161 106 62 -28 152 -34 -268 -151 -302 -141 47 84 40
5290D0J56ok45j7L07l09j61K01J10q8jOL59l66L16l93L6j22k2L70k80N4n7M22
5314C10k47NJ8J29k72JJ37q5k64J72K97k99J9n0J23K08q7j58pP0p6J3J64m02K41
5339d0J46p5J0N1j64j06J88J61m03J35J08K6J8r9J75o0Kl62M35j45R8l19M06j2
5363A74PN2j51K2j82O1R7l50L5L02j71o4J91O1r8K9J01j00J85l66J60l01Q4j71
5387c93N86p2ll6J31j53m0k27K18jk01j63N76k30m4K57%k60J27j20J8j38j1J75
5411dk7j24j01N05j90j68J66M3j75j50J38L21j52pJ16j55K69k59j75J47m9K9q9
5434i1O1k92M84j91j37L88k27J7J50j84k2k35L31q9LL1j08K99q3K36n29K86j66
5457f8j54K70O2k82j01N34k71J4K0J7q8M6p7o4j4j15M7L08m06L14K83M1l21J25
$$ plain form
5290 40 196 190 -55 -72 235 -74 -235 -34 76 -12 -13 -7 352 -14 302 -91 -55 -177 -199 171 -109 -55 -112 310
5314 310 63 68 86 215 -57 -56 81 -4 -268 -96 201 -98 -79 -129 -6 202 115 -43 -50 20 -56 -43 121 -281 -40
5339 -40 106 31 41 92 -72 -178 10 171 -232 -97 11 37 55 -44 131 71 73 -289 146 1 99 -220 186 174
5363 174 181 233 82 104 -78 -17 80 -270 -235 67 -104 -168 23 84 -14 15 116 16 201 -165 -5 -306 -222 -393
5387 -393 193 121 118 82 213 60 20 -207 11 10 -191 -354 222 -8 -52 205 205 -55 72 -48 -30 -168 -179 -4
5411 -4 -31 -155 -256 249 59 -109 57 100 -75 -225 -87 234 82 75 191 36 305 46 -129 18 -31 -2 -91
5434 -91 -30 -322 162 -29 -166 222 -5 12 162 -22 -44 -279 52 -37 -34 -3 -111 188 105 341 -188 98 -68
5457 -68 -222 48 110 -172 -273 261 -10 4 24 41 -47 -1 -78 -142 -156 -271 -224 84 -322 -8 275 316 -5 120
5481A20J81j85j30kl38J33j00L05o2m3K1L00q7j56r1J89r9j86L13J28j89k40L11
5504I3K73l21j14K38j31j70J88j84K17j41lJ96l0k78P4M5j29J16M5nj42L4J13
5527a6L04j99l14K93k43R6O6P0j31l5Q2J97k9k05L64m86R7J64k0l29J51J25Q6
5550H8N8n70O07j78%J58j8l0k86J07L9m1n7M2K94l73q1N26m76j1K79R9k06J20
5574I0j5K3l30J99K15j08O8j60r0p3K71N7%j81Op2K64o04Q5M98j31m7k21M14j40
5599A8n2j25K92o9J90l1J35j82k61m8M0k04J25K27J12o6Q8m42L59l43K85J00k32
5622h4o2L01k74J30m2J17K51k66J85j02j04j77J60j52L62j5k48m92P65l39K78
5643A92O20r61M24q67K74l09P17M15r92j78J500r69P5J23O2k38J01L86j90K9P7
$$ plain form
5481 120 301 116 -14 -16 -354 -221 -321 -16 -78 -121 -100 200 113 -43 -134 55 -44 -230 83 211 22 -218 93
5504 93 366 45 -69 169 38 -132 56 -128 89 -52 -55 141 111 -167 -93 -48 -177 -61 -16 -21 -163 -129 -16
5527 -16 288 89 -225 68 -175 -79 -13 57 -74 -109 -27 170 141 -64 300 -186 -89 75 55 -274 -123 2 88
5550 88 146 -424 183 5 5 163 145 115 -171 -64 -25 -66 -123 -81 213 -160 -241 285 -191 -202 77 176 -30 90
5574 90 75 98 -232 -33 182 74 142 -18 -108 -181 90 147 147 -34 -28 -100 164 -440 -355 143 12 -35 -256 158 18
5599 18 -34 -159 133 64 254 223 358 176 -85 -133 -93 -297 -172 55 167 101 189 -253 106 -237 48 148 -84
5622 -84 -146 155 -119 11 -31 86 337 71 256 154 50 -127 33 -119 243 228 -20 -512 253 -86 192
5643 192 812 -149 275 -592 -318 -627 90 505 -487 -665 835 -134 -59 64 126 -112 -11 375 185 214 291
5664B91o17M63k19j77O32k50J48k08l33L67j11k47N65k13m57K74j62P8q0R81n21
5685B04k58P4p1J00m25N46L0j01n0J02no9k08L79j09m72M23R7o9o1P8J90k87j45
5709a07K82l35j91L24K30j10o42N26M06k25m11L04j9k02p1N54k88j50j02M09J18
5730C00j50j62J47k85J82j40K70m34J47J48Nk98K38o4K19q4k0O0k06k34M57j85
5752h9n6j27L59J24j30L0L23l70l29K59j0k8j87K90O2n9K72k23j57L32k47Jm3
5775ck26K48j98Q8L6J44J78k27j22J71j00k27k54M18j1k40O50O7q84P43M73j566
5797h42N40k86P31k12l1J91K5j74J93j7J20p23M88J4k5j6k9J89j6l11J84p9J08
5820B2L2K81j38k21j81J74Q7k73K42J83l54L17k38J37n6j36K34n6j31j2J19J47
$$ plain form
5664 291 -326 137 -82 -259 373 123 271 63 -270 97 -14 -261 304 91 -366 -92 -254 -176 -256 725 204
5685 204 -54 20 -51 49 -376 170 200 99 49 151 146 77 -131 248 139 -333 90 187 118 57 135 325 38 -107
5709 -107 175 -160 -351 -27 203 93 -549 -23 383 158 -253 51 32 -170 -241 313 25 -125 -227 182 300
5730 300 150 -12 135 -150 32 -108 162 -272 -125 23 28 -270 -32 -96 123 39 19 79 -127 -361 96 -89
5752 -89 -145 -272 87 211 81 111 434 64 -265 -6 -16 -44 -231 59 121 62 334 111 -46 286 39 40 -3
5775 -3 -229 19 -179 -91 -55 89 267 40 -82 89 -11 -238 -492 -74 -85 -325 325 392 -492 251 724 -842
5797 -842 -302 -588 143 -69 -100 91 116 -58 135 118 238 -485 3 17 -8 -24 -53 136 120 -191 -7 -86 22
5820 22 54 335 197 -24 -205 -31 56 -217 25 208 -146 171 -67 70 14 -122 112 56 -75 -87 32 179
5842A79L9k50K43j42L5Oo8j54K38k56K65k13l0M8k1Mk9p2J49m7j35L79J0k29j38
5867a89K33k32J67J62J01k90p7L21l24k1K91L8j35j63J12J4L7M9J63k36K2j86
5889a43L93l79q7K43J61m11J22j05K88l7l3K41q3l48J55J63j05r4R0L7J1j68J20
5912C1k26N4J30l3Q8o9l8n1K74l02J48K22m98P1L45m2l25K08R1p7J17L7J56n36
5936b25J35J97p9o8J03j02R7k12R0K44l45J3L77r3J64m41M91l18j52J04J08K4
5958A12q3j19J05k7k74K2J80J58m17J25K17j59J5Q8n9N7j23N14m35K5L02k65M7
5981Fj06M22R1l94J02j20L2k06J14R3R5j50L63l85K13Q5k30J18j92K95k51m24
6003d29K44RJ55l3r6R9K41k31M2j18NQ5j96J54j0j27J53J49J19k22O4j4l2q1p0
$$ plain form
5842 179 218 -32 211 69 104 110 42 -112 126 -130 135 -78 -108 -60 -81 -77 -106 -178 -29 -76 -211 168 178 -51 -189
5867 -189 44 -188 -21 141 242 -48 -125 196 -128 -149 142 180 45 -118 -6 8 45 94 257 21 43 -143
5889 -143 250 -129 -216 27 188 -223 -101 -206 82 45 12 253 170 -178 -23 140 35 -59 31 68 79 -89 31
5912 31 -195 -141 -11 -44 44 -25 -63 -114 160 -142 6 228 -270 -199 146 104 -221 -13 78 1 118 155 311 -225
5936 -225 -90 107 28 -40 63 -39 58 -154 -64 180 -165 -152 225 132 296 -145 346 28 -124 -20 88 112
5958 112 29 -90 15 -12 -286 -264 -84 74 -343 -218 -1 -160 -145 -57 -116 -59 -182 332 -103 -78 224 -41 6
5981 6 -100 322 413 19 121 1 33 -173 -59 34 129 -21 342 -43 170 255 25 143 -49 246 -5 -429
6003 -429 -185 -176 -21 -54 -150 -51 190 -41 1 -117 -112 -27 -223 -69 -79 -206 -53 96 215 -7 57 43 11 -70 -140
6028a40J41l34L16k49L98k19J76j83j13K47P2O3k67j1J2J13j78K05j11P5l44Q71
6050E40m83l8k64J59K30j24j47K48J6l62L17j9m5l13L85p1M5k19L31k0j85o2L8
6073d3J12j75k9P6J36m2k02L31j93N3J74Qr3k07J63lJ2J67k94K23N6k18J40j90
6097c8R4j85L47l47j68K05N8j77L46K4j44J36n1K9m10J29P3J17j75j64Q4N5J4
6120a48m5K27n3r4L91k87o7k34M86l18J26O9R7l67M4K01M2o7n6K26o0k76Q4J97
6144A18M7j98J84o3q8j53J49J27j80P7q6Q9j34Q9M8j25J05j53K35j78j6K9K26
6167A49k40J43J01j66j45J6K28k67K42m4P8j78M2M8O3j27j59K64L6j51l03M57
6189H7ko6J52k15J23k2J7n7p5J8L35m67J62k25J69J12J90k93k3QPJ9J86l03Q5
$$ plain form
6028 -140 1 -333 -17 -266 132 -87 89 -94 -207 40 112 175 -92 -103 -91 22 -156 49 -62 13 -331 540
6050 540 57 19 -245 -86 144 20 -127 121 137 -225 92 73 28 -285 100 29 74 -145 186 166 -19 -81 -43
6073 -43 69 -106 -135 -59 77 35 -167 164 -29 24 198 206 113 -94 69 66 78 245 -49 174 230 12 152 -38
6097 -38 56 -129 218 -129 -297 -92 -34 -211 135 159 15 151 100 129 -281 -152 -79 38 -137 -301 -217 -162 -148
6120 -148 -193 34 -19 -113 278 -9 -76 -310 176 -142 -16 53 150 -217 -173 28 70 3 -53 173 113 -163 -79 118
6144 118 165 -33 151 88 0 -153 -4 123 -57 20 -66 23 -111 -22 26 -99 6 -147 88 -90 -106 -77 149
6167 149 -91 52 153 -13 -158 -142 86 -181 61 17 95 -83 -41 7 70 -57 -216 48 84 -67 -370 87
6189 87 85 19 171 -44 79 57 74 17 -58 -40 295 -172 -10 -235 -66 46 236 -57 -80 -72 -65 -46 140 -163 -78
6214g8N47l69k27L60r5l8k4k73M35Kk70Qj29J00l9m5J97j56L41k26Kl81L48o8
6238g8J37r7K3Rn1K32k24K69J54m92j00L72k27J0K67k73k7K81m26J59J55j34L39
6261B78l59l35N06k89J13N3LL45n53K84J10k24J53j34J5j04J50J10m82L09K14
6282A63j80J68k63M61m02r7J87K10l50Q8J91p8J68n36L65j08K1pj33J38r9p1M59
6305B95n08J44K04L03l64j79K23L28m58l81L45k00K69J8K15k2k32j59L67k55L0
6326a7L43l16l57%N55l46J89k9l03K05K27j97Q4j0j98K64k54qL26j50L5M5J02
6349A90k74k86K74J42n4o3LL72l20r2RL00k43J78q6K17l61Q6j91J91j79RJ2N19
6373C53k07o3K0M9m31J90O3J64j41m4J73k45n2L57r4k07K11j42p7J54j2O4j23
$$ plain form
6214 -78 469 100 -127 233 138 100 76 -197 238 240 -30 -22 -151 -51 -90 -135 62 -94 247 21 23 -358 -10 -78
6238 -78 59 -38 -15 -6 -57 175 -49 220 374 -118 -218 154 -73 -63 204 -69 -96 185 -241 -82 73 -61 278
6261 278 -81 -416 90 -199 -86 -33 -30 315 -238 46 156 -68 85 -49 -34 -138 12 122 -360 -51 163
6282 163 -17 151 -112 349 -53 -150 37 247 -103 -15 176 98 266 -270 95 -13 8 1 -132 6 -93 -164 295
6305 295 -213 -69 135 438 74 -105 118 446 -12 -393 -48 -248 21 39 254 232 0 -159 208 -47 -17
6326 -17 326 10 -347 -347 208 -138 51 22 -281 -76 151 -46 38 28 -170 94 -160 -168 158 8 43 88 190
6349 190 -84 -370 -96 46 -8 -71 -68 304 -16 -108 -99 201 -42 136 50 267 -94 -8 -199 -8 -187 -178 -166 353
6373 353 146 83 103 152 -279 -89 -26 138 -3 -47 126 -119 -171 186 92 -115 96 -46 -123 31 19 83 -40
6396d0r5J41J36J44l59k1P2n06K78L28l46O8L56RN3k16j5K42l50r4j4J44M9kK89
6421B51j88l4O3j33l0J07Q0k5q0k74K54K90n29K78J33R2l82J01P5k64k5K53J04
6444A17m52M17L8O4m84L12j64K0l24M56j19j29L18j64J6m3J27K85K02m51l41L54
6466E5Q3k78O9L35j52k29K13K30k86r5P1l11K50j11J73j92j04N3O12m22O4j37
6488a09K4j58J94J67j9r2n3J38j32k06J55J66j20j70L57j0l36j01L05O0j84J49
6510B5j61K78k60K61m8j01n4K00j87l00K55k7K11r1Q2K23j27n28L23l31K91J3
6532e3K32k10L5k86K34rj79J36K07j22k40K84J29k12M5Q6j1J71j96j12m0K5J4
6555g2J84k72K71r6j75J33K72j2j20n10L94P1j27m9j1K51l23rL21K24l99m0K75
$$ plain form
6396 -40 -135 6 142 286 -73 -94 -22 -528 -250 78 -268 -200 156 165 218 2 -13 229 -121 -215 -229 -85 -36 -38 251
6421 251 63 29 92 -41 -71 36 116 91 11 -263 -9 281 -248 30 163 255 -127 -26 49 -215 -240 13 117
6444 117 -335 82 120 184 -300 12 -152 -132 -456 0 -119 -248 70 -94 -78 -121 6 291 493 42 -299 55
6466 55 138 -140 -71 264 112 -117 96 326 40 -55 16 -295 -45 -156 17 -175 -279 -226 386 -36 28 -109
6488 -109 -85 -243 -49 118 99 7 -46 92 -40 -246 -91 75 -45 -215 142 132 -204 -305 0 60 -124 25
6510 25 -136 142 -118 143 95 -6 -60 140 -47 -347 -92 -119 92 1 83 306 179 -349 -26 -357 -66 -53
6532 -53 179 -31 4 -282 -48 -57 -236 -100 107 -15 -255 29 158 -54 -9 77 66 237 41 -71 -111 -86 -72
6555 -72 112 -160 111 15 -160 -27 245 233 113 -397 -3 68 -59 -108 -119 132 -191 -200 121 345 -54 -94 181
6578A81O9j88k90J52L9L0p2J31mr9J36j07%J18J31l41j03L49j9k27L42m5l30M21
6602B74k93l5r6r7J59J02k74J97K02J18k17l1P3j57J16k01J57J12j32K49Lj69
6624F0l42K75l3J09j43M87l52j68J02m9K08j29J96M2k16l06J82M28j97r8k31K37
6646F2j88J35J58m7o3k98N31l22K3J26n4O5K07m25J37j05j17J54P7k08J07k5M03
6669C33l82K37Q6n40J29K46K02k88K6J41o0l92K60Rl5j87L79J28o03J59j51L11
6691HJ48j23j47Q9m9o3L91n26K41r3J1k14K23n5J43m7R9j06J13O1M1J50q3m16
6715b04L83k42L27l28l9J28j5l01J23J71m4J05Q4k00M5j18K27k19Q7k1K15l07
6737a43J95J4N2l47L18j93Q1j22O0j6l1J13M7k01K51k4l70j03J65R6J73j42JJ2
$$ plain form
6578 181 250 62 -228 -76 -37 -7 -79 52 48 -51 85 -22 -22 96 227 -114 -217 132 113 -114 228 183 -147 274
6602 274 -19 -54 -150 -247 -88 14 -260 -63 139 257 40 9 82 -75 41 -160 -3 109 -23 226 229 60
6624 60 -282 -7 -40 69 -74 413 61 -107 -5 -54 154 25 221 263 47 -259 -77 351 154 56 -175 62
6646 62 -126 9 167 120 57 -241 290 -32 -9 117 63 128 335 -90 47 -58 -175 -21 56 -152 -45 -70 333
6669 333 -49 188 274 -266 -137 109 311 23 49 190 130 -262 -2 7 -28 -215 164 292 -311 -152 -303 8
6691 8 156 33 -114 -25 -74 -137 254 -272 -31 -124 -113 -327 -104 -159 -16 -63 36 -70 43 104 145 295 212 -204
6715 -204 179 -63 264 -64 -103 25 10 -291 -168 3 -41 64 148 -52 -7 -125 102 -117 -30 -51 164 -143
6737 -143 52 66 118 -229 89 -104 -23 -145 -85 -101 -132 -19 28 -173 78 54 -316 -419 -254 -158 15 -127 -126 -114
6761a14J78j43k0K49j04j05j4N3R9r1K49j88j16p5J87k9O8k31J33P6l30L29J27
6784A88K1l34q6K35k67M7M16k67r0J56j2J60l76M07K18p25l0M30M7j98O1L4j24
6807h9N0o1N9k2OJ3J96k73Q9j40K54k78K75J18l01o1m4N80n36J81j2P9j95j33
6831b45L80Mj63j52K34k00O2K11o0J6l75M08j7r6j42M85l35L7Rm2j43J44J83l25
6855a22J28k2n3KK00l19M99k27J3K9j08M5k01P8N5o0L1J95k97n1K76j11K04j92
6879hR9k1M3k24J61oj72o1L45j47j50J4J10k11k2m4L40j54j0P7J71k89J28K18
6903A87j0k34O0P3jj81l8M78o19K48j38K29m7M0J09O6M0m31J2K15j29K12j06l2
6927CL6l30M23k35L33j55k41J51rQ8O6l73L80k83L32q0k37J89j71K07J18mm01
$$ plain form
6761 -114 64 -79 -99 150 46 -59 -73 -20 79 -12 237 49 -67 -142 45 16 84 -147 -14 62 -268 61 188
6784 188 209 -125 -211 24 -243 -196 220 -47 -137 19 7 167 -209 198 416 -309 -339 91 138 -60 1 35 -89
6807 -89 -39 -100 -41 -63 -57 -44 152 -121 -32 -172 82 -196 79 197 -104 -165 -209 371 -165 16 4 83 -112 -245
6831 -245 135 139 -24 -176 58 -142 -80 131 71 87 -288 120 103 7 -135 350 15 52 61 19 -124 20 203 -122
6855 -122 6 -16 -69 -67 133 -186 313 86 99 128 20 65 -136 -58 -3 -63 -32 163 -134 -185 91 -20 184 -8
6879 -8 91 70 113 -111 50 44 -128 -189 156 9 -141 -127 -17 -228 -250 -294 46 -108 -118 -41 130 -159 -31 187
6903 187 177 -57 3 76 75 -106 -144 334 -285 -37 -175 54 7 47 156 222 262 -169 -157 58 -71 141 35 3
6927 3 39 -291 132 -103 230 75 -166 -15 -24 64 130 -243 137 -146 186 106 -131 58 -113 94 212 208 -193
6950a93J10K56j4k90L80k39J47k22L7M6O3k00O1R7Jm9M19l67k84K35Q1k44j89
6973c58N25J0j14J7kj21j32K31K1L5k80L37j4k25j31L35K74m47j03K62O8l73L40
6996A55j34j97J18p9M15k00J49K9k28J18o4k98K60j45J45Q0J31M3j50q4j58N18
7018D24l69j19r7K75J30k41j25J89K20j70j20L5j35j64K39J31j37j02J56M7k26
7039a59J7L73K7k24l73L23j61J72j36J74l7J41n8M9k5j05Q0j47p5j60L89Lj94
7062a06j57M99J2l62K07J15l14j80L49J15j84k27M49j98R7j08O5J32n45O24k97
7083a4j58J4J77R4q0K53l00p6N9j78L08j32j16J75r7J8n0J39J03j46j14l1J25
7106b7J2OM6j64O4J43J05k96l3J6L04l51J02J03k4k9J06j5ol95J60K98Pk21L94
$$ plain form
6950 -193 -83 173 159 -131 249 10 157 -65 -28 18 81 -119 -58 39 40 -9 410 43 -241 -6 75 -169 -358
6973 -358 167 177 63 80 78 -43 -175 56 77 112 -168 169 155 -70 -201 134 408 -39 -142 120 188 -185 155
6996 155 21 -176 -58 -137 278 78 227 256 28 146 82 -216 44 -101 44 124 255 298 148 64 -94 424
7018 424 55 -64 -161 114 244 3 -122 67 287 117 -3 32 -103 -267 -28 103 -34 -136 20 67 -159
7039 -159 -142 231 258 34 -339 -16 -177 -5 -141 33 -4 137 79 128 103 -2 78 -69 -144 -304 85 88 -106
7062 -106 -263 236 248 -114 93 208 -106 -286 63 178 -6 -233 216 18 115 7 72 204 -341 283 -14
7083 -14 -172 -158 19 113 33 286 -14 -90 -31 -209 99 -33 -149 26 -71 -53 -103 36 139 -7 -121 -152 -27
7106 -27 -15 -9 37 -127 -63 80 185 -111 -144 -128 176 -175 -73 30 6 -23 83 68 62 -333 -173 125 132 -89 305
7131C05m53J65K34k54k89L49l01K15K38Ml51K62j27j40K67k2j25o1K25k4K1l22
7153a84O6P8l84O04j14j05n0m3K87j60k73L38K6J43M4m5q3j25j42N8J25l31L84
7176A14L3l96r9M61j98J27O3J76m65m4M93n74L77p7n5K79k84J71j18r5L56k45
7198@K13l87R7P6J77l03K2R4J38j92J23J2l15M1N68k28j17q8J53p9j33J71j16
7221g3j54K40q5J81j86q3K26K85j59k20L2l16rK83J27L37o92K60J77j95m6J30
7243F0J46k81J06k04K56k30Q3Q0k15o6M12J08k75l54M61N1m11L59l5m7J7Q5k83
7266a77R3K77k17j2J88j97m2R5J3k54K54kn8l4R2K50l23K0l6j05k0K09j47K58
7290A25l1Q7l2j16J24q5q8l39K79M58m01J49k34P2J05k86N19k24j5J5K0j8j76
$$ plain form
7131 305 -148 17 251 -3 -292 57 -244 -29 209 213 -138 124 -3 -143 124 102 -23 -84 141 117 138 -184
7153 -184 -118 -40 -424 180 66 -39 -89 -132 155 -5 -278 60 86 229 273 228 145 20 -122 -64 61 -270 114
7176 114 147 -249 -348 113 -85 42 105 281 -184 -228 265 -309 68 -9 -64 215 -69 102 -16 -111 245 0
7198 0 213 -174 -77 -1 176 -127 -105 -11 127 -65 58 70 -245 -204 364 136 19 -69 84 5 -128 43 -73
7221 -73 -227 13 -72 109 -77 -160 66 351 192 -28 4 -312 -321 -38 89 426 -266 -6 171 -24 -70 60
7243 60 206 -75 31 -173 83 -147 -64 16 -199 -265 147 255 -20 -374 87 138 -273 86 51 4 21 106 -177
7266 -177 -84 193 -24 -36 152 -45 -87 8 21 -233 21 19 -39 -73 19 269 -54 -34 -70 -175 -195 14 -133 125
7290 125 94 181 149 33 157 72 -16 -355 -76 382 -19 130 -104 -32 73 -213 306 82 67 82 102 84 -92
7313i2N1O7r1J6K27p1k08k06Q6J3j19L16J1kRK99l85J62K04j88J2o6j39L78k64
7338B0k29R8J78P4j16q3O8m1K5K9K21l41p5L08l1l76K20M16l09P9j20n7j17K95
7362A36k02L0o2J04J82J8k86j26J8L78k04J07%k78LJ14o2J57q0m9J96l35K07j14
7386a48P5k53L98k42K74k96J07k9M4k2K25N4j88J69l17J5K17j18J65j49j04J09
7408a4J20k56J99J09r5j07P4K00q3j47lJ51m08K74k64K74k5R7J48l50O2J68j23
7431AJ03l55K85J83k35j50J10J77j14j33qL95k49J33J46l06q4L62l88J02L2O6
7453G3l60N0K97M3m30L94l09L62l63M59l93j19K13O1j1Rj19P7J18j99n3J55k7
7476g2J62l78M31q5j46L85q4k08j30J31j02J20j32PL66m05M8K85r8j74O8j18R1
$$ plain form
7313 -92 -41 26 -65 -49 178 107 -101 -307 -221 -208 -327 -11 0 -2 7 306 -79 83 287 99 111 45 -94 284 20
7338 20 -209 -111 67 141 25 -58 10 -31 -6 23 244 -97 -172 136 105 -271 -51 365 56 135 15 -42 -159 136
7362 136 -66 -36 -98 6 188 206 -80 -206 -188 190 -14 93 93 -185 -182 -68 -130 27 -53 -102 94 -241 -34 -148
7386 -148 -73 -326 72 -170 104 -192 -85 -114 -70 -92 133 187 -1 168 -149 -134 83 -35 130 -19 -123 -14
7408 -14 106 -150 49 158 63 -44 30 230 147 0 -3 148 -260 14 -250 24 -1 96 244 -106 -44 124 1
7431 1 104 -251 34 217 -18 -168 -58 119 5 -128 -136 259 10 143 289 -17 -101 261 -127 -25 7 73
7453 73 -287 -237 60 103 -327 67 -242 120 -243 216 -177 -296 -83 -22 -33 -24 -143 -66 52 -147 -200 -45 -72
7476 -72 90 -288 143 58 -88 297 213 5 -125 6 -96 24 -108 -101 265 -140 -92 193 95 -79 -11 -129 -38
7499c8P3j79K06p0P5o6lL5q8n2L00m96K88J59l5O4j85J24r8o6J47k65R8O3Q3k44
7525a70O5RL45l18O9K8k6l03L55k4J58p9k92l1J21J33J72j77K1l33K03K16j07
7548C5m1j5L9r3l2R0k17o4K00J42O2k64J36l7k81K27K09P2k89L50k07L5J05L0
7572A92k14m6K80o83M32K16j61J26R7l53J38OK58m77j67L21j95K01J87J04n72
7593c10L84k32L19J12l28J53j34OM1M26n53N9J15J68k89M1j14JJ68j78N1P8j92
7616b08L40J53l55k9lL11k68J7j69r1M67q1J91m24J32K12j87Qn8P1J17m2o7J40
7640A77o8j3j09J00j78j0K96m8j33M6q3q2K42k76K43J84n11L26o8j88J25j01K9
7663a00J98j5k4j86j47K24P7Q3q7M4pk09J17m5J8n8J55P4j17l5j12K74K2k54K24
$$ plain form
7499 -38 35 -144 62 -8 67 1 -2 33 -55 -107 193 -303 -15 144 109 173 -12 112 14 -52 95 -170 -72 -9 74 -170
7525 -170 -105 -96 249 -69 0 28 2 -301 54 30 188 109 -183 -214 -93 40 212 35 56 -277 -74 142 35
7548 35 -6 -21 18 -75 -107 -17 -234 -298 -98 44 106 -158 -22 -59 -340 -113 96 168 -121 229 22 57 162 192
7572 192 -22 -68 212 -471 -39 177 16 142 239 -114 24 30 288 -189 -356 -35 -230 -29 158 262 -310
7593 -310 74 -158 161 273 -55 98 -36 -30 11 437 -116 -57 58 226 -63 -22 -136 -135 33 -145 -94 -16 -208
7616 -208 132 285 -70 -99 -102 209 -59 -42 -211 -302 165 84 275 -149 -17 195 8 16 -42 29 146 104 37 177
7640 177 109 96 -13 87 -91 -101 195 147 14 60 -23 -105 137 -139 104 288 -223 103 35 -153 -28 -129 -100
7663 -100 98 83 59 -127 -274 -50 27 110 23 67 60 -149 -32 -77 -59 -117 38 112 -5 -40 -152 122 144 -110 114
7688A14K98l93j53K90kk73K01J15l90P9j23K03k7R5k15J51r7l9K78J01k02R3O
7711A10k0k55m2K60K10l80L53k1m3j59l6K98l49J61P2q5J48M3k08k5k12L00nk52
7735a37l8K16O3k72K86j00l8J31k61K20J08j11j31K68j51J0Q1O7l07L03l34o3
7757a90K34M3P6j12k00N0N5l0j24K44O2l23K26J00p5k9oo0Q2j45L17r0j70nR3
7782B3r9J25l2j17J41r4N7M0l27L15p8L04p6k00m6Q2p1j68Q3L01j76jn5J63j74
7807h0K67k67J28K1n2n00L08J29J75J68l78K02j32Jk51J07J18J34j22j5J15k63
7829a87L94r8N4j13J8r3M3j28L94j3j89k35M30k00J12o43O05m99M41j79L54k10
7851E8j91M86k31l81M5K65o0J40K19j60k15q9L13n01K66J81M2K41n19m9j70M33
$$ plain form
7688 114 412 19 -134 156 154 -119 82 197 -193 -114 -237 -34 -61 34 -181 -30 -127 -166 112 213 11 104 110
7711 110 90 -165 -207 53 263 -117 236 215 172 13 -23 275 -74 87 159 74 222 265 57 32 -180 120 115 -137
7735 -137 -175 41 104 -168 118 18 -20 111 -150 70 178 67 -64 204 53 63 144 211 -96 207 -127 -190
7757 -190 44 87 163 51 -149 -99 -44 -74 -198 46 108 -215 11 111 36 7 1 -59 23 -122 195 105 -65 -70 23
7782 23 -76 49 17 -100 41 -53 4 44 -283 32 -46 258 182 -18 -64 18 -53 -221 -138 163 -13 -14 -69 94 -80
7807 -80 187 -80 48 69 17 -483 -175 -46 129 297 -81 121 -11 -10 -261 -154 -36 98 -24 -39 76 -187
7829 -187 207 109 163 50 68 -25 18 -110 284 271 82 -153 277 77 189 -454 151 -348 93 -86 268 58
7851 58 -133 353 122 -259 -214 51 -9 131 350 190 -25 -114 199 -302 -36 145 187 428 -91 -140 -310 123
7873A23N63j100Q21l40j47Q2l10O03o94J67P81m02p2j03M5j89m5N15j89k16L22
7894B15j23j57l92N16o4n4jJ04Q1j25L2k91J62J08j65k4K15k04j2Rk4J93%p8j55
7919b34J05L56k75L20q6k75K66pj48Q9k21P6K8K25l45J13k2j53J9K04K7J26j80
7942HK18j79j12J04q2l35K14L73j47k41r5J73q2J36n4J25q8n9NK26j11r6K03L3
7966A37k27K39j67n3k1j7K58l7j06Q0K49l17k37K64l3J92l30K42l5K2p7O6q6J98
7990B04n24N25j23j29J49k33L22k29K63k48k45J43K39q0n3K19j37j22K38k10k54
8011b85j22M08j54K50j1k74K53j15k41K18J19n88R59n23J10J02k92O59k28n84
8031c39P8K51O03m63r1m92K66K63k07N40k65o25k03O16J13m00J620j469n3N37
$$ plain form
7873 123 686 -414 407 67 -80 2 -308 295 -399 -232 549 147 75 -28 17 -172 -217 298 109 -107 215
7894 215 92 -65 -457 59 -5 -59 -60 44 125 0 32 -259 -97 11 -154 -178 37 -167 -179 -170 -194 -1 -1 -79 -234
7919 -234 -129 227 -48 272 186 -89 177 170 22 111 -110 -34 -6 219 -126 -13 -35 -188 -169 35 62 188 8
7942 8 226 47 -65 39 -43 -378 -164 209 62 -179 -274 -101 -183 -47 -101 24 -64 -123 -118 108 -3 -99 104 137
7966 137 -90 149 -18 -71 -92 -109 149 112 6 86 335 18 -219 45 12 204 -126 116 81 103 26 92 6 204
7990 204 -320 205 82 -47 102 -131 191 -38 225 -23 -268 -125 114 34 -19 200 63 -59 179 -31 -285
8011 -285 -407 1 -153 97 86 -188 65 -50 -291 -73 46 -542 417 -106 4 106 -186 473 245 -339
8031 -339 -261 -10 593 130 39 -453 -187 76 -131 409 144 -481 -684 -68 45 -355 1265 -204 -257 280
8051B80m48J93n63N13L34k1j21J07l12j38L85j80k67J87j15l46L45N07M9l84K1
8072B6k44M39j29k90K41o9j12L64Q0l66L85n07o7L82m32K26l08M91J9o7o7J87
8094A82n41M98o9j39J61j50o6K44N6o47P06m60l23N67n76j08K8J100k43l67k07
8115c54O51r9n87J14O99m94k01N37L5j078P87l32K69P6n23l11P84m9o35J028r43
8136f26K68P38o84n7L05R7j88O30j30j23m33M99n68J8p51N57O00q1M5r6jr0K26
8159A55l21J86k74J48P31m40k79j05O4J36j13K76k86J99j97l6R2Q8k4J90j74j07
8181i1J53R4l3m31L68k48J82j42J63n0
$$ plain form
8051 280 -168 25 -538 -25 309 288 167 274 -38 -176 209 29 -238 -51 -166 -512 -167 340 389 5 26
8072 26 -218 221 92 -198 43 -26 -138 226 306 -60 325 -182 -249 133 -299 -73 -381 110 129 62 -5 182
8094 182 -359 139 70 -69 92 -58 -124 120 176 -471 235 -225 -548 19 -557 -665 -637 463 220 -147 -354
8115 -354 297 198 -389 -275 424 -70 -271 266 301 -777 10 -322 -53 23 -500 -811 -27 -76 -711 317 -626
8136 -626 -358 380 -304 -361 -56 41 -147 483 353 230 -203 296 -272 -254 -1005 -448 152 71 116 20 19 -71 155
8159 155 -166 20 -254 -106 625 185 -94 -199 -135 1 -112 164 -122 77 -120 -156 -64 24 0 190 16 -91
8181 -91 62 156 123 -308 60 -188 -6 -148 15 -35
8191c5
$$ Imaginary data points
##PAGE= N=2
##DATA TABLE= (X++(I..I)), XYDATA
0@%%%%%%%Qj6J6j6J6k4L2m0N6o9Q2j01J20j44J76k08K45k89L38l95M59n31O11
30C26p01P99r09J035j171J320j484J664j863K083k323K586k871L182l523L897
46B047m304M749n236N768o356P003p717Q508r391J0382j1501J2778j4250J5969
60H449j8004K0458k3492K7356l2465L9579n0247O8236j06292L28589m34440k95860
72d68133P83626k00853m87078J84831K84171l50390p1692L61285J14171k54993
82a05055k5952O9324p6480l3398J96315n435j95695J54737L53309j25976k07061
93a367K34278J62235k79921j67398R0533m0506j15230O3561L636r0268N9356Q3465
105B374m7480J3838L9633j21330j16540J00905J08111o7499m5731J01355J11928
$$ plain form
0 0 0 0 0 0 0 0 0 8 -8 8 -8 8 -16 16 -24 32 -37 45 -56 64 -80 96 -112 133 -156 182 -213 246 -285 326
30 326 -375 424 -485 550 -621 699 -785 879 -984 1099 -1224 1362 -1509 1673 -1850 2047
46 2047 -2257 2492 -2744 3024 -3332 3671 -4046 4462 -4929 5453 -6048 6730 -7520 8449
60 8449 -9555 10903 -12589 14767 -17698 21881 -28366 39870 -66422 262167 -172273 -468133
72 -468133 315493 114640 -372438 -187607 96564 -253826 -325518 35767 149938 -105055
82 -105055 -131007 -61683 -138163 -171561 24754 19319 -176376 -21639 331670 205694 -1367
93 -1367 232911 395146 115225 -52173 38360 -2146 -117376 -53815 -50179 -140447 -81091 2374
105 2374 -45106 -31268 8365 -112965 -229505 -128600 -20489 -87988 -133719 -32364 79564
116G9564P5623L8141m5166m8993L7342K5672j10875j19816L2185K6763o7660N5194
128b2026J12992j00377j34292J37272J25814j84229j42126J06512m965r7311J55694
139d7042J64984j45220q5471K49965J48831j81611r3433J08157m0042j41980L7347
150b5515R7774n4075q2127O1989Q6867k8932n6604o511j1698m5737m7861k5504
162a37934P946O2713O9216j6001j6581Q4935O3083j2094l103m0350r6003j4209
174d8382P4264J8073m2103j2733L96K3631P6470R212r5177o5261j0390k743P775
187f6968l975k5554P421O5054O2627J4001J256J629j2807o544o803l6347m6473
200e3483O490P2491K5507n7095O430P2331j1086n6701Q951j3940j01390k7967
$$ plain form
116 79564 155187 193328 148162 99169 136511 162183 51308 -68508 -36323 -9560 -77220 -22026
128 -22026 90966 -9411 -143703 -6431 119383 -64846 -206972 -100460 -105425 -202736 -47042
139 -47042 117942 -27278 -112749 137216 286047 104436 11003 119160 79118 -62862 -25515
150 -25515 72259 18184 -63943 -1954 84913 55981 -623 -7134 -18832 -64569 -112430 -137934
162 -137934 -129988 -67275 1941 -14060 -30641 54294 117377 105283 102180 61830 -34173 -48382
174 -48382 25882 43955 1852 -10881 -10485 13146 89616 98828 3651 -61610 -72000 -74743 -66968
187 -66968 -70943 -96497 -89076 -24022 38605 52606 53862 55491 42684 36140 29337 -7010 -53483
200 -53483 -46993 25498 51005 -6090 340 72671 61585 4884 13835 -105 -101495 -129462
212a29462R1743J8146n5204K8611O0108J9050L5808J5791o2609l3465N1491j2563
224B7445r6238J6382R7998k3589n6062P7795O2383r3671n5507J00344O717j65360
236a01363m3995J14256J9631n0407N0752N1610n5106J3160J26130j1930j37941
247b5203r413O0651m1760k8911P5009J4852q2392J9185J09257o481q6487k0497
259b2190J0620k5416l5174l313J9269J3165J9985K8347J5206J1786J4902N600
271E2787j2083k7413k8850j6508K0383L8439p056j8557J9994Q082N040K8067l5287
284B7038r2926j4319N0117k0730m2999M5600L3997l0035L9272P9338k3099o0798
296i544K3122M0066m7338n0874M2166L2303l3740J9612O7025k9204p2594M9176
$$ plain form
212 -129462 -37719 -19573 -74777 -46166 13942 32992 68800 84591 21982 -11483 40008 27445
224 27445 -68793 -52411 45587 21998 -34064 43731 106114 12443 -43064 57280 63997 -101363
236 -101363 -145358 -31102 -11471 -61878 -11126 40484 -14622 -1462 124668 112738 -25203
247 -25203 -34616 26035 -15725 -44636 30373 45225 -37167 -17982 91275 84794 -1693 -22190
259 -22190 -11570 -36986 -72160 -75473 -56204 -43039 -23054 5293 20499 32285 47187 52787
271 52787 40704 13291 -15559 -32067 -11684 26755 19699 1142 21136 29218 34258 62325 27038
284 27038 -65888 -80207 -30090 -50820 -93819 -48219 -14222 -44257 -4985 74353 51254 -9544
296 -9544 13578 53644 6306 -44568 -2402 29901 -3839 15773 82798 53594 -19000 30176
308C0176O3377j00538r7106N5263J7418o8311L1941Q5023l4780n6636P9588Q3863
320H9278n5357n7225L5294J0243m4403N455N6668P4l8255L8481N4262l8880m0193
333A5442K8744n404p1217l2612K0819j2978j8343M7127K8864l4863k895M9710
345A2394K5563k2870k8128r094l822J0823L3872K0037q424o777K3819L3452q763
358G2082l2076j9254l0666k7618M302m26k0557j681K6974J5790l336L697L160
371i609j376M980j4514k0520J2437J9692J5546K6620J6255q250m46K4243J0349
384G5407l2547m2507k0280j174j261j0992N010R472j4760P468L8481r411m0947
397c8041L326K0042j9713j4178L0482J7380j070L2650L1462j1768j1659J5327
$$ plain form
308 30176 93553 -6985 -104091 -48828 -31410 -99721 -67780 17243 -17537 -74173 5415 89278
320 89278 33921 -23304 11990 22233 -22170 -16715 39953 40027 1772 40253 94515 55635 15442
333 15442 44186 38782 -32435 -65047 -44228 -57206 -75549 -28422 442 -34421 -37316 12394
345 12394 37957 15087 -13041 -22135 -25957 -15134 18738 38775 30351 23574 47393 80845 72082
358 72082 40006 20752 -9914 -37532 -33230 -33656 -54213 -55894 -28920 -13130 -16466 -12769 -9609
371 -9609 -10985 -6005 -20519 -41039 -28602 -8910 6636 33256 49511 41261 40815 65058 75407
384 75407 42860 353 -19927 -21101 -22362 -33354 -28344 -18872 -33632 -26164 12317 2906 -38041
397 -38041 -34715 -14673 -34386 -48564 -18082 -702 -1772 30878 62340 50572 38913 54240
409E4240J0177k8103m0026q060L128o213N144J1909j0050j9236J2848K6847j2856
422b51l1974j1515n350O478K3110R167j854J6771K6081J2382N658O857j5705k0596
436A9259M59q865j9697K735R277n585N81R963n952j8679O769J1206l0940l6228
450f5697J2524L2159J967p960K7072K2516j7791J5590M4830j7997n4913R538K8051
463B9889k8473j9416L7428j42m1975K1467M2265k9775m5274J6449K0107l8131
475c5581l1654L2864K3168k1681J1587M5007l481k9256L1878L8988m3212l6858
487a8231L2432K727l4814K1044L8870k9146l7291L6870L4898l7301l7963J0596
499a7309P025k4012j1854K6622J4185j5851J0958L1669k578j0399J3541K473j9203
$$ plain form
409 54240 64417 36314 -3712 -11772 -8644 -14857 -9713 2196 -7854 -27090 -14242 12605 -251
422 -251 -32225 -43740 -49090 -42612 -19502 -10335 -12189 4582 30663 43045 48703 55560 39855 19259
436 19259 19718 10853 -8844 -6109 3168 -2417 -1836 8127 2175 -16504 -9735 1471 -29469 -65697
450 -65697 -53173 -21014 -19047 -27007 65 22581 4790 20380 65210 47213 -7700 1838 29889
463 29889 1416 -18000 19428 19286 -22689 -1222 41043 11268 -34006 -17557 2550 -35581
475 -35581 -67235 -34371 -11203 -32884 -21297 23710 20229 -9027 22851 61839 18627 -18231
487 -18231 14201 16928 -17886 3158 42028 12882 -24409 12461 47359 10058 -27905 -17309
499 -17309 -10284 -34296 -46150 -19528 -5343 -21194 -10236 21433 18855 8456 21997 24470 5267
512E267m779P032j1932j401K8265M922k2333n906J4405J2213j4326l3015p816
525b9404J0282o213r075K0052J9212j6995n924L7137J7307k3832j4713Q578L524
538I936j3552l236J5742L83j1299J3314J5164j7960j7068J8276L057m1622j1340
551d0205K7881o846j6045K7255J9902k1390n050L5290J1495k8720q640J3467q966
564e72j1848J8592J8281k2034j6782L5124J6429l9340j2953K6066j0557l7541
576c7135M653K5989j0180j2554K3939J7116r897j479J1561O074n439q234n279
589h65m120Q792J7387l758j5435L511J6376j012j8409m175L53j8140r797J0695
603a8597P613k538m659N993J8051R839r084q889J0991R383j7829j0396J8758Q883
$$ plain form
512 5267 488 7520 -4412 -5813 22452 27374 5041 -865 13540 25753 11427 -21588 -29404
525 -29404 -19122 -25335 -34410 -14358 4854 -12141 -18065 19072 36379 12547 -2166 6412 9936
538 9936 -3616 -6852 8890 9273 -2026 11288 26452 8492 -8576 9700 12757 -28865 -40205
551 -40205 -12324 -19170 -35215 -7960 11942 -9448 -14498 20792 32287 3567 -5073 8394 -572
564 -572 -12420 6172 24453 2419 -14363 20761 37190 -2150 -15103 10963 406 -37135
576 -37135 -32482 -6493 -16673 -29227 -5288 11828 1931 452 12013 18087 12648 4414 -865
589 -865 -4985 3807 21194 17436 2001 5512 21888 20876 2467 -1708 -1355 -19495 -29292 -18597
603 -18597 -10984 -13522 -18181 -12188 5863 15702 6618 -2271 8720 18103 274 -10122 8636 17519
617A7519r677J378J1827l454j2705N897O000k2366j9006O255K425r269M810J4992
631e374p726j1242K5114K0996k1996j3552K0152L690j9752O941K4872j2057j6416
644f350K7644J3767k8005p957K1236p312l4229j740K0187j3245j9612J8826K0901
657D111j6992j4147K6562J8854k2013j1016J6512q97o807J3771Q376q625J671
670I360J4230J152q688M67m025j3848q241N97K413o908j0815R605J5829o647j1276
685a6795R662J5040p366j5587N881J4480j695n875J1128J5619q101j0467K0183
698B6107R242k6692j2259J1864o954j7560R083Q791k1892m498K9205J717k4928
711a8774M472J9822j0798j9632J6507J9771j8303p911L1532J0664k3120J567K7912
$$ plain form
617 17519 7842 9220 21047 17593 4888 10785 16785 -5581 -24587 -18332 -15907 -25176 -20366 -5374
631 -5374 -13100 -24342 772 21768 -228 -13780 6372 10062 -9690 -2749 22123 10066 -6350
644 -6350 21294 35061 7056 -901 20335 13023 -21206 -22946 -2759 -16004 -35616 -16790 4111
657 4111 -12881 -27028 -466 18388 -3625 -14641 1871 974 -5833 7938 16314 7689 9360
670 9360 23590 24742 16054 16521 12496 -1352 -9593 -8996 -6583 -13491 -24306 -14701 1128 -5519 -16795
685 -16795 -7133 7907 541 -15046 -9165 5315 3620 -2255 8873 24492 16391 5924 26107
698 26107 35349 8657 -3602 8262 1308 -16252 -7169 1622 -20270 -24768 4437 6154 -18774
711 -18774 -14302 5520 -5278 -24910 -8403 11368 -6935 -14846 16686 27350 4230 5797 33709
724C3709p904l1294O963J4755k4358j1855K2763J052k7256K724K8657m102k4545
737b0691P978J3216j5974q044J9057R282j5692m21K5654O508j4127N150J3403
750B5299j0882j5540O998N501j8425n757J7170k448j4878N755J1621m029r644
763i259j089K555m579l104O820Q916j262n149J2594J5544o017n679N908m477p967
778C755L52R66m024n752O82O449J366o061j508O767n321j3864O348N753j2838
793a6930L011J8057j779q028J1816J5027n963r382M463j73r687l327O607J636
807E348j3901j266J9679j285j7330N961Q061j6148q178J3240j8j4556O936J7609
821D152k361m421J1438O936n626o131K985Q37j1865j850J0982k749r463N233J0042
$$ plain form
724 33709 25805 -5489 1474 16229 -8129 -19984 2779 3831 -23425 -20701 7956 3854 -20691
737 -20691 -12713 503 -15471 -23515 -4458 4824 -10868 -11289 14365 20873 6746 11896 25299
750 25299 14417 -1123 5875 11376 -7049 -12806 4364 1916 -12962 -7207 4414 385 -9259
763 -9259 -10348 -7793 -12372 -15476 -8656 260 -1002 -6151 6443 21987 15970 10291 16199 11722 3755
778 3755 4107 5073 1049 -4703 -4021 2428 3794 -2267 -3775 2992 -2329 -16193 -9845 -4092 -16930
793 -16930 -13919 4138 2359 -5669 6147 21174 15211 5829 10292 10119 432 -2895 3712 5348
807 5348 -8553 -9819 9860 8575 -8755 -2794 5267 -10881 -19059 -5819 -5837 -20393 -13457 4152
821 4152 1791 -2630 8808 15744 10118 3987 6972 7809 -4056 -5906 5076 2327 -7136 -1903 8139
836H139l430o917J567l498q207Q20K364k432P21K961N281Q735L393n77o92K053
852A0281j336p633l66L046n903j941Q365L270p545m73J0748m188j6134J071O271
867b467r367o299J1122Q197q520P20K0732L546j5754L135J1175j1218j1882J1618
881D738M919j7088P63K0820l776j4138P766P708j4238j1511Q475K081j6073o91
895b0245J9202K337j1157Q670J8955o390j4075R979N707j8199k294J4689k653
908D526j1404O731J2242k837p781J771Mr565o752K479J888q037j459J4681N691
923B178n539N689Q711k913o734J240J838n447l934N268N816j256l120O305P870
938A5972r563r854M765l591j3697N38R534l928p196J2042J4502n976m773R727
$$ plain form
836 8139 4709 -2208 -641 -4139 -12346 -11526 -9162 -11594 -10873 -7912 -2631 6104 9497 8920 8228 10281
852 10281 8945 1312 946 3992 -1911 -3852 4513 7783 238 -235 10513 6325 -9809 -8738 -2467
867 -2467 -11834 -18133 -7011 1186 -7334 -6614 14118 17664 1910 5045 16220 5002 -6880 4738
881 4738 9657 -7431 -6668 14152 10376 -3762 4004 11712 -2526 -14037 -5562 -3481 -19554 -20245
895 -20245 -1043 1294 -9863 -1193 17762 11372 -2703 7276 12983 -5216 -7510 7179 4526
908 4526 -6878 -147 12095 9258 1477 3248 3252 -6313 -13065 -10586 -8698 -16735 -18194 -3513 2178
923 2178 -3361 2328 11039 8126 1392 2632 4470 -977 -4911 357 6173 4917 1797 8102 15972
938 15972 6409 -3445 1320 -2271 -15968 -15430 -5896 -9824 -17020 -4978 9524 3548 -1225 8502
952H502K546j1805m722J1166q65j3264P556J6582n479q611J1380O069j6200q844
966e989R163n911j7567N671J3348o897p045J5245J2179j1064m646J2787k883j5411
980i020K960J1740m811q607J0630J3737o165n406R764j934j4674m386O100p333
994g405j2137O791J0309n491m60J1494L108o352j565K940k740p197J255O927J048
1009E25p90M895Q283Q56m300P64l375q822k602j598k940j971J54N095O538K0j082
1026c50L767Q71q415l917O482k484p848Q719J1046j491j868Q158O028p698q479
1041B521K474k790j1122j171P351j722n980Q743J0930p577m414R209m289j2976
1055a0813J936Q390n123o456J1895J2283n466j020R991L49j1477m063M249o623
$$ plain form
952 8502 11048 -757 -5479 5687 4822 -8442 -886 15696 10217 1606 12986 19055 2855 -5989
966 -5989 3174 -2737 -20304 -14633 -1285 -8182 -15227 18 12197 1133 -3513 9274 6391 -9020
980 -9020 -6060 5680 869 -7738 2892 16629 10464 5058 14822 12888 -1786 -6172 -72 -7405
994 -7405 -19542 -12751 -2442 -7933 -8393 3101 6209 -143 -1708 1232 -1508 -8705 -7450 -523 525
1009 525 -265 4630 12913 13769 9469 10233 6858 -1964 -4566 -6164 -9104 -11075 -10921 -5826 712 732 -350
1026 -350 3417 4288 -4127 -8044 -1562 -4046 -11894 -3175 7871 6380 4512 12670 18698 11000 2521
1041 2521 4995 2205 -8917 -10088 -2737 -4459 -10439 -1696 9234 1657 -2757 6452 2163 -10813
1055 -10813 -8877 -487 -5610 -12066 -171 12112 6646 5626 15617 15966 4489 426 4675 -1948
1069a948j0462N310O830m300K18P947K677m937k785J985m436p794J337M138M79
1084e741O35N498Q007K523j242k12j301l408n525m741J555j237l672N577O955
1099C671j647j684M368j27r072k934L681m963o794P836R616j959k147J2092Q241
1114A8178j1835n499R293m485j5435J975J1116o068p733J3008R774j0254k663
1127f28Q567n038j2843J073O324o905o321J2856J0573o928R80J3216M50j3199
1141B177q48P604r139j2048Q717Q164p551j095J1637L411q340k150M086o575r614
1156a1564J516M626k556k799Q767R465k176j147O881n15r085l273K967l113o779
1171h785L648P972j41j450M533L086m922o596l5j213q391j970P461L091k989M668
$$ plain form
1069 -1948 -12410 -7100 -270 -4570 -4352 3595 6272 1335 -1450 535 -3901 -11695 -10358 -6220 -5741
1084 -5741 -5106 392 8399 10922 9680 9468 8167 4759 -766 -5507 -3952 -5189 -8861 -3284 3671
1099 3671 2024 340 4708 4581 -4491 -7425 -3744 -8707 -15501 -7665 1951 -8 -2155 9937 18178
1114 18178 6343 844 10137 5652 -9783 -7808 3308 -2760 -10493 2515 12289 2035 -628
1127 -628 7939 2901 -9942 -8869 -2545 -9450 -15771 -2915 7658 730 1710 14926 15376 2177
1141 2177 1329 8933 -206 -12254 -3537 4627 -2924 -4019 7618 11029 2689 539 4625 -1950 -11564
1156 -11564 -10048 -5422 -7978 -10777 -2010 7455 5279 4132 11013 10498 1413 -1860 1107 -2006 -8785
1171 -8785 -5137 2835 2694 1244 5777 8863 3941 -2655 -2690 -3903 -12294 -14264 -6803 -3712 -6701 -2033
1187b033J1327Mo871L741K662r090o463M162K154m795n1R972M252n605N99M661
1203H626m508j0747k11L850q492m421J2097N720n918M745J1176k050r456L143
1217C554L520r996o365P546M905n679N10J1664L484r856K04O576r570j1631M544
1232f590L536q956q68J3176L501n006N953O351n531n506Q98L47n665l393O327
1247a426M210j893K334O581O48o021j263K16p905n724K487j83o71K984L430N316
1263C120K492j965m29R98m220o174J334L473m341N57J0273K952l374J949L629
1278A0274m130q703j356J880o989m693P953N161l947J639J0863K01j0357K979
1292G75N075j0657n738Q425L174o755L464J2771k24o893M355L436r206p808K776
$$ plain form
1187 -2033 9294 9298 2427 6168 8830 -260 -6723 -2561 -407 -5202 -5253 4719 8971 3366 3965 8626
1203 8626 4118 -6629 -6840 -2990 -11482 -15903 -3806 1914 -4004 741 11917 9867 411 3554
1217 3554 7074 -2922 -9287 -1741 3164 -2515 -2005 9659 13143 3287 3491 10067 497 -11134 -6590
1232 -6590 -3054 -12010 -12878 298 3799 -1207 4746 11097 5566 60 958 1305 -4360 -7753 -1426
1247 -1426 2784 891 3225 9806 10454 4433 3170 3386 -4519 -10243 -7756 -7939 -8610 -5626 -2196 3120
1263 3120 5612 3647 3218 4216 -4 -6178 -4844 -1371 -5712 -5155 5118 8070 4696 6645 10274
1278 10274 6144 -2559 -3915 -2035 -9024 -13717 -5764 -603 -4550 -2911 7952 8153 -2204 775
1292 775 5850 -4807 -10545 -2120 1054 -5701 -2237 10534 10310 3417 7772 11208 2002 -5806 -3030
1307c030Q90p940m66J0307K199m185M900O277m719o506K480P93q090j684P357
1322a417J525o77M580N137R47l069j203n75n410n334n26J752q44j321N353N644
1338D562j698j225K823j107n885l363K106m79l701K971Q331J308j599L574M687
1353A1305n311p165K500p69r085o62P383P9l699N195P987l845n736L803K38q804
1369f586k988N300J585m644L735J0867j39m778M860L527q085o761L924K0q742
1384h905J043R550m55l779N615N411n019o203K831M49q363k010O980J695k784
1399c944M208Q709m95n279L034J744q164m781L597m93m155J687P121J094k521
1414A362L108J485l873m574j234N66l292k078N463M055o83K057M983R57l989j895
$$ plain form
1307 -3030 -2140 -10080 -10546 -239 1960 -2225 2675 8952 4233 -2273 207 1000 -7090 -8774 -1417
1322 -1417 108 -569 4011 9148 10095 7026 5823 5248 -162 -5496 -6022 -4270 -5114 -6435 -1082 4562
1338 4562 2864 1639 4462 3355 -2530 -5893 -3787 -4266 -7967 -4996 3335 4643 3044 6618 11305
1353 11305 5994 -1171 1329 560 -8525 -9187 -1804 -1725 -5424 -229 7758 3913 -1823 1980 2218 -6586
1369 -6586 -9574 -4274 -2689 -7333 -3598 7269 7130 2352 7212 10739 2654 -4107 -183 -163 -8905
1384 -8905 -7862 1688 1233 -2546 3069 8480 3461 -2742 89 538 -7825 -9835 -2855 -1160 -3944
1399 -3944 264 8973 8478 3199 6233 7977 -187 -4968 -1371 -1864 -6019 -4332 2789 3883 1362
1414 1362 4470 5955 2082 -2492 -3726 -3160 -6452 -8530 -3067 988 305 2362 7345 8302 4313 2418
1430B418R88m325m370N00K860O17j543L962N449k275l904K297n45p263l225M160
1446d199M93m945M560Q534q50k595M514L200o785n190M213j192p891K157Q020
1461B044j373l089N675N059n475n472M373m88r884n15O708q77l121N654Q577l854
1477C942k915N750k31q028r69L117k753l341J953O765q7j012K984J235m195m084
1493a869O34m40n510M12L933J242K39K996L736J09j829r63J84k959l587k98L092
1510h78q2j454N163M192l627r93K825k282o573j475K573j710l579M151N895j215
1526I31q11M415K515o086l632M549k158p223L087O717k354k625O684M035n803
1541B241k226L560k606p341j07M150j200l575N193O467k928k198N420K44p147
$$ plain form
1430 2418 3406 -919 -5289 -4789 -1929 -1312 -2855 1107 6556 4281 377 2674 2129 -5134 -8359 -4199
1446 -4199 -3706 -8651 -4091 4443 3593 998 5512 8712 1927 -3263 950 -242 -8133 -5976 2044
1461 2044 671 -2418 3257 8316 2841 -2631 1742 1254 -8630 -9145 -2437 -3314 -6435 -781 7796 3942
1477 3942 1027 6777 6546 -1482 -2451 666 -2087 -5428 -3475 3290 3203 2191 5175 6410 2215 -1869
1493 -1869 -1235 -1675 -7185 -6773 -2840 -1598 -1359 1637 5373 5482 3653 2690 2874 -85 -3672 -3970 -878
1510 -878 -960 -2414 2749 6941 3314 2321 5146 2864 -3709 -5184 -2611 -4321 -7900 -3749 2146 931
1526 931 120 4535 7050 964 -2668 1881 -277 -7500 -4413 2304 -50 -2675 4009 8044 2241
1541 2241 15 3575 969 -6372 -6479 -2329 -3529 -7104 -1911 4556 1628 -570 4850 5094 -2053
1556b053j346M044k292n088M452N707k343k26M385J582m585k531J747j694n737
1571e978j60M097J39j495L408M827j385k757K131K45m961j737J944O43j908J282
1587a665N276J220k153J244J687k701m280n48J265l167k517M412L307j894L29
1602a85M534M01m963o96K626l267m406L113L418j744l15N047K822m243j130L554
1618D566k363o563K25M197k983l937N797M916m506m17N637j282o089J18L239l197
1634b642l811M130L964j946j97M713J861m561j758L959l033o642K232L715k524
1649b540j581M624L205l027n42K947j587l905r15J609O1k228J724M808k03j702
1665G48L023J380k944k560J397o88l872J59L108L13p43J157L026K12l932L91J587
$$ plain form
1556 -2053 -3399 645 -1647 -6735 -2283 3424 1081 855 5240 6822 2237 -294 1453 -241 -5978
1571 -5978 -6138 -2041 -1902 -3397 11 4838 3453 696 2827 3072 -1889 -3626 -1682 -1039 -2947 -1665
1587 -1665 3611 4831 2678 3922 5609 2908 -1372 -1920 -655 -3822 -6339 -1927 1380 -514 -185
1602 -185 4349 4750 -213 -909 1717 -1550 -5956 -2843 575 -1169 -1484 3563 6385 2142 1012 4566
1618 4566 2203 -4360 -4135 62 -2921 -6858 -1061 3855 -651 -1068 4569 3287 -2802 -2684 555 -2642
1634 -2642 -6453 -2323 1641 -305 -502 4211 6072 1511 -247 3712 679 -5963 -3731 -16 -2540
1649 -2540 -4121 503 3708 681 139 3086 1499 -2406 -3321 -1712 -1651 -3879 -2155 2653 2450 748
1665 748 3771 5151 2207 -353 1044 356 -3516 -3357 -249 64 -679 478 3504 3716 -216 175 1762
1682A762l411l278K721K565k728J03O066P15m222J618L419l472m360R33K186k961
1698b344k165N043K298l333J55M393p26n578J35L712l909l905M460L021l388K61
1714a870N664O57m604Q44L370m000l988K061K121k591j340M456K167l189J11L583
1730C452j625m573k79L068k558k481L679K653k181R98K990J60k270q03J320j233
1746C17l081K71K686L3k149K614L422k538j951K238j79l893p21J831K90j988P07
1763b091L848O48j946J391K281j957l909J882J612m121q48M850M26l433J911L861
1779D405k059l508J439J673m093k065L083J699l181O35M774M65m279J852L509
1794D349m213l362L090J247l830n62M723R54l572J598L357k063l731J024J919
$$ plain form
1682 1762 -1649 -4927 -2206 359 -2369 -2266 3800 4515 293 1911 5330 1858 -2502 -1569 617 -2344
1698 -2344 -4509 534 2832 -501 -346 4047 3321 -2257 -2122 1590 -2319 -6224 -1764 1257 -2131 -1870
1714 -1870 3794 4451 -153 691 4061 61 -3927 -1866 255 -2336 -3676 780 2947 -242 -131 3452
1730 3452 1827 -2746 -3025 43 -2515 -4996 -1317 1336 -845 153 3143 3303 1033 230 1550 317
1746 317 -2764 -2493 193 226 -1923 691 4113 1575 -376 1862 1683 -2210 -2931 -1100 -810 -2798 -2091
1763 -2091 1757 2405 459 1850 4131 2174 -1735 147 1759 -2362 -3210 1640 2066 -1367 544 4405
1779 4405 2346 -1162 277 1950 -2143 -4208 -1125 574 -2607 -1972 2802 3267 -1012 840 4349
1794 4349 136 -3226 -136 1111 -2719 -3281 1442 2396 -1176 422 3779 1716 -2015 -991 928
1809I28l473k241L787J243k633J284L261M93l249P60K273k615k971K217J352j943
1825a527q37L691J282k308J42K499j504l067j53J575q95k398J646L154j459q36
1841i95K754J210k466j504K376%l934O69L071o67j655J952K679j493k509K118
1857A606P20l977j376L095R5l243J240M407j349k609L289J598l567j505K192N18
1873A134l226j7L720o24k199K065K847k043k654J511J178l840j336L524l58k715
1889c033J827L039p63k054J441J754k642j484J637L22k180J4L010O74k203P20
1905G9K819j413k425P95J041k197j844K198J206j779M91K372M57j637m08J535
1921A290r07k462J056J275m14j824K360K405k085p60K495j89k992j05J598j005
$$ plain form
1809 928 -2545 -4786 -999 244 -2389 -1105 2156 2649 -600 160 2433 -182 -3153 -936 416 -1527
1825 -1527 -2364 1327 2609 301 443 2942 1438 -1629 -1782 -207 -1102 -3500 -1854 1300 -159 -995
1841 -995 1759 2969 503 -1001 1375 1375 -2559 -1890 1181 514 -1141 811 3490 1997 -512 1606
1857 1606 2326 -1651 -3027 68 163 -3080 -1840 2567 1218 -1391 1898 3496 -71 -1576 616 1134
1873 1134 -2092 -2109 1611 987 -1212 853 3700 1657 -997 514 1692 -2148 -3484 40 -318 -3033
1889 -3033 -1206 1833 1070 -984 457 2211 -431 -1915 -278 44 -2136 -2122 888 1562 -641 79
1905 79 2898 1485 -940 -145 896 -1301 -3145 -947 259 -1520 -1029 1343 1800 163 -245 1290
1921 1290 383 -2079 -1023 252 -162 -1986 374 2779 694 -66 2429 2240 -752 -857 741 -264
1937b64k524J679K626j679q15K246J361k201j585K234J83l574K88L440j039k176
1953a800K295K709k268j466K940l30l694P9K170p73k089Q69K816o97k228K322
1969H55J773k719j648K336L31l460J88L449j086j679K333J705j540j088Q89P29
1985A368k330j203J904M83k113L2L055L37k740J288K114k359j845J664N25j610
2001a430q36K254J035j436O16J559K00k664L70J742j659k788K506J488k060m06
2017a509L401L29k677J06K420j345k947J244J464j268j042K313K133k643o60L295
2033B614j80l679K40K609j756k729K361K300k276q40L388L21k821l1K174r66l184
2050b455R21K747j751j399K679J775k054j309L013k51l578MK419j310k154J756
$$ plain form
1937 -264 -2788 -1109 1517 -162 -977 1269 2630 429 -1156 1078 1261 -2313 -2025 1415 376 -1800
1953 -1800 495 3204 936 -530 2410 2080 -1614 -1535 635 -138 -2227 -1358 1458 761 -1467 855
1969 855 2628 -91 -1739 597 928 -2532 -2344 1105 19 -1660 673 2378 838 -250 639 1368
1985 1368 -962 -2165 -261 222 -1891 -1859 1196 1533 -1207 81 2195 -164 -2009 -345 180 -1430
2001 -1430 -2266 -12 1023 -413 203 1762 1962 -702 -332 1410 -249 -3037 -531 957 -1103 -1509
2017 -1509 1892 2221 -456 -350 2070 725 -2222 -978 486 -782 -1824 489 2622 -21 -681 2614
2033 2614 2434 -1245 -1005 1604 -152 -2881 -520 1780 -496 -1336 2052 2373 -448 -479 1695 729 -2455
2050 -2455 -1534 1213 -538 -1937 742 2517 463 -846 2167 1916 -1662 -1658 761 -549 -2703 -947
2066i47K041r79p62K028L62k240o32J352l22k127J50K418k12j479J602J917j305
2083H65j236J481j18k306q73J915o5j459Q94K152L21j796N23J709j782k041J423
2100c93Q37k284k78K512J054k380J367K388j495j929Q28P30j694j426J697J266
2116H00j833K42K633L19j900K03J643j569k547J199J266k291K15K391J068j691
2132A48N01J636p50k451P37O62j264j236J200J487o00n81K184M99j998j92R59
2149I41j007j710J38J509o59l38J475J367q17n48O11M72k124j127R35O81k129
2166b330J018K313k41j189J014J369j750q07P7L37j757n74J924M22j026K228R11
2183A939m58j969J088r2j463j806L084m71j721J455J676o6j256L90J916k172j697
$$ plain form
2066 -947 1094 115 -647 1381 1743 -497 -1129 223 -99 -2226 -2076 342 130 -1349 253 2170 865
2083 865 -371 1110 992 -1314 -2187 -272 -337 -1796 -902 1250 1571 -225 298 2007 225 -1816 -393
2100 -393 444 -1840 -2118 394 1448 -932 435 2823 1328 -601 227 957 -737 -2163 -466 800
2116 800 -1033 -791 1842 2161 261 464 2107 538 -2009 -810 456 -1835 -1620 771 1839 148
2132 148 649 2285 1535 -916 -179 483 -781 -2017 -817 670 70 -511 1673 2172 174 -18 941
2149 941 -66 -1776 -1638 -129 -788 -1126 349 1716 899 351 962 1434 -690 -1817 -882 -201 -2330
2166 -2330 -1312 1001 760 -429 585 1954 204 -603 -526 -189 -1946 -2520 -596 -174 -1200 1028 1939
2183 1939 1481 -488 600 508 -955 -2761 323 -148 -1869 -414 1262 1196 -60 330 2246 74 -1623
2200a623J233P64j889l77K440J080j834O6K724n55k817N17J202j856j822K438
2216c09J279j698L24K495M4j969K71J244j296k483M73J960j441m49K294J155j250
2233F44o25K364p36k959J86J629j802j093J542J768r07o43K145P53k264p31J346
2250F17p85k245M49K347j027r26K345J558j643j014J497p1k712l46J869q81j453
2267b421J731K047p62r07J667R15k494j280J657k82k407O92K741m34j405K004
2283A062J738k224o93J061k27k327l66J952Kj404J475K149j152j006Q09J094k611
2300f68r53J374Q0j644R32J962k69q04J111J271j388j823J114n0j688l92J614
2317b21P82j092P70J802n77j325J58L19j159j429R81P66p18K60J722M90r15J30
$$ plain form
2200 -1623 -390 374 -1515 -1892 548 1628 -206 -140 2584 2029 -788 -271 931 -925 -2747 -309
2216 -309 970 -728 -404 2091 2135 166 437 1681 385 -2098 -1625 335 -1106 -1555 739 1894 644
2233 644 19 2383 1647 -1312 -1126 503 -1299 -2392 -850 918 11 -632 1513 2266 2 -729 617
2250 617 -168 -2413 -1964 383 -644 -1570 775 2333 690 -324 1173 1102 -1610 -1956 -87 -968 -2421
2267 -2421 -690 1357 595 -312 1355 2270 -224 -1504 153 -129 -2536 -1844 897 463 -942 1062
2283 1062 2800 576 -117 944 717 -1610 -1976 -24 -22 -1426 49 2198 1046 40 849 1943 -668
2300 -668 -1621 -247 -167 -1811 -879 1083 814 10 1121 2392 1004 -819 295 245 -1443 -1835 -221
2317 -221 561 -531 239 2041 1464 139 297 616 -543 -1972 -991 -225 -943 -683 1039 1529 614 744
2335G44O21n36j677j53O26p24n69J484J003j35p40J402L90k339J79L99r74j349
2353b348Q65J608j45n20J668P26q36q16L30Nj846o10J453n3r44J393J775o44r98
2372F3R53J72j366j064O47l62o36N22J165Q26p02N37J395j207j049R0M01j273
2390h88q94J484Q97j088O43J692n03r20l8O01j288j545O08R98o06o8J667J212
2408A964j378j10J221m86k301L68P74r44j069J626J158l19m08J612j04j669l98
2425d63J512j178k127J097J354n26q58K504M23j223o65J383n88k322J41J298q13
2442a051o84J405J906q34r42J543N38k488j001J929j092j603J174J847l79j091
2458h23K161R08k045L2N33o74j868L4J725j30r92J553J721q20j189J059J32k457
$$ plain form
2335 744 1365 829 -848 -1001 -375 -1099 -1668 -184 819 684 -56 1346 1736 -603 -424 -25 -999 -2348
2353 -2348 -1483 125 -20 -540 1128 1854 1018 202 532 537 -1309 -1919 -466 -519 -1463 -70 1705 1061 63
2372 63 1016 1188 -178 -1242 -595 -957 -1593 -1071 94 920 218 755 2150 943 -106 -16 385 -888
2390 -888 -1782 -298 599 -489 154 1846 1343 423 385 986 -302 -1847 -1239 -241 -847 -915 752 1964
2408 1964 586 476 1697 1211 -1090 -722 52 -892 -1961 -335 823 504 96 1708 1604 -65 -463
2425 -463 1049 -129 -2256 -1159 195 -331 -1189 1315 1738 515 -150 1233 645 -1677 -1536 -238 -1051
2442 -1051 -1735 -330 1576 742 -200 1343 1881 -607 -1608 321 -771 -2374 -1200 647 268 -823
2458 -823 1338 2246 201 233 766 92 -1776 -1742 -17 -147 -1139 414 2135 1315 126 1185 1317 -1140
2476a140l00J229l21j057Q71K008n08p78J400O38j597j466J157k47j094l17J813
2493B91M15j356J187J691r25j338O27m7j747o70J561j93r43Q57J836j33j026M16
2511E03Q65j429j687J185N51j356j67K067M67r88O88J312j317j307M65J29j405
2528a424n51J219P08m48M14J686k87j347PP50j167r82J39J269q99K1J610N36q05
2547D49J18O06m43j529l55O55n64m30J021J174j60k90R12J83j328k70O45p62p79
2566a147M6J182J32k01J058M93o64j80k50j58j087n06N89K89n11N60J315J10o60
2585D10K32N83j265q77L37J44o76O7J174Q27q53M38J096m03j381o9L39j081o22
2604a580Q65J011n23l71J571L24j108l86P40o61j440M01P54l74j54J243R37o60
$$ plain form
2476 -1140 -1440 -211 -532 -1589 -718 1290 782 4 1404 2042 445 -1021 136 -111 -1205 -1522 291
2493 291 706 -650 537 2228 1303 -35 592 545 -1202 -1872 -311 -504 -1447 -590 1246 1113 87 503
2511 503 1368 -61 -1748 -563 -12 -1368 -1535 532 999 11 699 2011 694 -613 -148 -19 -1424
2528 -1424 -1975 -756 -48 -496 -82 1604 1317 -30 -23 727 -440 -1422 -1283 -14 -913 -892 718 1254 449
2547 449 567 1173 730 -799 -1154 -499 -1063 -1493 -472 702 542 252 1164 1347 19 -251 394 -368 -1147
2566 -1147 -1101 81 213 12 1070 1563 899 719 469 311 -776 -1282 -693 -404 -915 -355 960 1070 410
2585 410 642 1225 -40 -917 -580 -436 -1112 -1045 129 956 103 541 1637 1234 -147 -216 123 -958 -1580
2604 -1580 -715 296 -227 -598 973 1297 189 -197 543 -118 -1558 -1157 -403 -777 -931 312 1249 589
2622E89m80J297k80j940j03Q44m11j368J035J617o07n76J606J13j321p24P15j04
2640i8j478K03J841m18m96J083J103o42j057R32j19j825j08J116l38r59J030J832
2658A602o50j124J147N07j995o90J170j98j426N38J589m6p41R20J467j249j278
2675d57R32J70j588l21J360K45j531J203J376l55j168L41Q42j816q85J123N33
2692Dj380M07J818Jj261P93J173j407j215J013k3j110L22Q85L65q22Q49J437q62
2711I87j416M47L28j172p86R38O86j282P19J692k66p92K79O67r21j308Q45K40
2729a15p93n0J239P48p24N7J064o75j148K35L65r99p99J176N32m36J89J435j76
2748A125r08J48L56l81j343M52P47o08j09J161O20q29j51M53k13j282l14O60k51
$$ plain form
2622 589 109 1406 1126 -814 -917 -73 -484 -1852 -817 800 193 -383 1223 1336 15 -709 6 -98
2640 -98 -1576 -1373 468 50 -446 637 1740 1098 41 973 854 -971 -1079 37 -301 -1260 -230 1602
2658 1602 952 -172 975 1482 -513 -1203 -33 -231 -1657 -1119 470 424 -317 603 2070 821 -457
2675 -457 475 645 -943 -1264 96 341 -1190 13 1389 1034 -134 207 1049 -767 -1652 -529 4
2692 4 -1376 -969 849 850 -411 382 1555 148 -1067 -54 -77 -1187 -865 20 385 -437 412 1849 987
2711 987 -429 18 346 -826 -1612 -674 12 -1270 -551 1141 875 83 362 1029 108 -1200 -355 -115
2729 -115 -908 -958 281 1029 305 362 1426 751 -397 -162 203 -796 -1595 -419 113 -323 -134 1301 1125
2748 1125 217 365 721 340 -1003 -551 196 -412 -521 640 1260 431 280 733 520 -762 -1076 -416 -667
2767f67m71R63O24k74k23R75J10j324k5M26l99r07K22J178k08l63P68N87l37n29
2787A26j56M55j091o23Q84k65l3K43Q12K17l06l8N80o82o47L07Q7n99K9Q42N05
2808F47l84k38P42O3j193qK42l43o17L42R82j60k68R58M16r41l32O81k89j179
2828h79L26Q48o45n0R76N21m50m11N95K00j345m33O46j4r23L68J298l67p71J112
2848F02M02r54l42O86j57j308M15R42R3r88Q81J091n18j014N67N61j578o56J414
2867A39k22q70L64J167k17o41M77O84p92r01L86N76j188m1J407K35j016Q68R54
2886A369o91j102N34N29j400n43J357O3r58N16J428p61p99N27N48o99j097J004
2904a75M17q57j71J388M68j206K71J169n03j540Q12L93r17m22J052M97j045o8
$$ plain form
2767 -667 -1138 -175 449 175 -48 927 1037 -287 -312 114 -285 -1192 -970 208 0 -363 405 992 655 126
2787 126 -30 425 -666 -1289 -405 -670 -703 -460 352 569 263 225 805 123 -524 -217 -130 -729 -700 142 647
2808 647 263 25 767 830 -363 -371 -129 -472 -1089 -747 235 75 -193 765 1181 240 -92 589 300 -879
2828 -879 -553 295 -350 -400 576 1097 647 236 831 1031 -314 -747 -101 -115 -1038 -670 628 261 -510 602
2848 602 1004 50 -292 394 237 -1071 -656 286 379 -609 272 1363 845 -169 398 959 -619 -1275 139
2867 139 -83 -953 -589 578 361 -280 197 881 89 -812 -426 150 -1038 -1079 328 563 -453 415 1369
2886 1369 678 -424 110 639 -761 -1304 53 116 -842 -326 1102 341 -458 69 617 -82 -1179 -175
2904 -175 242 -615 -786 602 1070 -136 135 1304 801 -739 73 466 -451 -873 179 676 -369 -437
2922d37J425k92r32K47L78p45q61P72J143j215j17J493L0q06K10R96j106q93P47
2941C7M21o93n31Q03N52o59j81P73o3j039K08Q51o94r80J062N03o53j77J060L29
2961I29n95j55L74m43o78NO63j29n01O64O31o05l30K36M91j122k16O06j17m08
2981g00M30N30m91J44M58M62n63m48O12l60n86J8M26J05l20L96J86q1l28P7K33
3002B00l04o04K62N98p11K51P77J26n25J13M86l84m46L29J1m05l58O67K22j31
3022A74r6N86m30m10L34l4m37o09N32M32l45k32R67L19o14n7O28l29n79j36M66
3043A30l7o59N81N90l93k66M84m8p08l76P27j0p80R5Q28Q0n90J89Q34j96p57L54
3065G2M22r33l64J050pn11J46P79k21q52N44K55m18q80O50J28p15K10Q44K49q41
$$ plain form
2922 -437 988 696 -236 11 389 -356 -1217 -445 698 -517 -634 859 889 83 293 1289 183 -710 37
2941 37 458 -235 -766 37 589 -70 -251 522 459 -580 -372 479 -215 -1195 -133 370 -283 -460 600 929
2961 929 334 179 553 110 -568 -563 100 -29 -530 134 765 160 -170 66 557 -565 -781 -175 -292 -700
2981 -700 -270 260 -231 -87 371 833 270 -178 434 74 -512 -494 -68 37 -283 113 299 218 -110 -33 200
3002 200 -104 -708 -446 152 -559 -308 469 595 70 183 669 285 -161 168 179 -226 -584 83 305 174
3022 174 78 664 234 -176 158 124 -313 -922 -390 42 -303 -535 432 751 137 80 708 379 -200 -336 130
3043 130 93 -566 15 605 212 -54 430 382 -326 -702 25 15 -765 -670 158 238 -352 -163 671 475 -282 72
3065 72 494 -439 -803 247 240 -271 -125 654 433 -419 125 380 -38 -918 -268 -140 -855 -645 199 448 -393
3086c93K80R05p23n37O26M71q60j95P19M41j166K45J109m16q58M84O24r66j029
3105a239J240M70j201J64R76J40q31M80P15o61q78N41P08j017k70Q81M71r18P9
3124a50J139l96j013J49J004q92o34O12O68r87N3J081j83j033N48N21m48o78L77
3143b62N44o68l10Q81L70o54j30O76J58q99p7R64p96n81P60K69l90m65R03K06
3163D99o45l21Q58l58k43k2N01j55l96M53P21p43l97R94j98r98L8M45k11p41O40
3184b79L62n99k1N55O63q86r8N83p6n46NN84k05k49M10O21n14l46P51k50q64k
3206d01N22j90m22M41L68j45o6j32L23k19o53P44k89j66J23M09J16q40L55O00
3226D78j92m71P12k35j2j129M01N6L99p72P61J69n6q67P94K01p05k3P01r25l41
$$ plain form
3086 -393 -113 792 69 -468 158 629 -231 -426 293 734 -432 -187 922 506 -352 132 756 -210 -1239
3105 -1239 1 471 -730 -566 410 550 -281 199 914 253 -625 -84 624 -393 -663 218 689 -229 -150
3124 -150 989 593 -420 -271 733 -159 -793 -181 487 -500 -447 634 451 -582 -34 487 39 -639 -262
3143 -262 282 -386 -696 185 555 -99 -229 447 605 -294 -371 593 -203 -784 -24 245 -145 -610 293 499
3163 499 -146 -467 391 33 -210 -232 269 114 -282 171 892 149 -248 746 548 -450 -412 33 -178 -919 -279
3184 -279 83 -516 -537 18 681 -205 -303 280 204 -342 -337 247 42 -207 203 824 310 -36 715 465 -399 -401
3206 -401 121 -69 -491 -50 318 173 107 -25 298 79 -574 170 -119 -285 -162 247 363 -477 -122 478
3226 478 286 -185 527 292 280 -849 -448 -392 7 -765 -4 165 109 -758 36 237 -468 -491 210 -715 -1056
3247a056J480o00J65l8N05K60m11p07Q78m20p32J95P14l46k28N07L63l80r13Q76
3267A12o38L70l51Q91l10l72n1J257j004N8K73m17L75m58l39N19l78O86K24j061
3287f14O71K35L86j047k02M96N23p73j61O60k30l03O86L60l40m12N16J66l14r37
3307f34N20M15q69J96J007n37k36J15L79k50m81J85K55m51m93R02M02q69K59Q74
3327F89N0r50J15N02r61j16O20N81j036M4O75R6o44M1M40k80n50L27L87n53oN30
3349AL94m94q2J054l31p42o9P64o15n00M08N98l71l09O59L32q19m6N58k34p75
3370f19j8Q16k48n15N05O41m81o3O07m4n38j43K26J04o89L91M17k99l24N89J87
3391E02m79j51J66k95l12m1L00P6lJ84O68l78j17L81k82k19l61M84Q3m54J65L86
$$ plain form
3247 -1056 424 -176 -11 -49 456 716 305 -402 476 56 -676 -481 233 -113 -341 166 529 149 -764 112
3267 112 -526 -156 -507 384 74 -298 -349 908 -96 -38 235 -182 193 -265 -604 -85 -463 223 447 -614
3287 -614 57 292 678 -369 -571 -75 448 -325 -486 174 -56 -359 327 687 347 -65 451 617 303 -634
3307 -634 -114 301 -568 -372 635 98 -138 -23 356 106 -375 -190 65 -386 -879 23 425 -444 -185 689
3327 689 739 -211 -96 406 -555 -671 -51 530 -506 -462 213 309 -335 -294 146 -134 -684 -357 30 -523 -529 1
3349 1 395 -99 -181 873 542 -200 -269 495 -120 -620 -212 386 15 -294 365 697 -122 -168 390 156 -619
3370 -619 -637 179 -69 -584 -79 562 81 18 625 581 43 -100 126 230 -459 -68 349 50 -274 315 502
3391 502 23 -128 38 -257 -569 -610 -310 -234 -237 -53 615 237 120 501 219 0 -361 123 206 -248 -83 303
3413C03m28K40K97j08l77k88m7K20l52K1O89l09o8N09R8r5m86K6O25o91k15K58
3435a78K13j08k18P89j99n37K78M79r99QL63n5j49j78Q59j25N1j89N00j21j47
3456C37m19K85m46L8J09K64j63LM41m3k14l00L14l78l46K45K30j54l30N64N18
3477E55m69k06J87M03o25l10P83l03n90P08K43k34J84k86O04o60l50L03J19n24
3497d68j64P96j86n66O48O34n57n62O59J22p39m50Q94L20p46K08P87k22l17K82
3517C73p1m11l85J31L52m33k69Q88J63l64J1O59m26k68O9K14n66k10N42L80n54
3538a75L75M17o8n06J87J54m16n96M75L62o88n3Q56O6k34l5L99l06n59J11K41
3559Gj81m18N25M56k19j47N87k2o79M1L92n35m02K9N96%m83M12P12o94J94Mj03
$$ plain form
3413 303 -125 115 412 304 -73 -361 -408 -188 -540 -519 170 -139 -207 302 400 305 -181 -155 470 -221 -436 -178
3435 -178 35 -73 -291 498 299 -238 40 519 -480 -472 -109 -164 -313 -491 368 243 294 105 605 484 337
3456 337 -82 203 -243 -205 -96 168 5 8 449 406 192 -108 206 -172 -518 -273 -43 -197 -527 37 555
3477 555 86 -120 67 470 -155 -465 318 15 -575 133 376 142 326 40 644 -16 -366 -63 56 -468
3497 -468 -632 164 -22 -588 60 694 137 -425 234 356 -383 -833 61 381 -365 -157 630 408 91 373
3517 373 302 -109 -494 -363 -11 -444 -713 175 338 -26 -15 644 218 -50 19 233 -333 -543 -1 379 -175
3538 -175 200 617 549 43 230 384 -32 -628 -153 209 -479 -532 324 390 156 121 520 214 -345 -234 7
3559 7 -174 -592 -67 389 170 23 610 588 -91 -50 342 -193 -595 -566 30 30 -453 -41 671 -23 171 175 72
3582G2o73L6N67j10o64P83M95k96k36P46j80p10n4M92o88m84O28L32k25j22M81
3603A90J90k38m44L09l52k60M9M55J32n10O01N64k89l21L34M2p44lJ42J31l88
3624d10j5M48J24j37J92J51k04m64J16K2j38m56J115n22K25J20J5M15p15M66n00
3645a52N1Q07j153K79l1j7J335j029j15k18K68o19k62P66J70n19K60L03k7p4J36
3666A59L09L37o07k51l0M1m17M44j19K88k22L07L23o21j36L29K9o74K23J67m5
3687a66j68L85J96J90l59L56J6l81n64M37J9n32M27O56m36l3J26M38o16k27P9
3708a57p4j10l88N84o4K17J25J95J71o24N42j41k74m00O3K46N5J96L14kl95J86
3730B65K52n77m98RO52m07k17P57Q7l74Q6M83Rq16L52L72n82k45K60K40j62L00
$$ plain form
3582 72 -601 -565 2 -108 -772 11 506 210 -26 720 540 -170 -224 268 -420 -904 -276 56 -169 -291 190
3603 190 380 142 -302 7 -345 -605 -556 -101 31 -479 122 686 397 76 410 452 -292 -295 -153 -22 -410
3624 -410 -425 23 147 10 202 353 149 -315 -199 -177 -315 -771 344 -178 47 167 182 597 -118 348 -152
3645 -152 -101 706 -447 -168 -199 -216 1119 90 -25 -243 25 -594 -856 -90 80 -439 -179 124 97 23 159
3666 159 468 805 198 -53 -83 -42 -459 -15 -134 154 -68 239 562 -59 -195 134 163 -511 -288 -121 -166
3687 -166 -334 51 247 437 78 434 450 69 -495 -58 -39 -571 -144 512 76 43 169 607 -9 -236 -157
3708 -157 -231 -341 -729 -145 -209 8 133 328 499 -125 417 276 2 -398 -335 -89 -34 162 476 474 79 265
3730 265 517 -60 -558 -549 103 -304 -521 236 323 -51 35 518 527 -289 63 435 -147 -392 -132 108 -54 246
3752B46K47J62n01n8M4o2o34q6M08j47k60O89K59j39l97Q29m34m39j63N71k33
3773i8n03N45L69P3k93K95j17m35K4K98l46o95L98N08q8m65Q16J81k65l80K36
3794E8j46k14p5L29P1m67M13M15K17o42N86k88m61l69L29J63k55J02N64l05j58
3815a33K67M68n21j29Q0l0j63k09R3M34l13L11N93m95l68L95Kr4n69J98J32l42
3837c93J39O54k45k80K11K27j13l34k10N02m06k64K19N72j7m47M49J6k99K50K7
3858B58m32m54M37J36J87m69K46K95k90k2Q9Q8l37N7K50q8m04J69P73Q4l14M8
3880C07J62k90j59n51O57q99Q18j35J99j40k05Q26J43q89j29L61k9n86M90n70
3900f19O68o8J53K55k42j118J528k62m13M01p53Q04r02Q12j0p46Q02m42L02K70
$$ plain form
3752 246 493 655 154 96 140 78 -556 -642 -234 -381 -641 48 307 168 -229 600 166 -273 -436 135 -98
3773 -98 -601 -56 313 386 93 388 271 -164 -140 158 -188 -883 -485 23 -65 -530 286 467 202 -178 58
3794 58 -88 -302 -377 -48 23 -444 -31 384 601 -41 545 257 -204 -573 -244 -81 -336 -234 330 25 -133
3815 -133 134 602 81 -48 32 2 -161 -370 -277 157 -156 155 748 253 -115 280 282 188 -381 -183 -51 -393
3837 -393 -254 400 155 -125 86 313 200 -134 -344 158 -248 -512 -293 279 262 -185 264 280 -19 231 258
3858 258 -174 -628 -191 -55 132 -337 -91 204 -86 -108 -19 69 -268 -211 39 -49 -453 -284 489 573 259 307
3880 307 469 179 20 -531 126 -773 45 -90 109 -31 -236 590 733 -156 -285 76 47 -539 -49 -619
3900 -619 49 -19 134 389 147 -971 557 295 -118 283 -470 334 -568 244 234 -512 290 -152 150 420
3920D20j12l34m82p03R75J10rJ79L83p1J70M66l80p40j55j30N55n30m68Q76M47
3941D67k53j60k6K63q50J70N91l06j44M57l64L48pJ6L06k52p7j49j83k39L9J75
3963a78Rj49N21J23J2n65J81J36k96j05J01J2J2jN84k20j01q2M25m12l20O88k90
3986H5n15M55k1J06k96J67L20m01k1J00L1m23j16L25N26l87J05L27j32l57L58
4007B36l5m87J90K43l89j38M19L67l92l52O13j27j87l35J85J08n17K21L97N2J60
4028B32r0M27k54k30K26k59j65m38J78L38J15J32J47q0n11K41r2L25o18K07R4
4049g5l56L2M06M39o25L93J55j99l84qK31k50J32J13j2L7j35K50N9j24l80L17
4071A6n0l12J03K85L5j74M13P7m18QO6J0m17K38R2J99n24O03R8l11mL05m1j70
$$ plain form
3920 420 308 -26 -508 -1211 -236 -126 -135 44 427 356 526 992 612 -128 -283 -413 142 -388 -856 20 467
3941 467 214 54 28 291 -559 -389 202 -104 -248 209 -155 193 186 202 508 256 179 30 -153 -392 -353 -178
3963 -178 -169 -318 203 326 338 -227 -46 90 -206 -311 -210 -198 -186 -187 397 177 76 -6 419 7 -313 375 85
3986 85 -430 25 4 110 -186 -19 301 -100 -121 -21 10 -413 -529 -204 322 -65 40 367 235 -122 236
4007 236 201 -286 -96 147 -242 -380 39 406 14 -338 275 148 -39 -374 -189 -81 -598 -377 20 72 232
4028 232 142 569 315 85 311 52 -113 -551 -373 -35 80 212 359 279 -232 9 -83 242 -376 -169 -75
4049 -75 -431 -399 7 446 -179 214 369 170 -214 -222 9 -241 -109 4 -8 29 -106 144 203 79 -301 16
4071 16 -34 -346 -243 42 77 -97 316 393 -25 -17 49 59 -358 -120 -28 171 -353 250 348 37 33 338 297 127
4095A27k04n6k70O09l47M69k05k75J05P58p92r37N99Q84m73j178P18N03n54Q61
4115C42P5o6m36M07K72j069L19k77L13l41P15k47K44l97J13M68k63k32J93k33
4135a00l00M2K68L85k88J5J74L9l96L0N01l63k88M4L03k59O3L68p5k84k8N11j83
4158A79k27k12K62r9k14J92K53k16j75M24K18l97K04Ol39P2p4N13l11k02K71J99
4180C27m13M9J59M9p62N48J52j26J67j59K36p1j11J60J92k83l18j06L17k64LJ28
4202a26J51k51J81J94k49j53L33J92l16k56L09j4k85J52K95j5j47K16n3j20k23
4223a85J64J32n13L49K62j1j52J08O4l16l92K53O10p05j6L31M85n32J02L86j52
4244B72n19J51K19j49l57M87j22r4J14K76j52l36K42K86k10k90j54L95l41K91
$$ plain form
4095 127 -77 -133 -403 206 -141 328 123 -152 -47 711 -81 -1018 -419 465 -8 -1186 -468 35 -519 342
4115 342 417 351 -85 322 594 -475 -156 -433 -120 -461 254 7 251 -146 -33 435 172 -60 133 -100
4135 -100 -400 -358 -90 295 7 22 196 235 -161 -131 370 7 -281 -237 66 -193 -130 238 163 -121 -149 362 179
4158 179 -48 -260 2 -97 -311 -119 134 -82 -257 167 385 -12 192 198 -141 -69 -143 370 59 -143 128 327
4180 327 -86 -37 122 171 -591 -43 109 -17 150 -9 227 156 45 205 397 114 -204 -310 7 -257 -254 -126
4202 -126 25 -226 -45 149 -100 -253 80 272 -44 -300 9 -5 -290 -138 157 142 -5 211 158 38 -185
4223 -185 -21 111 -402 -53 209 198 46 154 218 -98 -490 -237 373 -332 -348 -17 468 -64 38 424 272
4244 272 -247 -96 123 -26 -383 104 -18 -112 2 278 126 -210 32 318 108 -182 -336 59 -282 9
4264In5P8QR8J40p6j59l59N32k34J17j18m2nK28k86J61l82M26m5q8j98o8L32l29
4289c15K93N8L15k76J0J26J1l19k86L28R8j60K71K2j54l7k43L60k03o4K1J50l50
4312c44MK62j9M9m7K86j18k34K26L62l65j46K16J57o10N8P57l08l76L71J8m19
4334b20J98q7K83j67j97N67l1m88N5M33l32j1P7n8Kl78L73J80j57p5J74L6l31
4357a54K5J69J1k95L34J09l11j53M18j3j40Q9K35j11l71K52P9o6k52rJ58K6l7
4380gK0N12n80O1K46m41J36k4Q6q6M1j05N60n69k9L08kq2k64L90Lm94L06P1R0
4405A47j87K25O4j0l12J41P6q07Q07l21J23M5L00p1l18m1L15k3k73j5K91Q3l98
4428a59K68n2K4J96j85j11J4k64K44J89m11J34n8K85j70MJ27r5k39L63J22n06
$$ plain form
4264 9 -46 32 40 138 278 202 43 -316 216 -18 99 -19 -61 -66 162 -124 37 -345 81 36 -52 -250 -318 14 -315
4289 -315 -22 36 351 75 85 211 222 -97 -383 -55 43 -117 154 176 22 -15 -258 102 -101 -165 -144 6 -344
4312 -344 -340 -78 -97 -48 -95 191 73 -161 65 427 62 -84 132 289 -321 -263 494 186 -190 181 199 -220
4334 -220 -22 -109 174 7 -190 377 346 -142 -87 346 14 3 80 22 24 -354 19 199 42 -33 141 177 -154
4357 -154 -129 40 51 -244 90 199 -112 -265 153 140 0 89 324 213 -158 94 173 107 -145 -154 4 30 -7
4380 -7 13 525 -55 6 252 -189 -53 -77 9 -77 -36 -141 419 -150 -179 129 127 45 -219 171 174 -320 -14 57 147
4405 147 -40 185 249 239 -73 68 144 -663 144 -177 -54 -9 291 220 -98 -139 176 153 -120 -135 156 239 -159
4428 -159 109 57 81 277 92 -19 -5 -269 -25 164 -247 -113 -171 114 -56 -52 75 -20 -259 104 226 -280
4450b80L03j30M02j72Q7kR6k92L7p9J7j43k3J65R7k84M83j16j22m5J60j4l40k1
4474b16N30l18q7j53L54k74j99L93L06n89J05L05j65m2j1J99j97k98K46M88n88
4495b11j89Q20j43l69o6J60N5l79J94M42n0k80N18l55k41J89j28J78m02l8M59
4516A64jm22J91M46m04p7n6K39l26K05N0p6r8j8L51j3j18M00m10K16j00j09k14
4539a80j04J61L4J8o6P1J22J70j80j04m5n0l9K02l5M1j53K57o1m13L42K53k95
4562e4k15M7K98q2k66K88L30l20l05M24R2k77J48j42N1n42L77K98k76q4K95K78
4584C63l53r2J84m9k81J64J62l99J63K88Q0m01p0M98N7l00j31R2j16k6L1LK82
4607A49m17M27k5Q7k62J36L2j51J34J37j07j22j91K34M5n5L87l15j4m32L62j42
$$ plain form
4450 -280 23 -107 295 123 210 208 304 12 49 -30 -13 -156 -179 -14 83 -201 282 166 44 -1 159 145 -195 -216
4474 -216 314 -4 -91 -244 110 -164 -363 30 336 -253 -148 157 -8 -50 -61 138 -59 -357 -111 377 -211
4495 -211 -400 420 277 -92 -158 2 57 -322 -128 314 264 -16 502 147 -94 95 -33 145 -257 -295 164
4516 164 163 -259 -68 378 -26 -103 -159 80 -246 -41 9 -67 -165 -183 168 155 37 437 27 243 143 34 -180
4539 -180 -284 -123 -89 -71 -137 -66 56 226 46 -58 -103 -153 -192 10 -25 16 -137 120 59 -354 -12 241 -54
4562 -54 -269 -222 76 -6 -272 16 346 26 -279 145 237 -40 108 -34 17 -525 -148 150 -126 -210 85 363
4584 363 10 -82 102 53 -228 -64 98 -301 -138 150 230 -171 -241 257 314 14 -117 -25 -141 -167 -136 -133 149
4607 149 -268 159 134 221 -41 95 127 -24 110 247 140 18 -173 61 106 51 438 123 109 -323 39 -103
4629a03j66K85K21M2l87J26L75n26k56O9L29k0m40N59L5j09k37O48l92q9j30J41
4651b5K40o60L91J76k64k92P41J68o26k5N60l46K01m56M33m37K25M39l25k14R3
4672cM86n69j39q3M35j65l6J37j05l18N13L0J89l58k02L93l53O0O8Q6j18R8l2
4695A4K91m41K30J80j99l1j57Mp4j03J20K54k92J36K71j04P0l27K69j18k10J66
4717e1m8M3Q2mK68k08l37N35k30k10kL01p5k35q7N51k38j73L30P5j99n50J87J38
4741a37j48O4M14L60o68M52j36Nm00K59N6n9m46K32J47l29L73K78q5k30j05J98
4763I5q3l07K52P3j83l9L58J38k69J03K2L3j82l21M15n05PL86K87l29K88j36k1
4786H2LOq7J6j88m1J73j92J27J88K05o4l11L01o4j73j50k68L95p0J39R1J37o5
$$ plain form
4629 -103 -269 16 237 279 -108 18 393 -133 -389 -320 9 -11 -451 108 143 34 -203 445 53 -36 -166 -25
4651 -25 215 -445 -54 122 -142 -434 307 475 -151 -176 384 38 239 -217 216 -221 4 443 118 -96 -3
4672 -3 483 -86 -225 -308 127 -38 -74 63 -42 -360 153 183 372 14 -188 205 -148 -88 -20 66 -52 46 14
4695 14 305 -136 94 274 75 44 -113 -109 -183 -286 -166 88 -204 -68 203 99 169 -158 111 -7 -217 -51
4717 -51 -99 -56 26 22 290 82 -255 280 50 -160 -162 139 64 -171 -258 293 55 -118 212 287 88 -462 -275 -137
4741 -137 -285 -221 193 553 -115 337 201 206 -194 65 121 62 -384 -152 -5 -334 39 317 232 2 -103 95
4763 95 12 -295 -43 30 -153 -192 166 304 35 138 160 193 11 -310 105 -400 -393 -7 280 -49 239 103 82
4786 82 85 91 4 20 -168 -209 -36 -228 -101 87 292 228 -83 218 154 -19 -169 -437 -42 -112 27 118 255 190
4810A90k48L75n45KL88Pl76M5M01j59j03nL45n2l11R3J07m40R7MJ50j69J55K58
4834B09Q5m68K13J72k22l21L38j35J3J00K06Ql75J83J95qk98K44l9k29j62K52
4856c9K78m46L19K48k77j84J81Jk65J04O3N2J20l87L30K66l09K98l21L55l33m24
4878c70O49m04j56K53J68k00l5J12R1j38j64K84P4l19l23P24j08l31N62j94j6
4899A59k45K20J1n51K50K91l70k7J80K40l78J29K75j8k47k44K26kk92Q9M70k34
4921f8j1Q3J73k90K5K07k81r8n8M67l60J40J38L43k84Q2l50K57k4k91O0J33k98
4944c05M02k54L82k20K71j04l14J61n7J69o4j88J06n9J00M8k71M27l40L7J0K34
4966A71n10K12L24k97k4K28K22r2l71L62J06o15J40M17l69j09P6K78j64q5K65
$$ plain form
4810 190 -58 317 -228 -226 162 169 -207 -162 239 80 -23 -28 317 265 -46 47 154 -286 -189 -185 -35 -204 -49 209
4834 209 294 -174 39 211 -11 -332 6 -129 -116 -16 190 198 -177 6 201 193 -105 139 100 -129 -291 -39
4856 -39 239 -207 112 360 83 -101 80 81 -184 -80 -17 35 155 -232 98 364 55 353 32 387 54 -370
4878 -370 279 -125 -281 -28 140 -60 -95 17 108 -30 -194 90 164 -155 -478 246 138 -193 369 175 159
4899 159 -86 134 145 -406 -156 135 -235 -262 -82 158 -220 -91 184 166 -81 -325 -99 -101 -393 -304 166 -68
4921 -68 -79 4 177 -113 -88 119 -162 -260 -318 149 -211 -71 67 410 126 208 -142 115 91 -200 -140 -7 -305
4944 -305 97 -157 225 5 276 172 -142 19 -38 131 67 -121 -15 -74 26 74 -197 230 -110 -73 -63 171
4966 171 -339 -127 197 -100 -124 104 326 234 -137 225 331 -284 -144 273 -96 -205 -129 149 -15 -100 165
4987A65J46o78K89p0N8j26k4L72j16j87L25J60j10k88M25m37k44K21K34k27j31
5008b43K91K11k80j61M93R8p24J56K62k76k1J34K87k87J41j05L59r3n53M34L01
5029D24m94R8K9O3l18K76K77l09QL7K8j39j54J70J81l24K20j12K21l13K96r2j09
5052c6l70L25k28K43k02M12o9j22J04K92k78j46k2J52m40Q9O7L99j28j86J75K63
$$ plain form
4987 165 311 -367 -78 -148 -90 -216 -240 132 16 -171 154 314 204 -84 341 -96 -340 -119 115 -112 -243
5008 -243 48 259 -21 -182 311 409 -315 -159 103 -173 -194 -60 227 -60 81 -24 335 242 -311 123 424
5029 424 -70 28 57 120 -198 78 355 46 54 91 119 -20 -174 -4 177 -147 73 -39 182 -131 165 73 -36
5052 -36 -406 -81 -309 -66 -268 144 75 -47 57 349 71 -75 -97 55 -385 -296 -229 170 42 -144 31 294
$$ [...]
8191a86
##END NTUPLES=NMR FID
##END=
