##TITLE=1H_Pr SA Et
 CDCl3, 8 sc, 
 3.06.2021
##JCAMPDX= 6.0         $$ Bruker NMR JCAMP-DX V2.0
##DATA TYPE= NMR FID
##DATA CLASS= NTUPLES
##ORIGIN= UXNMR, Bruker Analytische Messtechnik GmbH
##OWNER= root
$$ XWIN-NMR		Version 3.5
$$ Thu Jun  3 11:36:50 2021 Russian Standard Time (UT+4h)  she@DPX200
##.OBSERVE FREQUENCY= 200.131506
##.OBSERVE NUCLEUS= ^1H
##.DELAY= (6, 6)
##.ACQUISITION MODE= SIMULTANEOUS
##.ACQUISITION SCHEME= undefined
##.AVERAGES= 8
##.DIGITISER RES= 18
##SPECTROMETER/DATA SYSTEM= spect
##.PULSE SEQUENCE= zg30
##.SOLVENT NAME= CD3CN
##.SHIFT REFERENCE= (INTERNAL, CD3CN, 0, 15.7039)
##AUDIT TRAIL= $$ (NUMBER, WHEN, WHO, WHERE, WHAT)
$$ ##TITLE= Audit trail, XWIN-NMR		Version 3.5
$$ ##JCAMPDX= 5.01
$$ ##ORIGIN= Bruker BioSpin GmbH
$$ ##OWNER= she
$$ F:/spectra/data/she/nmr/H-F/1/audita.txt
$$ ##AUDIT TRAIL=  $$ (NUMBER, WHEN, WHO, WHERE, WHAT)
(   1,<2021-06-03 11:35:30.81 +0400>,<she>,<DPX200>,
      <created by zg, POWCHK disabled, PULCHK disabled
       configuration hash MD5:
       00 E9 B6 7A A2 85 ED C7 34 08 36 98 17 FE 4E 26
       data hash MD5: 16K
       36 21 E3 2A 62 32 61 E6 5B 3B FB E6 1B 5B C2 1B>)
$$ ##END=
$$ 
$$ hash MD5
$$ CC BD FF EF 0A 37 81 23 25 9F 3D 29 99 18 DD 10
##$RELAX= 
##$RELAX= 
##$RELAX= 
##$RELAX= 
##$RELAX= 
##$RELAX= 
$$ Bruker specific parameters
$$ --------------------------
##$DU= <F:/spectra>
##$EXPNO= 1
##$NAME= <H-F>
##$PROCNO= 1
##$TYPE= <nmr>
##$USER= <she>
##$AMP= (0..31)
100 100 100 100 100 100 100 100 100 100 100 100 100 100 100 100 100 100 
100 100 100 100 100 100 100 100 100 100 100 100 100 100 
##$AQSEQ= 0
##$AQ_mod= 1
##$AUNM= <au_zg>
##$AUTOPOS= <>
##$BF1= 200.13
##$BF2= 200.13
##$BF3= 200.13
##$BF4= 200.13
##$BF5= 200.13
##$BF6= 200.13
##$BF7= 200.13
##$BF8= 200.13
##$BYTORDA= 1
##$CFDGTYP= 0
##$CFRGTYP= 5
##$CHEMSTR= <none>
##$CNST= (0..31)
1 1 145 1 1 1 1 1 1 1 1 1 1 1 1 1 1 1 1 1 1 1 1 1 1 1 1 1 1 1 1 1 
##$CPDPRG= <>
##$CPDPRG1= <>
##$CPDPRG2= <>
##$CPDPRG3= <>
##$CPDPRG4= <mlev>
##$CPDPRG5= <mlev>
##$CPDPRG6= <mlev>
##$CPDPRG7= <mlev>
##$CPDPRG8= <mlev>
##$CPDPRGB= <>
##$CPDPRGT= <>
##$D= (0..31)
0 1.2 0 0 0 0 0 0 0 0.06 0 0.03 0 0 0 0 0.0002 0 0 0 0 0 0 0 0 0 0 0 0 
0 0 0 
##$DATE= 1622705730
##$DBL= (0..7)
120 120 120 120 120 120 120 120 
##$DBP= (0..7)
150 150 150 150 150 150 150 150 
##$DBP07= 0
##$DBPNAM0= <>
##$DBPNAM1= <>
##$DBPNAM2= <>
##$DBPNAM3= <>
##$DBPNAM4= <>
##$DBPNAM5= <>
##$DBPNAM6= <>
##$DBPNAM7= <>
##$DBPOAL= (0..7)
0.5 0.5 0.5 0.5 0.5 0.5 0.5 0.5 
##$DBPOFFS= (0..7)
0 0 0 0 0 0 0 0 
##$DE= 6
##$DECBNUC= <off>
##$DECIM= 32
##$DECNUC= <off>
##$DECSTAT= 4
##$DIGMOD= 1
##$DIGTYP= 9
##$DL= (0..7)
0 120 120 120 120 120 120 120 
##$DP= (0..7)
150 150 150 150 150 150 150 150 
##$DP07= 0
##$DPNAME0= <>
##$DPNAME1= <>
##$DPNAME2= <>
##$DPNAME3= <>
##$DPNAME4= <>
##$DPNAME5= <>
##$DPNAME6= <>
##$DPNAME7= <>
##$DPOAL= (0..7)
0.5 0.5 0.5 0.5 0.5 0.5 0.5 0.5 
##$DPOFFS= (0..7)
0 0 0 0 0 0 0 0 
##$DQDMODE= 0
##$DR= 18
##$DS= 0
##$DSLIST= <SSSSSSSSSSSSSSS>
$$ [...]
##$SUBNAM2= <"">
##$SUBNAM3= <"">
##$SUBNAM4= <"">
##$SUBNAM5= <"">
##$SUBNAM6= <"">
##$SUBNAM7= <"">
##$SUBNAM8= <"">
##$SUBNAM9= <"">
##$SW= 20.0188882624521
##$SWIBOX= (0..15)
0 0 2 0 0 0 0 0 0 0 0 0 0 0 0 0 
##$SW_h= 4006.41025641026
##$TD= 16384
##$TD0= 1
##$TE= 0
##$TE2= 300
##$TE3= 300
##$TEG= 300
##$TL= (0..7)
0 120 120 120 120 120 120 120 
##$TP= (0..7)
150 150 150 150 150 150 150 150 
##$TP07= 0
##$TPNAME0= <>
##$TPNAME1= <>
##$TPNAME2= <>
##$TPNAME3= <>
##$TPNAME4= <>
##$TPNAME5= <>
##$TPNAME6= <>
##$TPNAME7= <>
##$TPOAL= (0..7)
0.5 0.5 0.5 0.5 0.5 0.5 0.5 0.5 
##$TPOFFS= (0..7)
0 0 0 0 0 0 0 0 
##$TUNHIN= 0
##$TUNHOUT= 0
##$TUNXOUT= 0
##$USERA1= <user>
##$USERA2= <user>
##$USERA3= <user>
##$USERA4= <user>
##$USERA5= <user>
##$V9= 5
##$VALIST= <valist>
##$VCLIST= <CCCCCCCCCCCCCCC>
##$VD= 0
##$VDLIST= <DDDDDDDDDDDDDDD>
##$VPLIST= <PPPPPPPPPPPPPPP>
##$VTLIST= <TTTTTTTTTTTTTTT>
##$WBST= 1024
##$WBSW= 4
##$XGAIN= (0..3)
0 0 0 0 
##$XL= 0
##$YL= 0
##$YMAX_a= 444499
##$YMIN_a= -259237
##$ZGOPTNS= <>
##$ZL1= 120
##$ZL2= 120
##$ZL3= 120
##$ZL4= 120
##$ABSF1= 10
##$ABSF2= 0
##$ABSG= 5
##$ABSL= 3
##$ALPHA= 0
##$AQORDER= 0
##$ASSFAC= 0
##$ASSFACI= 0
##$ASSFACX= 0
##$ASSWID= 0
##$AUNMP= <proc_1d>
##$AZFE= 0.1
##$AZFW= 0.1
##$BCFW= 1
##$BC_mod= 2
##$BYTORDP= 1
##$COROFFS= 0
##$CY= 11.3945322036743
##$DATMOD= 1
##$DC= 2
##$DFILT= <>
##$DTYPP= 0
##$F1P= 15.9154993809931
##$F2P= -4.1035820241983
##$FCOR= 0.5
##$FTSIZE= 0
##$FT_mod= 4
##$GAMMA= 1
##$GB= 0.15
##$INTBC= 1
##$INTSCL= 1
##$ISEN= 128
##$LB= 0.24
##$LEV0= 0
##$LPBIN= 0
##$MAXI= 10000
##$MC2= 0
##$MEAN= 0
##$ME_mod= 0
##$MI= 1.114404
##$NCOEF= 0
##$NC_proc= 0
##$NLEV= 6
##$NOISF1= 3.799351
##$NOISF2= 2.8
##$NSP= 1
##$NTH_PI= 0
##$NZP= 0
##$OFFSET= 15.70392
##$PC= 1
##$PHC0= -11486.88
##$PHC1= 20.80099
##$PH_mod= 1
##$PKNL= yes
##$PPARMOD= 0
##$PSCAL= 0
##$PSIGN= 0
##$REVERSE= no
##$SF= 200.130013532006
##$SI= 16384
##$SIGF1= 3
##$SIGF2= 2
##$SINO= 400
##$SIOLD= 16384
##$SREGLST= <1H.CDCl3>
##$SSB= 0
##$STSI= 0
##$STSR= 0
##$SW_p= 3612.71676300578
##$SYMM= 0
##$S_DEV= 0
##$TDeff= 0
##$TDoff= 0
##$TI= <>
##$TILT= no
##$TM1= 0
##$TM2= 0
##$TOPLEV= 0
##$USERP1= <user>
##$USERP2= <user>
##$USERP3= <user>
##$USERP4= <user>
##$USERP5= <user>
##$WDW= 1
##$XDIM= 8192
##$YMAX_p= 0
##$YMIN_p= 0
$$ End of Bruker specific parameters
$$ ---------------------------------
##NTUPLES= NMR FID
##VAR_NAME=  TIME,          FID/REAL,        FID/IMAG
##SYMBOL=    X,             R,               I
##VAR_TYPE=  INDEPENDENT,   DEPENDENT,       DEPENDENT
##VAR_FORM=  AFFN,          ASDF,            ASDF
##VAR_DIM=   8192,          8192,            8192
##UNITS=     SECONDS,       ARBITRARY UNITS, ARBITRARY UNITS
##FACTOR=    0.0002496,     1,               1
##FIRST=     0,             0,               0
##LAST=      2.0444736,     0,               0
##MIN=       0,             -259237,         0
##MAX=       2.0444736,     444499,          0
$$ Real data points
##PAGE= N=1
##DATA TABLE= (X++(R..R)), XYDATA
$$ plain form
0 0 0 0 0 0 0 0 0 0 0 0 0 8 -8 8 -8 16 -16 24 -24 32 -40 48 -54 64 -72 86 -96 112 -133 152 -173 197 -222
33 -222 252 -285 318 -358 398 -446 497 -553 613 -681 754 -831 919 -1015 1116 -1230 1356
50 1356 -1493 1648 -1816 2003 -2216 2456 -2732 3045 -3415 3854 -4384 5042 -5879 6989 -8532
65 -8532 10828 -14602 21893 -41036 195569 444499 8170 18939 103399 -104895 -253772
76 -253772 -160661 -99698 45156 187588 154756 97935 122886 -22655 -176831 -164367 -132925
87 -132925 -39704 125696 97467 74416 175834 78468 -132993 -122369 -80590 -129481 -33079
98 -33079 132769 104437 73367 124250 11520 -124790 -79731 -64533 -94745 -14572 90134
109 90134 120046 86572 24935 -21209 -60739 -100124 -95202 -22344 39947 45135 73585 89863
$$ packed form
0@%%%%%%%%%%%Qj6J6j6K4l2M0m8N6p2Q8j02J18j36J58j82K08k45K85l25L70m19
33b22M74n37O03o76P56q44R43j050J166j294J435j585J750j934K131k346K586
50A356k849L141l464L819m219M672n188N777o460P269q238R426j0921J2868j5521
65h532J9360k5430L6495o2929K36605K48930m36329J0769Q4460k08294j48877
76b53772R3111O0963J44854J42432l2832n6821K4951j45541j54176J2464L1442
87a32925R3221J65400k8229k3051J01418r7366k11461J0624M1779m8891R6402
98c3079J65848k8332l1070N0883j12730j36310M5059J5198l0212Q0173J04706
109I0134K9912l3474o1637m6144l9530l9385M922P2858O2291N188K8450J6278
$$ plain form
121 89863 12891 -45742 -63733 -97152 -65652 4237 30636 56875 79519 44552 -19234 -39345
133 -39345 -36191 -77580 -78384 18162 77015 50124 25169 36261 17084 -66098 -85895 -19119 -6183
146 -6183 -9627 43549 69458 44308 10929 -21804 -49954 -56173 -26578 1190 19057 47426 47212
159 47212 26178 10162 -25577 -44620 -37327 -29816 10279 44363 35633 33356 27203 -9350 -36513
172 -36513 -28191 -19024 -24371 10077 51519 32585 22570 24459 -20807 -40719 -20799 -18642 -5904
185 -5904 21862 31868 26250 22311 9490 -24212 -36235 -20761 -17974 3393 29770 22128 21058
198 21058 13119 -13855 -16731 -24064 -34913 -7866 19483 15326 13300 29969 10613 -36875 -26413
211 -26413 -2346 -24862 -14985 19591 20448 17475 12499 -5322 -16598 -24336 -22798 -11170 5516
$$ packed form
121H9863p6972n8633j7991l3419L1500O9889K6399K6239K2644l4967o3786k0111
133c9345L154m1389q04R6546N8853k6891k4955J1092j9177q3182j9797O6776J2936
146f183l444N3176K5909k5150l3379l2733k8150o219K9595K7768J7867K8369k14
159D7212k1034j6016l5739j9043P293P511M0095L4084q730k277o153l6553k7163
172c6513Q322R167n347L4448M1442j8934j0015J889m5266j9912J9920K157J2738
185e904K7766J0006n618l939j2821l3702j2023J5474K787K1367K6377p642j070
198B1058p939k6974k876p333j0849K7047K7349m157k026J6669j9356m7488J0462
211b6413K4067k2516R877L4576Q57k973m976j7821j1276p738J538J1628J6686
$$ plain form
224 5516 17638 13337 12677 8349 -9044 -12976 -22848 -25711 4996 11897 4257 21778 20343 -6157
238 -6157 -16109 -9821 -11278 -17300 1555 16433 9217 18745 18376 -8452 -15663 -11513 -7968 -2632 -373
253 -373 14782 24084 9468 1994 112 -6751 -14880 -14902 3879 13936 11988 17268 7235 -1243 2111
268 2111 -12317 -17436 -2342 6411 8356 9236 16273 13196 -9439 -13235 -4777 -8791 -4852 3324 10543
283 10543 13708 5266 4318 -1832 -16224 -11227 -5017 -3225 6022 8237 8961 4881 -4791 -5148 -10719
298 -10719 -13379 -4465 -2700 4839 12691 5070 -1163 -5712 -6719 -7501 -15091 -3873 8733 1831 3131
313 3131 8566 3111 -7428 -14877 -6725 -1235 -4996 3433 7619 5093 5299 -3610 -6028 -4648 -8799
328 -8799 -3561 1374 6236 11798 2259 -847 2379 -4690 -7105 -4752 905 6863 2432 7828 11417
$$ packed form
224E516J2122m301o60m328j7393l932r872k863L0707O901p640J7521j435k6500
238f157r952O288j457o022J8855J4878p216R528l69k6828p211M150L545N336K259
253c73J5155R302j4616p474j882o863q129k2J8781J0057j948N280j0033q478L354
268B111j4428n119J5094Q753J945Q80P037l077k2635l796Q458m014L939Q176P219
283A0543L165q442r48o150j4392M997O210J792R247K215P24m080r672l57n571
298a0719k660Q914J765P539P852p621o233m549j007p82p590J1218J2606o902J300
313C131N435n455j0539p449Q152N490l761Q429M186k526K06q909k418J380m151
328h799N238M935M862N562r539l106L226p069k415K353N657N958m431N396L589
$$ plain form
343 11417 -2364 -4408 -1426 -4182 -1454 857 7124 8501 2713 6461 2736 -5528 -3133 -3540 -494
358 -494 5425 4302 7014 5102 618 1468 -4578 -5107 808 -1598 1795 5703 6302 4339 -4614 -3064
374 -3064 1471 -7801 -4597 3911 2822 2560 846 2860 484 -8247 -5159 -2141 -3267 1593 327
389 327 2115 3622 -3653 -3412 -3436 -6302 -2560 -2701 -189 4964 694 -1239 -2281 -3768 -2513 -6792
405 -6792 -2632 3675 -1417 1326 4021 -928 -1583 -4492 -4009 -78 -2596 1299 4086 792 2053 -307
421 -307 -524 -887 -5903 -69 3788 898 3434 2738 2145 2534 -4342 -1768 2602 -283 742 2176 5477
438 5477 6103 -1681 -1215 1857 -219 39 -1810 2930 7936 431 -289 3714 -128 -814 -3092 -1013
454 -1013 4690 2025 1352 2392 1080 1411 -2785 -2430 762 -2461 1820 3180 -1759 2592 1338 -3782
$$ packed form
343A1417j3781k044K982k756K728K311O267J377n788L748l725q264K395m07L046
358d94N919j123K712j912m484Q50o046n29N915k406L393L908N99j963q953J550
374c064M535r272L204Q508j089k62j714K014k376q731L088L018j126M860j266
389C27J788J507p275K41k4k866L742j41K512N153m270j933j042j487J255m279
405f792M160O307n092K743K695m949o55k909M83L931k518L895K787l294J261k360
421c07k17l63n016N834L857k890K536o96n93L89o876K574M370k885J025J434L301
438E477O26p784M66L072k076K58j849M740N006p505p20M003l842o86k278K079
454a013N703k665o73J040j312L31m196L55L192l223M281J360m939M351j254n120
$$ plain form
470 -3782 -1780 -2635 -1583 200 -1021 595 142 981 340 -6000 -2995 28 -3075 -81 -1829 -924
486 -924 4550 -2720 -5861 455 -294 -3886 -4310 1008 3010 -1750 -806 -928 -3257 1091 -2589 -4754
502 -4754 2303 811 102 1114 -2175 1377 1722 -3934 -3716 2320 5311 -2318 -3677 6853 3227 -3859
518 -3859 24 -297 1520 2941 -2278 1691 5284 1145 -41 -839 1164 2391 1014 341 -1228 4755
534 4755 7080 -4718 -1796 6630 78 -2441 486 2416 3941 -289 -1370 2762 1812 -861 -3044
549 -3044 1587 3821 -2624 636 3368 -2208 620 835 -3404 798 -175 -1897 496 615 99 -1792
565 -1792 -1621 -176 -2375 -844 -1074 -2283 2455 -1892 -4681 3805 -301 -7306 -1255 2961 -384 -4979
581 -4979 -2473 4657 154 -6121 -3240 2636 3275 -6521 -4665 7514 1217 -5685 -454 582 1338
$$ packed form
470c782K002q55J052J783j221J616m53Q39o41o340L005L023l103K994j748R05
486i24N474p270l141O316p49l592m24N318K002m760R44j22k329M348l680k165
502d754P057j492p09J012l289L552L45n656K18O036K991p629j359J0530l626p086
518c859L883l21J817J421n219L969L593m139j186p98K003J227j377o73j569N983
534D755K325j1798K922Q426o552k519K927J930J525m230j081M132r50k673k183
549c044M631K234o445L260K732n576K828K15m239M202r73j722K393J19n16j891
565a792J71J445k199J531k30j209M738m347k789Q486m106p005O051M216l345m595
581d979K506P130m503o275K881N876O39r796J856J2179o297o902N231J036P56
$$ plain form
596 1338 -97 -3686 -122 3366 1948 -1655 -2050 2981 1855 -2136 -904 -807 4403 3544 -5644 1107
612 1107 7164 -746 -3229 618 3639 2710 -1875 -119 3455 3535 -298 -3600 2814 4908 -2657 237
628 237 2274 589 4086 -47 -4118 3226 4869 -2224 -4201 2911 6197 -2654 -3664 2449 2885 201
644 201 -4903 -1126 6696 -1697 -6458 4604 2740 -4930 -1994 2337 -292 -4125 -366 1974 -2165
659 -2165 -683 -800 -1910 1403 -2849 -3663 1817 -1050 -1391 -52 -2541 -107 1038 -2764 -3458 626
675 626 2824 -3511 -3680 4256 78 -4211 358 -106 443 -175 -3179 1392 2438 -1698 -1111 279 1568
692 1568 -336 -1354 1261 255 1323 1789 -2849 1337 3957 -1642 -830 1337 1741 3158 -872 -1287
708 -1287 2976 3303 -6 -3363 2189 5172 -1420 -1253 2644 1678 2154 -1716 -1500 4827 957 -2226
$$ packed form
596A338j435l589L564L488j418l603l95N031j126l991J232R7N210q59r188O751
612A107O057p910k483L847L021r29m585J756L574Q0l833l302O414K094p565K894
628B37K037j685L497m133m071P344J643p093j977P112L286q851j010O113M36k684
644B01n104L777P822q393m761J1062j864p670K936M331k629l833L759K340m139
659b165J482j17j110L313m252q14N480k867l41J339k489K434J145l802o94M084
675F26K198o335j69P936m178m289M569m64N49o18l004M571J046m136N87J390J289
692A568j904j018K615j006J068M66m638M186K620n599Q12K167M04J417m030m15
708a287M263L27l309l357N552K983o592J67L897r66M76l870K16O327l870l183
$$ plain form
724 -2226 1038 2109 1147 -909 -578 1286 -199 627 -561 -879 3137 -432 -3255 1631 637 -1578
740 -1578 -425 -1297 640 436 -1827 -903 -530 505 -1443 -2587 1183 -1038 -2077 456 -2115 -898
756 -898 687 -2794 -1058 -109 -1695 -441 -689 -684 -832 -858 628 -2120 -1403 1753 -2081 -1002 1625 -1351
774 -1351 41 534 -1125 555 -668 -667 819 14 949 82 370 1067 -909 684 1407 -1352 1908 1615
792 1615 -1100 2031 2202 121 302 371 2184 459 164 2094 627 1333 1938 -896 1159 1601 -548
809 -548 1609 1053 123 1505 -384 678 738 61 447 45 1622 716 -1772 1761 1344 -2097 248 433
827 433 -781 331 -1574 414 144 -1169 40 -719 -574 -942 -1630 123 -728 -2016 256 -717 -1684
844 -1684 -93 -765 -167 -67 -1592 -83 -610 -693 64 -1485 -412 -138 -1956 506 -734 -438 145 -1303
$$ packed form
724b226L264J071r62k056L31J864j485Q26j188l18M016l569k823M886r94k215
740a578J153q72J937k04k263R24L73J035j948j144L770k221j039K533k571J217
756h98J585l481J736R49j586J254k48Nj48k6J486k748P17L156l834J079K627k976
774a351J392M93j659J680j223JJ486q05R35q67K88O97j976J593P23k759L260k93
792A615k715L131J71k081J81O9J813j725k95J930j467P06O05k834K055M42k149
809e48K157n56r30J382j889J062O0o77L86m02J577r06k488L533m17l441K345J85
827D33j214J112j905J988k70j313J209p59J45l68o88J753q51j288K272r73r67
844a684J591o72N98J00j525J509n27q3P57j549J073K74j818K462j240K96N83j448
$$ plain form
862 -1303 465 81 -1702 583 130 -361 197 -750 1242 680 -1391 1428 349 74 657 218 1599
879 1599 1019 -615 1552 1051 -57 817 -167 1519 757 -674 1970 1764 -437 1097 275 1540 967
896 967 -1209 1558 190 -115 829 1239 1974 159 -1300 652 1227 -607 -281 -292 1412 345 -1793
913 -1793 811 949 -1108 -243 -671 992 347 -2292 188 307 -1421 -533 -1265 328 -323 -1784 82
930 82 -693 -1183 118 -1762 -230 377 -1862 -473 -44 -931 -285 -1622 -273 -131 -2218 359 102 -1090
948 -1090 -433 -917 590 70 -2267 953 735 -1241 95 192 599 105 -1217 1398 286 -404 1189
965 1189 -343 841 908 -588 839 591 270 1325 -374 837 1532 -544 835 1270 281 1013 71
982 71 1222 1068 -274 1841 976 -599 920 337 801 414 -758 1598 449 -1023 1141 532 207
$$ packed form
862a303J768l84j783K285m53m91N58r47J992n62k071K819j079k75N83m39J381
879A599n80j634K167n01j108Q74r84J686p62j431K644k06k201J534q22J265n73
896I67k176K767j368l05R44M10P35j815j459J952N75j834L26j1J704j067k138
913a793K604J38k057Q65m28J663o45k639K480J19j728Q88p32J593o51j461J866
930H2p75m90J301j880J532O07k239J389M29q87O46j337J349J42k087K577k57j192
948a090O57m84J507n20k337L220k18j976J336R7M07m94j322K615j112o90J593
965A189j532J184O7j496J427k48l21J055j699J211O95k076J379M35r89P32r42
982G1J151j54j342K115q65j575J519n83M64l87j172K356j149j472K164o09l25
$$ plain form
999 207 186 -596 886 312 -892 286 -659 676 531 -2207 509 811 -1728 -627 -389 -285 -245 -2008
1017 -2008 -39 -98 -876 -202 -1077 -131 -18 -1550 252 -733 -1633 625 -783 -1762 404 -434 -274 -352
1035 -352 -741 -482 -759 429 -275 -1998 1445 480 -1776 200 270 -67 113 -1215 324 1154 -523 -324
1053 -324 8 1413 284 -1110 1514 882 -501 1007 -726 791 2332 -1288 81 2215 205 -123
1069 -123 384 1480 483 -291 1648 284 -363 2117 363 -249 1116 186 816 191 -764 1719 674
1086 674 -1255 340 1161 132 -1065 601 1316 -2136 229 2006 -2340 -594 1564 -776 -950 -704
1102 -704 209 467 -1725 -753 804 -763 -1191 -719 803 -604 -2409 1357 -109 -2899 931 242 -2309
1119 -2309 96 209 -642 -1138 -537 320 -610 -394 -414 -1054 917 -481 -1655 1094 -203 -1051 648 -822
$$ packed form
999B07k1p82J482n74j204J178r45J335j45k738K716L02k539J101K38J04M0j763
1017b008J969n9p78O74q75R46J13j532J802r85r00K258j408r79K166q38J60p8
1035c52l89K59k77J188p04j723L443r65k256J976P0l37J80j328J539Q30j677J99
1053c24L32J405j129j394K624o32j383J508j733J517J541l620J369K134k010l28
1069a23N07J096r97p74J939j364o47K480j754o12J365r30O30o25r55K483j045
1086F74j929J595Q21j029j197J666P15l452K365J777m346J746K158k340j74K46
1102g04R13K58k192R72J557j567m28M72J522j407j805L766j466k790L830o89k551
1119b309K405J13q51m96O01Q57r30K16k0o40J971j398j174K749j297q48J699j470
$$ plain form
1137 -822 364 1784 -853 -516 1065 908 -541 -537 1899 706 -85 923 -942 826 2757 -1853 -905
1154 -905 3100 487 -940 192 1713 1506 -920 134 1765 1155 160 -1182 1691 2130 -1730 592
1170 592 2315 -1464 644 1497 -923 190 1085 47 -944 611 1140 -1380 -220 991 -1069 255
1186 255 360 -1299 1045 -491 -1946 1102 -405 -1509 415 185 -983 -677 667 -846 -1948 1212
1202 1212 -347 -2510 997 -277 -2022 968 -762 -1513 829 -568 -1353 -526 520 -553 -1044 765
1218 765 412 -1333 280 -317 -43 703 -2112 237 2630 -1919 -1488 2428 1036 -1651 -103 1889
1234 1889 138 -1021 1411 -310 149 2220 -917 -136 1830 31 355 664 220 1670 -43 -720
1250 -720 678 1259 -245 -1113 2083 1727 -2094 485 3259 -1387 233 1370 -912 126 -38 251
$$ packed form
1137h22J186J420k637L37J581j57j449MK436j193p91J008j865J768J931m610R48
1154i05M005k613j427J132J521k07k426J054J631o10r95j342K873M39l860K322
1170E92J723l779K108Q53k420J113Q95j038r91J555N29k520J160J211k060J324
1186B55J05j659K344j536j455L048j507j104J924k30j168L06J344j513j102L160
1202A212j559k163L507j274j745K990j730p51K342j397p85Q27J046j073m91J809
1218G65l53j745J613n97K74P46k815K349K393m549M31L916j392k687J548J992
1234A889j751j159K432j721M59K071l137P81J966j799L24L09m44J450j713o77
1250g20J398N81j504q68L196l56l821K579K774m646J620J137k282J038j64K89
$$ plain form
1266 251 582 -72 1065 257 81 158 -752 659 -403 -1770 1679 -632 -1227 301 107 -871 1320 -501
1284 -501 -2267 698 992 -821 -2359 1587 -618 -1478 282 544 -929 336 -272 -877 -754 -1368 -747
1301 -747 369 -1052 -171 -386 186 -371 -682 206 -1028 -517 1477 -1810 -1181 1522 -147 -668 932
1318 932 158 -178 -379 768 547 -499 1225 -35 1006 533 -778 -419 1546 -703 292 1143 -719
1335 -719 1439 289 -207 149 137 189 261 332 1109 -1160 307 1586 -810 400 1241 -1239 653 203
1353 203 -398 212 -1003 174 383 -487 -1041 30 -552 -454 -1089 581 -773 -1106 630 110 -793 1000
1371 1000 17 -733 -774 -411 122 -1131 -100 592 -1409 -604 694 -747 -144 -1073 -594 673 -1104 103
1389 103 491 -608 -164 -116 -628 -370 -461 315 -413 -453 978 -652 -937 815 -103 -666 -211 390 489 -868
$$ packed form
1266B51L31o54J137q08j76P7r10J411j062j367L449k311n95J528j94r78K191j821
1284e01j766K965K94j813j538L946k205q60J760K62j473J265o08o05J23o14O21
1301g47J116j421Q81k15N72n57l11Q88j234N11J994l287O29K703j669n21J600
1318I32p74l36k01J147k21j046J724j260J041m73j311L59J965k249R95Q51j862
1335g19K158j150m96L56j2N2P2P1P77k269J467J279k396J210Q41k480J892m50
1353B03o01O10j215J177K09q70n54J071n82R8o35J670j354l33J736n20r03J793
1371A000r83p50m1L63N33j253J031O92k001Q05J298j441O03r29M79J267j777J207
1389A03L88j099M44M8n12K58r1P76p28m0J431j630k85J752r18n63M55O01R9j357
$$ plain form
1409 -868 19 1226 -658 -248 655 349 552 16 378 903 -431 417 749 -184 1093 453 32 709 391
1428 391 736 119 3 1307 48 -188 781 330 82 158 225 823 -578 -86 1045 -415 -428 657 148
1447 148 578 -400 -241 717 -782 -388 66 -335 306 -488 -387 544 -700 -168 -18 -497 143 -939 -611
1466 -611 362 -742 -773 -261 -338 23 -992 -311 415 -1014 -700 198 -565 32 -308 -615 329 -814 -327
1485 -327 2 -329 377 -549 -703 603 -465 -305 121 -184 389 -181 -159 950 -213 -327 485 71 249
1504 249 -219 265 1114 -254 127 887 3 491 228 175 1164 231 144 532 171 913 -92 18 1323 -223
1524 -223 -14 743 221 558 -147 -273 1395 -331 -600 609 -51 347 -32 62 413 -579 16 564 -786
1543 -786 253 124 -699 363 -312 -601 99 -511 -87 -384 -666 58 -269 -523 -476 -421 167 -852 -842 961
$$ packed form
1409h68Q87J207j884M10R03l06K03n36L62N25j334Q48L32r33J277o40m21O77l18
1428C91L45o17j16J304j259k36R69m51k48P6O7N98j401M92J131j460j3J085n09
1447A48M30r78J59R58j499L94M54m01O41p94J01R31j244N32J50m79O40j082L28
1466f11R73j104l1N12p7L61j015O81P26j429L14Q98p63N97l40l07R44j143M87
1485c27L29l31P06r26j54J306j068J60M26l05N73n70K2J109j163j14Q12m14J78
1504B49m68M84Q49j368L81P60q84M88k63n3R89r33q7L88l61P42j005J10J305j546
1524b23K09P57n22L37p05j26J668j726k69J209o60L98l79R4L51r92N95N48j350
1543g86J039j29q23J062o75k89P00o10M24k97k82P24l27k54M7N5N88j019J0J803
$$ plain form
1563 961 -887 -1188 310 -280 -355 -329 -418 209 -695 -272 193 -131 -94 -584 -183 643 -1027 -448 717 -338
1583 -338 -268 234 -475 294 32 -457 13 152 258 -23 -74 671 -240 366 896 -136 349 423 -181 957
1603 957 10 -474 884 352 -3 111 807 796 -120 446 1154 -211 952 826 -206 1258 1131 -1057
1621 -1057 877 212 -150 -15 28 105 -401 -60 1 -566 506 -331 -953 910 -718 -1084 903 -254 -1032
1640 -1032 84 -54 -239 -451 -34 -264 -771 138 -690 -824 489 -936 -710 699 -846 -612 257 -778
1658 -778 -523 117 -771 24 -377 759 -650 -244 309 -51 -207 462 -82 -273 99 -900 391 434 -564
1677 -564 158 641 106 -182 366 960 -513 43 1073 -333 648 553 -617 554 559 -251 816 536 -105
1696 -105 502 648 102 -48 1096 700 -608 846 639 -654 809 259 -332 703 174 -118 258 333
$$ packed form
1563I61j848l01J498n90p5K6q9O27r04M23M65l24L7m90M01Q26j670N79J165j055
1583c38P0N02p09P69k62m89M70J39J06k81n1P45r11O06N30j032M85P4o04J138
1603I57r47m84J358n32l55J14O96j1r16N66P08j365J163j26j032J464j27k188
1621a057J934o65l62J35M3P7n06L41O1n67J072q37o22J863j628l66J987j157p78
1640a032J116j38j85k12M17k30n07R09q28j34J313j425K26J409j545K34Q69j035
1658g78K55O40q88P95m01J136j409M06N53l60j56O69n44j91L72r99J291M3r98
1677e64P22M83n35k88N48N94j473N56J030j406R81r5j170J171Nq10J067k80o41
1696a05O07J46n46j50J144l96j308J454k07j293J463n50n91J035n29k92L76P5
$$ plain form
1714 333 213 -85 -169 15 3 940 -467 -1195 825 -874 -620 831 -875 -1275 303 -149 -268 -44 -347
1733 -347 -337 -107 16 -360 -635 589 -749 -844 555 -958 -499 514 -1269 -229 169 -618 -757 159
1751 159 112 -436 -200 750 -447 -545 367 -903 239 432 -940 293 308 -590 146 91 159 -141 42 261
1771 261 -289 203 323 -622 764 332 -629 814 516 -445 868 456 82 416 97 220 360 -4 371
1790 371 152 657 -114 -110 1167 -136 -574 799 235 -230 376 196 253 -213 -168 307 116 107 -16 -204 621
1811 621 -145 -747 587 -316 -347 554 -512 9 129 -916 -405 262 74 -710 -603 297 -426 -802 190
1830 190 -510 -408 -102 -960 82 243 -864 144 -12 -196 -423 -239 102 -185 -386 255 -447 -99 217
1849 217 -330 355 20 -619 301 38 -396 102 245 270 -237 341 489 -51 90 483 -65 247 264 -250 624
$$ packed form
1714C33j20k98q4J84j2R37j407p28K020j699K54J451j706m00J578m52j19K24l03
1733c47J0K30J23l76k75J224j338r5J399j513M59J013j783J040L98p87j39R16
1751A59m7n48K36R50j197r8R12j270J142J93j372J233J5q98P36n5O8l00J83K19
1771B61n50M92J20r45J386m32r61J443k98r61J313m12l74L34l19J23J40l64L75
1790C71k19N05p71MJ277j303m38J373n64m65O06j80N7m66M5M75j91rj23j88Q25
1811F21p66o02J334r03l1R01j066N21J20j045N11O67j88p84J07R00p23l76R92
1830A90p00J02L06q58J042J61j107J008j56j84k27J84L41k87k01O41p02L48L16
1849B17n47O85l35o39R20k63m34M98J43K5n07N78J48n40J41L93n48L12J7n14Q74
$$ plain form
1870 624 467 178 284 26 532 267 -108 148 482 556 239 96 610 70 -100 861 109 -34 432 77
1890 77 405 289 -149 217 124 77 151 -150 137 40 -446 182 -95 -64 57 -628 413 231 -846 24 -120
1911 -120 -337 -235 -217 63 -637 -637 111 -463 -615 164 -502 -8 -228 -351 107 -386 -382 142 -362 26 -81 -570
1933 -570 96 -445 -18 112 -463 -94 383 -320 26 -50 -217 264 -171 401 201 -251 414 119 -131 315
1953 315 65 311 164 -93 665 187 -67 375 -17 401 254 21 533 381 -11 201 -114 402 441 -37
1973 -37 229 528 -210 553 -137 149 153 -497 435 362 -287 186 -118 6 36 -536 199 -121 -282 38 -260 -465
1995 -465 189 -601 161 -419 -203 170 -701 -190 327 -411 15 -186 -542 -189 -671 -348 -5 -365 -2 -320
2015 -320 -243 -49 -426 141 164 -607 111 -125 -402 -1 -337 266 -36 -454 414 280 -90 5 133 16 74
$$ packed form
1870F24j57k89J06k58N06k65l75K56L34P4l17j43N14n40j70R61p52j43M66l55
1890G7L28j16m38L66r3m7P4l01K87r7m86O28k77L1J21o85J041j82j077Q70j44
1911a20k17J02J8K80p00%P48n74j52P79o66M94k20j23M58m93MN24n04L88j07m89
1933e70O66n41M27J30n75L69M77p03L46p6j67M81m35N72k00m52O65k95k50M46
1953C15k50K46j47k57P58m78k54M42l92M18j47k33N12j52l92K12l15N16L9m78
1973c7K66K99p38P63o90K86Mo50R32p3o49M73l04J24L0n72P35l20j61L20k98k05
1995d65O54p90P62n80K16L73q71N11N17p38M26k01l56L53m82L23L43l60L63l18
2015c20P7J94l77N67K3p71P18k36k77M01l36O03l02m18Q68j34l70R5J28j17N8
$$ plain form
2036 74 -365 284 296 -228 309 -125 223 392 -48 248 314 34 285 -190 60 522 -31 130 401 531 437
2057 437 -56 558 322 -361 160 139 -88 348 -204 419 386 -404 325 284 -139 173 61 49 -341 -137 45
2078 45 321 -359 188 -317 -129 275 -431 -300 174 8 20 -302 -122 196 -846 -128 -2 -457 -144 -232 123
2099 123 23 -487 163 135 -353 -285 -520 -191 -323 -1265 -291 -216 -510 -252 -182 -106 -193 441 -44 352 -420 -149
2121 -149 -248 -198 -444 57 -402 227 -569 593 -439 -19 712 -92 163 460 118 273 -19 308 294 -278
2141 -278 481 410 195 515 99 287 249 -30 418 436 -259 129 207 14 31 -89 408 263 -154 337 124 -92
2163 -92 302 -494 -91 181 -410 129 102 -122 225 -481 63 206 -320 -110 -300 233 341 -709 -377 501
2183 501 -571 -349 -178 -319 94 -422 -191 -456 -453 -187 -528 -278 29 -614 264 466 -473 54 198 -240
$$ packed form
2036G4m39O49J2n24N37m34L48J69m40K96O6k80K51m75K50M62n53J61K71J30r4
2057D37m93O14k36o83N21k1k27M36n52O23l3p90P29m1m23L12j12j2l90K04J82
2078D5K76o80N47n05J88M04p06J31M74j66J2l22J80L18j042P18J26m55L13q8L55
2099A23j00n10O50k8m88O8k35L29j32r42R74P5k94K58P0P6q7O34m85L96p72K71
2121a49r9N0k46N01m59O29p96J162j032M20P31q04K55K97l42J55k92L27j4n72
2141b78P59p1k15L20m16J88l8k79M48J8o95L88P8j93J7j20M97j45m17M91k13k16
2163i2L94p96M03K72n91N39k7k24L47p06N44J43n26K10j90N33J08j050L32Q78
2183E01j072K22J71j41M13n16K31k65LK66l41K50L07o43Q78K02r39N27J44m38
$$ plain form
2203 -240 -103 -443 123 41 -189 197 -229 -116 105 -375 298 -33 -402 450 29 66 355 152 84 280 -69
2224 -69 149 98 152 318 -311 271 246 -69 353 26 101 574 -108 -22 357 261 46 184 82 508 -66 65
2246 65 92 77 266 187 63 446 -339 -118 507 -225 -231 -92 173 17 -180 -207 -206 -330 195 -158 -517 396 -341
2269 -341 -249 71 -492 124 -161 -482 -157 -204 -307 -209 -314 143 -405 -349 191 -793 -251 87 -478 -243 -121
2290 -121 -304 303 -104 66 158 50 24 -104 235 187 -750 317 287 -255 29 419 -41 334 14 6 200 -132
2312 -132 196 10 99 477 -47 212 207 -76 713 160 126 603 -255 -188 638 -265 -29 140 306 307 -79 207
2334 207 -52 -132 241 -197 61 742 -180 -290 364 -401 9 -200 -47 -17 -16 -212 3 -402 107 -69 -248
2355 -248 248 -536 -63 41 -665 -212 76 -311 -138 -97 -70 -123 -155 -251 -346 76 314 -376 -139 302 -358 55
$$ packed form
2203b40J37l40N66q2k30L86m26J13K21m80O73l31l69Q52m21L7K89k03o8J96l49
2224f9K18n1N4J66o29N82k5l15M22l27P5M73o82Q6L79r6k15J38j02M26n74J31
2246F5K7j5J89p9j24L83p85K21O25p32oJ39K65j56j97k7Jj24N25l53l59R13p37
2269c41R2L20n63O16k85l21L25m7j03R8j05M57n48N6N40r84N42L38n65K35J22
2290a21j83O07m07J70R2j08k6j28L39m8r37J067l0n42K84L90m60L75l20qJ94l32
2312a32L28j86Q9L78n24K59nk83P89n53l4M77q58O7Q26r03K36J69J66Jl86K86
2334B07k59q0L73m38K58O81r22j10O54p65M10k09J53L0Jj96K15m05N09j76j79
2355b48M96p84M73J04p06M53K88l87J73M1K7n3l2r6r5M22K38o90K37M41o60M13
$$ plain form
2377 55 66 -299 -161 -369 -42 73 -367 -48 -240 104 13 -374 29 299 -615 182 95 -255 416 188 -417
2398 -417 311 67 150 -63 154 483 -412 205 242 -79 196 3 199 738 -287 153 653 130 8 379
2418 379 377 257 -107 236 241 -366 230 181 18 227 128 51 184 -167 146 181 156 189 -1 96 9 -281 -145 -170
2442 -170 64 -7 -545 -71 250 -464 -272 88 -213 -36 -322 -41 253 -251 19 -141 -371 -116 -430 -240
2462 -240 116 -103 -207 -204 -292 256 -208 -151 331 -50 -147 81 -69 -36 -388 -66 127 -45 62 249 -314 292
2484 292 45 321 409 -293 119 224 -127 347 77 249 162 6 269 -10 -191 399 -260 -113 116 6 -9
2505 -9 359 -55 152 -42 372 -15 -516 240 99 -221 117 262 88 586 -142 85 36 -387 425 -272 -315
2526 -315 580 -6 -242 -104 -93 78 -285 -355 364 -380 -426 52 -164 135 -212 -46 118 -534 65 -139 -140 -9
$$ packed form
2377E5J1l65J38k08L27J15m40L19j92L44r1l87M03K70r14P97q7l50O71k28o05
2398d17P28k44Q3k13K17L29q95O17L7l21K75j93J96N39j025M40N00n23j22L71
2418C79kj20l64L43No07N96m9j63K09r9p7J33l51L13L5k5L3j90R7q7k90J36k5
2442a70K34p1n38M74L21p14J92L60l01J77k86K81K94n04K70j60k30K55l14J90
2462b40L56k19j04Lq8N48m64N7M82l81r7K28j50L3l52L22J93j72J07J87n63O06
2484B92k47K76Q8p02M12J05l51M74k70J72q7j56K63k79j81N90o59J47K29j10j5
2505iL68m14K07j94M14l87n01P56j41l20L38J45j74M98p28K27m9m23Q12o97m3
2526c15Q95n86k36J38J1J71l63p0P19p44m6M78k16K99l47J66J64o52N99k04jJ31
$$ plain form
2548 -9 -210 -123 56 -194 -66 136 -285 173 -64 -264 290 -327 195 25 -160 -49 -277 -157 -28 -53 -155
2569 -155 189 -152 3 -39 -60 113 -58 -43 19 -158 86 204 -193 92 224 178 136 46 395 -195 -76 674
2591 674 233 -57 56 206 462 60 41 374 13 -191 -31 -146 23 -111 59 139 -39 32 310 -35 -135
2612 -135 -51 -282 -62 -69 -296 -200 -241 -3 -155 3 238 57 -305 165 -287 20 -134 -509 278 -413 -124 165
2634 165 -247 118 -229 -356 -173 -567 -266 -63 -378 195 -78 -480 78 -183 -441 116 -289 0 -96 -199
2654 -199 371 -43 -56 -79 -42 161 -34 -147 450 -38 -167 223 -40 466 -201 9 304 -71 58 19 -329
2675 -329 347 21 103 591 -71 166 306 109 461 249 19 398 -55 149 163 -203 69 117 101 191 -117 -67
2697 -67 -220 -110 194 106 -269 106 133 -168 285 -26 -207 54 -212 125 -373 -315 62 -325 -64 -312 -298 280
$$ packed form
2548ik01Q7J79k50J28K02m21M58k37k00N54o17N22j70j85J11k28J20J29k5j02
2569a55L44l41J55m2k1J73j71J5O2j77K44J18l97K85J32m6m2r0L49n90J19P50
2591F74m41k90J13J50K56m02j9L33l61k04J60j15J69j34J70Q0j78P1K78l45j00
2612a35Q4k31K20pk27R6m1K38j52J58K35j81l62M70m52L07j54l75P87o91K89K89
2634A65m12L65l47j27J83l94L01K03l15N73k73m02N58k61k58N57m05K89r6j03
2654a99N70m14j3k3L7K03j95j13N97m88j29L90k63N06o67K10K95l75J29l9l48
2675c29O76l26Q2M88o62K37J40j97L52k12k30L79m53K04J4l66K72M8j6R0l08N0
2697f7j53J10L04q8l75L75K7l01M53l11j81K61k66L37m98N8L77l87K61k48J4N78
$$ plain form
2719 280 -141 -358 137 -124 -332 -253 -115 -96 -182 -107 95 -331 72 -60 -705 138 51 -474 79 -330 -103 218
2741 218 -120 -58 -21 10 182 2 147 -310 -131 314 -24 -236 214 105 -23 327 5 234 231 -212 523 -55
2763 -55 176 34 -137 252 -223 188 361 -132 234 354 -358 54 325 -36 127 -76 97 -3 -18 -85 -109
2784 -109 -175 105 -160 -108 80 -264 222 81 -393 180 14 -228 22 -30 -4 -15 -124 -11 -188 -82 93 -262
2806 -262 174 -47 -357 57 -262 -392 127 -112 -65 30 -311 -140 -256 -130 -123 -390 96 -207 -168 -35 -85 -1
2828 -1 66 -341 40 278 -2 -108 -103 154 -80 -255 513 -282 -211 195 -207 -64 101 -205 -27 58 -271 338
2850 338 119 75 -166 -78 488 105 291 253 -178 288 131 -258 341 91 -44 53 245 41 330 295 93 83
2872 83 132 479 65 254 293 155 150 231 -201 326 185 -70 163 56 -59 -54 -141 -146 -381 51 251 -382 106 38
$$ packed form
2719B80m21k17M95k61k08P9J38J9q6P5K02m26M03j32o45Q43q7n25N53m09K27L21
2741B18l38O2L7L1J72j80J45m57J79M45l38k12M50j09j28L50l22K29lm43P35n78
2763e5K31j42j71L89m75M11J73m93L66J20p12M12K71l61J63k03J73j00j5o7k4
2784a09o6K80k65N2J88l44M86j41m74N73j66k42K50n2K6j1j09J13j77J06J75l55
2806b62M36k21l10M14l19j30N19k39M7R5l41J71j16J26Pk67M86l03L9J33n0Q4
2828aO7m07L81K38k80j06NK57k34j75P68p95P1M06m02J43J65l06J78Q5l29O09
2850C38k19m4k41Q8N66l83J86l8m31M66j57l89N99k50j35R7J92k04K89l5k02j0
2872H3M9L47m14J89L9j38nQ1m32N27j41k55K33j07j15Nq7nk35M32K00o33M88o8
$$ plain form
2896 38 -477 9 -147 -152 259 70 10 110 -237 -151 -109 128 -84 -338 335 -60 -602 258 -140 -133 230 -289 -188
2919 -188 326 -52 90 -63 -102 -30 -101 77 -126 -113 391 26 -93 93 -175 -46 355 -30 237 238 238 158 -155
2942 -155 54 273 -273 275 253 27 132 15 268 235 -111 270 177 -84 13 21 407 -95 128 541 227 192
2964 192 377 -168 230 148 -399 395 -114 27 -80 -171 127 -123 -93 58 -184 -42 -16 -161 -115 -167 -399 10
2986 10 -117 -285 343 -307 -53 39 2 -61 75 129 266 -283 84 220 -480 201 142 -361 -29 -139 -143 255 7
3009 7 139 57 84 -181 183 186 63 -139 332 -124 52 242 57 227 133 -208 140 34 61 102 309 134 230
3032 230 208 368 259 -4 383 208 410 75 -113 360 74 -282 281 -121 -40 211 161 70 40 18 191 -184
3054 -184 298 107 -91 99 133 20 -94 50 -2 -79 51 203 109 -211 -27 69 -75 0 -268 184 222 22
$$ packed form
2896C8n15M86j56nM11j89o0J00l47Q6M2K37k12k54O73l95n42Q60l98PL63n19J01
2919a88N14l78J42j53l9P2p1J78k03J3N04l65j19J86k68J29M01l85K67J%q0l13
2942a55K09K19n46N48k2k26J05j17K53l3l46L81r3k61R7QL86n02K23M13l14l5
2964A92J85n45L98q2n47P94n09J41j07r1K98k50L0J51k42J42K6j45M6n2k32M09
2986A0j27j68O28o50K54R2l7o3J36N4J37n49L67J36p00O81n9n03L32j10mL98k48
3009GJ32q2K7k65L64Lj23k02M71m56J76J90j85J70r4l41L48j06K7M1K07j75R6
3032B30k2J60j09k63L87j75K02l35j88M73k86l56N63m02Q1K51n0r1l0k2J73l75
3054a84M82j91j98J90L4j13j14J44n2p7J30J52r4l20J84R6j44P5k68M52L8k00
$$ plain form
3076 22 288 250 -112 -133 -158 87 -183 -31 105 -83 -89 80 -32 -57 -114 -145 52 -369 21 87 -194 103 134 -133
3100 -133 -31 48 314 111 -35 68 -103 -299 72 -89 309 162 -217 277 175 66 75 101 246 85 -238
3121 -238 174 268 21 -27 109 -110 334 -227 167 366 205 -97 29 -97 28 -27 -6 82 -17 294 8 -14
3143 -14 4 46 109 -33 -304 15 -300 -81 42 33 234 -121 -56 -219 -18 -11 29 -185 -86 95 -130 -226 -81 66
3167 66 -39 -313 -99 -83 -130 16 -66 -233 214 -393 244 -104 -282 -100 -20 -106 -160 -283 62 -49 -225 17
3189 17 -215 98 -97 -59 204 66 -123 136 -197 -7 23 57 26 93 150 -89 -139 121 31 -122 134 177 -5
3212 -5 320 -152 -65 463 -112 143 52 -50 20 80 -63 109 -210 101 229 -38 -67 100 -107 129 1 168
3234 168 -47 -19 -36 28 -4 -94 -4 -226 -99 215 9 -102 -171 -47 -229 -159 23 -397 -154 186 65 226 -285
$$ packed form
3076B2K66l8l62k1k5K45k70J52J36j88oJ69j12k5n7l1J97m21L90O6k81K97L1k67
3100a33J02P9K66k03j46J03j71j96L71j61L98j47l79M94j02j09RK6J45j61l23
3121b38M12R4k47m8J36k19M44n61L94J99j61l02J26j26J25n5K1Q8r9L11k86k2
3143a4J8M2O3j42k71L19l15K19J23rK01l55O5j63K01PM0k14R9J81k25r6J45J47
3167F6j05k74K14J6m7J46q2j67M47o07O37l48j78J82Q0q6n4j23L45j11j76K42
3189A7k32L13j95L8K63j38j89K59l33J90L0L4l1O7N7k39n0K60r0j53K56M3j82
3212eL25m72Q7N28n75K55r1j02P0O0j43J72l19L11J28k67k9J67k07K36j28J67
3234A68k15K8j7O4l2r0R0k22J27L14k06j11o9J24j82P0J82m20K43L40j21J61n11
$$ plain form
3257 -285 -5 128 111 -264 -165 -51 69 -164 -291 -101 -163 93 -29 -82 -135 63 -162 72 7 -263 -82 -163
3279 -163 80 -210 -141 -144 -377 108 -252 -66 72 -191 -76 369 -324 46 138 -40 64 -112 196 -41 125
3300 125 162 -30 35 379 40 16 244 103 79 150 -96 262 -56 146 188 121 61 -121 105 159 129 283 96
3323 96 -26 -62 3 -125 181 -16 -109 170 -277 51 109 85 102 107 -9 148 -405 -291 -181 91 -46 115 88
3346 88 145 -367 -98 41 -403 114 162 16 154 -401 53 -101 -61 230 115 -142 -17 -257 -168 170 -89 -89
3368 -89 -140 -18 162 -65 -92 -15 141 309 -44 132 -55 95 15 14 -48 72 53 128 233 76 405 31 100 369
3392 369 106 280 -57 -54 88 155 168 -140 -117 119 16 -92 -67 -32 38 493 -347 -296 55 -565 486 471 -146
3415 -146 182 279 -291 315 -545 308 -142 115 -278 153 27 -458 109 -129 77 336 191 -338 -280 50 -72
$$ packed form
3257b85K80J33j7l75R9J14J20k33j27J90o2K56j22n3n3J98k25K34o5k70J81q1
3279a63K43k90O9lk33M85l60J86J38k63J15M45o93L70R2j78J04j76L08k37J66
3300A25L7j92O5L44l39k4K28j41k4P1k46L58l18K02M2o7o0j82K26N4l0J54j87
3323I6j22l6O5j28L06j97r3K79m47L28N8k4J7Nj16J57n53J14J10K72j37J61k7
3346H8N7n12K69J39m44N17M8j46J38n55M54j54M0K91j15k57J25k40Q9L38k59%
3368h9n1J22J80k27k7P7J56J68l53J76j87J50q0jo2J20j9P5J05j57L29l74O9K69
3392C69k63J74l37LJ42O7J3l08K3K36j03j08K5L5P0M55q40N1L51o20J051j5o17
3415a46L28R7n70O06q60Q53m50K57l93M31j26m85N67k38K06K59j45n29N8L30j22
$$ plain form
3436 -72 -126 39 -296 13 22 -103 102 -234 99 76 -350 -16 6 282 120 -310 155 57 13 11 -176 -90 28 -284
3460 -284 169 187 -258 282 -77 -139 113 -214 -105 38 -17 194 -179 160 188 18 -63 17 236 -61 -9 42 55
3483 55 -94 -5 64 4 183 176 -100 150 -115 95 -23 61 128 45 -16 77 -250 -112 169 -113 17 -168 41 -6
3507 -6 -239 145 -1 66 199 45 45 -5 -377 -131 125 62 50 -42 20 -51 -95 18 139 -73 33 -194 -148 326
3531 326 -24 44 242 -1 241 207 -86 252 46 -140 19 -225 -19 29 -142 252 -183 -140 101 74 -31 135
3553 135 83 29 129 15 56 -133 29 201 26 3 -62 45 79 173 103 -12 278 293 72 53 -85 93 56 109
3577 109 122 113 -53 -97 -26 20 -53 47 -143 200 -168 -28 40 -79 187 108 111 42 -123 95 212 -137 351 229
3601 229 -195 294 -122 -152 235 -51 337 -101 76 -83 -124 -353 -35 -202 69 27 -325 -268 763 -127 -290
$$ packed form
3436g2n4J65l35L09Rj25K05l36L33k3m26L34K2K76j62m30M65r8m4kj87Q6J18l12
3460b84M53J8m45N40l59o2K52l27J09J43n5K11l73L39K8j70q1Q0K19k97N2N1J3
3483E5j49Q9O9o0J79pk76K50k65K10j18Q4O7q3o1R3l27J38K81k82J30j85K09m7
3507fk33L84j46O7J33j54%n0l72K46K56o3j2r2O2p1m4J13J21k12J06k27M6M74
3531C26l50O8J98k43K42l4k93L38k06j86J59k44K06M8j71L94m35M3K41k7j05J66
3553A35n2n4J00j14M1j89J62J72j75k3o5J07L4R4p0j15K90J5k21j9j38J78l7N3
3577A09J3rj66m4P1M6p3J00j90L43l68J40O8j19K66p9Lo9j65K18J17l49M88j22
3601B29m24M89m16l0L87k86L88m38J77j59m1k29L18j67K71m2l52N7J031q90j63
$$ plain form
3622 -290 -114 -20 -36 -41 111 -371 0 -85 -203 176 -24 -159 14 -40 76 23 -210 -200 -251 -76 45 42 114 179
3646 179 -242 -95 47 270 -18 73 12 197 355 46 -108 -84 30 163 -26 219 271 -199 248 -42 191
3667 191 -272 -133 366 99 -252 -98 93 132 -76 -83 -92 -108 -206 -192 101 -45 -34 -119 159 62 -17 221 38 -29
3691 -29 -11 41 404 -43 -43 -109 -151 -231 -298 15 116 -102 -336 -269 -214 -3 -244 -22 -125 -284 -61 -62 -10 127 -53
3716 -53 -71 -103 -267 74 244 53 192 -141 83 163 -123 -91 -235 -108 134 74 9 33 -389 43 29 -435 -241
3739 -241 118 242 -141 112 76 -71 5 83 3 101 133 209 239 179 106 107 197 -124 -18 180 -98 -66 202 -7 -123
3764 -123 -120 465 26 123 176 -62 377 129 -148 127 79 36 216 -337 -244 -128 -51 132 -1 31 61 -66 192
3787 192 30 -347 56 -119 -88 133 49 -76 86 -92 69 5 97 -282 -147 -147 -46 -336 -18 -34 -165 -246 -11
$$ packed form
3622b90J76R4j6nJ52m82L71q5j18L79k00j35J73n4J16n3k33J0n1J75J21lP2O5
3646A79m21J47J42K23k88R1o1J85J58l09j54K4J14J33j89K45N2m70M47k90K33
3667A91m63J39M99k67l51J54J91L9k08prj6r8J4K93j46J1q5K78r7p9K38j83o7
3691b9J8N2L63m47%o6m2q0o7L13J01k18k34O7N5K11k41K22j03j59K23jN2J37j80
3716e3j8l2j64L41J70j91J39l33K24Q0k86L2j44J27K42o0o5K4m22M32j4m64J94
3739b41L59J24l83K53l6j47P6P8q0R8L2P6L0o0p3JR0l21J06J98k78L2K68k09j16
3764a23LN85m39R7N3k38M39k48k77K75m8m3J80n53R3J16P7J83j33L2L0j27K58
3787A92j62l77M03j75L1K21q4j25J62j78J61o4R2l79J35%J01k90L18j6j31q1K35
$$ plain form
3810 -11 57 -184 -53 250 -228 48 101 -121 147 -79 -197 118 156 3 115 2 132 94 -172 93 -10 22
3832 22 220 -150 340 287 -143 57 -81 267 174 -34 -86 278 104 -50 60 -37 -107 -100 111 85 -112 -65 -154 -55
3856 -55 221 102 -115 23 -242 -56 -116 359 -2 115 93 -103 68 294 -217 -39 -39 -34 6 153 36 -63 -14
3879 -14 19 32 -45 -75 163 -163 -30 -336 61 -3 -297 -207 99 39 -55 -162 -89 162 -95 -206 -233 -120 -100 -176
3903 -176 202 52 -308 73 233 -184 228 112 -72 -31 -125 260 -370 -299 13 -221 251 11 -67 279 132
3924 132 -26 249 32 267 -125 -255 59 -27 50 95 -49 95 -82 -121 44 -306 124 76 37 -226 211 -138
3946 -138 -169 -121 188 79 -33 -145 120 -238 45 -57 -116 145 -132 71 -32 146 -43 -116 -147 252 46 47
3968 47 386 250 -204 -176 -151 64 -142 -197 81 -373 289 70 -133 80 -21 -325 214 -91 -87 -7 -348 -158
$$ packed form
3810a1O8k41J31L03m78K76N3k22K68k26j18L15L8j53J12j13J30l8k66K65j03L2
3832B2J98l70M90n3m30K00j38L48r3k08n2L64j74j54J10r7p0PK11k6j97M7q9R9
3856e5K76j19k17J38k65J86o0M75l61J17k2j96J71K26n11J78%NM0J47j17r9M9
3879a4L3J3p7l0K38l26J33l06L97o4k94R0L06o0r4j07P3K51k57j11k7J13K0p6
3903a76L78j50l60L81J60m17M12j16j84M1r4L85o30P1L12k34M72k40p8L46j47
3924A32j58K75k17K35l92j30L14q6P7M5j44J44j77l9J65l50M30m8l9k63M37l49
3946a38l1M8L09j09j12j12K65l58K83j02n9K61k77K03j03J78j89p3l1L99k06J
3968D7L39j36m54K8K5K15k06n5K78m54O62k19k03K13j01l04N39l05MQ0l41J90
$$ plain form
3990 -158 -46 -103 257 -89 88 -2 156 -51 -132 -88 -131 17 74 58 -240 -105 -209 -31 124 -166 -46 22 49
4013 49 167 128 -23 -65 -78 -7 -1 6 116 -89 -29 -39 -33 319 -111 340 284 317 -171 170 -78 119 79 4 45 56
4039 56 -41 84 235 -181 65 -21 179 290 -171 111 98 19 -108 -317 105 -31 -226 229 -179 -47 -108 -71
4061 -71 -160 11 -256 -3 -51 -48 102 -7 -21 90 -201 -112 -67 53 338 -107 17 -81 -54 74 -104 48 -189
4084 -189 -307 -74 -291 -135 0 62 -266 170 70 -30 133 -146 105 -20 41 211 61 -143 309 -44 201
4105 201 205 7 148 6 149 52 -109 166 66 -29 40 -102 -28 100 -194 332 2 185 -11 180 382 44
4127 44 -106 33 -20 114 -128 3 46 -143 6 179 -135 -36 43 7 60 -158 -169 12 -139 -91 -52 -107 51 -170
4151 -170 -169 -17 22 -37 81 -13 96 -13 -100 -181 131 -68 97 -21 -208 -67 114 100 -24 115 145 -59 -35
$$ packed form
3990a58J12n7L60l46J77r0J58k07q1M4m3J48N7j6k98J35j04J78J55k90J20O8K7
4013D9J18l9j51m2j3P1OPJ10k05O0j0OL52m30M51n6L3m88L41k48J97m0p5M1J1
4039E6r7J25J51m16K46q6K00J11m61K82j3p9j27k09M22j36j95M55m08J32o1L7
4061g1q9J71k67K53m8LJ50j09j4J11k91Q9M5J20K85m45J24r8K7J28j78J52k37
4084a89j18K33k17J56J35O2l28M36j00j00J63k79K51j25O1J70j50k04M52l53K45
4105B01Mj98J41j42J43r7j61K75j00r5O9j42P4J28k94N26l30J83j96J91K02l38
4127D4j50J39n3J34k42J31M3j89J49J73l14R9P9l6N3k18j1J81j51M8L9n5J58k21
4151a70JJ52L9n9J18r4J09j09q7q1L12j99J65j18j87J41J81j4j24J39L0k04K4
$$ plain form
4174 -35 197 -89 183 -191 33 -87 -39 123 33 -109 14 -55 10 -168 -126 229 -159 -251 -134 14 -46 45 -182
4197 -182 49 -50 29 39 182 -15 27 157 80 -45 -316 -15 -220 155 21 -131 90 138 78 220 85 29 4
4220 4 205 -163 267 -299 63 -166 202 183 -324 186 -79 -80 -45 118 -508 141 159 -226 34 -285 -45 -63 -183
4243 -183 -100 159 49 -222 -22 84 -119 -152 -60 -137 102 -162 144 -36 8 -80 192 117 78 -49 111 -166 -275
4266 -275 -164 158 -160 -191 -188 -77 307 -74 -36 427 236 229 -254 217 -94 55 105 195 322 49 1 193 161
4289 161 -28 -142 165 83 163 -42 -111 -34 -44 -181 380 -126 -101 164 71 34 -4 158 85 -222 60 90 -233 100
4313 100 104 -42 122 -7 7 140 -137 -85 -139 39 265 -409 -53 103 -29 -62 -47 -27 -76 -173 -12 -13 -167 7
4337 7 -267 171 -27 -101 -39 4 -24 -63 30 -21 83 259 1 50 -216 6 -3 -19 143 1 24 156 -109 366 -246
$$ packed form
4174c5K32k86K72l74K24j20M8J62r0j42J23o9O5j78M2L55l88r2J17J48o0R1k27
4197a82K31r9P9J0J43j97M2J30p7j25k71L01k05L75j34j52K21M8o0J42j35n6k5
4220DK01l68M30n66L62k29L68j9n07N10k65jL5J63o26O49J8l85K60l19K40j8j20
4243a83Q3K59j10k71K00J06k03l3R2p7K39k64L06j80M4q8K72p5l9j27J60k77j09
4266b75J11L22l18l1LJ11L84l81L8M63j91pm83M71l11J49N0R0J27k73m8J92l2
4289A61j89j14L07q2Q0k05o9P7j0j37N61n06K5K65r3l7l8J62p3l07K82L0l23L33
4313A00Mj46J64j29J4J33k77N2n4J78K26o74L56J56j32l3J5K0m9r7J61jj54J74
4337Gk74M38j98p4O2M3k8l9R3n1J04J76k58M9k66K22rj6J62j42K3J32k65M75o12
$$ plain form
4362 -246 15 -47 120 -111 160 -221 154 83 -216 354 48 284 153 44 105 -176 87 164 -130 26 -95
4383 -95 36 199 -75 -110 349 12 -77 -211 -26 -77 218 5 232 322 34 -9 -8 31 14 -64 0 -18 120 -69
4407 -69 27 166 26 -82 -361 41 -232 -3 157 -42 142 -301 -197 -341 -106 74 -112 231 -170 -87 312
4428 312 -255 -134 -338 14 175 -108 -30 -83 -69 52 -23 128 -144 24 -138 488 -27 -6 -76 -146 39 58 67
4451 67 14 86 172 -20 -75 -104 175 -98 -68 -38 167 228 215 65 -303 121 84 135 34 513 -139 214 -24 -185
4475 -185 72 -282 -9 -135 110 62 51 -21 -134 -306 54 112 78 130 8 138 -22 -200 57 8 -182 118
4497 118 -26 18 -11 116 46 -97 -23 -270 90 -48 679 144 -236 212 214 -114 137 45 299 -53 -407 244
4519 244 -56 476 107 -183 511 6 157 194 -133 186 -112 133 82 -539 -408 574 -562 -229 -74 -137 9
$$ packed form
4362b46K61o2J67k31K71l81L75p1k99N70l06K36j31j09O1k81K63P7k94J56j21
4383i5J31J63k74l5M59l37q9j34J85n1K95k13K27R0k88m3JL9j7p8O4j8J38j89
4407f9R6J39j40j08k79M02k73K29J60j99J84m43J04j44K35J80j86L43m01Q3L99
4428C12n67J21k04L52J61k83P8n3J4J21p5J51k72J68j62O26n15K1p0p0J85J9R
4451F7n3P2Q6j92n5k9K79k73L0L0K05O1j3j50l68M24l7N1j01M79o52L53k38j61
4475a85K57l54K73j26K45m8j1p2j13j72L60N8l4N2j22J30j60j78K57m9j90L00
4497A18j44M4k9J27p0j43P4k47L60j38P27n35l80M48Kl28K51r2K54l52l54O51
4519B44l00N32l69k90O94n05J51L7l27L19k98K45n1o21J31R82j136L33J55o3J46
$$ plain form
4540 9 51 101 67 59 -99 37 12 188 57 -236 152 400 -385 213 109 109 319 110 49 -392 60 -72 -23 80
4564 80 316 206 -22 116 -107 134 5 97 -51 -130 -126 -26 -121 -48 126 60 -18 -124 -17 -81 59 121 -350 -22
4588 -22 73 -180 -109 -182 178 155 49 -24 24 -4 -29 25 -84 30 -157 -119 -12 -121 130 56 -148 91 -187 155
4612 155 -133 -83 -80 -119 -55 246 142 -150 -344 -191 12 -129 3 259 -98 23 -20 -180 -187 89 14 -134 -108
4635 -108 -221 97 -361 46 -45 -312 -41 275 36 -132 107 -10 68 78 -5 -44 38 67 -73 136 -52 37 -86
4658 -86 -80 -175 72 -31 282 -210 176 101 -202 -62 -51 76 22 -176 -238 -107 1 135 14 -64 14 310 -207
4681 -207 204 -200 -113 -76 113 -61 176 -75 328 131 101 -8 -39 92 -34 -205 60 -145 68 28 138 26
4703 26 95 -390 -205 -233 -58 121 79 99 -67 -360 -332 -96 57 41 95 207 -253 -153 -27 64 -81 -29 -86 334
$$ packed form
4540IM2N0l4qj58J36k5J76j31k93L88K48p85N98j04%K10k09o1m41M52j32M9J03
4564H0K36j10k28J38k23K41j29R2j48p9MJ00r5P3J74o6p8j06J07o4J40O2m71L28
4588b2R5k53P1p3L60k3j06p3M8k8k5N4j09J14j87L8J07j09K51p4k04K39k78L42
4612A55k88N0Ll9O4L01j04k92j94J53K03j41J32K56l57J21m3j60pK76p5j48K6
4635a08j13L18m58M07r1k67K71L16k39j68K39j17P8J0q3l9Q2K9j40K09j88Q9j23
4658h6Or5K47j03L13m92L86p5l03J40J1J27n4j98o2J31J08J34j21p8P8K96n17
4681b07M11m04Q7L7J89j74K37k51M03j97l0j09l1J31j26j71K65k05K13m0J10j12
4703B6O9m85J85k8J75J79m2K0j66k93K8K36J53j6N4J12m60J00J26R1j45N2n7M20
$$ plain form
4727 334 -143 57 172 108 -171 -151 -184 30 8 24 140 112 24 -111 -139 349 -84 -97 -56 -94 35 103 140 -43
4751 -43 4 -34 -130 70 126 112 79 161 199 -79 -62 28 -111 27 104 82 -13 38 115 225 5 -406 60 156 -189 90
4777 90 -276 -67 -172 -62 -210 -26 86 35 57 116 -150 -130 -121 131 -293 -300 -133 71 -75 -4 -34 151 -115 -272
4801 -272 27 145 34 -111 -94 126 208 154 187 -303 57 -59 103 61 -253 -79 50 278 204 -108 57 165
4823 165 -4 -235 46 82 -187 242 -65 246 -147 -11 19 38 148 -175 -72 96 150 9 -103 16 74 154
4845 154 -46 -8 -62 124 -131 -151 51 62 36 -201 99 173 -91 21 118 60 -162 129 -247 40 -141 80 61
4868 61 -116 38 16 -53 2 255 211 54 -269 -197 -49 3 -99 -242 -18 86 -59 156 -30 -44 -69 -55 -177
4891 -177 -33 54 -120 -11 87 -13 -56 58 156 -233 -58 32 -210 36 -86 42 -126 -51 14 43 219 42 -91
$$ packed form
4727C34m77K00J15o4k79K0l3K14k2J6J16k8q8j35k8M88m33j3M1l8J29O8L7j83
4751d3M7l8r6K00N6j4l3Q2L8k78J7R0j39J38P7k2r5N1P7J10k20m11M66R6l45K79
4777I0l66K09j05J10j48J84J12n1K2N9k66K0RK52m24pJ67K04j46P1l0J85k66j57
4801b72K99J18j11j45J7K20Q2n4L3m90L60j16J62m2l14J74J29K28p4l12J65J08
4823A65j69k31K81L6k69M29l07L11l93J36L0J9J10l23J03J68N4j41j12J19N8Q0
4845A54k00L8n4J86k55k0K02J1k6k37L00P4k64J12R7n8k22K91l76K87j81K21j9
4868F1j77J54k2o9N5K53m4j57l23P2J48N2j02j43K24J04j45K15j86j4k5J4j22
4891a77J44Q7j74J09R8j00m3J14R8l89J75R0k42K46j22J28j68P5O5K9J76j77j33
$$ plain form
4914 -91 -39 -93 89 -15 122 71 -187 -129 10 93 106 161 -109 -156 -184 169 -99 236 -62 -15 -47 -120 51 -109
4938 -109 173 91 231 184 -104 207 159 33 -29 -115 -26 -62 -2 9 64 118 158 -33 134 -210 -558 -148 -108 17
4962 17 -132 145 241 -272 -103 -191 22 128 -225 -274 241 -425 -233 106 -41 -68 -451 7 -499 -337 134 -162
4984 -162 -101 -113 -96 -175 225 -305 41 -9 306 -232 36 -20 -21 169 -383 -121 31 545 -1 -89 425 -453 530
5007 530 67 163 251 -121 -250 305 -123 -328 1119 -576 368 9 251 115 193 -381 157 491 -252 -293 -678
5028 -678 -465 116 -363 -288 -214 106 341 -147 280 -66 -24 620 331 -544 164 -142 192 -358 143 -194 10
5049 10 -231 -188 -639 -43 -147 409 358 -797 -789 -265 -349 496 69 -46 31 650 -419 -64 -375 248 -319 119
5071 119 175 -931 -639 -448 -347 217 96 27 1474 253 -573 -469 -309 -950 211 64 -465 198 174 453
$$ packed form
4914i1N2n4J82j04J37n1k58N8J39Q3J3N5k70m7k8L53k68L35k98M7l2p3J71j60
4938a09K82q2J40m7k88L11m8j26o2q6Q9l6O0J1N5N4M0j91J67l44l48M10M0J25
4962A7j49K77R6n13J69q8K13J06l53m9N15o66J92L39j47k7l83M58n06J62M71k96
4984a62O1j2J7p9M00n30L46n0L15n38K68n6jJ90n52K62J52N14n46q8N14q78R83
5007E30m63R6Q8l72j29N55m28k05J447j695R44l59K42j36P8n74N38L34p43m1l85
5028f78K13N81m79P5P4L20K35m88M27l46M2O44k89q75P08l06L34n50N01l37K04
5049A0k41M3m51N96j04N56n1j155QN24q4Q45m27j15P7O19j069L55l11O23n67M38
5071A19N6j106K92J91J01N64j21o9J447j221q26J04J60o41J161j47n29O63k4K79
$$ plain form
5091 453 -367 -100 -511 -698 597 189 326 -587 -115 -328 141 456 62 392 -126 -640 56 -366 208 -435
5111 -435 -54 -142 -131 -30 336 -611 -599 -345 -288 -165 -143 120 -126 378 -18 305 -29 -192 140 149 -127 -3
5133 -3 117 24 -30 -189 -69 286 202 -222 98 65 112 -192 -102 -145 44 -156 -48 -129 -194 22 -166 8 -284 -166
5157 -166 23 182 -144 226 -146 26 -59 72 -375 178 243 -137 16 280 180 -161 45 26 49 100 129 100
5179 100 -46 -141 -36 318 -29 83 458 -41 -151 -32 -37 -2 116 -113 1 -132 -104 39 56 248 92 -106
5201 -106 137 44 57 17 -58 69 51 -213 -17 -249 16 194 -119 -11 -47 -96 -186 176 -292 75 41 190 -70
5224 -70 176 -22 -50 52 -88 139 -4 -109 -2 -147 215 -146 -69 -113 23 106 13 57 -8 -109 -112 -141 162 61
5248 61 101 114 -85 49 62 -19 -7 -34 4 -207 -33 -25 -149 101 -193 -164 137 -59 172 -194 51 6 109 112 -217
$$ packed form
5091D53q20K67m11j87J295m08J37r13M72k13M69L15l94L30n18n14O96m22N74o43
5111d35L81q8J1J01L66r47J2K54N7J23K2K63k46N04l96L23l34j63L32Rk76J24
5133cJ20r3n4j59J20L55q4m24L20l3M7l04R0m3J89k00J08q1o5K16j88J74k92J18
5157a66J89J59l26L70l72J72q5J31m47N53O5l80J53K64j00l41K06j9K3N1K9k9
5179A00j46r5J05L54l47J12L75m99j10J19nL5J18k29J14j33K8J43J7J92j56j98
5201a06K43r3J3m0p5J27j8k64J96k32K65J78l13J08l6m9r0L62m68L67l4J49k60
5224g0K46j98k8J02j40K27j43j05J07j45L62l61P7m4J36Q3r3M4o5j01lk9L03j01
5248F1M0J3j99J34J3q1J2k7L8k11J74Qj24K50k94K9L01j96K31l66K45m5J03Ll29
$$ plain form
5273 -217 122 297 108 -113 110 243 232 104 -285 -3 216 58 229 36 88 92 102 -101 306 -151 -18 -196
5295 -196 189 187 -99 52 -259 -271 195 -146 -117 -32 -86 167 102 -75 -219 -10 0 -41 -108 -42 -112 4 -145 -172
5319 -172 44 -4 -70 -167 237 -179 -58 46 18 182 -19 104 94 -72 143 -19 -129 1 -116 179 46 -42
5341 -42 -92 80 -203 -75 29 17 35 155 205 -85 28 -169 89 -105 -125 -67 -300 -92 192 -194 -195 -120 -172 -32
5365 -32 182 542 -123 132 -164 -92 -95 -101 179 -101 -94 350 -415 297 -596 602 -542 296 412 548 -440 -182
5387 -182 783 -46 -1121 -616 268 221 -512 12 525 -467 383 891 868 -283 -227 167 923 314 -696 44
5407 44 1290 310 129 149 33 361 74 -509 240 -441 341 208 -201 -631 -393 -410 -459 847 350 288 -360
5428 -360 412 384 -63 -215 -282 -70 -116 89 115 84 26 161 83 -285 -11 87 54 110 -55 -147 -22 42 -133 -187
$$ packed form
5273b17L39J75j89k21K23J33j1j28l89K82K19j58J71j93N2MJ0k03M07m57J33j78
5295a96L85kk86J51l11j2M66l41K9Q5n4K53o5j77j44K09J0m1o7O6p0J16j49k7
5319a72K16m8o6r7M04m16J21J04k8J64k01J23j0j66K15j62j10J30j17K95j33q8
5341d2n0J72k83J28J04j2J8J20N0k90J13j97K58j94k0N8k33K08K84l86jP5n2J40
5365c2K14L60o65K55k96P2loK80k80PM44p65P12q93J198j144Q38J16J36r88K58
5387a82R65q29j075N05Q84m7p33N24N13r92Q50N08k3j151N6L94P56o09j010P40
5407D4J246r80j81K0j16L28k87n83P49o81P82j33m09m30K38j7m9J306m97o2o48
5428c60P72k8m47j52o7K12m6K05K6l1n8J35p8l68K74R8l3N6j65r2J25O4j75n4
$$ plain form
5452 -187 -146 38 248 -50 -81 -232 140 -224 -71 70 8 -298 -225 -82 4 131 263 11 41 57 137 171 -138
5475 -138 180 -48 87 -371 58 -629 -181 -375 180 -813 163 583 -892 293 377 68 -269 235 28 199
5495 199 -289 155 -112 47 -57 65 -8 -4 -41 57 -273 84 42 -128 -58 -315 -196 -86 -36 80 -216 39 147
5518 147 -29 -195 -216 -146 43 237 49 285 176 -100 176 50 -218 -18 -32 -49 -29 0 -31 -219 -150 20 54
5541 54 66 46 182 168 -42 -49 110 -120 26 110 -220 -84 -129 81 9 117 -52 -161 7 24 -84 -6 102 168
5565 168 150 -25 138 56 300 146 35 341 -255 709 262 -232 -133 5 9 81 -131 161 202 376 -36 -83 -227
5588 -227 130 390 66 55 145 132 -120 -237 -85 28 -129 -113 -167 121 -72 -228 130 -13 36 -283 -154 34
5610 34 -7 201 -61 70 188 77 110 62 -26 98 252 -126 73 196 -78 168 186 -15 -166 211 115 11
$$ packed form
5452a87M1J84K10k98l1j51L72l64J53J41o2l06P3J43Q6J27J32k52L0J6Q0L4l09
5475a38L18k28J35m58M29o87M48j94N55r93R76M20j475J185Q4l09l37N04k07J71
5495A99m88M44k67J59j04J22p3Ml7R8l30L57m2j70P0k57J19J10N0J16k96K55J08
5518A47j76j66k1P0J89J94j88K36j09k76K76j26k68K00j4j7K0K9l1j88O9J70L4
5541E4J2k0J36j4k10pJ59k30J46Q4l30J36m5K10p2J08j69j09J68J7j08P8J08O6
5565A68j8j75J63q2K44j54j11L06n96R64m47m94R9J38MP2k12K92M1J74m12m7j44
5588b27L57K60l24j1R0j3k52j17J52J13j57J6n4K88j93j56L58j43M9l19J29J88
5610C4m1K08k62J31J18j11L3m8q8J24J54l78J99J23k74K46J8k01j51L77r6j04
$$ plain form
5632 11 160 -258 37 -200 269 33 63 236 99 -119 -1 -65 -83 -32 -118 -228 75 121 -85 -105 -236 -90 -42
5655 -42 -172 -75 -110 -145 104 165 35 131 149 35 -81 10 64 -3 -33 87 -28 178 -406 -169 56 42 167 92
5679 92 24 87 95 69 -152 -20 11 -136 111 -184 -127 -26 25 153 293 50 88 62 -4 100 -225 -194 39 -166
5703 -166 218 121 -26 10 -23 -3 61 118 106 69 -395 26 237 76 248 -129 -140 121 -51 95 -148 -455 333
5726 333 180 75 -189 10 107 113 -716 -347 -62 -130 155 -18 -138 -301 277 -168 -127 17 289 -19 -126 -121
5748 -121 -9 -37 -70 120 52 -66 211 -118 -27 16 -33 -207 148 -285 96 -193 -153 -8 -145 -60 149 -29 111
5771 111 -88 -145 100 -102 10 -41 -69 -225 28 176 82 -184 112 -264 -40 255 -116 -38 -116 -64 -309 -236 -82
5794 -82 46 111 128 99 -33 -149 183 -131 199 -102 -45 -84 -43 129 388 -21 -209 -147 20 -63 -104 -111 22 50
$$ packed form
5632A1J49m18K95k37M69k36L0J73j37k18J18o4j8N1q6j10L03M6k06k0j31J46M8
5655d2j30R7l5l5K49O1j30R6J8j14j16R1N4o7l0J20j15K06n84K37K25j4J25p5
5679I2o8O3Qk6k21J32L1j47K47k95N7J01N1J28J40k43L8k6o6J04l25L1K33k05
5703a66L84r7j47L6l3K0O4N7j2l7m64M21K11j61J72l77j1K61j72J46k43l07P88
5726C33j53j05k64J99R7Oq29L69K85o8K85j73j20j63N78m45M1J44K72l08j07N
5748a21J12k8l3J90o8j18K77l29R1M3m9j74L55m33L81k89M0J45j37Q5K09j78J40
5771A11j99n7K45k02J12n1k8j56K53J48r4k66K96l76K24K95l71P8p8N2k45P3J54
5794h2J28O5J7k9j32j16L32l14L30l01N7l9M1J72K59m09j88O2J67q3m1pJ33K8
$$ plain form
5818 50 101 58 -19 65 62 -86 338 -84 -242 197 -69 -9 -93 4 -134 52 -77 -69 25 -172 154 -158 60 19 -16
5843 -16 -104 -31 41 141 95 312 14 -49 183 1 153 57 -27 -7 -16 -170 -279 -201 136 -12 -43 -153 153 126 66
5868 66 -100 -92 -113 -113 -44 -141 13 -120 63 -33 15 261 -96 -159 171 138 -8 -64 8 79 -27 -80 157 -215 -109
5893 -109 -94 89 -113 -24 -124 196 226 -127 -187 -6 158 -92 141 55 -63 -215 443 -361 3 38 144 -116
5915 -116 -22 -121 94 8 81 -110 -138 -64 75 -99 -91 161 -186 -93 -8 281 45 -67 -13 -139 129 -143 -126 -40
5939 -40 61 -91 -14 -169 -158 270 -381 30 -199 0 -20 125 -61 -279 -69 36 154 -207 78 62 -167 -19
5961 -19 44 36 160 113 -279 -192 98 143 -64 0 -76 55 85 59 163 -37 127 58 -308 -10 32 -9 32 -122 -144
5986 -144 159 -129 -186 155 -159 23 147 73 -159 196 -151 -284 -41 150 160 -3 219 138 108 246 27 202
$$ packed form
5818E0N1m3p7Q4lj48M24m22j58M39k66O0q4R7j38J86j29QR4j97L26l12K18m1l5
5843a6q8P3P2J00m6K17k98o3K32j82J52r6q4K0rj54j09P8L37j48l1j10L06k7o0
5868F6j66Qk1%O9r7J54j33J83r6M8K46l57o3L30l3j46n6P2P1j06n3K37l72J06
5893a09J5J83k02Q9j00L20L0l53o0J81J64k50K33q6j18j52O58q04L64L5J06k60
5915a16R4r9K15q6P3j91k8P4J39j74QK52l47R3Q5K89k36j12N4j26K68k72J7Q6
5939d0J01j52P7j55J1M28o51M11k29J99k0J45j86k18K10J05J18l61K85j6k29J48
5961a9O3qJ24m7l92Q7K90M5k07O4p6J31L0k6J04k00J64o9l66K98M2m1M1j54k2
5986a44L03k88n7L41l14J82J24p4k32L55l47j33K43J91J0j63K22q1l0J38k19J75
$$ plain form
6008 202 -38 45 109 83 15 14 -23 149 -32 -118 -206 166 -74 -154 -114 241 -58 -38 -100 -69 -176 84 93 18 71 -88
6034 -88 -63 -87 -28 -233 -65 221 -3 98 66 -57 -63 165 -229 -140 -287 -207 -126 -3 -157 -2 -95 183 -19 34
6058 34 190 184 262 76 70 -192 -89 -39 139 4 -263 21 -124 67 131 70 83 154 175 -89 60 92 42 -34 -130
6083 -130 -234 -2 -230 -136 143 34 -70 51 -223 -155 -10 -46 22 137 213 49 71 -15 -213 -115 -109 20 -84
6106 -84 -100 79 -309 19 -66 247 294 71 13 79 46 -89 -6 -79 65 172 -207 167 -90 311 -150 -128 334
6129 334 -235 14 38 -27 -108 -158 -227 -134 24 -4 -280 323 43 -189 -85 -244 272 103 61 -82 -70 234 86
6152 86 -128 -82 325 -7 44 47 -346 -265 230 -205 11 152 -198 299 3 -282 24 -91 -774 -138 -149 -424
6174 -424 -73 -103 382 85 -105 -60 5 -14 -133 86 -50 42 -148 -73 -118 -195 116 -112 -67 68 23 32 -116 151
$$ packed form
6008B02k40Q3O4k6o8jl7J72j81q6q8L72k40q0M0L55k99K0o2L1j07K60Rp5N3j59
6034h8K5k4N9k05J68K86k24J01l2j23oK28l94Q9j47Q0Q1J23j54J55r3K78k02N3
6058C4J56oP8j86ok62J03N0J78j35k67K84j45J91O4o1J3P1K1k64J49L2n0p6r6
6083a30j04K32k28R4K79j09j04J21k74O8J45l6O8J15P6j64K2q6j98R8OJ29j04
6106h4j6J79l88L28q5L13M7k23n8O6l3j35Q3p3J44J07l79L74k57M01m61K2M62
6129C34n69K49K4o5q1n0o9R3J58k8k76O03k80k32J04j59N16j69m2j43J2L04j48
6152H6k14M6M07l32N1Ll93Q1M95m35K16J41l50M97k96k85L06j15o83O36j1k75
6174d24L51l0M85k97j90M5O5j9j19K19j36R2j90P5m5p7L11k28M5J35m5Rj48K67
$$ plain form
6198 151 99 148 10 -426 168 -41 -68 122 190 74 -12 80 8 -24 30 46 53 -106 69 9 72 -12 51 -82 -27 -26
6224 -26 -116 -168 156 -59 -235 -68 130 -37 -157 -274 117 -273 0 154 -24 -143 -64 -199 91 54 23 91
6246 91 -86 204 169 -47 45 188 -38 169 -61 48 168 94 6 -67 162 50 -218 -104 -135 67 -238 31
6268 31 67 -5 -58 107 -74 49 304 -88 210 73 -246 -156 -6 -26 -235 81 -148 -105 41 32 -40 -114 -69 55
6292 55 230 -42 341 -33 87 -99 -96 -87 -42 51 74 30 -34 52 -409 243 136 -40 -12 -59 -60 -50 41 -130 2 117
6318 117 -376 -27 153 38 -20 124 -99 -39 -77 -18 16 -244 -32 -83 183 56 27 103 -96 110 49 -96 32
6341 32 -93 -5 -6 -180 109 228 -216 205 -363 14 128 149 -60 12 72 -138 -81 217 16 30 122 -24 -167
6364 -167 -162 0 -25 -3 -98 -203 -116 46 -121 29 49 40 -154 -71 13 25 82 122 16 29 5 -84 -308 -73 6 198
$$ packed form
6198A51n2M9j38m36N94k09k7J90O8j16q6R2p2l2N4J6Pj59J75o0O3q4O3j33N5J
6224b6r0n2L24k15j76J67J98j67j20j17L91l90K73J54j78j19P9j35K90l7l1O8
6246I1j77K90l5k16R2J43k26K07k30J09J20p4q8p3K29j12k68J14l1K02l05K69
6268C1L6p2n3J65j81J23K55l92K98j37l19R0J50k0k09L16k29M3J46rp2p4M5J24
6292E5J75k72L83l74J20j86LRM5R3K3m4o4Q6m61O52j07j76K8m7jJ0R1j71J32J15
6318A17m93L49J80j15n8J44k23O0l8N9L4k60K12n1K66j27k9P6j99K06o1j45J28
6341C2j25Q8jj74K89J19m44M21n68L77J14K1k09P2O0k10N7K98k01J4R2j46j43
6364a67NJ62k5K2r5j05Q7J62j67J50K0rj94Q3Q4J2N7M0j06J3k4q9k24K35P9J92
$$ plain form
6390 198 209 -41 70 99 71 167 31 120 7 97 168 27 -168 -110 -332 -102 -28 52 -181 -37 -304 -62 -4 -254
6414 -254 57 -109 10 -333 -85 -54 126 41 83 -109 68 -9 -131 25 116 34 -125 15 -30 175 -60 -226
6436 -226 59 -202 -195 -105 -53 -33 48 -35 176 37 -46 51 -56 97 241 250 -4 -183 -257 -151 158 -28 -37 244 -105
6461 -105 131 262 235 -146 -235 71 178 35 196 -148 -277 -42 -11 -234 33 -149 22 -177 -64 -116 -264
6482 -264 64 17 48 -119 -148 -179 -28 -73 -121 257 -207 -198 77 -52 222 102 -37 76 60 -86 -102 121 77 206
6506 206 -48 -93 114 -262 -106 -312 64 1 -150 -406 83 108 9 102 -221 -73 8 165 44 -82 -7 81 21
6529 21 13 -90 102 249 -22 47 166 -29 284 -36 87 21 -85 -12 -28 176 22 -114 141 -15 94 -104
6551 -104 4 -127 -81 5 -61 -133 31 38 6 179 -56 -250 -2 -6 63 110 -192 -85 311 57 -131 -4 197 -111
$$ packed form
6390A98J1k50J11K9k8R6j36Q9j13R0P1j41j95N8k22K30P4Q0k33J44k67K42N8k50
6414b54L11j66J19l43K48L1J80q5M2j92J77p7j22J56R1q2j59J40m5K05k35j66
6436b26K85k61PR0N2K0Q1q3K11j39q3R7j07J53J44Rk54j79p4J06L09j86rK81l49
6461a05K36J31k7l81q9L06J07j43J61l44j29K35L1k23K67j82J71j99J13n2j48
6482b64L28m7L1j67k9l1J51m5m8L78m64RK75j29K74j20j39J13j6j46j6K23m4J29
6506B06k54m5K07l76J56k06L76o3j51k56M89K5r9R3l23J48Q1J57j21j26P5Q8o0
6529B1qj03J92J47k71O9J19j95L13l20J23o6j06P3j6K04j54j36K55j56J09j98
6551a04J08j31M6Q6o6p2J64Pl2J73k35j94K48mO9M7l02J07L96k54j88J27K01l08
$$ plain form
6575 -111 -76 19 406 108 -172 -54 115 -12 408 -37 42 -131 42 133 -35 -144 -99 50 82 -109 -208 128
6597 128 -37 -195 -165 -5 121 -9 111 93 -143 208 63 -67 -320 -9 7 209 98 -59 -67 56 -95 -84
6619 -84 -129 38 -29 -208 -61 175 163 -38 -31 162 7 128 -52 246 81 -34 67 -10 8 54 18 96 148 102
6643 102 301 -18 -196 217 -86 18 82 -21 168 -81 54 18 -126 56 -24 233 -25 -245 -249 -123 -2 -82
6665 -82 -224 89 -51 -136 45 84 65 -31 -114 -30 -199 174 161 23 105 49 -59 -58 -43 -24 34 200 156 28 -4 -78
6691 -78 274 319 -120 -2 91 -127 135 74 -219 41 66 67 12 -103 16 -37 26 -91 -30 124 -20 60 24 32 161
6716 161 156 10 46 22 49 -187 -136 76 -116 -196 128 34 173 70 -52 87 65 -168 46 -167 -135 -98 122 43
6740 43 28 105 114 199 -147 80 -254 160 -63 -126 -63 -6 -184 -101 -261 12 83 140 -46 110 -265 44 -99 45
$$ packed form
6575a11L5R5L87k98k80J18J69j27M20m45P9j73J73R1j68j09M5J49L2j91r9L36
6597A28j65j58L0J60J26j30J20j8k36L51j45j30k53L11J6K02j11j57qJ23j51J1
6619h4m5J67o7j79J47K36j2k01PJ93j55J21j80K98j65j15J01p7J8M6l6P8N2m6
6643A02J99l19j78M13l03J04O4j03J89k49J35l6j44J82q0K57k58k20mJ26J21q0
6665h2j42L13j40q5J81L9j9r6q3Q4j69L73j3j38Q2n6j08JJ5J9N8J66m4j28l2p4
6691g8L52M5m39J18R3k18K62o1k93K60K5Jn5j15J19n3O3j17O1J54j44Q0l6QJ29
6716A61nj46L6k4K7k36N1K12j92q0L24r4J39j03j22J39k2k33K14k13L2L7K20p9
6740D3j5P7RQ5l46K27l34M14k23o3O3N7j78Q3j60K73P1N7j86J56l75L09j43J44
$$ plain form
6764 45 178 -34 67 6 -45 -153 -99 -178 95 59 -48 66 -235 56 -212 -25 -39 -296 -117 -7 -231 68
6786 68 -85 171 14 -269 -89 -221 -74 -79 150 267 -137 -79 -12 15 -43 -198 -215 10 -2 295 -93 -253 -22
6809 -22 109 156 128 -138 118 79 5 2 51 21 -39 -54 -176 249 3 -25 -316 -173 -190 -195 -234 176 -34 78 61 302
6835 302 0 57 -123 74 -36 167 213 -16 -190 30 -43 9 -289 -44 -145 22 35 -99 -289 -114 18 -87
6857 -87 -72 -191 37 -15 90 15 -34 -158 91 -103 -374 -16 -482 92 -123 738 -71 108 110 -106 -78 -501 -172
6880 -172 91 -365 -155 64 527 -301 -601 -171 -13 -126 -344 211 -16 334 -62 -87 393 32 -72 106
6900 106 -544 453 136 -154 -118 -173 268 -396 -377 -16 -101 -575 -577 -40 -221 162 192 73 350 -120 287 24
6922 24 -19 32 -225 -158 -120 264 -184 -181 -148 -109 139 78 249 -202 -171 -22 156 15 33 -156 -243 49 -51 208
$$ packed form
6764D5J33k12J01o1n1j08N4p9K73l6j07J14l01K91k68J87j4k57J79J10k24K99
6786F8j53K56j57k83J80j32J47nK29J17m04N8O7K7n8j55j7K25j2K97l88j60K31
6809b2J31M7k8k66K56l9p4lM9l0o0j5j22M25k46k8k91J43j7nl9M10k10J12j7K41
6835C02l02N7j80J97j10K03M6k29j74K20p3N2k98K45j01J67J3j34j90J75J32j05
6857h7J5j19K28n2J05p5m9j24K49j94k71L58m66N74k15Q61q09J79Kk16K8m23L29
6880a72K63m56K10K19M63q28l00M30J58j13k18N55k27L50l96k5M80l61j04J78
6900A06o50R97l17k90L6n5M41o64J9L61q5m74kN37j81L83L0j19K77m70M07k63
6922B4m3N1k57O7L8L84m48LL3L9K48o1J71m51L1J49J78j41J8j89q7K92j00K59
$$ plain form
6946 208 164 126 -58 68 198 -65 -101 57 -164 -102 181 -203 -118 159 -11 74 180 -1 167 -22 -21 132 -116
6969 -116 11 127 -117 -60 -92 52 182 30 43 -47 -32 -30 -80 348 31 29 89 -318 22 19 -66 -89 268 78 -61
6994 -61 75 24 -384 -114 42 -155 164 -143 -336 -181 -77 -190 59 -76 111 24 -29 73 46 49 167 -14
7016 -14 35 -13 91 -340 192 27 -107 -35 -52 -36 -21 -60 50 149 -17 160 -63 -50 -46 22 85 -57 -17 -59 -152 298
7042 298 -47 -101 100 89 -73 -54 212 -114 121 149 -75 -140 117 -34 10 58 370 254 -60 -157 274 -28 374
7065 374 -9 219 -193 87 -35 -8 203 3 124 -35 40 201 -98 -100 -84 -177 8 -75 -40 -102 -81 -166 182 15
7089 15 167 86 -60 -6 -142 45 -41 -90 -10 372 -26 -79 -297 -217 345 -109 37 189 111 -55 21 176 -97
7112 -97 2 -95 171 143 -142 -208 70 131 86 -41 -2 -128 -117 -65 -31 194 30 -199 -182 88 223 -33 17 49 -226
$$ packed form
6946B08m4l8j84J26J30k63l6J58k21O2K83l84Q5K77j70Q5J06j81J68j89JJ53k48
6969a16J27J16k44N7l2J44J30j52J3r0J5Kn0M28l17kO0m07L40lq5k3L57j90j39
6994f1J36n1m08K70J56j97L19l07j93J55J04j13K49j35J87q7n3J02k7LJ18j81
7016a4M9m8J04m31N32j65j34P2j7J6J5l9J10R9j66J77k23J3MO8O3j42M0m2r3M50
7042B98l45n4K01j1j62J9K66l26K35K8k24o5K57j51M4M8L12j16l14r7M31l02M02
7065C74l83K28m12K80j22K7K11k00J21j59P5J61k99kJ6r3J85q3L5o2K1q5L48j67
7089A5J52q1j46N4j36J87q6m9Q0L82l98n3k18Q0N62m54J46J52p8j66P6J55k73
7112i7R9r7K66k8k85o6K78O1m5j27L9j26J1N2L4K25j64k29J7K70J35k56N0L2k75
$$ plain form
7137 -226 187 2 11 87 -195 22 -76 -80 -103 -108 -10 -80 121 76 103 -104 72 -58 -138 -4 135 -89 147 82 -11
7162 -11 156 -68 -106 -204 -23 236 4 48 -203 130 5 -23 -97 -73 -82 215 81 116 44 -26 -84 56 -1 151 -14
7187 -14 24 -10 72 -46 69 -118 40 9 28 204 -5 185 56 12 -212 -16 -119 234 -130 82 -70 -28 215
7210 215 -86 -104 -176 26 66 -87 -115 353 148 -172 16 -25 -233 -110 -91 183 -39 72 -77 -3 -143 -41
7232 -41 123 -64 96 -121 -26 -163 -156 -121 -94 144 97 -179 -134 -202 171 -109 150 77 -72 -43 184 -167 118 76
7256 76 -17 96 -21 47 268 18 64 94 170 -74 121 52 120 23 -53 -42 124 -11 342 18 13 -201 -159 111 -84
7281 -84 146 -105 167 -34 100 35 -279 -27 78 127 -162 18 92 -253 -57 3 25 -49 -79 47 -14 65 -140
7304 -140 -112 101 279 65 193 -13 138 -67 159 232 18 -143 -122 118 11 114 104 -107 -181 34 -27 -103
$$ packed form
7137b26M13j85RP6k82K17r8mk3nR8p0K01m5K7k07J76j30q0J34J39k24K36o5r3
7162a1J67k24l8r8J81K59k32M4k51L33j25k8p4K4rK97j34L5p2p0n8J40n7J52j65
7187a4L8l4Q2j18J15j87J58l1J9J76k09J90j29m4k24J96j03L53l64K12j52M2K43
7210B15l01j8p2K02M0j53k8M68k05l20J88m1k08J23J9K74k22J11j49P4j40J02
7232d1J64j87J60k17R5j37PL5K7K38m7k76M5o8L73k80K59p3j49K9K27l51K85m2
7256G6r3J13j17O8K21k50M6L0P6k44J95o9O8r7p6J1J66j35L53l24nk14M2K70j95
7281h4K30k51K72k01J34o5l14K52J05M9k89J80P4l45J96O0K2p4l0J26o1P9k05
7304a40K8K13J78k14J28k06J51k05K26P3k14j61K1K40j07J03j0k11p4K15o1p6
$$ plain form
7326 -103 359 -166 -51 -105 -2 -305 49 -38 -116 -25 311 -204 -177 190 -92 120 95 -11 -95 37 -18 -43 9
7349 9 195 6 205 -216 173 45 -159 -105 -182 83 -257 0 207 117 300 -125 -64 -199 159 -110 184 -261
7371 -261 -258 267 -107 193 -174 -124 75 114 -123 139 118 116 151 -278 -47 -188 102 -64 -288 255 -88 17 -55
7394 -55 -14 -190 -12 262 -4 67 -45 30 23 109 -47 110 -58 -32 84 212 -159 93 -70 90 -198 117 -112
7417 -112 -113 283 -188 -179 -173 139 112 -342 -111 -17 -7 75 -106 -118 -372 5 167 79 -32 2 155 -167 -102 176 122
7442 122 -28 -15 -137 -209 236 90 146 84 218 -72 -198 74 -98 121 -81 -98 132 -46 -178 145 -119 -316
7464 -316 196 217 19 375 191 194 -122 -42 -187 -7 233 -148 -24 -117 36 -2 -252 148 -92 -29 -128 -32 55
7487 55 12 38 105 -147 41 -38 82 -1 -56 -205 -24 57 89 -52 314 -2 186 -54 -154 -82 5 -46 -42 165 -210
$$ packed form
7326a03M62n25J15n4J03l03L54q7p8R1L36n15K7L67k82K12k5j06q4J32n5k5N2
7349IJ86j89J99m21L89j28k04N4p7K65l40K57K07r0J83m25O1j35L58k69K94m45
7371b61LN25l74L00l67N0J99L9k37K62k1kL5m29K31j41K90j66k24N43l43J05p2
7394e5M1j76J78K74k66P1j12P5pQ6j56J57j68K6J16J28l71K52j63J60k88L15k29
7417a12jL96m71ROL12k7m54K31R4J0Q2j81j2k54L77J62q8j11L4J53l22O5K78n4
7442A22j50J3j22p2M45j46N6o2J34k90j26K72j72K19k02j7K30j78j32L23k64j97
7464c16N12K1j98L56j84Ll16Q0j45J80K40l81J24r3J53l8k50M00k40O3r9R6Q7
7487E5m3K6O7k52J88p9J20q3n5j49J81Q1L2j41L66l16J88k40j00P2Q7n1MK07l75
$$ plain form
7512 -210 -3 128 71 -60 -109 167 -93 49 57 -141 -75 69 1 254 -92 190 70 -49 75 339 -136 -21
7534 -21 110 86 -119 255 21 -23 -472 -8 -60 -98 -149 35 217 97 252 134 290 76 109 87 36 -63 156
7557 156 -217 90 -56 168 208 -63 47 -86 171 -158 -232 -37 -103 86 186 10 -229 -206 -125 7 -61 -144
7579 -144 5 33 -121 105 51 171 34 97 100 -96 -73 -6 92 -43 -178 -196 -5 25 -174 108 123 139 156 -243
7603 -243 5 -87 140 -12 5 -42 44 -15 331 94 188 -68 36 15 65 257 -299 177 -67 90 -13 -87 -63
7626 -63 -195 -21 36 -114 45 272 -28 -10 101 57 -15 111 85 -11 32 -279 130 -109 -8 115 92 114 74 -226
7650 -226 48 -107 -95 -63 36 77 -2 31 102 -192 -127 -152 -151 168 114 -18 -13 -19 -123 7 153 353 31 47 7 73
7676 73 -126 298 -146 69 -12 -256 -62 -132 -77 51 -274 -93 67 -103 66 12 -251 297 53 274 -2 157
$$ packed form
7512b10K07J31n7j31m9K76k60J42Qj98O6J44o8K53l46K82j20j19J24K64m75J15
7534b1J31k4k05L74k34m4m49M64n2l8n1J84J82j20J55j18J56k14L3k2n1r9K19
7557A56l73L07j46K24M0k71J10j33K57l29p4J95o6J89J00j76k39K3Q1J32o8q3
7579a44J49K8j54K26n4J20j37O3Lj96K3O7R8j35j35j8J91L0j99K82J5J6J7l99
7603b43K48r2K27j52J7m7Q6n9L46k37R4k56J04k1N0J92n56M76k44J57j03p4K4
7626f3j32J74N7j50J59K27l00J8J11m4p2J26k6r6M3l11M09k39J01J23k3K2m0l00
7650b26K74j55J2L2R9M1p9L3P1k94O5k5JL19n4j32Noj04J30J46K00l22J6m0O6
7676G3j99M24m44K15q1k44J94p0N5J28l25J81J60j70J69n4k63N48k44K21k76J59
$$ plain form
7698 157 -108 79 73 -31 -57 -106 47 -4 -2 185 -232 43 54 -8 -11 -76 79 -214 174 249 192 246 -84 190 -112
7723 -112 -136 -65 -86 187 93 5 150 35 235 -183 -35 15 113 130 -109 -138 67 9 -70 361 221 8 -181 -117
7747 -117 -207 80 -227 -30 179 34 98 18 8 48 -45 -186 190 -20 -203 -134 -129 207 -189 45 -111 -14 -163
7770 -163 76 -184 -174 -57 -71 -8 11 -200 -359 281 -109 100 -436 -193 51 125 -182 -70 -37 31 68 135 57
7793 57 -182 -131 50 -50 -154 -142 154 222 38 94 89 -63 -102 64 63 199 -4 49 279 142 -54 46 90 -95
7817 -95 -85 51 -271 165 36 55 -196 -263 268 -43 251 124 17 227 -83 -257 -72 -234 -31 300 43
7838 43 -1 -70 124 -144 256 177 146 -52 312 -255 12 119 221 90 43 35 -132 143 -103 138 -13 -71 143
7861 143 133 91 -216 -20 192 -10 221 132 -5 -54 -267 249 178 -191 -3 -34 54 47 234 59 161 15 -19
$$ packed form
7698A57k65J87oj04k6m9J53n1KJ87m17K75J1o2lo5J55k93L88P5n7N4l30K74l02
7723a12k4P1k1K73r4q8J45j15K00m18J48N0R8J7k39k9K05n8p9M31j40k13j89O4
7747a17r0K87l07J97K09j45O4q0j0M0r3j41L76k10j83O9NL36l96K34j56R7j49
7770a63K39k60J0J17j4O3J9k11j59O40l90K09n36K43K44P4l07J12L3O8L7O7p8
7793E7k39N1J81j00j04J2K96O8j84N6nj52l9J66jJ36k03N3K30j37j96J00M4j85
7817i5J0J36l22M36j29J9k51o7N31l11K94j27j07K10l10j74J85j62K03L31k57
7838D3m4o9J94k68M00p9l1j98L64n67K67J07J02j31m7qj67K75k46K41j51n8K14
7861A43j0m2l07J96K12k02K31q9j37m9k13N16p1l69J88l1Q8pJ87j75J02j46l4
$$ plain form
7884 -19 -97 -152 230 128 -54 8 -291 44 -116 226 -6 43 299 -265 28 -68 24 -54 208 153 134 41 -168 122
7908 122 224 -79 146 25 -17 117 92 -37 106 77 -591 -277 312 657 -362 -136 79 -186 -192 -462 -183
7929 -183 642 271 -360 -61 167 827 1061 -238 209 -52 256 -309 377 -307 75 9 307 134 -736 104
7949 104 616 686 163 -285 104 300 104 -104 -246 -248 -187 -116 -48 74 139 -227 117 -149 -127 -76 184 112 230
7972 230 115 161 60 -35 -74 112 92 30 84 -17 -317 230 42 -273 32 -272 67 -199 133 -178 201 -59
7994 -59 180 129 140 -18 -182 117 -94 56 191 19 -166 74 -108 -27 140 182 -130 151 -13 51 -11 -210
8016 -210 -170 -55 39 -44 -1 66 125 124 126 65 80 -316 192 70 251 -231 -3 -127 76 -43 -40 -47 19 4 -211 38
8042 38 104 102 314 -60 229 172 183 -297 218 307 0 -30 -264 -23 -105 137 -269 -164 53 47 172 -85 -15 152
$$ packed form
7884a9p8n5L82j02j82O2k99L35j60L42k32M9K56n64K93r6R2p8K62n5j9r3k09K90
7908A22J02l03K25j21m2J34k5j29J43k9o68L14N89L45j019K26K15k65ok70K79
7929a83Q25l71o31K99K28O60K34j299M47k61L08n65O86o84L82o6K98j73q70Q40
7949A04N12P0n23m48L89J96j96k08j42kO1P1O8J22O5l66L44k66K2N1K60p2J18
7972B30j15M6j01r5l9J86k0o2N4j01l00N47j88l15L05l04L39k66L32l11L79k60
7994e9K39n1J1j58j64K99k11J50J35j72j85K40j82Q1J67M2l12K81j64O4o2j99
8016b10M0J15R4q3M3O7N9jKo1J5l96N08j22J81m82K28j24K03j19LpO6j5k15K49
8042C8O6kK12l74K89n7J1m80N15Q9l07l0k34K41q2K42m06J05K17oJ25k57P0J67
$$ plain form
8066 152 -20 130 -136 71 -24 -50 -134 11 -258 30 87 232 -89 5 63 -90 156 28 -159 45 168 -38
8088 -38 -190 -223 -113 -13 244 116 -10 124 -254 -270 6 -93 -222 -347 -106 -91 -45 -36 -63 -95 15 117 235
8111 235 -138 -25 -135 34 77 26 136 103 -13 -72 148 64 146 2 25 -36 20 -30 -56 66 -71 -162 71 -79
8135 -79 -5 -192 -96 94 -191 71 -164 80 -11 -180 25 -27 63 89 -201 -1 -287 86 -75 53 53 158 -128
8158 -128 125 24 -291 -281 -60 -100 -114 46 -99 142 45 -224 -339 64 27 19 137 16 -10 113 -199 11 110
8181 110 -8 83 91 -24 232 -36 139 68 -99 52
$$ packed form
8066A52j72J50k66K07r5k6q4J45k69K88N7J45l21R4N8j53K46j28j87K04J23k06
8088c8j52l3J10J00K57j28j26J34l78j6K76r9j29j25K41J5M6Rk7l2J10J02J18
8111B35l73J13j10J69M3n1J10l3j16n9K20q4Q2j44K3o1N6n0k6J22j37r1K33j50
8135g9P4j87R6J90k85K62k35K44r1j69K05n2R0K6k90K00k86L73j61J28%J05k86
8158a28K53j01l15J0K21m0j4J60j45K41r7k69j15M03l7qJ18j21k6J23l12K10R9
8181A10j18R1Qj15K56k68J75p1j67J51
8191E2
$$ Imaginary data points
##PAGE= N=2
##DATA TABLE= (X++(I..I)), XYDATA
$$ plain form
0 0 0 0 0 0 0 0 0 0 0 0 0 8 -8 8 -16 16 -16 24 -31 34 -40 48 -59 72 -82 96 -112 130 -151 174 -198 227 -258
33 -258 291 -331 371 -418 468 -524 585 -651 723 -803 889 -984 1087 -1200 1325 -1460 1607
50 1607 -1772 1951 -2151 2372 -2620 2898 -3216 3578 -3997 4490 -5077 5792 -6689 7843 -9398
65 -9398 11614 -15055 21161 -35316 142911 -76597 -259237 2073 -156566 -226984 -41769
76 -41769 117457 164646 229926 105202 -35145 -51448 -118695 -225392 -108930 19804 95251
87 95251 188108 127851 -3546 35724 -37093 -217031 -157515 -1467 -2081 57678 182701 111512
99 111512 -17715 -2342 -70060 -178488 -84703 14821 -721 60310 134245 96469 6385 -66284
111 -66284 -92072 -82560 -66897 -21629 55593 100171 66628 35342 23542 -52068 -103852 -68777
$$ packed form
0@%%%%%%%%%%%Qj6J6k4L2l2M0n5O5p4Q8j07J31j54J78k08K42k81L25l72M25m85
33b58N49o22P02p89Q86r92J109j236J374j526J692j873K071k287K525k785L067
50A607l379L723m102M523m992N518o114O794p575Q487r567J0869j2481J4532j7241
65i398K1012k6669L6216n6477J78227k19508j82640K61310j58639p0418J85215
76d1769J59226M7189O5280j24724j40347j6303o7247j06697J16462J28734P5447
87I5251R2857o0257j31397L9270p2817j79938N9516J56048o14N9759J25023p1189
99A11512j29227J5373o7718j08428R3785R9524j5542O1031P3935l7776r0084p2669
111f6284k5788R512J5663M5268P7222M4578l3543l1286j1800p5610n1784L5075
$$ plain form
123 -68777 -44596 -141 74106 77867 51979 37356 -12858 -70416 -70308 -31443 -27598 -13820 71568
136 71568 105978 36184 -18120 -16551 -24079 -71328 -66545 24814 55275 26444 50372 56041 2382
149 2382 -38725 -51379 -47204 -24605 17261 46600 44192 42398 25180 -13982 -29965 -41681 -41935
162 -41935 -8529 13997 38729 56928 25153 -2890 -10758 -36200 -47075 -19995 7560 9617
174 9617 26784 53074 18826 -17844 -13118 -37563 -48280 -6531 11384 15429 32413 27849 5594
187 5594 -10022 -20058 -37373 -35657 -2720 12190 19653 35023 15020 -5795 -10357 -30190 -28066
200 -28066 -13152 -12131 12572 36064 19593 1314 4167 -9102 -44896 -29756 13688 1177
212 1177 -1075 32316 23726 1215 -5858 -19545 -23329 -15826 -4375 11549 22275 23718 10418
$$ packed form
123f8777K4181M4455P4247L761k5888j4623n0214n7558J08L8865L845J3778Q5388
136G1568L4410o9794n4304J569p528m7249M783R1359L0461k8831K3928N669n3659
149B382m1107j2654M175K2599M1866K9339k408j794j7218l9162j5983j1716k54
162d1935L3406K2526K4732J8199l1775k8043p868k5442j0875K7080K7555K057
174I617J7167K6290l4248l6670M726k4445j0717M1749J7915M045J6984m564k2255
187E594j5616j0036j7315J716L2937J4910P463J5370k0003k0815m562j9833K124
200b8066J4914J021K4703K3492j6471j8279K853j3269l5794J5140M3444j2511
212A177k252L3391q590k2511p073j3687l784P503J1451J5924J0726J443j3300
$$ plain form
225 10418 -1205 -4544 -17019 -16609 -8699 -5624 20891 29498 7113 10707 9007 -17917 -22870 -5976
239 -5976 2024 -14 13307 25914 10430 4440 4582 -18582 -21805 -3674 3626 9421 10998 15043
253 15043 17433 -2211 -14024 -9077 -9698 -9704 -3434 13586 21022 8410 3754 -3907 -15086 -7598 -10482
268 -10482 -12886 6615 14789 9540 4372 2935 -1141 -18791 -20293 -1622 -138 1122 9164 9442
282 9442 6697 -4462 -9843 -8974 -16826 -8874 5172 5121 8746 7745 995 -3745 -12378 -10293 -6902
297 -6902 -6940 4320 7773 7177 10079 -608 -9212 -8610 -7190 -2482 -3915 3463 16508 6048 -519
312 -519 4589 -2517 -10482 -10533 -381 9309 4120 6800 10689 2753 -388 -5273 -7488 -292 -420 3438
328 3438 10148 9162 8862 -60 -6877 -496 -3012 -5077 1926 6402 9884 4190 2411 5637 -6596
$$ packed form
225A0418j1623l339j2475M10P910L075K6515Q607k2385L594j700k6924m953J6894
239e976Q000k038J3321J2607j5484n990J42k3164l223J8131P300N795J577M045
253A5043K390j9644j1813M947o21oO270J7020P436j2612m656p661j1179P488k884
268a0482k404J9501Q174n249n168j437m076j7650j502J8671J484J260Q042K78
282I442k745j1159n381Q69p852P952J4046n1L625j001o750m740q633K085L391
297f902l8J1260L453n96K902j0687q604O02J420M708j433P378J3045j0460o567
312e19N108p106p965n1J0152R690n189K680L889p936l141m885k215P196j28L858
328C438O710r86l00q922o817O381k516k065P003M476L482n694j779L226j2233
$$ plain form
343 -6596 -9708 -192 -254 1502 5145 6504 6171 -1903 -1689 -1446 -9141 -4552 636 1205 6575 3162 1088
360 1088 106 -6217 -4587 -5328 -5995 2180 1631 873 4537 1254 -2320 -8615 -7735 830 -4372 -3929 6397
377 6397 3190 -954 -1726 -2268 -2528 -9059 -5460 2690 598 2757 2518 -594 1285 -4680 -5608 -765
393 -765 -2893 126 3123 2037 5499 752 -3660 -1939 -2724 -179 -852 879 7769 2564 390 4271
409 4271 -1395 -2939 -1497 -1133 4095 3019 3200 6003 1125 109 290 -1470 743 -1954 1867 7601
425 7601 2088 2079 2502 -643 310 -3253 -2048 4641 1514 726 3093 2896 2880 -4177 -4602 1557 -229 -447
443 -447 167 1593 5761 -1713 -5318 702 -2068 -3537 -2028 -979 4023 1290 -2893 -610 -2043 -2189
459 -2189 -3439 -4191 984 -754 -317 2721 -2759 -2085 -108 -5579 -3023 -822 -1098 1468 -234 -383
$$ packed form
343f596l112R516o2J756L643J359l33q074K14K43p695M589N188N69N370l413k074
360A088r82o323J630p41o67Q175n49p58L664l283l574o295Q80Q565n202M43J0326
377F397l207m144p72n42k60o531L599Q150k092K159k39l112J879n965r28M843
393g65k128L019K997j086L462m747m412J721p85K545o73J731O890n205k174L881
409D271n666j544J442L64N228j076J81K803m878j016J81j760K213k697L821N734
425G601n513rM23l145R53l563J205O689l127p88K367j97j6p057m25O159j786k18
443d47O14J426M168p474l605O020k770j469J509J049N002k733m183K283j433j46
459b189j250p52N175j738M37L038n480O74J977n471K556K201k76K566j702j49
$$ plain form
475 -383 -169 -1099 -916 -4894 -2773 3102 -650 481 1113 -893 3337 -1439 -6206 1883 2376 -2008 -1223
492 -1223 3217 4978 -611 -1571 1310 -1320 1574 1258 -2332 4287 4564 -18 1923 -160 652 3095
508 3095 -2099 -1645 4655 5963 -363 -3649 5808 4379 -5070 -449 2705 1228 3023 -859 174
523 174 4614 -36 -2143 -814 413 1854 172 -702 -624 2084 4175 -5029 -5394 5479 7 -5233
539 -5233 372 1548 1237 -1499 -3853 658 281 -2991 -3335 42 2822 -2953 -3012 2596 -3100 -2806 731
556 731 -3688 -884 974 -2541 -485 135 -1241 -1995 -2152 -126 -1391 -1239 612 -1336 1536 321
572 321 -4474 2536 2016 -5474 199 5271 531 -3169 -972 5190 1535 -5260 -859 4818 4122 -3313
588 -3313 -3534 8300 4104 -6134 165 3807 1641 1581 -1565 1093 4809 1973 -965 -1453 3246 3361
$$ packed form
475c83K14r30J83l978K121N875l752J131O32k006M230m776m767Q089M93m384P85
492a223M440J761n589r60K881k630K894l16l590O619K77m582J941k083Q12K443
508C095n194M54O300J308o326l286R457j429r449M621L154j477J795l882J033
523A74M440m650k107J329J227J441j682q74P8K708K091r204l65J0873n472n240
539e233N605J176l11k736k354M511l77l272l44L377K780n775n9N608n696K94L537
556G31m419K804J858l515K056O20j376p54j57K026j265J52J851j948K872j215
572C21m795P010n20p490N673N072m740l700K197O162l655o795M401N677o96p435
588c313k21J1834m196j0238O299L642k166o0l146K658L716k836k938m88M699J15
$$ plain form
604 3361 -1854 -208 1708 3528 3664 -4295 -657 7215 -877 -4966 1257 3487 1842 -2556 -1003
619 -1003 2849 1281 -1662 -3890 724 4364 -3137 -2455 2862 -865 226 -513 -5251 1442 3776 -3844
635 -3844 -5084 1739 4300 -3328 -6316 1567 2009 -2266 -4482 -2008 5229 -625 -8200 2552 3529
650 3529 -5835 -3004 2716 430 -3802 -920 2744 -1604 -2219 200 -1197 1130 -593 -2949 2713
665 2713 1661 -1849 845 -778 159 2381 -1408 -1542 2166 3550 -1124 -2951 4377 2825 -3930 1585
681 1585 2652 677 1372 -907 1921 3937 -1154 -759 1719 2226 861 -705 2126 1977 683 1799
697 1799 -1633 -149 4426 -1233 -1883 2284 1515 1355 -653 -2186 2090 2440 -1370 -3013 906 4678
713 4678 -2177 -3657 2012 909 -715 -1987 -2403 2879 374 -4086 -323 1472 -821 -2131 -1773 580
$$ packed form
604C361n215J646J916J820J36p959L638P872q092m089O223K230j645m398J553
619a003L852j568k943k228M614L640p501O82N317l727J091p39m738O693K334p620
635c844j240O823K561p628k988P883M42m275k216K474P237n854p575J0752R77
650C529r364K831N720k286m232K882L664m348o15K419j397K327j723k356N662
665B713j052l510K694j623R37K222l789j34L708J384m674j827P328j552o755N515
681A585J067j975O95k279K828K016n091L95K478N07j365j566K831j49j294J116
697A799l432J484M575n659o50M167p69j60k008j533M276L50l810j643L919L772
713D678o855j480N669j103j624j272m16N282k505m460L763J795k293j310L58K353
$$ plain form
729 580 -473 -1646 -675 -2011 1147 -249 -4649 591 925 -2786 -887 -785 139 593 -2222 -1070 88
746 88 -233 -1103 -2578 1219 782 -2119 925 75 -1141 1592 -1042 -968 1773 -262 100 1223 341 673
764 673 393 1119 201 -738 2567 379 -696 2596 186 -101 1915 -191 539 1221 -90 1670 873
781 873 790 687 416 1539 71 328 2131 -970 1040 1944 -1642 969 1987 -1133 -53 352 1485
798 1485 -60 -1170 877 481 -1243 551 -1852 -148 1466 -2587 404 533 -406 951 -924 -1213
814 -1213 323 -1432 -1131 -1038 -381 392 -2453 -444 1428 -2608 -852 75 -1124 107 -1354 -318 669
831 669 -1824 -777 4 -1650 -180 -1153 309 1000 -2100 1141 1039 -1733 -73 419 -505 484 -572
848 -572 1205 1602 -709 830 -331 543 1210 -587 815 1890 44 1046 108 858 1902 -716 603
$$ packed form
729E80j053j173R71j336L158j396m400N240L34l711J899J02R24M54k815J152J158
746H8l21q70j475L797m37k901L044q50j216K733k634P4K741k035L62J123q82L32
764F73k80P26r18r39L305k188j075L292k410k87K016k106P30O82j311J760p97
781H73q3j03k71J123j468K57J803l101K010R04l586K611J018l120J080M05J133
798A485j545j110K047l96j724J794k403J704J614m053K991J29r39J357j875k89
814a213J536j755L01R3O57P73k845K009J872m036J756R27j199J231j461J036R87
831F69k493J047P81j654J470r73J462O91l100L241j02k772J660M92r24R89j056
848e72J777L97k311J539j161Q74O67j797J402J075j846J002r38P50J044k618J319
$$ plain form
865 603 2035 230 1170 639 948 1839 -697 1249 1545 -392 871 541 1188 1290 -1171 1186 1485 -822
883 -822 704 170 103 1048 -1492 388 904 -726 266 -91 25 465 -1352 311 1496 -1409 529 -835
901 -835 -545 345 -1977 -409 843 -1270 -918 -741 -129 -145 -2314 -179 1016 -1704 -848 -982 -118 158
919 158 -2461 -511 735 -1730 -847 -539 -185 272 -1577 -137 503 -1186 374 -499 -160 1151 -987
936 -987 -35 1017 -367 492 73 200 1277 -856 513 1551 -191 776 706 991 1082 -854 1178 1966
954 1966 -795 661 1398 855 723 -379 1204 1468 -745 602 898 81 1407 -257 637 1197 -171
971 -171 812 138 -73 1338 -574 46 989 -472 214 -48 -57 544 -1310 90 651 -1492 -62 175 -837
990 -837 -491 -1149 31 749 -2149 -264 303 -1100 -404 -1647 -143 106 -1822 -414 -348 -477 100 -2302
$$ packed form
865F03J432j805R40n31L09Q91k536J946K96j937J263l30O47J02k461K357K99k307
883h22J526n34o7R45k540J880N16j630R92l57J16M40j817J663J185k905J938j364
901h35K90Q90k322J568J252k113L52J77O12j6k169K135J195k720Q56j34Q64K76
919A58k619J950J246k465Q83L08L54M57j849J440O40j689J560q73L39J311k138
936i87R52J052j384Q59m19J27J077k133J369J038j742R67p0K85R1j936K032P88
954A966k761J456P37n43j32j102J583K64k213J347K96q17J326j664Q94N60j368
971a71R83o74k11J411j912O20R43j461O86k62rO01j854J400N61k143J430K37j012
990h37L46o58J180P18k898J885N67j403O96j243J504K49j928J408O6j29N77k402
$$ plain form
1008 -2302 -290 1188 -1522 -966 230 -437 -112 -1392 -368 542 -810 -116 29 -538 839 -971 103
1025 103 791 -1118 886 704 -986 851 750 45 453 -9 500 162 643 1116 -646 1112 1815 -1052
1043 -1052 689 1267 -62 871 -117 445 1943 -4 -184 996 1161 735 -801 1068 1851 -827 515
1060 515 314 -110 1781 -1040 -1142 2383 -45 -1078 121 720 88 -831 238 197 -1342 822 82
1077 82 -1797 504 -135 -706 -160 -1622 390 494 -2086 -607 479 -669 -1336 -324 958 -2030 -1386
1094 -1386 1601 -1814 -1847 1808 -696 -1622 -17 -35 58 -1549 -850 1154 -475 -911 -11 613 -81 -1792
1112 -1792 743 1450 -2179 755 1911 -1762 290 1521 -337 -446 240 1219 332 -131 847 132 1265
1129 1265 768 -1062 1401 1543 -767 1154 408 127 2017 -51 -737 1616 1153 5 -353 1652 1165
$$ packed form
1008b302K012J478k710N56J196o67L25j280J024R10j352O94J45n67J377j810J074
1025A03O88j909K004j82j690J837j01p05M08m62N09l38M81M73j762J758P03k867
1043a052J741N78j329R33r88N62J498j947j80J180J65m26j536J869P83k678J342
1060E15k01m24J891k821j02L525k428j033J199N99o32r19J069m1j539K164p40
1077H2j879K301o39n71N46j462K012J04k580J479J086j148o67J012J282k988O44
1094a386K987l415l3L655k504r26J605j8R3j607O99K004j629m36R00O24o94j711
1112a792K535P07l629K934J156l673K052J231j858j09O86R79q87m63R78p15J133
1129A265m97j830K463J42k310J921p46k81J890k068o86K353m63j148l58K005m87
$$ plain form
1146 1165 -917 747 56 -37 2158 -1018 -1402 2916 675 -1756 -211 1457 573 -1588 -836 1424
1162 1424 176 -904 -1360 571 1501 -2226 -895 2113 -1942 -930 1398 -1469 -947 773 -545 -1303
1178 -1303 -247 510 -1525 -1285 866 -1043 -1049 470 -1384 -66 73 -2371 563 647 -1568 -13 184
1195 184 -834 -520 433 -124 -1354 1076 804 -2446 882 1635 -1774 842 752 -1285 1117 678 -892
1212 -892 646 1462 -28 -615 1231 1366 -784 770 1132 -254 1524 -544 235 3126 -717 -1875
1228 -1875 2696 1391 -1966 -127 2281 644 -1539 1171 703 -757 1528 123 -1156 1384 321
1243 321 -724 240 116 856 279 -1381 135 302 -709 -1965 708 1774 -2319 -1254 2365 -1018
1259 -1018 -1936 1200 -315 -871 459 -515 -1221 -316 -795 -75 -713 -701 -699 -374 -720 -1031 -231 519 -1656
$$ packed form
1146A165k082J664o91r3K195l176l84M318k241k431J545J668q84k161P52K260
1162A424j248j080m56J931R30l727J331L008m055J012K328k867N22J720j318p58
1178a303J056P57k035K40K151j909oJ519j854J318J39k444K934Q4k215J555J97
1195A84j018L14R53n57j230K430k72l250L328P53l409K616r0k037K402m39j570
1212h92J538Q16j490n87J846J35k150J554L62j386J778k068P79K891l843j158
1228a875M571j305l357J839K408j637k183K710m68j460K285j405j279K540j063
1243C21j045R64j24P40n77j660J516J67j011j256K673J066m093J065L619l383
1259a018r18L136j515n56J330r74p06R05m79P20o38J2KL25l46l11Q00P50k175
$$ plain form
1278 -1656 -75 1674 -1130 43 -557 -194 -607 1592 -249 -818 173 808 -2305 686 1137 -1295 405
1295 405 169 204 231 -390 -1812 1879 268 124 627 299 306 68 854 315 -109 1687 -27 -326 2929
1314 2929 666 -1194 1264 930 -553 259 569 1275 132 229 919 -522 782 -205 359 1305 -32
1331 -32 17 617 -658 295 1088 -459 332 1097 -41 -124 -266 790 -1148 -798 1580 -1376 -673 656
1349 656 -1681 -331 -156 -1032 -639 -1167 -734 11 -938 -417 -746 -1358 -483 -1097 -663 -13 -1565 419 -242
1368 -242 -1240 1148 -420 -1553 -17 273 26 -38 -645 1316 -1194 -893 1444 -540 -667 -504 -178 1481
1386 1481 -421 -102 951 -107 -101 491 -290 532 709 502 443 -453 1265 640 -709 1409 745 -506
1404 -506 744 621 854 34 -118 1459 0 -494 1207 524 244 21 178 1057 -82 7 881 -660
$$ packed form
1278a656J581J749k804J173o00L63m13K199j841n69R91O35l113K991M51k432J700
1295D05k36L5K7o21j422L691j611j44N03l28Pk38P86n39m24J796j714k99L255
1314B929k263j860K458l34j483Q12L10P06j143R7O90j441J304r87N64R46j337
1331c2M9O00j275R53P93j547P91P65j138q3j42J056j938L50K378k956P03J329
1349F56k337J350J75q76L93n28M33P45r49N21l29o12Q75o14M34O50j552J984o61
1368b42r98K388j568j133J536K90k47o4o07J961k510L01K337j984j27J63L26J659
1386A481j902L19J053j058ON92p81Q22J77k07n9q96J718o25j349K118o64j251
1404e06J250j23K33q20j52J577j459m94J701o83k80k23J57Q79j139Q9Q74j541
$$ plain form
1422 -660 176 675 -411 352 78 -50 96 -672 540 -104 -1082 564 104 -600 -113 -249 18 -777 -1008
1441 -1008 637 -512 -975 375 -433 -584 -301 -491 300 -837 -793 197 -702 -165 -334 -760 254 -274
1459 -274 -725 394 -493 -255 -170 -634 498 -88 -704 327 16 -18 -207 -308 803 -498 -705 965 -266
1478 -266 -152 144 -267 749 250 -13 874 152 477 168 -263 1192 392 -302 619 657 609 64 -205 1098
1498 1098 324 -310 731 373 252 339 -311 963 -199 -490 910 -359 182 419 -391 380 13 -498
1516 -498 552 46 -142 16 -517 711 -279 -720 433 -276 -321 -378 -803 524 -579 -1343 36 -275 -633
1535 -633 -673 -597 235 -667 -576 416 -774 -424 332 -1016 189 -226 -783 86 -576 -434 -53 -369 60 -234
1555 -234 -632 233 -362 270 -358 -860 799 243 -950 866 310 -400 500 65 394 -14 -247 906 543
$$ packed form
1422f60Q36M99j086P63k74j28J46p68J212o44r78J646m60p04M87j36K67p95k31
1441a008J645j149m63J350q08j51K83j90P91j137M4R90q99N37j69m26J014n28
1459b74m51J119q87K38Q5m64J132n86o16J031l11l4j89j01J111j301k07J670j231
1478b66J14K96m11J016m99k63Q87p22L25l09m31J455q00o94R21L8m8n45k69J303
1498A098p74o34J041l58j21Q7o50J274j162k91J400j269N41K37q10P71l67n11
1516d98J050n06j88J58n33J228r90m41J153p09m5n7m25J327j103p64J379l11l58
1535f33m0P6Q32r02R1R92j190L50P56j348J205m15n57Q69o62J42L81l16M29k94
1555b34l98Q65n95O32o28n02J659n56j193J816n56p10R00m35L29m08k33J153l63
$$ plain form
1574 543 171 162 98 940 45 -245 1311 50 -101 1080 22 442 959 15 301 327 370 323 146 817 12
1595 12 -285 989 -122 -20 759 -238 216 710 -632 386 636 -508 -320 239 36 -922 -319 513 -237
1614 -237 -188 427 -997 520 -428 -575 106 -413 -950 -573 -200 97 -207 -511 107 -679 147 -268 -1197 640
1634 640 -190 -1608 357 158 -819 -151 244 -309 -316 113 54 -171 -50 23 -522 527 -333 -509 955 -191
1654 -191 -773 1056 -320 340 882 78 -3 -176 827 661 -640 923 187 -241 1103 182 390 1257
1672 1257 -329 145 1180 -367 24 918 406 -174 679 608 -12 -136 1052 -77 -172 790 -583 137
1690 137 874 -499 247 642 -583 121 287 -492 -631 50 503 -832 -177 804 -1054 -23 589 -858
1708 -858 118 -111 -831 -343 -31 -660 -58 -497 -600 -548 107 -341 -1264 233 -222 -2196 1459 886 -1008
$$ packed form
1574E43l72ro4Q42q95k90J556j261j51J181j058M20N17r44K86K6M3m7j77O71q05
1595A2k97J274j111J02P79r97M54M94j342J018K50j144J88N59k03r58O03Q32p50
1614b37M9O15j424J517r48j47O81n19n37L77L73K97l04l04O18p86Q26m15r29J837
1634F40q30j418J965j99r77O68L95n53pM29n9k25J21P3n45J049q60j76J464j146
1654a91n82J829j376O60N42q04q1j73J003j66j301J563p36m28J344r21K08Q67
1672A257j586M74J035j547L91Q94n12n80Q53p1o20j24J188j129r5R62j373P20
1690A37P37j373P46L95j225P04J66p79j39O81M53j335O55R81j858J031O12j447
1708h58R76k29p20M88L12o29O02m39j03N2O55m48r23J497m55j974L655n73j894
$$ plain form
1727 -1008 263 -603 -301 29 -583 -33 189 -152 -227 -378 596 -302 -825 761 18 -605 359 -406 0
1746 0 718 -317 -326 670 239 99 -107 752 332 146 897 155 -138 863 -182 474 833 -352 132 908
1766 908 -16 226 107 436 387 316 652 -92 416 780 -709 319 815 -684 307 622 -193 1 -146 50
1786 50 -197 -351 194 85 -133 151 -582 382 -290 -1095 540 298 -1034 -20 -38 -386 -694 -179 -323 -386
1806 -386 -270 -496 -731 107 140 -969 308 208 -652 -11 -342 -42 311 -448 -199 302 -105 -305 -224 443
1826 443 -126 -828 362 190 -189 291 -464 -119 645 -314 -28 556 -102 -86 45 553 -1 -146 684 287
1846 287 -101 538 -196 334 565 -151 540 458 -126 551 495 280 412 -32 694 84 -1 558 -87 164 422
1867 422 -235 443 511 -101 54 51 170 316 -435 -122 238 -504 101 -319 123 56 -705 -91 -26 -764 -197 -392
$$ packed form
1727a008J271q66L02L30o12N50K22l41p5j51R74q98n23J586p43o23R64p65M06
1746@P18j035rR96m31j40k06Q59m20j86P51p42k93J001j045O56L59j185M84P76
1766I08r24K42j19L29m9p1L36p44N08L64j489J028M96j499R91L15q15J94j47J96
1786E0k47j54N45j09k18K84p33R64o72q05J635k42j332J014j8l48l08N15j44o3
1806c86J16k26k35Q38L3j109J277j00q60O41l31L00L53p59K49N01m07k00Q1O67
1826D43n69p02J190j72l79M80p55L45P64r59K86N84o58J6J31N08n54j45Q30l97
1846B87l88O39p34N30K31p16O91q2n84O77n6k15J32m44P26o10q5N59o45K51K58
1867D22o57O78O8o12J55lJ19J46p51L13L60p42O05m20M42o7p61O14O5p38N67j95
$$ plain form
1889 -392 -470 278 -631 -335 -118 -248 -433 -267 -72 -57 -731 80 -32 -454 67 -145 -209 211 -510 -271 304
1910 304 -610 -444 -124 120 -94 -272 363 -76 -623 150 -82 -321 390 -139 197 235 -326 548 149 -216
1930 -216 592 -194 311 334 157 546 -44 145 595 -448 203 575 -175 -29 136 173 372 -323 272 475
1950 475 -121 121 165 214 148 -418 47 560 -163 185 -51 -18 152 -215 -52 253 -403 38 -324 84 448
1971 448 -828 134 175 -614 -112 -129 -353 152 -578 -263 148 -610 2 -395 -388 -192 -520 180 -17 -522 220
1992 220 -2 -762 107 -634 -419 121 -246 -109 -227 -332 215 -344 49 226 -267 155 -141 52 155 -84
2012 -84 161 651 -182 320 -99 127 643 -139 -43 314 -3 237 65 125 407 -128 324 427 95 156 192 103
2034 103 423 -219 404 320 -314 392 71 92 639 -130 157 415 -117 573 105 -275 436 4 -72 313 -267
$$ packed form
1889c92p8P48r09K96K17j30j85J66J95J5o74Q11j12m22N21k12o4M20p21K39N75
1910C04r14J66L20K44k14j78O35m39n47P73k32k39P11n29L36L8n61Q74l99l65
1930b16Q08p86N05K3j77L89n90J89M50j043O51L72p50J46J65L7J99o95N95K03
1950D75n96K42M4M9o6n66M65N13p23L48k36L3J70l67J63L05o56M41l62M08L64
1971D48j276R62M1p89N02j7k24N05p30L15M11p58O12l97PJ96l28P00j97n05P42
1992B20k22p60Q69p41K15N40l67J37j18j05N47n59L93J77m93M22k96J93J03k39
2012h4K45M90q33N02m19K26N16p82R6L57l17K40j72O0K82n35M52J03l32O1L6q9
2034A03L20o42O23q4o34P06l21K1N47p69K87K58n32O90m68l80P11m32p6L85n80
$$ plain form
2055 -267 512 -34 -91 306 -592 -231 333 -353 -138 -232 -279 145 -552 -79 312 -640 -487 -53 -120 174 -648
2076 -648 -154 150 -559 89 -165 -371 161 -477 -6 226 -344 -191 -83 -69 190 -218 -416 269 -265 -110
2096 -110 96 173 358 -305 -139 438 -307 -42 77 234 406 -335 120 429 -56 -44 703 331 637 594 181
2117 181 220 61 456 200 -128 783 31 547 936 334 -634 -175 282 776 -178 -151 656 111 -71 334 158
2138 158 16 -447 -56 -36 -305 -116 162 -12 -25 -337 -67 332 -427 -190 -261 14 61 -435 -72 157 -485
2159 -485 -137 214 -343 -119 -331 -261 105 -284 -333 -346 -461 -197 -39 -49 49 -661 -53 -124 -236 240 -291 -188
2181 -188 466 -303 -611 35 -222 86 -234 149 123 -406 172 154 219 324 0 159 524 -335 27 329 -96
2202 -96 -77 -30 31 563 -122 127 227 122 242 -215 37 487 14 355 440 -119 -6 232 312 322 43 103 274
$$ packed form
2055b67P79n46n7L97q98L61N64o86K15r4m7M24o97M73L91r52J53M34o7K94q22
2076f48M94L04p09O48k54k06N32o38M71K32n70J53J08J4K59m08j98O85n34J55
2096a10K06P7J85o63J66N77p45K65J19J57J72p41M55L09m85J2P47l72L06m3m13
2117A81L9j59L95k56l28R11p52N16L89o02r68M59M57M94r54K7Q07n45j82M05j76
2138A58j42m63L91K0k69J89K78j74j3l12K70L99p59K37p1K75M7m96L63K29o42
2159d85L48L51n57K24k12P0L66l89m9j3j15K64J58j0R8p10O08p1j12M76n31J03
2181a88O54p69l08O46k57L08l20L83k6n29N78j8O5J05l24J59L65q59L62L02m25
2202i6J9M7O1N32o85K49J00j05J20m57K52M50m73L41Q5n59J13K38Q0J0k79O0J71
$$ plain form
2225 274 92 20 -122 101 425 -692 -54 254 -129 209 -242 -316 47 -234 -1 -271 -47 -11 -49 -74 35
2246 35 -366 -53 -10 -463 -69 -288 -394 138 -223 -763 -88 -283 -169 -442 -90 -93 -410 -68 -182 -494 298
2267 298 4 65 343 -364 -139 421 -381 -75 117 -173 178 -184 -1 -84 59 523 -296 32 736 -147 133
2288 133 41 -103 361 105 -220 350 100 27 93 76 79 -216 -58 664 -520 -1 546 10 169 400 -234 181
2310 181 349 -3 338 34 634 98 -79 538 -157 -71 72 -304 262 36 -245 441 124 -278 130 -117
2330 -117 -13 -239 4 73 -234 -96 8 -264 105 5 -748 291 -120 -328 42 -264 -295 -180 -128 84 -229
2351 -229 -322 -139 -210 387 -423 -518 403 -429 -281 223 18 -52 385 -216 161 257 10 69 -221 254 -7 -63
2373 -63 736 -118 -154 666 -145 64 120 -18 431 149 9 325 248 336 -233 302 557 1 -43 515 -263 306
$$ packed form
2225B74j82p2j42K23L24j117O38L08l83L38m51p4L63k81K33k70K24L6l8k5J09
2246C5m01L13M3m53L94k19j06N32l61n40O75j95J14k73L52ll17L42j14l12P92
2267B98k94O1K78p07K25N60q02L06J92k90L51l62J83q3J43M64q19L28P04q83K80
2288A33r2j44M64k56l25N70k50p3O6j7Lk95J58P22j184N19N47n36J59K31o34M15
2310A81J68l52L41l04O00n36j77O17o95Q6J43l76N66k26k81O86l17m02M08k47
2330a17J04k26K43O9l07J38J04k72L69j00p53J039m11k08L70l06l1J15N2K12l13
2351b29r3J83p1N97q10r5R21q32J48N04k05p0M37o01L77R6k47N9k90M75k61n6
2373f3P99q54l6Q20q11K09N6j38M49k82j40L16p7Q8n69N35K55n56m4N58p78N69
$$ plain form
2395 306 380 -449 534 141 -36 -27 9 143 61 -42 339 37 -404 291 -155 238 -165 -161 376 -220 -426 266
2417 266 -269 -29 -257 -143 164 -394 -124 137 -473 -75 -234 -174 71 -184 -385 135 -280 -117 -35 -509 -95
2438 -95 -132 -69 26 -220 -455 38 -202 336 -173 -331 447 -98 -252 -147 164 -153 -132 -80 -24 25 -264 311 103
2461 103 200 38 -219 337 -102 279 32 -293 553 269 153 86 225 337 -105 -47 381 12 -63 388 -124
2482 -124 331 177 141 307 201 -70 415 -155 -209 253 -98 289 -93 203 360 -155 135 109 -199 242 34
2503 34 14 70 -301 283 24 -23 490 -132 -21 96 -331 66 -70 -320 66 -258 -272 148 -338 -210 40 -409
2525 -409 137 -353 -251 -114 -64 324 -61 -371 180 120 -478 73 -88 -81 357 -163 195 -60 15 104 -79 52
2547 52 282 -164 112 26 95 316 158 5 384 -182 512 -138 -10 533 -17 221 176 214 335 68 -261 257
$$ packed form
2395C06P4q29R83l93j77RL6J34q2j03L81l02m41O95m46L93m03MN37n96k06O92
2417B66n35K40k28J14L07n58K70K61o10L98j59O0K45k55k01N20m15J63Q2m74M14
2438i5l7O3R5k46k35M93k40N38n09j58P78n45j54J05L11l17K1N2N6M9k89N75k08
2461A03R7j62k57N56m39L81k47l25Q46k84j16o7J39J12m42N8M28l69p5M51n12
2482a24M55j54l6J66j06k71M85n70n4M62l51L87l82K96J57n15K90k6l08M41k08
2503C4k0N6l71N84k59m7N13o22J11J17m27L97j36k50L86l24j4M20m86J28K50m49
2525d09N46m90J02J37N0L88l85l10N51o0n98N51j61PM38n20L58k55P5Q9j83J31
2547E2K30m46K76q6O9K21j58j53L79n66O94o50J28N43n50K38m5L8J21k67l29N18
$$ plain form
2569 257 -346 -16 253 -11 408 102 32 321 -128 -65 154 -3 276 -14 -166 165 -486 224 258 -336 179
2590 179 312 -116 134 76 211 156 -186 193 -103 -331 221 99 -80 98 -128 190 -211 -231 106 -468 -63
2611 -63 -177 -428 113 -178 -394 -125 -196 -51 -169 -240 -86 100 -424 275 166 193 65 -274 233 9 -199
2632 -199 0 165 -222 37 -279 246 141 50 111 -77 259 265 -169 53 -17 -378 258 86 55 60 146 162 -33
2655 -33 -104 68 114 -174 -239 -140 521 432 -31 455 -174 -44 336 30 187 358 -200 349 -87 70 10 -92
2677 -92 119 0 -312 -39 135 -357 37 -204 201 38 -230 73 70 -349 -235 -217 100 -191 -136 50 -404 -293
2699 -293 17 -587 101 241 -325 -15 39 -260 89 -226 -130 -247 -388 -128 -28 185 -188 48 326 -140 -244
2720 -244 51 55 -215 139 59 -12 -207 -341 229 43 11 196 -344 324 106 -119 206 181 -42 291 -90 213
$$ packed form
2569B57o03L30K69k64M19l06p0K89m49O3K19j57K79k90j52L31o51P10L4n94N15
2590A79J33m28K50n8J35n5l42L79k96k28N52j22j79J78k26L18m01k0L37n74M05
2611f3j14k51N41k91k16K69p1J45j18p1J54J86n24O99j09K7j28l39N07k24k08
2632a99J99J65l87K59l16N25j05r1O1j88L36Om34K22p0l61O36j72l1NQ6J6j95
2655c3p1J72M6k88o5R9O61q9m63M86o29J30L80l06J57J71n58N49m36J57o0j02
2677i2K11j19l12K73J74m92L94k41M05j63k68L03lm19J14J8L17k91N5J86m54J11
2699b93L10o04O88J40n66L10N4k99L49l15R6j17j41K60J00K13l73K36K78m66j04
2720b44K95Mk70L54q0p1j95j34N70j86l2J85n40O68k18k25L25k5k23L33l81L03
$$ plain form
2742 213 560 -254 -193 63 222 18 -82 586 359 -107 251 -104 -122 357 -101 -170 303 6 27 322 -352
2763 -352 65 -306 357 -231 -188 458 -153 -269 288 -315 -37 181 -155 -201 130 -70 -56 7 54 -106 -217 7
2785 7 -232 -149 224 -376 -342 -175 -229 219 239 -278 -119 -222 11 -98 -192 150 40 -20 114 -322 41 114 -517
2808 -517 19 128 -120 90 259 -13 80 -135 36 -65 64 276 -138 201 322 -300 164 441 -26 121
2828 121 62 -13 139 151 167 35 118 254 -63 365 167 -314 281 -145 -127 163 108 -51 583 29 -28 14 150
2851 150 -75 300 43 204 -367 220 -224 -415 419 -188 -47 296 -487 -142 351 -255 -390 -59 53 -199
2871 -199 -194 -112 -224 53 -152 -201 -95 141 -393 -101 430 -336 -38 -7 -91 -264 -67 -75 -297 40 -21 -211 37
2894 37 108 -217 146 258 -373 -51 16 141 241 -6 -212 413 -230 291 -220 185 -40 -222 102 189 -138
$$ packed form
2742B13L47q14O1K56J59k04j00O68k27m66L58l55j8M79m58o9M73k97K1K95o74
2763c52M17l71O63n88M3O46o11j16N57o03K78K18l36m6L31k00J4O3M7j60j11K24
2785Gk39Q3L73o00L4J67n4M48K0n17J59j03K33j09r4L42j10o0J34m36L63P3o31
2808e17N36J09k48K10J69k72R3k15J71j01J29K12m14L39J21o22M64K77m67J47
2828A21n9p5J52J2J6j32Q3J36l17M28j98m81N95m26J8K90n5j59O34n54n7M2J36
2851A50k25L75k57J61n71N87m44j91Q34o07J41L43p83L45M93o06j35L31J12k52
2871a99NQ2j12K77k05m9J06K36n34K92N31p66K98L1q4j73J97qk22L37o1j90K48
2894C7P1l25L63J12o31L22O7J25J00k47k06O25o43N21n11M05k25j82L24Q7l27
$$ plain form
2915 -138 152 84 -346 183 -312 6 246 65 221 -185 360 264 -347 380 116 -233 176 216 46 113 45 -191
2937 -191 207 218 180 -119 165 193 -372 325 -146 -65 146 130 -145 148 -197 -138 105 -462 -61 -148 -168 -2 4
2960 4 108 -270 -59 203 -286 -78 -80 -350 127 -48 -319 -288 -151 -195 -109 -230 -118 -167 -98 -411 -238 14 -38
2983 -38 -321 99 -140 -393 230 -99 -63 169 41 -10 -58 -330 160 50 -174 1 -219 139 -22 -192 68
3004 68 -27 37 146 -59 39 78 82 -12 237 324 49 165 191 372 -72 -113 -37 -129 164 -198 356 460 -45 -5 41
3029 41 98 -34 32 109 87 -72 -25 88 -194 118 -182 -148 163 -81 203 -143 10 92 -85 38 45 -174 103
3052 103 -40 -233 -44 -137 21 123 -315 -94 52 59 -56 -114 -100 133 -250 -205 101 -226 -24 -96 1 24 -109
3075 -109 26 -3 -124 114 -277 40 237 102 125 -61 -94 -9 -40 62 118 85 227 67 121 496 -65 -94 330
$$ packed form
2915a38K90o8m30N29m95L18K40j81J56m06N45r6o11P27k64l49M09M0j70O7o8k36
2937a91L98J1l8k99K84K8n65O97m71Q1K11j6k75K93l45N9K43n67M01q7k0J66O
2960DJ04l78K11K62m89K08kk70M77j75k71L1J37m4Q6j21J12m9O9l13J73K52n2
2983c8k83M20k39k53O23l29L6K32j28n1m8k72M90j10k24J75k20L58j61j70K60
3004F8r5O4J09k05R8L9Mr4K49Q7k75J16K6J81m44m1P6r2K93l62N54J04n05M0M6
3029D1N7j32O6P7k2j59M7J13k82L12l00L4L11k44K84l46J53Q2j77J23Pk19K77
3052A03j43j93J89r3J58J02m38K21J46Pj15n8J4K33l83M5L06l27K02p2R7K3j33
3075a09J35k9j21K38l91L17J97j35K3j86l3Q5l1J02N6l3J42j60N4L75n61k9M24
$$ plain form
3098 330 83 20 50 204 282 -101 -217 303 -227 -32 156 -114 55 45 163 138 -200 -12 71 101 207 -47
3120 -47 129 -146 -25 409 -213 -33 293 -152 -162 1 -317 39 125 -93 96 -39 116 123 -221 69 -96 -151
3142 -151 -37 153 -220 9 -177 -80 -24 -269 319 -148 33 -91 -345 36 -69 -151 12 -68 -26 1 -160 5
3164 5 109 -101 11 50 22 197 30 -21 32 31 16 -66 -141 372 -151 -55 49 -21 120 -152 -185 180 -64 168 -75
3189 -75 -139 138 -285 238 376 -143 108 43 98 307 157 36 401 56 321 237 227 286 -59 -137 -63 -119 68
3212 68 15 41 40 -154 -2 401 -39 -29 67 -116 115 101 -199 -39 -188 -146 -18 -108 140 -177 -53 226 -196
3235 -196 -39 48 -38 -13 -360 -158 319 -60 -110 -161 -86 3 -81 145 71 -359 -366 -170 -143 84 -123 -156 105 113 -272
3260 -272 82 -188 1 -114 -30 -45 -136 126 -72 -197 251 6 -50 354 -38 199 122 45 68 303 -19 49 38
$$ packed form
3098C30k47o3L0J54P8l83j16N20n30J95J88k70J69j0J18k5l38J88Q3L0J06k54
3120d7J76k75J21M34o22J80L26m45j0J63l18L56Q6k18J89j35J55Pl44K90j65n5
3142a51J14J90l73K29j86R7N6k45N88m67J81j24k54L81j05q2J63q0M2K7j61J65
3164EJ04k10J12L9k8J75j67n1N3jj5q2p5N13n23R6J04p0J41k72l3L65k44K32k43
3189g5o4K77m23N23J38n19K51o5N5K09j50j21L65l45K65q4j0N9l45p8P4n6J87
3212F8n3K6jj94J52M03m40J0R6j83K31j4l00J60j49M2J28r0K48l17J24K79m22
3235a96J57Q7q6K5l47K02M77l79n0n1P5Q9q4K26p4m30pJ96K7K27k07l3K61Ql85
3260b72L54k70J89j15Q4j5r1K62j98j25M48k45n6M04l92K37p7p7K3K35l22O8j1
$$ plain form
3283 38 72 186 46 92 230 -1 257 -77 -204 328 266 81 -120 133 287 -76 412 269 -104 26 31 -157
3305 -157 11 -239 33 363 -266 65 -280 81 81 -206 -404 -10 -239 -161 -463 -52 -88 -227 -217 -63 -269 -80
3327 -80 -8 -208 39 -337 -52 115 -10 40 -90 -19 -179 -169 -252 -101 9 -257 -247 -126 -213 -16 -74 -6 64 40
$$ packed form
3283C8L4J14j40M6J38k31K58l34j27N32o2j85k01K53J54l63M88j43l73J30Nj88
3305a57J68k50K72L30o29L31l45L61%k87j98L94k29P8l02M11l6j39J0J54k06J89
3327h0P2k00K47l76K85J67j25N0j30P1j60J0q3J51J10k66J0J21q7J97n8O8P0k4
$$ [...]
8191A41
##END NTUPLES=NMR FID
##END=
