##TITLE=1H_Pr Reac
 CDCl3
 8 sc, 
 17.03.2022
##JCAMPDX= 6.0         $$ Bruker NMR JCAMP-DX V2.0
##DATA TYPE= NMR FID
##DATA CLASS= NTUPLES
##ORIGIN= UXNMR, Bruker Analytische Messtechnik GmbH
##OWNER= root
$$ XWIN-NMR		Version 3.5
$$ Thu Mar 17 13:51:52 2022 Russian Standard Time (UT+4h)  she@DPX200
##.OBSERVE FREQUENCY= 200.131346
##.OBSERVE NUCLEUS= ^1H
##.DELAY= (6, 6)
##.ACQUISITION MODE= SIMULTANEOUS
##.ACQUISITION SCHEME= undefined
##.AVERAGES= 8
##.DIGITISER RES= 18
##SPECTROMETER/DATA SYSTEM= spect
##.PULSE SEQUENCE= zg30
##.SOLVENT NAME= D2O
##.SHIFT REFERENCE= (INTERNAL, D2O, 0, 15.7039)
##AUDIT TRAIL= $$ (NUMBER, WHEN, WHO, WHERE, WHAT)
$$ ##TITLE= Audit trail, XWIN-NMR		Version 3.5
$$ ##JCAMPDX= 5.01
$$ ##ORIGIN= Bruker BioSpin GmbH
$$ ##OWNER= she
$$ F:/spectra/data/she/nmr/H-F/1/audita.txt
$$ ##AUDIT TRAIL=  $$ (NUMBER, WHEN, WHO, WHERE, WHAT)
(   1,<2022-03-17 13:50:44.54 +0400>,<she>,<DPX200>,
      <created by zg, POWCHK disabled, PULCHK disabled
       configuration hash MD5:
       00 E9 B6 7A A2 85 ED C7 34 08 36 98 17 FE 4E 26
       data hash MD5: 16K
       82 64 9C 99 5C E4 11 BA 38 FE A4 27 28 41 7C 25>)
$$ ##END=
$$ 
$$ hash MD5
$$ C2 28 20 0D 51 69 17 92 F9 B3 AD 23 3C FC D3 B2
##$RELAX= 
##$RELAX= 
##$RELAX= 
##$RELAX= 
##$RELAX= 
##$RELAX= 
$$ Bruker specific parameters
$$ --------------------------
##$DU= <F:/spectra>
##$EXPNO= 1
##$NAME= <H-F>
##$PROCNO= 1
##$TYPE= <nmr>
##$USER= <she>
##$AMP= (0..31)
100 100 100 100 100 100 100 100 100 100 100 100 100 100 100 100 100 100 
100 100 100 100 100 100 100 100 100 100 100 100 100 100 
##$AQSEQ= 0
##$AQ_mod= 1
##$AUNM= <au_zg>
##$AUTOPOS= <>
##$BF1= 200.13
##$BF2= 200.13
##$BF3= 200.13
##$BF4= 200.13
##$BF5= 200.13
##$BF6= 200.13
##$BF7= 200.13
##$BF8= 200.13
##$BYTORDA= 1
##$CFDGTYP= 0
##$CFRGTYP= 5
##$CHEMSTR= <none>
##$CNST= (0..31)
1 1 145 1 1 1 1 1 1 1 1 1 1 1 1 1 1 1 1 1 1 1 1 1 1 1 1 1 1 1 1 1 
##$CPDPRG= <>
##$CPDPRG1= <>
##$CPDPRG2= <>
##$CPDPRG3= <>
##$CPDPRG4= <mlev>
##$CPDPRG5= <mlev>
##$CPDPRG6= <mlev>
##$CPDPRG7= <mlev>
##$CPDPRG8= <mlev>
##$CPDPRGB= <>
##$CPDPRGT= <>
##$D= (0..31)
0 1.2 0 0 0 0 0 0 0 0.06 0 0.03 0 0 0 0 0.0002 0 0 0 0 0 0 0 0 0 0 0 0 
0 0 0 
##$DATE= 1647510643
##$DBL= (0..7)
120 120 120 120 120 120 120 120 
##$DBP= (0..7)
150 150 150 150 150 150 150 150 
##$DBP07= 0
##$DBPNAM0= <>
##$DBPNAM1= <>
##$DBPNAM2= <>
##$DBPNAM3= <>
##$DBPNAM4= <>
##$DBPNAM5= <>
##$DBPNAM6= <>
##$DBPNAM7= <>
##$DBPOAL= (0..7)
0.5 0.5 0.5 0.5 0.5 0.5 0.5 0.5 
##$DBPOFFS= (0..7)
0 0 0 0 0 0 0 0 
##$DE= 6
##$DECBNUC= <off>
##$DECIM= 32
##$DECNUC= <off>
##$DECSTAT= 4
##$DIGMOD= 1
##$DIGTYP= 9
##$DL= (0..7)
0 120 120 120 120 120 120 120 
##$DP= (0..7)
150 150 150 150 150 150 150 150 
##$DP07= 0
##$DPNAME0= <>
##$DPNAME1= <>
##$DPNAME2= <>
##$DPNAME3= <>
##$DPNAME4= <>
##$DPNAME5= <>
##$DPNAME6= <>
##$DPNAME7= <>
##$DPOAL= (0..7)
0.5 0.5 0.5 0.5 0.5 0.5 0.5 0.5 
##$DPOFFS= (0..7)
0 0 0 0 0 0 0 0 
##$DQDMODE= 0
##$DR= 18
##$DS= 0
##$DSLIST= <SSSSSSSSSSSSSSS>
$$ [...]
##$SUBNAM2= <"">
##$SUBNAM3= <"">
##$SUBNAM4= <"">
##$SUBNAM5= <"">
##$SUBNAM6= <"">
##$SUBNAM7= <"">
##$SUBNAM8= <"">
##$SUBNAM9= <"">
##$SW= 18.0517287032376
##$SWIBOX= (0..15)
0 0 2 0 0 0 0 0 0 0 0 0 0 0 0 0 
##$SW_h= 3612.71676300578
##$TD= 16384
##$TD0= 1
##$TE= 0
##$TE2= 300
##$TE3= 300
##$TEG= 300
##$TL= (0..7)
0 120 120 120 120 120 120 120 
##$TP= (0..7)
150 150 150 150 150 150 150 150 
##$TP07= 0
##$TPNAME0= <>
##$TPNAME1= <>
##$TPNAME2= <>
##$TPNAME3= <>
##$TPNAME4= <>
##$TPNAME5= <>
##$TPNAME6= <>
##$TPNAME7= <>
##$TPOAL= (0..7)
0.5 0.5 0.5 0.5 0.5 0.5 0.5 0.5 
##$TPOFFS= (0..7)
0 0 0 0 0 0 0 0 
##$TUNHIN= 0
##$TUNHOUT= 0
##$TUNXOUT= 0
##$USERA1= <user>
##$USERA2= <user>
##$USERA3= <user>
##$USERA4= <user>
##$USERA5= <user>
##$V9= 5
##$VALIST= <valist>
##$VCLIST= <CCCCCCCCCCCCCCC>
##$VD= 0
##$VDLIST= <DDDDDDDDDDDDDDD>
##$VPLIST= <PPPPPPPPPPPPPPP>
##$VTLIST= <TTTTTTTTTTTTTTT>
##$WBST= 1024
##$WBSW= 4
##$XGAIN= (0..3)
0 0 0 0 
##$XL= 0
##$YL= 0
##$YMAX_a= 797743
##$YMIN_a= -1111738
##$ZGOPTNS= <>
##$ZL1= 120
##$ZL2= 120
##$ZL3= 120
##$ZL4= 120
##$ABSF1= 10
##$ABSF2= 0
##$ABSG= 5
##$ABSL= 3
##$ALPHA= 0
##$AQORDER= 0
##$ASSFAC= 0
##$ASSFACI= 0
##$ASSFACX= 0
##$ASSWID= 0
##$AUNMP= <proc_1d>
##$AZFE= 0.1
##$AZFW= 0.1
##$BCFW= 1
##$BC_mod= 2
##$BYTORDP= 1
##$COROFFS= 0
##$CY= 11.3945322036743
##$DATMOD= 1
##$DC= 2
##$DFILT= <>
##$DTYPP= 0
##$F1P= 2.36226072786647
##$F2P= -0.459571619588291
##$FCOR= 0.5
##$FTSIZE= 0
##$FT_mod= 4
##$GAMMA= 1
##$GB= 0.15
##$INTBC= 1
##$INTSCL= 1
##$ISEN= 128
##$LB= 0.24
##$LEV0= 0
##$LPBIN= 0
##$MAXI= 10000
##$MC2= 0
##$MEAN= 0
##$ME_mod= 0
##$MI= 1.114404
##$NCOEF= 0
##$NC_proc= 0
##$NLEV= 6
##$NOISF1= 3.799351
##$NOISF2= 2.8
##$NSP= 1
##$NTH_PI= 0
##$NZP= 0
##$OFFSET= 15.70392
##$PC= 1
##$PHC0= -17308.71
##$PHC1= 11.60078
##$PH_mod= 1
##$PKNL= yes
##$PPARMOD= 0
##$PSCAL= 0
##$PSIGN= 0
##$REVERSE= no
##$SF= 200.130013532006
##$SI= 16384
##$SIGF1= 3
##$SIGF2= 2
##$SINO= 400
##$SIOLD= 16384
##$SREGLST= <1H.CDCl3>
##$SSB= 0
##$STSI= 0
##$STSR= 0
##$SW_p= 3612.71676300578
##$SYMM= 0
##$S_DEV= 0
##$TDeff= 0
##$TDoff= 0
##$TI= <>
##$TILT= no
##$TM1= 0
##$TM2= 0
##$TOPLEV= 0
##$USERP1= <user>
##$USERP2= <user>
##$USERP3= <user>
##$USERP4= <user>
##$USERP5= <user>
##$WDW= 1
##$XDIM= 8192
##$YMAX_p= 0
##$YMIN_p= 0
$$ End of Bruker specific parameters
$$ ---------------------------------
##NTUPLES= NMR FID
##VAR_NAME=  TIME,          FID/REAL,        FID/IMAG
##SYMBOL=    X,             R,               I
##VAR_TYPE=  INDEPENDENT,   DEPENDENT,       DEPENDENT
##VAR_FORM=  AFFN,          ASDF,            ASDF
##VAR_DIM=   8192,          8192,            8192
##UNITS=     SECONDS,       ARBITRARY UNITS, ARBITRARY UNITS
##FACTOR=    0.0002768,     1,               1
##FIRST=     0,             0,               0
##LAST=      2.2672688,     0,               0
##MIN=       0,             -1111738,        0
##MAX=       2.2672688,     797743,          0
$$ Real data points
##PAGE= N=1
##DATA TABLE= (X++(R..R)), XYDATA
$$ [...]
3059H155p572r132O789J0814n425j2247L228J2942n65j2554j331J1528K555j0752
3073c567k959R934L996j0156n628R762P265q712q608P042R188n551r397M395R520
3088F524l760r517L260R886j642j1005Q14J0860J074j0602k835J0260M125r794
3102b352n130R101O054q482p162Q040Q566p527r853N721J0642l889j1024K021
3116e274J1426r87j1074l28J1342J783j1311l213J1194M850j0218o349R314P213
3130H368p945q172O659R380n789j0065M546J0245l212j0621J703J0959o64j0957
3144e565r90J1034K138j0397l508R657M724r041n848Q635O953q242p474P303R092
3159H471o168j0086M751J0512l073j0479J143J0741k39j0861r14J0695K662j0590
$$ y = [8155, 583, -8549, -1760, 9054, 3629, -8618, -5390, 7552, 6987, -5567, -6898, 4630, 7185, -3567, -6526, 3408, 7404, -2752, -8380, 1382, 8647, -65, -8673, -1631, 7557, 2006, -7391, -2996, 6524, 2764, -6753, -3493, 6393, 4751, -6254, -5440, 5420, 6494, -4108, -6943, 3317, 7442, -2352, -7482, 1619, 7673, -809, -7971, 69, 8635, 1108, -8745, -3024, 7618, 3729, -7295, -5274, 6152, 5165, -5909, -6237, 5105, 6888, -4423, -7636, 3558, 8408, -1810, -8159, 1155, 8368, 423, -7749, -1090, 8290, 2501, -7564, -3018, 7227, 4015, -6606, -4903, 6056, 5392, -5565, -6555, 4479, 6617, -3780, -7288, 2369, 7093, -1948, -7796, 839, 7792, -450, -7924, -621, 8471, 2303, -7783, -3032, 7480, 4407, -6072, -4929, 5812, 5573, -5288, -6202, 4493, 7155, -3435]
3173c435m636J0125O023r337p040P920Q046o727q462N475R268n028r344L672J0298
3188F818k214j0595R45J0227J045j0281k096R803K929r438l712Q995M768q509
3202a315o570Q037P647o930q315N062Q821l916q918L096R414k496r765J409J0338
3217E599L79j0599k105J0599L524r806m311Q528N572q197o384P739P224o653q577
3232g468N280R437m179r901K584J0205j542r796jR936N62r747j630R553L545r303
3248b465m787Q571O023p442o898O618P042n334p351M286Q443l729r017K420R599
3263E979j406r818J86R041J438r131k251Q966K875q442m425Q205N468o701o569
3278f585N825P301n191p504L951Q340k859q799J754R297p76r079m94Q539J706
$$ y = [-3435, -8071, 2054, 8077, -1260, -8300, -380, 7666, 939, -7523, -2048, 7220, 2192, -7152, -3480, 6818, 4604, -5991, -5046, 5181, 6226, -4055, -6151, 3652, 6581, -2857, -6569, 2426, 7194, -1315, -7885, 152, 7799, 869, -7446, -2384, 6437, 2521, -6397, -3301, 6113, 3617, -6148, -4739, 5599, 5978, -4621, -6726, 3873, 7397, -2409, -6720, 1808, 7380, -817, -7201, 538, 7762, 1109, -7468, -2188, 7249, 3070, -6831, -4247, 5958, 4416, -5380, -5381, 4555, 5117, -4630, -6260, 3293, 6838, -2465, -7252, 1319, 7342, -100, -6998, -380, 6662, 1328, -6023, -1737, 6706, 2977, -6040, -3620, 5979, 4573, -5245, -5059, 3982, 5420, -3711, -5962, 3004, 5879, -2563, -6988, 1217, 6685, -16, -6585, -760, 6541, 1350, -6154, -2203, 6137, 3278, -5521, -3767, 5530, 4754, -4325, -4819, 3720, 5426]
3293E426q411k425P691L476q219l845P490M941o409o246N804O826n026p200M191
3308a936P649l450p833K489Q489j546q734L81Q831J318q661k612Q040L756p698
3323a517m626P531N019o906o391O479P406n508q530L912Q777k271q178O94Q589
3338D480n86q433k01Q648J665q726l417Q674M799p279n622N683N695m747n565
3353d932M075O422m130p100L319P862k102q191P63P312N84o777q04O348O05o345
3369c091j166P447J841p468l326P132M648n894n423N008N277m331n341M673N899
3384E885m877p453L742R386j791j0337n10R494K253q558k880P634L221p960l761
3399f512Q684N249p934q003O411R617l464r657J405Q704l98p766N20P498o9q492
$$ y = [5426, -2985, -5410, 2281, 5757, -2462, -6307, 1183, 6124, -285, -6531, -727, 6099, 1073, -6127, -1936, 5713, 2263, -5570, -3081, 5408, 3862, -4872, -4491, 4340, 5658, -3003, -5615, 2425, 6181, -1517, -6143, 1388, 6407, -499, -6890, -411, 6995, 1487, -7043, -3131, 5646, 3375, -4803, -4109, 4480, 3894, -4539, -4740, 3908, 5573, -3153, -6570, 2104, 6903, -376, -5998, -315, 5380, 633, -4932, -857, 5565, 1435, -5665, -2346, 5516, 3414, -4777, -4014, 3298, 3882, -2895, -3699, 2649, 3254, -3091, -4257, 3190, 5031, -2437, -5763, 1369, 6017, 123, -5300, -292, 4985, 654, -4687, -14, 5885, 1008, -6445, -2703, 6683, 4892, -5445, -5955, 3539, 5792, -2766, -5646, 1988, 5209, -2751, -6512, 2172, 7421, -513, -8516, -2105, 7512, 4048, -5609, -4204, 4500, 4102, -3664, -3144, 4354, 4285, -4207]
3415d207p90Q694K800q034n202O178N946m335n034K921M173l430l845M260N022
3430E117m631o365L469P269j256o605k46N391K00m727Q67N448j701o997O09Q837
3446D679J983q977m564P561N340n677n003M658M697n818n158O232P778o022j0089
3461h380L182J1775K32j1057k492Q848L617p397l185P601L332q630n007Q733P881
3476I053o900j0133L742J0190m83q867q62O802L00n912l5P097J6q333j733P857
3492A799M901o311n860L662M879j984l014K899K018m914k851N772N452m829p534
3507e915K849P218q53n682N05M735k058n243K615Q073k466r830r58J0630M142
3522G762q869o157O556O268n539n341N903N960o746p526O063J0630l873j2036
$$ y = [-4207, -4997, 3697, 6497, -1537, -6739, -561, 5385, 1050, -3984, -1063, 3110, -320, -4165, 95, 5117, 486, -5879, -2410, 4859, 3603, -3002, -3248, 2143, 2343, -2384, -1517, 3931, 2230, -4767, -4158, 4679, 6662, -2315, -6879, 682, 6022, 345, -4658, 0, 4697, -1121, -6279, -47, 7731, 1709, -8380, -5198, 6577, 6809, -4248, -6740, 2108, 5725, -1672, -4857, 2744, 6076, -2554, -7561, 1172, 9053, 2153, -7980, -4238, 5952, 5469, -3398, -4260, 2542, 2842, -3070, -3105, 3992, 4008, -4325, -6058, 1799, 6700, 389, -5471, -1809, 3070, 1086, -1928, 971, 2989, -1925, -4776, 996, 6448, 1619, -5915, -3066, 4152, 3299, -2383, -1878, 2857, 799, -4444, -1829, 6244, 3778, -6052, -7010, 3620, 7762, -1107, -7264, -708, 5560, 21, -5320, 583, 6543, -203, -7729, -1666, 8964, 5091, -6945]
3536f945n52J1951L353r537m387P214L887o613l558P150M827p928p270O516R756
3551G864l484r844m7Q204J642n775j184M668j37n668J052O858Q60p626l185O309
3567E07M604m085l714K559J825l399o20M872J931o787m220O288O706m112p482
3582e127J654O827r32n811J726N814k139p814J478J0421Q16j0560m517R266P125
3597H227o855p234M519O428m134o226M804P359m939r402K592J1293M61j0978l429
3612g514Q637M854o368m378N244L758n822l814O230N997n775p548L201Q370p42
3627D330p030o41N270N28m057O86M271j306o169P32O829J379o511l176N064L094
3643C293l603k299L653J652n126k158O539M213o653o196M773P741k640p355J131
$$ y = [-6945, -7497, 4454, 7807, -1730, -6117, 1097, 4984, -1629, -5187, 1963, 6790, -1138, -8408, -1892, 7864, 4380, -5464, -5511, 2693, 4335, -1440, -2624, 2044, 1907, -3761, -2709, 4149, 5009, -2617, -5802, 507, 5111, 1026, -2688, -129, 1696, -1703, -2323, 2549, 4480, -2307, -6527, -239, 6467, 2355, -5127, -3473, 3354, 2422, -3389, -1663, 4151, 2012, -5802, -4324, 6097, 6913, -3647, -8164, 1102, 8227, 1372, -5862, -1343, 5085, 951, -5275, -471, 6888, 1949, -7453, -4861, 6432, 6893, -4085, -7514, 1123, 5977, -391, -4769, 475, 4233, -1589, -5403, 827, 6824, 1049, -6499, -3298, 5072, 4330, -2700, -3341, 1929, 2457, -1600, -914, 3357, 2051, -4118, -3386, 3443, 4822, -1689, -4865, 199, 3293, -310, -2609, 1044, 2696, -2430, -4588, 1951, 6164, -489, -6685, -1912, 5829, 3189, -4166, -3035]
3658c035O594q48o268J168P232p50q798j568R651M138q382o272N827P130m205
3673A614o427L076N921l011o666L124P789j725q880l77Q814K507p142l808N494
3688C03L916m695k926M549L106m959m108N018N064l674o403K364N671o67n122
3703b563N76M648j641m421J493N367p45o331m29O358K293n924k960M909K955m484
3719h99k468M797L031n507m164N379N636l799p242K629O909r61o743n0O721k92
3735B977o537m87P232J503p172l328O580M668n167n446L971N595l035n151K689
3750a108N223k351n878J739O623r40o265r82O055J872n404k338M813K292m703
3765a352k651N079L069m980l880M409M740l487n082K261N340j550n216J574M943
$$ y = [-3035, 3559, 2711, -3557, -2389, 4843, 4093, -4705, -6273, 3378, 7516, -866, -7138, -1311, 5819, 1614, -4813, -1737, 4184, 1173, -5493, -2369, 5420, 3695, -5185, -5562, 3252, 5759, -1383, -5191, 303, 4219, -476, -3402, 1147, 4253, -706, -4814, 204, 5268, 1594, -4809, -2445, 3226, 2559, -2563, -1987, 2661, 1020, -3401, -1908, 3459, 2714, -3617, -4046, 2312, 4605, -1319, -4279, 630, 3585, -899, -3367, 1430, 4461, -1046, -5210, 169, 5805, 2006, -5236, -2607, 4302, 3341, -3402, -3452, 3269, 2977, -3560, -4047, 3185, 4688, -2484, -5812, 768, 5436, 269, -5177, -1206, 4389, 1354, -3797, -1108, 4115, 1764, -4114, -2375, 4248, 3308, -2957, -3939, 2116, 3988, -1416, -3754, 1059, 3351, -1352, -4003, 1076, 4145, -835, -4715, -306, 4434, 947, -4135, -1874, 3466, 1916, -3300, -1726, 3217]
3780C217q99n721P52N935L22o120j154N791K111n317k829M966L095m784l661M465
3796A69M106l906m630K963N479k514n738J608N983q84n891K75N870P16o000j227
3812c621N739K100n598k769M854L811m308m426L918M436l283m822K591N058k235
3827A445n225J512N549q56n608M1N861N26n677j569N733K093n130k800M861L420
3843D176m384l797M116M280l631n238L650N084k300n555Q99N945l28n602l85N553
3859B483P33n567j181N125K185m956l004M565L534l591l873K565M363k837l861
3874c317K620M393k358n328J981N778r61n539l6N317O75n080j184M928J570n044
3890a585k433N099L190m911m033M062M678l135m960K251N189j823n030J827N143
$$ y = [3217, 2318, -3403, -2651, 3284, 3606, -2514, -3668, 2123, 4234, -1083, -3912, 1054, 4149, -635, -4296, 169, 4275, 369, -4261, -1298, 4181, 1667, -4071, -2463, 3520, 2636, -3255, -2980, 2890, 3606, -2394, -3621, 2118, 4218, -1380, -4149, 705, 4516, 208, -4218, -300, 4136, 853, -3969, -1378, 3680, 1445, -3780, -2268, 3281, 2425, -3183, -3142, 2719, 3245, -2432, -4001, 1732, 3825, -1305, -4105, 756, 4176, -208, -4005, 111, 4391, 760, -4478, -828, 4256, 1956, -3599, -2700, 3245, 2917, -2685, -3070, 2483, 3216, -2351, -3532, 1593, 3778, -1178, -4182, 383, 3917, 326, -3547, -982, 3381, 544, -3317, -697, 3696, 1338, -3990, -2009, 3769, 2808, -2731, -2767, 2550, 3225, -1855, -3039, 1889, 3459, -1585, -4018, 1081, 4271, -640, -4673, -611, 4067, 932, -4028, -1777, 3412, 1589, -3441, -1614, 3529]
3905C529j144n491j26O192J105o094k010N850K241m464l243M226L377l973l756
3920c781L413M572l356m980K148N603j271n548J37N353M45n040p44N323R62n314
3936b078j556N319K342m577l352M031L756l547l571K763L789k613l969K375M731
3951C843k035n473J330N668o50n691j54N048J163n061j520N484J777n304k323
3966c898N028L381m588m456L876M993k550n362K121M887j358n307R91N354j00
3981C012n729j031N973J715n354k699M860L011m209l393L766L730l393m292L233
3996h00M635k345n054J601N368n83n590M33M943M00n006o93M888J119m895k013
4012c592M907K603m458l046K997L874l230l815K876M286k281m752J696N288j156
$$ y = [3529, 2385, -3106, -3232, 2960, 4065, -2029, -4039, 1811, 4052, -412, -3655, 571, 3948, -25, -3781, -368, 4204, 848, -4132, -1984, 3619, 2348, -3200, -3063, 2290, 2735, -2305, -3049, 2274, 3236, -2078, -3634, 1685, 4027, -550, -3902, 129, 3885, 338, -3233, -470, 3319, 706, -3263, -888, 3843, 1808, -3665, -2335, 3333, 2683, -3008, -3162, 1886, 3049, -2012, -3532, 1952, 3729, -1575, -3898, 1130, 4511, -77, -4533, -657, 4336, 1786, -3576, -1455, 3432, 2074, -3233, -2242, 3112, 3012, -2717, -3748, 2225, 3940, -1414, -4113, 747, 3758, -451, -3844, -78, 3652, 259, -4033, -800, 3835, 1490, -3564, -1963, 3405, 2822, -2768, -2335, 2608, 3008, -1998, -2691, 2197, 3316, -1579, -3592, 1315, 3918, -540, -3586, -589, 3285, 55, -3760, -884, 3402, 1121, -3631, -1935, 3353, 2197]
4027B197n376O83N222L03m922j470N181J939m914k428M412L482m627l398L488
4042b28M252l474m392K652M736j871n138J172M945j92m859l39M824O77m606j356
4058c197M836J694m554k294M149K965l807l294L390L531k569m154K143M413j830
4073A422m651J314N135q89n058k73N307R48n249j381M399K138m116k679M056L223
4089C646l698l941L310M519k670m887J943N073q73m714J58M456J09m709n33M773
4105A962J351m902j837M246K736l696l313L361L053k826l116K413L564k397m136
4120c537K351M363j353m315J65M620N9m179j82L887N27l902r75M305J568m844
4136a442k219M060L390l317m032K547L825k115l788J837M444j836n131J316N461
$$ y = [2197, -3179, -2496, 2726, 3029, -1893, -3363, 1818, 3757, -1157, -3585, 827, 4309, -318, -3716, -228, 4024, 550, -3842, -1190, 3546, 1675, -3463, -2291, 2654, 2462, -2397, -2736, 2088, 2765, -1841, -3197, 1639, 3333, -1221, -3515, 634, 3599, -208, -3502, -112, 3419, 850, -3304, -1161, 3252, 1422, -3229, -1915, 3220, 2331, -2727, -3000, 2307, 3255, -1994, -3375, 1024, 3162, -954, -3633, 423, 3646, -52, -3993, -683, 3836, 1166, -3721, -1778, 3295, 2422, -2292, -2134, 2322, 2431, -2278, -2811, 1962, 3313, -1589, -3426, 820, 3556, -140, -3453, -92, 2961, 135, -2981, -568, 2996, 599, -3537, -1186, 3177, 1824, -2491, -2326, 2294, 2353, -1826, -2008, 1879, 2406, -1496, -2471, 1834, 3402, -1442, -3661, 399, 3789, 472, -3560, -1013, 2812, 697, -3091, -1254, 3190, 1354, -3777, -2461, 3000]
4151C000L32n756j355N259K004m167k268L470K647l641k523L250L515k959m741
4166c933K288M880r49m624J09L761L36l632l5L427P3l619o24M085J301l820k173
4183c149L225K646k678k099J950K185k397k160K649K957k669l683K175M132r95
4198B089m387j16L958J64l284l14L862j31m311q72N007K067m476l387L570M079
4214C518k592l789J908L695k046l461J716M513j310n255R6N380J402n111j889
4229c225L588K270k854k288K905J833k510k907K888L657k471l776J019M180m78
4244A831l191j76K379J20k444N93L096o62l610k06L620J705l748j981K887K041
4260B254k371j879K968J419l211k264L074L282k537m214J703M218l44l945J50
$$ y = [3000, 3332, -2424, -3779, 1480, 3484, -683, -2951, 519, 3166, -475, -2998, 252, 3767, 808, -3933, -1645, 3235, 2286, -2338, -2229, 1532, 1868, -1764, -1799, 1628, 1701, -1918, -2542, 1543, 2844, -976, -3149, 76, 2722, 44, -2055, -105, 2080, -317, -2477, 172, 3129, 460, -3223, -1048, 3084, 2089, -2298, -2414, 1544, 1708, -1576, -1890, 1972, 1841, -2470, -3342, 1665, 3732, -744, -4131, -561, 3518, 926, -2863, -955, 2740, 694, -2767, -1051, 3462, 2152, -3103, -3007, 2373, 3775, -1336, -3225, 363, 2633, -221, -2509, 396, 2229, -281, -3188, -300, 3357, 886, -2890, -1871, 2309, 1831, -1360, -1536, 843, 963, -1481, -888, 2208, 1546, -2064, -2270, 1350, 3055, -693, -2674, 213, 2254, -117, -1996, 972, 2391, -820, -3084, -10, 3272, 735, -3479, -1776, 2442, 2098, -1847, -1697]
4275a697L379k86l411J72L918O92m617j779M573L053l609l735K374L683j542l511
4291b343J721K947j516l517J035M496m08m927k49L991J661l555j966K761J786
4306A917k143k022K993J685k744k547K332L620j861l406Q48L179n81k355M29K364
4322A708j067k468M63L619k43m050m35L745J309l212j657K723J424k460j488K820
4338G31J954l043k964K500M029j806m170P48M385j64l772ML428nl682n72L900
4355A501J522l928k394L504K906k643l382J854L169j855k789J595L379j526l485
4370b572P62L984k9l631q63L475J167k885j274K683J308k819j682K912K085k958
4386c37k363K451K641j456l010Q69K899p81k949Q43L044o50l108k87L813P08l555
$$ y = [-1697, 1682, 1396, -2015, -1843, 2075, 2767, -1850, -3629, 944, 3997, 388, -3347, -973, 2710, 1168, -2343, -622, 2325, 809, -2708, -1673, 2823, 2415, -2512, -2761, 1230, 2891, -664, -2630, 131, 1917, -226, -2248, 745, 2430, -314, -2861, -529, 3091, 1230, -2176, -1328, 1851, 1270, -1085, -656, 1708, 641, -1827, -1364, 2255, 2012, -2038, -2473, 1272, 2581, -631, -2288, 435, 1859, -601, -2089, 731, 2685, -358, -3322, -822, 3207, 1401, -2769, -2021, 2364, 2200, -1572, -1568, 1860, 1855, -1827, -2399, 1501, 3023, -905, -3299, 205, 3111, 468, -2914, -1060, 2109, 254, -2535, -940, 2439, 913, -2572, -1810, 2174, 2145, -1486, -2349, 1126, 2293, -592, -1866, 817, 2125, -694, -2376, 536, 2621, -337, -2700, -249, 2392, 936, -2074, -1205, 1694, 913, -2036, -1193, 1851, 1201, -1907, -2194, 1619, 2327, -1228]
4403a228j104L203J625l117j589L001J557k657k294K425L053k155l510J529L967
4418B706j177l631J51L824R1l580n59L648R59l814j136L236J832k835k460K514
4434b31K566j997k803K091K701j559k969Q45L598p18l412L31L431L08l512p60
4450b090L313J059l541j105L137J822k945k384K630K503k061k881J869L019j510
4465H35l166J150L341n70l327p5L367L95l153p76K951J307l010j292K727J700
4481B404k798j834K477K100k008k627J760K739j414l047J173L013q38l170K52
4496a818L572K5l245q21L273J555k959j641K577J820k664k016K571K400k470k744
4512b585J444L527j389l234P41L148j57l437K76L165K84l147j178L806J549l582
$$ y = [-1228, -2332, 871, 2496, -621, -2210, 791, 2348, -309, -2603, -178, 2875, 720, -2790, -1261, 2706, 1529, -2102, -1951, 1873, 1964, -1616, -2175, 1473, 2432, -1382, -2518, 718, 2550, -285, -2745, -231, 2335, 338, -2465, -374, 2327, 768, -2201, -1356, 2242, 1524, -1888, -1557, 1874, 2182, -1330, -2090, 1223, 2282, -1259, -2364, 773, 2595, -350, -2734, -104, 2399, 338, -2543, -674, 2345, 835, -2331, -1181, 2160, 1590, -1737, -1812, 1555, 1950, -1203, -1979, 972, 2279, -731, -2023, 704, 2404, -394, -2228, 249, 2349, 341, -2286, -526, 2213, 799, -2248, -1075, 1938, 1100, -2070, -1818, 1754, 1779, -1466, -2287, 986, 2541, -418, -2059, 518, 2338, -326, -2342, 229, 2629, 159, -2585, -1141, 2386, 997, -2237, -1496, 1652, 1495, -1942, -1666, 1499, 1783, -1364, -2542, 1264, 2813, -769]
4528g69k016K850K705k100k752J733K763j702k772J355K961j118l145M65L167
4543A625L21l388n23K701J192k703j222K511P28j962j372K547J598k097k202J694
4559e52K479j309k492J267K211p77k636J014L171j010l184L47L022O03l122j422
4575b390K931J599k746j552K616J775k776k009K333K796j858l169J168L278o85
4590A311k897J81K790P0k851l28L002Q86l267j051K780J821k242k522J985K130
4606A798j224k133J061K012r69k697J188K933o11k919m23K880N81k042j152K308
4622E91N84j928n90K222P14k280j424K656J756k063k013J243K055r12k179J149
4638d19K023j043k582J119K867k86l521l74L337Q91k774j487K807J291k329j328
$$ y = [-769, -2785, 65, 2770, 670, -2082, -349, 2414, 712, -2060, -705, 2256, 1138, -2007, -1542, 1625, 1946, -1442, -1965, 736, 1928, -775, -1997, 514, 1242, -720, -2092, 455, 2053, -44, -2246, -552, 1927, 618, -1874, -607, 1604, 827, -1809, -795, 2376, 1366, -1818, -1471, 1551, 2154, -968, -2390, 541, 2140, -606, -2158, 458, 2233, -543, -2552, -219, 2577, 719, -2450, -1282, 1996, 1311, -1586, -1405, 1385, 1455, -1396, -1724, 1278, 2164, -1103, -2154, 626, 2447, 205, -2317, -332, 1798, 574, -1559, -498, 1514, 545, -2152, -964, 1969, 1358, -1561, -1984, 896, 1477, -565, -1717, 591, 1175, -753, -1343, 879, 1593, -687, -2111, 545, 2301, 238, -1775, -532, 1523, 611, -1568, -419, 1604, 561, -2021, -902, 1965, 1679, -1842, -2216, 1121, 2012, -762, -2249, 558, 1849, -480, -1808]
4654a808J950K229k419k154J754K733q94l172M07K866k12k035l13K169o3k180
4670a142m79K671Q21k670j281J975J979j887j438J346J525j309j537J216J880
4685A670j390j901R30K402k82k576j08K328J42k017n39K270L56k151o00K103J141
4702A778k376j331J870J847j714j814J147K313j147k127Q91K142q62k379M09K995
4718A642k40k556q64K964R38k347j119J815J495k013j295J420K084j878j866J167
4734f53K424q71k481L63K321j8k497K66K319k6k127l32K019R34k041r40J680J357
4752A697k037j245J583J938j794j653J074K256j516j852N82K540n30k381l3K302
4768I31M14k211n15K046P13j833j285K337J283k136j634J694K125j673j770J099
$$ y = [-1808, 142, 2371, -48, -2202, -448, 2285, 1391, -1781, -1374, 1492, 1280, -755, -1068, 1101, 1038, -1142, -1621, 1050, 1871, -799, -2080, -105, 1874, -13, -1451, -105, 1420, 111, -1426, -210, 1670, 280, -1621, -691, 1711, 1429, -1147, -1255, 1073, 1215, -802, -1341, 929, 1285, -866, -1466, 637, 1778, -598, -1929, -59, 1788, 74, -1740, -593, 1720, 573, -1554, -663, 1479, 617, -1762, -1353, 1642, 1402, -1154, -2018, 946, 1884, -463, -1582, 233, 1728, -285, -1580, -160, 1924, 46, -1820, -653, 1771, 900, -1581, -1218, 1103, 1085, -1412, -1146, 1173, 1147, -980, -1312, 707, 1641, -400, -1340, 340, 1697, -340, -1585, -2, 1936, 142, -1511, -437, 1819, 303, -1549, -967, 1573, 1043, -1338, -1371, 931, 1345, -866, -1381, 665, 1378, -455, -1740, 597, 1880, -256, -1890, -196, 1929, 256, -1514, -415]
4784d15J998j034k049Q42K156n08k391m3K690J55k466q04K564P16j937j239K034
4801B69J091j552j243J377J692j679j527J183K178j021k254M44K465k58k497K64
4817a068K052L50k506K51K004L38k265r17K393J127j727k090J577J967j187j825
4833a526R37K369j320k279M90K810Rk775l56K708O90k368q68J735J297j481j606
4850a534J732J415j702j778J506J969j101k371J017J849J6k045J83J729j97j596
4866i08k64K338M08k460n88K219J041k190j140J888J068j276j277J420J321j420
4882A80j977J464K401j171k426J95K718M7k447j69K136L32k072p31K493P77k617
4899h67r37J720K326k205j925J231K055n28k092N55K513q65k479O78K382Q7k399
$$ y = [-415, 1583, 549, -1500, -658, 1498, 990, -1401, -1444, 1246, 1401, -1065, -1869, 695, 1411, -526, -1765, 269, 1360, -192, -1435, -58, 1634, -45, -1572, -389, 1789, 768, -1486, -1042, 1423, 1165, -1332, -1068, 984, 1334, -1172, -921, 1083, 1421, -844, -1761, 632, 1759, 32, -2058, -481, 1486, 299, -1526, -589, 1780, 460, -1819, -1329, 1481, 1490, -1285, -1641, 1067, 1757, -611, -1479, 256, 1553, 72, -1534, 198, 1613, -89, -1867, -361, 1608, 507, -1864, -847, 1002, 1018, -1027, -844, 885, 688, -908, -1172, 1166, 1574, -886, -1474, 745, 1786, -404, -1544, 344, 1412, 136, -1141, 279, 1600, 180, -1797, -333, 2068, 897, -1529, -1334, 1384, 1431, -1016, -1185, 951, 1283, -789, -1520, 973, 1750, -867, -1804, -84, 2242, 37, -1888, -657, 1398, 870, -1222, -667, 1846, 981, -1498, -820, 1562, 1649, -750]
4916g50j054K167J340j583j544J461J034j117j372J676J323j713j499J118J929
4931A416o16j775J00J739l42j516N18J717l36k213M22K129L73k194r45K026J037
4948A540j858r87J559J108j701r19J183J756j321k375Q57K942p27k398j14K377
4964I22Q26k349p20K014P01k235r47K543J136j932j882J603K043p77k507O42J983
4981A064k88j630qK077j88k462K7K123P36j799j187J638J103j147j157J474P67
4998A143j281j109J297J373p34j736N30J883l10k092N45J722n64j698M16J461
5014H46Q4k054k41K376L88k023j169J942J307j420j438J480J366j098j918J331
5030b41K033q85k407K78K215K62k091k35J590N88j650p88K030Q80j908j116J340
$$ y = [-750, -1804, 363, 1703, 120, -1424, 37, 1071, -46, -1418, 258, 1581, -132, -1631, -513, 1416, 800, -975, -875, 864, 522, -994, -476, 1241, 905, -1308, -886, 1243, 1616, -578, -1523, 503, 1540, -318, -1305, 254, 1362, -339, -1258, -75, 1681, 360, -2015, -1158, 1784, 1057, -1341, -1455, 922, 1748, -601, -1321, 693, 1394, -841, -1788, 755, 1891, -41, -1923, -320, 1723, 946, -1561, -919, 1064, 776, -854, -862, 1215, 1027, -1435, -1408, 715, 1451, -348, -1535, 103, 1206, 59, -1098, 376, 1143, -138, -1247, 50, 1423, 689, -1047, -517, 1366, 1056, -1036, -491, 1231, 667, -1031, -615, 846, 930, -1124, -1365, 1011, 1399, -624, -1793, 149, 1456, 36, -1402, 78, 1444, 346, -1572, -241, 1792, 907, -1500, -1222, 993, 1255, -836, -1071, 519, 1107, -543, -1331, 699, 1579, -329, -1445, -105]
5047a05J652j241j932Q16J750p73j354P90J351l98j626K89J880o8j917j85J812
5064G41M73j695o33J368R64j559p40J039J062j236r42Q62J842j199j661O38J857
5081A181o39j716N23J355M1j702pK027o4j693m47J582J089j910q44J619Q72j314
5099d7j009J020J585j295j667P30J714j47j945N02J396P6j438l69J494K21j484
5116f63p74J637J088j421j278J308J466j129j446R91J381p75j142L27J391m1j877
5133i57J77J656J4j617l41J688L63j601n02J362Q43j358p56P43J549j008j568
5150a313J017J303p26j427N68J756l46j704J49J525rj537j35J386N27j653k88
5167i07J447L74j376o74J448R50j229j377J008J525r94j540P80J632o28j436L23
$$ y = [-105, 1547, 306, -1626, -810, 940, 167, -1187, -397, 954, 556, -1070, -781, 1099, 1031, -886, -1071, 741, 1214, -481, -1114, 254, 1218, -341, -1081, -42, 1020, -216, -1158, -296, 1546, 347, -1314, -676, 1181, 542, -1174, -651, 704, 745, -957, -964, 1063, 999, -694, -1141, 441, 1530, -380, -1224, 395, 1267, -47, -1056, -36, 1549, 254, -1413, -683, 1031, 884, -1061, -559, 837, 913, -525, -894, 600, 821, -663, -1437, 200, 1288, -133, -1411, -103, 1363, 234, -1212, -221, 1160, 385, -757, -430, 961, 920, -957, -780, 876, 890, -727, -1068, 620, 983, -618, -1120, 242, 1085, -273, -1029, -286, 1263, 255, -1313, -296, 1007, 281, -1146, -578, 1178, 832, -872, -723, 802, 793, -744, -879, 507, 1034, -619, -907, 540, 914, -462, -1136, 312, 1262, 33, -1344, -336, 1189, 195, -1345, -565, 1067, 439, -997, -674]
5184f74J418L06j780n02K153O12j893q06J589Q56j289j177J256J084j221j401
5200a469J052J637o35j732L48J626j88j645M6J450K43j247n78J533P28j625q34
5217a290J802R95j280j229P17J468p12j025M49J239r13j348N75J539l58j646J29
5234h88J318M47j317k84J176L58j439o1J199P24j563r68J446J045r35j468Q05
5251d05J530n08j284J24J570l86j767L61J981N9k053o39J752J085j791q92J253
5268a0J062j221j279J296J621j415j312O54K005m86j830M2J630K41j566j14J317
5285F35L58j718k06J562L94j579o91J268J023p69j341P69J136n37j009N87J015
5302H97p00j400M46J519p5j471n4J399J1p36l95J241K17j542m13J480R63j523
$$ y = [-674, 744, 1050, -730, -1232, 921, 1533, -360, -1166, 423, 1279, -10, -1187, 69, 1153, -68, -1469, -417, 1220, 585, -1147, -799, 827, 639, -1006, -960, 490, 733, -514, -1092, 441, 1169, -456, -1290, 512, 1507, 227, -1002, -285, 1183, 471, -554, -105, 1134, 221, -1127, -552, 987, 629, -1017, -888, 430, 877, -440, -724, 452, 810, -629, -690, 509, 1233, -330, -1298, 148, 1193, 258, -1210, -405, 1125, 617, -667, -543, 1027, 641, -1126, -765, 1216, 1275, -778, -1417, 335, 1420, -371, -1263, -10, 1052, -169, -1448, -152, 1469, 54, -1258, -604, 1401, 915, -915, -873, 757, 998, -568, -682, 635, 993, -725, -931, 631, 1025, -554, -1245, 23, 1046, 277, -1064, -295, 841, 304, -705, -118, 897, 197, -1203, -757, 762, 687, -784, -838, 561, 572, -164, -559, 682, 899, -643, -1056, 424, 1387, -136]
5320a36j233J364J216p16j742Q37J430o95j139L44J725l49k208J70J979L23j632
5337d62j039J811R57j378j038J344Q82r10j333Q14J538p31j748N71J634j06j489
5354f83j35J363L4q89n26J455n9j186l41J203R23j212j144J104R59o22j032Q14
5372B6Q75q77j118R78J038m19j284r4J762K80j710n08J482K56j302l68J457M48
5390I22j361r29J584J089j245j380Q10J501n64j569N65J560l12j697L43J698J22
5407A137j558q22J492Q42r54j333J257P25p75p72M59J489j182j102N90J476l69
5424F00j341p0J335J51j224l71J343j1j140K8R75Q09j492n37J296N04r35q19P90
5443a09R73m79j319P06Q72m20j391M76J539Q1j709J15J342K1j152m84J311O17
$$ y = [-136, -1369, -5, 1211, 495, -1247, -410, 1020, 325, -814, -470, 1255, 906, -1302, -1132, 847, 1170, -462, -1501, 310, 1267, -111, -1149, 195, 1077, 167, -1166, -352, 1186, 455, -1293, -722, 912, 806, -683, -818, 545, 579, -310, -836, 619, 560, -626, -967, 236, 1159, -53, -1197, -93, 866, 244, -788, 26, 901, 24, -1094, -116, 922, 503, -781, -875, 887, 1167, -543, -1051, 431, 687, -615, -983, 474, 922, -439, -1368, 216, 1305, 60, -1320, -510, 991, 427, -1142, -577, 983, 671, -1026, -683, 1015, 1137, -421, -1243, 249, 1091, 137, -1196, 61, 786, 11, -761, -302, 1187, 5, -1097, -507, 969, 600, -741, -811, 524, 675, -549, -920, 423, 412, -728, -700, 275, 1084, -408, -945, 351, 855, -80, -899, -109, 864, 385, -934, -228, 644, 224, -1167, -691, 848, 929, -780, -665, 677, 698, -454, -938, 373, 990]
5461I90j173o37R56Q85j077r13R45R77m81j341K91J445k01j251j58J352j13j119
5479f23K4J290K86j218o67Q94P79q73r35J006R52j070p20J002P11m48j162L60
5497d12J222k08j209j13J309J23j208k2R87K59j281l36J398N92j350q34J428M36
5515G81n87j276Q76J092m83j257M63J197k76j345J41J362J29j269n90J596N96
5532A150j202n38O71R36j133o95Q83R99p65j071N83J007m66j249L72J151n0j070
5550d87j28J250j30j107o1R79N60j261n48J318N67r81r30Q53R96p57j079Q32R97
5569H83n41j210N96J217k01j793K47J118M21j373k94J486K87j206m18J164N38
5586I21j165o19R75R04r64q88M85J222l52r90P7J049j83j147J00J330m5j100o70
$$ y = [990, -183, -820, 136, 1021, -56, -969, -24, 953, 472, -869, -578, 867, 666, -585, -743, 609, 496, -623, -599, 691, 977, -241, -908, -14, 765, -108, -1043, -37, 915, -155, -875, 127, 838, 390, -772, -412, 810, 602, -607, -720, 589, 712, -496, -518, 469, 728, -553, -889, 509, 1101, -249, -1083, 345, 781, 194, -1082, -206, 886, 403, -854, -391, 806, 530, -815, -674, 688, 817, -452, -1042, 554, 1150, -52, -590, 81, 1017, -116, -811, 72, 1071, 306, -765, -182, 825, 359, -890, -518, 633, 583, -487, -615, 635, 505, -602, -663, 316, 876, -385, -933, 385, 952, -29, -959, -106, 890, 133, -946, -114, 883, 342, -868, -272, 945, 744, -1049, -802, 316, 737, -636, -930, 556, 843, -363, -781, 383, 921, -244, -863, 112, 1016, 52, -836, -351, 871, 519, -471, -394, 655, 472, -675, -575, 755, 710, -390, -1060]
5605a060J506N38j115p80J092K35k88q17N91J008q51p25M04J086m48j284O67R37
5623F96k31j183K50J148j70j152J72J219q6j121k12P26P94r31j002J139M70n98
5641g2o71N63Q98o23j033O42J184k55j005l01J513J99j363l55J138M97j423l86
5659h53J177N96r00q91P05J149o82j048J35J312n12p21R6R46m8j313J63J316R5
5678G22r96o77J047N32n23m94M50O41o27p29Q88Q21q85r81M78J029l16j281N30
5697c71R01J01j180M7J316o66r95Q0J205N93j385l96P73R01j024j002J150Q75
5715I23q22j124R06J027m53j295K77J180K05j063m20J126K07j075l16R81O90j253
5733b99n74J148O78p79j049M83R77l38q04K00J013l65j115J61J272J1j435K39
$$ y = [-1060, 446, 984, -131, -911, 181, 416, 128, -689, -98, 910, 59, -666, -262, 824, 376, -908, -241, 696, 465, -718, -468, 680, 510, -642, -470, 749, 663, -458, -670, 56, 850, -81, -1083, 56, 526, -72, -743, -180, 718, 95, -938, -296, 888, 633, -372, -673, 840, 1039, -324, -679, 459, 956, -467, -853, 324, 920, 20, -871, -166, 983, 301, -747, -612, 700, 188, -533, -437, 509, 461, -852, -689, 627, 722, -274, -951, 96, 628, 105, -389, 61, 702, 75, -654, 234, 1055, 170, -811, -333, 696, 380, -901, -371, 530, 631, -549, -502, 814, 148, -847, -767, 438, 1031, -354, -750, 23, 924, -100, -1102, 48, 923, 101, -1023, -117, 910, 457, -838, -561, 619, 824, -239, -659, 467, 674, -401, -717, 264, 954, -299, -873, 275, 953, 174, -875, -392, 585, 247, -557, -357, 656, 291, -824, -663, 609, 620, -815, -576]
5751e76R36L69r64m85J112K81n60q13Q47P10r04q54O60J195q03q48L38J119n63
5770A97p86J93J055l31q81o3J113K1j111j40J389K13r69p16R07O53n85j036R66
5789H9J155j113r77L70J446l19j463q5J217K75j133j62R92L61j156l23R37O28
5807G39p80p52Q66Q51p35r15M35J082m61j278Q20R06k51j179K27Q70N6r57l19
5826g75J042N62j016p21J168L18o13p64P84J056o47j227M61R86m10p46N19M94
5844D71O7r43L4R88r5j064j7Q18K00l84p95R73L76p97n85P03M64l83p49K22R66
5865D70kr13k45J209j3r87J97N70K51j115k13J346M30j049n46N75R52r48p74P78
5885b7R31n50j407P25P67j65q56n3J036L24j063j96P55M77p92p01Q37Q35j128
$$ y = [-576, 360, 729, -235, -720, 392, 673, 113, -700, 147, 857, -47, -901, -241, 954, 151, -697, -359, 760, 197, -589, -396, 659, 328, -553, -616, 497, 518, -593, -733, 656, 869, -100, -816, 91, 744, 159, -877, 89, 1244, 131, -846, -476, 970, 651, -812, -897, 320, 595, -538, -700, 292, 653, -503, -826, 111, 739, -41, -793, 73, 924, 189, -726, -291, 791, 330, -948, -128, 778, 527, -652, -425, 445, 501, -456, -775, 267, 829, -187, -908, 260, 578, -35, -799, -15, 1041, 394, -833, -372, 614, 204, -542, -23, 471, 538, -405, -371, 617, 522, -542, -559, 259, 459, 75, -720, 253, 629, -168, -753, -50, 414, 31, -718, -496, 470, 468, -445, -690, 519, 506, -481, -284, 286, 537, -578, -791, 555, 985, -64, -610, -35, 917, -31, -805, -27, 904, 354, -1053, -328, 439, 274, -582, -635, 401, 725, -338, -534, 221, 698, -94, -795, 42, 877, -251]
5904b51m56R58N69r48q97Q09Q12m54o62J05R15q9r02nR48j4r59j02P43O61j063
5925b82o18J059M67r02l71Q04M92q53o19Q83Q98q72q72N52Q30j60q57q0J208j62
5945E45r12k09J045K47j168k67J071M98j101o82L93J045j91j006M41P70l13q05
5963e99K69Q33R3j393J99J041J49q11l36P58L18p04k42Q20L09j096k17O94N40
5982F25m67j049O81N85j02o12qP25j96m90j77J105k50q87j07J010K17q92k40P22
6002A93L36o27m35P88M35q04p53O44J047n97r79L11Q65m2r25J83O44l3p25l18
6022g92R29O01q66o12R85O25n99q54M07O21j76q71L82R95n81o43J15R70qr49m0
6043c61O60J18o47k84Q34Pq45K3P18N71q96p50R42N11n40p14P64N42k87r04L14
$$ y = [-251, -707, 251, 820, -128, -1025, -216, 596, 142, -520, -415, 500, 411, -491, -496, 452, 438, -521, -623, 120, 781, -282, -900, 159, 626, -276, -647, 157, 649, -204, -823, 60, 958, 86, -786, -234, 596, 436, -421, -501, 707, 545, -367, -576, 469, 716, -452, -719, 352, 850, -251, -933, -540, 505, 314, -692, -251, 519, 206, -599, -330, 503, 596, -797, -598, 443, 592, -219, -555, 203, 521, -183, -425, 395, 704, -392, -609, 85, 625, 158, -891, -210, 375, 273, -339, -347, 378, 182, -308, -485, 620, 370, -517, -624, 386, 603, -289, -529, 193, 529, -98, -533, 255, 690, -114, -867, -223, 824, 227, -752, -441, 424, 382, -543, -360, 284, 251, -474, -792, 137, 738, -128, -740, 245, 870, 271, -583, -176, 445, 269, -602, -220, 775, 194, -449, -334, 636, 628, -321, -361, 299, 417, -230, -514, 320, 327, -518, -495, 223, 794, -102, -852, 90, 601, 61, -653, 111, 653, 366, -538, -224]
6064b24Q16M8j110j11J303j03j193k18R84L56o31m98M66P56p12n90Q82N48p45
6083B4o72N14P42j0j023o5R67j79o50J2P33K71r41m47J038M07p88o79R11K51k48
6104A68p94K67P41k38o73L65O10k71p41K53P40l6o69k91R92j95n38P5L72L42q52
6125c73k10Q16L81o62o81O40N84l67o91K09R56n03p87P5R24n4n98l76J210J09
6145F02p27m55M04N76n74n02P35M41m28q64Q96N58m16o80K7J032j15q76J46P93
6165E73J88j421J06R88J27r61l43P63Q06q42p95P40P58o70p42N93O14j47r40K46
6185c59Q18j25q55R9J293k84j154L41O71K84j058k82P33M82q09l54N96P57p33
6204F1q61L15J024j97j240M82P73no62p7Q27J10q81M0Q67N5o31p07O09O97n22
$$ y = [-224, 592, 640, -470, -581, 722, 619, -574, -792, 192, 548, -83, -581, -115, 641, -71, -661, 221, 769, 24, -648, -134, 608, 598, -425, -490, 477, 298, -352, -340, 393, 664, -277, -724, 314, 721, -67, -746, 165, 416, 168, -626, -359, 382, 144, -529, -164, 446, 175, -566, -313, 427, 391, -278, -569, 423, 228, -310, -235, 137, 479, -373, -583, 233, 614, -48, -729, -89, 495, 128, -563, -354, 602, 99, -688, -613, 311, 257, -341, -717, 493, 602, -125, -580, -176, 400, -174, -676, 59, 500, 72, -792, 104, 662, 246, -434, -407, 625, 510, -366, -220, 573, 761, -660, -554, 434, 561, -400, -743, 20, 826, -16, -811, -71, 687, 17, -725, -132, 482, 335, -605, -359, 459, 334, -521, -422, 871, 587, -567, -226, 445, 729, -329, -611, 122, 604, -205, -559, 37, 794, 61, -800, -485, 539, 342, -898, -416, 357, 352, -310, -387, 440, 550, -331, -291, 576, 631, 0, -707, -98, 599, 77]
6225G7n91M35O17m58o77K55Q35l30q28N90N26J58j069q8R80N9p75p1M57N53r34
6246b79p1M66O60p66p08O81O98m28p92L06Q37n5j014J14O44J92j070j12J193J69
6266F65j121m14J147N49r57o35Q07J59j86r03Q00P58m48q75M64O83n4p89k40J012
6286D22J26p51k15O41ll18j98M72L49n50p15M01R44p43l58M08K70p2n40L33O69
6307E72n75n67J15J090k06o89k7O77J40m69m78N49O29j013k78O80N32m20q53M5
6327e46J080j48j007R4R60p3p43J91M86M56j064r1P44L92p50n14M10R61n73l98
6347a33Q0O03m92n11J69R00n22o76M26O16O8j096J83O04L23o85k46N96J93q27
6367d27k0M39L61n74j18K42O85m63o13M66O68n95l87L24O10j05j276r2J536l9
$$ y = [77, -514, -79, 538, 80, -597, -342, 493, 163, -665, -75, 451, 609, -460, -548, 432, 491, -284, -355, 102, 655, -279, -350, 116, 776, 10, -698, -17, 681, 253, -539, -233, 604, 549, -465, -351, 293, 485, -585, -697, 496, 665, -456, -870, 277, 826, -131, -766, 41, 200, 14, -889, -89, 669, 221, -654, -190, 493, 439, -350, -590, 422, 548, -203, -418, 223, 220, -98, -296, 176, 525, -25, -740, -339, 605, -138, -496, -88, 182, 110, -430, -97, 572, -3, -570, -455, 635, 429, -260, -287, 390, 530, 61, -417, 132, 761, -252, -530, 150, 682, 262, -591, -546, 534, 386, -621, -527, 433, 360, -383, -192, 294, 750, -314, -405, 339, 731, -19, -533, -123, 838, 265, -133, -53, 550, 58, -453, -284, 616, 94, -582, -156, 460, 528, -568, -385, 219, 542, -143, -389, 207, 400, -427, -447, -8, 353, -221, -339, -97, 588, 125, -488, -22, 646, 51, -336, -12, 598, 493, -783, -875, 661, 622]
6387F22q41n07O30N43n87n39O96M22o75m55O33N60k93o52O8P07J70r41J43Q23
6407E27k23m94l79R97K38j119j2O55M02o35k05J34K86k0m25K41J29k1o08K74Q10
6428E52m9r44J70P07n7q19L5P19J10q39l1P73J78n41q42J027M16n51o03L40Q03
6449E54o35l00M69K57k76p99M26P39r3q48R5M94M19m19n54M69O29q60k05O90M88
6470G40o14p89N10N93j18r00K46Q49k36o81k1O21J46o48j00P27Lm51o12J006J31
6491D02m82k40L85M7k18l69M40L59k17l91K40M20k36o84K17N88K95p39k58R93
6511E52J15q89l13N92P59r40n43Q02N45o58m69M12M97k29p90M54P20j63j027J
6531e72J072Pr77k29Q94L45n97q67J142J98k80o80M57M36l94m25J91P13l10o25
$$ y = [622, -219, -726, -96, 447, -140, -679, 17, 439, -236, -691, -58, 502, 209, -443, -375, 332, 502, -439, -296, 527, 304, -190, -569, 428, 666, -453, -465, 190, 592, -43, -248, -114, 172, 152, -273, -32, 97, 76, -532, -258, 552, 503, -441, -271, 436, 379, -440, -405, 314, 424, -415, -446, 327, 505, -36, -878, 149, 565, 14, -589, -249, 554, -81, -381, 88, 345, 69, -730, -304, 435, 342, -506, -411, 83, 502, 83, -471, -2, 627, -233, -438, 252, 740, 126, -663, -153, 440, 322, -578, -332, 517, 281, -400, -421, 200, 346, -302, -402, 325, 328, -123, -735, 271, 402, -80, -320, 65, 112, -106, -475, -35, 324, 107, -284, -44, 376, 140, -544, -327, 261, 556, -183, -441, 552, 667, -222, -535, 57, 816, -124, -667, 135, 680, 22, -447, -35, 462, 233, -557, -103, 617, 454, -573, -572, 500, 507, -470, -699, 195, 540, -57, -924, 218, 416, 136, -544, -87, 349, -45, -470, -279, 434, 124, -501]
6551e01K42M42R8l80l07P52J91j005K15P09L5o73m60R64J30l64m99M09M56k22
6571B32p83O99K53l25p98M60P17j97o37N6P18R9q48P0M45J50l35n29Q63K33n17
6592B6n64M53N94m44o84M60P81k42p65J42O78l32o44J31Q15J09p55l36Q06K15
6612D44o78m85Q74K48l95n33P61K95n94j96L98N00l01p24J54R16j72o89k02O84
6632C05Q5n56m59O09L98m99l21K73O72n62m26L54O83n15n35M63O14m55p31M51
6652a52N32P5r54L37P53j65o51k70Q18N7l41n35K19Q76l46n77j31P19j84o06L21
6673b05Q05l93p05K11M64L60q87o9O59J39n87k31N86K40m37m79N92K85k61o98
6693f11M48M90l64n52J17J071k75n62j09N98K32r02J37O00j04n19l04Q56L14m74
$$ y = [-501, -259, 183, 281, -99, -406, 346, 537, -468, -253, 456, 491, -182, -642, 322, 452, 88, -411, -2, 454, 232, -551, 148, 401, 76, -722, -262, 455, 258, -379, -323, 395, 494, -354, -284, 161, 311, -24, -553, 310, 543, 26, -538, -85, 509, 65, -619, -159, 622, 380, -385, -243, 435, 103, -541, -410, 405, 514, -241, -577, 229, 444, -234, -719, 155, 403, 8, -525, 236, 531, -63, -259, 139, 639, 338, -386, -232, 684, 512, -177, -379, 305, 390, -166, -625, -16, 382, -117, -438, -165, 507, -55, -481, -127, 556, 41, -494, -31, 583, 128, -603, -152, 380, 455, -499, -162, 591, 426, -225, -495, 323, 380, 39, -496, -277, 599, 253, -324, -455, 264, 80, -526, -205, 600, 207, -498, -287, 177, 537, -350, -419, 240, 379, -208, -439, 147, 387, -50, -529, 63, 348, 87, -611, -163, 327, -37, -589, -472, 599, 324, -238, -347, 251, 483, -419, -282, 318, 214, -305, -609, 247, 561, 87]
6713H7o15P52N10l43q99O30K92r6m96q8O21N7p57J22P20k5o00o91R50L22o11m17
6735e75Q05J83m89m39Q27L63o17n08j11J001j90o76J15Q15n9n41k09Q26k27l51
6755e7k69O91J57q08l63N03N66l91j90J00K05j74m28N81L52k43q08L11P27q3m78
6776i9k61Q87n1r82K39N14K13n81k26K76P59n37q50P65L56k49o31Q7R05l39o47
6797d52K88N29l4p03M7N05L79p64k47K08M99m39k04N28M62k40j193P30N15l31
6817H3m13jO87r5n72K97M30j05o02J4N83L05p40j80K69N81l76o88P09J38l66m38
6839d80N45L70m80m02L10M22n5o46R5O37n8o75j9O76km67n21R01J14k82o75N51
6861a41N34l97m93M16M89k86o32L55N06k16k84m34Q49K36o82l7M04K33o05k05
$$ y = [87, -528, 224, 734, 391, -508, 122, 414, 318, -178, -266, 355, 412, -345, -223, 497, 472, -128, -819, 131, 453, -158, -575, 230, 413, -76, -515, 312, 675, 58, -450, -561, 440, 250, -426, -311, 504, 445, -96, -305, 521, 294, -57, -326, 365, 522, -286, -649, -146, 420, 29, -161, -61, 144, -30, -458, 123, 475, 232, -576, -265, 462, 379, -99, -360, 527, 476, -506, -267, 247, 460, -121, -347, -71, 688, 151, -699, 66, 422, 173, -458, -371, 534, 195, -452, -164, 365, 331, -372, -325, 180, 559, -205, -452, -244, 255, -184, -388, 140, 602, 362, -831, -101, 414, 83, -330, -331, 356, 261, -311, -14, 416, 311, -291, -277, 306, 611, -129, -309, -40, 541, 165, -523, 186, 324, -42, -480, 65, 435, -45, -447, -137, 285, 230, -416, -321, 316, 258, -417, -436, 240, 238, -229, -750, 151, 265, -17, -692, -141, 393, -4, -497, -81, 408, 122, -510, -155, 351, 135, -149, -583, 266, 502, -180, -217, 187, 420, -185, -390]
6881c90O10ok85n00M62P89n06n18P6O63l29l85O9P15k62o36lP87j14o45l5N10
6903F7L24p56K56K31M96q99j61P94K6m62j62N8P33o86l96M64L44k02m81M14K87
6924B89j28m87k30M98L00m40l71O80N65n72n60L64N38l44m38J42N65k02n54k8
6944d13Q18m9p53j93Q04J25o06l4O87ln24k97M73L06k36n04M04L16k61n24M89
6965B5M92m92l02K26L48K2o39J87N05j8o70k01Q17j44k45l69N37L73m21n13N09
6986B7N96n89n99N55L65j17o23J70N79k14n61J17N95J47o48k70M87M17n07n25
7006e98O49M46p57j73N76M77o02o93L92O75n1n48k64P20q7m79K99J86J2k78j62
7027b60N70J90p06k44N64M86o31r0R3K65n8n84K81M57k45m79N6P20J10j083l0
$$ y = [-390, 220, 214, -71, -571, -109, 680, 174, -344, -268, 395, 66, -319, -250, 465, 203, -433, -436, 351, 237, -408, -443, 67, 391, -365, -109, 122, 618, -281, -442, 352, 378, -84, -246, -188, 545, -141, -537, -73, 271, 69, -412, 2, 289, 161, -326, -556, -58, 242, -198, -569, 111, 676, 104, -456, -92, 446, 102, -336, -194, 371, 169, -385, -413, 405, 356, -397, -590, 214, 339, -267, -301, 386, 383, -141, -438, 35, 341, 105, -399, 5, 321, 60, -464, 25, 517, 25, -277, -51, 297, 319, -320, -133, 372, 354, -316, -517, 300, 156, -89, -458, 79, 452, 31, -482, 27, 623, 34, -565, -10, 355, 238, -385, -215, 364, 150, -411, -294, 301, 448, -200, -470, 17, 434, -73, -598, 51, 497, -260, -433, 143, 620, 18, -675, -283, 392, 341, -207, -471, 249, 162, -317, -18, 168, 180, -98, -260, 310, 500, -206, -450, 114, 600, -31, -121, -28, 237, 179, -405, -124, 333, 88, -391, -335, 385, 495, -588, -618]
7048f18P51K08l50k47K80L78n68l74M57N15m99n05O25N14m93k81J3N44l01o46
7068e97M11P71k36q36j11Q72K35q62l9J37N88l38l25M96J52l04n86O02M03j34
7088B99p10K10P67l50m96q1M33K26n14J06L40J31n26PL60K48n81l36M04L93n07
7109a77r1K42L27l62k24L56L06o2p31J91M61K01o62j46N25J18m59m20N34L84n71
7130b60j65P06K91n49n60M12P41n38n08j13P26K37p79J74O38R7p86l6M62M11o36
7151c5m05N99K89j78n42L04O39l60q13L75O83j16p79Q2O05n4k02m65O28J47p18
7172c16J0N73K9m82l03O30L65n79j96K38O66m75o10J62P08k02n57J30Q37m03o55
7193d30K61N81J41p33k94O51J62l25k99K84N37n33n60M94N65l76m61MN79R4o38
$$ y = [-618, 133, 341, -9, -256, 24, 402, -166, -540, -83, 432, -67, -572, 53, 567, 74, -207, -194, 350, 49, -597, -186, 585, 349, -487, -598, 274, 509, -353, -392, -255, 333, -5, -330, 166, 318, 14, -572, 30, 433, 299, -411, -201, 566, 216, -280, -361, 72, 298, -216, -110, 230, 361, -165, -158, 202, 450, -131, -467, -63, 330, -177, -268, -26, 301, -61, -285, 71, 377, 315, -416, -225, 236, 437, -225, -371, 154, 272, -187, -607, -73, 311, -260, -425, 281, 572, 23, -537, -125, 616, 78, -430, -543, 183, 420, -359, -185, 453, 550, -236, -272, 190, 601, -35, -440, 159, 448, 270, -272, 32, 671, 311, -502, -127, 556, 440, -339, -257, 348, 294, 92, -373, 255, 402, -316, -306, 267, 296, -186, -489, 141, 506, -73, -269, -31, 635, 160, -450, -288, 420, 218, -339, -209, 628, 225, -430, -169, 412, 553, -180, -474, 177, 339, 14, -285, -1, 536, 3, -557, -63, 502, 126, -335, -331, 248, 342, -296]
7214b96P3O15l8l00l23N05j30j88m03Q43L31o39n74O40J06k45n69L98M58k10k63
7235b09J45J80j6m45J50L20K36p14K6N64M3m24l11N12J98k91o02P64K57l80l99
7256c96K46O56m59n63J26P52p2n50p3N64P9o63J10M57J30m34k65N55L04o25m31
7277e52M00O20m32l62K09M97m66j33J45L60r9o02L64K43j76k66j10O51Nn25k43
7298d72O11Q9m81j8L76M22m41o06O02K46Qo71K52L46j67n86L64M22J37m95j06
7319a68K60J78l77k93N05K55j05o85L76L81j99o39M64O99l81m49N0M67p2o56K02
7340a87N81m0m07j46K57P25r39p4K52L02k32j99J16M21j80n98L37L83p8m68M1
7361a33K67P7n23J3M73J91n26j82L46K38l43k23O77K79p99j21L32M34m07l53P7
$$ y = [-296, -223, 392, 354, 54, -269, 236, 106, -82, -485, 358, 689, 50, -524, 116, 222, -23, -592, -194, 264, 54, -209, -64, 116, 100, -345, -195, 125, 361, -353, -327, 237, 280, -144, -455, 57, 255, -36, -638, 126, 383, 3, -396, -150, 506, 47, -516, -390, 362, 290, -260, -333, 231, 310, -353, -243, 214, 344, -90, -355, 200, 504, -121, -552, -152, 468, 36, -326, -117, 380, -86, -219, -74, 286, 187, -415, -51, 192, 16, -250, -360, 291, 296, -229, -472, 139, 228, -253, -271, 105, 527, 86, -520, 82, 328, 336, -335, -83, 263, 96, -490, -126, 296, 433, -62, -168, 92, 270, -107, -400, 105, 360, 255, -430, -54, 327, 128, -511, -47, 652, 271, -178, -128, 339, 267, -389, -187, 394, 354, -53, -199, 58, 783, -156, -230, 22, 324, 92, -107, 9, 430, 250, -348, -11, 372, 294, -174, -133, 134, 211, -312, -299, 174, 365, -161, -343, 3, 241, -102, -325, 352, 631, -168, -289, 43, 477, 70, -283, -206]
7382b06N18k76m29K28O26k91m56j12N69J42o30r8O34P4l39l64N17L65o33l95M96
7403f0O79m65n85J55O24k13j87r3M37j47m03RN37o7o14L0N59L15p81J83L14Q1
7425C08n08q7J64N71n42j35P9O65k57m18N3K90P2n69J76L85j43j82j42L26L75
7446D81n16m84Q15O4k78n35L39K63j02l82J10N04m6q11K49P05M2o06l3N70k16
7467A33k67k37M89J53j13o05N39J03k16m51K04O99l68n24L75L65l00l00l3Q80
7487E26m74k25l47Q05p3m87j99N28M76o18j85N05n2j38k42J52N36l23m28r0J010
7508F57o12m64L32M97J17q40L3M12j76l7j70L25L01l95k20K27K95k39m03M50M27
7529E17k75n44K64M15j03n86J29N00o7o26jL94N35p82j89O52k8m70k24N50K04
$$ y = [-206, 312, 36, -393, -165, 461, 170, -286, -398, 171, 313, -317, -415, 219, 293, -46, -410, 107, 472, -161, -556, -60, 619, 154, -431, -276, 348, 135, -52, -145, 292, 145, -258, -249, 288, 221, -393, -363, 196, 511, -270, -87, 227, 308, -200, -287, -123, 448, -94, -229, -150, 515, 258, -160, -107, 183, 255, -314, -138, 247, 104, -78, -220, 106, 481, -35, -519, 296, 360, 82, -453, -114, 149, 47, -335, -225, 279, 233, -578, -329, 376, 418, -188, -221, 349, 133, -134, -371, 118, 271, 158, -447, 92, 195, -21, -472, -268, 431, 63, -461, -86, 279, -21, -321, -354, 526, 52, -173, -520, 285, 212, -275, -474, 54, 530, -88, -273, 232, 180, 42, -200, -48, 488, 165, -263, -353, 657, 45, -419, -87, 410, 527, -313, -280, 132, -44, -81, -251, 74, 375, -20, -240, -13, 282, 43, -360, 90, 517, 242, -302, -38, 377, 274, -312, -183, 317, 250, -376, -377, 17, 552, -230, -419, 233, 205, -265, -489, 61, 265]
7550B65m29j75N6N83j32m81K75J63Q1m50L37L02O4q85L4N36lk16k96N00M08l80
7572A57n86L20L37k38j36j60O91l32m83K88N30j16n72L72M08lo34J92J11K03m91
7593a42k96N21M81n22l82L81K93m09l27J3R56n34l73JP31l70j60j6L85J16n99
7614b52Q5N17P4p53j00M76L43l43n26O23K96l08m16K16K51j38n79K81P70l20l92
7635a95j28L36K30k82j94O8N94m17j73K44K41m47k40J73M61k30m03L92L23M4p90
7656c93J35N86k53j89l82O06K48o27q0O57J70l53m65L70N20m81n55M48L91q8m64
7677a99k5L09j00l47K25L61J75p06l4N77K21p88j9M62K72k43n29L99L16k07m68
7698c48K49N52m68m39K48N18k01k85j50N24P9m60l16O52K3q5m59M71N51q43k81
$$ y = [265, -164, -339, -283, 300, 168, -313, -38, 125, 206, -244, 93, 395, 459, -426, -392, 144, 141, -75, -371, 129, 537, 157, -429, -109, 228, -10, -146, -306, 385, 53, -430, -142, 388, 272, -300, 72, 480, 477, -157, 35, 146, 349, -142, -438, 83, 564, 42, -340, 41, 334, -75, -402, -389, 567, 33, -340, -339, 392, 22, -138, -154, 231, 347, -252, -167, 350, 424, -329, -429, 47, 390, 47, -479, 144, 440, 132, -284, -68, 183, 45, -534, -253, 517, 197, -195, -323, 13, 243, -39, -233, -165, 429, 12, -161, 83, 324, -123, -363, -190, 271, 41, -362, 30, 353, 397, -393, -258, 328, 75, -114, -496, 110, 358, -269, -349, 308, 478, 125, -340, 30, 550, 69, -486, -38, 353, 265, -199, -224, 85, -15, -362, -137, 224, 399, -307, -341, 236, 457, -331, -350, 112, 384, 141, -388, 11, 327, 120, -348, -99, 453, -15, -454, -206, 312, 111, -174, -324, 200, 279, -181, -497, 155, 178, 93, -366, 105, 656, -187, -468]
7719d68O03L59l50o03N88L10j38n73pN62n3p78L98P40k21o92J80K57J96m00o1
7740a51L31L79q53j29M82L38l83l33L36L12k87l93J18L32M09o98l21O74K42n24
7760a19m42O24L14o21p0K56L96k01m95M40J32m4m96Q9M55l75j10J13N32J12o29
7781a39n7M72K02q56J53L43M7m40k29M89L60l84m14N52J75r9n17K59L86m73m6
7802b16KN24j62n65L65M13n1m46m25P33L02o21j61K66J71k90k11K21P18m82k26
7823a41K21L05k23n34J25L69J79o18J83K36J92m05l78N75J14k83j88K97J96j82
7843D0m33L98N27n54k31J31K91l01j79J2P53j75n49r8M02R3j93k58M69mm51K08
7865a02R7L85k91m54L81L59l44r8k77Q19m56j46j39M08R1k81n37R82m9m92n13
$$ y = [-468, 135, 494, 144, -459, 129, 439, 301, -272, -279, 283, 230, -548, -150, 590, 369, -323, -143, 114, 310, -90, -151, 180, 559, -294, -423, 59, 397, 14, -319, 17, 329, 42, -351, -233, 99, 508, -190, -511, 163, 405, -119, -561, 63, 377, -244, -314, -58, 338, 137, -358, 82, 214, 170, -326, -237, 218, -157, -267, -154, 378, 490, -139, -196, 276, 478, -378, -225, 118, 165, -275, -504, -15, 345, -39, -453, 99, 274, 175, -342, -83, 303, -170, -216, -214, 310, 148, -417, -52, 361, 310, -136, -561, 172, 474, -147, -308, -42, 129, -161, -372, -151, 567, 85, -141, 80, 385, 162, -372, -247, 122, 301, -317, -134, 102, 294, -111, -489, 86, 200, -83, -271, 26, 222, 40, -393, 5, 532, -22, -253, -122, 169, -132, -311, -299, 454, 279, -270, -368, 34, 127, -66, -324, 145, 141, -310, -102, -5, 380, 89, -365, 16, 375, 31, -67, -344, 475, 19, -127, -266, 142, 233, -48, -585, 397, 348, -144, -657]
7886f57P01J84m14k37N94K40l30m84M57M62m46m92M51K50k07k38j87O69j48k70
7906a02k42N42J85m81k64N59Qm12j20M84J35j32n03N66J35l63m14L08M42m0n61
7927b70R5L90J27o85K4L63J42k98k36N02K57o72l00L72O83m97k48J33L67k39m01
7948c91K87M68l20k22m6N21R1p32k0O10rm22k38K27M33k44k96K94L57j36n79M67
7970A00M28n24k12j55O01M8m01j95P25k67n25o6N09K87n65j01M15K54k40m22L34
7991B8K44l96k79N34O2r4k80k60M74J11n82L12L75N5l79k44J60O31n91l27M85
8012C9M71j24p99N75L06m49j99J72M45m36j78L5M73M0n69J46K72J29n75k52N49
8033G1K49m51l83O68K49m93l33O68N1l72k65K08L91R7o46J23M98j6o21RM62N2
$$ y = [-657, 44, 228, -186, -423, 171, 411, 81, -403, 54, 516, 70, -422, 29, 279, 72, -166, -353, 316, 168, -102, -344, 198, 383, -98, -362, 197, 205, -207, -327, 157, 292, 160, -343, 223, 358, -5, -419, -111, 331, 291, -270, -175, 215, 342, -343, -319, 44, 186, -112, -348, 154, 411, -261, -561, -189, 494, -3, -251, -118, 249, 10, -391, -104, 364, 44, -178, -224, 297, 388, -344, -364, 246, 237, -185, -423, -196, 237, -7, -303, -9, 348, 212, -367, 100, 528, 4, -208, -363, 238, 286, -115, -310, 415, 148, -377, -443, 66, 353, -212, -313, 102, 356, 116, -306, 28, 272, -124, -403, 131, 193, 99, -181, -441, 33, 144, -438, -126, 249, 304, -75, -319, -159, 472, -119, -446, 39, 510, 386, -413, 162, 468, 19, -180, -8, 437, 1, -177, -142, 331, 371, -198, -52, 220, 349, -226, -478, 71, 320, -131, -514, 154, 403, -90, -423, 245, 296, -76, -341, -133, 258, 355, -291, -168, 330, 314, -307, -298, 164, 216]
8055B16l40jJ80L55m99l32L45N82m76l82L64K37k4o26L80M57k41q53L08M80N0
8076A80m05k95P13r4j89m06O47J74l39r9K22j15l6l34L85N20o37l87L79L10J10
8097C04p12M17M37l75k98n3M38O7m29r2K91K59j14n80M60J32k29m88M92M89j68
8118B48m82L46L70k20n26k2M87J9m40j24N82J64l57q8J54J62m25ko3O59o45r2
8140b95K10M78J07p12K22J34j01r6j34M01pn71R0L83O5k46k86N31R5j94l83K47
8162f2N34l91k23J52J56k32k30J29O59n49l77K92K48K79n71J0J05M19l36k17M73
8183B68M8n27l20N01L90l77l66J32
$$ y = [216, -124, -125, 55, 410, -89, -421, -76, 506, 30, -352, 12, 249, 225, -401, -21, 436, 195, -658, -350, 130, 180, -225, -520, 193, 99, -90, -496, 151, 325, -14, -113, 109, -6, -42, -376, 9, 529, -108, -495, -116, 194, 304, -408, 9, 446, 71, -227, -280, 158, 225, -204, -296, -5, 254, 140, -440, 20, 152, -77, -565, -73, 416, 248, -234, 112, 482, 262, -264, -286, 201, 220, -220, -344, 238, 402, 45, -43, 111, 273, -152, -154, -217, 442, -203, -295, -85, 393, 500, -212, 10, 144, 43, -53, -187, 214, 207, -364, -274, 109, 174, -72, -358, 173, 268, 74, -309, -62, 472, 81, -142, 10, 166, -66, -296, -167, 492, -57, -434, -142, 106, 385, -186, -176, -71, 348, 12, -205, 268, 316, -211, -531, -30, 360, -17, -383, -251]
8191b51
$$ Imaginary data points
##PAGE= N=2
##DATA TABLE= (X++(I..I)), XYDATA
0@%%%%%%Qq%qJ6j6J6j6K4l2L2m0N6o4P2r2J08j20J44j74K00k30K66l04L47l95
32b10M46n03N70o41P18q05Q99j002J115j237J370j517J678j852K041k249K480
49A301k734L009l312L654m035M460m944N498o135O878p761Q833j0161J1850j4090
64g689J7210k1847K9451m4053Q1759l56212q10357Q30091J079390j73015r11458
75b86730j89142M42411J63452j57209J73671K24161l94947o11614K64174R03050
85E31277J84695q50916n96224M56405P19739o634m84130k27015J01358J02311
95f9134J18529J88877l4296l84015k19546L38724M37822r4587m27698j37427K15808
106f6943J60292N701J6937n5673k36976r2911L31271L33254k31364m87420K4386
$$ y = [0, 0, 0, 0, 0, 0, 0, 8, 0, 0, -8, 8, -8, 8, -8, 16, -16, 16, -24, 32, -32, 40, -52, 56, -64, 80, -94, 106, -124, 142, -162, 185, -210, 236, -267, 303, -338, 380, -425, 474, -528, 587, -650, 720, -797, 881, -971, 1070, -1179, 1301, -1433, 1576, -1736, 1918, -2117, 2343, -2601, 2897, -3238, 3640, -4121, 4712, -5449, 6401, -7689, 9521, -12326, 17125, -26928, 54831, -301381, -1111738, -281647, 797743, 624728, -286730, -475872, -33461, 129991, -27218, 146453, 370614, -24333, -635947, -371773, 531277, 715972, -134944, -731168, -274763, 444976, 438342, -45788, -272803, -171445, -69134, 49395, 238272, 203976, -180039, -399585, -60861, 376961, 282374, -145324, -282751, -66943, 93349, 99050, 115987, 60314, -176662, -269573, 61698, 394952, 163588, -323832, -299446]
117b99446M71710J30675l64485j71472K79028J31045k87985j16479L56197J91924
127C20712l95360l29194L50813M53028k32066n08616J03692N11010L33m95621
137b21269q5660M79259J76714m43334k72030L73224L46582k69636l65151J75566
147a05735L40603j30571l28986J09445L50254p6381m00203j3662M21372J51548
157C17684l55265k58808K14442K67641p3825j76792J5868N3758p1629K925J83406
168A19405O1368k32341j83653J71334K61038l9465k18314n5675Q1247J7649K4238
179F831J28087K492k68306j63926K80403L50750j40030m32672n9071L62080J78063
190B44701k16447j57544J22614N4445j58491Q949K87134O1103l80035k32355L46332
$$ y = [-299446, 172264, 302939, -61546, -233018, 46010, 177055, -110930, -227409, 128788, 320712, -74648, -403842, -53029, 399999, 167933, -340683, -236991, 274019, 274352, -221269, -306929, 172330, 349044, -94290, -366320, 6904, 353486, 83850, -281301, -105735, 234868, 104297, -224689, -115244, 235010, 158629, -241574, -255236, 166136, 317684, -37581, -296389, -81947, 185694, 111869, -64923, -49055, 4703, -66926, -64001, 119405, 180773, -51568, -235221, -63887, 197151, 157686, -60628, -116303, -35056, -17407, 6831, 134918, 137410, -130896, -294822, -14419, 336331, 196301, -236371, -295442, 66638, 244701, 28254, -129290, -6676, 47769, -110722, -101773, 185361, 246464, -133571, -365926, -19594]
201a9594M03343j83245m61454j1042L79880J18777k45330j03964J67153K3041
211F7565j98988J7667K98714N2670l64968k07625L13210L39773j64459l66982
221b13423K366K81251P5881j56318l8932R6491m1232j28947P7991K10841k8384
232A37585k58164p0547K20828J42514j27391j36051N1348O9029m3954l642R9545
243H1100o918j69598m9494J95701J24871j70151j77727J13683J86561o6270j66658
254a04900N3986J55718o0998j67376O3237K01958l9443k38025j1129K53472P1960
265A78460k39226j22048K09820J57123j74953j76711J43478J87241j16664k02313
275a55793Q4259K10482n4263k14713K5526K16265L237k16774l2260K16465O7337
$$ y = [-19594, 383749, 200504, -260950, -271992, 107888, 226665, -18665, -122629, 44524, 67565, -131423, -113756, 184958, 237628, -127340, -334965, -21755, 318018, 153559, -213423, -211057, 70194, 146075, -10243, -49175, 47316, 6084, -122863, -44872, 165969, 137585, -120579, -191126, 29702, 172216, 44825, -91226, -39878, 29151, -14803, -18445, 81100, 74182, -95416, -144910, 50791, 175662, 5511, -172216, -58533, 128028, 61758, -104900, -50914, 104804, 43806, -123570, -60333, 141625, 102182, -135843, -146972, 106500, 178460, -60766, -182814, 27006, 184129, 9176, -167535, -24057, 163184, 46520, -155793, -71534, 138948, 84685, -130028, -104502, 111763, 115000, -101774, -134034, 82431, 149768]
286A49768k04869j05010J74341J31110j32773j32936J00893J19870q8445j07240
296i5291R8848J19684j06941j54405R0067J86598m8572j96457l024J74071L1806
307I6384j39516l1329J18773J5341j26372r969J53134L1817j75664p7704J69927
318B4822J24489j35180j47952R4154J44958o5232j24235O5265J19016p9956j42169
329a22020Q2410J84206n5020k20943l988K24290O6245j93358j02295J48920J04236
340A12683j20961r2227J18068R0757j32115j15262J31831J54057j03800j82292
350a39261O0534J88179j6915j70737n099J49947J0600j42126r032J48565J4779
361H9434j62523l5548J71649P0190j67411j08134J46173J35199j13613j48387
$$ y = [149768, -55101, -160111, 14230, 145340, 12567, -120369, -19476, 100394, 11949, -95291, 3557, 123241, 16300, -138105, -48038, 138560, 89988, -106469, -109493, 64578, 96384, -43132, -74461, 44312, 59653, -66719, -76688, 76446, 108263, -67401, -145105, 24822, 149311, 14131, -133821, -39667, 105291, 40059, -84176, -18911, 100105, 20149, -122020, -39610, 144596, 89576, -131367, -135355, 88935, 155180, -38178, -140473, 8447, 112683, -8278, -100505, 17563, 108320, -23795, -139057, -7226, 146831, 43031, -139261, -78727, 109452, 92537, -78200, -83299, 66648, 77248, -64878, -73910, 74655, 89434, -73089, -108637, 63012, 133202, -34209, -142343, 3830, 139029, 25416, -122971]
371a22971Q0337J44252o3194j38732O0068J42315n8546j60190M6113J84357j1927
382A01882j94588k9821J83362O6849j57762q4873J33965Q7246j21982q6815J22627
393B0090R8245j23960j21531J14473J47007r1613j65992N4070J69019k1430j59535
404h1157j301J44287R998j34653j0396J39536J6392j53195l6219J62427O9711
415A25430j53249j03057J27160J23871r4485j23846P4188J17533o8920j20264
425i5639P0314J37761o3452j62773L5496J76946R01j74342l4831J58289N3632
436A02302j40375o2388J31231P0161j30906q5143J31481J08361j22220j35016
446a32512J02394J58496p1516j68046M0689J66697j2900j58426o810J50483J9372
$$ y = [-122971, -42634, 101618, 38424, -100308, -40240, 102075, 43529, -116661, -70548, 113809, 101882, -92706, -122527, 60835, 127684, -30078, -114951, 19014, 106260, -15722, -102537, 20090, 118335, -5625, -127156, -12683, 134324, 42711, -123281, -69211, 99808, 78378, -81157, -82458, 61829, 71827, -62826, -73222, 66314, 82706, -70489, -106708, 55719, 125430, -27819, -130876, -3716, 120155, 25670, -98176, -23988, 93545, 24625, -95639, -25325, 112436, 48984, -113789, -78293, 98653, 99554, -74788, -109619, 48670, 102302, -38073, -100461, 30770, 100931, -29975, -115118, 16363, 124724, 2504, -132512, -30118, 128378, 56862, -111184, -70495, 96202, 83302, -75124, -81934, 68549, 87921]
457H7921j47822l4678J45968N4288j41149p8247J28646R6272j09772j07594R0103
468a6064J11147p6817j13697O7812J18324n7982j26100M6023J37421k8753j45150
479h3836J0500J51923J1061j52711l4534J48763N6563j38771p4619J24075Q7251
490A05665j11215r8735J01121J11153r1749j27255P4394J41541n2573j49860K8159
501f9354J48454q308j42077n145J38641J8331j37365l2727J37605N2556j31888
512c1277p3281J21530R1695j06871j05159R1296J13939p5506j20708O0107J25627
523I1392m6311j30744K9706J34461j3974j38227n209J39158K3868j35826m1535
534i3241J29730N8494j22185p2494J14728Q8226j03541j03332Q9905J16589p2494
$$ y = [87921, -59901, -94579, 51389, 105677, -35472, -113719, 14927, 111199, 1427, -106167, -16064, 95083, 18266, -95431, -27619, 90705, 32723, -93377, -47354, 90067, 61314, -83836, -73336, 78587, 89648, -63063, -97597, 51166, 107729, -31042, -105661, 18414, 105665, -5550, -104285, -3164, 107989, 16240, -111015, -36621, 104920, 52347, -97513, -69354, 79100, 70792, -71285, -76430, 62211, 80542, -56823, -89550, 48055, 100611, -31277, -104558, 16972, 108667, 1796, -103363, -12067, 101872, 26366, -94342, -34235, 91392, 45081, -85663, -55957, 78504, 64530, -73697, -78906, 60252, 84120, -51706, -93241, 36489, 94983, -27202, -99696, 15032, 103258, -283, -103615, -13710, 102879, 30385]
545C0385j25255N6100J31368m0149j37652K2516J44990k092j48370k3762J41522
556D9601M6236j28825o2307J13997O9665j05509p7660J01406R3464r2092j14463
567a06487P2094J30859m1866j31192J4114J18994J278j02963k338R7449J173j02287
579e1172q274J10843K6913j11746n0596R8196O4724p9943o6471O7526N8953p0770
591a1817n6569Q2408P0867r0505j00195Q1277J30583n2164j44601J5938J39083
602F4305J0705j23009j7811J16508J8556j25624k7971J41150N9523j43876j01981
613a29525J19568J31514p7524j37317L9549J22110k5275j08562K8064J13312k7988
624D7926j35123O251J51548L4491j43670p3692J10770R2066p1260q3062N0667
$$ y = [30385, -94870, -38770, 92598, 52449, -85203, -62687, 82303, 80211, -68159, -91921, 49601, 95837, -32988, -95295, 18702, 88367, -17142, -94802, 6604, 100068, 7976, -106487, -34393, 96466, 54600, -76592, -62478, 56516, 57794, -45169, -47507, 49942, 51115, -51172, -59446, 51397, 78310, -33436, -84032, 14164, 78888, -1055, -67526, 0, 58953, -11817, -68386, 14022, 84889, -5616, -105811, -24534, 106049, 53885, -90716, -74778, 64305, 75010, -47999, -65810, 50698, 69254, -56370, -84341, 56809, 116332, -27544, -129525, -9957, 121557, 44033, -93284, -53735, 68375, 43100, -65462, -37398, 75914, 47926, -87197, -80946, 70602, 105093, -38577, -112269, -1499, 90567, 19307, -63755, -13088]
635a3088O5432n1436n9032O2375P4978o2584r9099M0536J10773p756r9447j5690
647e4038P1637J3945n0842O626N2558k4924p7919J9896J04406P429j11835l9751
659h2812R5441N6383p2073n0001O6308L8822q0841m4258J01683P6689j02692j19084
671a16435P4101J46185k9627j44360o101J25022J8187j12657j6486J18792K2748
682G9369j36922n4517J41242R9940j18055j35754P1241J43211k4714j23867K715
693e6111J00836l340r3169R353J06110K114j21689l3499J17176O9752q5527q5285
705g3279M4422P0887j9971m1716K5151K2264n0467l2896O6819O2094n7634q5545
717f9871K7268Q1399j040n4591K748L2326k8875l7776N4302P2187n1407j09767
$$ y = [-13088, 52344, 908, -58124, 4251, 79229, 16645, -82454, -41918, 68855, 61099, -38348, -54038, 17599, 31544, -19298, -12672, 39886, 14962, -62957, -43061, 61345, 68774, -43061, -82812, 12629, 69012, -3061, -53062, 13246, 52068, -28773, -73031, 28652, 105341, 2649, -116435, -42334, 103851, 74224, -70136, -76237, 48785, 66972, -45685, -62171, 56621, 79369, -57553, -112070, 29172, 129112, 11057, -124697, -53456, 89755, 65041, -58826, -56111, 44725, 41385, -51784, -42431, 63679, 65793, -55896, -89395, 27781, 97533, 12006, -73279, -28857, 42030, 22059, -19657, 5494, 27758, -22709, -55605, 11214, 73308, 15674, -69871, -42603, 38796, 37756, -16835, -14087, 18239, -10636, -48412, 5890, 78077, 26670, -83097]
729h3097J8212J25052K4019j08931m5741Q2642M2074p2737l0630Q7920L5370j11920
741c7767p0829J15258J18959q6152j53634L5295J55315J0350j31149l1167J06089
752C0568K8727j00841k5064J13618M2766j23865q1087J11457J21141o9070j34350
763h6000J9240J15581J2221q2300j1563N9742p665o5452J5989Q6862P88r8164
775d0721l4453Q2006N6737m6786n0793J8988K2051k1754J768M9361O26p4980k7849
788f5799P8617N9329n7534o8294L4530N5709k8154m2169M2968M7724o0647p6822
800h0542N7772J11879k7935j30677j3858J22560M3823r9295n3460Q0612M7476
811E8355q1119m9059R3091P0624r5532j05949P5031J36555l3134j40510q948J20550
$$ y = [-83097, -64885, 60167, 84186, -24745, -70486, 12156, 54230, -18507, -49137, 38783, 74153, -37767, -108596, 6662, 125621, 39469, -114165, -78870, 76445, 86795, -44354, -75521, 30568, 59295, -41546, -66610, 47008, 89774, -34091, -115178, -3721, 117420, 48350, -86000, -66760, 48821, 61042, -21258, -32821, 26921, 19256, -46196, -30207, 56655, 57443, -40721, -75174, 6832, 63569, 16783, -34010, -15022, 7029, -14725, -12957, 36404, 37030, -37950, -65799, 12818, 72147, 14613, -53681, -19151, 36558, 8404, -33765, 9203, 56927, -3720, -80542, -22770, 89109, 61174, -69503, -83361, 39199, 83022, -16273, -69733, 10879, 58355, -22764, -71823, 21268, 91892, -3640, -109589, -34558, 101997, 68863, -71647, -80595, 39955]
823C9955L0847r3467l0077Q1913K3132q9932k9645J01730N7244r5856r0285O5682
835b8759J04321k7537r2937J091O6115j270m8333J5876N2553k5116o8453J4909
847c7540Q0194Q259p3297k5175N3439K4241l8317q695M2443k784o2051j987Q2880
860D1610K5659q7429n4491P3062P0837n1900p2179L7168O4442l6992o6037M3085
872a3165Q2120l9749j05570J8837J19696J5268j15289m4473R4896N7018p3646
883d057n4449O6025N2768o9215o1925P1748Q4594n9181j05874L1371J11243j914
895F1134j01304j6883Q3784K0793p4004j9588P4808K4562p9239l9547P5424N6890
907F6830o1527o7946M3221O7137k8900n9195K5339N5053k6737n7268K8398O6182
$$ y = [39955, 70802, -22665, -52742, 29171, 52303, -37629, -67274, 34456, 91700, -4156, -94441, -28759, 75562, 48025, -44912, -43821, 22294, 21024, -27309, -11433, 41120, 16004, -52449, -37540, 42654, 50913, -22384, -47559, 5880, 30121, -8196, -16891, 25552, 22768, -39283, -41270, 41610, 67269, -20160, -74651, -1589, 69248, 17348, -54831, -17663, 46779, 9787, -56250, -13165, 68955, 29206, -76364, -57527, 62169, 77437, -37852, -82325, 12571, 69589, -4057, -58506, 7519, 60287, -8928, -70853, 895, 85489, 26308, -79566, -48195, 63048, 61134, -40170, -57053, 26731, 47524, -26480, -46068, 28740, 53302, -25937, -65484, 9940, 66830, 5303, -62643, -19422, 47715, 18815, -40380, -15041, 40012, 13275, -43993, -15595, 50587]
919E0587k2223p4521Q675P7042N248p3189j4831O6725J8456o4514j9911O7537
931B5081K5277p3086l8766P2585N4559o4348o8061M9374P4767l5516p4257K6677
943b5714P5573j9720q0190J2516Q6728P60q9426j7800Q5955L2986p7095m2831
955e8258O7604M8353n9177n4309N2753O0259m6435o7260L6882P1161k7591p4243
967e0261J8389P5975j0071p6387J672P7811Q669p7400j8620P4664K9318p1070
979a7311l7994O5800M7532n9945n5800N4109O4066m5237p0565L3600P4406k2800
991B9861p5817J1061P3574k102p2200n698P1430J3608p1124k3025P0021L3965
1003E3554o5495m3872N6822N0835m7116n2414L9483N4836l5014n8393L1464O6166
$$ y = [50587, 28364, -46157, -37482, 39560, 44808, -28381, -43212, 23513, 41969, -22545, -42456, 25081, 50358, -22728, -61494, 11091, 65650, 1302, -66759, -17385, 57382, 21866, -52391, -25714, 49859, 30139, -50051, -37535, 49193, 49953, -39473, -57273, 28682, 61668, -15427, -58258, 9346, 57699, -1478, -55787, -3034, 57225, 10790, -56470, -19588, 51573, 23982, -50261, -31872, 44103, 34032, -42355, -40683, 37128, 45797, -31603, -50223, 24441, 53759, -17311, -55305, 10495, 58027, -1918, -57718, -3609, 60457, 15220, -55345, -21745, 52661, 29861, -45956, -34895, 38679, 36577, -35623, -41321, 30109, 43717, -27407, -50432, 19589, 53554, -11941, -55813, 1009, 51844, 4728, -47686, -8203, 46633, 11619, -46774, -15310, 50856]
1015E0856k2914p2968Q508P4020N216o8775j4989O0587J6574n6236j6497N8129
1027B1511K0083o1750l0577O1021M2846n3553n2314M2400N5669l4747n3835L2489
1039a0757N6582l1893o3648K9057P4992j8094q3995P42Q4753J7181p8594l0129
1051e3803O8921L6333o2289m0122O0023M7067n9949n9981N3350P3873l8207q2821
1063e7605J7331Q0957M88p0386q970O1810J0411n9505j1183O4502J9781o6871
1075a9240l4677N9388M7858m3685n0610K8845M3026k2900l4860K6684L5477l3818
1087A488m5615L1377N7341k0682o2959N884N9003L181n1389k189M8018j93n3261
1100b9996j302O2970J2627o8124k9542O3664M5500n1095n2303L8203N2022l2031
$$ y = [50856, 27942, -45026, -36518, 37502, 42718, -26057, -41046, 19541, 36115, -20121, -36618, 21511, 41594, -20156, -50733, 10288, 53134, -419, -52733, -10333, 45336, 10589, -43246, -10757, 45825, 13932, -49716, -20659, 54333, 36239, -47756, -47014, 37739, 54920, -23674, -53803, 15118, 51451, -10838, -50960, 9063, 56130, -3819, -63800, -10450, 63423, 25216, -57605, -40274, 40683, 41171, -29215, -38185, 23625, 34036, -25469, -36652, 27850, 47631, -19240, -53917, 5471, 53329, 9644, -40966, -12121, 30905, 8005, -26855, -171, 35306, 1488, -44127, -12750, 44591, 23909, -39050, -33166, 25837, 29018, -22371, -24560, 23458, 23265, -29996, -31298, 31672, 44299, -23825, -53367, 10297, 55797, 4702, -47601, -9398, 42624, 10593]
1112A0593m9553L1820N3240l3110o5150K5587P7316r065q2580j2482P6221K8864
1124E1701o3792l4825N3841L4810n1444l7321N4005M7779n1323o2357L8571P2676
1136E2321j7194p0916k32O0406P631m9194o114M5563L211n0924p359N5385J7682
1149D0266n3224k9586M3556L4080l2396l0674K6849K4934k9833k4085L5760L2233
1161C7880l8271m4420L3171N4219j9923n6594Q946N2389k770m8474L571M9447
1173B9171k708n7957n278O5310K0684o5713l7326N5116M8279m1637n0701L1951
1185a0809M7634k9102m8945K8640N6686k3161o6522J0698P1532O676o6530j9962
1197d3165N6828K5807m8151k5691M4891K6576m5479l2277M4389M2055l8929m9995
$$ y = [10593, -38960, -7140, 46100, 12990, -52160, -26573, 50743, 41678, -40902, -53384, 22837, 51701, -12091, -46916, 6925, 41735, -9709, -47030, 6975, 54754, 3431, -58926, -20355, 52321, 35127, -35789, -36021, 24385, 32016, -17178, -23292, 22271, 25482, -25442, -32801, 22584, 40266, -12958, -42544, 1012, 35092, 2696, -27978, -1129, 23805, -6028, -30113, 5647, 37880, -391, -44811, -11640, 42579, 22656, -33938, -24992, 27397, 24627, -23847, -20276, 29171, 26463, -31494, -36772, 28538, 49222, -16491, -53817, 1299, 49578, 7941, -42760, -10809, 36825, 7723, -41222, -12582, 44104, 20943, -45579, -34881, 36651, 43327, -23203, -43165, 13663, 39470, -8681, -34372, 10519, 37095, -8384, -40661, 3728, 45783, 6854, -43141]
1209d3141K7952N2510j6848n0681Q651M6247n930m4731M845M6552j907n0242m475
1222c1198N2277J3967m8978k1339M2738K5473l7192k5546L5538K6519l6554l1971
1234c6266L8082M0804l4528m9813K5748N4878j5797n5975P533N3817k557n4385
1246b8459k686N6318J0867n7717k1618N5823L2185m9398l9547M1020M3848l3541
1258G095m4931K7589M6361k1939m7676J6642N0333j1075n1586M904N1667K012
1270B9396n2796q243N0609J4483m8643j9909M5490K4423m3249k9022M1048L4618
1282C8205l8417m1076L3659M7486k6267n2253J8670N5077j0404n4938L518N4939
1294B8199L054n4652r235N4153J6114n3224k4763N0678L3130m5653m1054L7135
$$ y = [-43141, -15189, 37321, 20473, -30208, -21557, 24690, 18760, -25971, -21126, 25426, 23519, -26723, -31198, 21079, 35046, -13932, -35271, 7467, 32940, -4252, -29798, 5740, 32259, -4295, -36266, 1816, 42620, 8092, -41721, -15973, 38905, 23108, -32867, -25334, 28483, 25926, -28459, -31145, 25173, 36040, -21677, -43295, 12528, 44713, -4685, -44232, -3212, 40636, 7095, -37836, -10247, 36114, 14175, -33501, -16859, 33474, 22399, -29187, -24283, 27384, 29396, -23400, -31643, 18966, 33449, -15194, -35103, 10387, 34810, -8439, -37461, 3587, 38205, -212, -41288, -7629, 39857, 13590, -38663, -19993, 35084, 24680, -30258, -26740, 28199, 31253, -23399, -32634, 21519, 37633, -15591, -40354, 10324, 43454, -2199, -43253, -6118]
1306f118M5706k8667m7229K1907M6985j8335m7758J4227N1676q156n4970j386
1318c2118N4487J2747m8658j9197M1427K1335l6945k0490L7557K1959l9496k9094
1330c6486L8627L7925l1815m4525K2129M3850j3829m1325J1037L9548j2727m3008
1342c0599J2074N0120n706n6692n271N8466J7407n3325k5610M6660K9479m2374
1354e371l1071M2314L6452m3039m7240L9589O0357k7967o9498J1441O8619L986
1366C8572o1882j2505N3776J4737n1848j7530N3733K6178n3883m0349M6477N1709
1378D7185l0624n3562J5059M6906p495l7857R150L6390j3156m1747J0509M9919
1390C0677N99n1600j3994M3940K1102l3023j9057K6205J1939k9814q886L8509
$$ y = [-6118, 39588, 10921, -36308, -14401, 32584, 14249, -33509, -19282, 32394, 24238, -30732, -32118, 22369, 35116, -13542, -32739, 8688, 30023, -6922, -27412, 10145, 32104, -7392, -36486, 2141, 40066, 8251, -36274, -14145, 29705, 15876, -25449, -14412, 25136, 12409, -30599, -18525, 31595, 25889, -30803, -36074, 22392, 39799, -13526, -39136, 7524, 37003, -5371, -36442, 5872, 42324, -715, -47955, -8366, 51991, 24024, -45474, -34033, 34586, 38572, -23310, -35815, 17961, 32698, -19150, -36680, 17053, 43231, -10652, -51001, -4524, 47185, 16561, -37001, -21942, 24964, 17469, -20388, -11238, 25152, 11996, -29751, -19242, 30677, 31276, -20324, -34318, 9622, 30724, -2299, -21356, 4849, 16788, -13026, -21912, 16597]
1402A6597J4651m4288k8308M1554L9942l0251m3891J8916M0114j4345l5924J8567
1414f666L9163k2629n0277J8902O4292l635p0405j5980O4357L0504n1331l5561
1426c9266M1511L3250l9730l5602M2669M5992m1236o1842K7542P2473o346p0327
1438c0912j2733N7610K1285m4111j9611L9805J6660m2389k1438M6216L4449m1154
1450C677m6822K6730N0345j0028m2718O76L0380l170k3567J0827K6961j5529l6668
1463b8906R634M3742K187m1843j1856L2743J2229k5399n299K7409M15l8200m042
1476b7186M8675J9238m9572l5768L9247M5472k5021m4231J6280L9021j6438l9259
1488b9542J9289M8448j6340o0972J664O6172J7995n9804l3339M5362L7652l2974
$$ y = [16597, 31248, -13040, -41348, 206, 40148, 9897, -33994, -15078, 25036, 10691, -25233, -6666, 32497, 9868, -40409, -21507, 42785, 39150, -31255, -47235, 17122, 47626, -3705, -39266, 2245, 35495, -4235, -39837, 2832, 48824, 7588, -54254, -26712, 45761, 39415, -30912, -43645, 13965, 35250, -8861, -28472, 11333, 27993, -14396, -35834, 10382, 44831, 3677, -43145, -16415, 33930, 23902, -18816, -18140, 12240, 9070, -14497, -3670, 23291, 7762, -28906, -19272, 24470, 26657, -15186, -27042, 5701, 17930, -7469, -12768, 14641, 15056, -23144, -27186, 21489, 40727, -8845, -44613, -5366, 40106, 15085, -29146, -12866, 26155, 9717, -29542, -10253, 38195, 21855, -39117, -37453, 28719, 46714, -13090, -46429, -1067, 36585, 3611]
1500C611l4668K9043L3217l1509l8787L2059N0781k3035o0132O461O0369J0812
1512C8222m9983k0278L7388J9545k9763j4785L0008J4099l4926k0688L4676L0913
1524C4428k7438l6712J4822L3335o382k3860O044J7325j3163j9450K0050K8854
1536B7853j7946l7989Q046M1074L028l6320p312L0055N658k9777k776L6474O086
1549B6154m3763j7545M4076L1453l6487m1192K4631M1905j5685l8724J1907L8106
1561B4836j2318m2463R410M9828m91n3183j2761N0327K5167m1030l1099L0831
1573b946L1654k4687k9257K3518L0853k4125l5913K0173M1967j1060m5111M54
1585b4480M0370P306l3281r302K7950P128k8005o379L1339J0389l2906j8392L0012
$$ y = [3611, -31057, -2014, 31203, -306, -39093, -7034, 43747, 20712, -39420, -32959, 27410, 38222, -11761, -32039, 5349, 24894, -4869, -19654, 10354, 24453, -10473, -31161, 3515, 34428, 6990, -29722, -14900, 18435, 12053, -11807, -5763, 11562, -1601, -21051, -1001, 27853, 9907, -28082, -20036, 21038, 24066, -12254, -19566, 10489, 16147, -13630, -16406, 20068, 26154, -17609, -35154, 8922, 40375, 3888, -37304, -12673, 29232, 13547, -25177, -13270, 24836, 12518, -29945, -20535, 29293, 28802, -24381, -37142, 13185, 38352, -2678, -33777, -2946, 28708, 4021, -25236, -1718, 29135, 5010, -30903, -10730, 31237, 20177, -24934, -24480, 15890, 23196, -10085, -19387, 8563, 15691, -12314, -18693, 12646, 23035, -9871, -28263, 1749]
1598A749K4767k2773k5899J7167K3350j4641k1287J6394K3277j7646k8822J5143
1610i221L4671r304l6835J878L5608K595l3820n099L3139O864l4960j0784L6340
1623A1072J7540l6043k5095L1637L2035k4889l5593J8318L6994j2766l6761R433
1635a4118L7220n178l8679M1M0145N882l8198j3213L4734J7914l0647k0065K6610
1648B448K1563k5591k3918K3901K7552k1464l1115J6716L3304j1108l4342O921
1660a5133L4373k645l4363j517L5531O269l5093j1107L3380J5612l0779j8506
1672b3978K8015K1620k6318k4591K3179K8184j9120l1593J4336L2436j0013l3250
1684b1093O678L3193l788l3976j00L5270M859l4778j0078L2919J5390l0062j7887
$$ y = [1749, 26516, 3743, -22156, -4989, 18361, 3720, -17567, -1173, 22104, 4458, -24364, -9221, 25450, 16146, -20689, -18811, 16797, 19392, -14428, -19527, 13612, 20476, -14484, -25268, 11072, 28612, -7431, -32526, -889, 31146, 6257, -29336, -11018, 25976, 13210, -23551, -14118, 23102, 17924, -20755, -20714, 19431, 25313, -12885, -26098, 8636, 26550, -4097, -24162, 2448, 24011, -1580, -25498, -1597, 25955, 4491, -26624, -9908, 23396, 12288, -22054, -15133, 19240, 16595, -17768, -19285, 16246, 22515, -12578, -23685, 9695, 25307, -5472, -23978, 4037, 25657, -661, -25252, -2073, 26111, 6991, -24602, -10266, 22170, 12157, -21093, -14415, 18778, 14990, -18986, -19086, 16184, 21043, -13735, -23813, 9106, 24496, -5566, -23453]
1697b3453K6502K0140k3898k1942K2703K4664k1324k8040J8611L1668j4339l4603
1709b3311Q460L4973l100l4271n03L2578K802l3016n987L5320J0671l6106j8109
1722b9599L4379K5022k8938k8706K3324K9676j9150k9428J7811L1723j5886l7163
1734b6935J1582M1899k957m3479o698M0143J3028l4979j6177L1137J7018l0091
1746f509j9885K9571K4954k6609l1783K0488L5728j1858l5239N096L1620j597
1758A3977k7216J710K6874k084k9378P2L2204N671l2606j2084K8579J6642k3871
1771a510j7070K0873J5278k2352j6493K5078K2165k5768l0309K0703L6015j1963
1783A4647l6886N153L3909j710l1335J598L3528k8l8500n922M2115J5957m0068
$$ y = [-23453, 3049, 23189, -709, -22651, 52, 24716, 3392, -24648, -6037, 25631, 11292, -23311, -14851, 20122, 17022, -17249, -17752, 14826, 17628, -15388, -21375, 13945, 24616, -11490, -29599, 4780, 29802, 864, -27842, -4518, 25158, 6008, -23420, -5609, 26114, 10228, -26935, -15353, 26546, 23589, -19890, -26588, 13555, 26583, -8396, -24573, 6564, 23582, -6509, -26394, 3177, 28131, 1522, -30261, -9773, 25955, 14097, -21142, -16046, 15574, 13977, -13239, -11529, 15345, 13261, -16117, -16045, 16159, 21830, -10776, -22860, 5719, 22361, -1510, -18580, 2293, 17571, -4781, -21274, 3804, 25969, 201, -30108, -9405, 26610, 14647, -22239, -17086, 16823, 15113, -16222, -14624, 18904, 18876, -19624, -25546, 16569, 32526, -7542]
1796g542k5104L2774L0673k5110l1248J9713L0439j8274l2545J6912L7141j2311
1808A5518m3010L021M4694P926m0851j6007L3568J9092k6774j8337K3977J8081
1820B0898k3970k0692K4427K6149k0285l1499J3020L2633n522k8685J315K4024
1832A1813k683k2750N161K5630m647l0963j339L3225Q883l0275j4211K4844J5111
1845A7799k1664j3510K3131J4282k6214j9736K7608K7931k3091l4511J5489L6693
1857B4207p041l5085J473L3362J3l3262k636L5734P883l8367j5872L6285K4437
1870C1131l0222l0611K1752L1939j4912k9836J0909K9054r971l0342P916L4493
1882B1300k919l6262m482L4661J1933k9624j5200K4077J4973k1251j4220K1513
$$ y = [-7542, -32646, 128, 30801, 5691, -25557, -5844, 24595, 6321, -26224, -9312, 27829, 15518, -27492, -24471, 20223, 28149, -12702, -28709, 4859, 23951, -2823, -21160, 2817, 20898, -3072, -23764, 663, 26812, 6527, -24972, -11952, 20681, 15159, -13526, -12211, 11813, 9130, -13620, -8459, 17171, 12524, -18439, -19778, 13447, 22330, -7945, -22156, 2688, 17799, -3865, -17375, 5756, 20038, -6176, -25912, 1696, 29627, 6536, -27975, -12486, 24207, 17166, -17919, -16446, 16916, 16929, -16333, -18969, 16765, 24648, -13719, -29591, 6694, 31131, 909, -29702, -7950, 23989, 9077, -20759, -9850, 19204, 9233, -21109, -13193, 21300, 18381, -17881, -22363, 12298, 24231, -5393, -20593, 3484, 18457, -2794, -17014, 4499]
1894D499J5696k2213k0799K0621K4947j5712k7562R974K6020n795k4193N196K3244
1907A3923n656k4738M433K8235m52l0092n193L0120J0689k7291j4467K4727J6550
1920B0788k3173j7804K2123K1222k1381k6017J8140L0587j2584l3227M615L3160
1932A6449J333l1061n090K8578O964k7590r090K8055J2944k7422j7951K4590K2574
1945B3283j9587k4252J4479K4498j0876k3849Q824K4997p543k6411M502K8168
1957A6233j042k8316l360K6456P365k5313r792K2892J2065k1430j4070K0021J6273
1970A7982j8985j8679J7818K1840j5340k4612J1722K6809p248k7102L462K6501
1982A4168J80k6310k660K6308N997k6969j0044K5848J4491k3531j8935K0168K0386
$$ y = [4499, 20195, -2018, -22817, -2196, 22751, 7039, -20523, -10549, 15471, 9676, -14517, -9321, 13923, 8267, -16471, -12038, 16197, 15745, -14347, -19540, 10580, 21269, -6022, -20489, 4238, 20788, -2385, -20189, 1934, 23156, 1775, -24242, -6102, 24485, 11901, -21326, -16711, 16449, 17782, -13279, -18369, 10209, 17173, -10417, -19507, 8548, 21492, -5930, -23881, 709, 23283, 3696, -20556, -6077, 18421, 7545, -16304, -7480, 17517, 9974, -16437, -11935, 16233, 15191, -13125, -16485, 9971, 17336, -7977, -17769, 5123, 17188, -4242, -18312, 1709, 17982, -1003, -19682, -1864, 19976, 4636, -19976, -8254, 18555, 11307, -15795, -12333, 14168, 14348, -11962, -14622, 11686, 17683, -9286, -19330, 6518, 21009, -2522, -21457, -1289, 19097]
1995A9097j6230k1066J3049K1692j1530k2216R267K4446o399k5959K436K6689
2007A3276K180k5553n448K3753P759k1694q657K0062R977k0141j1503J9554J4560
2020A8125j8555j8448J6014K0918j2289k2053Q699K1345p158k1584P355K3007
2032A5376o027k6518K219K9724M410k9449j0826K6210J5274k1807j6725J9471
2044A332J7301j8662j9957J8215K4360j4955k9075Q568L0512j502k8199m640K4718
2057H016O138k1519o262K0755O702k2133r273K2541J4404j9995j8812J5239K0200
2070A6001r483j8048O910J5086p141j5012R602J7749r284k2090N148K4411O03
2083A4452k3156m755J8924M705j6727k906J8389K312k2434o707K5637J4413k4041
$$ y = [19097, 2867, -18199, -5150, 16542, 5012, -17204, -7937, 16509, 10110, -15849, -13413, 13276, 15456, -10097, -15545, 8208, 15967, -5727, -14384, 5678, 15655, -4486, -15989, 3565, 18125, -430, -18878, -2864, 18054, 5765, -16288, -7589, 13756, 6598, -14986, -7631, 15376, 9349, -17169, -14950, 14774, 19184, -10265, -21091, 5119, 20393, -1414, -18139, 1332, 18633, -29, -19986, -1771, 22589, 7634, -21441, -12873, 17639, 16137, -12062, -16702, 8016, 14154, -7365, -13627, 7128, 13830, -8303, -17576, 4965, 19369, -626, -19438, -4199, 16001, 6518, -11530, -4620, 10466, 3325, -11687, -2085, 15664, 6380, -15710, -10562, 13849, 14452, -8704, -13459, 5465, 10170, -6557, -9463, 8926, 11238, -11196, -17903, 7734, 22147, -1894]
2096a894k1192J8203K4183j2028k3103R263K2001r462k3139R562K7760n604l2283
2109a7733k115L3186J0764k9810j6849K2860J8949j8311j7667J6369J7688j7414
2121h3k0942J6623K6075j1421l0229L532K9246M601k4233p696J8633O463j5868
2134e299m177J8539M511k1247r076K0333J4994j5545j7281R466J4416o589j0353
2147g308Q637R079j3394j3324J5466J9883j2179k5436N684K5644O3k2194k295
2160a1674K0179J252k0914j247K5281N561k8653j2928K7403K1127k1975k5209
2172b1797J4799K5089r946k3310R019K2422q866k6168O354L0752L0l2709r235
2185b3566K9858J6260k3224j8842J7198J7238j4387j5828J5662J7617j5709k2264
$$ y = [-1894, -23086, -4883, 19300, 7272, -15831, -6568, 15433, 5971, -17168, -7606, 20154, 14550, -17733, -19848, 13338, 24102, -5708, -22557, 303, 19252, 941, -16726, -357, 17331, -83, -21025, -4402, 21673, 10252, -19977, -16445, 12801, 17402, -6831, -14527, 4106, 10569, -5299, -9476, 9063, 13574, -7673, -16749, 3584, 18578, 3033, -14248, -4782, 9634, 3045, -7308, 1329, 10408, -2986, -16310, -844, 19039, 6860, -18576, -12892, 12752, 12815, -9379, -11674, 8505, 9757, -11157, -12404, 12877, 18438, -10215, -23143, 4260, 25387, 3412, -21797, -6998, 18091, 8145, -15165, -6146, 16276, 7410, -18758, -12404, 18348, 18378, -14331, -23566, 6292, 22552, -672, -19514, -2316, 14922, 535, -15293, 369, 17986, 2277, -19987]
2197a9987J1913K6763m754k6081k650K1819N580j6624l908J4353P64j6443j008
2210a0263K0246M322k1491r962J8351J3920j4172j3530J1502J0862j1405j0774
2222a2394J4474J4070j5743j9768J3504K5051p977k6454K095K4626J788k1868
2234h596k982K1901L012k4371o128K6703J2524k6252j9829K1096K4318j4092k4908
2247a7604Q230K3330o366k2032N765K3892l721k6899j254K7944Q401k5323j3183
2260a8820K0491J4713j5600j3954J4143J3018j4351j4821J4204J8332j2323k1174
2272a6142P472K2278l191k1102J27J8786M25j7749p39J8812J887k0135m942K1088
2286F875Q738j8976j2033J5875J3573j2866j3889J2617J3646j2201j6012J1878
$$ y = [-19987, -8074, 18689, 13935, -12146, -14796, 7023, 12603, -4021, -7929, 6424, 7188, -9255, -10263, 9983, 14305, -7186, -17148, 1203, 15123, 951, -12579, -1077, 9785, -1620, -12394, 2080, 16150, 407, -19361, -5857, 19194, 11217, -15237, -13142, 11484, 13272, -8596, -11578, 10323, 13335, -11036, -17164, 9539, 22063, -4189, -24018, -2922, 21396, 7304, -17604, -9374, 13956, 7590, -14442, -8677, 15215, 11494, -15405, -16659, 11285, 19686, -5637, -18820, 1671, 16384, 784, -13170, 973, 13991, -360, -15181, -977, 17355, 5032, -16142, -8670, 13608, 10417, -10685, -10558, 8228, 8653, -9096, -9835, 8977, 10864, -9271, -14213, 6875, 15613, -3363, -15396, 479, 14052, 1186, -12703, -86, 13560, 1359, -14653, -2775]
2298b775J9814j0150k2927N681K3597p21k2963k623K1315M097k0309o490K1169
2311F715R117k1233j3260J9729J7220j5790j9660J2009K0001q814j9969P543J9977
2324A3585n052k1491K712K2542P91k2663m161K1235P033j9847r125J8557J0495
2337A4611j7437j2729J5877J5314j4252j7368J1378J9194q700j9676N602K0380
2349A2194l461j9974J301K0658J295k0674l875J9896O967j8544r779J6737J1400
2362A4141j4893j2751J3296J4047j2395j6051J0653J7749p670j8985M522J8380
2374A0043k065j7337N35J7206K62j7357j916J8782M483j8431p975J7204J0708
2387A4142j5033j1609J3184J1789j2272j3283J2531J5366j1288j8446P941K0600
$$ y = [-2775, 17039, 6889, -16038, -10357, 13240, 12519, -10444, -13067, 8248, 12345, -7964, -14454, 6715, 15832, -5401, -18661, 1068, 18288, 2498, -17162, -5153, 14848, 6034, -13935, -6392, 13585, 8533, -12958, -10246, 12296, 13087, -9576, -13737, 7498, 14531, -5316, -14441, 4116, 14611, -2826, -15555, 322, 15636, 1384, -15984, -4606, 14588, 5888, -13788, -8186, 12194, 8733, -11241, -9940, 10718, 12013, -8661, -12536, 7360, 14327, -4217, -13996, 2741, 14141, -752, -13503, -207, 13840, 1445, -14606, -3953, 13796, 6126, -12859, -8337, 10043, 7978, -9359, -8824, 8382, 8644, -8713, -10629, 8153, 12636, -5795, -13770, 3434, 14142, -891, -12500, 684, 12473, 201, -13082, -551, 14815, 3527, -14919, -6978, 13622]
2399A3622m126k1014L04J9668K213j8612l455J8647M948j9257p791J9718J1658
2412A6523j8024j5497J4802J7723j0101j8260P105J8063n640j8072M392J9676
2424A2690k566k1597j546K1848O251j9623j0173J5592J0628j1775j0202J0842
2436C69R495j1768j0397J1906J3834j0303j5811O367J6118k588j3977J499J2328
2449G072l053j2150M000J5009l126j7560j369J8664N783j7259q571J4358R110
2462A0908j3370q227J3117R017j4151j2468J4581J6704j1529k0289O438K1814
2474A2545j528k0452p11J8062K035j7969k249J9669M960k1134j0045J9594J5649
2487A8426j5369j8842R755J7886n803j5603M825J4291n355j6161M693J8764j156
$$ y = [13622, 9496, -11518, -11214, 8454, 10667, -7945, -11400, 7247, 12195, -7062, -14853, 4865, 16523, -1501, -16998, -2196, 15527, 5426, -12834, -5729, 12334, 6694, -11378, -6986, 12690, 10124, -11473, -13019, 8829, 15080, -4543, -14716, 876, 11504, -271, -10473, 369, 9864, -1904, -12301, -395, 13439, 3136, -12675, -6308, 9810, 7222, -6755, -5256, 7072, 4019, -8131, -4131, 10878, 7752, -9808, -11177, 7487, 13270, -3989, -12560, 1798, 10908, -2462, -10689, 2428, 11445, -2706, -15174, -593, 16111, 4582, -15707, -9269, 12545, 11017, -9435, -10146, 7916, 9951, -8018, -10267, 9402, 14362, -6772, -16817, 2777, 18426, 3057, -15785, -6030, 11856, 6053, -9550, -4725, 9566, 4211, -11950, -7257, 11507, 10351]
2500A0351j9674l819J7216P726j3105q101J0157O317r535m811J1407N875j2640
2513b636r394J2331J2488q957j3990N703J2122l730j0719M454J0726o453j3132
2526a1187O133J6967l027j9935j273J8798N950j6250p585J4274P178j3677p908
2539a1542J5591J0593j5853j5372J3664J9850q459k1635K769J9932Q28j7415j460
2552h509J5863J517j7131l384J8946P090j8283j1821J4375J4809r963j4531O594
2565d428J2962n727j1630O166J2986o016j5165M154J6940n90j6198l312J3919
2578D061N392j1638n106J0649L734j1697m098J3212O514j3906r814J1987J2525
2591A1815r117j3009O576J2597o348j1973O245J4318o212j7001L778J9239Q70
$$ y = [10351, -9323, -13142, 4074, 11800, -1305, -9406, 751, 7068, -2467, -7278, 4129, 10004, -2636, -12030, 301, 12789, 3832, -10158, -4455, 7667, 3937, -6782, -2328, 8398, 1945, -11187, -5054, 11913, 8886, -11049, -12322, 6476, 12426, -3824, -11409, 2865, 10043, -3634, -11542, 4049, 14642, -1211, -16583, -2919, 16931, 8472, -13163, -10394, 9538, 10366, -7049, -8509, 7354, 8871, -8260, -11644, 7302, 14392, -3891, -15712, -1337, 13472, 3509, -11022, -4428, 8534, 2807, -8823, -2657, 10329, 4313, -10852, -6698, 10242, 9652, -6546, -9858, 4061, 9453, -2185, -7291, 3358, 7092, -4605, -8703, 4509, 11023, -2883, -12697, -710, 11815, 2698, -10311, -3735, 8862, 2514, -9459, -3214, 11104, 4892, -12109, -8331, 10908, 11778]
2604A1778j9241n103J7213Q080j5125q848J3716R229j3529j0843J3158J3804j1913
2617B376j6641Q204J8187m173j8213J013J6882R03j5824j665J5279L015j5272
2630e929n316J5703Q194j4810j0194J2190J2409j0018j2237P862J2108p307j1746
2643i091O612J2910n949j5079M246J5916j410j6307j386J5659K833j4527m124
2656i697J4355N334j4296p641J4636J0072j3336j2101J1229J4077q579j5223O255
2669d915J5577m370j5568K218J5941j99j6411j528J5848L717j5908o152J5008
2682C258Q416j3107j0388J1354J0984r259j1570P952J2495p429j3477O595J4800
2695A0624m165j5430J366J5587Q53j4390k491J3375L351j3621m183J4278N563
$$ y = [11778, -7463, -12566, 4647, 12727, -2398, -11246, 2470, 11699, -1830, -12673, 485, 14289, 2376, -14265, -6061, 12126, 7953, -10260, -9247, 7635, 8538, -7286, -8951, 6328, 9343, -5929, -11245, 4458, 12652, -2158, -12352, -162, 12247, 2229, -10008, -2146, 9962, 2655, -9091, -2479, 10431, 4482, -10597, -6351, 9565, 8155, -8152, -9538, 6121, 8954, -5573, -9697, 4658, 9992, -4304, -11945, 2691, 12763, -573, -12674, -1445, 12632, 4053, -11170, -4915, 10662, 6292, -9276, -7058, 8883, 8684, -7727, -9255, 6593, 10310, -5598, -11750, 3258, 11674, -1433, -11821, -467, 10517, 1258, -10312, -2360, 10135, 2706, -10771, -4176, 10624, 6459, -8971, -7605, 7982, 8835, -5555, -8046, 5329, 8680, -4941, -9124, 5154, 10717]
2708A0717j4599q040J3701J0689j2056j2906R437J4183p489j4243N625J4981m598
2721E402j5814K857J7384k6j8214l398J8011P211j6179r446J3084J0595j0530
2734I37j1317R968J1408r421j3394Q542J5180n377j6804J330J6168J540j3988
2747e228k861J2204K115j1484k236J2806L639j3578o440J2882R305j0205j0539
2760i620Q108R496o566q583P132R188q641j1104Q287J3881n802j5967J723J6220
2774G752J380j4878k831J3133L059j3932l088J5487N838j6473j0533J5274J4946
2787A5134j1254j6941O303J6911l324j4693K247J4418k183j5912L94J7992L608
2800A2700j8471q588J5788J1692j1265j2182P510J0506o834r041P230J0175p416
$$ y = [10717, -3882, -11922, 1779, 12468, 412, -12494, -3057, 11126, 3637, -10606, -4981, 10000, 5402, -10412, -7555, 9829, 9803, -8411, -11809, 6202, 13413, -2766, -12212, 872, 11467, 937, -10380, -412, 10996, 1575, -11819, -3277, 11903, 6526, -10278, -8948, 7220, 8760, -5228, -8089, 4115, 6230, -5254, -7490, 5316, 8955, -4623, -11063, 1819, 11124, 919, -9620, -1512, 7984, 1418, -7165, -33, 9155, 514, -10590, -2303, 11578, 5776, -10191, -8468, 7752, 9132, -5746, -8577, 4556, 7615, -6317, -9405, 6082, 11920, -4553, -15086, 188, 15134, 3880, -13061, -6758, 10153, 6829, -7864, -5617, 8801, 6618, -9294, -8900, 9092, 12700, -5771, -14359, 1429, 13121, 1856, -10326, -2816, 7690, 856, -8185, -955, 9220, 1804]
2813A804j2880N499J4704j249j4045j909J1089L103q121j536P623p52r174O91
2827e153J2045J651j2871n468J1365Q182q995q267P126O604p733o539R899Q653
2841A0499j0942j3076R027J7007m279j7930l68J5911L415j3420l370J2806L258
2854H538j4387n167J6398R509j5463j4873J1222J7811n928j6852J590J4165m66
2867F097j2446Q80J3222q33j5151k310J6073O628j3888r797R250J0173m784q334
2881e220L760N696m970n261O936P434o615j0168M183J1298q05j0124o19P155n43
2896B137n879K408P825l407j1437J316J3985K806j3510o709J0812P840q147o694
2910f654P543O436r300q167J1299J1563r344j5855N160J7615k14j6214l108J3596
$$ y = [1804, -11076, -5577, 9127, 7878, -6167, -8076, 3013, 6116, -2005, -3541, 4082, 3330, -5844, -5153, 6892, 8543, -4328, -9796, 1569, 9751, 756, -7511, -385, 6219, -1514, -8053, 1846, 10499, -443, -13519, -4492, 12515, 8236, -9694, -10062, 5849, 9264, -4156, -7526, 5280, 8538, -5849, -11016, 5382, 14891, -572, -15445, -4223, 13588, 7660, -9192, -7602, 6563, 6097, -6349, -5469, 7753, 6920, -8231, -10541, 5532, 12160, -1728, -11525, -2275, 7898, 3114, -5220, -1460, 4236, -734, -5995, 941, 8375, 1760, -8408, -4225, 7073, 6268, -3856, -4475, 2680, 2137, -3742, -1334, 6491, 3084, -8353, -7037, 6948, 9754, -3756, -10465, 347, 8187, 40, -6654, 889, 7325, -1975, -10142, 1157, 12720, 3376, -12479, -7319, 10296, 10082, -6132, -9240, 4356]
2924D356L694j1774l952J2497M406j3761p689J3479J1628j0744j4595O217J4635
2937H397j912j2344L9J0056r2r926J600J1080m01j2315k859J2252O035r392p495
2952g277O367N897m744l881N405L291p515n107Q347Q276p097j0292M118R833k150
2967C471q102K070P407l475q127L700J1324k396j3307j217J3686N064j2156p043
2981i101J0283P442r057p318R008Q153r439j0590Q270J3080n088j5146J314J4911
2995F722J743j3034l462J0915L715j0103l880J0639N604j1282q143R740J1080
3008A0254o796j1572L590J0589j678r085J873Q752k653r794K201J1001j84j1446
3022d948k257J0123L804q499m439P773L186p295l856Q553N059q978o981Q329R181
$$ y = [4356, 8050, -3724, -7676, 4821, 9227, -4534, -12223, 1256, 12884, 2140, -12455, -6238, 8397, 6485, -5859, -5820, 4236, 4144, -5782, -4182, 6898, 6497, -5818, -8677, 3575, 9610, 218, -7277, -910, 4987, 243, -3638, 1767, 5058, -2457, -7564, 783, 9059, 1962, -8330, -4212, 5621, 3471, -4631, -2561, 4846, 1371, -6756, -3056, 8268, 5872, -7435, -8652, 5034, 10098, -2058, -9101, 1182, 8624, -433, -7751, 1257, 9410, -29, -10619, -2349, 10731, 5643, -9503, -8189, 6722, 8465, -4569, -8031, 2884, 6599, -3504, -7384, 3255, 8859, -2423, -10566, -826, 10254, 3458, -8114, -4524, 6065, 4387, -4698, -2825, 5927, 3274, -6520, -4319, 6682, 6498, -4948, -7205, 2918, 6722, -1777, -6216, 1557, 4743, -2552, -6408, 2145, 7204, -1774, -8755, -426, 8755]
3037H755o897r551M698R753l299r689K784J0358k265j1620Q89J2733J521j2916
3051d746m213J1528O584j0227p531Q492P795p519q520O972R793o118j1594M821
3065d483J2590j982j2708n44J2192K218j0895k989J0310L838j0343m821J0205
3078B588N936r082p654P496R018o417r358M596R546m030r496L309R932k583j0386
3093f585J205J0658O84j1065j924J0816L451r991m644R549N486q830o395Q033
3107D48Q103p608r318O408J0556n017j0907K997J1138j811j1027J31J1103J243
3121F439j1607k574J1323M460j0969n381R688O840q585p747P506Q642o154r501
3135g620M771J0318l517j0707K674J0718j240j1126m03J1430J560j1071l077J0510
$$ y = [8755, 1858, -7693, -2995, 6758, 3459, -6230, -3446, 6912, 4647, -6973, -6084, 6649, 8170, -4746, -8959, 2569, 9153, -1074, -8605, -113, 7682, 163, -8357, -1385, 8408, 2290, -9304, -4483, 8107, 6125, -6583, -7127, 5065, 7283, -3612, -6601, 3709, 7547, -2796, -7617, 2588, 8524, -558, -8212, -716, 8302, 1885, -7473, -2877, 6669, 2639, -6857, -3548, 6384, 3801, -6585, -5380, 5278, 5962, -5103, -7027, 3789, 7240, -2751, -7395, 2154, 7640, -1190, -7585, 448, 8551, 943, -8375, -1967, 8589, 3572, -7335, -4338, 6800, 4989, -6038, -5907, 5196, 6439, -5168, -7742, 3581, 8041, -2928, -8309, 1379, 8219, -366, -8113, -607, 8035, 1881, -7620, -2849, 7469, 3952, -6755, -4081, 6637, 5397, -5729, -6132, 5298, 6858, -4213, -7290, 3220]
3149C220L699r254n077Q509O159q334o942P732Q185o473r685N275J0516l855j0580
3164f905K375J0672o99j0628o17J1022J956j0911l695J0437N342r730o823Q896
3178F92P153p455q343O510Q618n344r060L962R906k808j0507J481J0826L75j0636
3193d630j800J0204K790r560l375R010M777r276n385Q410O994p544q072N856Q844
3208G243m830r082L695R128k850r829K166R994m47j0683r86J0360K822r930l821
3223g050Q933N234q557n491P432P316p290p865N996Q927m564j0075L796R803j908
3238D637j0279Q77R845J14r832j016R360K671r770l776R004N431q162o391P053
3253b34O857n678p475M863Q282m372q447L090R116j363r650L15R313O34q865k151
$$ y = [3220, 6919, -2335, -7412, 1097, 7256, -1078, -8020, -288, 7897, 1424, -8261, -2986, 7530, 3675, -6905, -4530, 6142, 5443, -5185, -5802, 5220, 7176, -3735, -7430, 3007, 8349, -1381, -8204, 692, 7845, 390, -7953, -1443, 7175, 1831, -7229, -3267, 6639, 3831, -6676, -5195, 5631, 6006, -4630, -6430, 3774, 6564, -2996, -6371, 2639, 7416, -1860, -7245, 1165, 8159, 615, -7457, -1601, 7243, 2413, -6669, -2974, 6154, 3304, -6525, -4359, 5635, 5188, -5495, -6481, 3879, 6701, -3229, -7050, 1883, 7117, -1440, -6931, 501, 7817, 527, -7338, -1342, 7585, 3021, -7054, -3258, 6545, 4637, -5642, -4765, 5080, 5194, -4638, -5654, 3706, 6377, -3393, -7169, 1835, 7266, -896, -7287, -234, 6623, 945, -6530, -1667, 6615, 2243, -6204, -3114, 6002, 4639, -5011, -4696, 4617, 5251, -3614, -5765]
3269e765R199K728q808l760Q073N073p470o313O289P199n514p421M549P937l479
3284B517q619K389R261j023r126n3Q843J156q598k036Q236K844p988l779P615
3299A639M783p099n697O386O137n416p107M802P274l743p650K947Q053j941q739
3314e371P30Q986N98q828j582Q482L109q039l790P454M680p273n443O877O536
3329G126n705q217M401Q464k570q947J451Q475l64q931K97Q870O02q886k533R075
3345B608M009p987n092O207N857m884n958M509O003m044o458L865P323k792q097
3360d931J304P998j59p374p36O443R41o259r68O854J070p247k602P457M096o530
3376f43n418N342N908m374n541M507N480m681o594M264Q595k858r894O88R820
$$ y = [-5765, 3434, 6162, -2646, -6406, 1667, 6740, -730, -7043, -754, 6445, 931, -6490, -1941, 5996, 2517, -6102, -3713, 5548, 4525, -4601, -4654, 4189, 5345, -3253, -5289, 2947, 5791, -2197, -5976, 1639, 6422, -677, -6374, 12, 6149, 733, -6374, -1572, 5702, 1959, -5691, -2744, 5309, 3368, -5371, -4641, 4345, 4943, -3885, -5467, 3015, 6124, -1915, -5705, 1749, 6429, -844, -6287, 590, 7126, 1421, -6796, -2395, 6069, 3499, -5448, -3997, 4478, 4114, -4817, -4520, 4350, 4952, -3934, -6467, 2608, 6617, -1370, -6462, -255, 5602, 718, -5240, -731, 5272, 1228, -5230, -1365, 5958, 3166, -4931, -3627, 4371, 4212, -3162, -3898, 2545, 3486, -2773, -3741, 3113, 4183, -3064, -5666, 1791, 5887, -643, -6061, -719, 5189, 815, -4726, -219, 5261, 580, -6014, -1750, 6845, 3987, -5907, -5219, 4601]
3391D601J641r356k578Q046K658p560l312Q413M417q716o410O970R058n026r541
3406f695K321R147p87q132N77P369l74p882J75Q553J765q606m083P484N730n194
3422A368n981L532M737l362l781L759M287m490n800M252O751k154p353J00O634
3437B499L06n118J98N177j361o303J347Q212O97r034l447Q566N102o461n166M732
3453e4M815n133m831N960O410o428r107M456J1182j300j1403j813R988L216q160
3468b202l401P672L064p876m237Q738O566p670r339N388J0535j844r759m62P767
3483B940Q13o451J64O603q83p372j145Q575L289p329n281M639N579k527m024K215
3499a95K207l784k149N509M233n853o218L922P483j660o529N53N088j308m619
$$ y = [4601, 6242, -3114, -5692, 2354, 5012, -2548, -5860, 2553, 6970, -1746, -8156, -1186, 7872, 2846, -6695, -4374, 4773, 3986, -4146, -3569, 3800, 3426, -4456, -4281, 4272, 6037, -2569, -6652, 832, 6562, 1368, -4613, -1081, 3656, 294, -3487, 272, 4559, 69, -5731, -1479, 5272, 3118, -4235, -4135, 2499, 2805, -2313, -2115, 3062, 1701, -4602, -3255, 4957, 5654, -3380, -6827, 1739, 6841, 380, -4786, -54, 4761, -372, -5203, 757, 7167, 739, -8368, -3912, 7270, 5970, -5433, -7246, 2742, 5958, -2202, -5603, 2069, 5133, -2743, -6980, 1758, 8324, 654, -8685, -3297, 7238, 5394, -4365, -4827, 2940, 3753, -2698, -2534, 4069, 3186, -4186, -5331, 3244, 6533, -796, -6077, -1438, 4141, 1614, -2410, -195, 2012, -1772, -3921, 1588, 5821, -32, -6250, -2328, 5155, 3495, -3034, -2481, 2607, 1299, -3320]
3514c320K529O298k709q960Q18J0548K724j0438n426P999O238o269n098M911N701
3529E546o375o591O516R235n263j1314J743J2280K155j0662m443Q471M395o642
3543i49l790O949L899p850n825P342Q713n292r858J262R536Q03o944j419M833
3558A410K47m852J057O051l02p394j744O767M242m843m628L238K959k503j347
3573a642M269J060o229k796O689N635n642p303L065P306j261o509J321N611k038
3588A536p012K752Q800n81j0718k654J0195N883q093p484N503P184l882o449M669
3603c51O476m706q488L747J0581r35j1465k172R831M510p440m767N347L715n027
3618a144l548N973M584o230o686M671Q451k281p584n21O505P32m499K39M003j117
$$ y = [-3320, -791, 5507, 2798, -6162, -5344, 5204, 7928, -2510, -7936, 63, 6301, 32, -5066, -155, 5546, -829, -7420, -904, 8331, 3068, -8246, -6503, 5777, 7932, -2730, -7173, 1298, 5693, -949, -4739, 2210, 6109, -1741, -7566, -224, 8489, 3197, -6661, -5399, 4137, 4940, -2004, -3423, 1410, 1657, -3195, -2138, 3913, 3611, -3783, -5527, 1240, 5482, 639, -3989, -751, 2208, -295, -1642, 2627, 3687, -2542, -5338, 1351, 6986, 1344, -5959, -2894, 4412, 3151, -3358, -2037, 3574, 1536, -5476, -2724, 6076, 5495, -5223, -7877, 2318, 8201, 108, -7376, -1873, 5311, 1429, -5020, -351, 6125, 1419, -7069, -3322, 7259, 6324, -5141, -7313, 2518, 7028, -412, -5179, 168, 3883, -1144, -4692, 1281, 5865, -365, -7051, -2380, 6071, 3790, -3794, -4315, 2190, 2922, -1577, -1338, 2665, 1548]
3634A548n109J156O306O02p100k031N671L347m305k905L567J677m160j843N897
3649B318K784o573n310N631P383l769p771J822P008p13o062O17O775o04q347k42
3665e053R451K738q888n574P318P057n264o912L661O145l310o320L218P282k698
3680B851q429N90R144J359p919l287O338L789n060l074M197L261m845l340N002
3695E77M595m245n931K903O171p51o129M66M876r16l911J119M751j197n963%O552
3712B967J432o359k493N437K740m539k874M834K500m852l922N807N181m907o279
3727e327L070P127j553p032O39O452J15o786j61O790J104p273k747P036M207o001
3743c40n214M546N641l527n399K540N486k209n936K122O464j124o529j22O472
$$ y = [1548, -3561, -2405, 3901, 4503, -2597, -4628, 1043, 4390, 85, -2820, 747, 2424, -1736, -3579, 2318, 5102, -1471, -6781, -1150, 6233, 2464, -5307, -3485, 3523, 2810, -3252, -2635, 4140, 3536, -4811, -5053, 4398, 7136, -1752, -7326, -8, 7049, 1785, -5127, -1466, 4679, 1369, -4951, -1733, 5549, 2851, -5578, -4988, 4156, 5515, -2404, -5691, 647, 4436, -624, -3698, 499, 3760, -1085, -4425, 577, 5172, 927, -5004, -2101, 4070, 3319, -2810, -2344, 2532, 1616, -2295, -1176, 3575, 2378, -3585, -3585, 2967, 4399, -1960, -4453, 984, 3724, -815, -3689, 1145, 3645, -1207, -5129, 678, 5859, 952, -5327, -2257, 4870, 3317, -3715, -3076, 3376, 3491, -3295, -3456, 3334, 4438, -2835, -5582, 1454, 5661, -340, -5554, -1008, 4633, 1106, -4293, -1753, 3733, 1524, -4412, -2290, 4174, 3050, -3479, -3601, 2871]
3758B871J251n692j986M957K487m843k571M777K770m747l404M487M298l968m904
3773d217K762M980k072n146J909N021j526n410R19O181n10n698j164O121J957
3788D107n788k620N511K870m468l284M201L782m103m468L414N159k555n904K049
3803b097N656j060n921K41O195j18n597j114N657J831n505k434N154L133m512
3818d91l725L992M489l458m927L023N193k465n308J918N511j346n732O08N711
3833B993J22n796q73N635J519n497k277N150K831m506l559M303M001l847m857
3848d658L642N292k345n995J797N597n64n437j43N487N61n346j106N216K042n290
$$ y = [2871, 4122, -1570, -3556, 1401, 3888, -955, -3526, 1251, 4021, -726, -4130, 357, 4655, 687, -4217, -1455, 3525, 1453, -3693, -1784, 3237, 1711, -3699, -2780, 3401, 2891, -2807, -3971, 2150, 4107, -1681, -4301, 1210, 4080, -388, -3672, 529, 4311, 208, -4260, -846, 4313, 1758, -4146, -2097, 3559, 2499, -3422, -3181, 3014, 2896, -2701, -3815, 1842, 3673, -1832, -4266, 888, 4021, -491, -4216, -224, 4265, 807, -4120, -1097, 4096, 1631, -3677, -1759, 3752, 2406, -3326, -2718, 2993, 3115, -2681, -3554, 2081, 3600, -1897, -4174, 976, 3807, -699, -4258, 45, 4046, 199, -4658, -1016, 4276, 1931, -4064, -2267, 3330, 2766, -2671, -2814, 2673, 3234, -2112, -3218, 1998, 4040, -1250]
$$ [...]
8191C97
##END NTUPLES=NMR FID
##END=
