##TITLE=1H_Pr Qoro
 200.13MHz, DMSO,
 8 sc
 
 2.10.2025
##JCAMPDX= 6.0         $$ Bruker NMR JCAMP-DX V2.0
##DATA TYPE= NMR FID
##DATA CLASS= NTUPLES
##ORIGIN= UXNMR, Bruker Analytische Messtechnik GmbH
##OWNER= pz
$$ XWIN-NMR		Version 3.5
$$ Thu Oct  2 16:15:03 2025 Russian Standard Time (UT+4h)  she@DPX200
##.OBSERVE FREQUENCY= 200.1313
##.OBSERVE NUCLEUS= ^1H
##.DELAY= (6, 6)
##.ACQUISITION MODE= SIMULTANEOUS
##.ACQUISITION SCHEME= undefined
##.AVERAGES= 8
##.DIGITISER RES= 18
##SPECTROMETER/DATA SYSTEM= spect
##.PULSE SEQUENCE= zg30
##.SOLVENT NAME= CDCl3
##.SHIFT REFERENCE= (INTERNAL, CDCl3, 0, 14.3821)
##AUDIT TRAIL= $$ (NUMBER, WHEN, WHO, WHERE, WHAT)
$$ ##TITLE= Audit trail, XWIN-NMR		Version 3.5
$$ ##JCAMPDX= 5.01
$$ ##ORIGIN= Bruker BioSpin GmbH
$$ ##OWNER= she
$$ F:/spectra/data/she/nmr/H-C/1/audita.txt
$$ ##AUDIT TRAIL=  $$ (NUMBER, WHEN, WHO, WHERE, WHAT)
(   1,<2025-10-02 16:14:04.31 +0400>,<she>,<DPX200>,
      <created by zg, POWCHK disabled, PULCHK disabled
       configuration hash MD5:
       00 E9 B6 7A A2 85 ED C7 34 08 36 98 17 FE 4E 26
       data hash MD5: 16K
       48 1E 34 ED 50 70 58 C4 2D A4 73 21 AB 78 D0 E9>)
$$ ##END=
$$ 
$$ hash MD5
$$ 25 6C D1 00 E3 D1 33 B1 1C C0 AD 17 FE E1 0A 8E
##$RELAX= 
##$RELAX= 
##$RELAX= 
##$RELAX= 
##$RELAX= 
##$RELAX= 
$$ Bruker specific parameters
$$ --------------------------
##$DU= <F:/spectra>
##$EXPNO= 1
##$NAME= <H-C>
##$PROCNO= 1
##$TYPE= <nmr>
##$USER= <she>
##$AMP= (0..31)
100 100 100 100 100 100 100 100 100 100 100 100 100 100 100 100 100 100 
100 100 100 100 100 100 100 100 100 100 100 100 100 100 
##$AQSEQ= 0
##$AQ_mod= 1
##$AUNM= <au_zg>
##$AUTOPOS= <>
##$BF1= 200.13
##$BF2= 200.13
##$BF3= 200.13
##$BF4= 200.13
##$BF5= 200.13
##$BF6= 200.13
##$BF7= 200.13
##$BF8= 200.13
##$BYTORDA= 1
##$CFDGTYP= 0
##$CFRGTYP= 5
##$CHEMSTR= <none>
##$CNST= (0..31)
1 1 145 1 1 1 1 1 1 1 1 1 1 1 1 1 1 1 1 1 1 1 1 1 1 1 1 1 1 1 1 1 
##$CPDPRG= <>
##$CPDPRG1= <>
##$CPDPRG2= <>
##$CPDPRG3= <>
##$CPDPRG4= <mlev>
##$CPDPRG5= <mlev>
##$CPDPRG6= <mlev>
##$CPDPRG7= <mlev>
##$CPDPRG8= <mlev>
##$CPDPRGB= <>
##$CPDPRGT= <>
##$D= (0..31)
0 0.7 0 0 0 0 0 0 0 0 0 0.03 0 0 0 0 0 0 0 0 0 0 0 0 0 0 0 0 0 0 0 0 
##$DATE= 1759407243
##$DBL= (0..7)
120 120 120 120 120 120 120 120 
##$DBP= (0..7)
150 150 150 150 150 150 150 150 
##$DBP07= 0
##$DBPNAM0= <>
##$DBPNAM1= <>
##$DBPNAM2= <>
##$DBPNAM3= <>
##$DBPNAM4= <>
##$DBPNAM5= <>
##$DBPNAM6= <>
##$DBPNAM7= <>
##$DBPOAL= (0..7)
0.5 0.5 0.5 0.5 0.5 0.5 0.5 0.5 
##$DBPOFFS= (0..7)
0 0 0 0 0 0 0 0 
##$DE= 6
##$DECBNUC= <off>
##$DECIM= 32
##$DECNUC= <off>
##$DECSTAT= 4
##$DIGMOD= 1
##$DIGTYP= 9
##$DL= (0..7)
0 120 120 120 120 120 120 120 
##$DP= (0..7)
150 150 150 150 150 150 150 150 
##$DP07= 0
##$DPNAME0= <>
##$DPNAME1= <>
##$DPNAME2= <>
##$DPNAME3= <>
##$DPNAME4= <>
##$DPNAME5= <>
##$DPNAME6= <>
##$DPNAME7= <>
##$DPOAL= (0..7)
0.5 0.5 0.5 0.5 0.5 0.5 0.5 0.5 
##$DPOFFS= (0..7)
0 0 0 0 0 0 0 0 
##$DQDMODE= 0
##$DR= 18
##$DS= 0
##$DSLIST= <SSSSSSSSSSSSSSS>
$$ [...]
##$SUBNAM0= <"">
##$SUBNAM1= <"">
##$SUBNAM2= <"">
##$SUBNAM3= <"">
##$SUBNAM4= <"">
##$SUBNAM5= <"">
##$SUBNAM6= <"">
##$SUBNAM7= <"">
##$SUBNAM8= <"">
##$SUBNAM9= <"">
##$SW= 18.0517328524113
##$SWIBOX= (0..15)
0 0 2 0 0 0 0 0 0 0 0 0 0 0 0 0 
##$SW_h= 3612.71676300578
##$TD= 16384
##$TD0= 1
##$TE= 0
##$TE2= 300
##$TE3= 300
##$TEG= 300
##$TL= (0..7)
0 120 120 120 120 120 120 120 
##$TP= (0..7)
150 150 150 150 150 150 150 150 
##$TP07= 0
##$TPNAME0= <>
##$TPNAME1= <>
##$TPNAME2= <>
##$TPNAME3= <>
##$TPNAME4= <>
##$TPNAME5= <>
##$TPNAME6= <>
##$TPNAME7= <>
##$TPOAL= (0..7)
0.5 0.5 0.5 0.5 0.5 0.5 0.5 0.5 
##$TPOFFS= (0..7)
0 0 0 0 0 0 0 0 
##$TUNHIN= 0
##$TUNHOUT= 0
##$TUNXOUT= 0
##$USERA1= <user>
##$USERA2= <user>
##$USERA3= <user>
##$USERA4= <user>
##$USERA5= <user>
##$V9= 5
##$VALIST= <valist>
##$VCLIST= <CCCCCCCCCCCCCCC>
##$VD= 0
##$VDLIST= <DDDDDDDDDDDDDDD>
##$VPLIST= <PPPPPPPPPPPPPPP>
##$VTLIST= <TTTTTTTTTTTTTTT>
##$WBST= 1024
##$WBSW= 4
##$XGAIN= (0..3)
0 0 0 0 
##$XL= 0
##$YL= 0
##$YMAX_a= 75438
##$YMIN_a= -62462
##$ZGOPTNS= <>
##$ZL1= 120
##$ZL2= 120
##$ZL3= 120
##$ZL4= 120
##$ABSF1= 10
##$ABSF2= 0
##$ABSG= 5
##$ABSL= 3
##$ALPHA= 0
##$AQORDER= 0
##$ASSFAC= 0
##$ASSFACI= 0
##$ASSFACX= 0
##$ASSWID= 0
##$AUNMP= <proc_1d>
##$AZFE= 0.1
##$AZFW= 0.1
##$BCFW= 1
##$BC_mod= 2
##$BYTORDP= 1
##$COROFFS= 0
##$CY= -3
##$DATMOD= 1
##$DC= 2
##$DFILT= <>
##$DTYPP= 0
##$F1P= 0
##$F2P= 0
##$FCOR= 0.5
##$FTSIZE= 0
##$FT_mod= 4
##$GAMMA= 1
##$GB= 0.15
##$INTBC= 1
##$INTSCL= 1
##$ISEN= 128
##$LB= 0.25
##$LEV0= 0
##$LPBIN= 0
##$MAXI= 10000
##$MC2= 0
##$MEAN= 0
##$ME_mod= 0
##$MI= 1.114404
##$NCOEF= 0
##$NC_proc= 0
##$NLEV= 6
##$NOISF1= 3.799351
##$NOISF2= 2.8
##$NSP= 1
##$NTH_PI= 0
##$NZP= 0
##$OFFSET= 14.38212
##$PC= 1
##$PHC0= -2074.207
##$PHC1= 14.59224
##$PH_mod= 1
##$PKNL= yes
##$PPARMOD= 0
##$PSCAL= 0
##$PSIGN= 0
##$REVERSE= no
##$SF= 200.129724274929
##$SI= 16384
##$SIGF1= 3
##$SIGF2= 2
##$SINO= 400
##$SIOLD= 16384
##$SREGLST= <1H.CDCl3>
##$SSB= 0
##$STSI= 0
##$STSR= 0
##$SW_p= 3205.1282051282
##$SYMM= 0
##$S_DEV= 0
##$TDeff= 0
##$TDoff= 0
##$TI= <>
##$TILT= no
##$TM1= 0
##$TM2= 0
##$TOPLEV= 0
##$USERP1= <user>
##$USERP2= <user>
##$USERP3= <user>
##$USERP4= <user>
##$USERP5= <user>
##$WDW= 1
##$XDIM= 8192
##$YMAX_p= 0
##$YMIN_p= 0
$$ End of Bruker specific parameters
$$ ---------------------------------
##NTUPLES= NMR FID
##VAR_NAME=  TIME,          FID/REAL,        FID/IMAG
##SYMBOL=    X,             R,               I
##VAR_TYPE=  INDEPENDENT,   DEPENDENT,       DEPENDENT
##VAR_FORM=  AFFN,          ASDF,            ASDF
##VAR_DIM=   8192,          8192,            8192
##UNITS=     SECONDS,       ARBITRARY UNITS, ARBITRARY UNITS
##FACTOR=    0.0002768,     1,               1
##FIRST=     0,             0,               0
##LAST=      2.2672688,     0,               0
##MIN=       0,             -62462,          0
##MAX=       2.2672688,     75438,           0
$$ Real data points
##PAGE= N=1
##DATA TABLE= (X++(R..R)), XYDATA
$$ [...]
1223i38K52Q30N05l69q43q41l76N52P91N13M4j048o53m6N83J175Q20l86p89o43
$$ -938 -686 144 649 280 -563 -1404 -1780 -1228 -437 76 120 -928 -1581 -1627 -1044 131 951 565 -224 -867
1243h67J68J217Q85M14m55j290m04M60P19Q43j31j060r63m62L17J136L67m10p06
$$ -867 -699 518 1403 1817 1362 72 -332 128 847 1690 1559 499 -464 -926 -609 527 894 484 -222
1262b22r83j05P00J071M48m21r66m60K43N91J052K37o20p05q64K37Q85M49J76
$$ -222 -1205 -1310 -610 461 909 488 -478 -938 -695 -104 948 1185 565 -140 -1004 -767 118 567 743
1281G43o89j276k84L39P84P74k09p87m82k90P43J149N00j02o76p96L82P89P39
$$ 743 54 -1222 -1506 -1167 -383 391 182 -605 -1087 -1377 -634 515 1015 913 237 -559 -177 612 1351
1300A351O60p20r16m35L6O80Q08k24o55j030o44N10O31N37j50r10r97j6M75R46
$$ 1351 2011 1291 375 -60 -24 656 1464 1240 585 -445 -1089 -579 52 589 439 -471 -1468 -1484 -1009 -63
1320f3N84o53n41p11J11P70Q34L54k53q97m62M45O36Q73J83p79n90m35K43J045
$$ -63 521 -132 -673 -1384 -1273 -503 331 685 432 -465 -927 -482 154 1027 1210 431 -159 -594 -351 694
1340F94L69j46n89j026k04O35O59N75k17j063n45p9P16J075J87m42o87o59K37
$$ 694 1063 917 328 -698 -902 -267 392 967 750 -313 -858 -937 -221 854 1041 599 -88 -747 -510
1359e10R10M84K29n02j089l35K33P32N64k57p66q07l53N19R51K55k03o66p36J70
$$ -510 400 884 1113 611 -478 -813 -580 152 716 459 -307 -1114 -1467 -948 3 258 55 -611 -1347 -1177
1379a177Q57P49N06m49o44k58Q3Q31O63L8l78q97m36M00N89M72M1q06r46k9L66
$$ -1177 -320 429 935 486 -158 -416 -333 498 1161 1199 821 -76 -512 -112 477 949 990 184 -762 -791 -425
1400d25P61N48l67p42p38r9Q29O70L03l03j051m15L18N25R44N5q77n47l12K80
$$ -425 336 884 517 -225 -963 -1062 -233 437 740 437 -614 -1029 -711 -186 758 813 -64 -611 -923 -643
1420f43R86M66o3p49p23n7M77Q17M00M0r21o31j38M91Q18L03l67n56q61n7P61
$$ -643 343 809 746 -3 -726 -783 -306 511 911 951 30 -601 -739 -248 570 873 506 -50 -911 -968 -207
1441b07Q21M14n07j062m30K03Q07R66P0q78p99m73P01R62J87k9r68p67K19M86
$$ -207 614 1028 521 -541 -971 -768 39 1005 1075 197 -602 -1075 -374 588 775 746 -222 -989 -770 -284
1461b84O55L54l78o13l53j92N79O83K20n0p78n16J83L88P06M94m89q67m54m4R34
$$ -284 371 725 347 -266 -619 -811 -232 451 671 621 -157 -673 -490 -102 604 1098 609 -258 -712 -756 178
1482A78Q33o7o50r08n12N64R80L69L2j078o75m2N93Q96K05o09m73m20J89O04L38
$$ 178 1011 944 294 -614 -1126 -562 418 787 819 -259 -934 -976 -383 513 718 109 -364 -784 -595 9 347
1503C47O8k64l91j91J08K53N52O9j71j96m10o6N23M79K76l59q92k46K35O17N37
$$ 347 415 151 -240 -431 -323 -70 482 551 380 184 -226 -292 231 710 986 627 -265 -511 -276 341 878
1524H78k50r07m77RL57P24P1m48n56m64M83N86L84k43m02k07K75K89K89J22l46
$$ 878 628 -279 -756 -747 -390 334 405 -43 -599 -1063 -580 6 390 147 -255 -462 -187 102 391 513 167
1545A67j73K1j63J19L01j19j6j35l45l5K15L01M03m33k67k09j3N95M25L8l01n99
$$ 167 -6 15 -148 -29 272 153 137 2 -343 -378 -163 138 541 108 -159 -368 -381 214 639 677 376 -223
1567b23k10O27M51K27l52p47m02M23M00N60l56o47m13m6L71N24ml90k71k90R6
$$ -223 -433 194 645 872 520 -227 -629 -206 194 754 398 -249 -662 -708 -337 187 183 -207 -478 -768 -672
1588f72L95J84K59p7m03n2j93M60M44K93q0k59n67R2N27N94L52n43q48l27J58
$$ -672 -277 -93 166 89 -314 -366 -559 -99 345 638 558 299 -268 -176 351 945 1297 754 -94 -421 -263
1609b63N81P33l02p23p28l10O01O96J62k77p60n72K92N98N80L00n35m37k69J79
$$ -263 318 1051 749 26 -702 -1012 -411 285 447 170 -590 -1162 -870 -272 308 608 73 -364 -633 -454
1629d54N51M83j17j64n61m08K67L08M23K07m66n85m38J26P03O29j3m84p28j94
$$ -454 97 580 463 299 -262 -670 -403 -95 328 535 69 -516 -954 -828 -125 504 491 7 -721 -915
1649i15O79Q04O12k75q08l30k8P01P07J05n82o62m59J92N70J65J57o65p32q2J29
$$ -915 -236 568 1180 905 97 -233 -261 440 1147 1252 670 8 -451 -259 311 476 633 -32 -764 -846 -717
1670g17K81M19N1l90k81l82K80N94L08J6k05o24N7L34N16N40j90m56m59o5M61
$$ -717 -436 -17 34 -356 -637 -1019 -739 -145 163 179 -26 -650 -593 -259 257 797 607 151 -308 -373 88
1691H8P03O6m19o16k53J59L51M35J97n39n31j50K75N46J33j83k28m26k26N81L05
$$ 88 791 857 438 -178 -431 -272 79 514 711 172 -359 -509 -234 312 445 262 34 -392 -618 -37 268
1712B68L7R3m88k50J25J12N24L9l59m36k82m2O09J07l2j39o53j53K85M54L12J05
$$ 268 305 398 -90 -340 -215 -103 421 460 101 -335 -617 -659 -50 57 25 -114 -767 -920 -635 -181 131 236
1734B36n96j35L7K64O61K91k11l70l37K85L79K13J51k21o29j60j9M24K38j64l59
$$ 236 -360 -495 -458 -194 467 758 547 177 -160 125 504 717 868 647 18 -142 -161 263 501 337 -22
1755b2m49k69K27M36K26l2m87l69K11K42L19L41r3m35l43K8M55L88Nk53l55k72
$$ -22 -471 -740 -513 -77 149 117 -370 -739 -528 -286 33 374 281 -154 -497 -469 -14 374 379 126 -229 -501
1777e01K23K96L93J78o37l93M3J77L53M06k28k62l55j04M41L62K08j25m47k48
$$ -501 -278 18 411 589 -48 -441 -398 -221 132 538 310 48 -307 -411 30 392 600 475 28 -220
1797b20L5K90L67J16l23l49l90K07L76L15j1k90m29k89K66K77M34l19l59l58q0
$$ -220 -185 105 472 588 265 -84 -474 -267 109 424 413 123 -306 -595 -329 -52 382 63 -296 -654 -734
1818g34K94M65K07r2l33l74J30M08M10J03p0m79m3O5K73M32j25l15k86k82K43
$$ -734 -440 25 232 140 -193 -567 -437 -29 381 484 414 -65 -108 -43 230 662 537 222 -64 -346 -103
1839a03L71J79j38l68l07p7K61L21K41l45l64p1M8K66L04K07j31m21k53K48R0
$$ -103 268 447 309 -59 -366 -443 -182 139 380 35 -329 -400 -352 -86 218 425 294 -127 -380 -132 -42
1860d2L25Q1l63l46oJ2L68K90j95j81k90j51L49K66J63m5l39j49L9J90L42J68
$$ -42 283 364 1 -345 -351 -339 29 319 124 -57 -347 -498 -149 117 280 235 -104 -253 -214 -24 318 486
1882D86k62k90j69k5M14K72m6k26m41k0J10J57M84n4n19j81j66K49N55kj28k21
$$ 486 224 -66 -235 -260 154 426 380 154 -287 -307 -197 -40 444 390 -129 -310 -476 -227 328 326 198 -23
1904b3l51L3K23K47J41k86j37j80R6J99L18o5q1l52m9J54L65Q9K1j85m58J22J17
$$ -23 -374 -341 -118 129 270 -16 -153 -333 -237 -38 280 215 134 -218 -267 -113 252 341 362 177 -281 -159 -42
1927d2L19J11k19l02j66j20M05K65n4j20m71l8J97K82J00J61k77k60p3K29K19
$$ -42 277 388 169 -133 -299 -419 -14 251 197 77 -394 -432 -235 47 147 308 31 -229 -302 -73 146
1948A46J76q4j50l02l1K46J72P8k6k49k46K35o2L64K4n3k54k88K8N22L1N3k14
$$ 146 322 238 88 -214 -245 1 173 251 225 -24 -270 -35 -97 267 291 238 -16 -304 -276 246 277 330 116
1971A16l79j13K18J51L25k53k23k57PJ69M50O0j89k76j69K76K08K56n1l16j39
$$ 116 -263 -376 -158 -7 318 65 -158 -415 -408 -239 211 271 82 -194 -363 -87 121 377 326 10 -129
1992a29l0o9L14J87n9j57j70k79J91J78K65Q4j96l68p2K42L35K01j04l08k42J
$$ -129 -159 -228 86 273 214 57 -113 -392 -201 -23 242 326 130 -238 -310 -68 267 468 364 56 -186 -185
2014a85J86L85rj00m30k43J55K76K40L3m88l08n2K41K43L15j68k70j46J1K64J25
$$ -185 1 386 377 277 -153 -396 -241 35 275 308 -180 -488 -540 -299 -56 259 91 -179 -325 -314 -50 75
2036G5K46j28j45k54OJ43L67J30pl61l47K9K64K82J96l02l94j86K06K66K65k9
$$ 75 321 193 48 -206 -200 -57 310 440 433 72 -275 -246 18 300 496 194 -200 -386 -180 86 351 322
2058C22l05l27j32K97K86MK7k96l13J63K44J64R6j34k65o7PJ83J64Q0o0j90k13
$$ 322 17 -310 -442 -145 141 145 172 -124 -437 -274 -30 134 230 96 -169 -236 -229 -46 118 198 138 -52 -265
2081b65j7R1K69N2k59j35j00P7K30L14n1l5l60nK27K71J96k46j77k69J48J92K61
$$ -265 -282 -191 78 130 -129 -264 -364 -287 -57 257 206 171 -189 -194 33 304 500 254 77 -192 -44 148 409
2104D09j09j58j86j41J01M0J43j59M5j73k49Q9L38O9j04j42J8n6M8J71K03M3k33
$$ 409 300 142 -44 -185 -84 -44 99 -60 -15 -188 -437 -348 -10 59 -45 -187 -169 -225 -177 -6 197 240 7
2127Gj46J7R8J57J97Nm74o3Q6P8K61L9k12j91n0L3L02Q9r9j60k26K00O4K27q1
$$ 7 -139 -122 -24 133 330 335 -139 -202 -116 -38 223 262 50 -141 -191 -158 144 233 134 -26 -252 -52 12 239 158
2152A58r7r9K3k26L01J90j05j27j57O2mN6J01J20k31k19J3%J68K54j60r5k42M5
$$ 158 61 -38 -15 -241 60 250 145 18 -139 -77 -81 -25 76 196 -35 -254 -241 -241 -73 181 21 -74 -316 -271
2176b71K49J62K1K9l42j69R8L26J08J84l39j14N5j5K14P8o5k22j26J9J17J18J22
$$ -271 -22 140 161 190 -152 -321 -223 103 211 395 56 -58 -3 -18 196 274 209 -13 -139 -120 -3 115 237
2199B37k50p5j19p1J46J85m1o5p7j8k3J60J30K93l01k30q2J59J33J81p4j62k48
$$ 237 -13 -88 -207 -278 -132 53 12 -53 -130 -148 -171 -11 119 412 111 -119 -201 -42 91 272 198 36 -212
2222b12K9O5K16J63j76j31o1o2J62N5J43j42j77L5o9K14K46q3k11k01k9J77K29
$$ -212 -183 -118 98 261 85 -46 -107 -169 -7 48 191 49 -128 -93 -162 52 298 215 4 -197 -226 -49 180
2245A80Q1jj71k58J6L0J3K67n2k18p9r3K57J19k6K5j89k10J23R6J43p4N4j19o2
$$ 180 261 260 89 -169 -153 -123 -110 157 105 -113 -192 -285 -28 91 65 90 -99 -309 -186 -90 53 -21 33 -86 -148
2270a48K4J16J71K7q9j60q0O2J64J39k2k29j10M6K5O5K51j82q6j87P1J93J1M8
$$ -148 -124 -8 163 190 101 -59 -139 -77 87 226 204 -25 -135 -89 -64 1 252 70 -16 -203 -132 61 72 120
2294A20p3k26j8Q5M2K87j88o5M1j29J06K45j77J33j51r5k8J04J29k8P7k04o4m1
$$ 120 47 -179 -197 -112 -70 217 29 -36 5 -124 -18 227 50 183 32 -63 -91 13 142 114 191 -13 -77 -118
2318a18J52N2J02p5k15Mr5J99J75n9j01j03M3j4R2J9m0m8m7j24K11O0M7j00l5
$$ -118 34 86 188 113 -102 -98 -193 6 181 122 21 -82 -39 -53 39 58 18 -30 -77 -201 10 70 117 17 -18
2343a8j30P1m9K57l2k8r3j98Q5N2J53O3n5l53J34o0K57L2M7j23j70N1K05J11j21
$$ -18 -148 -77 -126 131 99 71 -22 -220 -135 -83 70 133 78 -275 -141 -201 56 88 135 12 -158 -107 98 209 88
2368H8J3j34k9o2K13qM5k2j93j00R0J03K5j06p4J5KM8O6J22L7k02j21Q1J45M9
$$ 88 101 -33 -62 -124 89 81 126 104 -89 -189 -99 4 29 -77 -151 -136 -134 -86 -20 102 139 -63 -184 -103 42 91
2394I1J06o2j80p0M5K00m3O9j37j14m3j1P9J55M8j49j08J1M2K23m2m2Nk14N0J30
$$ 91 197 135 -45 -115 -70 130 87 156 19 -95 -138 -149 -70 85 133 -16 -124 -113 -71 152 110 68 73 -141 -91 39
2420C9m5R3j7j60N7k2KJ81Qj12l2k26K63Kk2J09r2r1m0P3R3n3M2m1k6J8Q2K9n5
$$ 39 -6 87 70 -90 -33 -55 -53 128 136 24 -8 -234 29 31 9 118 26 -65 -105 -32 61 8 50 9 -17 1 83 112 57
2449E7j34M1o3j05L37m2J6L2j65l1p1K30J70j90j67M1m4J35M9O4k49J2jk4o0J03
$$ 57 -77 -36 -99 -204 133 91 107 139 -26 -57 -128 102 272 82 -85 -44 -88 47 96 160 -89 -77 -78 -102 -162 -59
2475e9R4j23j7O1l1N2J09j34MM3o1P4J18j18J25k22Q0l6J2O0N0K3q4j26K8J15
$$ -59 35 -88 -105 -44 -75 -23 86 -48 -44 -1 -62 12 130 12 137 -85 -5 -41 -29 31 81 104 20 -106 -78 37
2501C7kj4r6Q1j07J16n8K16p8j82mQ0k6P8M7o1k1j11O5J5O7J06j95K6J9K8p6K00
$$ 37 35 21 -75 6 -101 15 -43 173 95 -87 -91 -11 -37 41 88 27 6 -105 -40 -25 42 148 -47 -21 -2 26 -50 150
2529A50o6j27K2j28J31j9R2j15%k7nJ81o0NK9r8O0k3J02qk9o9m0Q8q9J37J6j37
$$ 150 84 -43 -21 -149 -18 -37 55 -60 -60 -87 -92 89 29 34 63 -35 25 2 104 96 67 -2 -42 46 -43 94 110 -27
2557b7R6j57Q2N4j12Q5M6j00m9k1J38r0J58lj91N6PlJ60p1m5m8j16K62ll0N7j45
$$ -27 69 -88 -6 48 -64 21 67 -33 -82 -103 35 -55 103 100 -91 -35 -28 -31 129 58 13 -35 -151 111 108 78 135 -10
2585a0j50O4K4Q6Q0j7j23r9M0O1J30j0o0k0j54J89p6J46m0Q0k22j03J59J25j03
$$ -10 -160 -96 -72 14 94 77 -46 -145 -105 -44 86 76 16 -4 -158 31 -45 101 61 141 -81 -184 -25 100 -3
2610cQ7p6j20j8P9Q8O7m1r9r1K4N3N5J23j47k9Ko3L59j79k0j0j16n3J44O1J08
$$ -3 84 8 -112 -130 -51 37 104 63 -36 -127 -103 -50 5 128 -19 -48 -46 -109 250 71 51 41 -75 -128 16 77 185
2637A85j57K3j46K0j7J55NOj22r9R5JN0M5J23l40L7k8J11J00O9j40l9l6L5P5J10
$$ 185 28 51 -95 -75 -92 63 68 74 -48 -147 -52 -51 -1 44 167 -173 -136 -164 -53 47 116 -24 -63 -99 -64 11 121
2664A21p8k1r8N6r1J77o9Q9j14p4J6K55p3Nq3q5n1Q3J1l3R2p4l9P6j33K44l5r3
$$ 121 43 22 -76 -20 -111 66 -3 86 -28 -102 -86 169 96 101 18 -67 -118 -35 -24 -57 35 -39 -78 -2 -135 109 74 -19
2692a9J28k01P1m5M8K10j07j98J61j90J04K06q0j53J4p9J36m8J5Q1M2j46KO8J18
$$ -19 109 -92 -21 -66 -18 192 85 -113 48 -142 -38 168 88 -65 -51 -130 6 -42 -27 54 96 -50 -48 20 138
2717A38j56J37j70nn2k1J61P9j27j8n8J37q1Q9M4j31Q1o1j59K15Q8p1m7j25n5
$$ 138 -18 119 -51 -56 -108 -129 32 111 -16 -34 -92 45 -36 53 97 -34 47 -14 -173 42 130 59 12 -113 -168
2742a68J06J14k6j7K3j24n3K30q4n7P5n0O3o3L9j4Q6j15R7o5R2k4J12o1r3q9Q8
$$ -168 -62 52 26 9 32 -92 -145 85 1 -56 19 -31 32 -31 8 -6 80 -35 62 -3 89 65 177 116 23 -66 22
2769B2j40K38L0j81l3n5R8PO8p0j26J28l4j15J82J9k6j33j5N4j8O6R6k0L3p1q0
$$ 22 -118 120 150 -31 -64 -119 -21 -14 54 -16 -142 -14 -48 -163 19 38 12 -121 -136 -82 -100 -34 62 42 75 4 -76
2796g6J4Q3N6p7lj3n0O7O8M8n5p8j41J24Q2J8O3m5l9K5j13J98l7p9n7RJ27j5P5
$$ -76 -62 21 77 0 -3 -16 -66 1 69 117 62 -16 -157 -33 49 67 130 85 46 71 -42 156 119 40 -17 -8 119 104 179
2825A79m1j35n4l8P3J6m6O4k5o8lN3K15k55N1q9J40l2l8Q8n1p8J03P9j06N6o5
$$ 179 138 3 -51 -89 -16 0 -46 18 -7 -75 -78 -25 190 -65 -14 -103 37 5 -33 55 4 -74 29 108 2 58 -7
2852gM3j7j2k8l1J77J3j62O2j12NR7j3N4n7o9n7M5N4Q4Q5q1M8k36M3O9R4k0j34
$$ -7 36 19 7 -21 -52 125 138 -24 38 -74 -69 28 15 69 12 -57 -114 -69 -15 69 154 73 121 -115 -72 -3 91 71 -63
2881f3M4o5R7j26J54o6J5j9j44J38P5q0P7j90K3K4N6j0O6J51j06k09J03J72l3
$$ -63 -19 -84 13 -113 41 -25 -10 -29 -173 -35 40 -40 37 -153 -130 -106 -50 -60 6 157 51 -158 -55 117 84
2906H4k8j00N7L6p9Q8p3pQ5j20J28j27p8L28k27n7J13j19QQJ26p1o1M0q6J10J59
$$ 84 56 -44 13 49 -30 58 -15 -22 63 -57 71 -56 -134 194 -33 -90 23 -96 -88 -80 46 -25 -86 -46 -132 -22 137
2933A37j81P1o7L5nP8M2j04O2j46kJ26pOk9J1q8M4O2J2L0q4k7r2J01J49j37J62
$$ 137 -44 27 -40 -5 -10 68 110 6 68 -78 -80 46 39 45 16 27 -61 -17 45 57 87 3 -24 -116 -15 134 -3 159
2961A59j68K2r8R5J94j37k7k5m0k2Q7R6k4j00n9m7m8J05M5M9j55j8j4K1J41L1
$$ 159 -9 13 -85 10 204 67 40 15 -25 -47 40 136 112 12 -47 -94 -142 -37 8 57 -98 -116 -130 -109 32 63
2987F3l3m3q3Q1m2J16N3q0j8o5j8P3J74Jj79k8K7Jk8J2J16j05O3j35O3L1m1L9
$$ 63 30 -13 -96 -15 -57 59 112 32 14 -51 -69 4 178 179 0 -28 -1 0 -28 -16 100 -5 58 -77 -14 17 -24 15
3015A5m5R1j02P9O8j7j08J33j25ol7J50l8J4j55o4N6JJ98j53K2N1j8j9J2N2J3
$$ 15 -30 61 -41 38 106 89 -19 114 -11 -17 -54 96 58 72 -83 -147 -91 -90 108 -45 -23 28 10 -9 3 55 68
3042F8m1j04J67j91K12K3L6j04j50j1P8M1j2J00j32j07O6M8N4m8J09r6p7O9R4
$$ 68 27 -77 90 -101 111 134 170 66 -84 -95 -17 24 12 112 -20 -127 -61 -13 41 -7 102 6 -71 -2 92
3067I2Qk5j13M9o0RQ4l6j03J91j78JQ4J2J5j16N8k6l4J18R4j5j21L8o4J9J67j24
$$ 92 100 75 -38 11 -49 -40 44 8 -95 96 -82 -81 3 15 30 -86 -28 -54 -88 30 124 109 -12 26 -38 -19 148 24
3095B4M1j07p0M7j8N5Q8j1j56Q8j65K32k2Q1r8rr5M7J10m6P2k02R7J08l1J21r9
$$ 24 65 -42 -112 -65 -83 -28 60 49 -107 -19 -184 48 26 107 9 0 -95 -48 62 16 88 -114 -17 91 60 181 82
3122H2n0l6K9K6L4o4J58j79nj46Q3K5J39n8j37J24j38J38o0J51j25%p3R5L4%k0
$$ 82 32 -4 25 51 85 21 179 0 -5 -151 -68 -43 96 38 -99 25 -113 25 -35 116 -9 -9 -82 13 47 47 27
3149B7L6j58R8j66R5P9j62J66m7j25Q2P6J15k03J03o4M1p3K60j7k35J16j45Q1
$$ 27 63 -95 3 -163 -68 11 -151 15 -32 -157 -75 1 116 -87 16 -48 -7 -80 180 163 -72 44 -101 -20
3173b0k8N0P2n0j27L9M3K39p1n6j65K3k6P1L0M6k8L4j82m3R7N5L6k5n9l1m5M3
$$ -20 -48 2 74 24 -103 -64 -21 218 147 91 -74 -51 -77 -6 24 70 42 76 -106 -149 -52 3 39 14 -45 -76 -121 -78
3201g8K38k13O7QK6p8J43N9j76N5o0mk7J74l4l7r7p2k6J77j2L1n8kj84O8J06p
$$ -78 160 -53 14 22 48 -30 113 172 -4 51 -9 -13 -40 134 100 63 -34 -106 -132 45 33 64 6 4 -180 -112 -6 -13
3229a3Q3p4j03P3Op1K08L9j39m2r2O5J17p4O5j22J10j42NJK1J61j93N5L2m3Q1
$$ -13 70 -4 -107 -34 -28 -99 109 148 9 -33 -125 -60 57 -17 48 -74 36 -106 -101 -100 -79 82 -111 -56 -24 -67 14
3256A4k9P3p3j61J26J11l6J40j24j8j41R9Q7J5P0j64J3O1j32R5oq1L7n6M8qjO8
$$ 14 -15 58 -15 -176 -50 61 25 165 41 23 -118 -19 68 83 153 -11 2 63 -69 26 20 -61 -24 -80 -32 -40 -41 27
3284B7om5j64R6J20j07J00R6k07j28K91pJ4m5o5j19J53O0k5L3L0o8q0p5P8rQ3
$$ 27 21 -24 -188 -92 28 -79 21 117 -90 -218 73 66 80 35 -30 -149 4 64 39 72 102 34 -46 -121 -43 -52 31
3311C1M8j70N9j7J15J75j60m4k1j16J72M6n2m7k3o6Q9n9J71o5n0j39P2l7l4J84
$$ 31 79 -91 -32 -49 66 241 81 37 16 -100 72 118 66 19 -4 -70 19 -40 131 66 16 -123 -51 -88 -122 62
3337F2n3n2j32j5J74K6kOL5k16J89M7K7j7J5J9r4m5O5Q1k8n2j7j25nJ16MJ64j37
$$ 62 9 -43 -175 -190 -16 10 8 14 49 -167 22 69 96 79 94 113 19 -26 39 120 92 40 23 -102 -107 9 13 177 40
3366D0p9J8n2N5n6J29o3j1o4M0m9K18L6k75QJ8K0J02R7j65O8j35K1J55rO8o2r1
$$ 40 -39 -21 -73 -18 -74 55 -8 -19 -83 -43 -92 126 162 -113 -105 -87 -67 35 132 -33 35 -100 -79 76 67 135 73 -18
3394a8q3J19M4J9rj14Q0k39J36J48q0Q5j03K2r7j0J11J13n5o6j37k9J64P6o2Q2
$$ -18 -101 18 62 81 72 -42 38 -201 -65 83 3 88 -15 7 -90 -100 11 124 69 3 -134 -163 1 77 15 97
3420I7q7n0q9J64J6m3np8n5J06J13j7q3J5Qj76J77m0M1Mm3k1M3J63j36P6j18P4
$$ 97 10 -40 -129 35 51 8 3 -75 -130 -24 89 72 -11 4 12 -164 13 -27 14 18 -25 -46 -3 160 24 100 -18 56
3448E6m6l3m9J56j6O2k43P8j7J21Q4q3o5Ko5j06R5J64N7j88j26R4Q4q6J72q7p0
$$ 56 10 -23 -72 84 68 130 -113 -35 -52 69 153 70 5 7 -58 -164 -69 95 152 -36 -162 -68 16 -70 102 15 -55
3475e5K9N4l3O4n3j9Lm3k0J47j13J02j38k0Q5k1Q8q5j3k4lP4K5M4o5P0l4j17R3
$$ -55 -26 28 -5 59 6 -13 -10 -53 -73 74 -39 63 -75 -95 -10 -31 57 -28 -41 -65 -68 6 31 75 10 80 46 -71 22
3504B2L8N3Nj71Q2j04M9N6jp8J23j72R1PJ14j92J45j72J0Q0N2Q5n6o7k5j42J02
$$ 22 60 113 118 -53 29 -75 -26 30 29 -49 74 -98 -7 0 114 -78 67 -105 -95 -15 37 122 66 -1 -26 -168 -66
3531f6J22J7j21J2l2%Q0pJ24j25j7j11N3L9N1M3j2j65j30K52M6j0N0m9j31%L8
$$ -66 56 73 -48 -36 -68 -68 12 5 129 4 -13 -124 -71 -32 19 62 50 -115 -245 7 53 43 93 44 -87 -87 -49
3558d9M4O9j96J22n0rR2K2KQ2j80O0lO0o9J22J0k03LM0J13j76J20l4j0LPN5O9
$$ -49 -5 64 -132 -10 -60 -69 23 45 47 129 -51 9 6 66 -3 119 129 -74 -71 -31 82 -94 26 -8 -18 -15 -8 47 116
3587A16%o2j54K5P8o7O2J15m7j8j14L8K1LJ5K0o2M8M8m6K2n1p6j7J34l3J18q1
$$ 116 116 54 -100 -75 3 -64 -2 113 66 48 -66 -28 -7 -4 11 31 -31 17 65 19 41 -10 -86 -103 31 -2 116 35
3615C5M9k5qr3K2J45j01k1n5P7q3J61n9m1J15k65j2J94l4J31j35p0j1J20o3L8
$$ 35 84 59 51 -42 -20 125 24 3 -52 25 -58 103 44 3 118 -147 -159 35 1 132 -3 -73 -84 36 -27 11
3641A1N5r8j7m8L7J39j11J23j53kl9Q4J14o9l5N8q9q8K14M8q1r9Kp0J88j15L2
$$ 11 66 -32 -49 -97 -60 79 -32 91 -62 -64 -103 -19 95 26 -9 49 -40 -128 86 134 53 -46 -44 -114 74 -41 -9
3668imM1j15qJ20n3J41k4m7q6K9P8P9l3q2r2R4l2Q2Lq9n1Q1k11N8K37Lj42O0n0
$$ -9 -13 28 -87 -95 25 -28 113 89 42 -44 -15 63 142 109 27 -65 29 -3 79 82 -7 -58 23 -188 -130 107 110 -32 28 -22
3698b2p6K4J24J10j51j29O9o1OK73l0k49P3KM7O0N5j1j54K3mj28K12k6M2j34k4
$$ -22 -98 -74 50 160 9 -120 -51 -112 -106 167 137 -112 -39 -37 10 70 125 114 -40 -17 -21 -149 63 37 79 -55 -79
3725g9N2J3J99j22N7j07j81M7P2Q3j8N5k2q8r5J28J2o4Q1r5j36K21M1Q8pj10r5
$$ -79 -27 -14 185 63 120 13 -168 -121 -49 34 16 71 49 -39 -134 -6 6 -58 23 -72 -208 13 54 142 135 25 -70
3752g0J8N1J06n1M2j00r8l0K13R2j81Q6j96J28n5JJ18J5j9k8q7RN8L2lNj34K1
$$ -70 -52 -1 105 54 96 -4 -102 -132 81 173 -8 78 -118 10 -45 -44 74 89 70 42 -45 -36 22 54 51 56 -78 -57
3780e7O9oK8k2k74J03O0N6J23M5j17J0j46J11OR9R7j05j95R8p1J07MNk3l0L0j09
$$ -57 12 6 34 12 -262 -159 -99 -43 80 125 8 18 -128 -17 -11 88 185 80 -115 -17 -88 19 23 28 5 -25 5 -104
3808a04R0M8oL1j66P7l1K53o8n5m7j35N5L0J34j26l1l8K4K1N8R1%k14J16j07Q6
$$ -104 -14 34 28 59 -107 -30 -61 192 124 69 22 -113 -58 -28 106 -20 -51 -89 -65 -44 14 105 105 -109 7 -100 -14
3835a4J32p1P8p0j52O3m3J57m4j4m8L8l8N8QrL1ql4m1J7Q1k2Rm5M5j8l9m9L2J1
$$ -14 118 47 125 55 -97 -34 -77 80 36 22 -26 12 -26 32 40 31 62 54 20 -21 -4 77 55 64 19 64 46 7 -42 -10 1
3866AL4j9l1M7N4M7j06j40J14L2j7N9q5p7O3Q0K4o4P8p0Pj35J39n6L6n3K13k26
$$ 1 35 16 -15 32 86 133 27 -113 1 33 16 75 -10 -87 -24 56 80 16 94 24 31 -104 35 -21 15 -38 175 -51
3894e1J4M1P0Mo6J72k89J49jN0J16o0k64L9j7J92n7n5l8o3P2J00j4K3kj07k1j9
$$ -51 -37 4 74 78 12 184 -105 44 43 93 209 149 -115 -76 -93 99 42 -13 -51 -114 -42 58 44 67 65 -42 -63 -82
3922h2J37K2M3o8j01Q3Kp1J75j4j56J53k16PJ18l1J04Jj49rlJ07J59k01J2p5p5
$$ -82 55 77 120 52 -49 34 36 -35 140 126 -30 123 -93 -86 32 1 105 106 -43 -52 -55 52 211 10 22 -53 -128
3949a28N7M8J2K3m5n2R6m7k7K3m1lk0kJ11M4k0j06l6J21P1j36P2J81j43k07K01
$$ -128 -71 -23 -11 12 -33 -85 11 -36 -63 -40 -81 -84 -104 -106 5 49 29 -77 -113 8 79 -57 15 196 53 -154 47
3976D7n1O0l9j5Kj39j2J13L5O6M0o9j24j2J17L8m5m6q6rJ13J9Q2j14k5j05K05
$$ 47 -4 56 17 2 4 -135 -147 -34 1 67 107 38 -86 -98 19 57 12 -34 -120 -129 -16 3 85 -29 -54 -159 46
4003D6j99J73M5j42J0L3J20j85K65j33J2q9j07J54J01j8%n4j9j7lJ7R2n0j77P5
$$ 46 -153 20 65 -77 -67 -34 86 -99 166 33 45 -44 -151 3 104 86 86 32 13 -4 -7 10 102 52 -125 -50
4029e0K6K6n9J10o6Qp6M2O4o4N9K2j12L7o4J61L1M2r7q3o3J8K16q5J49j44L2j90
$$ -50 -24 2 -57 53 -13 -5 -81 -39 25 -39 20 42 -70 -33 -97 64 95 137 40 -43 -106 -88 128 43 192 48 80 -110
4057a10k8J30P2K5n0o4J5Q3rl1N1j03k6L7o9J30l7l7K8j28J6J03Q3r6j6j07J12
$$ -110 -138 -8 64 89 39 -25 -10 73 64 33 84 -19 -45 -8 -77 53 16 -21 7 -121 -105 -2 81 -15 -31 -138 -26
4084b6K4N0m3Pj1q4N5pJ50Nkj98J1lMJ02j8L0J01r6j37J52P7O4l17L5J5J13R8
$$ -26 -2 48 5 12 1 -83 -28 -35 115 120 118 -80 -69 -72 -68 34 16 46 147 51 -86 66 143 207 -110 -75 -60 53 151
4113A51%ok04O1p8K7K06jj97J17q2q8J90M6p2r4K7o6P3lJ33r2j76J00j06M2J02
$$ 151 151 145 -59 2 -76 -49 157 156 -41 76 -6 -94 96 142 70 -24 3 -63 10 7 140 48 -128 -28 -134 -92 10
4140A0L3N5J8j66r9J51J40l9rn0j72P2J09J1pj01om7J3J78k5m6j37k2J8N9O5P4
$$ 10 43 98 116 -50 -149 2 142 103 94 44 -128 -56 53 64 57 -44 -50 -97 -84 94 69 23 -114 -136 -118 -59 6 80
4168H0m1j80J22l9N5j6j9O5q1Kn2J42L7M6j21j31J43j72J98m6N8J0m3k1o0J50
$$ 80 39 -141 -19 -58 -3 -19 -38 27 -54 -52 -104 38 75 121 0 -131 12 -160 38 -8 50 60 17 -4 -64 86
4194H6J37j94p2L7p1P8k4L4L8o2m8P8j56J76m0L2Qn3m2K1L2J20m9j31j60K48R
$$ 86 223 29 -43 -6 -77 1 -23 11 49 -13 -61 17 -139 37 -3 29 37 -16 -58 -37 -5 115 66 -65 -225 23 32
4221C2J20l7k25R3P5q1M7KO3j57n0R5MJ50o8o9k1p8Q3O2l4J41j29j30L7J08j20
$$ 32 152 115 -110 -17 58 -23 24 26 89 -68 -118 -23 -19 131 63 -6 -27 -105 -22 40 6 147 18 -112 -75 33 -87
4248h7K79j15j14JQ3j01n2J85j20M2O1l1P6r4J24n4j30M7o3J61r6N3r8o4q8J50
$$ -87 192 77 -37 -36 47 -54 -106 79 -41 1 62 31 107 13 137 83 -47 0 -63 98 2 55 -43 -107 -195 -45
4274d5J90Ml3p7l7O8q5J3PN0O8o7k0K8R2j01k0j38nJj6J29N5j58J5J44q3m5P3
$$ -45 145 149 116 39 2 70 -15 -2 5 55 123 56 36 64 156 55 35 -103 -108 -107 -123 6 61 -97 -82 62 -21 -66 7
4303Gn2K5qJ6R4n3J55j70j63J69j47J18J69q1Lj56j04K23j6j1M7q7k2J5JO2M9
$$ 7 -45 -20 -28 -12 82 29 184 14 -149 20 -127 -9 160 79 82 -74 -178 45 29 18 65 -22 -44 -29 -28 34 83
4330H3L5j42j37kK46J35n1l1j70nL6L9JP0j87Kn8J26J34j28P1q1L3o5l5J09O4
$$ 83 118 -24 -161 -163 83 218 167 136 -34 -39 -3 36 37 107 -80 -78 -136 -10 124 -4 67 -14 19 -46 -81 28 92
4357I2m6l1j14J5J09J37k5q0j39n3J25n3K34j15n1l6J9J0M6L1j47J33j03p8P0
$$ 92 46 15 -99 -84 25 162 137 57 -82 -135 -10 -63 171 56 5 -31 -12 -2 44 75 -72 61 -42 -120 -50
4382e0J97l7m6p9k8oMM3rn3KR9n2j1Q1K3r6K8nQK2q3M6Rj78J86j08J06j09J27
$$ -50 147 110 64 -15 -43 -49 -45 -2 -11 -64 -62 37 -15 -26 55 78 -18 10 5 13 35 -48 -2 7 -171 15 -93 13 -96 31
4412C1j10p6J54j6jJ71j37J2n0j3J1O6J55j22l3p9J04j0j06J14j53j7P6m6P1Q5
$$ 31 -79 -155 -1 -17 -18 153 16 28 -22 -35 -24 42 197 75 42 -37 67 57 -49 65 -88 -105 -29 -75 -4 81
4438H1o2j23Q1m4M9L1k6J33n9n8p3J82j43JJ04j38j2P2P2l9l8r6P8j04J91L4j48
$$ 81 19 -104 -23 -67 -18 13 -13 120 61 3 -70 112 -31 -30 74 -64 -76 -4 68 29 -9 -105 -27 -131 60 94 -54
4465e4kj0rJ00Q8l6m3k8N1q7m6P3oON8r4M3j7J56mo4m8j27J05m3k7J94j27n7P0
$$ -54 -56 -66 -75 25 113 77 34 6 57 -30 -76 -3 -9 -3 55 -39 4 -13 143 139 75 27 -100 5 -38 -65 129 2 -55 15
4495A5j49L2J37p6J10j44j6m0J43R6j62J19L9j35K6J16o7L2J6o9j9Ln6R2J18k05
$$ 15 -134 -102 35 -41 69 -75 -91 -131 12 108 -54 65 104 -31 -5 111 44 76 92 23 4 7 -49 43 161 -44
4521d4K0l3j9J89q6K0j65N1N6M0J03j67k5PO4j2P0N6r3J0op4kR4m9N2j20K4r8
$$ -44 -24 -57 -76 113 27 47 -118 -67 -11 29 132 -35 -60 -53 11 -1 69 125 32 42 36 -38 -40 54 5 57 -63 -39 -137
4550a37J76j4O9p6j01O5j04K26J7J2k3j29j17J64l8O3M7j03Kr3J11R1l3n2j14
$$ -137 39 25 94 18 -83 -18 -122 104 121 133 110 -19 -136 28 -10 53 100 -3 -1 -94 17 108 75 23 -91
4575i1K5Q0ON1J0L3j46L9o1J06r3J22j61K5rl0J33n9J18j32j06O6n6J26K69l40
$$ -91 -66 14 20 71 81 114 -32 7 -54 52 -41 81 -80 -55 -64 -94 39 -20 98 -34 -140 -74 -130 -4 265 -75
4601g5L8M5j11M3J94p0L7p7o4Q8j02J75m4qj77k8R0N0P4%J6j10k8n3J78j10R2
$$ -75 -37 8 -103 -60 134 64 101 24 -40 48 -54 121 77 69 -108 -136 -46 4 78 78 94 -16 -44 -97 81 -29 63
4628F3r2QR1j51J43M0J7j29j20J15O6k7n6N4k%j0OO1p6o5MK4RJ35j3k3j06l9l1
$$ 63 -29 -21 70 -81 62 102 119 -10 -130 -15 51 24 -32 22 20 20 10 16 77 1 -64 -60 -36 -27 108 95 72 -34 -73 -104
4658a04M5J51q7J28j21k5RO3NnN5j60qJ5K3L7J2l8m8NP8n5J8j4N0j18ol7K58m
$$ -104 -59 92 5 133 12 -13 -4 59 64 59 114 -46 -54 -39 -16 21 33 -5 -53 -48 30 -25 -7 -21 29 -89 -95 -132 126 122
4688A22m4r0%N2Pj2M2N5j65j7J8J14j06N9l3J37j71o6J15L0J35l43R0k6K2P1R0
$$ 122 78 -12 -12 40 47 35 77 132 -33 -50 -32 82 -24 35 2 139 -32 -98 17 47 182 -161 -71 -97 -75 -4 86
4715H6j25m1J4K7J13k8j5k3r7P8n1J39N7K8k63P1K5m6J56Rp2j05rN3q3J15K9K2
$$ 86 -39 -80 -66 -39 74 46 31 8 -89 -11 -62 77 134 162 -101 -30 -5 -51 105 114 42 -63 -72 -19 -102 13 42 64
4743F4q7l3oJ1J43j2r8J1j51P2L5J30Qo1n0J4qJ9O4M3p9j39J02j64J01J46j2j15
$$ 64 -23 -56 -62 -51 92 80 -18 -7 -158 -86 -51 79 87 26 -24 -10 -18 1 65 108 29 -110 -8 -172 -71 75 63 -52
4771e2n2P5L9N2Rl3k8M2k7p3K02j3j35L4q7J7m9P5mK0q9j05J61p3R2O5j43k2j4
$$ -52 -104 -29 10 62 71 38 10 52 25 -48 154 141 6 40 -47 -30 -79 -4 -8 12 -77 -182 -21 -94 -2 63 -80 -102 -116
4800a16K44j49k1J25n5n2N1k5P0P0j45k7n2K8J06N0o2j50P8j88K84K2m4m5l9M7
$$ -116 128 -21 -42 83 28 -24 27 2 72 142 -3 -30 -82 -54 52 102 40 -110 -32 -220 64 86 42 -3 -42 5
4826Ek3L4O4j05J25N7k99J08Jm3J75j44m2l9J26N1K6j8j6j56m5J60P9k2J1m6p5
$$ 5 -18 16 80 -25 100 157 -142 -34 -33 -76 99 -45 -87 -126 0 51 77 59 43 -113 -158 2 81 59 70 24 -51
4853e1n9J76l6J9q7OL7r3O4J33j23R4q8j20L00j36O3K8r6M9j02J5Q4Q8j37J6j65
$$ -51 -110 66 30 49 -38 -32 5 -88 -24 109 -14 80 -8 -128 172 36 99 127 31 80 -22 -7 77 165 28 44 -121
4880a21jJ66o5J17m6j92L4M1M7R1k0L4l7j0K3O0j44J17j12P2q6O7J20n4j07m1
$$ -121 -122 44 -21 96 50 -142 -108 -67 -20 71 51 85 48 38 61 121 -23 94 -18 54 -32 35 155 101 -6 -47
4906d7q8J85j34J29P5j76Q6j08J07M7r5J17r6p9k7k0J62J57j24j61m7NJ75J01
$$ -47 -135 50 -84 45 120 -56 30 -78 29 76 -19 98 2 -77 -104 -124 38 195 71 -90 -137 -132 43 144
4930A44m7J28j93j90J78j1j6Q5j03K2o4J28o4l1J37j72Q4q4K6J18l8J03j61l2
$$ 144 97 225 32 -158 20 9 -7 78 -25 -3 -67 61 -3 -34 103 -69 15 -69 -43 75 37 140 -21 -53
4954e3kRk6J87j77J55j78LR7l6M3p3L3j49L8P8J83p7k2r5m2%J55QO1j56L6l2J9
$$ -53 -55 -46 -72 115 -62 93 -85 -82 15 -21 22 -51 -18 -167 -129 -51 132 55 33 -62 -104 -104 51 59 120 -36 0 -32 -13
4983a3J63q6j2J0m6j02m7J81J39j77n7m6l7J37N6J2p4l5KLJ40k5o0nq6NM5J0k0
$$ -13 150 64 52 62 16 -86 -133 48 187 10 -47 -93 -130 7 63 75 1 -34 -32 -29 111 86 26 21 -65 -60 -15 -5 -25
5012b5L3q2o1KJ22N9M5j02o3ko2J48l8J75j74J22rj5o9M0j1j33J01oN4r5J5KJ1
$$ -25 8 -74 -135 -133 -11 48 93 -9 -72 -74 -136 12 -26 149 -25 97 88 73 4 44 33 -100 1 -5 49 -46 -31 -29 -18
5041a8M6k20K61N6j03j0np1n6J33R4j80O3p0K0oJ23J9j25J32j37n6N4K6K7rM6
$$ -18 28 -192 69 125 22 12 7 -64 -120 13 107 -73 -10 -80 -60 -66 57 76 -49 83 -54 -110 -56 -30 -3 -12 34
5068C4j21J48M7j23R3q1M4j27L6N3J5rJj5m1O2OR2m7p1N2j31M0J09J7J19k63j00
$$ 34 -87 61 108 -15 78 -3 41 -86 -50 3 18 9 10 -5 -46 16 22 114 67 -4 48 -83 -43 66 83 202 -61 -161
5096a61R6P1J4P3n1k0q1K4J60m0r0O5k3j08P6q9N6J32r4N7j51L5J41q6k7L1q6
$$ -161 -65 6 20 93 42 22 -59 -35 125 85 -5 60 37 -71 5 -84 -28 104 10 67 -84 -49 92 6 -21 10 -76
5123g6P4p5J25K8j17Rp2J20N4L5l8q1kp2M1R6qJ0j13P9p5K2j6J60j14%j18P8n9
$$ -76 -2 -77 48 76 -41 -32 -104 16 70 105 67 -14 -16 -88 -47 49 41 51 -62 17 -58 -36 -52 108 -6 -6 -124 -46 -105
5152a05P4Q8Lo1r9M4M0Q8K5l5j06l0k2J51J38j67O0j67j4J69L3pn7n7j27J08n2
$$ -105 -31 57 60 -1 -100 -56 -16 72 97 62 -44 -74 -96 55 193 26 86 -81 -95 74 107 100 43 -14 -141 -33 -85
5179h5J21l6J19p3j01L4J28j4j7K0j47p0J33L0N8j7l2j37O3o1J8J01m0m3p9J15
$$ -85 36 0 119 46 -55 -21 107 93 76 96 -51 -121 12 42 100 83 51 -86 -23 -84 -66 35 -5 -48 -127 -12
5205a2l5lJ59j85j34J21O6l2J52J01j61q3o4K03q9p8J61j45PN4K9n7J09Ol6r1
$$ -12 -47 -50 109 -76 -210 -89 -23 -55 97 198 37 -46 -110 93 4 -74 87 -58 -51 3 32 -25 84 90 54 -37
5231c7l9P6M4L7j35J0n3J69r4J52r9j44J35j39m7K53N1o6l4P8k43J81p1L3J00
$$ -37 -76 0 44 81 -54 -44 -97 72 -22 130 31 -113 22 -117 -164 89 140 74 40 118 -125 56 -15 18 118
5256A18j04j24N2l4M0O7p3n1j03J58J04m7r0J82j38K9Q2j6j28J30N1q7M3j23L5
$$ 118 14 -110 -58 -92 -52 15 -58 -109 -212 -54 50 3 -87 95 -43 -14 68 52 -76 54 105 18 61 -62 -27
5281b7jN2n6J8%JL7n8J06r3J2MK6k4J07j0p5j31J30J03r9m7QO1j37K09n0p4R3
$$ -27 -28 24 -32 -14 -14 -13 24 -34 72 -21 -9 -5 21 -3 104 94 19 -112 18 121 22 -25 -17 44 -93 116 66 -8 85
5310H5m9r8J9J9L5K72j89j8k05J91j08Q8J20k33N1j9O0L6Lkr3j4M7Nk8J31n0j12
$$ 85 36 -62 -43 -24 11 283 94 76 -129 62 -46 42 162 -71 -20 -39 21 57 60 58 -35 -49 -2 3 -25 106 56 -56
5338e6J23mK9L4j9j81L4j27J04J19j2OQj15o7K1R8J0P0j20k2m7J13J12K5j49Q4
$$ -56 67 63 92 126 107 -74 -40 -167 -63 56 44 50 58 -57 -124 -103 -5 5 75 -45 -67 -114 -1 111 136 -13 71
5365G1k6j23J66J6J03k99L5O2j03K26r4M0p6k4j15K17M7l0q2p1o4Q3k4J15p3Q5
$$ 71 45 -78 88 104 207 -92 -57 5 -98 128 34 74 -2 -26 -141 76 123 93 11 -60 -124 -41 -65 50 -23 62
5391F2L0j53p7N5O1R3j77N9L1l0RN6K2rk7Q0m2%O1J3m2j53l0Q9P0J9j10m3n8J35
$$ 62 92 -61 -138 -83 -22 71 -106 -47 -16 -46 -37 19 41 32 5 85 43 43 104 117 75 -78 -108 -19 51 70 -40 -83 -141 -6
5421fp3R5jM3j6r2L4k0J25j3K5j71R4j06J12N5l4om4M4j59J27n2P0p1L9L1j36
$$ -6 -79 16 15 58 42 -50 -16 -36 89 76 101 -70 24 -82 30 85 51 45 1 45 -114 13 -39 31 -40 -1 30 -106
5449a06J33Q3n0j39PnK4J07M0r1O5k46J00O1j9l4J3j37Q5M8JJ79po8j04j07K95
$$ -106 27 110 60 -79 -72 -77 -53 54 94 3 68 -178 -78 -17 -36 -70 -57 -194 -109 -61 -60 119 112 44 -60 -167 128
5476A28p4j27R4NMj58J50k0l4K8J8l1j1J29N0j68O1j47m8K57m6O4q7j13n5O8L7
$$ 128 54 -73 21 26 30 -128 22 2 -32 -4 14 -17 -28 101 151 -17 44 -103 -151 106 60 124 37 -76 -131 -63 -26
5503b6J33j29J30j16p7M2QNJ50q7j70J9J39J6P6j32M8j0N2P0o5k1Nj0j85J50J13
$$ -26 107 -22 108 -8 -85 -43 -35 -30 120 33 -137 -118 21 37 113 -19 29 19 71 141 76 55 60 50 -135 15 128
5530A28q7l6j0L3j02O8n5J49j31J2q5L7J10M0Q1r4o7r2J98j88J78M5n4k07R3R3
$$ 128 41 5 -5 28 -74 -6 -61 88 -43 -31 -116 -79 31 71 152 58 -9 -101 97 -91 87 132 78 -129 -36 57
5556E7p6OJ2K5rj10P4J06j46R1kj23oj5R6J23m3p9j7N7J0p0J71m8q4m3J0PnJ52
$$ 57 -19 -13 -1 24 15 -95 -21 85 -61 30 28 -95 -101 -116 -20 103 60 -19 -36 21 31 -39 132 84 0 -43 -33 -26 -31 121
5586A21q9n6q1J37K9j0mk1r5r3J3Q9J28j14m7J54o6K2o5J42J22j84p3k1L6R6k4
$$ 121 32 -24 -105 32 61 51 47 26 -69 -162 -149 -60 68 -46 -93 61 -5 17 -48 94 216 32 -41 -62 -26 70 46
5613D6j3n0n6J20m6J48l5o7J0p8L3L6m1K6jj95M0J14P7l1m1l4O5j5P6k7K7J8k03
$$ 46 33 -17 -73 47 1 149 114 47 57 -21 12 48 7 33 32 -163 -123 -9 68 37 -4 -38 27 12 88 61 88 106 -97
5642i7p3K15q1K6J11r5m7J4o2J33MK0j24o1K7Q2K9n6L8qO0n1PL2j1p0MnL2J6K7
$$ -97 -170 45 -36 -10 101 6 -41 -27 -89 44 48 68 -56 -117 -90 -8 21 -35 3 -5 55 4 11 43 32 -38 -34 -39 -7 9 36
5673C6Q8j04j8j3o0R8n7M7L7m2l9O1O6j89N5L8j19K5P4Q6l9l0j3n0Q1Q2o5j4O0
$$ 36 124 20 2 -11 -71 27 -30 17 54 12 -27 34 100 -89 -34 4 -115 -90 -16 70 31 1 -12 -62 19 101 36 22 82
5702H2j29J18n9lko2P9k6P8k08K31j52o1J37r8J09p7O5q4J46q5p2J72p8j0Jj3
$$ 82 -47 71 12 9 7 -55 24 -2 76 -132 99 -53 -114 23 -75 34 -43 22 -62 84 -1 -73 99 21 11 12 -1
5729aLk5o2L7J49l7l1p5l9P0P6Q0j11m7k2rJ04mqn7o8k4J01KO3o9j16nqON5J01
$$ -1 2 -23 -85 -48 101 64 33 -42 -81 -11 65 145 34 -13 -35 -44 60 56 48 -9 -77 -101 0 2 65 -4 -120 -125 -133 -127 -72 29
5761B9j9j51R6k4R2J0RnJ8j19m0J94l8M2L5j31j48J96l5n0Q5m9m3k5J47J1j5J
$$ 29 10 -141 -45 -69 23 33 42 37 55 -64 -104 90 52 94 129 -2 -150 46 11 -39 46 -3 -46 -71 76 87 72 73
5789G3j1L9l3j2N4o4p5MkKNm8R4j31m1J50j30Q7n5p9K53j68j4jJ17M2m8J4n1K2
$$ 73 62 101 68 56 110 46 -29 -25 -27 -25 -20 -68 26 -105 -146 4 -126 -39 -94 -173 80 -88 -102 -103 14 56 8 22 -29 -7
5819gk9k4O6o9k5J32r4j1J69p0RN2n4P1j20M3K1L6j1j75N5O9m0K1M4j24N4K5k2
$$ -7 -36 -60 6 -63 -88 44 -50 -61 108 38 47 99 45 116 -4 39 60 96 85 -90 -35 34 -6 15 59 -65 -11 14 -8
5848hkLL1q2M1N2o6O9mj0r4k2M8L3M2Mm9k0r4J04P6r5j12J59j18Q7JK4L7j1m1
$$ -8 -10 -7 24 -58 -17 35 -31 38 34 24 -70 -92 -44 -11 31 35 -14 -34 -128 -24 52 -43 -155 4 -114 -27 -26 -2 35 24 -17
5879a7M6J2j00J20o0ON4m3q1M7m6J6Q0rj61J51N5N3o7r7n6O3Q3Q2%j23j2j43J96
$$ -17 29 41 -59 61 1 7 61 18 -63 -16 -62 -46 34 25 -136 15 70 123 56 -41 -97 -34 49 131 131 8 -4 -147 49
5908D9n1On5J70k0j24J49j52qj9P5j43J42j18O8J9J3L8lQJ7k4m6n7j8N5m2J06
$$ 49 -2 4 -51 119 99 -25 124 -28 -36 -55 20 -123 19 -99 -31 -12 1 39 36 44 61 37 -9 -66 -84 -29 -71 35
5936C5J4R1k58qJ00M3MN9L1k09P8j10J36N9r2l2P7j12M8K9P8p4p7l2N1Q2j33K64
$$ 35 49 140 -118 -126 -26 17 21 80 111 -98 -20 -130 6 65 -27 -59 18 -94 -46 -17 61 -13 -90 -122 -71 11 -122 142
5964A42j37n3K4m1J40l3N0qj44P5k8k6K52j41j6j35O5J6k5J30o9k30J13N4kP1
$$ 142 5 -48 -24 -65 75 42 92 84 -60 15 -13 -39 213 72 56 -79 -14 2 -23 107 38 -192 -79 -25 -27 44
5990D4k7K9L6j58l9J30J0Q2j86p2M6L8L4nO3k0o0k4Q4k0J17k5k8q4O1j7%l1R5
$$ 44 17 46 82 -76 -115 15 25 107 -79 -151 -105 -67 -33 -38 25 5 -55 -79 5 -15 102 77 49 -35 26 9 9 -22 73
6019G3j87J21n4M8M2j5M0o2N1r9J75j11K0j37R4r4J41r0O1L1l3j36R9p3J32j8
$$ 73 -114 7 -47 1 43 28 68 6 57 -42 133 22 42 -95 -1 -95 46 -44 17 48 15 -121 -22 -95 37 19
6045A9n6J9k0k2K7N4qm8rmqM8P3j2j6j6mR1j08O5K4o2M4j46ML0P6p9m6N0J1O0
$$ 19 -37 -18 -38 -60 -33 21 13 -35 -44 -48 -56 -8 65 53 37 21 17 108 0 65 89 27 71 -75 -71 -41 35 -44 -90 -40 -29 31
6077C1j1o2L3oQP6k3l0O2m4n4k9l9j1J41k4q8K4M1O5l7oL1q4K2M1N1q4N8p0qM2
$$ 31 20 -42 -9 -15 -7 69 46 16 78 34 -20 -49 -88 -99 42 18 -70 -46 -5 60 23 17 48 -36 -14 27 78 -6 52 -18 -26 16
6109A6m9LpN8oj91J58L5MQJ39j72j2j04J12Q6q3l7K8Q0r8NJ73r7nj5j65J13k3
$$ 16 -33 -30 -37 21 15 -176 -18 17 21 29 168 -4 -16 -120 -8 78 -5 -42 -14 66 -32 -27 146 49 44 29 -136 -23 -46
6138d6M0q5O0l3J17p5M1j13J25r4M0o9J8J19k0k4M3j05J08o4p1J48j29mQ8k4m
$$ -46 -6 -91 -31 -64 53 -22 19 -94 31 -63 -23 -92 -74 45 25 1 44 -61 47 -17 -88 60 -69 -73 15 -9 -13
6165a3K5J35j21J3j36J66k6p7J27R0k75k9J37m6M5J00j46J37j91R6ro9J8m7J34
$$ -13 12 147 26 39 -97 69 43 -34 93 183 -92 -121 16 -30 15 115 -31 106 -85 11 2 -67 -49 -96 38
6190C8o5L4rj03J11m4M1J9j09N5P9lj32J15Q6j48P7K9j48N7l5j1L9L8N0j10J8
$$ 38 -27 7 -2 -105 6 -38 3 22 -87 -32 47 44 -88 27 113 -35 42 71 -77 -20 -55 -66 -27 11 61 -49 -31
6217c1J1l7R6l1L6m1r5N1j1J11q1J9q4NM8l7L0j2%M7K7K9Q4j97lJ77j25K7N7j0
$$ -31 -20 -57 39 8 44 3 -92 -41 -52 59 -22 -3 -87 -82 -34 -71 -41 -53 -53 -6 21 50 134 -63 -66 111 -14 13 70 60
6247F0j49J48k5M4j6l1O1j9j19K4P6Pj73J29m9j3J9L6j1M7l7Qkq1J11j24Q6o0
$$ 60 -89 59 34 78 62 31 92 73 -46 -22 54 61 -112 17 -32 -45 -26 10 -1 46 9 17 15 -66 45 -79 7 -53
6275e3R9n7lm9N1Q3n3J1J4l5O5l7o8J2L9L9o7J04j10j2n5L0%Q7L0N2j69P6j6o6
$$ -53 46 -11 -14 -63 -12 71 18 29 43 8 73 36 -32 -20 19 58 -9 95 -15 -27 -82 -52 -52 35 65 117 -52 24 8 -58
6305e8J65j14j3j1q8J16j05R8O3r9NL3r5Q9J17j04q4J20l5m3jM1L7M9r0J26j09
$$ -58 107 -7 -20 -31 -119 -3 -108 -10 53 -46 -41 -8 -103 -14 103 -1 -85 35 0 -43 -44 -3 34 83 -7 119 10
6332A0o0m1J67j3j36N0p1P6p6M3lN9q9L1QO8M2j01O6q1K1M0lR5p8q5N2R1n5j21
$$ 10 -50 -91 76 63 -73 -23 -94 -18 -94 -51 -54 5 -84 -53 -45 23 65 -36 30 -51 -30 10 7 102 24 -61 -9 82 27 -94
6362i4Q8l3n7K2J47M5j07N1j00P2r7J17K1Pj03J38j86o4J13N3j5m9Q2k59J82j4
$$ -94 -6 -39 -96 -74 73 118 11 62 -38 34 -63 54 75 82 -21 117 -69 -133 -20 33 18 -31 51 -208 -26 -40
6388d0J11j07MM7l1K8P2K6j50mj6M4o6J12J0j23P7O7j46J19P6Lr6LL0q0J2l4J32
$$ -40 71 -36 -32 15 -16 12 84 110 -40 -44 -60 -16 -82 30 40 -83 -6 61 -85 34 110 113 17 20 50 -30 -18 -52 80
6417H0m1j29R4O8k0K4m8q3M9l1JM2M%j06K06k12J85r1o2N3m0J36j76J37q9N0j09
$$ 80 39 -90 4 72 52 76 28 -55 -6 -37 -36 6 10 10 -96 110 -102 83 -8 -70 -17 -57 79 -97 40 -49 1 -108
6445a08M8R1P7r9k9p1O0M9m8Rjl0K2pj4Q0K0q5K1O9k9m4j7O2q6J51k10kR6ko3
$$ -108 -60 31 108 9 -20 -91 -31 18 -30 -21 -22 -52 -30 -37 -51 29 49 -36 -15 54 25 -19 -36 26 -60 91 -119 -121 -25 -27 -90
6476i0J14q0K4k8O5n6N2n0N4L7J4j09J36j30K3R6n7j24L2J67k1K5r4n4L1K5P3
$$ -90 24 -56 -32 -60 5 -51 1 -49 5 42 56 -53 83 -47 -24 72 15 -109 -77 90 69 94 0 -54 -23 2 75
6503G5j7p2k5k6J7K9R9O5j61m5Q4j00K1N8m4J37j16N0L1m0M6p0j3j0J28n7K5r
$$ 75 58 -14 -39 -65 -48 -19 80 145 -16 -61 23 -77 -56 2 -42 95 -21 29 60 20 66 -4 -17 -27 101 44 69 60
6531F0l7j15k6N0J16j50L3n0J55j63L2J70j11J09p5j38J39j45J28J25p9Lj70P0
$$ 60 23 -92 -118 -68 48 -102 -69 -119 36 -127 -95 75 -36 73 -2 -140 -1 -146 -18 107 28 31 -139 -69
6555f9P8j3ol1J6Q5j8j26R7L5p2k2O3r8R5k6O7J8l1Rl9Om5pP2j18J24o3o3R9k1
$$ -69 9 -4 -10 -41 -25 60 42 -84 13 48 -24 -46 17 -81 14 -12 55 73 42 51 12 18 -27 -34 38 -80 44 -19 -82 17 -4
6586dJ4o4J21j1o9M3J30j65L8j41J17L4l8J5j95J95r3O7K2J4j23oJ21j10J26l8
$$ -4 10 -54 67 56 -13 30 160 -5 33 -108 9 43 5 20 -175 20 -73 -6 16 30 -93 -99 22 -88 38 0
6612@o5K6K5N1j22K09j39M8l5m3j46J97kq0MJ33j95O2mK0J01J0M1k18J46p7K7
$$ 0 -65 -39 -14 37 -85 124 -15 33 -2 -45 -191 6 4 -76 -72 61 -134 -72 -76 -56 45 55 96 -122 24 -53 -26
6639b6J2r9Q3K1l3P9N6O2j64k4p0M1R3p2j5L3M9j23K5J48k1m5k3LP0l8L8l1m9
$$ -26 -14 -113 -30 -9 -42 37 93 155 -9 -33 -103 -62 31 -41 -56 -23 26 -97 -72 76 55 10 -13 -10 60 22 60 29 -20
6668b0K5P5k8jn1j9M0K6p9K6m5R9kO5j24l8J25l1r1j12J37nL1n7J5r8P7J0O4P7
$$ -20 5 80 52 51 0 -19 21 47 -32 -6 -51 48 46 111 -13 -51 74 43 -48 -160 -23 -28 3 -54 -39 -137 -60 -50 14 91
6698I1j48L8O5q6J31k2q6PM0J4j3o0N9j06J60j01rR0J5j08mN6K0l5j4m4P9Mj37
$$ 91 -57 -19 46 -40 91 69 -17 -10 30 44 31 -29 30 -76 84 -17 -26 64 79 -29 -33 23 43 8 -6 -50 29 33 -104
6727a04J49j9J7pj8q7Q4j06M3l5M2M7R2p1j93J20k4m5O9k9j0M7M0L3km3J02j97
$$ -104 45 26 43 36 18 -69 15 -91 -48 -83 -41 6 98 27 -166 -46 -70 -115 -46 -75 -85 -38 2 35 33 -10 92 -105
6755a05Q8N2r9M6K1K4m2L5q0J59n3n2J22n0r8o4J53j21J13p3J65j50p0P5M9l1
$$ -105 -17 35 -64 -18 3 27 -15 20 -60 99 46 -6 116 66 -32 -96 57 -64 49 -24 141 -9 -79 -4 45 14
6781A4k8n7l4J51r7O6j3lj0Q3n8Ml3O0r6l2J01p4K7J47k4Q5k29n0R5Q1j2l8N4
$$ 14 -14 -71 -105 46 -51 15 2 -1 -11 72 14 18 -15 45 -51 -83 18 -56 -29 118 94 179 -50 -100 -5 76 64 26 80
6810H0o0o2l4J58j06j04J46k7r2P8Ko5J14oo7M8J36o9j60R8nl6K6P1r3RO5j73
$$ 80 20 -42 -76 82 -24 -128 18 -9 -101 -23 -21 -86 28 22 -45 3 139 70 -90 8 3 -33 -7 64 -29 -20 45 -128
6838a28K9J83j86J50p1l0k5J35j12J49j25op1N4O6n2l6O9L6n1r7J99j02J7k4o3
$$ -128 -99 84 -102 48 -23 -53 -78 57 -55 94 -31 -37 -108 -54 12 -40 -76 -7 29 -22 -119 80 -22 -5 -29 -92
6864i2L8k3J10j38RP9j9M9k6L2Q0j16K9l2R2k0J0j01mJ34p5K5j42K02j92L8J7
$$ -92 -54 -77 33 -105 -96 -17 -36 13 -13 19 99 -17 12 -20 72 52 62 -39 -43 91 16 41 -101 101 -91 -53 -36
6891c6l9O2KK1k0K6o8ON1Qn5M6nO4M5j37J67j54m0N7l7KP1r3Q2j38J39j22P9m4
$$ -36 -75 -13 -11 10 -10 16 -52 -46 5 13 -42 4 -1 63 108 -29 138 -16 -56 1 -36 -34 37 -56 26 -112 27 -95 -16 -60
6921f0J84j04L6n6J2k1l0L6L8l0l6Nl1oJ26j99J62m6J11Ko4Kj2p6Q4Mj23J37K9
$$ -60 124 20 56 0 12 -9 -39 -3 35 5 -31 -26 -57 -63 63 -136 26 -20 91 93 29 31 19 -57 27 31 -92 45 74
6950G4R6j96MN7L6j56J78Nj21P9op4j7L1J9l7l2K4J20p2j53J64M9j56M8rJ47j33
$$ 74 170 -26 -22 35 71 -85 93 98 -23 56 50 -24 -41 -10 9 -28 -60 -36 84 12 -141 23 72 -84 -36 -45 102 -31
6978c1m1R0N1j39P4J9n2n2LN2j9q7O0N7j1J15r0M2j3j63J15j4k6L9Q1Lo2L6j37
$$ -31 -72 18 69 -70 4 23 -29 -81 -78 -26 -45 -132 -72 -15 -26 89 -1 41 28 -135 -20 -34 -60 -21 60 63 1 37 -100
7007a00P8j8k0K1J12j57k1J26K2j09R0j3K1p8J21J09p8j78P7K2j48N7J07J3p5
$$ -100 -22 -40 -60 -39 73 -84 -105 21 43 -66 24 11 32 -46 75 184 106 -72 5 27 -121 -64 43 56 -19
7032a9M6j10O8L2k1o2P8J3J06j80N7L9P3k9k2p8Q7O8k43J09J02j09P2r7O5P7j81
$$ -19 27 -83 -15 17 -4 -66 12 25 131 -49 8 47 120 91 69 -9 78 146 -97 12 114 5 77 -20 45 122 -59
7059e9M7p9Q1J44r8O7Jr5k7kJ22p8j4lO5p5J14j93N6J24j20k9J8N8m6R5j44J39
$$ -59 -12 -91 -10 134 36 103 104 9 -18 -20 102 24 10 7 72 -3 111 -82 -26 98 -22 -51 -33 25 -21 74 -70 69
7087F9J%r0O0k1l7p0N6J02o2l2KJk0l1N8K2l5P8N3j84P8j4J7K1p5Rj0K5O8j48
$$ 69 70 70 -20 40 19 -18 -88 -32 70 8 -24 -22 -21 -41 -72 -14 8 -27 51 104 -80 -2 -16 1 22 -53 -44 -54 -29 39 -109
7118a09J88r9J3Q6p8l5P3j42J76p2j05J37l1J7jm5J0P7j45J54m5O7j17Q5j3n6
$$ -109 79 -20 -7 79 1 -34 39 -103 73 1 -104 33 2 19 18 -27 -17 60 -85 69 24 91 -26 59 46 -10
7144a0q6P1l2L4K22k36K9L8K1r1O1K7j27N0lq6J66j1n5Q3j32J60j37Q6l0KQK6
$$ -10 -96 -25 -57 -23 199 -37 -8 30 51 -40 21 48 -79 -29 -32 -118 48 37 -18 65 -67 93 -44 42 12 14 22 48
7172D8J7k5r5R6l5r3J01kL5q8qQ8nL8o5Lj10M8K2J8p3M1R4M0Pn1l1Q9j31l4o1
$$ 48 65 40 -55 41 6 -87 14 12 47 -41 -49 39 34 72 7 10 -100 -52 -30 -12 -85 -44 50 90 97 46 15 104 -27 -61 -122
7203a22M9%J39K7K3n9%NJ8r3M7Pj52Q7K7r3K3j5J6J96j65K8M3j3K9j73J15j21
$$ -122 -73 -73 66 93 116 57 57 62 80 -13 34 41 -111 -24 3 -90 -67 -82 -66 130 -35 -7 36 23 52 -121 -6 -127
7231a27J40o8P1l6M2l4%n4N7j6q7K02j08K7J12j43l6L0l5J08j5p8j2Q3l0l0M3
$$ -127 13 -55 16 -20 22 -12 -12 -66 -9 -25 -112 90 -18 9 121 -22 -58 -28 -63 45 30 -48 -60 23 -7 -37 6
7258FN0r1m1L8P6l9J7J3m0R4k18J19oq6J78r0K0O9o3n7pP5M9r0%K1K6r6P0l5n
$$ 6 56 -35 -76 -38 38 -1 16 29 -11 83 -135 -16 -22 -108 70 -20 0 69 6 -51 -58 17 66 -24 -24 -3 23 -73 -3 -38 -43
7289d3m2J17RNr5l3J43O5r0o6R5r6n4L7l6N9P3K7j42N2O6l1q1J41p4Nj2Q2n4n8
$$ -43 -85 32 41 46 -49 -82 61 126 36 -30 65 -31 -85 -48 -84 -25 48 75 -67 -15 51 20 -61 80 6 11 -1 81 27 -31
7319c1J0p9Q8L0Jq6J33Qn6j13Q4LJ0NQ4l1j42KR3qJ4n4K5J0N6r3L4K3K7J9m5o2
$$ -31 -21 -100 -12 18 19 -67 66 74 18 -95 -11 -8 2 7 91 60 -82 -80 13 5 19 -35 -10 0 56 -37 -3 20 47 66 21 -41
7351d1P1k8j1j18J00l6J08Q8q6j37J09P3q2l1k8J31l7m2L9L5j87J08O7n8j5k0
$$ -41 30 2 -9 -127 -27 -63 45 133 47 -90 19 92 10 -21 -49 82 45 3 42 77 -110 -2 65 7 -8 -28
7377b8j9R5n7j9L6n0%QL3Q8n2n6O5o8k3R6Nq4N6p5j6J01J0K9k7l4k5Q3oK1r8O8
$$ -28 -47 48 -9 -28 8 -42 -42 -34 -1 87 35 -21 44 -24 -47 49 54 -30 26 -49 -65 36 46 75 48 14 -11 72 66 87 -11 57
7409E7n5l9L2q3O9K0n6R6j4kqq5J08q0m7K20k78J97Pj37K23q6l4p0O3q2K1K6k9
$$ 57 2 -37 -5 -88 -19 1 -55 41 27 25 17 -68 40 -40 -87 133 -145 52 59 -78 145 59 25 -45 18 -64 -43 -17 -46
7438d6J5Jn8J54q2p8n3QJ53K1Lj20O0J17j47N7J5oJ08j48oQ0nMr8N7J01j39Q1
$$ -46 -31 -30 -88 66 -16 -94 -147 -139 14 35 38 -82 -22 95 -52 5 20 14 122 -26 -32 48 43 47 -51 6 107 -32 49
7467D9J5L6j18P2j12p7J47L2o7J3J7n1Q1p0O4k6M0j6p4J29p9j40J74p2k1J18o5
$$ 49 64 100 -18 54 -58 -135 12 44 -23 -10 7 -44 37 -33 31 5 45 29 -45 84 5 -135 39 -33 -54 64 -1
7494aP6j17J05j47O4N9L3Rr1rK8j9J4J9l1M1K6j29o9J41p1J87L2j96j6J8L3L6
$$ -1 75 -42 63 -84 -20 39 72 81 -10 -19 9 -10 4 23 -8 33 59 -70 -139 2 -69 118 150 -46 -62 -44 -11 25
7522B5j14J74o3j06K5J76j00L9r3Nj0N1P6j02o1J21Lpo4M7N5j02K7k3JJ0J05j25
$$ 25 -89 85 22 -84 -59 117 17 56 -37 -32 -42 9 85 -17 -78 43 46 39 -25 22 77 -25 2 -21 -20 -10 95 -30
7550c0J51p7o6p3jP8q1k9K02n3p4M8LP4r1K5o7J72j50rK8Ojo7R4j14Q0J0P9p8
$$ -30 121 44 -22 -95 -96 -18 -99 -128 74 21 -53 -5 -2 72 -19 6 -61 111 -39 -48 -20 -14 -15 -82 12 -102 -22 -12 67 -11
7580a1m0P2l4N9j0L1Ln1L9J%j11J11M8j5r1m7N6R0k2l2j11J9j7K8J05j45j7J38
$$ -11 -51 21 -13 46 36 67 70 19 58 59 59 -52 59 107 92 1 -46 10 100 78 46 -65 -46 -63 -35 70 -75 -92 46
7609D6q4m2jN1J02j15J4N6J32j82Oj2J47q6K6k5j5N2l3r0Q8jn3O3k7j57N4J51
$$ 46 -38 -80 -81 -30 72 -43 -29 27 159 -23 -17 -29 118 32 58 33 18 70 37 -53 35 34 -19 44 17 -140 -86 65
7637F5j12r2J15Q4Q9j41J3k0n0j7knJ24j02j2M3O4n4n1J06j9pj06K25k22J37q3
$$ 65 -47 -139 -24 60 149 8 21 1 -49 -66 -68 -73 51 -51 -63 -20 44 -10 -61 45 26 19 -87 138 -84 53 -30
7664c0m6K25j26P7j57L4J32k1j24P2J3Jn5m9J09l0K6j23j0P5P2j10K0J01q5L3
$$ -30 -76 149 23 100 -57 -23 109 88 -36 36 49 50 -5 -54 55 25 51 -72 -82 -7 65 -45 -25 76 -9 24
7690B4L0m8J35j92K6J32p8J9kK6j48Q6q5J15L6j21J0R6l9M9j61M5J44j08l8J63
$$ 24 54 6 141 -51 -25 107 29 48 46 72 -76 10 -75 40 76 -45 -35 61 22 71 -90 -45 99 -9 -47 116
7716A16j42k6J20j41J83j17J02j52J52j87M4Q0j41P7L9N4r3J8j8K9O0O9n8j82
$$ 116 -26 -52 68 -73 110 -7 95 -57 95 -92 -48 32 -109 -32 7 61 -32 -14 -32 -3 57 126 68 -114
7740a14K10N8k01M4j4m3P1NK7j7k6pN9K7n5l9O4r4qQ6j00R7k0l3r6J59Rj08J22
$$ -114 96 154 -47 -3 -17 -60 11 16 43 26 0 -7 52 79 24 -15 49 -45 -53 33 -67 30 10 -23 -119 40 49 -59 63
7769F3j45J34q5m3J07l9n4L7O6m7Q5o7o7J15p9J7O2J6J4M1j32P1j9K9r0n7R3P2
$$ 63 -82 52 -33 -76 31 -8 -62 -25 41 -6 79 12 -55 60 -19 -2 60 76 90 131 -1 70 51 80 -10 -67 26 98
7797I8p3p1Lqj9N2j9n7Q9M4K8j28K9J15k2j31J11j54P5k9k7J25j02J16j61l5Q2
$$ 98 25 -46 -43 -51 -70 -18 -37 -94 -5 39 67 -61 -32 83 61 -70 41 -113 -38 -67 -94 31 -71 45 -116 -151 -69
7824f9O0r7J08q1J39o1M9j48J62q4N8P7j65J3J07j10O0K3n2P8j6O4r0n7L4O0n2
$$ -69 -9 -106 2 -79 60 -1 48 -100 62 -22 36 113 -52 -39 68 -42 18 41 -11 67 51 115 25 -32 2 62 10
7851A0k1N4j31J86M4k15N9j1O2j14R0K9J54k59P4O2r8J5J05r7K4m8K0k6J8J09
$$ 10 -11 43 -88 98 142 -73 -14 -25 37 -77 13 42 196 -63 11 73 -25 -10 95 -2 22 -26 -6 -32 -14 95
7877I5j05J61k02MP4K1Jj01J76n2l9k1K0j5j61K10J2m6j0k9k5n3Q6N7j28J4nP9
$$ 95 -10 151 -51 -47 27 48 49 -52 124 72 33 12 32 17 -144 66 78 32 22 -7 -32 -85 1 58 -70 -56 -61 18
7905A8K7q6o5J43r6nJ17m8kl3k7M0j25J46o1R0N0j5N7j46J32j46rP5L2j67J04
$$ 18 45 -41 -106 37 -59 -64 53 5 3 -30 -57 -17 -142 4 -57 33 83 68 125 -21 111 -35 -44 31 63 -104 0
7932@J11q8n0KN4oj2Qj09R0Lj7QJ16r0oMj24R7J5k0M1K4K2o7jq8J03P4o4o8L2
$$ 0 111 23 -27 -25 29 23 11 19 -90 0 3 -14 -6 110 20 14 18 -106 -9 6 -14 27 51 73 6 5 -83 20 94 30 -38 -6
7964fn5P6k9k5J36r3o6L6J3Q0j35J0j1Q4P5j13kP0Pj33J52n4k3J2Om6P1j01p5
$$ -6 -61 15 -14 -39 97 4 -62 -26 -13 67 -68 -58 -69 15 90 -23 -25 45 52 -81 71 17 -6 6 12 -34 37 -64 -139
7993a39O8M9m6N6q9J32j7j65N8P6Q8Rq3N2l9K3l5K9l5m3J12m5L9n7Nm4M7%l0j7
$$ -139 -71 -22 -68 -12 -101 31 14 -151 -93 -17 71 80 -3 49 10 33 -2 27 -8 -51 61 16 55 -2 3 -41 6 6 -24 -41
8023d1O6o5%N6lJ12j16rp7m1J34Rj01J2J12NO6j50K1kj3R6j11J29q2L3k9L7n1
$$ -41 25 -40 -40 16 13 125 9 0 -77 -118 16 25 -76 -64 48 53 119 -31 -10 -12 -25 71 -40 89 7 40 11 48 -3
8052cl0M5l6J04r5j5O5j7L8n4K4j72O2P4o1L3MkO9%q5Kl5M9r9J31O3r8k2R2J13
$$ -3 -33 12 -24 80 -15 -30 35 18 56 2 26 -146 -84 -10 -71 -38 -34 -36 33 33 -52 -50 -85 -36 -135 -4 59 -39 -61 31 144
8083A44p4j17J17j91J47R7j44N6q1lJ52j00P6q0r4P2k2J28p0N0p6j5PP4j0k5M0
$$ 144 70 -47 70 -121 26 123 -21 35 -46 -49 103 3 79 -1 -95 -23 -45 83 13 63 -13 -28 -21 53 43 18 58
8110E8j49J08NP4m6p9Q0j6K5p0K9L6j3j04P4N5l1M8p2P9j96J68j11K8K7j7P2n
$$ 58 -91 17 22 96 50 -29 51 35 60 -10 19 55 42 -62 12 67 36 84 12 91 -105 63 -48 -20 7 -10 62 57
8138E7J2p2K8k0O5q4L1K3r6J68L1r0o8P0J7J7n5Pn9mL3N6j4o3L8q2P0K1n6JO7
$$ 57 69 -3 25 5 70 -14 17 40 -56 112 143 53 -15 55 72 89 34 41 -18 -22 11 67 53 -10 28 -54 16 37 -19 -18 49
8169D9m5K8l4k2O0j52J57l7N1Onj59J91k8r2Jl0P1k8j06J95n1
$$ 49 4 32 -2 -24 36 -116 41 4 55 61 56 -103 88 60 -32 -31 -61 10 -18 -124 71 20
8191B0
$$ Imaginary data points
##PAGE= N=2
##DATA TABLE= (X++(I..I)), XYDATA
0@%%%%%%%%%%%%%%%%%Qj6J6j6J6j7K5l2L3m1M8n6O4p2Q6r5J05j20J36j53J72j94
$$ 0 0 0 0 0 0 0 0 0 0 0 0 0 0 0 0 0 0 8 -8 8 -8 8 -9 16 -16 17 -24 24 -32 32 -40 46 -49 56 -64 72 -81 91 -103
39a03K16k41K70k98L31l67M05m47M91n42N97o56P25q00Q81r74J078j195J329j484
$$ -103 113 -128 142 -156 175 -192 213 -234 257 -285 312 -344 381 -419 462 -512 566 -629 700 -784
59g84J668j885K149k479K906l483M301n576P856j3205N2175L1795n5283k1299
$$ -784 884 -1001 1148 -1331 1575 -1908 2393 -3183 4673 -8532 43643 75438 20155 -1144
73a144p055L3190K5089J193k8495l2467j8510J4435J8034J4001k635j7815j6251
$$ -1144 -8199 24991 50080 51273 22778 -9689 -28199 -13764 4270 18271 15636 -2179 -18430
86a8430k022L322J5770J4029N163k701j2943j3597K926J3259K1465J2878j2856
$$ -18430 -20452 -17130 -1360 12669 17832 15131 2188 -11409 -8483 4776 26241 39119 26263
99B6263k4111j5914K245K6178K3675j501k1864k8292q717K0856K5877J2847j0194
$$ 26263 2152 -13762 -11517 14661 38336 36835 14971 -13321 -22038 -1182 24695 37542 27348
112B7348k7407j4348R099J9501J9091N06j6288j2501l342P849J3646L447k846
$$ 27348 -59 -14407 -5308 14193 33284 33790 17502 5001 1659 9508 23154 26601 23755
125B3755n583r580l165M58M92O236K416n967q533j1880l988R394R479M121o894
$$ 23755 18172 8592 5427 5885 6377 12613 15029 9062 529 -11351 -15339 -5945 3534 7655 761
140G61j7045o518P832J4291J3916k381j4391p683L251J5511J6517L39r364r488
$$ 761 -16284 -22802 -14970 -679 13237 10856 -3535 -11218 -7967 7544 24061 24400 15036 5548
154E548k698J1677J2075M13n976j1106o048N236M973J019l161q907m066K82l89
$$ 5548 2850 14527 26602 27015 21039 9933 3885 9121 14094 15113 11952 3045 -1021 -739 -1128
169a128L041O10k305O93k431k929K069K534N315M349m316n742l263J106R749O322
$$ -1128 1913 2523 218 911 -1520 -4449 -2380 154 5469 9818 5502 -240 -3503 -2397 7352 13674
185A3674l811p824j0011j794J0157Q363J635p403j3012l421P167J0019Q225l460
$$ 13674 9863 2039 -7972 -9766 391 8754 10389 2986 -10026 -13447 -6280 3739 11964 8504
199H504j0979n066J508Q929J0827Q67n099o471n044L843P060L878J701n203q007
$$ 8504 -2475 -7541 -6033 2896 13723 14590 9491 3020 -2024 1819 8879 12757 14458 9255 1248
214A248k807m12M545P136k07m945p923p340K326P949O313J937q113j1226k294
$$ 1248 -1559 -1971 2574 9710 9503 4558 -3365 -10705 -8379 -430 5883 7820 -293 -11519 -13813
229a3813M443J0413Q490l690r297p789j106J0030J0482K898l717r852n956M253
$$ -13813 -9370 1043 9533 5843 -3454 -11243 -12349 -2319 8163 11061 7344 -2508 -8464 -4211
243d211P585P733J995p660p809l412J675Q246N269j619m997q612l895M634N939
$$ -4211 3374 11107 13102 5442 -2367 -5779 -4104 4142 9411 7792 2795 -5817 -9712 -5078 861
258H61N501J79q079o610j464L879R480M906l278o326p421l20Q052O797K945l979
$$ 861 6362 6541 -1538 -8148 -9612 -5733 3747 8653 5375 -951 -8372 -8692 -640 6157 9102 5123
274E123r781m382K258O184P690j18o841o246l809L714Q593L732o24n602p511k39
$$ 5123 -4658 -9040 -6782 -598 7092 6974 133 -6113 -9922 -6208 2385 6117 5493 -109 -7620 -7859
290g859M986O050M567l026p218m175r25N369P086O58l320o077n594K426O146M922
$$ -7859 -2873 3177 7744 4718 -2500 -6675 -7600 -2231 4855 5513 2193 -3884 -9478 -7052 -906 4016
306D016J689n156o873j597K219O693N555k127n119n484k603N144O009K447j403
$$ 4016 5705 549 -6324 -7921 -5702 991 6546 4419 -700 -6184 -8787 -3643 2366 4813 3410
321C410o972n166J125M254O134K846m504m999l102Q63P012N232K04l081o255k589
$$ 3410 -3562 -8728 -7603 -3349 2785 5631 1127 -3872 -6974 -6111 901 6133 6337 3256 -2999 -5588
337e588L547M720M283p92o551m935j775K223O237K080l404m832n569p8N392M404
$$ -5588 -2041 2679 6962 6170 -381 -5316 -7091 -4868 1369 3449 45 -4787 -10356 -10434 -5042 -638
353f38K284k842o236j941K124N143N953K38m109l752k171L329N939K609l32m333
$$ -638 1646 -1196 -7432 -9373 -7249 -2106 3847 4085 -24 -3776 -5947 -2618 3321 5930 5598 1265
369A265n196J50K983M036L013k494n227l138q61L821M805N69k230n124m108J940
$$ 1265 -3931 -3781 -798 3238 6251 3757 -1470 -4608 -5469 -1648 3157 3726 1496 -3628 -7736 -5796
385e796M548L839J245m829n383j073K170N923L985k432m526m316q09N550M651
$$ -5796 -1248 2591 3836 -993 -6376 -7449 -5279 644 4629 2197 -2329 -6645 -7454 -1904 2747
400B747R06k492o102k914K408L592L995p6m512l537j652J807N306K884m04k178
$$ 2747 3653 1161 -4941 -7855 -5447 -1855 2140 2064 -2448 -5985 -7637 -5830 -524 2360 1956 -222
416b22m057p51L498M344M316J72m720l663j376L225O391K360k919o051o383L6
$$ -222 -4279 -5030 -1532 2812 7128 7300 2580 -1083 -2459 766 7157 9517 6598 547 -5836 -5800
432e800N455M447P25n562p992k784K646N947N061k073n664m067p98N294O477J962
$$ -5800 -345 4102 4827 -735 -8727 -11511 -8865 -2918 2143 70 -5594 -9661 -10459 -5165 1312 3274
448C274j193m102l356J465L452M090K741k133l817l280j633L222N050K048j239
$$ 3274 2081 -2021 -5377 -3912 -460 3630 6371 4238 421 -2859 -4492 -1270 3780 5828 4589
463D589n696n859K85M691O531L339m739p366l613K022Q145O281j287n769o819
$$ 4589 -1107 -6966 -6681 -1990 4541 7880 3141 -4225 -7838 -5816 2329 8610 7323 1554 -5265
478e265j771N704O318K488k703o912m054J166L222M246N85l547l154k775m82K824
$$ -5265 -7036 -1332 4986 7474 4771 -2141 -6195 -5029 -1807 2439 3024 -523 -3677 -6452 -6934 -4110
494d110K491J866r4l685k988o35K193N898L681j420m042m359K69O305N899J978
$$ -4110 -1619 247 153 -3532 -6520 -7155 -4962 936 4617 3197 -845 -5204 -4935 1370 7269 9247
510I247l489o876k468L583N633M094k388o574m254p5L721M019p89l692l378j813
$$ 9247 5758 -1118 -3586 -3 5630 9724 7336 762 -3492 -3567 154 4173 3384 -308 -3686 -5499
526e499J698K261N32Q2r49j143O42l60K21K240J318Q59p54k694j080J450K561
$$ -5499 -3801 -1540 -1008 -926 -1875 -3018 -2376 -2736 -2515 -275 1043 1902 1148 -1546 -2626 -1176 1385
543A385K618j502m128k289J41L352L577j171l497k960j40M138L504r3k264l181
$$ 1385 4003 2501 -1627 -3916 -3775 -423 3154 1983 -1514 -4474 -4614 -476 3028 2935 671 -2510
559b510K5M096K786K65j865l358K52K564J703L81k367k615N7P99Q84L22k004j114
$$ -2510 -2485 1611 4397 4662 2797 -561 -309 2255 3958 4339 1972 -643 -586 213 1097 1419 -585 -1699
577a699N8l71L44m42l80J033P18o94r15j603Q17L178J739m0k432l159Q12L938
$$ -1699 -1641 -2012 -1668 -2110 -2490 -1457 -739 -1433 -2348 -3951 -3134 44 1783 1743 -689 -3848 -3036 902
595I02L389Q13l264m483m81L092M514K218l112m512k369R35M301K973j390l042
$$ 902 4291 5104 1840 -2643 -3124 -32 4482 6700 3588 -924 -3293 -2358 1943 4916 3526 484
611D84l368p89K520K242J126m44k306j469k27K26K228K025L03o10k781k318P85
$$ 484 -2884 -3673 -1153 1089 2215 1771 -535 -2004 -2231 -2005 223 2248 2551 1941 -840 -3158 -2373
628b373K652L492J058l667m413j948J577N207L180j676m609m345l3M785M364J481
$$ -2373 279 3771 4829 1162 -3251 -5199 -3622 1585 4765 3089 -1520 -5865 -5898 -1113 3251 4732
644D732k690m884j570K140L816L409k89l283k232j020J445K880J205k04j639l132
$$ 4732 2042 -2842 -4412 -2272 1544 4953 4664 1381 -851 -1871 -426 2454 3659 3455 1816 -1316
660a316j175N79J961K743L31k323k986k303J184L993K805Q6l350m126o40K922
$$ -1316 -2491 -1912 49 2792 3123 800 -2186 -4489 -3305 688 3493 3579 229 -3897 -4537 -1615
676a615M024K417k130m344k241K83L765L598k38k454l091j475K223K817J611j53
$$ -1615 2409 4826 2696 -1648 -3889 -3606 159 3757 3519 1065 -2026 -3501 -1278 1539 3150 2997
692B997k460k150r4R09K011J628p04j351k168j151J290K003J351Q1k446k350k76
$$ 2997 537 -1613 -1707 -798 1213 2841 2137 786 -1382 -2533 -1243 760 2111 2192 -254 -2604 -2880
709b880J427K861J600j393k416j936P4L276K394J41j700l029j004J862K173J711
$$ -2880 -1453 1408 3008 1615 -801 -2737 -2663 613 3007 3148 1448 -1581 -2585 -723 1450 3161
725C161p82k753j565j28J421K359L92j247j422j515M78J844J093O57q42k017o03
$$ 3161 2379 -374 -1939 -2067 -646 1713 2105 858 -564 -2079 -1601 243 1336 1993 1151 -866 -1469
742a469L76J384J786l7j450j565j235R38K124J029j80j661k279J0J505J739J325
$$ -1469 -1093 291 2077 2040 590 -975 -2210 -1272 852 1881 1701 40 -2239 -2229 -724 1015 2340
759B340j110k284r22O5J916K123r5j407j796j231J200J939J238J31j951j611p
$$ 2340 1230 -1054 -1976 -1911 5 2128 2033 626 -1170 -2401 -1201 738 1976 2107 156 -1455 -1462
776a462J016K016J320q83j355j473l22J737J550M03o38k398j452M84J102J730
$$ -1462 -446 1570 2890 2007 652 -821 -1143 594 2144 2547 1909 -489 -1941 -1457 -355 1375
792A375J55j797j740j144N31K200J150m3j167j982l15J792J619J564k27k020j179
$$ 1375 1530 -267 -2007 -3151 -2620 -420 730 687 -480 -2462 -2777 -985 634 2198 1971 -49 -1228
809a228J33J276K221N50j063j848j543L65J857J209L55j383k351n09O08J684J731
$$ -1228 -1095 181 2402 2952 1889 41 -1502 -1137 720 1929 2284 901 -1450 -1959 -1351 333 2064
826B064m80j486j494n88J329K066P64l50j861j664K60J195J631Q91j299j925j049
$$ 2064 1584 98 -1396 -1984 -655 1411 2175 1825 -36 -1700 -1440 -245 1386 2277 978 -947 -1996
843a996j15J725J516r3r99j944j023J054J635J251J45j659j448o5Q27J979J247
$$ -1996 -2111 -386 1130 1037 38 -1906 -2929 -1875 -240 1011 1156 -503 -1951 -2016 -1189 790 2037
860B037n87j163j284k39J746J757P86n60k023j127K72J331J814K11j743j643j291
$$ 2037 1450 287 -997 -1236 510 2267 3053 2493 470 -657 -385 946 2760 2971 1228 -415 -1706
877a706K96J775R79l76j301k244n68J201J400J320m48j742r40l6J259K047O33
$$ -1706 -1410 365 1344 968 -333 -2577 -3145 -1944 -544 776 328 -1414 -2354 -2390 -1131 916 1549
894A549m29j324j041L01J345J047O47p48j770q44R7R46J498K3q26j524j133P71
$$ 1549 1120 -204 -1245 -944 401 1448 2095 1347 -423 -1267 -1170 -224 1274 1297 471 -1053 -2186 -1415
912a415J664J229M08j420j829J38J002J877J189r54j555j127p7J490J314k29r90
$$ -1415 249 1478 1886 466 -1363 -1225 -223 1654 2843 1889 334 -793 -870 620 1934 1705 715
929G15j692q49O15R46N19o4j204q58k0KJ178O76j05k74p81m15Q58P47J031L08
$$ 715 -977 -1826 -1211 -265 254 190 -1014 -1872 -1892 -1890 -712 -36 -141 -415 -1196 -1611 -753 -6 1025 1333
949A333r68q73k42O88J618Q60r51j204j038K30J658R48j76j286j777K2J076J111
$$ 1333 365 -508 -750 -62 1556 2416 1465 261 -777 -547 1111 2059 1883 597 -1180 -1158 -82 1029
967A029M97j032j674l04K28J293P92n41r69n30k43R60Q74J84M4o71n80J87M2O02
$$ 1029 1526 494 -1180 -1484 -1256 37 829 288 -681 -1211 -1454 -494 380 564 608 -63 -643 -456 -414 188
987A88P89j73o01r04o80M79J395N36o5j428j542R0J372J859P31j437j847o07Q93
$$ 188 977 804 203 -701 -1381 -902 493 1029 964 -464 -2006 -1916 -544 1315 2046 609 -1238 -1845 -952
1006i52K304J423q68j546j577j4J771J316K99j132j742p81M86P98J078j1q20q43
$$ -952 1352 2775 1907 361 -1216 -1230 541 1857 2156 1024 -718 -1499 -1013 -215 863 852 32 -811
1024h11q87j28J175Q45Q12n5j784r94O5J110K134Q00j175j888j510N86K518J597
$$ -811 -1698 -1826 -651 194 1006 951 -833 -1827 -1762 -652 1482 2282 1107 -781 -2291 -1705 813 2410
1042B410r6j865k370m32J842J956J238j160k239j087J98J705J672j46j046j306
$$ 2410 2314 449 -1921 -2353 -511 1445 2683 1523 -716 -1803 -1605 100 1772 1626 580 -726
1058g26q57M80J007P83M48o70j082q15j80Q00J696O08l65j529j547L72J536J809
$$ -726 -1583 -1103 -96 687 1135 465 -617 -1432 -1612 -812 884 1492 1127 -402 -1949 -1577 -41 1768
1076A768P42j511k162p53P24K159J592p56k019j509l43J660J694K86q39j707q43
$$ 1768 2510 999 -1163 -1916 -1192 967 2559 1803 -216 -1725 -2068 -408 1286 1572 733 -974 -1817
1093a817P36J082R51J25q69o81n09K5J053N40J34j4r62q22M6N54J156O61q30j164
$$ -1817 -1081 1 952 1077 208 -473 -982 -957 96 636 770 756 -206 -1028 -982 -428 728 1389 559 -605
1113f05q98J08J599J061l0r65j586k03J207J240O82p51j448o60M75J115J114l79
$$ -605 -1503 -1395 204 1265 1235 270 -1316 -1519 -312 928 1610 859 -589 -1249 -774 341 1455 1076
1131A076r98m99l20Q78R04j20k30n26m25J00K46R2K82k61m06k60n96L10N17K08
$$ 1076 78 -421 -741 137 1041 921 691 165 -260 -160 86 178 460 199 -207 -467 -1063 -753 -236 -28
1151b8j38n10r28K04P61O83N42o68q99J4M89J221R17o81p73o31K54J129O65n3
$$ -28 -166 -676 -1604 -1400 -639 44 586 -82 -981 -967 -478 743 1660 979 206 -425 -171 958 1623 1570
1171A570p64j146k57O57O96K99n78r03m90rM27Q51K3m51k52n38P8O55M89M67k84
$$ 1570 806 -340 -597 60 756 1055 477 -426 -916 -925 -498 353 376 -75 -327 -865 -787 -132 357 824 540
1192E40p41l60r5M08J116L9n87q88q92K34J235O73m1q61j310m4P29J118Q46m68
$$ 540 -201 -561 -656 -248 868 907 320 -568 -1460 -1226 9 682 641 -220 -1530 -1574 -845 273 1119 651
1212F51r93n27q2J096J126J80m79p55o45L64R78N89K16q16r03k66j11Q88P12k70
$$ 651 -342 -869 -951 145 1271 1451 972 217 -428 -64 914 1503 1719 903 0 -266 -377 511 1223 953
1232I53p49j041o01M29O52O04q6j041q86j75O43J127P11m89o51q37J82J129J110
$$ 953 204 -837 -1438 -1009 -357 247 161 -880 -1766 -1941 -1298 -171 540 51 -600 -1437 -1255 -126 984
1251I84M49m60j100m85N48O61R93m2r89o87o13K76J061K45q7p50r64j32P25P12
$$ 984 1433 973 -127 -612 -64 597 1590 1548 559 -128 -741 -465 596 841 754 4 -960 -1092 -367 345
1271C45O40l12q55l99q3Q03J037K15n20p85p77K92P14M95J88o26j350m23J51Q21
$$ 345 985 673 -182 -581 -664 139 1176 1391 871 86 -691 -399 315 810 998 372 -978 -1401 -1250 -429
1291d29P68l05q84n84m43Q45J019N29Mr06m85K22P59R02O43o65o62m87J52R06
$$ -429 339 34 -850 -1434 -1877 -1032 -13 516 520 -386 -871 -649 110 1012 1655 990 328 -159 -7 899
1311H99O50k1o08q40p21N79N78M84j00q85q00k67K26J026M48m97o69p06j92Q18
$$ 899 1549 1528 920 80 -641 -62 516 1000 900 15 -785 -1052 -826 200 648 151 -518 -1224 -1416 -598
1331e98P90K63j47j094k86L06N72R49J09n46p11m48K80R44N49M4p14j030j70O19
$$ -598 192 455 308 -786 -1072 -766 -194 755 864 318 -393 -841 -561 383 932 976 262 -768 -938 -319
1351c19M79P30l85o72o18j21O39R57K42k41o28o73L12R19M87K11n49q78l58J27
$$ -319 160 890 505 -167 -785 -906 -267 690 932 691 63 -610 -298 621 1108 1319 770 -108 -466 -339
1371c39O80N93j99q09o49n38N31O98K23j19p45o59J11O30P19M85m17o30l60N9
$$ -339 341 934 735 -74 -723 -1261 -730 -32 191 72 -673 -1332 -1221 -591 128 613 196 -434 -794 -735
1391g35O84J087L1k47q38o34M52O17O38J26q71p83l14K83J075N81n06n67r36o7
$$ -735 -51 1036 1067 820 -18 -652 -200 417 1055 1181 310 -473 -787 -504 571 1152 646 79 -857 -924
1411i24Q17P47K41l46j009n47K96N92R29j07o42o50k47L15P18L96Q6n09o94k28
$$ -924 -107 640 881 535 -474 -1021 -725 -133 796 689 47 -603 -850 -535 183 579 665 156 -538 -766
1431g66L66M67Q99j73o96o78l11M73R72L87j59q64r48M4Q44P11N41n81j068m42
$$ -766 -400 67 966 793 97 -581 -892 -419 553 940 781 -83 -1031 -987 -143 568 1109 528 -540 -982
1451i82K16Q94R95j88q04o38l89N73Q50L31j99o17o96j28L70O37M46j17o06n25
$$ -982 -766 128 1123 935 131 -507 -896 -323 527 858 659 42 -654 -782 -412 225 671 554 -52 -577
1471e77k23L10P25M47J40q24r32J70N66R30N90p49q28m40k36J230O13kn55r67
$$ -577 -800 -490 235 682 822 -2 -934 -764 -198 732 1322 573 -255 -695 -931 299 912 910 355 -612
1491f12l40O29P62L49j65q18n55J02M10O67R2l85l57m24lM06K08K77K2n81l65
$$ -612 -952 -323 439 788 623 -195 -750 -648 -238 429 521 136 -221 -645 -648 -242 -34 243 265 -316 -681
1512f81J17J20P27L69j74m46o03J85O91N28J75m06q08j99M38N20N05m56o50n10
$$ -681 -564 -444 283 652 478 32 -571 -386 305 833 1008 602 -206 -405 33 553 1058 602 -48 -558
1532e58l0N27N14l2n61n57QL79K72J73n3k39k24K34K0J98K03q1j39n7k23J48K05
$$ -558 -588 -61 453 421 -140 -697 -689 -310 -38 135 82 -157 -381 -147 -127 71 274 193 54 -3 -226 -78 127
1555A27R2L9l88l93K3R8O93K09l57n62k54J91P43M83j19m51p44J79P70L87L24
$$ 127 219 258 -130 -523 -500 -402 291 500 143 -419 -673 -482 261 744 625 174 -570 -391 379 766 1090
1576A090n90o19j62J92M97L94j43p14m03J6K65M99j44j28l67l88K7J23L03L88
$$ 1090 500 -119 -281 -89 408 802 659 -55 -458 -442 -177 322 178 50 -317 -705 -678 -555 -252 136
1596A36k28k85k78j87K21Q63K69j40m32o38J70O47O79M13n14r65q3J72P28O28
$$ 136 -92 -377 -655 -842 -621 242 511 371 -61 -699 -529 118 797 1210 696 -269 -352 -180 548 1176
1616A176k75o93p24j91O15N56J33l05p48k27J29L19N29J63k28l46m19P8L51O90
$$ 1176 901 208 -516 -707 -92 464 597 292 -456 -683 -554 -235 294 457 229 -117 -536 -458 -107 583
1636E83J7o1o59m48oM44N66K73o45o79m96J20Q48N28j3o22o62k42O82Q60M67j71
$$ 583 600 539 -120 -568 -574 -130 436 709 64 -615 -1111 -991 -143 385 372 -250 -912 -1154 -472 388 855 684
1658F84o94k92R7M67P77R0l79l82m74J29L46L12J30m56m36m45P5K66M53N3m41
$$ 684 -10 -302 -205 262 1039 1129 750 368 -106 23 369 681 811 355 -81 -526 -451 -185 268 321 -120
1679a20m29m16J46O36L53O2m58o65j33N01P74M34l82m00n14J35N54O28L9l38n29
$$ -120 -549 -965 -819 -183 170 232 -226 -891 -1024 -523 251 685 303 -97 -611 -476 78 706 745 407 -122
1700a22l72L49L52L50K9l71n77j36K18M48M21k35l01l71j18L26L62M04j53m15
$$ -122 -494 -145 207 557 586 215 -362 -498 -280 168 589 354 53 -318 -436 -110 252 656 503 88
1720H8l79J76K25M10K06k92n56l23mL89K79rl91n56j77J05L73L51j5m10j70n3
$$ 88 -291 -115 110 520 726 434 -122 -445 -449 -60 219 210 -181 -737 -914 -809 -436 -85 -100 -510 -680 -733
1742g33M29N34J93j98k29k44J04M42M61P6k81n63M6o8L54M39j49k88o15k10K55
$$ -733 -304 230 423 225 -4 -248 -144 298 759 835 554 -9 37 -31 323 762 613 325 -290 -500 -245
1763b45L38K12k13j61n85L7L59L91L54l14l88l05n4N12N07k9k50l98l72J50M43
$$ -245 93 305 92 -69 -654 -617 -258 133 487 173 -215 -520 -574 -62 445 416 166 -232 -604 -454 -11
1784a1M27j8l86m68oJ13M39K74n9k88n71J4M37M00K97j35n16k85O5K80M63J97
$$ -11 416 398 12 -456 -462 -349 90 364 305 17 -554 -540 -103 297 594 459 -57 -342 -277 3 466 663
1806F63k99l10l07J78L94J91Q6l18m60k41J33L20L26j37m42k07k28K26M03K60
$$ 663 364 54 -253 -75 319 510 596 278 -182 -423 -290 30 356 219 -223 -430 -658 -432 -29 231
1826B31k24k83l77%M99K43L42k56l44j52J87L22N14k05k16l31k13K62K78K37p8
$$ 231 7 -276 -653 -653 -154 89 431 175 -169 -321 -134 188 702 497 281 -50 -263 -1 277 514 436
1847D36m77k45j23J18N16J14j23l80q2k58L89L81J26j61l07k77J24K94L03J47
$$ 436 -41 -286 -409 -291 225 339 216 -164 -246 -504 -115 266 392 231 -76 -353 -229 65 368 515
1867E15l80n26N8J23K78K92j58j86m96j4K81J74K74J3m77j29nJ75M78J76k37k14
$$ 515 135 -391 -333 -210 68 360 202 16 -480 -494 -213 -39 235 248 -229 -358 -363 -188 290 466 229 15
1889A5m71J00M50K88K7k11m93j94L39K31M33j65k54k78j57K15M05Q3k08k92j78
$$ 15 -456 -356 94 382 409 198 -295 -489 -150 81 514 349 95 -183 -340 -125 280 363 155 -137 -315
1910c15k2L35R7J43k57k26j50j4L73L46m3j59j81k09J04L47J15J36l54k70l0O0
$$ -315 -337 -2 95 238 -19 -245 -395 -409 -36 310 267 108 -73 -282 -178 169 284 420 66 -204 -234 -174
1932a74M04K15k28k80j35j63L16K54p1n2l34j33K71%K53M5k50k44O1J29J86J81
$$ -174 230 445 217 -63 -198 -361 -45 209 138 86 -248 -381 -110 -110 143 188 -62 -306 -245 -116 70 251
1954B51n8j24k43j9J91Q3P1J21k81j81k0J11L26R4j19k72j68P0L15K12N6k50l86
$$ 251 193 69 -174 -193 -2 81 152 273 -8 -189 -209 -98 228 322 203 -69 -237 -167 148 360 416 166 -220
1977b20j39K17K14K76k70k99j39o7L39L79o5j86k01j79K35K35J73K2k39j89j02
$$ -220 -359 -142 72 348 78 -221 -360 -427 -88 291 226 40 -161 -340 -105 130 303 325 86 -103 -205
1998b05m0K09K80mk12k90j98J56K37K58R9k75l97N3K39L36K19j92l04j60o2M68
$$ -205 -245 -36 244 240 28 -262 -460 -304 -67 191 290 15 -382 -329 -90 246 465 273 -31 -191 -253 215
2020B15K74P0k18l28k31J17K90N3M2l74q3l06K26K58J52q2k20j04j02J65J88J45
$$ 215 489 559 341 13 -218 -101 189 242 284 -90 -173 -479 -253 5 157 75 -145 -249 -351 -186 2 147
2042A47J21m30j48J5O6N15K02k03k66k81J3L54K15J27k12n56J3J54K70L41q6k88
$$ 147 268 -162 -310 -295 -229 286 488 285 19 -262 -249 105 320 447 235 -321 -308 -154 116 457 371 83
2064H3j99k16K35L41l0P6l29j73Q5P1J67J87n6k66j10m8J58K49J06k36p9k91p0
$$ 83 -116 -332 -97 244 214 290 -39 -212 -127 -56 111 298 242 -24 -134 -182 -24 225 331 95 16 -275 -345
2087c45K27K50Kj76k47j40J53J68L02o0j95k57m4L62K73j4q5k1j76L0K03K30j16
$$ -345 -118 132 134 -42 -289 -429 -276 -108 194 134 -61 -318 -362 0 273 259 174 153 -23 7 210 440 324
2110C24k10n2r1j28K45J00o6K9k14k01JJ29J56l0o7j71j22O8L40j9J58k19k16
$$ 324 114 62 -29 -157 88 188 122 151 -63 -264 -263 -134 22 -8 -75 -246 -368 -300 40 21 179 -40 -256
2133b56J53P8J35J06k15j73K9k8J92K41j96j92lj16K29J70J29k05j26j27J13J32
$$ -256 -103 -25 110 216 1 -172 -143 -171 21 262 66 -126 -129 -245 -16 154 283 78 -48 -175 -62 70
2155G0P8R4j99M5k49J60O3J92ook19k06N4J80K42j57j15j38q1k2K92J03j24j85
$$ 70 148 242 43 88 -161 -1 62 254 248 242 23 -183 -129 51 293 136 21 -117 -198 -220 72 175 51 -134
2179a34k25N4K72P2Jj14j61O2k7K53K16j2k11p4j06N5K84J03o5o0j80j18J24J47
$$ -134 -359 -305 -33 39 40 -74 -235 -173 -200 53 269 257 46 -28 -134 -79 205 308 243 183 3 -115 9 156
2203A56O9r8j90j62m2K17J74M6p1k08k00J13J93Q0J36j49r9k20O1J28L35p4j23
$$ 156 225 127 -63 -225 -267 -50 124 170 99 -109 -309 -196 -3 77 213 64 -35 -255 -194 -66 269 195 72
2226G2k20j14R6K01R9k7j96j79O4m1M57q0N6l28J7r9L01J63p2m5j04j51Q7Q4J05
$$ 72 -148 -262 -166 35 134 107 -89 -268 -204 -245 212 132 188 -140 -123 -222 79 242 170 125 21 -130 -43 41 146
2251A46J7j39p3j44J35J51J97j00j26k29K2J48L9O1J34k68r7j9K5K00J45l59N0
$$ 146 163 24 -49 -193 -58 93 290 190 64 -165 -143 5 44 105 239 -29 -126 -145 -120 80 225 -134 -84
2274h4K4J3P9J0J19j01l01O4N2J83J10k2j37n3j05M5J64L0O7q7j69J41j48K00
$$ -84 -60 -47 32 42 161 60 -241 -177 -125 58 168 146 9 -44 -149 -104 60 90 157 70 -99 42 -106 94
2298I4Nr9p5q0J08J19O1k2rj03j35J17N1O4L6j35j14O7K4R7J29n8k10j13J10J40
$$ 94 99 0 -75 -155 -47 72 133 111 102 -1 -136 -19 32 96 132 -3 -117 -50 -26 71 200 142 -68 -181 -71 69
2324F9P5O2j37k26J02L0J31J96j71j13j31J04O3nJ44j98n5m2K5N9J74l0p0j9j96
$$ 69 144 206 69 -157 -55 -25 106 302 131 18 -113 -9 54 49 193 -5 -60 -102 -77 -18 156 126 56 37 -159
2349a59o9J81K22q6L4j63n7L5J28N5r3l8o7j1n4R4K18j27o9p1r9K28J25l3j8m7
$$ -159 -228 -47 175 89 123 -40 -97 -62 66 121 28 -10 -77 -88 -142 -48 170 43 -26 -97 -196 32 157 124 106 59
2375E9j43qJ45R6j7j59j3k9r0K52J47j64j42p8N2%J81m8m8n4j82L1K58N6j50Q7
$$ 59 -84 -92 53 149 132 -27 -40 -69 -159 93 240 76 -66 -144 -92 -92 89 41 -7 -61 -243 -212 46 102 -48 39
2401C9j34n1N1Q7J02J02j45K8j94O3K7o9K70j34L3j73J0J71rl7n1j07k3Q4P8N6
$$ 39 -95 -146 -95 -8 94 196 51 79 -115 -52 -25 -94 176 42 75 -98 -88 83 74 37 -14 -121 -144 -60 18 74
2427G4n6j15J48m8k5L7J06j26o4j5k0J28J19p6n2j34P8N4J2K6m8l9r8K9M7J99
$$ 74 18 -97 51 3 -22 15 121 -5 -69 -84 -104 24 143 67 15 -119 -41 13 25 51 3 -36 -134 -105 -58 141
2453A41j05l3k2m0LkR3N2n4j55J64M5k6J32J9j75M2k11J03L6L8j5n3n4M9l0O0
$$ 141 36 3 -19 -59 -56 -58 35 87 33 -122 42 87 61 193 212 37 79 -132 -29 7 45 30 -23 -77 -28 -58 2
2480BO1l0j23j45J56L5J12jj65l2mJ63PN9N0k28qkM6J1L3Q5j06j10R9Q5j00J50
$$ 2 63 33 -90 -235 -79 -44 68 67 -98 -130 -134 29 36 95 145 -83 -91 -93 -47 -36 -3 82 -24 -134 -35 50 -50 100
2508A00j7j83K2R1P9M5j16Rj26J41k1J14Mm2l4k1j15J3K6J05j05l3p9J43r4K5
$$ 100 83 -100 -78 13 92 137 21 30 -96 45 24 138 142 100 66 45 -70 -57 -31 74 -31 -64 -143 0 -94 -69
2534f9R4Q1m8k14Q1J68J1l1j26j45R8o8L48j60M0j22j5R6J02k8O3j12r0L2O6p4
$$ -69 25 106 58 -156 -75 93 104 73 -53 -198 -100 -168 180 20 60 -62 -77 19 121 93 156 44 -46 -14 52 -22
2560b2R8P3j24p6p6O4O6J00m9o2m4l4J1J10J15k32Q2j88J01R4J38r2k2oj14J41
$$ -22 76 149 25 -51 -127 -63 3 103 54 -8 -52 -86 -75 35 150 -82 0 -188 -87 7 145 53 31 25 -89 52
2586E2r8J93j54p8J07j01J8N7P6J8r9l5k8K6P7O6k1j12j2ONO9J13k8j81K5o9K52
$$ 52 -46 147 -7 -85 22 -79 -61 -4 72 90 -9 -44 -72 -46 31 97 76 -36 -48 -42 -37 32 145 117 -64 -39 -108 144
2614A44n8lp3o6p0J18j5J34Lj70r1M4J60M3o4R6k30N4l7L5J29m4m3q7N4N9l2J86
$$ 144 86 83 10 -56 -126 -8 -23 111 114 -56 -147 -103 57 100 36 132 -98 -44 -81 -46 83 39 -4 -91 -37 22 -10 176
2642A76j66PJ3p2RO4Q5M4j27q0l6Q4M0K9k6j52j58J48J11J31j25Lq7j19R4M5R6
$$ 176 10 17 30 -42 -33 31 116 160 33 -47 -83 1 41 70 44 -108 -266 -118 -7 124 -1 2 -85 -204 -110 -65 31
2669C1KP0k17jK02n2R0r3J1j56R4O3p2Q5p1m8n9J65j12J44L9p2r8k1RJ25n0P8
$$ 31 33 103 -114 -115 87 35 125 32 43 -113 -19 44 -28 57 -14 -62 -121 44 -68 76 115 43 -55 -76 -67 58 8 86
2697H6q7QJ4q8J63n0k4mj14RM8Q2p7L0M0o6K0K1J12l3r9n8m1J61L8p2K9p8j9K3
$$ 86 -1 7 21 -67 96 46 22 18 -96 -87 -39 43 -34 -4 36 -30 -10 11 123 90 -9 -67 -108 53 91 19 48 -30 -49 -26
2727b6k0J71R7k36k5jo1J6Q0%O4o6N0P7j1r7N3j31N1l6kJ1R1j05l5P0j02J14N7
$$ -26 -46 125 222 -14 -39 -40 -101 -85 -5 -5 59 -7 43 120 109 12 65 -66 -15 -51 -53 -42 49 -56 -91 -21 -123 -9 48
2756D8%O6j09p4J7J52nO0k21J7m8J34J18q9N5j22Q0o8q0J64j29R1q9o9Q0p6J08
$$ 48 48 114 5 -69 -52 100 95 155 -66 -49 -97 37 155 66 121 -1 79 11 -69 95 -34 57 -32 -101 -21 -97 11
2783A1O6j32N4j04J40r4J42j7j25l6m2N1J59q8R8j54K2m3N8OqM9r9q4J58M8L1
$$ 11 77 -55 -1 -105 35 -59 83 66 -59 -95 -137 -86 73 -15 83 -71 -49 -92 -34 -28 -36 13 -86 -170 -12 36 67
2810F7o5n5m2M0k0Q8Q3Ln7k09J7R5J65J7o8j0j27m8J80j10K19q3j70NJ28O7nr2
$$ 67 2 -53 -95 -55 -75 13 96 99 42 -167 -150 -55 110 127 59 49 -78 -126 54 -56 163 80 -90 -85 43 110 105 13
2838A3j21R0K9k20J48J31m9j70OMJ96n1O1l4r3K6m2P9Q5j4rq5K7K3J62J1j52j52
$$ 13 -108 -18 11 -209 -61 70 21 -149 -143 -139 57 6 67 33 -60 -34 -76 3 88 74 65 -20 7 30 192 203 51 -101
2866a01K7J4J54k3k6L1l3Qj06k3J62jo5p0J5J8QO1r0m3J02q3rP4P6oq2j13o7J52
$$ -101 -74 -60 94 71 45 76 43 51 -55 -78 84 83 18 -52 -37 -19 -11 50 -40 -83 19 -64 -73 1 77 71 -11 -124 -191 -39
2896c9Q8J02j18l4j19R9o3J06J31j14o6p5Q0J9K8J00p1p7L4J11n8J2o6j3Pk1O6
$$ -39 49 151 33 -1 -120 -21 -84 22 153 39 -27 -102 -22 -3 25 125 54 -23 11 122 64 76 10 -3 4 -17 49
2923D9j3J61j30j25qm4J48L4qk2m7j54Q6K9Q2K9m7j01LJ43M7J5J4j06q4J7l0P2
$$ 49 36 197 67 -58 -66 -110 38 72 64 42 -5 -159 -73 -44 38 67 20 -81 -78 65 112 127 141 35 -49 -32 -62 10
2951A0Mq7L7K6j04J84m1L3j1j9j63J99o9P8Lrj66P2j2Q5j0J14j74m9n8K5J64k2
$$ 10 14 -73 -36 -10 -114 70 29 62 51 32 -131 68 -1 77 80 71 -95 -23 -35 50 40 154 -20 -69 -127 -102 62 40
2979D0j6n1L8k0N0J16l2j03k9j59P5R7O9J21k96qK8J06k1m6J22j30K6N4K7n3J6
$$ 40 24 -27 11 -9 41 157 125 22 -7 -166 -91 6 75 196 -100 -108 -80 26 5 -41 81 -49 -23 31 58 5 21
3006B1j9j6l1O8j0L0k0M7r3o0R4O8J8r5Lo2k2%K5J09j91J39p2jN7J28Q2k45k8
$$ 21 2 -14 -45 23 13 43 23 70 -23 -83 11 79 97 2 5 -57 -79 -79 -54 55 -136 3 -69 -70 -13 115 197 -48 -76
3035g6Rr5K86r3N8j9j45Q8m5j3O9K1l3l9q9J43K8o9J26q0l4j30J23R1M0j20j9
$$ -76 -67 -162 124 31 89 70 -75 13 -32 -45 24 45 12 -27 -116 27 55 -14 112 32 -2 -132 -9 82 122 2 -17
3062a7k8K4N8q0J33p5K2j04N7NJ2J10m6j22OM2mJ0L1qJ1j10M2J21mL0p7j47J07
$$ -17 -45 -21 37 -43 90 15 37 -67 -10 -5 7 117 71 -51 -45 -3 -7 3 34 26 37 -73 -31 90 86 116 39 -108 -1
3091ak0J01lp2J7qM0n1N3M4j07j29Q6K9J11Qj25k7N6P3p0K9k6r7J95j02l1R7m2
$$ -1 -21 80 77 5 22 14 54 3 56 100 -7 -136 -50 -21 90 98 -27 -54 2 75 5 34 8 -89 106 4 -27 70 28
3120B8N4Rj16O3j60R8J7J10p5j0p1J09M4q7m5Pl9k0J04k2L1l4j57R7l7J26R9j11
$$ 28 82 91 -25 38 -122 -24 -7 103 28 18 -53 56 100 13 -32 -25 -64 -84 20 -2 29 -5 -162 -65 -102 24 123 12
3148A2j1rl6N9Q3j03N0j24J69j26l9P3J12j37J3rl9J12l4j09J45j97ON8K3Q1M5
$$ 12 1 -8 -44 15 98 -5 45 -79 90 -36 -75 -2 110 -27 -14 -23 -62 50 16 -93 52 -145 -139 -81 -58 23 68
3175F8j09m2q7J74P2l0Q1j77j10J46j4R8l3O4K3j69J67j70J5Q1O2o4j32R0l3m4
$$ 68 -41 -83 -170 4 76 46 127 -50 -160 -14 -28 70 37 101 124 -45 122 -48 -33 48 110 46 -86 4 -29 -73
3201g3J73j25j09P0j8O1L6j1l8m1L5o5K04Q7j15p6r8P8O4M2R1j66o0Q0l3O6p5
$$ -73 100 -25 -134 -64 -82 -21 15 4 -34 -75 -40 -105 99 186 71 -5 -103 -25 39 81 172 6 -54 26 -7 59 -16
3228a6J00r6l6O6Q9M3m3j54R6m6m3J54O2j02k5o6j61J39J23n0Nj04Q3q7pJ41j01
$$ -16 84 -12 -48 18 107 150 107 -47 49 3 -40 114 176 74 49 -17 -178 -39 84 34 39 -65 18 -69 -76 65 -36
3255c6L3N0j24J6m2J44N8j64Lo0k1J32L4R2N7r2L9j02J11M8r4j04m1N6JPJ74q2
$$ -36 -3 47 -77 -61 -103 41 99 -65 -62 -122 -143 -11 23 115 172 80 119 17 128 176 82 -22 -63 -7 -6 1 175 93
3283I3j99k7J46R2r9J35q7j41rK1O9m0P0rl3j00qM2K41q5q8k7j0n3J78Rrn5j25
$$ 93 -106 -133 13 105 6 141 54 -87 -96 -75 -6 -46 24 15 -18 -118 -126 -84 157 72 -16 -43 -53 -106 72 81 72 17 -108
3312a08M3O0Q1j56Q9m2j3l9J47J51k31R4j12N8J8j6Q9L1j01q3K7K5o5K87j28k21
$$ -108 -65 -5 76 -80 9 -33 -46 -85 62 213 -18 76 -36 22 40 24 113 144 43 -40 -13 12 -53 234 106 -115
3338a15K9k0J62J5j21N9j09K1o4P7J02M0K9k08K6N1m3K47j35l7j4r0J41O2N8j96
$$ -115 -86 -106 56 71 -50 9 -100 -79 -143 -66 36 76 105 -103 -77 -26 -69 178 43 6 -8 -98 43 105 163 -33
3364c3n4J42j91R2J13j3k6N9j84j14K61j3Q4r6j39kM3N5J5Q5j69l6J3j1J20Q1
$$ -33 -87 55 -136 -44 69 56 30 89 -95 -209 52 39 123 27 -112 -114 -71 -16 -1 84 -85 -121 -108 -119 1 82
3390H2L5p3j49L1R1k0J06j87Q0j09l8J30N1q3N9O4j91R8j5P8j7r7J16j09q5J53
$$ 82 117 44 -105 -74 17 -3 103 -84 -4 -113 -151 -21 30 -53 6 70 -121 -23 -38 40 23 -74 42 -67 -152 1
3416AJ19q0J0K5r6Q0O8Qj45L3q8PJ3J58K5j47r9j90J87K31p8mj30Q3j04J95j05
$$ 1 120 40 50 75 -21 59 127 135 -10 23 -65 -58 -45 113 138 -9 -108 -298 -111 120 42 38 -92 -9 -113 82 -23
3443b3J96j65o8k5P6k4O6L8k2j5l3pJ00l7k4Q3j36j24Q6J06Q3p3Qn7j61J9K34
$$ -23 173 8 -60 -85 -9 -33 33 71 49 34 1 -6 94 57 33 116 -20 -144 -58 48 131 58 66 9 -152 -133 101
3470A01q4p9q2Q8O7j5N6J7p2o0LL8J63p7p9L3r0P2k9o5M9J31j20q1M7m1J25J58
$$ 101 17 -62 -144 -56 11 -4 52 69 -3 -63 -60 -22 141 64 -15 18 -72 0 -29 -94 -45 86 -34 -115 -68 -109 16 174
3498A74k28L6j3j27O4J55Qm7o2j70L00j93Q1J02j15J1l4k1O4K00j60o8j9m4J47
$$ 174 -54 -18 -31 -158 -94 61 69 22 -40 -210 90 -103 -22 80 -35 -24 -58 -79 -15 185 25 -43 -62 -106 41
3523D1L3mn7k4j2m8J86q1N6j33l6O7M1j1k1J70r3j02j01J39L3J42j86p2l3P9J20
$$ 41 74 70 13 -11 -23 -71 115 34 90 -43 -79 -12 29 18 -3 167 74 -28 -129 10 43 185 -1 -73 -106 -27 93
3550I3K5P9k14Lo4r1J72m2M7K9j64K7R5R7J7M5j11j73l1J35Q1p3J03o3q3O2o6
$$ 93 118 197 -17 -14 -78 -169 3 -39 8 37 -127 -100 -5 92 109 154 43 -130 -161 -26 55 -18 85 22 -61 1 -65
3577f5J14K7j01M1j48O2J4J90j11L1j28N6j7L4J25j67P0p7J10j83K37k3m7q2m
$$ -65 49 76 -25 16 -132 -70 -56 134 23 54 -74 -18 -35 -1 124 -43 27 -50 60 -123 114 91 44 -38 -42
3602d2j9N3J75m6q8j45N0J15r0L2J58k62O2l5j6J98%k2q5j45R4J5J11N1j3k3r6
$$ -42 -61 -8 167 121 33 -112 -62 53 -37 -5 153 -109 -47 -82 -98 100 100 78 -7 -152 -58 -43 68 119 106 83 -13
3629a3N9J2oJ23l2j32j11J09J02o7j3j3q9J9N5RJ45j73J3k3p2O5K1KQ9p0r4Q2
$$ -13 46 58 52 175 143 11 -100 9 111 44 31 18 -71 -52 3 12 157 -16 -3 -26 -98 -33 -12 -10 79 9 -85 -3
3657cK3q3J40o2M3j06o8K47Jj40P7j69jP1N9P2Kj11l1o1J7Q0N0j62O7p5R8RQR8
$$ -3 20 -63 77 15 58 -48 -116 131 132 -8 69 -100 -101 -30 29 101 103 -8 -39 -100 -83 -3 47 -115 -48 -123 -25 -16 -8 90
3687I0J8n7j33J69j7j60M1O2kp4K0N4LJ93k22j34jJ34OJ75j07k06J30l3J7J39
$$ 90 108 51 -82 87 70 -90 -49 13 11 -63 -43 11 14 207 -15 -149 -150 -16 -10 165 58 -148 -18 -51 -34 105
3713A05p1K6p0k9K8l9Q5J5J1j25nkJ64K3n9O4k98K08j9J0P6q3M1r9L8n0L3O3O
$$ 105 34 60 -10 -39 -11 -50 35 50 61 -64 -69 -71 93 116 57 121 -177 31 12 22 98 15 56 -43 -5 -55 -22 41 47
3742D7j12j4j63L09k5lP6l15K6J28L1J00K7j27M5j56J01P3NM5o4j77Q2m0R6J51
$$ 47 -65 -79 -242 67 42 39 115 -200 -174 -46 -15 85 112 -15 30 -126 -25 48 53 98 34 -143 -61 -101 -5 146
3768A46j83n3m1J0J22J36p2L7l2j15K1Q9J26j80J58j26j36m0J60j2N3j25r1J22
$$ 146 -37 -90 -131 -121 1 137 65 102 70 -45 -24 65 191 11 169 43 -93 -133 27 15 68 -57 -148 -26
3792b6L1K8K5o1J2l2M5pP4M4j46j45J67j44J12Q3k7O5j86kP3J4L2P7r2j05j7O6
$$ -26 5 33 58 -3 9 -23 22 15 89 133 -13 -158 9 -135 -23 60 33 98 -88 -90 -17 -3 29 106 14 -91 -108 -42
3820d2O3J44j30m9n0L3mk9J39p0k5j51Q2M5J84j84mN1L1q2O3P8j22O2j55J29J05
$$ -42 21 165 35 -14 -64 -31 -35 -64 75 5 -20 -171 -89 -44 140 -44 -48 3 34 -48 15 93 -29 33 -122 7 112
3847A12j17J4J0l0o9M7L3J31K3o9j23j05R6J01J02Pk13J06j06kP2L3J3j49M6K7
$$ 112 -5 9 19 -11 -80 -33 0 131 154 85 -38 -143 -47 54 156 163 -50 56 -50 -52 20 53 66 -83 -37 -10
3873a0mO1K3j8q4j03J83k24K85r6Q5j36L2r2J22K5k2m1m1l9O5L3M9p1j3k1j4J2
$$ -10 -14 47 70 52 -32 -135 48 -176 109 13 98 -38 -6 -98 24 49 27 -14 -55 -94 -29 4 53 -18 -31 -52 -66 -54
3901e4N9lM6j25K3J5J29Q8j24Nj53L0P7Mj0L4j8j83J04l4J30N5j14M5j75P9QK09
$$ -54 5 2 48 -77 -54 -39 90 178 54 59 -94 -64 13 17 7 41 23 -160 -56 -90 40 95 -19 26 -149 -70 -62 147
3929A47K7j31rj5M0p2O8j4Op0m0N5k8J04l5Rn5J2j09J07J31q2j6j92R4O1P4N1
$$ 147 174 43 34 19 59 -13 55 41 47 -23 -63 -8 -36 68 33 42 -13 -1 -110 -3 128 46 30 -162 -68 -7 67 118
3957A18p6j87K8N9k9J78r9pkn4l7Q1nN2O4j33L7n5K7M6P0j97O8O0o1O2J58j15
$$ 118 42 -145 -117 -58 -87 91 -8 -15 -17 -71 -108 -27 -32 20 84 -49 -12 -67 -40 6 76 -121 -53 7 -54 8 166 51
3985E1L8j42L9J31n1L5k9j32o1RJ95Q5j07r9q6M8J7J19l6k1p7J1K1j1P8P3k25
$$ 51 89 -53 -14 117 66 101 72 -60 -121 -112 83 168 61 -38 -124 -76 -59 60 24 3 -74 -63 -42 -53 25 98 -127
4012a27J3O4j13P2R3L9J76k36j6J2J03R2j78J01j05q9R8O6l8L5j15LL3o4J68j06
$$ -127 -114 -50 -163 -91 2 41 217 -19 -35 -23 80 172 -6 95 -10 -99 -1 65 27 62 -53 -50 -17 -81 87 -19
4038a9Q4J2k44K36k0k2P7n2J6j68L7K4J16j10J08k44J03L8P2Q5j19j09J84j05
$$ -19 65 77 -167 69 49 27 104 52 68 -100 -63 -39 77 -33 75 -169 -66 -28 44 129 10 -99 85 -20
4062b0J9k6jO1j05r7J34P2RQ7j74k2Q4p7J39K0l4n2j23JK21n2n9J4K4j63Q5jL5
$$ -20 -1 -27 -28 33 -72 -169 -35 37 46 133 -41 -63 21 -56 83 103 69 17 -106 -105 116 64 5 19 43 -120 -35 -36 -1
4091aJ11r6l8n9R4R3j18J08j31MQm2Q4L6o2o6k4l4P8j9J31J04k44J02N0o2L5o
$$ -1 110 14 -24 -83 11 104 -14 94 -37 -33 -25 -67 17 53 -9 -75 -99 -133 -55 -74 57 161 -83 19 69 7 42 36
4119C6n0r3Q3P7q4J57J1p8q0r6R8J6J60j02J55k31j24L6J87k3p7J5p8JkNR7N2
$$ 36 -14 -107 -24 53 -31 126 137 59 -21 -117 -19 -3 157 55 210 -21 -145 -109 78 55 -22 -7 -85 -84 -86 -81 16 68
4147F8j35j57P7J15Q3J25j50k2q1N3L3N6mN3j49l0Q5l6Q7k7p7On5L0J66n2m7J8
$$ 68 -67 -224 -147 -32 51 176 26 4 -77 -24 9 65 61 114 -35 -65 20 -16 71 44 -33 -27 -82 -52 114 62 15 33
4175C3j00o6K9K91j45J80j94j4j09NJ56J8q1j66O8lJ49l1K8lr6j20J24J9J76q9
$$ 33 -67 -133 -104 187 42 222 28 14 -95 -90 66 84 3 -163 -95 -98 51 20 48 45 -51 -171 -47 -28 148 59
4201E9r4K8j20J89N1j16P5j7k26Q4J40P8l2L5j85n8O1L1M3k2Q3n1j15n3K00k7
$$ 59 -35 -7 -127 62 113 -3 72 55 -171 -87 53 131 99 134 -51 -109 -48 -17 26 4 87 36 -79 -132 68 41
4227D1K07k58n0k6J57j6o9R7k4j85N1J28O1j6j89KL0JQ3N0q3Q1j18N6q1J62j63
$$ 41 248 -10 -60 -86 71 55 -14 83 59 -126 -75 53 114 98 -91 -89 -59 -58 25 75 -8 73 -45 11 -70 92 -71
4254g1J60k02J51k07J59J21n1Nj53L2p2O4J32Qp3j8l4N7J04j72J43r8l3k8l0J65
$$ -71 89 -113 38 -169 -10 111 60 65 -88 -56 -128 -64 68 76 3 -15 -49 8 112 -60 83 -15 -48 -76 -106 59
4280E9p3P3j40Rm8J33J6Q7j01k1o0O8J09l2P2j11K8j73K4Q1P2n2r3J73j30q1Q5
$$ 59 -14 59 -81 -72 -120 13 29 116 15 -6 -66 2 111 79 151 40 68 -105 -81 0 72 20 -73 100 -30 -111 -26
4307b6R2k0m3k05K27n1K4J45mj21q6M5J11N0q5L0j88K4oRJ20J4O5k73N1L6L0O6
$$ -26 66 46 3 -202 25 -26 -2 143 139 18 -68 -23 88 138 53 83 -105 -81 -87 -78 42 56 121 -152 -101 -65 -35 31
4335C1L9p0K4j8MM1R7j06o7n4K4R3M0K7j84J6o2O2n5J15K7n7l8o8J05n4Q7J11
$$ 31 70 0 24 6 10 51 148 42 -25 -79 -55 38 78 105 -79 -63 -125 -63 -118 -3 24 -33 -71 -139 -34 -88 -1 110
4363A10j78p0l5J35J44Pj07jn0j0K0J00o3J28j07j12O4J11nK0j85J42j51k9J65
$$ 110 -68 -138 -173 -38 106 113 6 5 -45 -55 -35 65 2 130 23 -89 -25 86 81 101 -84 58 -93 -122 43
4388D3m2O5j13p0q3K56l9M9nq0M5j5m4R5n6M0pj64k9J98k1l9r0j16P9O2K8kl0
$$ 43 1 66 -47 -117 -200 56 17 66 61 -19 26 11 -33 62 6 46 39 -125 -154 44 23 -16 -106 -222 -143 -81 -53 -55 -85
4417h5K7J6j6O3P8J9r4M2p7k0l3K28J11j29r3j6l0P3j26J27n3n9j6M3O2o4P8j01
$$ -85 -58 -42 -58 5 83 102 8 50 -27 -47 -80 148 259 130 37 21 -9 64 -62 65 12 -47 -63 -20 42 -22 56 -45
4445d5M5r4Q7R2o5Mj24P5q6J41J9K1q5JQ8n0J34j59N4j04n0L4R3O1n5Lr0J02n0
$$ -45 0 -94 -7 85 20 24 -100 -25 -111 30 49 70 -15 -14 74 24 158 -1 53 -51 -101 -67 26 87 32 35 -55 47 -3
4474cN6K9oL0j77Q5m3K6O4o6O8n6J7ko3J12o9Rj12Q3R1J4J3j47m5K4n7J42q1Q6
$$ -3 53 82 76 106 -71 14 -29 -3 61 -5 63 7 24 22 -41 71 2 11 -101 -18 73 87 100 -47 -92 -68 -125 17 -64 22
4504B2J7j12L5J2n9J76k2o6N8p5m0J02N0L6j32l2p7N5R2j4N4r2J3r0J3O5M9j33
$$ 22 39 -73 -38 -26 -85 91 69 3 61 -14 -54 48 98 134 2 -30 -107 -52 40 26 80 -12 1 -89 -76 -11 38 -95
4532i5J52j37kO9J71m2k30Q1r9J63j8P1L9l9j72JJ31m0%L7j18m0j20J72P8M4j6
$$ -95 57 -80 -82 -13 158 116 -114 -33 -132 31 13 84 123 84 -88 -87 44 4 4 41 -77 -117 -237 -65 13 57 41
4559D1o7J6k03K65M6n7N4j80KJ31L8l9jJ1j15L0j47J45P6J36j49j20J1O5K3L6
$$ 41 -26 -10 -213 52 98 41 95 -85 -83 48 86 47 46 57 -58 -28 -175 -30 46 182 33 -87 -76 -11 12 48
4585D8r7jq2O2L7K00j44J18j33j47Q9J41j12J18l8j70N0O1R6j46L9Q8j05j02J38
$$ 48 -49 -50 -132 -70 -33 167 23 141 8 -139 -50 91 -21 97 59 -111 -61 0 96 -50 -11 77 -28 -130 8
4610HQ4j29K7P7q2j07J50o1L2P0n2Lp8L9j1j9R0j08kP0l7J61j07k9m6M4nk1L7
$$ 8 92 -37 -10 67 -15 -122 28 -33 -1 69 17 20 -58 -19 -30 -49 41 -67 -69 1 -36 125 18 -11 -57 -13 -18 -39 -2
4639bJ12r2j61O2o4K41N1j20j01j0J9K12o9j3nj56J80j17j4J90q0q7j07K1L9O6
$$ -2 110 18 -143 -81 -145 96 147 27 -74 -84 -65 147 78 65 60 -96 84 -33 -47 143 63 -24 -131 -110 -71 -5
4665eJ45k9r6k17J85J7J8ll4m8p3J47p3Q8J39j65j08J10M1rjkj35J41r0k8J33
$$ -5 140 111 15 -202 -17 0 18 15 -19 -67 -140 7 -66 22 161 -4 -112 -2 39 30 29 27 -108 33 -57 -85 48
4692D8Q2o8k9q1J15p8%J21Jr3j0j63J96L3m6L3k6j99J38rM4Rm5J6r1M2J40j41
$$ 48 130 62 33 -48 67 -11 -11 110 111 18 8 -155 41 74 28 61 35 -164 -26 -35 9 18 -27 -11 -102 -60 80 -61
4720f1j4L8Kj09K13j08J59k9j60l1J20N9l8J69k98J28j84R6J09k1l5o3l8M0R1
$$ -61 -75 -37 -35 -144 69 -39 120 91 -69 -100 20 79 41 210 -88 40 -144 -48 61 40 5 -58 -96 -56 35
4745C5j87J39k0k5l3r0J35J27Pp3M4j51q5J11J15R5l0k05J52p3n9K27j48j02R
$$ 35 -152 -13 -33 -58 -91 -181 -46 81 88 15 59 -92 -177 -66 49 144 114 -91 61 -12 -71 156 8 -94 -85
4770h5J46r9O1l3no5M3o9L1J48J3p6j2K5r2J19k6kQ9n0r5QK1K3m5J25j86Q0k4
$$ -85 61 -38 23 -10 -15 -80 -37 -106 -75 73 86 10 -2 23 -69 50 24 22 111 61 -34 -26 -5 18 -27 98 -88 -8 -32
4799c2L9k2J21q7j17n4J40K5k3R9j72j8o4J53M4o2k7Ok3PJ24k9q2J25p1q0J40
$$ -32 7 -15 106 19 -98 -152 -12 13 -10 89 -83 -101 -165 -12 32 -30 -57 -51 -74 -67 57 28 -54 71 0 -80 60
4826F0l5Q9j5k05J16Qj06J19L8k7k1l0L2n9qJ25q6j12K2%Q8J38j71j1M0p5J32
$$ 60 25 114 99 -106 10 18 -88 31 69 42 21 -9 23 -36 -44 81 -5 -117 -95 -95 -7 131 -40 -51 -11 -86 46
4853D6p4N9q4L1l6oP4M8j52J66j19j07Q3J20%PL1p7m3Q8J5Q0K7k12rR3L3n1M6
$$ 46 -28 31 -53 -22 -58 -64 10 58 -94 72 -47 -154 -71 49 49 56 87 10 -33 55 70 150 177 -35 -44 49 82 31 77
4882G7l8n0N0l9o8P1J7Rj85O3N0n9K11p6qn3N8j6j14J36m8M3p6L7J4J2R0j35j01
$$ 77 39 -11 39 0 -68 3 20 29 -156 -93 -43 -102 109 33 25 -28 30 14 -100 36 -12 31 -45 -8 6 18 108 -27 -128
4911a28QJ18r6J48L3q4K3rj07K11l4l5o1J9m1R9k4PL0j47j4J0mJ92o1p1qn8Q6
$$ -128 -120 -2 -98 50 83 -1 22 13 -94 117 83 48 -13 6 -35 64 40 47 77 -70 -84 -74 -78 114 53 -18 -26 -84 2
4940Bjk6N1o0nk4p2R5O0N1m3j73L9O8K5J19o3k4p7Q5l8K9N3l2m1j3n7K20l4K3
$$ 2 1 -25 26 -34 -39 -63 -135 -40 20 71 28 -145 -106 -38 -13 106 43 19 -58 27 -11 18 71 39 -2 -15 -72 148 114 137
4970A37j19q0K3m0M6J33k3j02m6M3l5J80j32J54j63RL5K5p0J32j3j57jr5O8O2
$$ 137 18 -62 -39 -79 -33 100 77 -25 -71 -28 -63 117 -15 139 -24 -15 20 45 -25 107 94 -63 -64 -159 -91 -29
4996b9J20j06k9M2j51K02o2N5mj14j7R8j4J07j3o9n7n1L8O7J72j18j20k1mR9j16
$$ -29 91 -15 -44 -2 -153 49 -13 42 38 -76 -93 5 -9 98 85 16 -41 -92 -54 13 185 67 -53 -74 -78 21 -95
5023i5J57j11k5J48j55l7J59M4ll7q9J3R5q7Q0q0J1M0j65J43J36j02k6k2K8pp6
$$ -95 62 -49 -74 74 -81 -118 41 85 82 45 -44 -31 64 -23 57 -23 -12 28 -137 6 142 40 14 -8 20 13 -63
5050f3J76Oj93Q8r0J1R5j2rnn1M6nK5PJj08p4J54j24K19j87J74k69O4J10l8M1
$$ -63 113 119 -74 14 -76 -65 30 18 9 4 -47 -1 -6 19 26 27 -81 -155 -1 -125 94 -93 81 -188 -124 -14 -52 -11
5078a1mP1j4j14R0k9O3j24O0j0l3J19O8q0j02j7L5Q3p3P3M9n0PQl1M9L6q2m3m1
$$ -11 -15 56 42 -72 18 -11 52 -72 -12 -22 -55 64 132 52 -50 -67 -32 51 -22 51 100 50 57 65 34 83 119 37 -6 -47
5108d7k5N1N2P1j05M4k07J18J39J4l9qPom4k3J05r7j2K6k56L17k2k7n2o4J16j91
$$ -47 -72 -21 31 102 -3 41 -166 -48 91 105 66 58 65 59 15 -8 97 0 -12 14 -242 75 53 26 -26 -90 26 -165
5136a65J17J28k0n3n3Q9p8K34k98J18O5r3q6M2R0L2Pk16qJ7J9J06M7Q3j16j69
$$ -165 -48 80 60 7 -46 43 -35 199 -99 19 84 -9 -95 -53 37 69 76 -140 -148 -131 -112 -6 41 124 8 -161
5162a61J14K6J16M4j59N1m4o2K06m0r8Pj4j57J59N2l6K9j02L4L0%K5J08j24j13
$$ -161 -47 -21 95 139 -20 31 -13 -75 131 91 -7 0 -14 -171 -12 40 4 33 -69 -35 -5 -5 20 128 4 -109
5188a09l8J7R6J03P2r0p8n0J53j43J28n2K6oj00O2M7J30j38o3o0KM2O5P0n4k7
$$ -109 -147 -130 -34 69 141 51 -27 -77 76 -67 61 9 35 29 -71 -9 38 168 30 -33 -93 -91 -49 16 86 32 5
5215Ej30J55Q0M9j84O5j27L2R0PJ2N1m6p3Lj51K11J09q6p0j07J41r7O3p8RQ0r0
$$ 5 -125 30 110 159 -25 40 -87 -55 35 42 54 105 59 -14 -11 -162 49 158 72 2 -105 36 -61 2 -76 -67 13 -77
5243g7OM4N2p6m3J29j08Rj40K33J30k28J15j02J50j23P6%l2No6J01O9r0Jj2j00
$$ -77 -71 -27 25 -51 -94 35 -73 -64 -204 29 159 -69 46 -56 94 -29 47 47 15 20 -46 55 124 34 35 23 -77
5270g7J13m0N5j3Q0j90J1J11q9M9Q9j29Q2j56J00O0j53K28j65o8L6J51o7nN7j04
$$ -77 36 -4 51 38 118 -72 -61 50 -39 10 99 -30 52 -104 -4 56 -97 131 -34 -102 -66 85 18 13 70 -34
5296c4k1O1K2J29j30K7j59J8K09m4l1K9j01r6O5k7J56n5o0J71j42j62K04N5N3
$$ -34 -55 6 28 157 27 54 -105 -87 122 78 47 76 -25 -121 -56 -83 73 18 -42 129 -13 -175 29 84 137
5321A37Qj38q5%R2J44j91J9k3RK7NqM9l9j74J57kL9K7m8o1P5n9O7P9p3n5N4j9
$$ 137 145 7 -78 -78 14 158 -33 -14 -37 -28 -1 4 -4 45 6 -168 -11 -13 26 53 5 -56 19 -40 27 106 33 -22 32 13
5351A3n9N9R6j5j26L8L4L3k34J86j4q2K1%M8J00j5m4N6k16O0J37o2J62q2j97J0
$$ 13 -46 13 109 94 -32 6 40 73 -161 25 11 -71 -50 -50 -2 98 83 39 95 -121 -61 76 14 176 94 -103 -93
5378i3J49M4j64J77o6j55O4J1J72On3n7N4j59N1L0P4O1r6J2k7o9m0K09j71K0r8
$$ -93 56 100 -64 113 47 -108 -44 -33 139 145 92 35 89 -70 -19 11 85 146 50 62 35 -34 -74 135 -36 -16 -114
5405a14J58j88J42J09j67P0p9N3L1j3J35k08m6nP9R4P8p8o0L4j20J7M2O9l9Qq
$$ -114 44 -144 -2 107 -60 10 -69 -16 15 2 137 -71 -117 -122 -43 51 129 51 -9 25 -95 -78 -36 33 -6 2 -6
5432fj0M1M2N5j86M5P1j31R2J18J7k69J79q0QM4m6J0k7k1j09J08k4K05o9j19O9
$$ -6 -16 25 67 122 -64 -19 52 -79 13 131 148 -121 58 -22 -14 30 -16 -6 -33 -54 -163 -55 -79 126 57 -62 7
5459Gj19J56N6j45J57j29n3R8K8l6J8J8r5K7N4K7Q7p0k1j72Q2J31p0O6n5n7lk2
$$ 7 -112 44 100 -45 112 -17 -70 28 56 20 38 56 -39 -12 42 69 156 86 65 -107 -25 106 36 102 47 -10 -13 -35
5487c5J6K25k14j9K8o6q4J91L0%j80R8Kj3Q5n9J31j43O1j20J6J84m2o4j9k10J75
$$ -35 -19 206 -8 -27 1 -65 -149 42 72 72 -108 -10 -8 -21 64 5 136 -7 54 -66 -50 134 92 28 9 -201 -26
5514b6O3k3n1l4O1rj4L3M9P6j28k7P8m2O5M4nm1j89N4mP4lPl6j03J18K2j9q9K06
$$ -26 37 14 -37 -71 -10 -19 -33 0 49 125 -3 -30 48 6 71 115 110 69 -120 -66 -70 4 1 8 -28 -131 -13 9 -10 -99 107
5545A07r6l7O5k4J4J23j14j43Q8J49j48J51j38K1n7k5R6r8J33q0J7nr1P5m8K2
$$ 107 11 -26 39 15 29 152 38 -105 -17 132 -16 135 -3 18 -39 -64 32 -66 67 -13 4 -1 -92 -17 -65 -43
5571d3NL4k1j4J21R5j62lj84O4J31NJ71j04p3q2m0L6q4J63R0j0j43R0L5m7J10
$$ -43 -38 -4 -25 -39 82 177 15 12 -172 -108 23 28 199 95 22 -60 -100 -64 -148 15 105 95 -48 42 77 30 140
5598A40j09k8o2O7o9J23j14J27j43q4O5J15Nl8M0J5q4L0M2L5j01j06R9M2Q9l8
$$ 140 31 3 -59 8 -61 62 -52 75 -68 -152 -87 28 33 -5 35 50 -34 -4 38 73 -28 -134 -35 7 96 58
5624E8j13J14j04k8R7L9r0J45j09p1m5J88o4J36n4j8p8o9J32n1Q7M6r5j26J7J49
$$ 58 -55 59 -45 -73 24 63 -27 118 9 -62 -107 81 17 153 99 81 3 -66 66 15 102 148 53 -73 -56 93
5650I3o6l7L8j23N7O9J1l3Mm0L2j15P1M3K0q7O8O3q6%R6L4j46J00m4K8p4L0L6
$$ 93 27 -10 28 -95 -38 31 42 9 13 -27 5 -110 -39 4 24 -63 5 68 -18 -18 78 112 -34 66 22 50 -24 6 42
5679D2j23R9m1P5j21Q9N4j10O2l9M2j7m0L0k3rN1q6Q2K3N4j1j18q8J24K7J3J3
$$ 42 -81 18 -23 52 -69 20 74 -36 26 -13 29 12 -28 2 -21 -30 21 -65 17 40 94 83 -35 -123 1 28 41 54
5707E4k6l6M3O2q3p0n3R7M8j91J70m0N0j18N5q2J64M2J7n3p1%R9k19J94Qm9j5
$$ 54 28 -8 35 97 14 -56 -109 -12 36 -155 15 -25 25 -93 -38 -120 44 86 103 50 -21 -21 78 -141 53 61 12 -3
5735cq5k3J74q5Q4p2N0k0K3j98J85J6rp8J0k9J57j5p6Qj95K36n3P4j0m1k3j85
$$ -3 -88 -111 63 -22 62 -10 40 20 43 -155 30 46 37 -41 -31 -60 97 82 6 14 -181 55 2 76 66 25 2 -183
5763a83J05kJ89q7K6m4r7J8J35k4K5mj66R7q3J33K6k4k3o7q7J18R3po8L7j23J15
$$ -183 -78 -80 109 22 48 4 -93 -75 60 36 61 57 -109 -12 -95 38 64 40 17 -50 -137 -19 74 67 -1 36 -87 28
5791B8r7Q7Q4j13o0L6m5P6J02j07j43J42L3m3M8R9j85j4M5o1PJ29M8p7o9j7pP9
$$ 28 -69 18 102 -11 -71 -35 -80 -4 98 -9 -152 -10 23 -20 28 127 -58 -72 -27 -88 -81 48 96 19 -50 -67 -74 5
5819Ek7J48j73P8q7O6%j5l2j5Q3r2J12m2M4j35P0QK0l8J32O9j58J4j46J53N5p
$$ 5 -22 126 -47 31 -56 10 10 -5 -37 -52 31 -61 51 9 53 -82 -12 -4 16 -22 110 179 21 35 -111 42 97 90
5847I0j84L0L2p6J38m7J6J27j05n8J5Q8K2r9M7j31J55j06N3O8r7K5j69O7J35q3
$$ 90 -94 -64 -32 -108 30 -17 -1 126 21 -37 -22 66 88 -11 36 -95 60 -46 7 75 -22 3 -166 -99 36 -47
5873d7Q9r5j4J4m4J07PL1j10j8R6jP2J1l8K7j17rKKJ62J6j19k9m8%O2L6j9j14
$$ -47 42 -53 -67 -53 -97 10 17 48 -62 -80 16 15 87 98 60 87 -30 -39 -37 -35 127 143 24 -5 -53 -53 9 45 26 -88
5903h8o7p3J58P6M4n6j00j2J31oM0L9r0q7OP7l9J33j67P3L5j43P2k1J72l2m0n0
$$ -88 -155 -228 -70 6 50 -6 -106 -118 13 7 47 86 -4 -91 -85 -8 -47 86 -81 -8 27 -116 -44 -65 107 75 35 -15
5931a5j7P2PK7Jq8M5o1O2L0mj7j3j50P4M3P4j01J53p9n7n5M8J12o5k9l8m5J45
$$ -15 -32 40 47 74 75 -13 32 -29 33 63 59 42 29 -121 -47 -4 70 -31 122 43 -14 -69 -21 91 26 -3 -41 -86 59
5960E9m0J8nj23j30P5J86K6M9q8qJ1j14J87j63K52q2k59O5P2J33n3j20O1k4m1
$$ 59 19 37 32 -91 -221 -146 40 66 115 27 19 30 -84 103 -60 192 110 -149 -84 -12 121 68 -52 9 -15 -56
5986e6pO1P0j15N8k3l7K2J8J8k3K1l7RM4O9j31j4L8p1J36n7K2n4J26j52QL8n8
$$ -56 -63 -2 68 -47 11 -12 -49 -27 -9 9 -14 7 -30 -21 23 92 -39 -53 -15 -86 50 -7 15 -39 87 -65 -57 -19 -77
6015g7J07lj12R6J8j47K44j02L1J0j28pJ14m8R8O6j65M3j9p5N6Q0q1j7Lj02J48
$$ -77 30 27 -85 11 29 -118 126 24 55 65 -63 -70 44 -4 94 160 -5 38 19 -56 0 80 -1 -18 -15 -117 31
6042C1p2Q7m0N4r4j20P9N7%O0l5j3pJ19Kj93P2m6lJ4L6k4O1j91J17R3qm4r0m4
$$ 31 -41 46 6 60 -34 -154 -75 -18 -18 42 7 -6 -13 106 108 -85 -13 -59 -62 -48 -12 -36 25 -166 -49 44 36 -8 -98 -142
6072a42Q8l5R9MQj03P5K3r7R2m0M9k5n6Om9J51j0R4r2j38J12o8M0qO3l4M5j94
$$ -142 -54 -89 10 14 22 -81 -6 17 -80 12 -28 21 -4 -60 -54 -103 48 38 132 40 -98 14 -54 -14 -22 41 7 52 -142
6101a42J34R2r0m1L5J19j63m3O1J51n2n8l7j4O0RnK7p8n5J01n9j0M8L5j11L8R
$$ -142 -8 84 -6 -47 -12 107 -56 -99 -38 113 61 3 -34 -48 12 21 16 43 -35 -90 11 -48 -58 -10 25 -86 -48 -39
6129c9kM7%On6NK4Q0r4K2L9k5k8R2r3O9j16N7L3j25J68K2j45R3Jn0j0R6Q6j75
$$ -39 -41 6 6 12 -44 -39 -15 65 -29 -7 32 7 -21 71 -22 47 -69 -12 21 -104 64 86 -59 34 35 -15 -25 71 157 -18
6159a8j2K0j5O6p6L6j10J16q4kJ33L7j09KN4j31P0n0J09p3o0J60r9K3mJ47r5n2
$$ -18 -30 -10 -25 41 -35 1 -109 7 -77 -79 54 91 -18 -16 38 -93 -23 -73 36 -37 -97 63 -36 -13 -17 130 35 -17
6187a7%k3O0k8L3j07J44mr4O4J53j79oq9J05o3N3Q6j67J49j31M2P7n1J0Rj06O2
$$ -17 -17 -40 20 -8 25 -82 62 58 -36 28 181 2 -4 -93 12 -51 2 88 -79 70 -61 -19 58 7 17 26 -80 -18
6215a8n0k0N2J44j44L4kJ4r5N0M4m7m2k7j6J03J3N3P1j46R7j00J81j93L4j2j14
$$ -18 -68 -88 -36 108 -36 -2 -4 10 -85 -35 9 -38 -80 -107 -123 -20 -7 46 117 -29 68 -32 149 -44 -10 -22 -136
6242a36J50q5J71j50J0N5p3j6k0J97j74J10j56J31Q2j38J30j64J44o2kj15R9j3
$$ -136 14 -71 100 -50 -40 15 -58 -74 -94 103 -71 39 -117 14 96 -42 88 -76 68 6 4 -111 -12 -25
6266b5O0m9Nm9O3Om9P0r1J15p4M6p5O0l7Jj5L9j4O2m5m1O0j5j18J74l7p6m9J53
$$ -25 35 -14 -9 -58 5 11 -38 32 -59 56 -18 28 -47 13 -24 -23 -38 1 -13 49 4 -37 23 8 -110 64 27 -49 -98 55
6296E5k7n4N8j11K34j72l9J4nL2j12J76m4J2q9R2P3p4Lo0n9K09j29L8Rr0l3M6
$$ 55 28 -26 32 -79 155 -17 -56 -42 -47 -15 -127 49 5 17 -72 20 93 19 22 -38 -97 112 -17 21 30 -60 -93 -47
6324d7l2L0P5mR2j54Q0n4J44j40k1rm6J25m8J51n2n9M0r9p8J87j47RN3Kj49J15
$$ -47 -79 -49 26 22 114 -40 40 -14 130 -10 -31 -40 -86 39 -9 142 90 31 71 -28 -106 81 -66 -57 -4 -2 -151 -36
6352c6o5J91p7l0o9P7K7j6L6j59K6J1J5J47q3rJ13l00K27n7n1J35N0k6J2j48J44
$$ -36 -101 90 13 -17 -86 -9 18 2 38 -121 -95 -84 -69 78 -5 -14 99 -201 26 -31 -82 53 103 77 89 -59 85
6379H5j61J67j10m4j4Q8ok4J43k23J7L5O6L6j1m5L0p3M4LQ9jj42J4J04r1k2K4
$$ 85 -76 91 -19 -63 -77 11 5 -19 124 -99 -82 -47 19 55 44 -1 29 -44 0 3 92 91 -51 -37 67 -24 -46 -22
6407b2M9n4J2op3J08J2ll3n4jK3N0KNR5j19n0L3J12j82N6N1l9k4Q1m4j5J8L9k9
$$ -22 27 -27 -15 -21 -94 14 26 23 -10 -64 -65 -42 8 10 15 110 -9 -59 -26 86 -96 -40 11 -28 -52 29 -15 -30 -12 27 -2
6438bN8j88J92m1J3M5j13J7Ml7J72n4K2j08p%k7kk0R9j09P7J8j03J07o7k3M5J33
$$ -2 56 -132 60 19 32 77 -36 -19 -15 -52 120 66 88 -20 -27 -27 -54 -56 -76 23 -86 -9 9 -94 13 -54 -77 -32 101
6467A01k02J04L3j04J00J5l5l4l9J09j91K30n9j4j7n8L4r4J00L8n2P9m4j1l3K6
$$ 101 -101 3 36 -68 32 47 12 -22 -61 48 -143 87 28 14 -3 -61 -27 -121 -21 17 -35 44 0 -11 -44 -18
6493a8P7N8j92J38o4n6j3m0R1n6J16Rj64R4N7k6m8l2J01K8j13O5M7l4K3j01O2
$$ -18 59 117 -75 63 -1 -57 -70 -110 -19 -75 41 50 -114 -20 37 11 -37 -69 32 60 -53 12 59 25 48 -53 9
6520Iq4Q6N4q1p1O4J38r2OR6j25rJ1J2KQ0j21J05M5j28%l6L5K4M3r7k9K8J14r3
$$ 9 -75 11 65 -16 -87 -23 115 23 29 125 0 -9 2 14 16 96 -25 80 125 -3 -3 -39 -4 20 63 -34 -63 -35 79 -14
6550a4R6p1q5J20p3J5M4l7r4J85q4Jn8M9J18k60P3J39j20O2K6q0m1J37K7k3m5
$$ -14 82 11 -74 46 -27 -12 32 -5 -99 86 2 3 -55 -6 112 -148 -75 64 -56 6 32 -48 -89 48 75 52 7
6577Glj9m4K4N8LK1p7J16j86M7Rj9P2n4o2Q8O1O7j17m1L0o2Q5R0j56J48j24O3
$$ 7 4 -15 -59 -35 23 26 47 -30 86 -100 -53 -44 -63 9 -45 -107 -19 42 109 -8 -49 -19 -81 4 94 -62 86 -38 25
6606B5k7m6M5l0N1%kl6J4j24K07j01J3m3N4M9J9J2l6j49P7L9k9J1k6m1M9q4Q8
$$ 25 -2 -48 -3 -33 18 18 16 -20 -6 -130 77 -24 -11 -54 0 49 68 80 44 -105 -28 11 -18 -7 -33 -74 -25 -109 -21
$$ [...]
8191C6
##END NTUPLES=NMR FID
##END=
