##TITLE=1H_Pr Q5
 CDCl3, 8 sc, 
 8.06.2021
##JCAMPDX= 6.0         $$ Bruker NMR JCAMP-DX V2.0
##DATA TYPE= NMR FID
##DATA CLASS= NTUPLES
##ORIGIN= UXNMR, Bruker Analytische Messtechnik GmbH
##OWNER= root
$$ XWIN-NMR		Version 3.5
$$ Tue Jun  8 13:47:36 2021 Russian Standard Time (UT+4h)  she@DPX200
##.OBSERVE FREQUENCY= 200.131506
##.OBSERVE NUCLEUS= ^1H
##.DELAY= (6, 6)
##.ACQUISITION MODE= SIMULTANEOUS
##.ACQUISITION SCHEME= undefined
##.AVERAGES= 8
##.DIGITISER RES= 18
##SPECTROMETER/DATA SYSTEM= spect
##.PULSE SEQUENCE= zg30
##.SOLVENT NAME= CDCl3
##.SHIFT REFERENCE= (INTERNAL, CDCl3, 0, 15.7039)
##AUDIT TRAIL= $$ (NUMBER, WHEN, WHO, WHERE, WHAT)
$$ ##TITLE= Audit trail, XWIN-NMR		Version 3.5
$$ ##JCAMPDX= 5.01
$$ ##ORIGIN= Bruker BioSpin GmbH
$$ ##OWNER= she
$$ F:/spectra/data/she/nmr/H-F/1/audita.txt
$$ ##AUDIT TRAIL=  $$ (NUMBER, WHEN, WHO, WHERE, WHAT)
(   1,<2021-06-08 13:46:04.17 +0400>,<she>,<DPX200>,
      <created by zg, POWCHK disabled, PULCHK disabled
       configuration hash MD5:
       00 E9 B6 7A A2 85 ED C7 34 08 36 98 17 FE 4E 26
       data hash MD5: 16K
       ED 4D 4F FB 9F D5 B1 76 BB 9F 87 E7 28 E8 3F 24>)
$$ ##END=
$$ 
$$ hash MD5
$$ 3B 82 12 A6 49 E5 AA 46 97 7B 5B 2F 82 8F E7 B0
##$RELAX= 
##$RELAX= 
##$RELAX= 
##$RELAX= 
##$RELAX= 
##$RELAX= 
$$ Bruker specific parameters
$$ --------------------------
##$DU= <F:/spectra>
##$EXPNO= 1
##$NAME= <H-F>
##$PROCNO= 1
##$TYPE= <nmr>
##$USER= <she>
##$AMP= (0..31)
100 100 100 100 100 100 100 100 100 100 100 100 100 100 100 100 100 100 
100 100 100 100 100 100 100 100 100 100 100 100 100 100 
##$AQSEQ= 0
##$AQ_mod= 1
##$AUNM= <au_zg>
##$AUTOPOS= <>
##$BF1= 200.13
##$BF2= 200.13
##$BF3= 200.13
##$BF4= 200.13
##$BF5= 200.13
##$BF6= 200.13
##$BF7= 200.13
##$BF8= 200.13
##$BYTORDA= 1
##$CFDGTYP= 0
##$CFRGTYP= 5
##$CHEMSTR= <none>
##$CNST= (0..31)
1 1 145 1 1 1 1 1 1 1 1 1 1 1 1 1 1 1 1 1 1 1 1 1 1 1 1 1 1 1 1 1 
##$CPDPRG= <>
##$CPDPRG1= <>
##$CPDPRG2= <>
##$CPDPRG3= <>
##$CPDPRG4= <mlev>
##$CPDPRG5= <mlev>
##$CPDPRG6= <mlev>
##$CPDPRG7= <mlev>
##$CPDPRG8= <mlev>
##$CPDPRGB= <>
##$CPDPRGT= <>
##$D= (0..31)
0 1.2 0 0 0 0 0 0 0 0.06 0 0.03 0 0 0 0 0.0002 0 0 0 0 0 0 0 0 0 0 0 0 
0 0 0 
##$DATE= 1623145563
##$DBL= (0..7)
120 120 120 120 120 120 120 120 
##$DBP= (0..7)
150 150 150 150 150 150 150 150 
##$DBP07= 0
##$DBPNAM0= <>
##$DBPNAM1= <>
##$DBPNAM2= <>
##$DBPNAM3= <>
##$DBPNAM4= <>
##$DBPNAM5= <>
##$DBPNAM6= <>
##$DBPNAM7= <>
##$DBPOAL= (0..7)
0.5 0.5 0.5 0.5 0.5 0.5 0.5 0.5 
##$DBPOFFS= (0..7)
0 0 0 0 0 0 0 0 
##$DE= 6
##$DECBNUC= <off>
##$DECIM= 32
##$DECNUC= <off>
##$DECSTAT= 4
##$DIGMOD= 1
##$DIGTYP= 9
##$DL= (0..7)
0 120 120 120 120 120 120 120 
##$DP= (0..7)
150 150 150 150 150 150 150 150 
##$DP07= 0
##$DPNAME0= <>
##$DPNAME1= <>
##$DPNAME2= <>
##$DPNAME3= <>
##$DPNAME4= <>
##$DPNAME5= <>
##$DPNAME6= <>
##$DPNAME7= <>
##$DPOAL= (0..7)
0.5 0.5 0.5 0.5 0.5 0.5 0.5 0.5 
##$DPOFFS= (0..7)
0 0 0 0 0 0 0 0 
##$DQDMODE= 0
##$DR= 18
##$DS= 0
##$DSLIST= <SSSSSSSSSSSSSSS>
$$ [...]
##$SUBNAM2= <"">
##$SUBNAM3= <"">
##$SUBNAM4= <"">
##$SUBNAM5= <"">
##$SUBNAM6= <"">
##$SUBNAM7= <"">
##$SUBNAM8= <"">
##$SUBNAM9= <"">
##$SW= 20.0188882624521
##$SWIBOX= (0..15)
0 0 2 0 0 0 0 0 0 0 0 0 0 0 0 0 
##$SW_h= 4006.41025641026
##$TD= 16384
##$TD0= 1
##$TE= 0
##$TE2= 300
##$TE3= 300
##$TEG= 300
##$TL= (0..7)
0 120 120 120 120 120 120 120 
##$TP= (0..7)
150 150 150 150 150 150 150 150 
##$TP07= 0
##$TPNAME0= <>
##$TPNAME1= <>
##$TPNAME2= <>
##$TPNAME3= <>
##$TPNAME4= <>
##$TPNAME5= <>
##$TPNAME6= <>
##$TPNAME7= <>
##$TPOAL= (0..7)
0.5 0.5 0.5 0.5 0.5 0.5 0.5 0.5 
##$TPOFFS= (0..7)
0 0 0 0 0 0 0 0 
##$TUNHIN= 0
##$TUNHOUT= 0
##$TUNXOUT= 0
##$USERA1= <user>
##$USERA2= <user>
##$USERA3= <user>
##$USERA4= <user>
##$USERA5= <user>
##$V9= 5
##$VALIST= <valist>
##$VCLIST= <CCCCCCCCCCCCCCC>
##$VD= 0
##$VDLIST= <DDDDDDDDDDDDDDD>
##$VPLIST= <PPPPPPPPPPPPPPP>
##$VTLIST= <TTTTTTTTTTTTTTT>
##$WBST= 1024
##$WBSW= 4
##$XGAIN= (0..3)
0 0 0 0 
##$XL= 0
##$YL= 0
##$YMAX_a= 813113
##$YMIN_a= -837911
##$ZGOPTNS= <>
##$ZL1= 120
##$ZL2= 120
##$ZL3= 120
##$ZL4= 120
##$ABSF1= 10
##$ABSF2= 0
##$ABSG= 5
##$ABSL= 3
##$ALPHA= 0
##$AQORDER= 0
##$ASSFAC= 0
##$ASSFACI= 0
##$ASSFACX= 0
##$ASSWID= 0
##$AUNMP= <proc_1d>
##$AZFE= 0.1
##$AZFW= 0.1
##$BCFW= 1
##$BC_mod= 2
##$BYTORDP= 1
##$COROFFS= 0
##$CY= 11.3945322036743
##$DATMOD= 1
##$DC= 2
##$DFILT= <>
##$DTYPP= 0
##$F1P= 15.9154993809931
##$F2P= -4.1035820241983
##$FCOR= 0.5
##$FTSIZE= 0
##$FT_mod= 4
##$GAMMA= 1
##$GB= 0.15
##$INTBC= 1
##$INTSCL= 1
##$ISEN= 128
##$LB= 0.24
##$LEV0= 0
##$LPBIN= 0
##$MAXI= 10000
##$MC2= 0
##$MEAN= 0
##$ME_mod= 0
##$MI= 1.114404
##$NCOEF= 0
##$NC_proc= 0
##$NLEV= 6
##$NOISF1= 3.799351
##$NOISF2= 2.8
##$NSP= 1
##$NTH_PI= 0
##$NZP= 0
##$OFFSET= 15.70392
##$PC= 1
##$PHC0= -11485.24
##$PHC1= 10.80101
##$PH_mod= 1
##$PKNL= yes
##$PPARMOD= 0
##$PSCAL= 0
##$PSIGN= 0
##$REVERSE= no
##$SF= 200.130013532006
##$SI= 16384
##$SIGF1= 3
##$SIGF2= 2
##$SINO= 400
##$SIOLD= 16384
##$SREGLST= <1H.CDCl3>
##$SSB= 0
##$STSI= 0
##$STSR= 0
##$SW_p= 3612.71676300578
##$SYMM= 0
##$S_DEV= 0
##$TDeff= 0
##$TDoff= 0
##$TI= <>
##$TILT= no
##$TM1= 0
##$TM2= 0
##$TOPLEV= 0
##$USERP1= <user>
##$USERP2= <user>
##$USERP3= <user>
##$USERP4= <user>
##$USERP5= <user>
##$WDW= 1
##$XDIM= 8192
##$YMAX_p= 0
##$YMIN_p= 0
$$ End of Bruker specific parameters
$$ ---------------------------------
##NTUPLES= NMR FID
##VAR_NAME=  TIME,          FID/REAL,        FID/IMAG
##SYMBOL=    X,             R,               I
##VAR_TYPE=  INDEPENDENT,   DEPENDENT,       DEPENDENT
##VAR_FORM=  AFFN,          ASDF,            ASDF
##VAR_DIM=   8192,          8192,            8192
##UNITS=     SECONDS,       ARBITRARY UNITS, ARBITRARY UNITS
##FACTOR=    0.0002496,     1,               1
##FIRST=     0,             0,               0
##LAST=      2.0444736,     0,               0
##MIN=       0,             -837911,         0
##MAX=       2.0444736,     813113,          0
$$ Real data points
##PAGE= N=1
##DATA TABLE= (X++(R..R)), XYDATA
0@%%%%%%qJ6j6J6j6K4l2M0n6O4p6J00j24J48j76K08k48K96l46M02m66N40o23P13
$$ 0 0 0 0 0 0 0 -8 8 -8 8 -8 16 -16 24 -32 32 -44 56 -68 80 -96 112 -136 160 -186 216 -250 290 -333 380
30C80q16R29j053J194j349J518j702J904k129K376k644K936l256L606l986M403
$$ 380 -436 493 -560 634 -715 803 -899 1005 -1124 1252 -1392 1544 -1712 1894 -2092 2311
46B311m860N355n897O499p161P887q693R594j0603J1743j3038J4524j6256J8305
$$ 2311 -2549 2806 -3091 3408 -3753 4134 -4559 5035 -5568 6175 -6863 7661 -8595 9710
60I710k0767K3788k7598L2573l9370M9229o4844R3250j60462N93207L24397j651024
$$ 9710 -11057 12731 -14867 17706 -21664 27565 -37279 55971 -104491 488716 813113 -837911
72h37911N14258J031289m53349m60133J96956p5827K84681R4945o79260Q7331
$$ -837911 -323653 707636 254287 -205846 -8890 -84717 199964 294909 -384351 -297020
82b97020Q52821l80633n92742M53282J77752k15343K84174j62297m44813M06510
$$ -297020 555801 175168 -417574 35708 213460 -1883 282291 119994 -324819 81691
92H1691L23630m25131n8574J02526k02100K80698J84559o31818R2602P09033m51972
$$ 81691 405321 -19810 -78384 24142 -177958 102740 287299 -344519 -251917 457116 5144
103E144n07480O75760K13212n49600L5843J77501j15221K57819k5235n70255K46469
$$ 5144 -502336 173424 386636 -162964 -127121 50380 -64841 192978 167743 -402512 -156043
114a56043N27355n03749k50743N74832j09532m60944L35006K46733l19173P782
$$ -156043 371312 -132437 -383180 191652 82120 -378824 -43818 202915 -116258 -108476
124a08476J96436j43764m1037J38459m858k929j20322j87621K95012K57540m35416
$$ -108476 87960 -55804 -96841 41618 36760 33831 -86491 -274112 20900 278440 -156976
135a56976k16163M31258J11648k93410J474J37887J7469M5662j28138j33991L34341
$$ -156976 -373139 58119 169767 -123643 -122169 15718 33187 78849 -49289 -183280 151061
146A51061J40908m87505q8259M82165Q309l54150L8416J52668n9916M0639N2308
$$ 151061 291969 -195536 -283795 198370 206679 -147471 -109055 43613 -16303 24336 76644
157G6644j28777L4487J36045r7969l6100J37024n0978r8496R9356l829j34381
$$ 76644 -52133 -17646 118399 20430 -15670 121354 70376 -28120 71236 67407 -66974
168f6974J15430J34205k27051j35563K51844J32950j82520j41815R3703J85113
$$ -66974 48456 182661 -44390 -179953 71891 204841 22321 -119494 -25791 159322
178A59322j6596k13959M705K40405l8465k64919P3976K26009j05294j57186M1862
$$ 159322 142726 -71233 -66528 173877 135412 -129507 -55531 170478 65184 -92002 -50140
189e0140M3062O2151K0308j65795j6844K14635l7704j83273J30175R2533j98410
$$ -50140 -7078 55073 75381 -90414 -107258 107377 69673 -113600 16575 109108 -89302
200h9302K9562J77081j49052r0249J75202l5180j50429Q2509Q1521n1661k3888
$$ -89302 -59740 117341 -31711 -121960 53242 18062 -132367 -49858 31663 -19998 -43886
211d3886m2391N124J69376k4606k42947R5613K36126j53646j61814J49419Q0449
$$ -43886 -86277 -81153 88223 63617 -179330 -83717 152409 -1237 -163051 -13632 66817
222F6817r9004o3640J9657R7153M0592j61544m7668K31438M547k31776R4989J79202
$$ 66817 -32187 -95827 -76170 20983 61575 -99969 -147637 83801 88348 -143428 -48439 130763
234A30763j52831p5289J51668L081q9528J0947Q515K4389M6476r4413m8475J70560
$$ 130763 -22068 -97357 54311 57392 -32136 -21189 -12674 11715 58191 -36222 -84697 85863
246H5863n556j94118R7870J73532j39094j07901J34576O7015q4660n1945L0329
$$ 85863 80307 -113811 -15941 157591 18497 -89404 45172 112187 27527 -24418 5911
257E911O1405r57r9782L658J30319m9644j30674R7360R4433j05312m4997Q3442
$$ 5911 67316 66359 -33423 -29765 100554 50910 -79764 17596 112029 6717 -38280 45162
269D5162K2802m8223k3551J9903M2535j7129q8013L1645J13217q2922j18171J15536
$$ 45162 67964 19741 -3810 16093 58628 41499 -46514 -14869 98348 15426 -102745 12791
281A2791Q4558j25640n3485J10818L6590q9831l1898O7105L9974n2105o7293M6659
$$ 12791 97349 -28291 -81776 29042 65632 -24199 -56097 11008 50982 -1123 -68416 -21757
293b1757Q0208o8169q3550P2198O5010p2515n9433O6559N7594o2496n3129O0237
$$ -21757 58451 -9718 -93268 -21070 43940 -28575 -88008 -21449 36145 -26351 -79480 -19243
305a9243N8218n5554o4936O5156O4386p9324n2531P9857L7121p4005l3404O8993
$$ -19243 38975 -16579 -81515 -16359 48027 -31297 -83828 -3971 33150 -40855 -74259 -5266
317e266L2941o1850k6695N7110L7058m5369m3442N6095N2151o1826m5926O5937
$$ -5266 27675 -34175 -60870 -3760 33298 -12071 -55513 582 52733 -9093 -55019 10918
329A0918M4561o5996m5830P2903M1947p4217l0611P2042L2905o3803l0619P0756
$$ 10918 55479 -10517 -56347 16556 58503 -15714 -46325 25717 58622 -5181 -35800 34956
341C4956L1473o5306k4034N9580K8846n6696l4924N8640L2636o0164l2794N5379
$$ 34956 66429 1123 -22911 36669 65515 8819 -26105 32535 65171 5007 -27787 27592
353B7592L6918n6837m0591O4708L7868o6508l1294O4116L0443o6065l0377O5764
$$ 27592 64510 7673 -32918 31790 69658 3150 -28144 35972 66415 350 -30027 35737
365C5737J9030o4420j9726N1622K0395n4076k6286N3274K2971n2641k5934N0155
$$ 35737 54767 -9653 -29379 22243 42638 -11438 -37724 15550 38521 -14120 -40054 10101
377A0101L0086n7331l0031O0282K0009o0060k0766N2052J9621n6880k2288N5480
$$ 10101 40187 -17144 -47175 13107 33116 -26944 -47710 4342 23963 -32917 -55205 275
389B75J8153n4287k1026N5413K3910o1243j5785O3791N554n4987l133M6256P821
$$ 275 18428 -35859 -56885 -1472 22438 -38805 -54590 9201 14755 -40232 -43365 2891 10712
402A0712m4265j3533M2823K0107m3290k8704N6292L1373o9194j3908P7455N12
$$ 10712 -33553 -47086 -4263 15844 -27446 -56150 142 31515 -37679 -51587 25868 26380
414B6380o4559Q264N3844j587m0349o496L3503K3542l5614l5696N5743L5052p3585
$$ 26380 -38179 -29915 23929 22342 -18007 -24503 9000 32542 -3072 -38768 16975 52027 -21558
427b1558j2433P8173n674n7784J6082L7141q682j6291m821J0452K6943k6982m0663
$$ -21558 -33991 44182 38508 -19276 -3194 33947 25265 8974 4153 14605 41548 14566 -26097
440b6097O1078K8836q7562J482Q6125l0503o0746M1841K9830l2289q968L516R729
$$ -26097 34981 63817 -23745 -22263 63862 33359 -27387 14454 44284 11995 3027 6543 16272
453A6272L2008m1841n4639Q2313L8156j08569m111R4336l1507o1641M0508K2128
$$ 16272 48280 6439 -48200 34113 72269 -36300 -40411 53925 22418 -39223 1285 23413
465B3413k5702O49j5802J863N5014l5818o7629P2927L3261r0609J6351P1594n7668
$$ 23413 -2289 -1640 -17442 -15579 39435 3617 -64012 8915 42176 -48433 -32082 39512 -18156
478a8156l9744O3217L780l6195J3976j3527j817N3211l8908n2566Q2945J3142
$$ -18156 -57900 5317 9097 -27098 -13122 -26649 -28466 24745 -14163 -66729 16216 29358
490B9358j01799L4715Q8116n9102n1866M9039J1182r139J5523l7542m854O6351
$$ 29358 -72441 -37726 50390 -8712 -60578 -11539 -357 -9496 6027 -31515 -36369 29982
502B9982l2248n0028P3917J0198q3411L1862O4810m9203k1960M6507j7100k3863
$$ 29982 -2266 -52294 21623 31821 -51590 -19728 45082 -4121 -26081 20426 3326 -20537
514b0537L4236m79p809J3473m0495J562Q3759k3736r2393M5625P5608n5230m1803
$$ -20537 13699 13220 5411 18884 -21611 -20049 63710 39974 -52419 -6794 68814 13584 -28219
527b8219N4237J4098l5214q824L594L0547K3693o0190l5086P3016K9829o4288
$$ -28219 26018 40116 4902 -3922 -328 30219 53912 -6278 -41364 31652 61481 -2807
539b807j2717M3778j3293k1397L0883M52k8936O900L825m501J6302n796k3930
$$ -2807 -15524 28254 14961 -6436 24447 24899 -4037 2863 6688 2187 18489 12693 -11237
552a1237J2526Q520k8538J9019M6800n5346n8848P2450N0073o2912l3402L0265
$$ -11237 1289 9809 -18729 290 47090 -8256 -67104 5346 55419 -7493 -40895 -10630
564a0630J4411p03j1911k1664K8213K5877o5512j5606R5372p030r1318K4305M6775
$$ -10630 3781 3078 -8833 -30497 -2284 23593 -41919 -57525 37847 30817 -60501 -36196 10579
577A0579k4902J3153J0843n5741J0780O0717l1976k5219M2041k8739k4054O5105
$$ 10579 -14323 -1170 9673 -46068 -35288 25429 -6547 -31766 10275 -18464 -42518 22587
589B2587j9050n2583O8236O220r2018M3517Q4492n8181m1166L3216j1794K8252
$$ 22587 3537 -49046 19190 25410 -66608 -23091 61401 3220 -37946 -4730 -16524 11728
601A1728M6507r0296k9047J19566k4499r5376P9888M2710r2586J0893N5660l4038
$$ 11728 58235 -32061 -61108 58458 33959 -61417 18471 61181 -31405 -20512 35148 1110
613A110J8871K2593q3919K0622R7363o4782m2537P9472m3763n1960J05714j446
$$ 1110 19981 42574 -41345 -20723 76640 11858 -30679 48793 5030 -46930 58784 57338
625E7338j07684N1900N3782p4600J9742N1819o5493Q257M8307p5500J9459J04259
$$ 57338 -50346 1554 55336 -19264 478 52297 -13196 -4939 43368 -32132 -12673 91586
637I1586r1629q4578J15823K7287q5378K8581J4135n4159N3327K5401q5085L7753
$$ 91586 -43 -84621 31202 58489 -26889 1692 15827 -38332 14995 40396 -44689 -6936
649f936O0147r6212l391J01823m8486n5271O2686j9421m3591P6720J594q6483
$$ -6936 53211 -43001 -46392 55431 6945 -48326 14360 -5061 -48652 28068 29662 -56821
661e6821L4152L9510m2972L1279J2925p7672L7072P0390p8364k1808R1723l1347
$$ -56821 -22669 16841 -26131 5148 18073 -59599 -22527 47863 -30501 -52309 39414 8067
673H067p3642N6637L2473l5809J2226j7261l3062P0891K0266q6303J6436O1799
$$ 8067 -65575 -8938 23535 -12274 -48 -17309 -50371 20520 40786 -45517 -29081 32718
685C2718m5757j4857N5047k1499l3957L6966m153k2338L9752m076m4529K7282
$$ 32718 -13039 -27896 27151 5652 -28305 8661 4508 -17830 21922 17846 -26683 599
697E99J7195k6003K5768J0101n4205J0315O0275k1479m0675K3943J1261j2302
$$ 599 17794 -8209 17559 27660 -26545 -16230 44045 22566 -18109 5834 17095 4793
709D793Q989o974l005K3499k0172k9855M0546K8144m5948k1394L5729Q697j6636
$$ 4793 13782 6808 3803 27302 7130 -22725 17821 45965 17 -21377 14352 23049 6413
722F413K523k308p529R218R66m898O577n744j3139Q777J2357j0121p685J0521
$$ 6413 8936 6628 -901 8317 9283 4385 10962 5218 -7921 856 13213 3092 -4593 5928
736E928o024j4299J6189J4906j8857j7466J0803J6115k840j3736m910P802Q661
$$ 5928 -96 -14395 1794 16700 -2157 -19623 -8820 7295 4455 -9281 -14191 -6389 2272
749B272j0924r837J9874L517k7824K262K6489m147j8240L441N737j759N725k253
$$ 2272 -8652 -18489 1385 4902 -22922 -20660 5829 1682 -16558 -13117 -7380 -9139 -3414 -5667
763e667q403Q796r66j2016J8793P015k7641L141K6576j1409j5553J8526M268j7244
$$ -5667 -14070 -5274 -6240 -18256 537 7552 -20089 -16948 9628 -1781 -17334 1192 5460 -11784
777a1784N535Q116k765P414q558j4655K4336J1266k7706J83K3833r138j2981J5071
$$ -11784 -6249 1867 -898 6516 -2042 -16697 7639 18905 -8801 -8618 15215 6077 -6904 8167
791H167L163r909M443j945k258J5554p917j6227J8381O296k0190P239J5694j6619
$$ 8167 11330 1421 5864 3919 1661 17215 9298 -6929 11452 17748 -2442 4797 20491 3872
805C872q326J8969o60j1886N731j900j924J0606r700q899J8279j285k2001R293
$$ 3872 -4454 14515 13855 1969 7700 5800 3876 14482 4782 -4117 14162 12877 -9124 169
819A69J8562j4776j2857J3251L050o788M15m362L350O994j2460m266J6182l549
$$ 169 18731 3955 -8902 4349 7399 611 1026 -3336 14 7008 -5452 -9718 6464 2915
833B915j6199O848J1734r421o979P787M93l405P0k985M723L435j1709R07J3575
$$ 2915 -13284 -6436 5298 -4123 -11102 -3315 -2822 -6227 -6157 -9142 -4419 -984 -12693 -11786 1789
848A789n292j2154P442J0060r265o389R583K775n392k885K038P308j617r530M489
$$ 1789 -3503 -15657 -8215 1845 -7420 -13809 -4226 -1451 -6843 -9728 -7690 -382 -1999 -11529 -7040
863g040J0031m824q580O540R479p257o714P849N739m513n468L419Q881l870q406
$$ -7040 2991 -1833 -10413 -3873 5606 -1651 -8365 -516 5223 710 -4758 -1339 7542 3672 -4734
878d734O029Q144n150p483O588Q005p213n607P463M221m600m661L998O475m950
$$ -4734 1295 9439 4289 -3194 3394 11399 4186 -1421 6042 10263 5663 1002 5000 11475 6525
893F525o084N542N697m870o811N758P227q453n486P881L843o511n179O018N216
$$ 6525 441 5983 11680 6810 -1 5757 12984 4531 -955 6926 10769 4258 -921 5097 10313
908A0313p869m644N784M970o121p116O286O420q725n351O903L588n895n484N283
$$ 10313 2444 -2200 3584 8554 2433 -4683 1603 8023 -702 -6053 850 4438 -1457 -6941 -1658
923a658M468n696m860M358M927n100o867P003N124q906l019P275J757o283k365
$$ -1658 2810 -2886 -7746 -3388 1539 -3561 -10428 -3425 1699 -7207 -10226 -2951 -1194 -7477 -9842
938i842O159J794n589j755M554M270n685n967Q941M889r442k622Q872K672p773
$$ -9842 -3683 -1889 -7478 -9233 -4679 -409 -6094 -12061 -3120 1769 -7673 -10295 -1423 1249 -6524
953f524j574P434J719m618k119L685O024m377o746P867N390p902k409Q734R48
$$ -6524 -8098 -664 1055 -3563 -5682 -1997 4027 -350 -7096 771 6161 -1741 -4150 4584 5532
968E532p768J825O602j969k487J53J209M950l531o904R047N603j1810k682J3615
$$ 5532 -2236 -411 6191 4222 1735 1888 3097 8047 4516 -2388 6659 12262 452 -2230 11385
983A1385o52j1870L231P040l139o35k014j486P691l045j0080Q348P989j2468m131
$$ 11385 10733 -1137 2094 9134 5995 5360 3346 1860 9551 6506 -3574 4774 12763 295 -3836
998c836J2481k127r711O871J593p548M805J28m960O197k917r705J1206N873j6690
$$ -3836 8645 6518 -3193 3678 5271 -2277 2528 2656 -2304 3893 976 -8729 2477 8350 -8340
1013h340n69J6690p838j2235J2114K448q570K954k701j670J2670o331j6365J3981
$$ -8340 -8909 7781 -57 -12292 -178 2270 -6300 -3346 -6047 -7717 4953 -1378 -17743 -3762
1027c762J1459j7584k114J5533q250p058J2516l945n923J0210n912o928J3924
$$ -3762 7697 -9887 -12001 3532 -4718 -11776 740 -3205 -9128 1082 -4830 -11758 2166
1040B166j218j1872J0125L555j5393R108J5314j7721o924J7767k229o469O482
$$ 2166 948 -10924 -799 2756 -12637 -3529 11785 -5936 -12860 4907 2678 -3791 2691
1053B691n280j001J2579r134r605J9470K362k3250O458J9992j0863o900P622n658
$$ 2691 -2589 -3590 8989 -145 -9750 9720 12082 -11168 -4710 15282 4419 -2481 5141 -517
1067e17L017R761j1198l589J3074o005r068J4548J171j5766P505P977j2630L714
$$ -517 2500 12261 1063 -2526 10548 4543 -4525 10023 11194 -4572 2933 10910 -1720 1994
1081A994J0822j0653n246P373n73K074K619j2283k520J7501j432j7349O542R926
$$ 1994 12816 2163 -3083 4290 3717 5791 8410 -3873 -6393 11108 9676 -7673 -1131 8795
1095H795r712l381O798r7m23l968o433P913R511r412j0333P739N039n276J800
$$ 8795 -917 -4298 2500 2403 1980 -1988 -8421 -508 9003 -409 -10742 -3003 2036 -3240 -1440
1110a440J670p228O25N857j46l276m41P21q47k30J429J642Q79n098n919Q703J0494
$$ -1440 230 -6998 -6373 -516 -662 -3938 -4379 -3658 -4505 -4735 -3306 -1664 -785 -5883 -11802 -3099 7395
1127G395q591j2397O222J1813l999o634L432J058j105J192k003L545N597r673
$$ 7395 -1196 -13593 -7371 4442 443 -6191 -2759 -1701 -2806 -1614 -3617 -72 5525 -4148
1141d148o291J3251N957j1002o82M660n390M542R962j0515o312R831q10j507O361
$$ -4148 -10439 2812 8769 -2233 -2915 1745 -3645 897 10859 344 -5968 3863 3053 1546 7907
1156G907p063m907J2037k292j1564J3695P380k1709o74J9771m347o076J837q490
$$ 7907 844 -4063 7974 5682 -5882 7813 15193 -6516 -7190 12581 8234 2158 3995 -4495
1170d495M977J5518j2935j1367J7428j183j6607J2730R574j7277J861P772j1195
$$ -4495 482 16000 3065 -8302 9126 7943 -8664 4066 13640 -3637 -1776 5996 -5199
1183e199O787J2167j7891n104J6102o321m015J2802j1124j3900K1636M286k1840
$$ -5199 1588 13755 -4136 -9240 6862 541 -3474 9328 -1796 -15696 5940 10226 -11614
1196a1614R009R868j6427L476J1064j0553L241O748j7990K456K5000j2533k0555
$$ -11614 -2605 7263 -9164 -5688 5376 -5177 -1936 4812 -13178 -10722 14278 1745 -18810
1209a8810J7587M912j3593J0278K350j4814R220O329j3695Q085J0570j8469j394
$$ -18810 -1223 3689 -9904 374 2724 -12090 -2870 3459 -10236 -2151 8419 -10050 -11444
1222a1444J8754q541p096J4907p745j3160J7938M514j4463M989K312p896J0567
$$ -11444 7310 -1231 -8327 6580 -1165 -14325 3613 8127 -6336 -1347 965 -6931 3636
1235C636M643j6137M681J3800j3916m032J8796n228j3563Q930K168l159Q159n632
$$ 3636 8279 -7858 -3177 10623 -3293 -7325 11471 6243 -7320 1610 3778 619 8778 3146
1249C146j0806J2129N650j2655M320Q128j1956j058J3011n565n617P060m083l515
$$ 3146 -7660 4469 10119 -2536 1784 9912 -2044 -3102 9909 4344 -1273 5787 1704 -1811
1263a811Q305j682n514M763k074o044R326M478j3594q43J0320k866l538K756k582
$$ -1811 6494 4812 -702 4061 1987 -4057 5269 9747 -3847 -4690 5630 2764 -774 1982 -600
1278f00k14K736m097J144N901n508o944P069N037o328j799K513j833P64J777j447
$$ -600 -814 1922 -2175 -1031 4870 -638 -7582 -513 4524 -1804 -3603 -1090 -2923 -2159 -382 -1829
1294a829J02r67j878K611K587l428k794L332J058k644R45K591j497k871p1M419
$$ -1829 -1727 -2694 -4572 -1961 626 -2802 -5596 -2264 -1206 -3850 -2905 -314 -1811 -4682 -4753 -334
1310c34J999n534k051N123J784k551j679K174J134j840j073K928K628l302l634
$$ -334 1665 -3869 -5920 -797 987 -1564 -3243 -1069 65 -1775 -2848 80 2708 -594 -4228
1325d228M562L060l909j71J692o25J05J012J04P24q41k350K617L671l977k733
$$ -4228 334 3394 -515 -686 1006 381 486 1498 1602 2326 1485 -865 1752 5423 1446 -1287
1341a287N195J4m666K723K834l117r99J045P44J952j629m063L267L585m656k050
$$ -1287 3908 3922 -744 1979 4813 1696 697 1742 2486 4438 2809 -1254 2013 5598 942 -1108
1357a108N591j284m413K527J759j397m58j322K60K369j111l375K144K648m627
$$ -1108 4483 3199 -1214 1313 3072 1675 1217 -105 155 2524 1413 -1962 182 2830 -1797
1372a797o50M962j814l507K013R29p77j90j375L28K135j772k346L225J528m958
$$ -1797 -2447 2515 701 -2806 -793 136 -641 -831 -2206 -1878 257 -1515 -3861 -636 892 -4066
1388d066j0M727j924k562J427J074j05r03p07J128J542k110j595L481J233m356
$$ -4066 -4076 651 -1273 -3835 -2408 -1334 -1439 -2342 -3049 -1921 -379 -2489 -4084 -603 630 -3726
1404c726N17L746j275j898R64R98O69j075r82K293J106k600j270L697R84l460
$$ -3726 -3209 537 -738 -2636 -1672 -674 -5 -1080 -2062 231 1337 -1263 -2533 1164 2148 -1312
1420a312O68K838j142j423N39J445N47j449n81J831Q74j920r76K832Q19l277N03
$$ -1312 -644 2194 1052 -371 168 1613 2160 711 130 1961 2835 915 -61 2771 3590 313 816
1437H16K261l63j835J38J544K41j977k24J944M96k182n83K223L24k904L72J985
$$ 816 3077 2714 879 1017 2561 2802 825 601 2545 3041 859 276 2499 2823 -81 291 2276
1454B276k47k064j20J681J11j887l20J281O27k123r05K656M4k879L43K133n64
$$ 2276 2029 -35 -155 1526 1637 -250 -570 711 1338 -785 -1690 966 1010 -1869 -1526 607 43
1471D3k084L02J558k56j574k71J627J77j901o71K838l74k257J06K014l06j731
$$ 43 -2041 -1739 -181 -437 -2011 -2282 -655 -478 -2379 -3050 -212 -586 -2843 -2737 -723 -1029 -2760
1488b760J93K080l29j340K8J576K20j865j72K108nj847O00K175n24k072J127J758
$$ -2760 -2567 -487 -816 -2156 -2128 -552 -332 -2197 -2369 -261 -266 -2113 -1513 662 138 -1934 -807 951
1506I51r10q51L39Q63Q06j366q14K442N55k543K20K600m19k247J051J524n65j004
$$ 951 41 -810 -471 392 1198 -168 -982 1460 2015 -528 -308 2292 1873 -374 677 2201 1636 632
1524F32Q9J081O45j394p87J976O78k210j58K130n63j764J141J009j670L2J46M05
$$ 632 721 1802 2447 1053 266 2242 2920 710 552 2682 2119 355 1496 2505 835 867 1013 1418
1542A418N96j159q34J662L81k648R8K933j663k673K470R63j647r8j87Q3J186j366
$$ 1418 2014 855 21 1683 2064 -584 -486 2447 784 -1889 581 1544 -103 -201 -388 -305 881 -485
1560d85j428J848J465l434p03L675j363k269J596N87j340J087j44j138J060j42
$$ -485 -1913 -65 1400 -2034 -2737 938 -425 -2694 -1098 -511 -1851 -764 -908 -2046 -986 -1128
1576a128j628K189J049l557K70M332k625k496L733o04k093J610K47n99J534j071
$$ -1128 -2756 -567 482 -3075 -2805 1527 -1098 -3594 139 -465 -2558 -948 -701 -1300 234 -837
1592h37k360L459K033m800L4M563k689j193L359j253j661K091n91q86K976j036
$$ -837 -3197 262 2295 -2505 -2471 2092 -597 -1790 1569 316 -1345 746 155 -731 2245 1209
1608A209l269K971J693l685J729K824m108n47M489j537j737J515p93l81K788j791
$$ 1209 -2060 911 2604 -1081 648 3472 -636 -1183 3306 1769 32 1547 754 373 3161 1370
1624A370k647L957n4m573K825L619m164r09K611j077K78J232l160j00L402j173
$$ 1370 -1277 2680 2626 -1947 878 4497 333 -576 2035 958 1236 2468 -692 -792 2610 1437
1640A437k519L053k74l728K412J711l089Q06J156k242M38J972j124o57N59k079
$$ 1437 -1082 1971 1697 -2031 381 2092 -997 -191 965 -1277 -839 1133 9 -648 -89 -2168
1656b168K14M014k122l235K359J633k021p7J235j045j57j59m67K100N39l217p38
$$ -2168 -1954 2060 -62 -3297 -938 695 -1326 -1403 -168 -1213 -1370 -1529 -1996 104 643 -2574 -3312
1673c312K948Q87k089M40j20j61Q35K95n14j87n61J24J499Q9q44J04J29p11P80
$$ -3312 -364 523 -1566 -1126 -1246 -1407 -572 -277 -791 -978 -1539 -1415 84 173 -671 -567 -438 -1149 -369
1692c69J371O5k027p16J788K165j422k170J154J162l77J33N23m36k19k05k84J859
$$ -369 1002 1067 -960 -1676 112 2277 855 -1315 -161 1001 624 757 1280 844 625 420 136 1995
1710A995R81l581m11K923M9j118J131j361j143K202L88j359N63k85j747K113J270
$$ 1995 2976 -605 -1016 1907 1956 838 1969 608 -535 1667 2055 696 1259 974 -773 1340 2610
1727B610k864M25J951l253M63L997k179k942J554J23K24K114j703l512L598J133
$$ 2610 -254 171 2122 -1131 -668 3329 1150 -1792 -238 -115 109 2223 520 -2992 606 1739
1743A739l624J464K660m112k80L389j732l02J553k661q63M311p70l272K255l68
$$ 1739 -1885 -421 2239 -1873 -2153 1236 -496 -798 755 -1906 -2769 1542 772 -2500 -245 -613
1759f13k812L666J846m968O14K903k585L01K821k561r93K796j956m57M455k703
$$ -613 -3425 241 2087 -2881 -2267 636 -1949 -1648 1173 -1388 -2381 415 -1541 -1998 2457 -246
1775b46m167M048K281l605J399Q79k790J571K577k905J37K579k966m98M465j683
$$ -246 -4413 -365 1916 -1689 -290 589 -2201 -630 1947 -958 -821 1758 -1208 -1706 2759 1076
1791A076l096L192m51k272L381P35l842R99J912j958J156J808l689J18M122k308
$$ 1076 -2020 1172 721 -1551 1830 2565 -1277 -278 1634 -324 832 2640 -1049 -931 3191 883
1807H83j582L304r94k974K532J113j769P44o07j772K707J540l645J36K358k237
$$ 883 -699 2605 1611 -1363 1169 2282 513 1257 650 -1122 1585 3125 -520 -384 1974 -263
1823b63l26L014j695j758J760l18o21J484p39j920J334Q91j881J240P51k490M22
$$ -263 -589 2425 730 -1028 732 414 -207 1277 538 -1382 -48 843 -1038 202 953 -1537 -1115
1840a115K279j146q98M26q71N25R90q94k62J199r01j667K083R57k101k39Q92r9
$$ -1115 1164 18 -880 -454 -1325 -800 190 -704 -966 233 -668 -2335 -252 705 -1396 -1635 -743 -842
1858h42M40p6p98L95M52q55O54Q52j000p15J091N24r07O76l86j29N67m19M04L57
$$ -842 -402 -478 -1276 -881 -429 -1284 -630 222 -778 -1493 -402 122 -785 -109 -495 -624 -57 -476 -72 285
1878B85n63p10J059R65r86m13O81j51j9M66l24M60l72p45R35R15j112n10Q49J18
$$ 285 -278 -988 71 1036 50 -363 318 167 148 614 290 750 378 -367 568 1483 371 -139 710 828
1898H28j73L39k52m24M52K37m15R22o56j096P36J025r49q4N61m19l85M54j2J89
$$ 828 655 994 742 318 770 1007 592 1514 858 -238 498 1523 574 490 1051 632 247 701 689 878
1918H78k50o72p1R04q7j359R80J11q73K53M84n22o2k27J7L81L35j173J61J321
$$ 878 628 -44 -115 789 702 -657 323 434 -439 -186 298 -224 -286 -513 -496 -115 220 -953 -792 529
1938E29r20m68L88P8r61P32L05l78J63j19j67K44K44p91L39R82j170k05J100k45
$$ 529 -391 -859 -471 -393 -1354 -622 -317 -695 -532 -651 -818 -574 -330 -1121 -782 200 -970 -1175 -75 -320
1958c20n92J4O86J11n98J27j41N82p9n55M81O66m79l21P48N7m41J3L14j81P2n5
$$ -320 -912 -898 -212 -101 -699 -572 -713 -131 -210 -765 -284 382 -97 -418 330 387 -54 -41 273 92 164 109
1980A09J51N13j34p81N34O54q63q9Q78l75l47K63N1K55j68O7J01J10j38q07Q54
$$ 109 260 773 639 -142 392 1046 183 94 972 597 250 513 564 819 651 718 819 929 791 -16 838
2001H38J02o94L2M86p0l36j19L31j05K8k11k18M03j28o20O15K48q38j30P73k68
$$ 838 940 246 278 764 694 358 239 570 465 493 282 64 467 339 -281 334 582 -256 -386 387 119
2022A19o31K02L03k27lk44K60P9L5m59K31K00l69p7K79k4n19J94L72l02J57k71
$$ 119 -512 -310 -7 -234 -237 -481 -221 -142 -107 -566 -335 -135 -504 -581 -302 -326 -845 -651 -279 -581 -424 -695
2044f95j2J37J01n11O33j64n0k17M58N9p11L54K30J59j27j25J40N78k91l88J82
$$ -695 -707 -570 -469 -980 -347 -511 -561 -778 -320 -261 -972 -618 -388 -229 -356 -481 -341 237 -54 -442 -260
2065b60O25o01j27O05Q6m11K54O6j76R2j5L7K68n4k91O45K30m64m96R01l0o30
$$ -260 365 -236 -363 242 328 -83 171 237 61 153 138 175 443 389 98 743 973 509 13 914 884 254
2087B54M08J11k14JM8k2l8Mj40J87Q0j27j82K81K96p08Q2M40o58n4M50j16j83
$$ 254 662 773 559 560 608 586 548 552 412 599 679 552 370 651 947 239 321 761 103 49 499 383 200
2110B00r3j54j29O81n73n03P00L17j195L86N28n66r5K17q4j19M9j73l50P80l55
$$ 200 107 -47 -176 505 -68 -571 129 446 -749 -363 165 -401 -496 -279 -363 -482 -433 -606 -956 -176 -531
2131e31p81R50J60r70N70M44o63N1O90q94K24N58n45k43J047p48l81J454l72j375
$$ -531 -1312 -362 -202 -1172 -602 -158 -821 -770 -80 -974 -750 -192 -737 -980 67 -681 -1062 392 20 -1355
2151a355J173O49j226L70J145j067l33P23m79J66J407j329j176K268l12j164Q94
$$ -1355 -182 467 -759 -389 756 -311 -644 79 -400 -234 1173 -156 -1332 936 624 -540 354
2168C54L60p99M61Q32j352N02Q67j228K28J215j079p5R96r87o84J918k2j975J087
$$ 354 714 -85 376 1208 -144 358 1225 -3 225 1440 361 286 1282 295 -389 1529 1507 -468 619
2187F19N47r85N47N17j464P38R38j807K33K028j764p31J257J5q26O15m36r02J492
$$ 619 1166 181 728 1245 -219 519 1457 -350 -117 1911 147 -584 673 688 -138 477 41 -861 631
2206F31R3j497N77P91j447M80J181j391l31J051p87j04J031j77j534J048O7m71
$$ 631 724 -773 -196 595 -852 -372 809 -582 -913 138 -649 -753 278 101 -1433 -385 -318 -789
2224g89J274o52j776R70J438j476K25P17l79n40P92j91q4M24q60k96J457Oj035
$$ -789 485 -167 -1943 -973 465 -1011 -786 -69 -448 -988 -196 -387 -471 -47 -907 -1203 254 260 -775
2243g75N59p7j82O98J21q89p3N84k45M23N12r23p9Q17k78J29M73m97q17P49L91
$$ -775 -216 -293 -475 223 344 -545 -618 -34 -279 144 656 -267 -346 471 193 322 795 298 -519 230 621
2264F21M21j74j095J42J307j68p76L66j7q02O73P10m75K7m38n89J079N77j055
$$ 621 1042 868 -227 -85 1222 1054 278 644 627 -175 498 1208 733 760 322 -267 812 1389 334
2283C34n9K68m96K01J465j682n80Q61j8j40N90o83n79R90o16l35J167O7k012N79
$$ 334 275 543 47 248 1713 31 -549 312 294 154 744 61 -518 472 -144 -479 688 755 -1257 -678
2303f78J475o17p35M21r72L34J713j527n90J463r55j242K248K85j927P06M87j068
$$ -678 797 180 -555 -134 -1106 -772 941 -586 -1176 287 -668 -1910 338 623 -1304 -598 -111 -1179
2321a179Q08Q48j895K91J304j142L12J503j823r75K251j63j229J076M1j539J249
$$ -1179 -371 477 -1418 -1127 177 -965 -653 850 -973 -1948 303 140 -1089 -13 28 -1511 -262
2338b62Q13j224R93K6j865J304K061j883j120J844o86o86J922m56j707J438L3
$$ -262 551 -673 320 346 -1519 -215 1846 -37 -1157 687 1 -685 1237 781 -926 512 545
2355E45j085J723Q7k304J545J152j663K77J363j786m66J813k17r78J077l75r31
$$ 545 -540 1183 1270 -1034 511 1663 0 277 1640 -146 -612 1201 984 6 1083 708 -223
2372b23J616l36j538J181K72j272Q23J075j592m87J213p93L12J017j252q45J441
$$ -223 1393 1057 -481 700 972 -300 523 1598 6 -481 732 -61 251 1268 16 -829 612
2389F12m21j005J511k89j664R66J119j197J49K52p91J66R19r60j55R80j333j42
$$ 612 191 -814 697 408 -1256 -290 829 -368 -219 33 -758 -592 327 -633 -788 192 -1141 -1283
2407a283J629j87j396P70q9l38M40J20o51N71j05o67P55O67j534K29J139m54l03
$$ -1283 346 159 -1237 -467 -556 -894 -454 -334 -985 -414 -519 -1186 -431 236 -1298 -1069 70 -384 -687
2426f87N61k68l28N01J12k51O27n76o68J479m4j043Q32J08n72L20M41N2m76J28
$$ -687 -126 -394 -722 -221 -109 -360 267 -309 -977 502 458 -585 247 355 -217 103 544 596 120 248
2446B48k69L38P11r79k63R99j68n49O11L8n39L35k40M41p0k84k33P24K33r21K20
$$ 248 -21 317 1028 49 -214 785 617 68 679 717 178 513 273 714 644 360 127 851 1084 163 383
2467C83L31j04k55N52n72J43k16k53L86K68n02l21O12j63n62N53J37q72J30K64
$$ 383 714 610 355 907 335 478 262 9 395 663 161 -160 452 289 -273 280 417 -455 -325 -61
2487f1j73R0j16l71N52J70n11j86O22l44q65P91M04o11K1m00L95M46m68k56M25
$$ -61 -234 -144 -260 -631 -79 91 -420 -606 16 -328 -1193 -402 2 -609 -588 -988 -593 -147 -615 -871 -446
2508d46L57p30Q4M90L6p62L53J25K7o0M6j40O38o24K22O81k87n13K68M93m09k17
$$ -446 -89 -819 -735 -245 -209 -971 -618 -493 -466 -526 -480 -620 18 -606 -384 297 10 -503 -235 258 -151 -368
2530c68N40q9r7M35k93O0L40l97j53P55O0p16K58L55j24j60K90j11j13P4k06N34
$$ -368 172 83 -14 421 128 188 528 131 -22 733 793 77 335 690 566 406 696 585 472 546 340 874
2552H74j56n32J65M43J76p98J17M84l50k97O08j35o8l73J71k4J17n31K37K04j24
$$ 874 718 186 351 794 970 172 289 773 423 126 734 599 531 158 329 305 422 -109 128 332 208
2573B08o26N37J76k93L7r8j56N0j83j44K05J70q39P12K83M4q12J28L50n26K61
$$ 208 -418 119 295 2 39 -59 -215 -165 -348 -492 -287 -117 -956 -244 39 83 -729 -601 -251 -777 -516
2594e16k28J74K80j64j40K76k32r9k82O39P3n71L17L92o44J47J47J66k4k24l9
$$ -516 -744 -570 -290 -454 -594 -318 -550 -649 -931 -292 -219 -790 -473 -81 -725 -578 -431 -265 -289 -513 -552
2615e52N31lj10k21N72k65l15K41L81k88k02M76L64j77n92O53K59k69j98J74L97
$$ -552 -21 -24 -134 -355 217 -48 -363 -122 259 -29 -231 245 609 432 -160 493 752 483 285 459 856
2636H56l20m54L88l9j21r6L43J22j34k31M21P3n19J41J2N53l94o96L63L64q5l67
$$ 856 536 82 470 431 310 214 557 679 545 314 735 808 289 430 442 995 601 -95 268 632 547 180
2658A80K17M2k78k06R4QK52l76m11Q20k41m37M67O9n97K0N6N87q72K70n0r2k79
$$ 180 397 439 161 -45 49 57 309 -67 -478 342 101 -336 131 200 -397 -377 -321 266 -606 -336 -386 -478 -757
2681g57N21k35n4P2l17L14M66o27m60P59k8n43J62K34j92N28k34k56P53k38q38
$$ -757 -236 -471 -525 -453 -770 -456 10 -617 -1077 -318 -346 -889 -727 -493 -685 -157 -391 -647 106 -132 -970
2702i70M63N79l30m96J038l10m54N56P2o92N64r6j30Q25k77j022P45P67r53j59
$$ -970 -507 72 -258 -754 284 -26 -480 76 148 -544 20 -76 -206 619 342 -680 65 832 -121 -280
2722b80J233o91m18O37l7j54O37o73m56J052o0j221R14O62j205j31J252n08n83
$$ -280 953 262 -156 481 444 290 927 254 -202 850 790 -431 483 1145 -60 -191 1061 553 -30
2741c0O76l52QO47q64k88J360o37p37R83p1j241M35J120j078j11N25p13M20O97
$$ -30 646 294 302 949 85 -203 1157 520 -217 766 695 -546 -111 1009 -69 -180 345 -368 52 749
2761G49j265j33J224q78q43J394J84j474O42N15r04N53L89j222L21P27q48L65
$$ 749 -516 -649 575 -303 -1146 248 432 -1042 -400 115 -789 -236 153 -1069 -748 -21 -869 -504
2779e04O02r68l39J205N3j166Q36Or53J171o5n70O02o10p69J441O45j051o88J311
$$ -504 98 -870 -1209 -4 49 -1117 -281 -275 -1228 -57 -122 -692 -90 -700 -1469 -28 617 -434 -1122 189
2799A89l49l22Q77l55l95Q44p83N2J265p88r41O69Q46n64j25O34p29q0O55m14
$$ 189 -160 -482 395 40 -355 489 -294 -242 1023 235 -706 -37 809 245 120 754 25 -55 600 186
2819A86K17L60r96N98R22q10m85R30m79m55P05K57k12n02J12j65J010m06j172
$$ 186 403 763 -233 365 1287 477 -8 922 443 -12 693 950 738 236 348 183 1193 787 -385
2838c85O01O30r00J07N62m68l76M77o7J65N6r57M6Q28p9p54Q95n32j012R49N56
$$ -385 216 846 -54 53 615 147 -229 248 181 346 402 -555 -509 319 240 -514 381 -151 -1163 -214 342
2859C42o76l1j30k19J87Q51j161M17N78j370M07J496q63j164P79J24r0N54n93
$$ 342 -334 -365 -495 -714 -527 324 -837 -420 158 -1212 -805 691 -172 -1336 -557 -433 -523 31 -562
2878e62p11J126J55j061R68M94j645M19J587r38k73O80j068K29J204n40n82J080
$$ -562 -1273 -147 8 -1053 -85 409 -1236 -817 770 -168 -441 239 -829 -600 604 64 -518 562
2896E62o98r80J934n6j646O49J062r94N77M56j002K86N25o13L87J004j304m99
$$ 562 -136 -1116 818 762 -884 -235 827 -167 410 866 -136 150 675 62 449 1453 149 -350
2914c50J449J62j329P18L85j322Q00N72r81P24J43r92M19J067j244o25J231o77
$$ -350 1099 1261 -68 650 1035 -287 513 1085 104 828 971 -21 398 1465 221 -404 827 150
2932A50m09J070l5j270N59p0j01P95j67j489Q92R56j329K97O72j158m38J277k14
$$ 150 -259 811 776 -494 65 -5 -106 689 522 -967 -75 881 -448 -151 521 -637 -1075 202 -12
2951a2l92J10n24k32J407n53j018J048K02j264R55P51j202O5L92m98K82N18p89
$$ -12 -404 -294 -818 -1050 357 -196 -1214 -166 36 -1228 -273 478 -724 -659 -267 -765 -483 35 -754
2970g54o2Q43n41k16J060o62q28O25P00j050L68O17l92K40M60p81N78K35q85J19
$$ -754 -816 27 -514 -730 330 -332 -1160 -535 165 -885 -517 100 -292 -52 408 -373 205 440 -445 -326
2990c26J086m55o14O15L9j70J80L05p00O35j03j95O01k8j083M86L19M1m05L98
$$ -326 760 305 -309 306 345 175 355 660 -40 595 492 297 898 870 -213 273 592 633 228 626
3010F26Ml85K03M7N7J24m39k60R74j64o03K20j50j74L21j53J73j92j59k20M85
$$ 626 630 245 448 495 552 676 237 -23 951 787 184 404 254 80 401 248 421 229 70 -150 335
3031C35K80j200L57M82m56kJ18K06m78l3lK45K81o63l51P91j75o83M08L25o78
$$ 335 615 -585 -228 254 -202 -204 -86 120 -358 -391 -394 -149 132 -531 -882 -91 -266 -949 -541 -216 -894
3052h94K52J87K0k61K62k99M31L1l50rJ92K59q01P83K12n06N1K80J58j85p4j92
$$ -894 -642 -455 -435 -696 -434 -733 -302 -271 -621 -630 -438 -179 -980 -197 15 -491 -440 -160 -2 -187 -261 -453
3074d53N46N4n45N5Q49n18k47N85L06n39J7P6R5J81l73O5M32J99p69L33O24m11
$$ -453 93 147 -398 -343 506 -12 -259 326 632 93 110 186 281 462 89 154 586 785 16 349 973 562
3096E62m54K26L88j80l3k11K11KQ5r2j28K27p08M72M34l28m50O09l37n1k4j62
$$ 562 108 334 722 542 509 298 509 511 596 504 376 603 -105 367 801 473 23 632 295 244 220 58
3118E8M33q9n43K50K24n2q30M28N04p29J45O0k20J63J1j00K41r3l67N8M23k66
$$ 58 491 402 -141 109 333 281 -549 -121 383 -346 -201 -141 -361 -198 -187 -287 -46 -139 -506 -448 -25 -291
3140b91o72O67q9j72J56o2J74k09J6j85L14j49k22j51N16q7l70O03J21l01l5L25
$$ -291 -963 -296 -385 -557 -401 -463 -289 -498 -482 -667 -353 -502 -724 -875 -359 -446 -816 -213 -92 -393 -428 -103
3162a03j27k05J55J69L9J43m29J53M36l46o2L83k74j2K25M73j86j45K06r5J03
$$ -103 -230 -435 -280 -111 -72 71 -358 -205 231 -115 -177 206 -68 -80 145 618 432 287 493 398 501
3183E01j31k56J98M79l57m06M46K25l39l01M30J47rl48P2K87M7o67L85L68l28
$$ 501 370 114 312 791 434 28 474 699 360 59 489 636 627 279 351 638 685 18 403 771 443
3204D43j69K63j23k69K3J9J06l1l99K16K36k08k38J38K62l67k38L71j27m58Q4
$$ 443 274 537 414 145 168 187 293 262 -137 79 315 107 -131 7 269 -98 -336 35 -92 -550 -466
3225d66J0K79l26j98O15j98q4o00M05P7j47m4R2L04l40k46O14J39o86J79J74K17
$$ -466 -456 -177 -503 -701 -86 -284 -368 -968 -563 -486 -633 -677 -585 -281 -621 -867 -253 -114 -800 -621 -447 -230
3247b30j90m7K9J42j07K6J75L55l91m72R45Q9p42K81M34k7j60o7R1R1L83p25L75
$$ -230 -420 -467 -438 -296 -403 -377 -202 153 -238 -710 235 324 -418 -137 297 270 110 43 134 225 608 -117 258
3270B58L71l88n64J148j56o77O81Om83J88J45k14L34n4m33L89O62q60m68J112
$$ 258 629 241 -323 825 669 -8 673 679 196 384 529 315 649 595 162 551 1213 353 -115 997
3290I97m20p64J004o1p27J86J68m64P76j24j200R79N13r40j69J009j060l97J061
$$ 997 577 -187 817 756 29 215 383 -81 695 571 -629 350 863 -77 -246 763 -297 -694 367
3309C67n29j3K09k36m99P80p6o94L56K76j103R49L52p53j79N92l53J44M17o94
$$ 367 -162 -175 34 -202 -701 79 3 -691 -335 -59 -1162 -213 139 -614 -793 -201 -554 -410 7 -687
3329f87j56M73l26k22P28Q9j050N69P37q98M28L8n86M84N76n59k0Q15j114J48
$$ -687 -843 -370 -696 -918 -190 -101 -1151 -582 155 -743 -315 -277 -863 -379 197 -362 -382 433 -681 -533
3349e33J035l03p33O04J57o26Q44J20q45N67O1m97P99L77j117p5R66k16l38O67
$$ -533 502 199 -534 70 227 -399 445 565 -280 287 348 -149 650 1027 -90 -165 801 585 247 914
3369I14o41k89P60l16O5J22q5q00J192K19p83l57N75n48J66N57m03k22L54n93
$$ 914 273 -16 744 428 493 615 530 -270 922 1141 358 1 576 28 194 751 348 126 480 -113
3389a13L85P72j183k45P76j89m35N14K14r98L31M56l51M06l99j022Q42O66o34
$$ -113 272 1044 -139 -384 392 203 -232 282 496 -502 -171 285 -66 340 -59 -1081 -239 427 -207
3408b07k86L70l98j22N87O1p38L31l72P6J055p03q77R26n5m91N66J91q19j12P58
$$ -207 -493 -123 -521 -643 -56 5 -733 -402 -774 -698 357 -346 -1223 -297 -352 -843 -277 -86 -905 -1017 -259
3429b59L0k15N80r74M06N96o32n2N36k15q44J260L14p31L29j64m04P90M35r68
$$ -259 -229 -444 136 -838 -432 164 -468 -520 16 -199 -1043 217 531 -200 129 -35 -439 351 786 -182
3449a82M43L66r12M65J032o19p46Q26n15L19M48m00l15N13L3p79J114l02j255
$$ -182 261 627 -285 180 1212 593 -153 673 158 477 925 525 210 723 756 -23 1091 789 -466
3468d66Q08P96q22Q6L12o91K36R12p88k46M34n78j51J341p62j195R93N20j059
$$ -466 342 1138 316 402 714 23 259 1171 383 137 571 -7 -158 1183 421 -774 219 739 -320
3487c20P93O9j121K96P02p95L41O96j295l13J347m32p30R60n48q31R86N3l05o
$$ -320 473 542 -579 -283 419 -376 -35 661 -634 -947 400 -32 -762 198 -350 -1181 -195 -142 -447 -453
3507d53L02r62P67P22j445J34Q99p14m3J074o28o15O52k75n5N76l66l95O50L59
$$ -453 -151 -1113 -346 376 -1069 -935 -36 -750 -793 281 -347 -962 -310 -585 -640 -64 -430 -825 -175 184
3527A84o78N21J46j105K79Q57o0J07J54p92K64O98o12j58O45k0p29Q89M8o43N12
$$ 184 -494 27 173 -932 -653 204 144 251 405 -387 -123 575 -37 -195 450 430 -299 590 638 -5 507
3548E07Q3m04J24M05p14M25L74m40P1L37j99o09Q13k73j23K49k87j30L47j52l
$$ 507 590 186 310 715 1 426 800 360 431 768 569 -40 773 500 377 626 339 209 556 404 401
3569D01K51k63m23K09L62m53r5L26m08l8M88m74j00M6o3J27M41k95o20J0N33k76
$$ 401 652 389 -34 175 537 84 -11 315 -93 -131 357 -117 -217 -171 -234 -107 334 39 -581 -571 -38 -314
3591c14k93O33m55k43M74j72j06km31N97j00r9k23M70p2m43L71j08j3K29l57O9
$$ -314 -607 26 -429 -672 -198 -370 -476 -478 -909 -312 -412 -511 -734 -264 -336 -779 -408 -516 -529 -300 -657 -588
3613e88K69K26n80M99l9j78J6P04l67m35M02Q7p6J63l30J64L69k49j11N77l18
$$ -588 -319 -93 -673 -174 -213 -391 -375 329 -38 -473 -71 16 -60 103 -227 -63 306 57 -54 523 205
3634B05k00M5N77n27L74K62l19K36j52j91K12K22n79R1M01M3n98K88P1K29P3o19
$$ 205 5 50 627 100 474 736 417 653 501 310 522 744 165 256 657 700 102 390 461 690 763 144
3656A44J81K76j83m18N32j15k42J77o8j50k1P6j8K6l08N1o3R4P1n30P63m95j89
$$ 144 325 601 418 0 532 417 175 352 284 134 113 189 171 197 -111 -60 -123 -29 42 -488 275 -220 -409
3679d09J77L88l06j59j90J28k96K97j02r1J56j78q4N78n9m42J22j2k05P1K04K08
$$ -409 -232 156 -150 -309 -499 -371 -667 -370 -472 -563 -407 -585 -669 -91 -150 -592 -470 -482 -687 -616 -412 -204
3701b04k09J37k11oM99k56j64L02k26k7J67l4K21L5j54K19r7r2j70n7P42m02J9
$$ -204 -413 -276 -487 -493 6 -250 -414 -112 -338 -365 -198 -232 -11 24 -130 89 -8 -100 -270 -327 415 13 32
3724C2M38p0k79M31m4r9j76J69m0LJ89j38N2L14n24K04L44l59m5q7K7mml9K94
$$ 32 470 400 121 552 508 409 233 402 362 365 554 416 468 782 258 462 806 447 402 315 342 338 334 295 589
3749E89j12j60l06M58J60n46O7K74m18L20j14L7k45R6l56J09N2j78p8M14n2l27
$$ 589 477 317 11 469 629 83 150 424 6 326 212 249 4 100 -256 -147 -95 -273 -351 63 11 -316
3771c16n3K02j23j70L54n5j55m19K31K5R5r4r7L32k05k27J77M16l24k05L77j80
$$ -316 -369 -167 -290 -460 -106 -161 -316 -735 -504 -479 -384 -478 -575 -243 -448 -675 -498 -82 -406 -611 -234 -414
3793d14p5n5M5L65k19j32R5L07l16K11j75J37N30k00k78L30p4Q5K0K4j66MK31
$$ -414 -489 -544 -499 -134 -353 -485 -390 -83 -399 -188 -363 -226 304 104 -174 156 82 167 187 211 45 49 280
3816B80R3j41Q9j9j9K6j28K67K32k39l17M52J44m27kM01q0l72L53O7n25N45n82
$$ 280 373 232 321 302 283 309 181 448 680 441 124 576 720 293 291 692 612 240 593 660 135 680 98
3839I8N4N72k80l10K36J8l76N57j45n48K24K72m33K83o4o96J18R46q75M9M05l61
$$ 98 152 724 444 134 370 388 12 569 424 -124 100 372 -61 222 158 -538 -420 526 -349 -300 105 -256
3861b56l60N61Rn61M01j17n68P69J5q85O38K90o75l9P64k65l52P6J31l79O57k24
$$ -256 -616 -55 -46 -607 -206 -323 -891 -122 -107 -992 -354 -64 -739 -778 -14 -279 -631 -555 -424 -803 -146 -370
3883c70n63R13K41r41N29L33j051L79R35p40o2N78m59j83J117n49n20J047l87
$$ -370 -933 -20 221 -720 -191 142 -909 -530 405 -335 -397 181 -278 -461 656 107 -413 634 247
3902B47q31R27K52r32L44O32n75K18M48p88K17M13n34N35Q51j338k12J060m72
$$ 247 -584 343 595 -337 7 639 64 282 730 -58 159 572 38 573 1424 86 -126 934 462
3921D62j26L27K6o93M03P36r72L92L54j387P99O18o18n81R58o55K99J97n03l13
$$ 462 336 663 689 -4 399 1135 163 555 909 -478 321 939 321 -260 698 43 342 539 36 -277
3941b77P79l82m13Q18m83q21Q39J92o60L12K1m21M13m4l19K57M4m08l30Q52l23
$$ -277 502 120 -293 525 42 -779 60 252 -408 -96 -75 -496 -83 -127 -446 -189 -145 -553 -883 -31 -354
3962c54m77N44j26l18M98K47o17j31L22n45N22M83p48q2P79l48j06N93m20l91
$$ -354 -831 -287 -413 -731 -233 14 -603 -734 -412 -957 -435 48 -700 -782 -3 -351 -457 136 -284 -675
3982f75Q47m28O4M67m48m51P17M15o68M85p0o07L16Q07n78M6J96l93J56J021j157
$$ -675 172 -256 -192 275 -173 -624 93 508 -160 325 255 -352 -36 771 193 239 435 42 198 1219 62
4003F2M4O93l24l32J038n62p14L54O35n24M50N9j053P29K80o06K00N46r34L1J031
$$ 62 106 799 475 143 1181 619 -95 259 894 370 820 879 -174 555 835 229 429 975 41 72 1103
4024A103o58l88O48o63o43J030K6r01R86q08k65J023n2j000J73O33l48k38O24
$$ 1103 445 57 705 42 -601 429 455 -446 540 -268 -533 490 438 -562 -389 244 -104 -342 282
4043B82q54j96Q07m24j38L21m80o74J506j01p84P00j5q35k4Q84n23O4L32q89N68
$$ 282 -572 -768 39 -385 -523 -202 -682 -1356 150 49 -735 -35 -50 -885 -909 -25 -548 -484 -152 -1041 -473
4064d73O87p02j93M06l07k1Q63k16p87P73J8k94L85K60j043O53N01m84JL20k53
$$ -473 214 -488 -681 -275 -582 -603 260 44 -743 30 48 -246 139 399 -644 9 510 26 27 347 94
4085I4m95Q97K40p35M77k84j43Q48m14m81O12K1p11M23M18l66l14N32j56j78M77
$$ 94 -401 496 736 1 478 194 51 899 485 4 616 637 -74 349 767 401 87 619 463 285 762
4106G62n08L5N71o69K87J85j49p65O33L06k63m20M72m37Q8K57j35k45L21n90J31
$$ 762 254 289 860 191 478 663 514 -251 382 688 425 5 477 40 128 385 250 5 326 -264 -133
4127a33M40k82l66N59n22K9O68n88k98J57L75n80K94q7m11k6P67n31N64m72j04
$$ -133 307 25 -341 218 -304 -275 393 -195 -493 -336 39 -541 -247 -334 -745 -771 -4 -535 29 -443 -547
4148e47k19M33l10J50M50n62J64J68ml45L68l4p5Q3J09j54mj39K08M0L31l77Q0
$$ -547 -766 -333 -643 -493 -43 -605 -441 -273 -277 -622 -254 -288 -363 -280 -171 -325 -329 -468 -260 -220 111 -266 -186
4171a86M33j77n84M76K14o7K8J71kl9l37J43J44M35l23j07M48l93n4J50L98k30
$$ -186 247 70 -514 -38 176 109 137 308 306 267 -70 73 217 652 329 222 670 277 223 373 771 541
4193E41q5n8k4L48l63k46%J33p6J58K54m53K23k41L22k72K27j69n7o2k99K51K08
$$ 541 456 398 374 722 359 113 113 246 170 328 582 129 352 111 433 161 388 219 162 100 -199 52 260
4216B60l67j56J52K8o5J64K09n84K68o5l04M47k29k03J27R3j93k99N75j77k17
$$ 260 -107 -263 -111 -83 -148 16 225 -359 -91 -156 -460 -13 -242 -445 -318 -225 -418 -717 -142 -319 -536
4237e36J78j01j33J41K01j85o1J03l27K49L13%j82O8j51j5K16j68J26K85l02n8
$$ -536 -358 -459 -592 -451 -250 -435 -496 -393 -720 -471 -158 -158 -340 -272 -423 -438 -222 -390 -264 21 -281 -339
4259c39K28k9m7K73J9l9k81K18O9J08K41k64M3J20l34M50j64K2M17j44j02l3j05
$$ -339 -111 -140 -187 86 105 66 -215 3 72 180 421 157 200 320 -14 436 272 294 711 567 465 432 327
4282C27N3n0P7n5j61N9J67n04N25n8m7N9k47R7j35M1n2k0N84n48J23J97p32L67
$$ 327 380 330 407 352 191 250 417 -87 438 380 333 392 145 242 107 148 96 76 660 112 235 432 -300 67
4306F7n2m6k6k4q9J67k92J13Q7k36j14J80K50k2r0k49o5J88j35o1K11j48p5j2
$$ 67 15 -31 -57 -81 -170 -3 -295 -182 -95 -331 -445 -265 -15 -37 -127 -376 -441 -253 -388 -449 -238 -386 -461 -473
4330d73J1J32K21m05K25M75q18J87j95M76n44N01j52k9J19l5M04k28Q0k62J88
$$ -473 -462 -330 -109 -514 -289 186 -632 -445 -640 -164 -708 -207 -359 -388 -269 -304 100 -128 -48 -310 -122
4351a22J80j58O3J5L61ll96K40J9j53K85j14J35J30j68M5M54j42j09j50%l86N11
$$ -122 58 -100 -37 -22 339 336 -60 180 199 46 331 217 352 482 314 359 813 671 562 412 412 26 537
4374E37k60J66K58j71M2k74J89k78J30n8j9K55k21q5P7j43J30J07j23j62j9o4
$$ 537 277 443 701 530 572 298 487 209 339 281 262 517 296 211 288 145 275 382 259 97 78 14
4396A4k43J3L96k34j48O99r60L79L95m36m14J35O7k97O21J84o60L34j60kJ63r7
$$ 14 -229 -216 180 -54 -202 497 -463 -84 311 -125 -539 -404 -337 -634 -13 171 -489 -155 -315 -317 -154 -251
4418b51k15qJ71k91L15J40l68j63N70K07p77K55k4p6L16J44j51L12k05k55L54
$$ -251 -466 -474 -303 -594 -279 -139 -507 -670 -100 107 -670 -415 -439 -515 -199 -55 -206 106 -99 -354 0
4439@n8j05j21N45n77Q7L61k7j95N49l40j85M90j81m41M05K07m35K46L45l15k46
$$ 0 -58 -163 -284 261 -316 -229 132 105 -90 459 119 -66 424 243 -198 207 414 -21 225 570 255 9
4461IN27l75L27or7j44M47m14j00M63P9q02O17M3n04L49P3o77N73R5p14K59L16
$$ 9 536 161 488 482 385 241 688 274 174 637 716 -86 531 574 70 419 492 -185 388 483 -231 28 344
4484C44o11k6O62l67p9m2L13n39N97k83p99M87K49l07N37M4o38O3N05m33j68L47
$$ 344 -267 -293 369 2 -77 -119 194 -345 252 -31 -830 -343 -94 -401 136 180 -458 -395 110 -323 -491 -144
4506a44k42m43O35j98l68N44j44l91O30M1m42J57J33k52L05N3m07K35L61n73K54
$$ -144 -386 -829 -194 -392 -760 -216 -360 -751 -121 -80 -522 -365 -232 -484 -179 -126 -533 -298 63 -510 -256
4527b56R18r58j94O93k04l17L53M0m22L74K29m34J69K37l69L23K82l66J90K37
$$ -256 662 -296 -490 203 -1 -318 35 75 -347 27 256 -178 -9 228 -141 182 464 98 288 525
4547E25l88J08M82k95j64K41j24j81M58k17m06M65j96l39O08lo80L15L76m67K69
$$ 525 137 245 727 432 268 509 385 204 662 445 39 504 308 -31 577 574 -106 209 585 118 387
4568C87J9n49J35L74k25m67P22k28m56N26J39l94M3Om80O05k00L1l04L24l05P1
$$ 387 406 -143 -8 366 141 -326 396 168 -288 238 377 -17 26 32 -448 157 -43 -12 -316 8 -297 -226
4590b26N15l34o44N12j51j94P48o05l13L50P7o8Q8K49p51N43L42n96P5M19n72
$$ -226 289 -45 -689 -177 -328 -522 226 -379 -692 -342 -265 -333 -245 4 -747 -204 138 -458 -383 36 -536
4611e36j9M31J24l78L07o8l09P77l79l91P14N8n93L05K33n13K43L20k91K87k6
$$ -536 -555 -124 0 -378 -71 -139 -448 329 -50 -441 273 331 -262 43 276 -237 6 326 35 322 296
4632B96k65j43N85l47k9L44n86K58L94l88K9K32J82m11K12r2m8pL79m29j29L98
$$ 296 31 -112 473 126 97 441 -145 113 507 119 148 380 562 151 363 271 223 216 595 166 37 435
4654D35p2l89L53Q5l49N35k85l43J41K26l46L65N7p23K00J95L7k70j32J17K9N10
$$ 435 363 -26 327 412 63 598 313 -30 111 337 -9 356 413 -310 -110 85 122 -148 -280 -163 -134 376
4676C76l23l49L84n01j10L92K03o70L00J00J4Kl4j57Q4K33j29qK05l81J11M7J81
$$ 376 53 -296 88 -413 -523 -131 72 -598 -298 -198 -184 -182 -216 -373 -289 -56 -185 -193 12 -369 -258 -211 -30
4699c0l60J78L92n68M47j87j6J80r4l96L74n3P3N3Q6k77J45J16j53rJ54j22K85
$$ -30 -390 -212 180 -388 59 -128 -144 36 -58 -454 -80 -133 -60 -7 79 -198 -53 63 -90 -99 55 -67 218
4722B18L3j56q3N03k37m24K31N02n30K32J8J06k28J14j43l4M25k02r4k22L23j87
$$ 218 251 95 12 515 278 -146 85 587 57 289 307 413 185 299 156 122 547 345 251 29 352 165
4744A65o4K05q3K0Q0j97j27J64j10J01Nk41L68j06l01J19K8N3Q2p7P4m25L65r5
$$ 165 101 306 223 243 323 126 -1 163 53 154 159 -82 286 180 -121 -2 26 79 161 84 158 -267 98 3
4768Ck1j83K06l46K41o9m3nQ8R7q4j66K02k90J06Nl7K79j29O2l53N8K72j33J69
$$ 3 -18 -201 5 -341 -100 -169 -212 -217 -129 -32 -116 -282 -80 -370 -264 -259 -296 -17 -146 -84 -437 -379 -107 -240 -71
4793g1P5k86J48p5K44k14K09j20k97N43j69J43q5K43O2m37J84j37k8J2J64L6j6
$$ -71 4 -282 -134 -209 35 -179 30 -90 -387 156 -13 130 45 288 350 -87 97 -40 -68 -56 108 144 128
4816A28R4J45k28J11K1k25M11k33J9k97L28j04o8L70l63n2L09k30O8J38l92L15
$$ 128 222 367 139 250 271 46 457 224 243 -54 274 170 102 472 109 57 366 136 204 342 -50 265
4838B65j02J07J21j54R7j53q3Q0l04K15K6p5P6j67m6j19L34l39Q2K67j90k55J83
$$ 265 163 270 391 237 334 181 98 178 -126 89 115 40 116 -51 -97 -216 118 -221 -139 128 -62 -317 -134
4861a34J42j2m77K22J55j51J13k27J26J27k56J45Pj93M89k38O6Lj9k17L47k97
$$ -134 8 -4 -481 -259 -104 -255 -142 -369 -243 -116 -372 -227 -220 -413 76 -162 -96 -93 -112 -329 18 -279
4883b79K38k13jK53j06k50K32m9J26n2J28q8n3J56o1k2J19l1P8J46k47R4rj33
$$ -279 -41 -254 -255 -2 -108 -358 -126 -175 -49 -101 27 -61 -114 42 -19 -41 78 47 125 271 24 118 109 -24
4907b4m4L01l08J19J85K27l9k16J93M2J18l28k8K8J63j58r8J6L8j9J12j98j28
$$ -24 -68 233 -75 44 229 456 417 201 394 436 554 226 198 226 389 231 133 149 187 168 280 82 -46
4930d6J81o7r0R3n5j36K11K33r5k06k8j98J43K84l81J18K01k22o3j39L88m45R6
$$ -46 135 68 -22 71 16 -120 91 324 229 23 -5 -203 -60 224 -157 -39 162 -60 -123 -262 126 -319 -223
4953b23K04P6j25k74O1Q2j08L8M4J22j99J27j1R3o6J86l00j5K46j74l6J71j62
$$ -223 -19 57 -68 -342 -281 -199 -307 -269 -225 -103 -302 -175 -186 -93 -159 27 -273 -288 -42 -216 -252 -81 -243
4976b43P5K61k73P5p7m2J09l2J82j00j69K13P8r8N1k0qK99l04J13Q0q5j25K63
$$ -243 -168 93 -180 -105 -182 -224 -115 -147 35 -65 -234 -21 57 -41 10 -10 -18 281 -23 90 170 85 -40 223
5000B23O0j95J45l7o3o0J05n8p7L07k30j66N73j85l69L44N7j8k34K8j00O0O1r7
$$ 223 283 88 233 196 133 73 178 120 43 350 120 -46 527 342 -27 317 374 356 122 150 50 110 171 74
5024G4J13p7k89M44J77l53J6M0o5j99K34k56K60q3P1k40K23J62n40J12K88l71
$$ 74 187 110 -179 265 442 89 105 145 80 -119 115 -141 119 36 107 -133 90 252 -288 -176 112 -259
5046b59K85O0k22j72L00k47j6p8J94N8O2M6k95J22Lj30K17K19m70K37P3k06K79
$$ -259 26 86 -136 -308 -8 -255 -271 -349 -155 -97 -35 11 -284 -162 -159 -289 -72 147 -323 -86 -13 -219 60
5069F0J60n77K68J91q0j19J77k44J53N4K2k10L88j38l76L76P5l7P7k79L0mM74
$$ 60 220 -357 -89 102 22 -97 80 -164 -11 43 65 -145 243 105 -271 105 180 143 220 -59 -29 -33 441
5092D41l80K72J75k88l60L09j04J01J55N9m91L33Q9j11k29M23n07L85j2m52J55
$$ 441 61 333 508 220 -140 169 65 166 321 380 -111 222 311 200 -29 394 -113 272 260 -192 -37
5113c7M25J0k33Q7l95Q8J63J02m31L48k46q1J65K7k83L33j51j15o5J89j73Q2K05
$$ -37 388 398 165 252 -143 -55 108 210 -221 127 -119 -200 -35 -8 -291 42 -109 -224 -289 -100 -273 -191 14
5136A4N0k31L24k23l4K56k21j92J59nl26L72l1O6j70J41j68p7J76r9lM01l78j01
$$ 14 64 -167 157 -66 -100 156 -65 -257 -98 -103 -429 -57 -88 -22 -192 -51 -219 -296 -120 -219 -222 179 -199 -300
5160c00M19l89r8L04Q8m22L48K4q3K52j22J05P3k5m21K41K40J6k07M09m16j62
$$ -300 119 -270 -368 -64 24 -398 -50 -26 -109 143 21 126 199 174 -247 -6 234 250 43 452 36 -126
5182a26J92q5J49J49j36O6j70J05k45L41k95K15J12j40P2l9J60r3j85K18j28k34
$$ -126 66 -19 130 279 143 209 39 144 -101 240 -55 160 272 132 204 165 325 232 47 265 137 -97
5204i7J65J59l94L81J91k70J88k20k09K32k23J43K8O7p8k87K81l58o3M50j46N7
$$ -97 68 227 -167 214 405 135 323 103 -106 126 -97 46 74 141 63 -224 57 -301 -364 86 -60 -3
5226cm8q2l76K57J94N5O1k77M19o21L22R9n14M41J06K4Rl68K41l3J6J94j3j83
$$ -3 -51 -133 -509 -252 -58 -3 58 -219 200 -421 -99 0 -514 -73 33 57 66 -302 -61 -94 -78 116 103 -80
5250h0k82M16p0J71k86L0m14P99m33m4J08J64l6q4J31P6l05K85j96k3M23k04J78
$$ -80 -362 54 -16 155 -131 -101 -515 284 -149 -193 -85 79 43 -41 90 166 -139 146 -50 -73 350 146 324
5273C24k91J30Q0m1J41l45J43J76j68k8j2q0j25L28j48J13j4j39K9K53k67j80
$$ 324 33 163 243 202 343 -2 141 317 149 121 109 29 -96 232 84 197 183 44 73 326 59 -121
5295a21M10p6N1j22n1j50k1pk4p9R9K2J57Q0k70j0n1J53J45k00K10p8m06O9J29
$$ -121 289 213 264 142 91 -59 -80 -87 -111 -190 -91 -69 88 168 -102 -112 -163 -10 135 -65 145 67 -339 -270 -141
5320a41M1k07J25l46K60J32K8L02k63m3J19J54l53l4l6L80j82j3k7K83k83J02
$$ -141 -100 -307 -182 -528 -268 -136 -108 194 -69 -112 7 161 -192 -226 -262 118 -64 -77 -104 179 -104 -2
5342bN1J56k49m7J49j31J09J85j10j62J12p8K18l56p3lK35L08j59k25R1p4L22
$$ -2 49 205 -44 -91 58 -73 36 221 111 -51 61 -17 201 -155 -228 -231 4 312 153 -72 19 -55 267
5365B67l1m81L82k22Q6K90l36kJ56J70l12K62j66J29j74P3J40l3K09j51j40k02
$$ 267 236 -245 137 -85 1 291 -45 -47 109 279 -33 229 63 192 18 91 231 198 407 256 116 -86
5387h6l82J71K89M8k33jO69j65o78M83j5J09n04N91m17L13j88j13J49j3J5k11
$$ -86 -468 -297 -8 40 -193 -194 475 310 -368 115 100 209 -295 296 -121 192 4 -109 40 27 42 -169
5409a69J68j05j21J45l24M11l87K27K21k99M46n24K28j46J12l05M59l34J93p5
$$ -169 -1 -106 -227 -82 -406 5 -382 -155 66 -233 213 -311 -83 -229 -117 -422 37 -297 -104 -179
5429a79J10l92L37J46j74Q5m51N25j02Q1K90l68M55l03m2J12j57k38M42k37k45
$$ -179 -69 -461 -124 22 -152 -67 -518 7 -95 -14 276 -92 363 60 18 130 -27 -265 177 -60 -305
5450c05P38j65k7k62K58J09M4m70R2j70K55q5l31N32n83L13K35k48J64P4k00Q2
$$ -305 433 268 241 -21 237 346 390 -80 12 -158 97 12 -319 213 -370 -57 178 -70 94 168 -32 50
5472E0l5m5k85K21m9K69J74m41K84M23m46P6l4k93K2K87j55k37j8j79K27L96k70
$$ 50 15 -30 -315 -94 -143 126 300 -141 143 566 120 196 162 -131 -109 178 23 -214 -232 -411 -184 212 -58
5495e8P6L6K1k56J2M31o54k31L46L59p19P34J84p93O25Q5L14n53j21m61M40j38
$$ -58 18 54 75 -181 -169 262 -392 -623 -277 82 -637 97 281 -512 113 198 512 -41 -162 -623 -183 -321
5517c21J39NPJ85K66j6l7j28K98n01J8N1L10m28k4L55o98M34k24K80j38j24Q07
$$ -321 -182 -177 -170 15 281 265 228 100 398 -103 -85 -34 276 -152 -176 179 -519 -85 -309 -29 -167 -291 516
5540E16l88m03P04N3l8o44K74p1l45J039o63N2J37j86j58M78k47k98O68n36l56
$$ 516 128 -275 429 482 444 -200 74 3 -342 697 34 86 223 37 -121 357 110 -188 480 -56 -412
5561d12L89%K07k19N39m41j75l67M91l6L58k31j68m06m1P89J41l57m00l88L54
$$ -412 -23 -23 184 -35 504 63 -112 -479 12 -24 334 103 -65 -471 -512 277 418 61 -339 -727 -373
5582c73L64K67l35J57r9Q0J26j08n47M83J98o02M54j99j01j06O31n01M20k64J54
$$ -373 -9 258 -77 80 -19 61 187 79 -468 15 213 -389 65 -134 -235 -341 290 -211 209 -55 99
5603I9p4J6k86l78N44j08o7N12K8l96L03k93O7m8L63m16Q6K8j20J04J40K79M2
$$ 99 25 41 -245 -623 -79 -187 -254 258 286 -110 193 -100 -33 -81 282 -134 -48 -20 -140 -36 104 383 425
5626D25p27M83lp21J082p09J35O38o61J0L16k19l98K46L37K29l64Q8J45j86J21
$$ 425 -302 181 178 -543 539 -170 -35 603 -58 -48 268 49 -349 -103 234 463 99 187 332 146 267
5647B67J64m88j63j60M42j8P2r4j19M63k37l23M18j32K42M9j22l29l22P62l08
$$ 267 431 -57 -220 -380 62 44 116 22 -97 366 129 -194 224 92 334 383 261 -68 -390 372 64
5668F4P2p45P56l66N2M92k63k87K31M53l50n54P28j58j00j17j98P70n09N81k71
$$ 64 136 -609 147 -219 -167 325 62 -225 6 459 109 -445 283 125 25 -92 -290 480 -29 552 281
5689B81Kq6r60L44J25L55J4K91n87p2Q18l32l24L42k20p14J103l42j59O54m86
$$ 281 283 197 -763 -419 -294 61 75 366 -221 -293 525 193 -131 211 -9 -723 380 38 -121 533 47
5710D7P4N9m00n69J82L22J82K77j12j87n9J69j69k73L85o6O2l9j73Q32n27N96
$$ 47 121 180 -220 -789 -607 -285 -103 174 62 -125 -184 -15 -184 -457 -72 -138 -76 -115 -288 544 17 613
5732F13r25M53j22m38P46p4q4K1o78J015j010L82K00j87P04j046N22j57K70m79
$$ 613 -312 141 19 -419 327 253 169 190 -488 527 -483 -101 99 -88 616 -430 92 -65 205 -274
5752b74L94k98N91q78K16oM30J59P0m9k70k29L74m09J79J88j82k56r1K52N4L67
$$ -274 120 -178 413 -465 -249 -255 175 334 404 355 85 -144 230 -179 0 188 6 -250 -341 -89 -35 332
5774C32k57K36n64J92k99L32p32M52K08O85p42j68j75P76j56K12l91m48N24k45
$$ 332 75 311 -253 -61 -360 -28 -760 -308 -100 585 -157 -325 -500 276 120 332 -59 -507 17 -228
5794b28J15M60l06q1k03l2R4o53O76J04K04n83L82K84J57l14J86l70k52L64l01
$$ -228 -113 347 41 -40 -243 -275 -181 -834 -158 -54 150 -433 -51 233 390 76 262 -108 -360 4 -297
5815b97L72j12j0M68l69k04Q5p9M5L20p9r6m33M64O66p13K10o80M76O45o98O0
$$ -297 75 -37 -47 421 52 -152 -67 -146 -101 219 140 44 -389 75 741 28 238 -442 34 679 -19 41
5837D1l4j94P69m62m81N4Q2Q10m74j78J76j41M0M47Lj98l69k9R7p42M21N3MJ59
$$ 41 7 -187 582 120 -361 -307 -225 585 111 -67 109 -32 8 455 458 260 -109 -138 -41 -783 -362 -309 -305 -146
5861a46l4p72R79n61N53j89J52l13L81k04o40J000q2K2j66J75q2k11k35R8Q12
$$ -146 -180 -952 27 -534 19 -170 -18 -331 50 -154 -794 206 124 146 -20 155 73 -138 -373 -275 537
5882E37l12m83L61j34o66J01j29J03M64k01L48k43N19o95J53L0j93J211j068J3
$$ 537 225 -258 103 -31 -697 -596 -725 -622 -158 -359 -11 -254 265 -430 -277 -247 -440 771 -297 -284
5902b84j63P60m96j04J6J65K9K31m36k81N54j57o68O17r7J79R3k77O04l19J12
$$ -284 -447 313 -183 -287 -271 -106 -77 154 -282 -563 -9 -166 -834 -217 -314 -135 -42 -319 285 -34 78
5923G8k00n48Q93K91p18J59J2k1o7K48l4n03L51n34O59j15j60M52l74j07J08J09
$$ 78 -122 -670 223 514 -204 -45 -33 -54 -121 127 93 -410 -59 -593 66 -49 -209 243 -131 -238 -130 -21
5945b1K90q03K97J58l51M73j33L71q6l60R0k05j04K09R6m5K5m65P25J1j89R51
$$ -21 269 -534 -237 -79 -430 43 -90 281 195 -165 -75 -280 -384 -175 -79 -124 -99 -564 161 172 -17 934
5967I34j200L56j94J37n77P68J2m37l90JR07k2n85L39N42p27K9k96K61l36P17
$$ 934 -266 90 -104 33 -544 224 236 -201 -591 -590 317 295 -290 49 591 -136 -107 -403 -142 -478 239
5988B39Q2j28l55n08M00M81k80k04M68K2j62K32o38L33m39L63o4Q94o85k1k95
$$ 239 321 193 -162 -670 -270 211 -69 -273 195 217 55 287 -351 -18 -457 -94 -158 736 51 30 -265
6009b65Q9R46j359O87N2l61M32l7o43L30n04M25l73P44m87k75J250r46N13P3l51
$$ -265 -176 770 -589 98 150 -211 221 184 -459 -129 -633 -208 -581 163 -324 -599 651 -295 218 291 -60
6030f0J44N8m15P97n65l30K05j20l68L9L19K56N28p49K44n73P09k56M11l67o63
$$ -60 84 142 -273 524 -41 -371 -166 -286 -654 -615 -296 -40 488 -261 -17 -590 119 -137 274 -93 -756
6051g56R07k52m51L37K32J99p45P6K36M41K41k81n89N74L2o89N39J27N07r50K36
$$ -756 151 -101 -552 -215 17 216 -529 -453 -217 224 465 184 -405 169 201 -488 51 178 685 -265 -29
6072b9r5l51N22j016Q05M8J49l31Q25l84J67n81R77p40n62R83m45j26M98j18n6
$$ -29 -124 -475 47 -969 -164 -116 33 -298 527 143 310 -271 706 -34 -596 387 -58 -184 314 196 140
6093A40m76N28l31j59L76N46p29L78k28K63l16q0J85k31J11l31O73p40K21L75
$$ 140 -336 192 -139 -298 78 624 -105 273 45 308 -8 -88 97 -134 -23 -354 319 -421 -200 175
6113A75k82M98l94j75N97l32l40k80K65L4J80M5j36Q6m99M01r3j39M60o21R0L59
$$ 175 -107 391 -3 -178 419 87 -253 -533 -268 -234 -54 -9 -145 -59 -558 -157 -250 -389 71 -550 -460 -101
6135a01l34o6Q37o14J68j72P90j006K38k68K67K49m0J31J46M47j301J056j710
$$ -101 -435 -501 336 -278 -110 -282 508 -498 -260 -528 -261 -12 -52 79 225 672 -629 427 -1283
6154a283J163M90o55O74l02k56Q81q07R4N58n99K7n00k59O63K39Kl17p19J284
$$ -1283 -120 370 -285 389 87 -169 712 -95 -1 557 -42 -15 -515 -774 -111 128 130 -187 -906 378
6174C78K13o77L36r9M83k90M09r83N89m15K77k69n90k07J339j212M33j87k05j88
$$ 378 591 -86 250 151 634 344 753 -230 359 -56 221 -48 -638 -845 494 -718 -285 -472 -677 -865
6194h65Q8R22K29p25O08K46j620J509pl74m98K59M02k54n06J74J070m49N84n86
$$ -865 -777 145 374 -351 257 503 -1117 392 385 11 -487 -228 174 -80 -586 -412 658 209 793 207
6214B07M44p50n45R25n07J08Q9o15O37n12J91j05K12l16M78P6p00J030J17l02
$$ 207 651 -99 -644 281 -226 -118 -29 -644 -7 -519 -328 -433 -221 -537 -59 17 -683 347 464 162
6234A62k82K27L33p50J532j249L1l17L54k49j26Q1N35l12n42N91l97L35o81j98
$$ 162 -120 107 440 -310 1222 -27 4 -313 41 -208 -334 -253 282 -30 -572 19 -378 -43 -724 -922
6254i22J129K1q43L82R4K96k81r2k51K80k0Q96j038Q2L83q79J105K82j150Q18
$$ -922 207 228 -615 -233 -139 157 -124 -216 -467 -187 -207 689 -349 -267 116 -763 342 624 -526 292
6274B92k1r39P1K34M85l51O13J93o36k41O56k30k19l0m03K95M93k62J18q24O56
$$ 292 271 -668 -597 -363 122 -229 384 577 -59 -300 356 126 -93 -123 -526 -231 262 0 118 -706 -50
6295e0L90p39Q72n60O75r95J034l56l20N89j66q7j162K93Q73j101j43J022M80
$$ -50 340 -399 473 -87 588 -407 627 271 -49 540 374 287 -875 -582 291 -810 -953 69 549
6314E49j017P43pr37M13K63J2l34L74r17k98Q85J25k01L15n25M51m90M97p82J349
$$ 549 -468 275 268 -669 -256 7 19 -315 59 -858 -1156 -271 -146 -347 -32 -557 -106 -596 -99 -881 468
6335D68j125P80l66q1J48K88j12k38o4P07q99L46k10J73M51q0p4j30M20n08N14
$$ 468 -657 123 -243 -324 -176 112 0 -238 -302 405 -494 -148 -358 -185 266 186 112 -18 402 -106 408
6356D08j082L63l78R61j88o17J04m97J394m75J45N55m24q38J199p47l33n64N80
$$ 408 -674 -311 -689 272 84 -533 -429 -926 468 -7 138 693 269 -569 630 -117 -450 -1014 -434
6375d34p13L57O42o8J09J2P57j152N81l92O1p3p7m8j20M64J45m0o08J93N60j77
$$ -434 -1147 -790 -148 -216 -107 -95 662 -490 91 -301 -240 -313 -390 -438 -558 -94 51 11 -597 -404 156 -21
6397b1O70m23K01l69q23J79O71j086J444j174P44L08k66N09q84N29n49N88j248
$$ -21 649 226 427 58 -765 -586 85 -1001 443 -731 13 321 55 564 -320 209 -340 248 -1000
6416a000O97P08P0q79M03j80L58p32m00P41O74k27j014O99QoM01K01M51j043J08
$$ -1000 -303 405 475 -404 -1 -181 177 -555 -955 -214 460 233 -781 -82 -74 -80 321 522 973 -70 38
6437C8l54J15L73o28L0k54M98Q13m12k30M1O72o39j52Q8k85J68L76j05O50p75
$$ 38 -316 -201 172 -456 -426 -680 -182 631 219 -11 30 702 63 -89 -1 -286 -118 258 153 803 28
6458B8P6J35l39p31N26L55J5l22N77j22J56q64O14o82M8l92J099N15j48q44l60
$$ 28 104 239 -100 -831 -305 50 65 -257 320 198 354 -510 104 -578 -530 -922 177 692 544 -300 -660
6479f60Q19p7q64J558j329N08j07M5o27q25J556K44l16P8j95k39m79M61m73J423
$$ -660 159 82 -782 776 -553 -45 -152 -107 -734 -1559 -3 241 -75 3 -192 -431 -910 -449 -922 501
6499E01j049J98K98l17J11Q84l55l15K82L93o19m57M59p21J282l74K97j143Q74
$$ 501 -548 -350 -52 -369 -258 626 271 -44 238 631 12 -445 14 -707 575 201 498 -645 229
6518B29K64k84Kk99m16m39L76J078r19J105n22p99K87P18l9k85m53O14L05Ro61
$$ 229 493 209 211 -88 -504 -943 -567 511 -408 697 175 -624 -337 381 342 57 -396 218 523 532 -129
6539a29M58q24N56O10j018n5m97L38K56J85n84O06M12K67n05L3m09n91J33P93
$$ -129 329 -495 61 671 -347 -402 -899 -561 -305 -120 -704 -98 314 581 76 109 -300 -891 -758 35
6559C5r07J106m3J75m87J82M31n53M3n67J11R91J35j460K07L20M28j36o92J010
$$ 35 -872 234 191 366 -121 61 492 -61 -18 -585 -474 517 652 -808 -601 -281 147 11 -681 329
6579C29o68K93O76j051N78k58r5O56M30l83p64j46j15N27R06j267l75P95m52K38
$$ 329 -339 -46 630 -421 157 -101 -196 460 890 507 -257 -403 -518 9 915 -352 -727 68 -384 -146
6599a46Nk74LL65p8N31k72r52N59J36J03M41l66j20M46O1q13N45j58m85J017j5
$$ -146 -141 -415 -412 -47 -125 406 134 -818 -259 -123 -20 421 55 -65 381 442 -371 174 16 -469 548 533
6621E33n7j190O77pk7k55J14j22RM18r2M2o98M40k85O16P5J71j92k95L20m6L53
$$ 533 476 -714 -37 -44 -71 -326 -212 -334 -325 93 1 43 -655 -215 -500 116 191 362 170 -125 195 149 502
6644E02p01K7R77j030j97P73l54O3%N1j50P4j06K07P4k79N9K84m35O37l69q31
$$ 502 -199 -172 805 -225 -422 351 -3 60 60 111 -39 35 -71 136 210 -69 -10 274 -161 476 107 -724
6666g24M33k14q2M32M09j14n11Q7R81j024R10q18m1l99N74j13O67r95k17J216
$$ -724 -291 -505 -587 -155 254 140 -371 -284 697 -327 583 -235 -276 -675 -101 -214 453 -542 -759 457
6686D57q53P56m48P7K04o09R43p77K02K81n34p30N29J281j136P01m97J52l23J71
$$ 457 -396 360 -88 -11 193 -416 527 -250 -48 233 -301 -1031 -502 779 -357 344 -153 -1 -324 -153
6706a53o34K77O08k43j31M50q9N16j012Q0N77L69k4r29K59J08j91P06j77n99O78
$$ -153 -787 -510 98 -145 -276 174 85 601 -411 -331 246 615 591 -338 -79 29 -162 544 367 -232 446
6727D46M2p78k87P47L4M47j154P08L0l12n86R13J64k94P10j501L82p0R18j294
$$ 446 488 -290 -577 170 204 651 -503 205 235 -77 -663 250 414 120 830 -671 -289 -359 559 -735
6747g35J308p3J00m34M06p82k75O37o45K30r17J214J90j45q0j11N43n26j53k03
$$ -735 573 500 600 166 572 -210 -485 152 -493 -263 -1180 34 224 79 -1 -112 431 -95 -248 -451
6767d51K0O28k5k17J72j12r3l1J44N82n16j83l52m98J339K74p29p45J113m4O48
$$ -451 -431 197 172 -45 127 15 -78 -109 35 617 101 -82 -434 -932 407 681 -48 -793 320 276 924
6788I24o29R30j00j246l45j97P96j178Q56n10N46n05j96J389j016P23j062K68
$$ 924 295 1225 1125 -121 -466 -663 133 -1045 -189 -699 -153 -658 -854 535 -481 242 -820 -552
6806e52N52m35L87o16Q30m48R12r66n61Q27L48j45O89j665J142R9o64n87L27n70
$$ -552 0 -435 -48 -664 166 -282 630 -336 -897 -70 278 133 822 -843 299 398 -266 -853 -526 -1096
6826a096J581j018o99J676l22j344M64L33J427j811N25J43k86n58J039j59k70
$$ -1096 485 -533 -1232 444 122 -1222 -758 -425 1002 -809 -284 -141 -427 -985 54 -105 -375
6843c75L40M9p25j3Q92K3j125q18J922k98K60K79n14m0ojl30M50j15R37m08p51
$$ -375 -35 14 -711 -724 168 191 -934 -1752 170 -128 132 411 -103 -143 -149 -150 -480 -30 -145 792 384 -367
6865c67M34k86N91J81p88O52q14P66m6o11M99N87o31j56O20o29k6o05J242m76
$$ -367 67 -219 372 553 -235 417 -397 369 323 -288 211 798 167 11 631 2 -24 -629 613 137
6885A37R92j652N53l81N57j17M80j193j76P18Q28o62m2o22M97L5L46p50J15J142
$$ 137 1129 -523 30 -351 206 89 569 -624 -800 -82 746 84 42 -580 -83 -48 298 -452 -337 805
6905H05q23M21j152R56k6j83m3k2l52Q47l07l61p95J308J84n09k40R08j149J606
$$ 805 -18 403 -749 207 181 -2 -45 -67 -419 428 121 -240 -1035 273 457 -52 -292 616 -533 1073
6925A073j349K84L81o56J262k24o44j086J803q66l32n4J592j326J393p84q08J305
$$ 1073 -276 8 389 -267 995 771 127 -959 844 -22 -354 -408 1184 -142 1251 467 -341 964
6943I64j110j16l4k43m28J195o85P87j02K65l26m86J69Q08j92j70k90n84J20M50
$$ 964 -146 -262 -296 -539 -967 228 -457 330 228 493 167 -319 -150 658 466 296 6 -578 -458 -8
6963hO08o71J43L52p75Q07L01j193R25m86k94L33m14J83J82P00p46k88O7Nk95
$$ -8 600 -71 72 424 -351 456 757 -436 489 3 -291 42 -372 -189 -7 693 -53 -341 -274 -269 -564
6984e64N52m29O23m88O74n57K10k1M5j33p95N45r3M60q33N22j5j53J55L83J80
$$ -564 -12 -441 182 -306 368 -189 21 0 45 -88 -883 -338 -431 29 -804 -282 -297 -450 -295 88 268
7005B68M2N21r60n17P02j49n8M70K32L7j115J11O41k00k45P64j26R2j233P09M80
$$ 268 310 831 -129 -646 56 -93 -151 319 551 588 -527 -416 225 25 -220 544 418 510 -723 -14 466
7026D66j49J0l5K01j340P19N15o15J71R96j201Q70n49K42j246R14l74P80k10N1
$$ 466 317 327 292 493 -847 -128 387 -228 -57 939 -262 608 59 301 -945 -31 -405 375 165 216
7046B16J03r43M13N85j185J222n59o02R51O72n90j46l91N68O30m79r30K64L12
$$ 216 319 -624 -211 374 -811 411 -148 -750 201 873 283 137 -254 314 944 465 -465 -201 111
7065A11m7Q9k18l93L24r98L27J55O67K05p76N58J32n4Q05n71r5p56L30k31K00
$$ 111 64 153 -65 -458 -134 -1132 -805 -650 17 222 -554 4 136 82 887 316 221 -535 -205 -436 -236
7086b36m11l31Q52k60l67J588o46l65m70P73O74j295o44J422k58n00M82q63Q32
$$ -236 -647 -978 -126 -386 -753 835 189 -176 -646 127 801 -494 -1138 284 26 -474 8 -855 -23
7105b3k33l03L68N85j77j247O89m91K54O24J9J53rl55m15Q64k16m39K87J74K20
$$ -23 -256 -559 -191 394 217 -1030 -341 -832 -578 46 65 218 209 -146 -561 303 87 -352 -65 109 329
7126C29l68N93o47n85J623j573N31J50j118M47M61j93R72j367N53k4N21l78J40
$$ 329 -39 554 -93 -678 945 -628 -97 53 -1065 -618 -157 -350 622 -745 -192 -216 305 -73 67
7145F7j62J83o1l08M70m21L8k71N34j88L31j297J020M67o05J62L06p64M28k71
$$ 67 -95 88 27 -281 189 -232 -194 -465 69 -119 212 -1085 -65 402 -203 -41 265 -499 -71 -342
7165c42K57J7nK3O04l72rJ6m9L36m51N3k18M31j56j4j81j7O71j702J502j062J084
$$ -342 -85 -68 -73 -50 554 182 173 189 140 476 25 78 -140 291 135 121 -60 -77 594 -1108 394 -668 416
7188D16n27j44L25K05p5m46n07N29K34l19O27K17p68L32K35l60J47L89r11P50
$$ 416 -111 -255 70 275 200 -246 -753 -224 10 -309 318 535 -233 99 334 -26 121 510 -401 349
7208C49L39p99l70O78l13J85o60J099p86P65j239P57M89m48r04J161j49M4l23
$$ 349 688 -111 -481 197 -116 69 -591 508 -278 487 -752 5 494 46 -858 303 154 198 -125
7227a25j40Q0K93m3L19L44j253M63j51J052j119O09o15J87M55l58j05l09K81N01
$$ -125 -265 -185 108 65 384 728 -525 -62 -213 839 -280 329 -286 -99 356 -2 -107 -416 -135 366
7247C66p11J055p14M37m42l96k18j18Q96l11K28j36J04j01M5m79L73N5L6M96K60
$$ 366 -345 710 -4 433 -9 -405 -623 -741 155 -156 72 -64 40 -61 -16 -495 -122 -67 -31 465 725
7268G25j230M19L8k08j43O62K8n1m65N2m01O10l43L72m12N13M5l15J91k86M37
$$ 725 -505 -86 -48 -256 -399 263 291 240 -225 -173 -574 36 -307 65 -347 166 211 -104 87 -199 238
7289B38l51k37Q01j028P89l48j97Q66r56j9M5P36o21K07m61Q36J3p02J99l09J92
$$ 238 -113 -350 451 -577 212 -136 -333 533 -423 -442 -397 339 -282 -75 -536 300 313 -389 -190 -499 -307
7310c07N81l24L01j12q73L45L93o14N19K98L63m94k89M40q04L19N88l56O28o36
$$ -307 274 -50 251 139 -734 -389 4 -610 -91 207 570 76 -213 227 -577 -258 330 -26 602 -34
7330c4k70j20N18K82n68J262j691K61k05M25l93J206j08k37L5q79M32K72k33o50
$$ -34 -304 -424 94 376 -192 1070 -621 -360 -565 -140 -533 673 565 328 363 -516 -84 188 -45 -695
7350f95K20P33q7j10j16l73R17p08K16l97M35P6J82l36p57L62L41j47l12N04m4
$$ -695 -475 258 171 61 -55 -428 489 -219 -3 -400 35 111 293 -43 -800 -438 -97 -244 -556 -52 -96
7371i6o62P24L30l75K11p1kJ284q51o16m88o3O38l11L15L66o38L48O25j135r8
$$ -96 -758 -34 296 -79 132 61 59 1343 492 -124 -612 -675 -37 -348 -33 333 -305 43 668 -467 -565
7392e65L26O18p00n50J307m18P23q79J08j45J118j036J10Q27o44M23j34l11r10
$$ -565 -239 379 -321 -871 436 18 741 -138 -30 -175 943 -93 17 844 200 623 489 178 -732
7411g32R31q39Q56r74J252l96n86J013n80k46L17p49O96J42j183L14Q67n54q83
$$ -732 199 -640 216 -758 494 98 -488 525 -55 -301 16 -733 -37 105 -1078 -764 103 -451 -1334
7430a334K601m16j369L99Jo27J5O6J175J83o59j041L86O35J12r28K01NQ26k40
$$ -1334 1267 851 -518 -119 -118 -745 -730 -664 511 694 35 -1006 -620 15 127 -801 -600 -595 231 -9
7450iJ64p1k59M51j43n02J9L12o23N20J08j87N08M00J61m15J86j137N15L00q45
$$ -9 155 84 -175 276 133 -369 -350 -38 -661 -141 -33 -220 288 688 849 434 620 -517 -2 298 -547
7471e47J362k47l50Q6k237J340J257k04m41l3M88p83J062o93l55Q1m99J113M02
$$ -547 815 568 218 304 -1933 -593 664 460 19 -14 474 -309 753 60 -295 -214 -713 400 802
7490H02o1j767J021m27K3Q87n45Jr65Q59J59k96L92K86j223J65J302r42L31O85
$$ 802 741 -1026 -5 -432 -409 478 -67 -66 -1031 -172 -13 -309 83 369 -854 -689 613 -329 2 687
7510F87K0j183j18J86L02O05r71L11N28k2k93j66K74k06K12l93J91l93N91L11
$$ 687 707 -476 -594 -408 -106 499 -472 -161 367 345 52 -114 160 -46 166 -227 -36 -429 162 473
7530D73j47R2r76J047N78j036R0j88n56M32l21P97l11l22P03j274L65n78L73M91
$$ 473 326 418 -558 489 1067 31 121 -67 -623 -191 -512 285 -26 -348 355 -919 -554 -1132 -759 -268
7550b68l7j046J969j067k4R32o34M69j13J02L91m76k79k07J008p97L05k58N3k30
$$ -268 -305 -1351 618 -449 -473 459 -175 294 181 283 674 198 -81 -288 720 -77 228 -30 23 -207
7570b07o73P34L66m52m04P85m17L91N38p58N64j44k19L71r14J462j161J42J60
$$ -207 -880 -146 220 -232 -636 149 -268 123 661 -97 467 323 104 475 -439 1023 -138 4 164
7589A64o99Q17L54j298R85j97O56q51j96N41q51l3L21J39Q19p35J025j185L15
$$ 164 -535 282 636 -662 323 126 782 -69 -265 276 -575 -608 -287 -148 671 -64 961 -224 91
7608I1P42o40o06l49Q36J66k16o3l97M09N07n1k69J10J7m81l8L00M33n73L58p37
$$ 91 833 193 -413 -762 74 240 24 -39 -436 -27 480 429 160 270 287 -194 -232 68 501 -72 286 -451
7630d51Q15o02J00j19J76P36m64L00p78M35J24p02J25J0O53m57k74N37j3L17j07
$$ -451 364 -238 -138 -257 -81 655 191 491 -287 148 272 -430 -305 -295 358 -99 -373 164 151 468 361
7651C61o29L47m41N3Q66p01L03k65L48k37q00K87J305n44j46j76j31J21J36K97
$$ 361 -268 79 -362 -309 557 -144 159 -106 242 5 -795 -508 797 253 107 -69 -200 -79 57 354
7671C54j44n05M09R6r00N94N08p4o41M19l25Q82p47m9M99Pm45n7l24P70l24P1
$$ 354 210 -295 114 210 -690 -96 412 338 -303 116 -209 673 -74 -123 376 383 -62 -119 -443 327 3 74
7693G4J6K59l98Rm54M83k36j66K62R3J39J02j68m02j15K13P79q95O00j11J78j90
$$ 74 90 349 -49 -40 -494 -11 -247 -413 -151 -58 81 183 15 -387 -502 -289 490 -405 195 84 262 72
7715G2J74n77M23l36M26k18O3K17o02O28m93l58R38J93k82n8o37J82o5P51l38
$$ 72 246 -331 92 -244 182 -36 27 244 -358 270 -223 -581 357 550 268 210 -427 -245 -310 441 103
7736A03n61m7L51J26N07n39J2L8J21K18M7j73l1k24J90k74L27m8K1m92O32o0J81
$$ 103 -458 -505 -154 -28 479 -60 -48 -10 111 329 376 203 172 -52 138 -136 191 143 164 -328 304 244 425
7759D25m00K65l62k40M55n26N67k48p6N8j42j3K46M7l3o40O80M59j041K68K90
$$ 425 25 290 -72 -312 143 -383 184 -64 -140 -82 -224 -237 9 56 23 -617 63 522 -519 -251 39
7780C9n7q8L06j05j91j4K16m31l1l1J34l76M59L42K25o94L39k16j02J46J2M20
$$ 39 -18 -106 200 95 -96 -110 106 -325 -356 -387 -253 -629 -170 172 397 -297 42 -174 -276 -130 -118 302
7802C02Q1o11o1J4O93j077K66P41l93o98J355j115O27l09k82N62K51l29K32m78
$$ 302 383 -228 -289 -275 418 -659 -393 348 -45 -743 612 -503 124 -185 -467 95 346 17 249 -229
7822b29L71l9k50J73%l88K13J14O10l65j22j24m37r5P45Oj59j14K26J32k79q2
$$ -229 142 103 -147 26 26 -362 -149 -35 575 210 88 -36 -473 -568 177 183 24 -90 136 268 -11 -93
7844i3j79K94j03j32J12K77k96j10K82k46j89O5j00K35K82n68L78p1J81M59j023
$$ -93 -272 22 -81 -213 -101 176 -120 -230 52 -194 -383 -318 -418 -183 99 -469 -91 -162 19 478 -545
7865e45L11j69q8K55L27M91o59J90m38j2n5M54j22K51M47p21k3J12k93K91J71
$$ -545 -234 -403 -491 -236 91 582 -77 113 -325 -337 -392 62 -60 191 638 -83 -106 6 -287 4 175
7886A75m29j44K86M63j41j32p3J45L1k02m37M84j12j16J22p6j41Q19q24L20k37
$$ 175 -254 -398 -112 351 210 78 5 150 181 -21 -458 26 -86 -202 -80 -156 -297 522 -302 18 -219
7907b19j80N87k90J15k37L53J13o4k43K37j45M28n79J30n4JL46K40k62Jl0j99
$$ -219 -399 188 -102 13 -224 129 242 178 -65 172 27 455 -124 6 -48 -47 299 539 277 278 248 49
7929D9N21m22m66L43r9M67l93J05k97K43p1k00L88k8r8n3r5q4J21J05K99p17N00
$$ 49 570 148 -318 25 -74 393 0 105 -192 51 -20 -220 168 140 42 -11 -106 -190 -69 36 335 -382 118
7952A18n58Q28m28l72Q10j78j05m45K81q8r4j46O46o61l7K29R1k71Q7K04K3R8
$$ 118 -440 388 -40 -412 398 220 115 -330 -49 -137 -231 -377 269 -392 -429 -200 -109 -380 -293 -89 -66 32
7974C2M7p62O73J35l00l74P41M0p80M53K62l04l4K33l0k00J84Q2n49M15Q8j4J8
$$ 32 79 -683 -10 125 -175 -549 192 232 -548 -95 167 -137 -171 62 32 -168 16 98 -451 -36 52 38 56
7997E6j73N6L31k14J4J86q75N50R74j125l3P55o45J41J71MP9j65N46j45o41M29
$$ 56 -117 -61 270 56 70 256 -619 -69 905 -220 -253 502 -143 -2 169 173 252 87 633 488 -153 276
8019B76l68L61l02J49n27Q3L09q4O50q32L56M54p69k16N91k91M08k32k43m48N95
$$ 276 -92 269 -33 116 -411 -328 -19 -103 547 -285 71 525 -244 -460 131 -160 248 16 -227 -675 -80
8040h0O44m36rJ85m71J46j40P2M52l82k06j2J22n16Q78j1j34k36M48m29N4K31
$$ -80 564 128 119 304 -167 -21 -161 -89 363 -19 -225 -237 -115 -631 247 236 102 -134 314 -115 -61 170
8062A70l23k96L01J62m79L63K56n15M83o32O15p76L19N6k37N35j63l95O9LN81
$$ 170 -153 -449 -148 14 -465 -102 154 -361 122 -510 105 -671 -352 -296 -533 2 -161 -556 -487 -484 97
8083I7m31M65J47j26No68L67K00N57o97o5j65L44J84k9l01K76j92L8L49q07p4
$$ 97 -334 131 278 152 157 -511 -144 56 613 -84 -149 -314 30 214 185 -116 160 -32 6 355 -452 -526
8105e26P36l49l6k84M08m9l8J48R44r05N91p17N20o27J01P3R0nj82M84l98J71
$$ -526 210 -139 -175 -459 -51 -100 -138 10 954 49 640 -77 443 -184 -83 -10 80 75 -107 377 -21 150
8127A50q4L91n46j70M4p1M19m05n15J005j49j7n83K73J85O18n1o06q0Q3j43N47
$$ 150 66 457 -89 -259 -215 -286 133 -272 -787 218 69 52 -531 -258 -73 545 494 -112 -192 -109 -252 295
8149B95J09l30M3p07M19m07j45R90o47K38l59L41l42J52L36k36J7k03K83l7L92
$$ 295 404 74 117 -590 -171 -578 -723 267 -380 -142 -501 -160 -502 -350 -14 -250 -233 -436 -153 -190 202
8170B02j24j09R3k7K3Q5o51O01J1O1p12N81J55j89l59L91K9N1k7L46n6
$$ 202 78 -31 62 35 58 143 -508 93 104 165 -547 34 189 0 -359 32 61 112 85 431 375
8191C75
$$ Imaginary data points
##PAGE= N=2
##DATA TABLE= (X++(I..I)), XYDATA
0@%%%%%%%Qj6J6j6K4l2M0n6P2q8J04j28J60j92K29k75L28l88M54n28O12p09Q19
$$ 0 0 0 0 0 0 0 0 8 -8 8 -8 16 -16 24 -32 40 -48 56 -72 88 -104 125 -150 178 -210 244 -284 328 -381 438
30D38r39J073j220J383j566J771j995K237k506K802l128L482l866M287m747N250
$$ 438 -501 572 -648 735 -831 940 -1055 1182 -1324 1478 -1650 1832 -2034 2253 -2494 2756
46B756n798O399p053P770q561R432j0393J1457j2643J3974j5477J7183j9147K1432
$$ 2756 -3042 3357 -3696 4074 -4487 4945 -5448 6009 -6634 7340 -8137 9046 -10101 11331
60A1331k4130K7379l1375L6427m3049N2165o5602Q7615j31762L66629q60865p8521
$$ 11331 -12799 14580 -16795 19632 -23417 28748 -36854 50761 -81001 285628 -575237 -653758
72f53758J334535m92875m96170K93788n585q0814K98618l76751n2771O34818k54619
$$ -653758 680777 187902 -308268 -14480 -20065 -100879 197739 -179012 -231783 403035 148416
83A48416o42441N69045L08121m91272O2040J52491l66177K21604L01307m23417
$$ 148416 -494025 75020 383141 -108131 -46091 106400 -259777 -38173 263134 -160283
93a60283j04055L17322j84336K7249K81673l82556p1556O35745l13195n72175
$$ -160283 -264338 52984 -131352 -104103 177570 -204986 -276542 359203 46008 -526167
103e26167O62669L42446p29264r1880M37379o1893P516O280m48409J82513O18967
$$ -526167 136502 478948 -250316 -342196 95183 33290 40806 47086 -401323 -218810 400157
114D00157m17656m48676N86372J19708n19241K18410L38507l27780p4023K66245
$$ 400157 -17499 -466175 120197 239905 -279336 -60926 277581 -50199 -124222 142023
124A42023j29887j32228J82368K4254r3836p2057j04046K34789K63237l87212
$$ 142023 12136 -120092 62276 86530 -7306 -79363 -183409 51380 314617 -72595
134g2595k67548M59310J97832l55162n8950K02100j241k2453n5988j21562K11795
$$ -72595 -340143 119167 316999 -38163 -97113 104987 103746 81293 25305 -96257 115538
145A15538J53039m13291j21493M88249L9431m19374L3319K55996o2825m8516P6294
$$ 115538 268577 -144714 -266207 222042 261473 -157901 -124582 131414 68589 20073 96367
156I6367q8078j9642J33357p2833q5627J25236k4427j40522P6691N6886j20789
$$ 96367 8289 -11353 122004 49171 -36456 88780 64353 -76169 522 57408 -63381
167f3381M9952J29495j73182j27294K53184J27894k28663j29334J42511J58650
$$ -63381 -13429 116066 -57116 -184410 68774 196668 -31995 -161329 -18818 139832
177A39832n7599k06337L568K26454k5136k65313N2815K54156r5053k00379Q0803
$$ 139832 82233 -124104 -120536 105918 80782 -184531 -131716 122440 27387 -172992 -92189
188i2189J01816J3390R8j19600k7282K02037j297k08348P8661J41261j71889l3016
$$ -92189 9627 23017 23115 -96485 -123767 78270 76973 -131375 -52714 88547 -83342 -116358
200a16358J97470r9176j41225J75281K7837j67040P0795J21569p1113m5104J3135
$$ -116358 81112 -18064 -159289 15992 43829 -123211 -52416 69153 -1960 -47064 -33929
211c3929J0036J09671n068k14627N5610K49930j29813k03108J60358J15750j28404
$$ -33929 -23893 85778 80710 -133917 -78307 171623 41810 -161298 -940 114810 -13594
222a3594o0591O3308P7770J7027j23701m7602K03660L5778k40767M4553K14119
$$ -13594 -74185 -10877 66893 83920 -39781 -87383 116277 152055 -88712 -44159 169960
233A69960j31740j29812J59054L1169j26249J0505M8028Q04K5115n4690n4789
$$ 169960 38220 -91592 67462 98631 -27618 -17113 30915 31719 56834 2144 -52645
244e2645J36532K8358j88693N2872J89697j27630j43981J41225Q1497j15327n9446
$$ -52645 83887 112245 -76448 -23576 166121 38491 -105490 35735 117232 1905 -57541
255e7541N3665N1035j3526p9971m837J17135k3127j35833P5663J15169j07212
$$ -57541 -3876 47159 33633 -46338 -51175 65960 42833 -93000 -17337 97832 -9380
266i380o9150R5556K8291o8703k2579K9896K7599j7772o6229J9209J03133n6083
$$ -9380 -78530 17026 45317 -23386 -45965 -16069 11530 -6242 -72471 -53262 49871 -6212
278f212j20454J03364J04216j23020o7171J20109M3909j00914l3083P8168L2922
$$ -6212 -126666 -23302 80914 -42106 -109277 10832 54741 -46173 -79256 -1088 31834
289C1834n8697n3659M6620P5358n6225q3109P3961P6346p1186n8727P1568O0567
$$ 31834 -26863 -80522 -33902 41456 -14769 -97878 -23917 52429 -18757 -77484 -5916 54651
301E4651o2382n3690O3261N5752n6079o1314N9153O7096p2246n9006Q2732M5208
$$ 54651 -7731 -61421 1840 57592 1513 -59801 -648 66448 -5798 -64804 17928 63136
313F3136p6011l1509P2893L5195o3635k7460O1207L1487m8693m0007M9207M8880
$$ 63136 -12875 -44384 28509 63704 69 -27391 33816 65303 16610 -23397 25810 74690
325G4690n9779m9972O3716M4375o5524m5655O8937M5328p4235l5474P4071L0937
$$ 74690 14911 -35061 28655 73030 7506 -38149 30788 76116 1881 -33593 40478 71415
337G1415o7272l2369O5863L0639p0210k9682O1284K3566n9359l3989N5619L3212
$$ 71415 4143 -28226 37637 68276 -1934 -31616 29668 53234 -6125 -40114 15505 48717
349D8717o1206l2897N7001L3645n5503m0575O0175L8991o7862l5216O3448K8855
$$ 48717 -12489 -45386 11615 45260 -10243 -50818 9357 48348 -19514 -54730 8718 37573
361C7573o6052l3045O4963K3765o7519j9013N7361J9399n1795k3903N4157K4827
$$ 37573 -28479 -61524 3439 27204 -40315 -59328 -1967 17432 -34363 -58266 -4109 20718
373B0718n2963k3585N1073K8337n3384l1600N9500K5310o1102j9050N5917K0865
$$ 20718 -32245 -55830 -4757 23580 -29804 -61404 -1904 23406 -37696 -56746 -829 20036
385B0036n2735k0306N7716K1905n3690j7435N5340K4752n7059k0007O5069J0801
$$ 20036 -32699 -53005 4711 26616 -27074 -44509 10831 35583 -21476 -41483 23586 34387
397C4387n9167k396N0743O053m4248r544M4938J7536m0803k3544N0200L3080o2272
$$ 34387 -24780 -27176 23567 29620 -14628 -24172 20766 38302 -2501 -26045 24155 57235 -5037
410e037k2938P6104O955p1904N919N8912o010m7180j954L5995J4121l2372l1025
$$ -5037 -27975 48129 55084 -16820 -10901 48011 42001 -5179 -7133 28862 42983 10611 -20414
423b0414M4118L8316o6073k5213P8366J567o9746J1603M6801j4540k7337K156
$$ -20414 23704 62020 -4053 -29266 49100 50667 -19079 -7476 39325 24785 -2552 -396
435c96R696J4078j6561l7321M1820L7217p8086j5464R0253j8659p6073L7977M3984
$$ -396 9300 23378 6817 -30504 11316 48533 -29553 -45017 45236 26577 -49496 -11519 32465
448C2465m0801j8437J8939M240J3628k3590m8349O1851N0180j00092k2283J05001
$$ 32465 -8336 -26773 -7834 -3594 10034 -13556 -61905 -54 50126 -49966 -72249 32752
460C2752j6046p9174L9347M1016l6270p903P107l517L7138j6006o6606N5524N5567
$$ 32752 16706 -62468 -23121 17895 -18375 -26278 -19171 -22688 14450 -1556 -68162 -12638 42929
473D2929q5526q297Q5212l9386n5862O5641K1879n2077Q828J3610j1222L8078
$$ 42929 -42597 -50894 34318 -5068 -60930 4711 26590 -25487 -16659 -3049 -14271 23807
485B3807j5230n8143O3312L7387r5953J2987R9095n0270p0615N9112L2185l0930
$$ 23807 8577 -49566 13746 51133 -44820 -31833 67262 16992 -53623 5489 37674 6744
497F744O593j4154j4157N7110j0302o2752N5352L1911q2536J2700P7642m3399
$$ 6744 13337 -817 -14974 42136 31834 -30918 24434 56345 -26191 -13491 64151 20752
509B0752m4785N0174R19l6923L0376J1009k6475R963j5434q957O4683j2438r2956
$$ 20752 -24033 26141 27060 -9863 20513 31522 5047 15010 -424 -9381 55302 42864 -50092
522e0092L4907Q5537n2623o0090N5716K5173m8001q603J9326J6223J0742m6852
$$ -50092 -15185 70352 17729 -42361 13355 38528 -9473 -18076 1250 17473 28215 -18637
534a8637l2588O8765L4109p1803k3930N3911m45l3237K3045R271l3974M260J7190
$$ -18637 -51225 17540 51649 -20154 -44084 9827 9382 -23855 -810 8461 -25513 -21253 -4063
547d063o980P232j234k3010Q841J8403j9280L593L7341l7647n4526O6954N6908
$$ -4063 -11043 -3811 -5045 -28055 -19214 -811 -20091 -16498 20843 -16804 -71330 -4376 52532
560E2532p1118m2121M7961K3307j3854j0786j1733J8006K6525m5038k1842Q4177
$$ 52532 -18586 -60707 -12746 10561 -3293 -14079 -25812 -7806 18719 -26319 -48161 36016
572C6016N781r8087J7984P3784k5787j6011J9743l7081k75O4301k1123m6665M0875
$$ 36016 41797 -56290 -38306 35478 9691 -6320 13423 -23658 -23933 40368 19245 -27420 13455
585A3455j081l6622N2961N324o4257M5933L2151q3746K1628R3162n5846o5727
$$ 13455 12374 -24248 28713 34037 -30220 15713 47864 -35882 -14254 78908 23062 -42665
597d2665N1052J4194n271L4256o1595m4258J11035M879j13378N5109P0304r2664
$$ -42665 8387 22581 17310 51566 -10029 -54287 56748 61627 -51751 3358 73662 -19002
609a9002j4018P9591k7468k1110L2363n6172m426R8785m5624p7853P6816o17p1360
$$ -19002 -33020 46571 19103 -2007 30356 -25816 -30242 68543 22919 -54934 21882 21265 -50095
622e0095Q0077K6090j15127K7767Q5567o8762j7441O8521m9848k5684O4292m4347
$$ -50095 29982 56072 -59055 -31288 54279 -14483 -31924 36597 -13251 -38935 25357 -18990
634a8990j8953R5522n9018j00993J10657N8246j07797L007N1928m7021K1894M6384
$$ -18990 -37943 57579 -1439 -102432 8225 66471 -41326 -38319 13609 -33412 -11518 34866
646C4866p5574L695P9116p0959l3359J06902k5742q4050O1268J8743n6703N3450
$$ 34866 -40708 -37013 42103 -28856 -62215 44687 18945 -65105 -3837 14906 -41797 11653
658A1653K3800q7986J9105O9247m2576l318L2603n9139J2013Q0866n9323m8776
$$ 11653 35453 -52533 -33428 35819 -6757 -10075 22528 -36611 -24598 56268 -3055 -51831
670e1831Q9253n639q5611M9512N5790n0978q208J2221k6588M7790L1311q4062
$$ -51831 37422 31783 -53828 -4316 51474 496 -7712 4509 -22079 25711 57022 -27040
682b7040l083P9054l2468l9330N4318n478m7804L2652J6421l2905K4350R973m7032
$$ -27040 -30123 48931 16463 -22867 31451 25973 -21831 10821 27242 -5663 18687 28660 -18372
695a8372J7455L3941k9489M259J8630m2698O9N9889j7339n3127K3402K5463k0202
$$ -18372 -917 33024 3535 7794 26424 -16274 -16205 43684 26345 -26782 -3380 22083 1881
708A881R30K339r575J5580q481k8128L1264K9119m6254k5789M2147J4764k7411
$$ 1881 2811 5150 -4425 11155 2674 -25454 5810 34929 -11325 -37114 5033 19797 -7614
721g614k810N925p312P382M592q724K952j370j0732P823J2987r498j0673R835
$$ -7614 -10424 -4499 -11811 -4429 163 -8561 -5609 -6979 -17711 -9888 3099 -6399 -17072 -7237
735g237J303j2446J2031J4631j8852j6144J5906J7275o405j5326q10J0693P546
$$ -7237 -5934 -18380 -6349 8282 -10570 -26714 -10808 6467 62 -15264 -16074 -5381 2165
748B165p750r645J4909P899k3844J28K8634k878k2644M367J2636k174J259J162
$$ 2165 -5585 -15230 -321 7578 -16266 -16138 12496 9618 -13026 -8659 3977 1803 3062 4224
762D224q685N962N823j1041J0724J0920k4015j917K8684p006k0916J5410R915
$$ 4224 -4461 1501 7324 -3717 7007 17927 -6088 -8005 20679 13673 -7243 8167 18082
775A8082j8737J871J3762n569K43k171j2639J7009J4410k7506o110K6777m906
$$ 18082 -655 1216 14978 9409 9652 7481 -5158 11851 26261 -1245 -7355 19422 14516
788A4516j9380J2841P944j4421J439M084n065R346l128j7771J3400J1686k0825
$$ 14516 -4864 7977 15921 1500 2939 7023 1958 11304 8176 -9595 3805 15491 -5334
801e334L18J8644j3879j2896J8853K881j6848M006M372n626P168m117j1577J4589
$$ -5334 -5016 13628 -251 -13147 5706 8587 -8261 -4255 117 -5509 1659 -2458 -14035 554
815E54L833k1431N285K0537j3245j6292J4997P864j0831q05R72O29O729p805o548
$$ 554 4387 -17044 -11759 8778 -4467 -20759 -5762 2102 -8729 -9534 -8562 -7933 -1204 -9009 -15557
830a5557J5292K19j6449N608J4631q402r336R462L740n385Q57M06K219M257q452
$$ -15557 -265 -46 -16495 -10887 3744 -4658 -13994 -4532 -792 -6177 -5320 -4914 -2695 1562 -6890
845f890p71J3173k291j2512O323J2180q247q057J0066M861p363j540L980N206
$$ -6890 -7661 5512 3221 -9291 -2968 9212 965 -7092 2974 7835 472 -1068 2912 8118
859H118j235q590L622J0513m615r369N751R481o634q157P898O099o217n206L536
$$ 8118 6883 -1707 1915 12428 7813 -1556 4195 13676 7042 -1115 6783 12882 6665 1459 4995
874D995P261l576q980M851Q168n832p784N106P813p166p115P235M156o174m928
$$ 4995 12256 8680 -300 4551 12719 6887 -897 4209 12022 4856 -2259 4976 9132 2958 -1970
889a970L663N553m716p152N376M941n412o597M949O903p679o996Q186L586p367
$$ -1970 1693 7246 2530 -4622 754 5695 283 -6314 -1365 5538 -2141 -9137 -951 2635 -4732
904d732m481N950M954p176n458O535M581n965n963O080P025q269n475Q018L905
$$ -4732 -9213 -3263 1691 -5485 -10943 -4408 173 -5792 -11755 -5675 1350 -6919 -12394 -4376 -471
919d71o018m244N091N282n348m523N097M943l971o040O277O519p632l626Q427
$$ -471 -6489 -10733 -5642 -360 -5708 -10231 -5134 -191 -4162 -10202 -3925 2594 -5038 -8664 -237
934b37K344o242j540O755K201n946q90N567L111m470n169P900O026r374l351R731
$$ -237 2107 -4135 -5675 1080 3281 -2665 -3555 2012 5123 653 -4516 3384 9410 36 -3315 6416
950F416K605p848k173Q143J776o377j415M107M301l372o752N878O523q363l798
$$ 6416 9021 1173 -1000 7143 8919 2542 1127 5234 9535 6163 -589 5289 11812 3449 -349
965c49Q741J337q313K10O953k081n011J777Q57K295k056o878O203N958j0828m371
$$ -349 8392 9729 1416 1626 8579 6498 1487 3264 4121 6416 4360 -2518 3685 9643 -1185 -5556
981e556J2242O91j2610J285R266l871m332J132j559M674k23j0078N004R626j1046
$$ -5556 6686 7377 -5233 -3948 5318 1447 -2885 -1753 -3312 1362 1139 -8939 -3935 5691 -5355
996e355o253J2868O18j1874M703N648p925J960M316n731L183J510r136P531Q396
$$ -5355 -11608 1260 1878 -9996 -5293 355 -7570 -5610 -1294 -7025 -3842 -2332 -11468 -3937 4459
1011D459j4370l616J7659l689j5084J0947P950j1409J332L804l534Q651j811j5033
$$ 4459 -9911 -13527 4132 443 -14641 -3694 4256 -7153 -5821 -2017 -5551 3100 1289 -13744
1025a3744J0513J5045j5714p048J7562k739j1900J1473J699r814Q455K24r612
$$ -13744 -3231 11814 -3900 -10948 6614 3875 -8025 3448 5147 -4667 3788 4012 -5600
1038e600J1242L700j3881N995Q990j3360K908J6579j4429j1749J9263K858j3707
$$ -5600 5642 9342 -4539 1456 10446 -2914 -6 16573 2144 -9605 9658 12516 -1191
1051a191N971J50n054J0388l901j2277J4786O577k2553J698K3224j0045j4124
$$ -1191 4780 4930 -124 10264 6363 -5914 8872 15449 -7104 -5406 17818 7773 -6351
1064f351R851p0k326Q314p999p997J3134j738j1915J0609N103j6018K575J2705
$$ -6351 3500 3430 1104 9418 1419 -6578 6556 4818 -7097 3512 8615 -7403 -4828 7877
1078G877j0840k683J2555q918q197J0413J625l663J798p958k724J5414Q83j8516
$$ 7877 -2963 -5646 6909 -2009 -10206 207 1832 -1831 -33 -7991 -10715 4699 5582 -12934
1092a2934L933J3660q657o011Q760O28l555j855l018O017Q587r088j0314R034
$$ -12934 -9001 4659 -3998 -10009 -1249 -621 -4176 -6031 -9049 -3032 5555 -3533 -13847 -4813
1106d813Q388o287j742L298m728K62P236p29m390J41J957L75LJ285J252p18k808
$$ -4813 3575 -2712 -4454 -1156 -5884 -5622 1614 885 -3505 -3364 -1407 -1032 -1029 256 1508 790 -2018
1123b018k848O947Q846q720j1633P946J2443m797r241M066L487k090J060n68O12
$$ -2018 -4866 2081 10927 2207 -9426 -1480 10963 6166 -3075 991 4478 2388 3448 2880 3492
1138C492M373o765o189J2372O040j2746l529Q447k566O3Q186q496q909J1330K519
$$ 3492 7865 1100 -5089 7283 13323 577 -2952 5495 2929 2992 11178 2682 -6227 5103 7622
1153G622o447M211l178o998R897K126j2561P831R575j8711m193K1955k917j3957
$$ 7622 1175 5386 2208 -4790 5107 7233 -5328 2503 12078 -6633 -10826 11129 8212 -5745
1167e745L824j914J052J3044r596j4809J5559N382j8165P733J3660j6771l948
$$ -5745 -1921 -3835 -2783 10261 665 -14144 1415 6797 -11368 -3635 10025 -6746 -10694
1180a0694J3717p554o61J2792j3708r345J8416n74j1400J0937l817j4537J7485
$$ -10694 3023 -4531 -5192 7600 -6108 -15453 2963 2389 -9011 1926 -1891 -16428 1057
1193A057R912k3213K715J6867j3902k958J5441p858m555J0083j1268k177K3046
$$ 1057 10969 -12244 -9529 7338 -6564 -9522 5919 -1939 -6494 3589 -7679 -9856 13190
1206A3190p561k3990J6195J3664j6473L286Q939j4064L799J2486j2293J074J2845
$$ 13190 5629 -18361 -2166 11498 -4975 -1689 7250 -6814 -3015 9471 -2822 -1748 11097
1219A1097j4016o319J9820k990j4017J2612l28j4905J4383R210j7528O44Q925
$$ 11097 -2919 -9238 10582 7592 -6425 6187 5859 -9046 5337 14547 -2981 -2337 6588
1232F588p424M938P473j5012m79J6183r663r302J7189j393j7068Q138P977p035
$$ 6588 -836 4102 11575 -3437 -3916 12267 2604 -6698 10491 9098 -7970 168 8145 1110
1246A110L703j365j0768R406Q809j3259j308J0805q663m985J3336k936j0374P044
$$ 1110 4813 3448 -7320 2086 10895 -2364 -3672 7133 -1530 -6515 6821 3885 -6489 555
1260E55K44n567O817L63p732L463J900n962O126N514j2481k688J2216j309o740
$$ 555 799 -4768 2049 2412 -5320 -1857 43 -5919 207 5721 -6760 -9448 2768 1459 -5281
1275e281K858k65j912L505k357l53M818l392o720O522O531o581l866N077l15m77
$$ -5281 -2423 -2688 -4600 -1095 -3452 -3805 1013 -2379 -9099 -2577 3954 -2627 -6493 -1416 -1731 -2208
1291b208K178j537p15K22n60K072K784l579k489L519K464l190M66K695j686k240
$$ -2208 -30 -1567 -2282 -2060 -2620 -548 2236 -1343 -3832 -313 2151 -1039 -573 2122 436 -1804
1307a804R96M132J065n127k137N468K371l546j450K250J415k053p56K234K007
$$ -1804 -808 3324 4389 -738 -2875 2593 4964 1418 -32 2218 3633 1580 824 3058 5065
1322E065k846l660L907M050n030j294K957p85n39R77l91m5q74j179J753K366k761
$$ 5065 2219 -1441 2466 6516 1486 192 3149 2364 1825 2802 2411 2366 1492 313 2066 4432 1671
1339A671l654M532J059n043J698L176l438j405J532O81N05j357l178K317L751
$$ 1671 -1983 2549 3608 -1435 263 3439 1 -1404 128 809 1314 -43 -3221 -904 2847
1354B847l896l499N212M66n243J725L272k538j142rN57J940r13l057J277L702
$$ 2847 -1049 -4548 664 1130 -4113 -2388 884 -1654 -2796 -2805 -2248 -308 -1221 -4278 -3001 701
1370G01l832j632M927n56m580K306K169j504K0o65L11J897n59k662K643K377m008
$$ 701 -3131 -4763 164 -392 -4972 -2666 -497 -2001 -1981 -2646 -2335 -438 -997 -3659 -1016 1361 -2647
1387b647r39N338r08l792K197J571p49j69o46Q64J686j681j407L186J374l674
$$ -2647 -3586 1752 844 -2948 -751 820 71 -98 -744 120 1806 125 -1282 1904 3278 -396
1403c96n90M299p84k858J556J271Rj018n69J373R81j740j770L169J100l872p6
$$ -396 -986 3313 2529 -329 1227 2498 2507 1489 920 2293 3274 1534 -236 2933 4033 161 85
1420H5L644r67k364O23J451J06j759o63J920N44j886j204K348Q01k890o21K664
$$ 85 3729 2762 398 1021 2472 2578 819 156 2076 2620 734 -470 1878 2679 -211 -832 1832
1437A832q09k050M73J316j4j979j00J511L98k196o68K281L04k698R5K391m64k303
$$ 1832 1023 -1027 -554 762 748 -1231 -1331 180 578 -1618 -2286 -5 299 -2399 -2304 87 -377 -2680
1455b680N50J399j50j607K7J448K90j563q33K316O85k698J20K019j26j737L3K329
$$ -2680 -2130 -731 -881 -2488 -2461 -1013 -723 -2286 -3119 -803 -118 -2816 -2696 -677 -803 -2540 -2507 -178
1473a78k57j815M69J422N60j742k18J830P16k331J72K340j03j693M57J515l02
$$ -178 -435 -2250 -1781 -359 201 -1541 -1759 71 787 -1544 -1372 968 865 -828 -371 1144 842
1490H42j252N36J181L79j388o17K549M6k495N76K385q64j793N53K115q84j302
$$ 842 -410 126 1307 1686 298 -319 2230 2276 -219 357 2742 1878 85 638 2753 1869 567
1507E67R04M98M06j745k98K202K92k685M40J856K0k491M65J855q16j288K10Q62
$$ 567 1471 1969 2375 630 332 2534 2826 141 581 2437 2457 -34 431 2286 1470 182 392 1254
1525A254n2p95j181J820N49j970m81J786j61k362Q89J709j774n08Q68j89O9m01
$$ 1254 1202 407 -774 1046 1595 -375 -856 930 769 -1593 -704 1005 -769 -1277 -409 -598 -529 -930
1543i30j165J725N33k447J00K890j163l167J851K236k108r58J154j4N57j42j881
$$ -930 -2095 -370 163 -2284 -2184 706 -457 -3624 -1773 463 -1645 -2603 -1449 -1463 -906 -1048 -2929
1560b929J425K030k651j083L957m14l386K028J773k076P23O17j466J037R56k008
$$ -2929 -1504 526 -2125 -3208 749 335 -3051 -1023 750 -1326 -603 14 -1452 -415 541 -1467
1576a467J365J571k845k77L985j373k988L389N89k781J111J748j678O23L71k726
$$ -1467 -102 1469 -1376 -1653 2332 959 -2029 1360 1949 -832 279 2027 349 972 1343 -1383
1592a383L291J961m442n07M926j408l388L408l76k720J968O42j964K475k09l302
$$ -1383 1908 3869 -573 -1080 3846 2438 -950 2458 2082 -638 1330 1972 8 2483 2274 -1028
1608a028J599K867l656m19L949l157j463M306q99l412J866L37j333K148r77k779
$$ -1028 571 3438 -218 -637 3312 155 -1308 2998 2099 -1313 553 890 -443 1705 728 -2051
1624b051K713J387m459J284M338m106k306L670O6j512J229j631j372L515p20k727
$$ -2051 662 2049 -2410 -1126 3212 -894 -3200 470 536 -976 253 -1378 -2750 765 45 -2682
1640b682K409R74m147J778L054k991p10K517k011m06K449p17j639R62j07o71L301
$$ -2682 -273 701 -3446 -1668 1386 -1605 -2315 202 -1809 -2215 234 -483 -2122 -1160 -1267 -1938 1363
1657A363j215m303K721L056k673n14J665p30J00K63j01P84O33k011j129L570P77
$$ 1363 148 -4155 -1434 1622 -1051 -1565 100 -630 -530 -267 -368 416 1049 -962 -2091 1479 2256
1674B256l001K32P48k35J163N4p96K2j26K0J090q2p44j99O61j05J48R74q90j205
$$ 2256 -745 -513 235 0 1163 1217 421 443 317 337 1427 1345 601 402 1063 958 1106 2080 1190 -15
1694a5l7J322J754j395k791J232K295q95o16R0l23m17J49k26J361N21k956q78
$$ -15 -52 1270 3024 1629 -1162 70 2365 1470 854 944 621 204 353 127 1488 2009 -947 -1825
1712a825L295M20k436Q47m09j101K019P46k399q3Q44j308J207J793l028m75K617
$$ -1825 1470 1890 -546 301 -108 -1209 810 1556 -843 -926 -82 -1390 -183 1610 -1418 -1893 724
1729G24k203o18L814j288l644J699J645q99Q17p39l076K976K637l969J33L408
$$ 724 -1479 -2097 1717 429 -3215 -1516 129 -770 47 -692 -3768 -792 1845 -2124 -1991 1417
1745A417l137j383M068r80k129J717o76j359L745j96l621J816J690l224K533K342
$$ 1417 -1720 -3103 965 -15 -2144 -427 -1103 -2462 1283 1087 -2534 -718 972 -2252 281 2623
1761B623m696n29M513j610j372K927j862j975L215j64k086L341p65m794L894L454
$$ 2623 -2073 -2602 1911 301 -1071 1856 -6 -1981 1234 1070 -1016 2325 1560 -3234 660 4114
1777D114m382l75K465k226K62L298k697j428L297j697j605M090q08m131K514J691
$$ 4114 -268 -643 1822 -404 -142 3156 459 -969 2328 631 -974 3116 2308 -1823 691 2382
1793B382k846J625J676l947M42K971j630n23J869k693o26M004j582k693K775n2
$$ 2382 -464 1161 2837 -1110 -668 2303 673 150 2019 -674 -1300 2704 1122 -1571 1204 1152
1809A152l425J939K426k691K66M35j783J702K195l833q13L252j146j418K498r95
$$ 1152 -2273 -334 2092 -599 -333 102 -1681 21 2216 -1617 -2430 822 -324 -1742 756 -239
1825b39k149J786L84j203J392n7k392J144J748j937L66J763k663j10K785m41j997
$$ -239 -2388 -602 -218 -1421 -29 -86 -2478 -1334 414 -1523 -1157 606 -2057 -2167 618 177 -1820
1842a820J187M0n19J210m26p83Q73J35j320J430J406k126m87J542o1l11O18q17
$$ -1820 -633 -593 -1112 98 -328 -1111 -238 -103 -1423 7 1413 -713 -1200 342 281 -30 588 -229
1860b29rO92l98K44P15n78j210J219Q65q13M7J1l01M57K92m69M22j95p67J038
$$ -229 -238 454 56 300 1015 437 -773 446 1311 498 545 556 255 712 1004 535 957 762 -5 1033
1880A033N28r41p42J025K36m58M23m63j79O9m79N36Q43j013n73M49N03o53l2M29
$$ 1033 1561 620 -122 903 1139 681 1104 641 462 531 52 588 1431 418 -155 294 797 144 112 541
1900E41p45j86M54k20M56j7j088M79Q45j019j13N62k4o85L46P7k37R9j83n20J216
$$ 541 -204 -390 64 -156 300 283 -805 -326 519 -500 -613 -51 -75 -760 -414 -337 -574 -475 -658 -1178 38
1921C8j93j288N74Q91j120k44J134m24n93K47L28P6L21p88j7J072j3j209Q02K79
$$ 38 -155 -1443 -869 22 -1098 -1342 -208 -632 -1225 -978 -650 -574 -253 -1041 -1058 14 1 -1208 -406 -127
1941a27o67P7Q01j84m00L00K22P9J03n57L3J143o23p47J062L75r82K04O38k15
$$ -127 -794 -717 84 -100 -500 -200 22 101 204 -353 -320 823 200 -547 515 890 -92 112 750 535
1961E35k38K26k52K32M04n06K5O68n48l43Q41j36m90J32J30O8k2r4j32K84k28
$$ 535 297 523 271 503 907 401 426 1094 546 203 1044 908 418 550 680 748 726 632 500 784 556
1982E56m05K88P92r15k55M58n6k51J43K16l03O2l94L09k1n5n78K01O48p43q0O32
$$ 556 151 439 1231 316 61 519 463 212 355 571 268 330 -64 245 224 169 -409 -208 440 -303 -383 249
$$ [...]
8191G35
##END NTUPLES=NMR FID
##END=
