##TITLE=1H_Pr Q4
 CDCl3, 8 sc, 
 4.06.2021
##JCAMPDX= 6.0         $$ Bruker NMR JCAMP-DX V2.0
##DATA TYPE= NMR FID
##DATA CLASS= NTUPLES
##ORIGIN= UXNMR, Bruker Analytische Messtechnik GmbH
##OWNER= root
$$ XWIN-NMR		Version 3.5
$$ Fri Jun  4 13:15:30 2021 Russian Standard Time (UT+4h)  she@DPX200
##.OBSERVE FREQUENCY= 200.131506
##.OBSERVE NUCLEUS= ^1H
##.DELAY= (6, 6)
##.ACQUISITION MODE= SIMULTANEOUS
##.ACQUISITION SCHEME= undefined
##.AVERAGES= 8
##.DIGITISER RES= 18
##SPECTROMETER/DATA SYSTEM= spect
##.PULSE SEQUENCE= zg30
##.SOLVENT NAME= CD3CN
##.SHIFT REFERENCE= (INTERNAL, CD3CN, 0, 15.7039)
##AUDIT TRAIL= $$ (NUMBER, WHEN, WHO, WHERE, WHAT)
$$ ##TITLE= Audit trail, XWIN-NMR		Version 3.5
$$ ##JCAMPDX= 5.01
$$ ##ORIGIN= Bruker BioSpin GmbH
$$ ##OWNER= she
$$ F:/spectra/data/she/nmr/H-F/1/audita.txt
$$ ##AUDIT TRAIL=  $$ (NUMBER, WHEN, WHO, WHERE, WHAT)
(   1,<2021-06-04 13:14:31.60 +0400>,<she>,<DPX200>,
      <created by zg, POWCHK disabled, PULCHK disabled
       configuration hash MD5:
       00 E9 B6 7A A2 85 ED C7 34 08 36 98 17 FE 4E 26
       data hash MD5: 16K
       54 DD A2 9A 04 ED 77 43 EC 09 67 CA 0E 22 79 BB>)
$$ ##END=
$$ 
$$ hash MD5
$$ 26 81 B9 C2 25 6D C8 03 B9 8B 2C 13 52 C4 4D 92
##$RELAX= 
##$RELAX= 
##$RELAX= 
##$RELAX= 
##$RELAX= 
##$RELAX= 
$$ Bruker specific parameters
$$ --------------------------
##$DU= <F:/spectra>
##$EXPNO= 1
##$NAME= <H-F>
##$PROCNO= 1
##$TYPE= <nmr>
##$USER= <she>
##$AMP= (0..31)
100 100 100 100 100 100 100 100 100 100 100 100 100 100 100 100 100 100 
100 100 100 100 100 100 100 100 100 100 100 100 100 100 
##$AQSEQ= 0
##$AQ_mod= 1
##$AUNM= <au_zg>
##$AUTOPOS= <>
##$BF1= 200.13
##$BF2= 200.13
##$BF3= 200.13
##$BF4= 200.13
##$BF5= 200.13
##$BF6= 200.13
##$BF7= 200.13
##$BF8= 200.13
##$BYTORDA= 1
##$CFDGTYP= 0
##$CFRGTYP= 5
##$CHEMSTR= <none>
##$CNST= (0..31)
1 1 145 1 1 1 1 1 1 1 1 1 1 1 1 1 1 1 1 1 1 1 1 1 1 1 1 1 1 1 1 1 
##$CPDPRG= <>
##$CPDPRG1= <>
##$CPDPRG2= <>
##$CPDPRG3= <>
##$CPDPRG4= <mlev>
##$CPDPRG5= <mlev>
##$CPDPRG6= <mlev>
##$CPDPRG7= <mlev>
##$CPDPRG8= <mlev>
##$CPDPRGB= <>
##$CPDPRGT= <>
##$D= (0..31)
0 1.2 0 0 0 0 0 0 0 0.06 0 0.03 0 0 0 0 0.0002 0 0 0 0 0 0 0 0 0 0 0 0 
0 0 0 
##$DATE= 1622798071
##$DBL= (0..7)
120 120 120 120 120 120 120 120 
##$DBP= (0..7)
150 150 150 150 150 150 150 150 
##$DBP07= 0
##$DBPNAM0= <>
##$DBPNAM1= <>
##$DBPNAM2= <>
##$DBPNAM3= <>
##$DBPNAM4= <>
##$DBPNAM5= <>
##$DBPNAM6= <>
##$DBPNAM7= <>
##$DBPOAL= (0..7)
0.5 0.5 0.5 0.5 0.5 0.5 0.5 0.5 
##$DBPOFFS= (0..7)
0 0 0 0 0 0 0 0 
##$DE= 6
##$DECBNUC= <off>
##$DECIM= 32
##$DECNUC= <off>
##$DECSTAT= 4
##$DIGMOD= 1
##$DIGTYP= 9
##$DL= (0..7)
0 120 120 120 120 120 120 120 
##$DP= (0..7)
150 150 150 150 150 150 150 150 
##$DP07= 0
##$DPNAME0= <>
##$DPNAME1= <>
##$DPNAME2= <>
##$DPNAME3= <>
##$DPNAME4= <>
##$DPNAME5= <>
##$DPNAME6= <>
##$DPNAME7= <>
##$DPOAL= (0..7)
0.5 0.5 0.5 0.5 0.5 0.5 0.5 0.5 
##$DPOFFS= (0..7)
0 0 0 0 0 0 0 0 
##$DQDMODE= 0
##$DR= 18
##$DS= 0
##$DSLIST= <SSSSSSSSSSSSSSS>
$$ [...]
##$SUBNAM2= <"">
##$SUBNAM3= <"">
##$SUBNAM4= <"">
##$SUBNAM5= <"">
##$SUBNAM6= <"">
##$SUBNAM7= <"">
##$SUBNAM8= <"">
##$SUBNAM9= <"">
##$SW= 20.0188882624521
##$SWIBOX= (0..15)
0 0 2 0 0 0 0 0 0 0 0 0 0 0 0 0 
##$SW_h= 4006.41025641026
##$TD= 16384
##$TD0= 1
##$TE= 0
##$TE2= 300
##$TE3= 300
##$TEG= 300
##$TL= (0..7)
0 120 120 120 120 120 120 120 
##$TP= (0..7)
150 150 150 150 150 150 150 150 
##$TP07= 0
##$TPNAME0= <>
##$TPNAME1= <>
##$TPNAME2= <>
##$TPNAME3= <>
##$TPNAME4= <>
##$TPNAME5= <>
##$TPNAME6= <>
##$TPNAME7= <>
##$TPOAL= (0..7)
0.5 0.5 0.5 0.5 0.5 0.5 0.5 0.5 
##$TPOFFS= (0..7)
0 0 0 0 0 0 0 0 
##$TUNHIN= 0
##$TUNHOUT= 0
##$TUNXOUT= 0
##$USERA1= <user>
##$USERA2= <user>
##$USERA3= <user>
##$USERA4= <user>
##$USERA5= <user>
##$V9= 5
##$VALIST= <valist>
##$VCLIST= <CCCCCCCCCCCCCCC>
##$VD= 0
##$VDLIST= <DDDDDDDDDDDDDDD>
##$VPLIST= <PPPPPPPPPPPPPPP>
##$VTLIST= <TTTTTTTTTTTTTTT>
##$WBST= 1024
##$WBSW= 4
##$XGAIN= (0..3)
0 0 0 0 
##$XL= 0
##$YL= 0
##$YMAX_a= 200757
##$YMIN_a= -161474
##$ZGOPTNS= <>
##$ZL1= 120
##$ZL2= 120
##$ZL3= 120
##$ZL4= 120
##$ABSF1= 10
##$ABSF2= 0
##$ABSG= 5
##$ABSL= 3
##$ALPHA= 0
##$AQORDER= 0
##$ASSFAC= 0
##$ASSFACI= 0
##$ASSFACX= 0
##$ASSWID= 0
##$AUNMP= <proc_1d>
##$AZFE= 0.1
##$AZFW= 0.1
##$BCFW= 1
##$BC_mod= 2
##$BYTORDP= 1
##$COROFFS= 0
##$CY= 11.3945322036743
##$DATMOD= 1
##$DC= 2
##$DFILT= <>
##$DTYPP= 0
##$F1P= 15.9154993809931
##$F2P= -4.1035820241983
##$FCOR= 0.5
##$FTSIZE= 0
##$FT_mod= 4
##$GAMMA= 1
##$GB= 0.15
##$INTBC= 1
##$INTSCL= 1
##$ISEN= 128
##$LB= 0.24
##$LEV0= 0
##$LPBIN= 0
##$MAXI= 10000
##$MC2= 0
##$MEAN= 0
##$ME_mod= 0
##$MI= 1.114404
##$NCOEF= 0
##$NC_proc= 0
##$NLEV= 6
##$NOISF1= 3.799351
##$NOISF2= 2.8
##$NSP= 1
##$NTH_PI= 0
##$NZP= 0
##$OFFSET= 15.70392
##$PC= 1
##$PHC0= -11127.1
##$PHC1= 19.40101
##$PH_mod= 1
##$PKNL= yes
##$PPARMOD= 0
##$PSCAL= 0
##$PSIGN= 0
##$REVERSE= no
##$SF= 200.130013532006
##$SI= 16384
##$SIGF1= 3
##$SIGF2= 2
##$SINO= 400
##$SIOLD= 16384
##$SREGLST= <1H.CDCl3>
##$SSB= 0
##$STSI= 0
##$STSR= 0
##$SW_p= 3612.71676300578
##$SYMM= 0
##$S_DEV= 0
##$TDeff= 0
##$TDoff= 0
##$TI= <>
##$TILT= no
##$TM1= 0
##$TM2= 0
##$TOPLEV= 0
##$USERP1= <user>
##$USERP2= <user>
##$USERP3= <user>
##$USERP4= <user>
##$USERP5= <user>
##$WDW= 1
##$XDIM= 8192
##$YMAX_p= 0
##$YMIN_p= 0
$$ End of Bruker specific parameters
$$ ---------------------------------
##NTUPLES= NMR FID
##VAR_NAME=  TIME,          FID/REAL,        FID/IMAG
##SYMBOL=    X,             R,               I
##VAR_TYPE=  INDEPENDENT,   DEPENDENT,       DEPENDENT
##VAR_FORM=  AFFN,          ASDF,            ASDF
##VAR_DIM=   8192,          8192,            8192
##UNITS=     SECONDS,       ARBITRARY UNITS, ARBITRARY UNITS
##FACTOR=    0.0002496,     1,               1
##FIRST=     0,             0,               0
##LAST=      2.0444736,     0,               0
##MIN=       0,             -161474,         0
##MAX=       2.0444736,     200757,          0
$$ Real data points
##PAGE= N=1
##DATA TABLE= (X++(R..R)), XYDATA
0@%%%%%%%%%%%%%Qj6J6j6J6k4L2l2M0m8N6p2Q4r2J04j22J45j67J90k15K41k72
$$ 0 0 0 0 0 0 0 0 0 0 0 0 0 0 8 -8 8 -8 8 -16 16 -16 24 -24 32 -40 44 -48 56 -66 79 -88 102 -113 128 -144
35a44L07l45L88m36M85n37N96o63P34q10Q97r92J092j204J327j461J610j774J958
$$ -144 163 -182 206 -230 255 -282 314 -349 385 -425 472 -520 572 -632 695 -766 844 -930 1028
54A028k163K394k659K962l314L728m224M834n602O603p967R942j3068J8765l2363
$$ 1028 -1135 1259 -1400 1562 -1752 1976 -2248 2586 -3016 3587 -4380 5562 -7506 11259 -21104
69b1104J21063J00798l10142j9205K05480K0806j64258J5674J11789l0539p7922
$$ -21104 99959 200757 -109385 -128590 76890 97696 -66562 -50888 60901 30362 -47560
80d7560J6617L062M1790N8654p5093j15406P4324J45662n4899j45094P3183J07204
$$ -47560 -30943 -27881 13909 72563 -2530 -117936 -43612 102050 47151 -97943 -24760 82444
92H2444r1623o5757R6666N7270o6519n6958L1519K7977J4314K4779m8991n5186
$$ 82444 -9179 -74936 21730 79000 12481 -44477 -12958 15019 29333 54112 5121 -50065
104e0065N3746M2629l6822k0070K8880J209m7265R94M2105n86L63j5786o2736
$$ -50065 3681 46310 9488 -10582 18298 19507 -27758 -26764 15341 14755 15118 -668 -63404
117f3404J8612R1785n518r4543o735Q8737j7446q1281O0778P2164p2650o1376
$$ -63404 -44792 46993 41475 -53068 -59803 28934 11488 -69793 -9015 63149 -9501 -70877
129g0877N1155N0397k1409j0763J3328l9883l943P1459r433n4944L1412K8600
$$ -70877 -19722 30675 9266 -1497 11831 -28052 -31995 39464 30031 -24913 6499 35099
141C5099n7178k2775Q8683K7102j04598j4699Q3453j7386m9877M5418L6168o8112
$$ 35099 -22079 -44854 43829 70931 -33667 -48366 35087 17701 -32176 13242 49410 -18702
153a8702m6362P3803M0030o0011j0589L0964j9008j5374K6685K1348j6540j7755
$$ -18702 -65064 8739 48769 -11242 -21831 9133 -9875 -25249 1436 22784 6244 -11511
165a1511J949j2365J8671N0925k7598n8245K3768M3842j5848k7053L2153K1837
$$ -11511 -9562 -21927 -3256 47669 20071 -38174 -14406 29436 13588 -13465 18688 40525
177D0525n5405j9771N3492K0876k2374k3558p063J1668J1503O328r603j0988R801
$$ 40525 -14880 -34651 18841 39717 17343 -6215 -13278 -1610 9893 16221 6618 -4370 5431
190E431j6125j6896M0460K1099m0325k9415K2302K5411j7567k706K6296k4033
$$ 5431 -10694 -27590 12870 33969 -6356 -35771 -13469 11942 -5625 -8331 17965 -6068
202f068l1841K7337K8647q111j6752m50l06j0290K1343K1306k4003j1362Q500
$$ -6068 -37909 -10572 18075 9964 -6788 -7238 -7544 -17834 3509 24815 812 -10550 -2050
215b050p673L974K3065O826l1890k1970L0994J4400j9247R259N662k5213j0811
$$ -2050 -9723 -5749 17316 24142 -7748 -29718 1276 15676 -3571 5688 11350 -13863 -24674
228b4674K3045K2458j6998j6902R880r550n139K7760Q420k1130j7614O330J6801
$$ -24674 -1629 20829 3831 -13071 -3191 -12741 -17880 9880 18300 -2830 -20444 -14114 2687
241B687J431L806R8j9585J458J3229j511Q518Q136j4487k3009O173L8844J708
$$ 2687 4118 7924 8022 -11563 -10105 3124 1613 10131 18267 3780 -19229 -13056 25788 27496
255B7496l3878J46J3235n317l202J0408J2080j4085k2576N945J3624J3152Q20
$$ 27496 -6382 -6236 6999 1682 -1520 8888 20968 6883 -15693 -9748 3876 17028 17848
268A7848k6778j0206J8583Q973n462m896R295n123k5495J1937L0695m679j9696
$$ 17848 -8930 -19136 -553 8420 2958 -1938 7357 2234 -23261 -11324 19371 14692 -5004
281e004q666N770Q973L274P122o261j6098M229N305K519J1486k930j4916r781
$$ -5004 -13670 -7900 1073 4347 11469 5208 -10890 -6661 -1356 1163 12649 9719 -5197 -14978
295a4978Q075J8484k593q263o59j2377l16J7336N884p843j2206m82M391l295J2841
$$ -14978 -6903 11581 8988 725 66 -12311 -12627 4709 10593 2750 -9456 -9938 -5547 -8842 3999
310C999R056j8837j1971N937J1889P607m952m852o934m191J3907O415k989P83
$$ 3999 13055 -5782 -17753 -11816 73 7680 2728 -2124 -9058 -13249 658 7073 4084 4867
324D867r499q158Q286J4615O741j6141j1042Q737J348L452R375m425j0538p619
$$ 4867 -4632 -12790 -4504 10111 16852 711 -10331 -1594 -246 3206 12581 8156 -2382 -10001
338a0001N864J3840m56k526o084j2864P217J2125J657k444q617m116L62M507J3854
$$ -10001 -4137 9703 9247 6721 637 -12227 -5010 7115 8772 6328 -2289 -6405 -6043 -1536 12318
353A2318k586j4404j135Q10M855Q842P47n383j2303j034J4643L328j811j785r823
$$ 12318 9732 -4672 -5807 -4997 -142 8700 9447 4064 -8239 -9273 5370 8698 6887 5102 -4721
368d721j815N272P918N400r302p821j436N21J2274M764j0167o806k969M731O823
$$ -4721 -6536 -1264 6654 12054 2752 -5069 -6505 -5984 6290 11054 887 -5919 -8888 -4157 2666
383B666J214J664r330j0133P514P525L998o24r524m777Q47P136J0959n435q889
$$ 2666 3880 5544 -3786 -13919 -6405 1120 5118 4494 -5030 -9807 -8960 -1824 9135 3700 -5189
398e189j763j185P364O207q83k710r381j242P889N095N155o344j2726J885P838
$$ -5189 -6952 -8137 -773 5434 4551 1841 -7540 -8782 -893 4202 9357 3013 -9713 -7828 10
413A0O307R9p454j420k246j863R768N445l699p897q701P372J0979J133m088r116
$$ 10 6317 6416 -1038 -2458 -4704 -6567 3201 8646 4947 -2950 -11651 -4279 6700 7833 3745 -5371
429e371q23N733P65N420K311p700n919j326Q823R972n008p175m354p26R869L795
$$ -5371 -6194 -461 304 5724 8035 335 -5584 -6910 1913 11885 6877 -298 -4652 -5378 4491 8286
445H286k440l016o311k9L301M635O637p733r991J840L853O641J030m871m515n271
$$ 8286 5846 2830 -3481 -3510 -209 4426 11063 3330 -6661 -4821 -968 5673 6703 1832 -2683 -7954
461g954L651J1086r80m973m164l151L362L414M186J449j0038m295L741M605O851
$$ -7954 -4303 6783 5803 830 -3334 -6485 -3123 291 4477 5926 -4112 -8407 -4666 -61 6790
476F790k522p957m106R68J0043L611p297j232j359k325K082M726P159n075j4546
$$ 6790 4268 -3689 -7795 -6827 3216 6827 -470 -1702 -3061 -5386 -3304 1422 8581 3506 -11040
491a1040J193J0633O147k394r169j033L096r6L951J215j326p81p858r09J0484
$$ -11040 -9847 786 6933 4539 -4630 -5663 -2567 -2663 1288 2503 1177 396 -7462 -8371 2113
506B113Q294m011j5957k375J6050M175p963k737M471J102r664P85J5942R94j2308
$$ 2113 10407 6396 -9561 -11936 4114 8289 326 -2411 2060 3162 -6502 -5717 10225 11219 -1089
521a089p861L487J2179L088o682n823k178O913K742o382L952O175p104j1477K852
$$ -1089 -8950 -5463 6716 9804 3122 -2701 -4879 2034 4776 -1606 2346 8521 1417 -10060 -7208
536g208J8986K669j9463m985J0441M539l167k537M710j722q967L177O539K242
$$ -7208 11778 14447 -5016 -10001 440 4979 1812 -725 3985 2263 -6704 -3527 3012 5254
550E254J33p352n612L210Q487N504r289p780O540J957l050K802M050j972j0519
$$ 5254 5387 -1965 -7577 -4367 4120 9624 335 -7445 -905 1052 -1998 804 4854 2882 -7637
565g637n33J1677J738m374j473l566j759L229P385J566j1469k513P155K1j268
$$ -7637 -8170 3507 5245 871 -602 -4168 -5927 -2698 4687 6253 -5216 -7729 -574 -553 -1821
580a821L869J713o001p773O408J0120l147m328j799k682K640N102L856n008p396
$$ -1821 2048 3761 -2240 -10013 -3605 6515 3368 -960 -2759 -5441 -2801 2301 6157 1149 -6247
595f247M314L537l633L148N006l228r726j351J3516M014r183l686R82K151J885
$$ -6247 -1933 1604 -2029 1119 6125 2897 -6829 -8180 5336 9350 167 -3519 -2537 -386 1499
610A499P36J492k856l488J778r16K524P479k945j0844l218J1265Q983r931p674
$$ 1499 2235 3727 871 -2617 -839 -1755 769 8248 5303 -5541 -8759 2506 11489 1558 -6116
625f116P128K640n702p72P867M655j1977o757Q494O040J49m000n358O51L580K755
$$ -6116 1012 3652 -2050 -2822 5045 9700 -2277 -9034 -540 5500 5649 1649 -3709 -3058 522 3277
641C277q82l585L338j137p632L108J0240Q26j0885o449R518N689n786m36K031
$$ 3277 2395 -1190 2148 1011 -6621 -3513 6727 7553 -3332 -9781 -263 5426 -360 -796 1235
656A235k476l708J540P166L50o117j131n58J031N477P28l821l762m28M865K97
$$ 1235 -1241 -4949 -3409 3757 4107 -2010 -3141 -3699 -2668 2809 3537 -284 -4046 -4474 391 688
672F88J82J396m018l178K117M275K759m023l329J360j160K445M134r23l773l562
$$ 688 870 2266 -1752 -4930 -2813 1462 4221 198 -3131 -1771 -2931 -486 3648 2725 -1048 -4610
688d610J837N578k71j459r22k716L9K580K831J267m769j923J290K68L700J892
$$ -4610 -2773 2805 2534 1075 153 -2563 -2524 56 2887 4154 -615 -2538 -1248 -980 2720 4612
704D612l184m303j102O147K651l969l07O55k502o56K569M958j751o874k61L017
$$ 4612 1428 -2875 -3977 2170 4821 852 545 1200 -1302 -1958 611 5569 3818 -3056 -3317 -300
720c00K818K102l525l087R84R78J381q42J707J055o398k385O959M392l189n896
$$ -300 2518 4620 1095 -1992 -1008 -30 1351 509 2216 3271 -3127 -5512 1447 5839 2650 -3246
736c246m26M368k06k01J526j318j723j889Q96M568J118l018l885j064N015K160
$$ -3246 -3672 696 490 289 1815 497 -1226 -3115 -2219 2349 3467 449 -3436 -4500 515 2675
752B675k588k6j344j454Q85J766K777j262l724o13N88K668K915k704k626j042
$$ 2675 87 61 -1283 -2737 -1852 -86 2691 1429 -2295 -2908 -2320 348 3263 559 -2067 -3109
768c109J256K701O7j38r82l052J242K407O98J413k428l097L17K240L681p91l826
$$ -3109 -1853 848 915 777 -205 -3257 -2015 392 1090 2503 75 -3022 -2705 -465 3216 2425 -1401
785a401K96lP59J846J015m52l495j492L032K089O50j130l502RJ981J453P64j428
$$ -1401 -1105 -1108 -349 1497 2512 2060 -1435 -2927 105 2194 2844 1714 -1788 -1779 202 1655 2419 991
803I91j005r99j127L427K565k387k246j340R77K472L87R29k052l326J698J877
$$ 991 -14 -1013 -2140 1287 3852 1465 -781 -2121 -1144 1328 1715 2644 592 -2734 -1036 841
819H41J042O27k143j960j0J169K882n86j925r70j269J822K610n17j246k122j55
$$ 841 1883 2510 367 -1593 -1603 -434 2448 1862 -63 -1033 -2302 -480 2130 1613 367 -1755 -1910
836a910J434L26J928j88l630n59J114K469J173k151j353q79R8K406J123p54j006
$$ -1910 -476 -150 1778 1590 -2040 -2599 -1485 984 2157 6 -1347 -2226 -2128 278 1401 647 -359
853c59k123K27K521J528j47k978j470J881N21J177P90j747j667o42J966K590o32
$$ -359 -2482 -2255 266 1794 1647 -1331 -2801 -920 -399 778 1568 -179 -1846 -2488 -522 2068 1436
870A436j240j336j161K028J583J3m06j994p86J296J310J733j082k680J34M64J777
$$ 1436 196 -1140 -2301 -273 1310 1323 917 -1077 -1863 -567 743 2476 1394 -1286 -1152 -688 1089
887A089J405j357j014j494J65K508O35l87j257j923P74J349J264P73k448j502
$$ 1089 2494 1137 123 -1371 -1206 1302 1937 1550 293 -1630 -856 493 1757 2530 82 -1420
903a420P37N60K385j18k148q87o65J372K220m40p11j979j131K135J294L05q27
$$ -1420 -683 -123 2262 2144 -4 -891 -1556 -184 2036 1596 885 -1094 -2225 -90 1204 1509 682
920F82j865k82R93O00J733q61k348k04j27K279J175j473j023j229M72J746M32
$$ 682 -1183 -1465 -472 128 1861 1000 -1348 -1552 -1679 600 1775 302 -721 -1950 -1478 268 700
937G00R5r98k158P57J462J419J47k420r79O04P78J901n20j335p00n46J189J657
$$ 700 795 -203 -2361 -1604 -142 1277 1424 -996 -1975 -1371 -593 1308 788 -547 -1247 -1793 -604 1053
955A053P1k83k254q65K074J231P55j345j819L80J03J422J466j319r50q36r9K160
$$ 1053 1124 841 -1413 -2278 -204 1027 1782 437 -1382 -1002 -899 523 1989 670 -280 -1116 -1215 945
973I45J181q07j208k043J134K347m62p2r56p90J0N49J817P35k072j197Q8R52J907
$$ 945 2126 1319 111 -1932 -798 1549 1087 1015 59 -731 -721 -172 1645 2380 308 -889 -801 151 2058
992B058l68j185j243o40J932N29j51Q0j562r61R39J573J551j891k192M77K22J366
$$ 2058 1690 505 -738 -1378 554 1083 932 1012 -550 -1511 -572 1001 2552 661 -1531 -1054 -832 534
1010E34R72q55q33j267J85K055M2j95p63j547N20J092J306R7k345r15J084M39
$$ 534 1506 651 -182 -1449 -1264 791 833 638 -125 -1672 -1152 -60 1246 1343 -1002 -1917 -833 -394
1028c94J298M9j283p47r17J399J482o25m2j258q70J212J467Q99j312k398P47J417
$$ -394 904 953 -330 -1077 -1994 -595 887 262 220 -1038 -1908 -696 771 1670 358 -2040 -1293 124
1046A24j50R24n69m55q71j020K779J327k199m62o21L69Q37J812k26k668o86K223
$$ 124 -26 898 329 -126 -997 -2017 762 2089 -110 -572 -1193 -824 13 1825 1599 -1069 -1755 468
1064D68n62L17J232r2k249j187K031K899j934j422J67j04Q56Q27K84p33j859P44
$$ 468 -94 223 1455 1363 -886 -2073 -42 2857 923 -499 -332 -436 420 1247 1531 798 -1061 -317
1082c17Q50n08J420O19l256p86J312K664o79k591P52M71j349J297J290j60m88
$$ -317 533 25 1445 2064 -1192 -1978 -666 1998 1319 -1272 -520 -49 -1398 -101 1189 1029 541
1099E41k509J170J553m3K5q15j242J071N49P05q91l60K74p53k61K016J108j639
$$ 541 -1968 -798 755 712 737 -78 -1320 -249 300 1005 114 -246 28 -725 -986 1030 2138 499
1117D99j800n97K464J15j091P03n17j342P54O63J844j832j312M7K42J441Q75J76
$$ 499 -1301 -1898 566 681 -410 293 -224 -1566 -812 -149 1695 -137 -1449 -1402 -1160 281 1156 1332
1135A332j965j748J594J845j362R78j39j653n95J433K428q73k276J046p85n3K002
$$ 1332 -633 -2381 -787 1058 -304 674 535 -1118 -1713 -280 2148 1275 -1001 45 -740 -793 1209
1152A209M98j812j997O60K812J21j948J531j429j315J883O18M39j070r94M14j96
$$ 1209 1707 -105 -2102 -1442 1370 1491 -457 1074 -355 -1670 213 831 1270 200 -794 -380 -576
1169e76P84J509j414j684N74J155P08o76P37J05k049R0J292J354n60j682j391
$$ -576 208 1717 303 -1381 -807 348 1056 380 1117 1222 -827 -737 555 1909 1349 -333 -1724
1186a724J453R76L19k51j296j91j93O74J336l62q26o44q95J003J693R5j345j646
$$ -1724 -271 705 1024 773 -523 -714 -907 -233 1103 741 -85 -729 -1624 -621 1072 1167 -178 -1824
1204a824J173R04n25P93M03j804p30M62K339k43j403k00m80k06J872P39j213j015
$$ -1824 -651 253 -272 521 924 -880 -1610 -1148 1191 948 -455 -655 -1135 -1341 531 1270 57 -958
1222i58m48J259l7M46J024j857j257R11J119J004r74n74j23q26J037J884j043
$$ -958 -1406 -147 -184 262 1286 -571 -1828 -917 202 1206 232 -342 -465 -1291 -254 1630 587
1239E87n26k93l29P15L9J092n54j809M31Q99O57M23r25j279K78K44J476R6r02
$$ 587 61 -232 -561 154 193 1285 731 -1078 -647 252 909 1332 407 -872 -594 -350 1126 1222 320
1258C20l43o17n0K038j81k17q71q48N44N85R19l22j662J1M19O17R31o02p48n36
$$ 320 -23 -640 -690 1348 1167 950 79 -769 -225 360 1279 957 -705 -694 -275 342 1273 671 -77 -613
1278f13l70J494N33l76n03j288M9J375N79j31q73q37K89J46Q12J033j256j126
$$ -613 -983 511 1044 668 165 -1123 -1074 301 880 749 -124 -961 -672 -526 286 1319 63 -1063
1296a063J75J45J408j33p68k35j427J285J109l4k09r89n38N83N37J084n33j460
$$ -1063 -888 -743 665 532 -236 -471 -1898 -613 496 462 253 -736 -1274 -691 -154 930 397 -1063
1314a063R4K31M41J160k17p61p25m72J674J97k27k58j387L39J175N65P6j150m59
$$ -1063 -969 -738 -297 863 646 -115 -840 -1312 362 559 332 74 -1313 -974 201 766 842 -308 -767
1333g67J71n8J582O40j525n05m13P27J307m46Q3j085q41J269O01Q3M9r87n68N14
$$ -767 -596 -654 928 1568 43 -462 -875 -148 1159 713 796 -289 -1130 139 740 823 872 -115 -683 -169
1353a69O68J115j084o57l21m2Q30O41l19m76j012N19P07K7M77o55j397O75P38
$$ -169 499 1614 530 -127 -448 -490 340 981 662 186 -826 -307 400 427 904 249 -1148 -473 265
1372B65J46O22j201p87R2M42J407o52m50n31o87J188N69K78j93j612J69N21L35
$$ 265 411 1033 -168 -955 -863 -421 986 334 -116 -647 -1334 -146 423 701 508 -1104 -935 -414 -79
1391g9O86mj258m56N71R04K27n82l92n54j47J469M89m79q06n62M05M31M90M82
$$ -79 607 603 -655 -1111 -540 364 591 9 -383 -937 -1084 385 874 395 -411 -973 -568 -137 353 835
1411H35j211o90N51K35P87N2p47k39o61J064J241p65o25N6o50O78Q46L25j36j631
$$ 835 -376 -1066 -515 -280 507 559 -188 -427 -1088 -24 1217 452 -173 -117 -767 -89 757 1082 946 -685
1431f85K76O48k41J188o03q59k42L20J082L63q17J2j108Q0J359k19l8k57j007
$$ -685 -409 239 -2 1186 583 -276 -518 -198 884 1247 430 442 -666 -586 773 554 516 259 -748
1450g48M20M10O05M62j391o6J06OJ028J5j007k44o42J179M72k28Or12l65R95L66
$$ -748 -328 82 687 1149 -242 -308 -202 -196 832 847 -160 -404 -1046 133 605 377 383 -529 -894 101 467
1471D67K44n27j135K60J56P13P41r09q97M8M41O35J27l40l63r40O41J099j45J26
$$ 467 711 184 -951 -691 -535 178 919 10 -887 -839 -398 237 364 24 -339 -1279 -638 461 316 442
1491D42j009n33L59O11Q23r9j370j30K02N16Q65M4q80o19p2Q37N83j72o2r02J70
$$ 442 -567 -1100 -741 -130 693 594 -776 -906 -704 -188 677 721 -159 -778 -850 -13 570 398 336 -566 -396
1512c96M58M73K5j39o23l43L45P50Q06j332k22n7J09R43j62j9p72o48O86N89P
$$ -396 62 535 560 421 -202 -545 -200 550 1356 24 -198 -255 -146 797 635 616 -156 -804 -118 471 478
1533D78K06o73o47L15O58R58n49r77Q4j98N55Q26p76k98o19R1O24K54L22l12j047
$$ 478 684 11 -636 -321 337 1295 746 -231 -147 -345 210 1036 260 -38 -657 -566 58 312 634 322 -725
1554g25M1R74J71K20p91l70k75L06Q21L6j53o61l94M36O58m8j2p84m88M93N34
$$ -725 -684 290 461 681 -110 -480 -755 -449 372 408 255 -406 -800 -364 294 246 234 -550 -1038 -545 -11
1575a1N81l88q73J00j13N86N86k69o24m75L48J007K09o48j56n99k7Q76L31K04
$$ -11 570 182 -691 -591 -704 -118 468 199 -425 -900 -552 455 664 16 -140 -739 -766 110 441 645
1595F45q61l16L37k8P88J37o47o03j82P27P72l32k08j41q50P71O82K0j93q33j87
$$ 645 -216 -532 -195 -223 565 702 55 -548 -730 -3 769 437 229 88 -762 9 691 711 518 -315 -502
1616e02P02N2K03J42r54p4K20R42K08p17k51m30K06N99M06q9o93o35N21L05R0
$$ -502 200 252 455 597 -357 -431 -211 731 939 222 -29 -459 -253 346 752 663 -30 -665 -144 161 251
1637B51N30p90p04R8P85O52m41p30J75l56NJ060K45o23q47r9P80K3J54M0o43m58
$$ 251 781 -9 -713 -615 170 822 381 -349 -174 -530 -525 535 780 157 -690 -789 -9 14 168 208 -435 -893
1659h93Q31K55J14j62n43K3o03R05Q40p24m12n17K08J066k2K63o29o13L56N14
$$ -893 -62 193 307 145 -398 -375 -978 -73 767 43 -369 -886 -678 388 366 629 0 -613 -257 257
1679B57K77j96q14M0O0L62R23k73o42m25n8O68O49m52L5o85k34O99J28O29n88
$$ 257 534 338 -476 -436 -376 -14 909 636 -6 -431 -489 179 828 376 411 -274 -508 191 319 948 360
1700C60p97M00m8K81Q35q96k93n8J89P34j92j53Oj211L46J218J46l02q93R2R1
$$ 360 -437 -37 -85 196 1031 135 -158 -216 -27 707 515 362 368 -843 -497 721 867 565 -328 -236 -145
1721a45j28J022l31p43k03J98J96N50l08j33l80l04R44J75l22M6n74J71J15J92
$$ -145 -273 749 418 -325 -528 -330 -134 416 108 -25 -405 -709 235 410 88 134 -440 -269 -154 38
1741C8O96p45q35M81j19P17K88l16m54m87L69P59k20j52j71m62L38L69J90k13
$$ 38 734 -11 -846 -365 -484 233 521 205 -249 -736 -367 392 172 20 -151 -613 -275 94 284 71
1761G1l12m22M06M02J55J72p10j71R3M89L71om19l70j01L78L75O5k10p69J56P21
$$ 71 -241 -663 -257 145 300 472 -238 -409 -316 173 544 538 119 -251 -352 26 401 466 256 -513 -357 364
1783C64L00o4m50l06P1R0M48K00p47j71pM20K63q6N2n96m16O52O07p3k72j78o9
$$ 364 664 600 150 -156 -85 5 453 653 -94 -265 -272 148 411 325 377 -219 -635 17 624 551 279 101 32
1806C2k65N18M96r17N6k9k50M05N59l42m66m24M63N39k77K28m19n98K24N11J50
$$ 32 -233 285 781 -136 -80 -109 -359 46 605 263 -203 -627 -164 375 98 326 -93 -691 -467 44 194
1827A94N9m20r3k38K57N97l05r4k40l43M05M58j94J64m87j45P5L37L38k97k84
$$ 194 253 -167 -260 -498 -241 356 51 -43 -283 -626 -221 237 43 207 -280 -425 -350 -13 325 28 -256
1848b56j70L5O16j05j03l48J92O3L73j05O7k94m03K94J09M66J12q50o0K95J16
$$ -256 -426 -391 225 120 17 -331 -139 -76 297 192 259 -35 -438 -144 -35 431 543 -307 -367 -72 44
1869D4L83j37k78k9l91M97L67R3m21p2l16K9O49K34k86o66K94P2M84M1n01k30
$$ 44 427 290 12 -17 -408 89 456 549 128 56 -260 -231 418 652 366 -300 -6 66 550 591 90 -140
1891a40m0M0Q20k68k80K97r53N1R43k05j31l00j34J54J06M37k67m04p4J24K03
$$ -140 -180 -140 680 412 132 429 -524 -473 470 265 134 -166 -300 -146 -40 397 130 -274 -348 -224 -21
1912b1K81n5k32k85l84O90M43k98J00p45J02L64J49L43n17m85J82J80k2K95j56
$$ -21 260 205 -27 -312 -696 -6 437 139 239 -506 -404 -40 109 452 -65 -550 -368 -188 -210 85 -71
1933g1j91l8M1P44l54j18j02k44M14J7J24P5n97O7L58R3J95l21l4k04k38K97M51
$$ -71 -262 -300 -259 485 131 13 -89 -333 81 98 222 297 -300 -233 125 218 413 92 58 -146 -384 -87 364
1956C64j15j43k46j73L14M28m48N7m07K15K44J63L48n22k49O4JN72j83r7j54l01
$$ 364 249 106 -140 -313 1 429 -19 38 -369 -154 90 253 601 79 -170 -106 -105 467 284 187 33 -268
1978b68L42L13o7k85k48m8L42j80O05o2p10N0L6O2Q04o03l98j24J43J90L75r3
$$ -268 74 387 320 35 -213 -261 81 -99 506 444 -266 -216 -180 -118 686 83 -315 -439 -296 -106 269 176
2000A76j89n62K90L71j22Q2k47k39L86O0K57J93p03J8j06Q2N28k17n7j57l00L72
$$ 176 -13 -575 -285 86 -36 46 -201 -440 -54 6 263 456 -247 -229 -335 -253 275 58 1 -156 -456 -84
2022h4M63l61O5l60lM39L4J16k43m09k0Q1K93L74m04j62j32O0N89k87m2k93J78
$$ -84 379 18 83 -277 -280 159 193 309 66 -343 -363 -282 11 385 -19 -181 -313 -253 336 49 7 -286 -108
2045a08j7L11J77j49l79N4K77k42K94L19n87q5q7K54N77m07q3k90P1K15q7M89
$$ -108 -125 186 363 214 -165 -111 166 -76 218 537 -50 -135 -222 32 609 202 119 -171 -100 115 28 517
2067E17j90m56j83M98J7R9l14J07k66J23J24K35j74l29o4j8N30j00j24j83l98
$$ 517 327 -129 -312 186 203 302 -12 95 -171 -48 76 311 137 -192 -256 -274 256 156 32 -151 -549
2088e49M54n7N83l85m54K08l05K37N31k66j10j07o5M77j76k16m2l19J45P29j06
$$ -549 -95 -152 431 46 -408 -200 -505 -268 263 -3 -113 -220 -285 192 16 -200 -242 -561 -416 313 207
2109B07n2j42l75J36r4J97K02j17l11j62L39K29L5m3Ol07L42Q3L5l4l43k09L52
$$ 207 155 13 -362 -226 -320 -123 79 -38 -349 -511 -172 57 92 49 55 -252 90 173 208 174 -169 -378 -26
2132b6K06K37k21k31K7j9J33J17o7k69j50K42M18l8k26j56j88J18K47l9K80k20
$$ -26 180 417 196 -35 -8 -27 106 223 156 -113 -263 -21 397 359 133 -23 -211 -93 154 115 395 175
2154A75k58j06L11O7J59l36j41l2L01L16q5l22j64j42N8K60K71k88m58K23M62
$$ 175 -83 -189 122 189 348 12 -129 -161 140 456 371 49 -115 -257 -199 61 332 44 -414 -191 271
2175B71k32Jl5r2k6k6P4L20l27M0k22kJ32N0J83l61k60L64J03P9K14o23L80j54
$$ 271 39 40 5 -87 -113 -139 -65 255 -72 -32 -254 -256 -124 -74 109 -252 -512 -148 -45 34 248 -375 5 -149
2199a49K64K37l39p0j53J27K04J7L4j86m04M3N43m38K20K46o12K89J54O0Q0m04
$$ -149 115 352 13 -57 -210 -83 121 138 172 -14 -418 -375 168 -270 -50 196 -416 -127 27 87 167 -237
2221b37J62J19l22K44J85k43o1k7OM99k08L30m92k0P1J26K82o1o63k5N44l28J95
$$ -237 -75 44 -278 -34 151 -92 -153 -180 -174 325 117 447 -45 -65 6 132 414 353 -310 -335 209 -119 76
2244G6K83k73m8j0L0J34j7j09k99J7L74k00L34k77j43J16k15M87P8j95k17k37
$$ 76 359 86 38 28 58 192 175 66 -233 -216 158 -42 292 15 -128 -12 -227 260 338 143 -74 -311
2266c11qO74j46l76om5K0L04o0K04m48P6n5K68J53j91j75k61K78K15o3k86J71
$$ -311 -319 355 209 -167 -173 -218 -198 106 46 250 -198 -122 -177 91 244 53 -122 -383 -105 110 47 -239 -68
2289f8j64O9Q6K09K28l08k83l1O12n67L71m19K30pR5L63j71m02p0j71K72L94K10
$$ -68 -232 -163 -77 132 360 52 -231 -262 350 -217 154 -265 -35 -42 53 416 245 -157 -227 -398 -126 268 478
2312D78l58j71k81K47P9J12K89n36L9O1K15J02j71k14L5RL52J12j54q7j74l89
$$ 478 120 -51 -332 -85 -6 106 395 -141 -102 -41 174 276 105 -109 -74 -65 287 399 245 158 -16 -405
2334d05N13q6j16Q0j4q7k31N75r2l62L19l97J91K75j63P4j37j56K5N11n17M6j15
$$ -405 108 22 -94 -14 -28 -115 -346 229 137 -225 94 -303 -112 163 0 74 -63 -219 -194 317 -200 -154 -269
2357b69KJ70N1Q2N3k26n9k44L28L02k12j74k07N5L30J86j31j82n14M61L88L5k48
$$ -269 -267 -97 -46 36 89 -137 -196 -440 -112 190 -22 -196 -403 -348 -18 168 37 -145 -659 -198 190 225 -23
2380b3N1k59P9j2M58q5k14m1k58K09K74ml26J23k65M86j73L02j39m47J97n3j55
$$ -23 28 -231 -152 -164 294 209 -5 -46 -304 -95 179 175 -151 -28 -293 193 20 322 183 -264 -67 -120 -275
2403b75P42m64k49K70k1J79M66o65J31j75J2N2R7P5l63J9J95J15l2J94m36J5M6
$$ -275 467 3 -246 24 3 182 648 -17 114 -61 -49 3 100 175 -188 -169 26 141 109 303 -133 -118 -72
2426g2J26K68j43j66J12o15O31j56J02q9m15L12J59j36J05K54l00J2J10mj3m2
$$ -72 54 322 179 13 125 -490 141 -15 87 -2 -417 -105 54 -82 23 277 -23 -11 99 95 82 40
2448D0o4n7p8K94P2j00m10J60n4L14j14j07J34m21L71j55K41j5l56J36M7K72K89
$$ 40 -24 -81 -159 135 207 107 -303 -143 -197 117 3 -104 30 -391 -20 -175 66 51 -305 -169 -122 150 439
2471D39l95j60R9r7J47K64l82K11k03M5L7K35J11l10k49q7K84L0N4j31J0j43l0
$$ 439 44 -116 -17 -114 33 297 -85 126 -77 -32 5 240 351 41 -208 -295 -11 19 73 -58 -48 -191 -221
2494b21N80j61r6k56j17K22K62n1Nl01l2M1L7N64m11k98K36k39K49L82m79L23
$$ -221 359 198 102 -154 -271 -49 213 162 167 -134 -166 -125 -88 476 65 -233 3 -236 13 395 -84 239
2516B39l32j32L18j9Rmpj34J6R5K06k94j05JR4L80l06jr0o1K4P4J00j01J03l41
$$ 239 -93 -225 93 74 83 79 72 -62 -46 49 255 -39 -144 -143 -49 331 25 24 -66 -127 -103 -29 71 -30 73 -268
2542b68J99K42n8r8k86K8K34p5J28j1p2k32K27l3J24p1k8j62J74K30k31M36n04
$$ -268 -69 173 115 17 -269 -241 -7 -82 46 35 -37 -269 -42 -75 49 -22 -50 -212 -38 192 -39 397 -107
2565a07J5J35j86M53m7n06P5L1O8L20k9k62Q0j30J98N5J57j07k83J46k43L48p
$$ -107 -92 43 -143 310 263 -243 -168 -137 -69 251 222 -40 40 -90 108 163 320 213 -70 76 -167 181 174
2588A74J05n39K10oL02O9j59%k19P2J04J4j16O2j70k7M62r0j5j56k65J87l74L69
$$ 174 279 -260 -50 -56 246 315 156 156 -63 9 113 127 11 73 -97 -124 338 248 233 77 -188 -1 -375 -6
2612fK53k96j21j62O04j15o6J76m69MJ95N9J93k29k31L14m26K67K33l48j07J09
$$ -6 247 -49 -170 -332 272 157 91 267 -202 -198 -3 56 249 20 -211 103 -323 -56 177 -171 -278 -169
2634a69m7J88J40J9j38n8m5O9k26M54o3k47k4L66k10P6M5k23q5m5K01K24k37K05
$$ -169 -216 -28 112 131 -7 -65 -110 -41 -267 187 124 -123 -147 219 9 85 130 -93 -178 -223 -22 202 -35 170
2658A70k22J04N7J82q3m36J71jo9N22l61r9L4L84k50R3k31n6J25j73K55k18L61
$$ 170 -52 52 109 291 208 -228 -57 -58 -127 395 34 -65 -31 353 103 196 -35 -91 34 -139 116 -102 259
2681B59J12k90R8q2M6p6p8j7J8k3J35R9L8o08J76J80J73k77O6L9k08K48l7N7j13
$$ 259 371 81 179 97 143 67 -11 -28 -10 -33 102 201 239 -369 -193 -13 160 -117 -51 -12 -220 28 -9 48 -65
2706f5m8q4r5M69j38k0m17M78j87J60r6j62kj89J3N18j10m9j26l1M14l98p6M98
$$ -65 -113 -197 -292 177 39 19 -398 80 -107 53 -43 -205 -207 -396 -383 135 25 -24 -150 -181 233 -165 -241 257
2730B57j40l53K70r1K38j53r6k3j94L08K00j12j14j7j97K01J45M7k68j56K11J97
$$ 257 117 -236 34 -57 181 28 -68 -91 -285 23 223 111 -3 -20 -217 -16 129 176 -92 -248 -37 160
2752A60J59qn31M9j4q2M28j11J35j87L0j31R1M02k55l17J05J97o6L1J70j79J70
$$ 160 319 311 -220 -171 -185 -267 161 50 185 -2 28 -103 -12 390 135 -182 -77 120 54 85 255 76 246
2775B46k73R0J39k48j64L05j47L0K36L1k43k12J6K71J6j32Q0j34J49j66P7L08
$$ 246 -27 63 202 -46 -210 95 -52 -22 214 245 2 -210 -194 77 93 -39 41 -93 56 -110 -33 275
2797B75k76nj24J66K1o9m1j09l59K29L58P7k4l10J4J44j92M12l6k3n5k43J83o4
$$ 275 -1 -6 -130 36 57 -12 -53 -162 -521 -292 66 143 119 -191 -177 -33 -225 187 151 128 73 -170 13 -51
2821e1m6l0J82m56M65K0j80Lk4J91o5L7J63j88K07n1l15N40l09k55J03K48k85
$$ -51 -97 -127 55 -401 64 84 -96 -93 -117 74 9 46 209 21 228 177 -138 402 93 -162 -59 189 -96
2844i6K01r4O0j93m6Q4K97j9Qj76M6p2J27J04k58k7J34k75O5L11l03K9P1o7J41
$$ -96 105 11 71 -122 -168 -84 213 194 202 26 72 0 127 231 -27 -54 80 -195 -130 181 -122 -93 -22 -89 52
2869E2ko2k20j67J06J28K0L31j72M3jj36L95m21Q3j42n9N7J19N7l9J05m01O5M54
$$ 52 50 -12 -232 -399 -293 -165 -145 186 14 57 56 -80 315 -106 -23 -165 -224 -167 -48 9 -30 75 -326 -261 193
2894A93M3k99o7O4R7k17J24L9J8l97L98J23oj88K92n41L30k3K20l6k29J3n4l6
$$ 193 236 -63 -130 -66 31 -186 -62 -23 -5 -402 -4 119 113 -75 217 -324 6 -17 203 167 -62 -49 -103 -139
2918a39M45l2m36J09j91L47K3O9k62M0k15K17Q4N4p2j22l4K4J37J67k69K51k87
$$ -139 306 274 -162 -53 -244 103 126 195 -67 -27 -242 -25 59 113 41 -81 -115 -91 46 213 -56 195 -92
2941i2m6K71j1k91L83k07j58K58J06j88K21j72r4k5K70J67k76K9k98J68N9K19
$$ -92 -138 133 122 -169 214 7 -151 107 213 25 246 74 -20 -45 225 392 116 145 -153 15 74 293
2963B93ol33M3j2J23R1P4l01q1L81k26r8j6m0k1j82J60N33j42m10L08l52K60j8
$$ 293 287 -46 -3 -15 108 199 273 -28 -109 272 46 -52 -68 -108 -129 -311 -151 382 240 -170 138 -214 46 28
2987B8j74J34j11k11N19l4J53o01m8O00m49K72j02M4j52n9K69J30m7j73j1r3R6
$$ 28 -146 -12 -123 -334 185 151 304 -297 -345 255 -194 78 -24 20 -132 -191 78 208 161 -12 -23 -116 -20
3010b0R6j17J61p3J39n16K15M68k73p2l3p5J56J98j13j29j91J92J40j22J92k86
$$ -20 76 -41 120 47 186 -330 -115 353 80 8 -25 -100 56 254 141 12 -179 13 153 31 223 -63
3032f3k59K87M0K27l59K67k60j76M93K7K71m63Q9k69k0K57k85O9K6J03J01n4K94
$$ -63 -322 -35 5 232 -127 140 -120 -296 197 224 495 32 121 -148 -168 89 -196 -127 -101 2 103 49 343
3055C43l80j5O2M7j61K29O8l70p6M1L32P9j4k31k52M01N6j82L42l52j14P1J06
$$ 343 -37 -52 10 57 -104 125 193 -177 -253 -212 120 199 185 -46 -298 103 159 -23 319 -33 -147 -76 30
3078C0o1J07l59J89k25L28J01Q7l73R9k77J84M55j91%k65j36M47J46k74k32q1
$$ 30 -31 76 -283 -94 -319 9 110 197 -176 -77 -354 -170 285 94 94 -171 -307 140 286 12 -220 -301
3100c01L00l3k6M01m25P0k13P0J94J95j04r6j16J34r9L4J19j30K15pk83L94j50
$$ -301 -1 -34 -60 341 -84 -14 -227 -157 37 232 128 32 -84 50 -49 -15 104 -26 189 182 -101 293 143
3123A43k59L83k89N2K44j61j36O3k18K14J47m15J82J05k67K97j40K9oL9jP6n0
$$ 143 -116 267 -22 30 274 113 -23 40 -178 36 183 -232 -50 55 -212 85 -55 -26 -32 7 6 82 32
3146C2N0j85j2P5j53N31k75l9l19J6J77j86K49k8j76M9pJ4L66k44Q7j58K72k63
$$ 32 82 -103 -115 -40 -193 338 63 24 -295 -279 -102 -288 -39 -67 -243 -194 -201 -187 179 -65 22 -136 136 -127
3170a27Q3M5Kk13j04L87l9J8m8J9j40K60k0o7p1j92K52q7O4q4j00R4j64L03k51
$$ -127 -44 1 3 -210 -314 73 34 52 4 23 -117 143 123 56 -15 -207 45 -42 22 -62 -162 -68 -232 71 -180
3195a80J50J7J97l42L17m1j74J38l9j57r0K70J14j95k7j36j94O93k56J04k79K4
$$ -180 -30 -13 184 -158 159 118 -56 82 43 -114 -204 66 180 -15 -42 -178 -372 321 65 169 -110 -86
3217h6K8J43j26N32n15j05J82j21J10M8K47j83k79r4L61O9R9l97j0J69J60k42
$$ -86 -58 85 -41 491 -24 -129 53 -68 42 90 337 154 -125 -219 142 211 310 -87 -97 72 232 -10
3239a0J01j9PJ37m06L95L89o09O1j93K31J77k86J35k24P7LJ97r9l2p2l3j05J91
$$ -10 91 72 79 216 -190 205 594 -15 46 -147 84 261 -25 110 -114 -37 -34 163 64 32 -40 -73 -178 13
3263A3K6P6l59P4K34p0O5j31R2k97K3K33J72o4N9k95O0J41j43R0j94L38l46J70
$$ 13 39 115 -244 -170 64 -6 59 -72 20 -277 -254 -21 151 87 146 -149 -89 52 -91 -1 -195 143 -203 -33
3287c3k33L14j42m3j4Oo2L29L9k57o5K06J53m6k67n5N7J58m6L79l17r8O5j56o
$$ -33 -266 48 -94 -137 -151 -145 -207 122 161 -96 -161 45 198 152 -115 -170 -113 45 -1 378 61 -37 28 -128 -134
3312a34O11m68K21m26J54J12L1j83R7L29m10P2q4R3k19L06l68L06K09j05j55o
$$ -134 477 9 230 -196 -42 70 101 -82 15 344 -66 6 -78 15 -204 102 -266 40 249 144 -11 -17
3334a7k45J72P0K73k34M4j77K2J30k7RP1j0k39J15k5J16j77m1J12j4Nj45J89l01
$$ -17 -262 -90 -20 253 19 63 -114 -92 38 11 20 91 81 -158 -43 -68 48 -129 -170 -58 -72 -67 -212 -23 -324
3359c24L14nQ9L9k62n8K05j06J6L42l34j05N6K59n8j2l13K73j47O1K43k45J63
$$ -324 -10 -15 74 113 -149 -207 -2 -108 -92 250 -84 -189 -133 126 68 56 -257 16 -131 -70 173 -72 91
3382I1P0m09J10J62J21j13j87J4N2K27K3j43M0Q5l68L01k90N39k63l17J69K34
$$ 91 161 -248 -138 24 145 32 -155 -141 -89 138 161 18 58 143 -225 76 -214 325 62 -255 -86 148
3404A48Q4l18j30M45m5p8k86J54ok42K25j04n4R9N12k96l68O76n03L15k98K9m0
$$ 148 232 -86 -216 229 184 106 -180 -26 -32 -274 -49 -153 -207 -108 404 108 -260 416 -87 228 -70 -41 -81
3427h1j19K57lJ1j55J3K21o8j08j62j02N63j39j55j07M43M4l67M87n80m4N86p96
$$ -81 -200 57 54 65 -90 -77 144 76 -32 -194 -296 267 128 -27 -134 309 353 -14 473 -107 -151 435 -361
3450c61K73j43J55K90Q9k93m06K19L53m88N24l10K19O0Jm2m2J13l87K00l89K46
$$ -361 -88 -231 -76 214 303 10 -396 -177 176 -312 212 -98 121 181 182 140 98 211 -176 24 -365 -119
3472a19L76m25N25j16l18O36o28L48k81J33J76Kl80K38L7l98L6K21L8R1l91q8
$$ -119 257 -168 357 241 -77 559 -69 279 -2 131 307 309 -71 167 204 -194 -158 63 101 192 -199 -287
3494b87N62l33L56M5n7j53n28M11nK07k84J20J81j18n9M26l62n36O19o13N53l6
$$ -287 275 -58 298 343 286 133 -395 16 11 218 -66 54 235 117 58 484 122 -414 205 -408 145 109
3516A09k28L52m27m6J93N90r66M30k62M6R8m3M87m37Q0L10k81J85M66o08L75l22
$$ 109 -119 233 -194 -240 -47 543 -423 7 -255 -209 -111 -154 333 -104 -24 286 5 190 656 48 423 101
3538A01j48K52k73K26l28J12N2j23j81N75k53K11q26N43R8l63M26n20j94O58j92
$$ 101 -47 205 -68 158 -170 -58 -6 -129 -310 265 12 223 -603 -60 38 -325 101 -419 -613 45 -147
3559a47RK95l89L98j85o1k44n1O59K5k59N37m98j17qM6O18j020P22J94k22l83
$$ -147 -138 157 -232 166 -19 -80 -324 -375 284 309 50 587 89 -28 -36 10 628 -392 330 524 302 -81
3581h1M81j05o54M31L71K14o04k23N34l03j45N00o16K19L68k62l6n01L75k08M29
$$ -81 400 295 -359 72 443 657 53 -170 364 61 -84 416 -200 19 387 125 89 -412 -37 -245 184
3602A84l55J73pr0J03M20j61m94j48M34j61L15j48l32P9K70o8J46k99P2m85M28
$$ 184 -171 2 -5 -95 8 428 267 -227 -375 59 -102 213 65 -267 -188 82 14 160 -139 -67 -552 -124
3624a24L2O6M12n25p1K90l28J06M46k38n49M92k54L21j47R7l02RL18r7K75P4m83
$$ -124 -92 -26 386 -139 -210 80 -248 -142 304 66 -483 9 -245 76 -71 26 -276 -267 51 -46 229 303 -180
3647a80k01K39N5R5Q8K0k38M3J38J26m7j14o0k11L88k2j07L57l55l60N95J12m04
$$ -180 -381 -142 -87 8 96 116 -122 -79 59 185 138 24 -36 -247 141 119 12 369 14 -346 249 361 -43
3670d3j79M58m50K49N88l14o40K43k32l01P02m85N46j43l28j57O37l95k1R8N47
$$ -43 -222 236 -214 35 623 309 -331 -88 -320 -621 81 -404 142 -1 -329 -486 151 -244 -265 -167 380
3691C80p44l37P62K09l62m53Q05N89o59k53l85N44M69l80K27K64q05J37L17l28
$$ 380 -364 -701 61 270 -92 -545 260 849 190 -63 -448 96 565 185 412 676 -129 8 325 -3
3711cr6o6J47m7J92l00J16J61k44L07j41r7J24j20MJ11k68J97p1Q6l15j6Q3L84
$$ -3 -99 -165 -18 -65 127 -173 -57 104 -140 167 26 -71 53 -67 -63 48 -220 -23 -94 -8 -323 -339 -256 128
3735A28k91K39L3m03R7j39L60o7mP1l14OL53J00k4j36k25J78p1L85M3l01q4m5
$$ 128 -163 76 109 -294 -197 -336 24 -43 -47 24 -290 -284 69 169 145 9 -216 -38 -109 276 319 18 -66 -111
3759a11Q5K47N4j91j2j24J73O5N2l3l46P7J45j40J43qj02ml5K18Q6j69m15L71
$$ -111 -26 221 275 84 72 -52 121 186 238 205 -141 -64 81 -59 84 76 -26 -30 -65 153 239 70 -345 26
3783B6M9n5K68l25l28J17J50J76J26k19m9o7K95j40lJ78j79q6j64N2L25l32K31
$$ 26 75 20 288 -37 -365 -248 -98 78 204 -15 -64 -131 164 24 21 199 20 -66 -230 -178 147 -185 46
3806D6k02j00N74l29j0L13m72j63J22qJ94J02k19j7oQ7J3K92k87j88j8K00J9j10
$$ 46 -156 -256 318 -11 -21 292 -180 -343 -221 -229 -35 67 -152 -169 -175 -88 -75 217 -70 -258 -276 -76 -57 -167
3830a67l0M6J56Q2k4l1q1R1n2N0K4lQ8k34l04K04K88j07J12j32l7K10j0k4j09
$$ -167 -197 -151 5 87 63 32 -49 42 -10 40 64 61 149 -85 -389 -185 103 -4 108 -24 -61 149 139 115 6
3855FJ2J09q3q4K52r2K72m49P6j40J49k74N47l60m0K88L8n5j85l9Q9J64k0Jm14
$$ 6 18 127 44 -40 212 120 392 -57 19 -121 28 -246 301 -59 -99 189 227 172 -13 -52 37 201 181 182 -232
3880b32O4j43J25M68m02K27j26k28M13l2j42L4m37L98j17K33p9R7j25p8k55L50
$$ -232 -168 -311 -186 282 -120 107 -19 -247 166 134 -8 26 -411 -13 -130 103 24 121 -4 -82 -337 13
3902A3K5k64L63l78K1L61k2K0m3m59M89j32K7q9k77K55j47K38k1j35j64K26k76
$$ 13 38 -226 137 -241 -220 141 119 139 96 -363 126 -6 21 -68 -345 -90 -237 1 -20 -155 -319 -93 -369
3925c69K07K05m2K55m75LJ59K97j44k7K3j91K6k26N62m3m85K36K2M9n2n7L73k15
$$ -369 -162 43 1 256 -219 -216 -57 240 96 69 92 -99 -73 -299 263 220 -265 -29 -7 42 -10 -67 306 91
3949I1j16L9R8L10j39m39K60K8k9J60m49L82k52k0K93j73n6k0n3L6L44r4j51j53
$$ 91 -25 14 112 422 283 -156 104 132 103 263 -186 196 -56 -76 217 44 -12 -32 -85 -49 295 201 50 -103
3973a03j05L49j43K67k52j34k17J01O5L11l08pJ39q5j0L44j25n83N23j62J02q5
$$ -103 -208 141 -2 265 13 -121 -338 -237 -172 139 -169 -176 -37 -122 -132 212 87 -496 27 -135 -33 -118
3995a18R9j08j9J46j57N4J39j00L3r1j62N39o0m28K16m37M88M75o60Q7k41j5L48
$$ -118 -19 -127 -146 0 -157 -103 36 -64 -31 -122 -284 255 195 -233 -17 -454 34 509 -151 -64 -305 -320 28
4018B8J46M9k25N8r3P2K80K2l92%q2K15M3J19m47M31j86l6L4K77k02j59K11j04
$$ 28 174 223 -2 56 -37 35 315 337 -55 -55 -137 78 121 240 -207 224 38 2 36 313 111 -48 163 59
4042E9M5l0m1l6L5j16K42k26P2K32k69k5M10j32j77Q9j71j1k29N92l19J15J96
$$ 59 104 74 33 -3 32 -84 158 -68 4 236 -33 -58 352 220 43 132 -39 -50 -279 313 -6 109 305
4065C05n82L56p8p5M9l5k55N4N1J55P8O2m72L46o7J35j22J28j93j80K87J45j14
$$ 305 -277 79 1 -74 -25 -60 -315 -261 -210 -55 23 85 -387 -41 -108 27 -95 33 -160 -340 -53 92 -22
4088b2L9j73N7R7k69J95P2Q6k70L47k30J20n0j98K39j92RP5o9M08n9j59R4k22
$$ -22 17 -156 -99 -2 -271 -76 -4 82 -188 159 -71 49 -1 -199 40 -152 -143 -68 -137 271 212 53 147 -75
4112g5K48J1m29J68m4K29n5J50j12p4J46P0k99k7J16j36O06l45j67J94l76J40
$$ -75 173 184 -245 -77 -121 108 53 203 91 17 163 233 -66 -93 23 -113 493 148 -19 175 -201 -61
4134f1L39L2N9k19J4J16k11K39k05oj82k18P0M21J30k99l15n1M93Rj83J19j37
$$ -61 278 310 369 150 164 280 69 308 103 97 -85 -303 -233 188 318 19 -296 -347 146 155 -28 91 -46
4157d6k61K45J89L9r8m35N04j06J4J41p8j06l67K54k0k3j8K00l45J21J64n4K17
$$ -46 -307 -62 127 166 68 -367 137 31 45 186 108 2 -365 -111 -131 -154 -172 28 -317 -196 -32 -86 131
4180A31l00J03l26J91M14j62l75K34k29K38J22J02k49l34L25QM05m74K50m9k17
$$ 131 -169 -66 -392 -201 213 51 -324 -90 -319 -81 41 143 -106 -440 -115 -107 298 -176 74 25 -192
4201a92K92o8L04l28j84K93n2J11J74l14qL0m3j22J71L52j04j74p6k23J62L45
$$ -192 100 32 336 8 -176 117 65 176 350 36 28 58 15 -107 64 416 312 138 62 -161 1 346
4223C46m41J46k33K13j05J52n4J91m36j1L68l95L98Lk68%L44k96K02J3k44K55
$$ 346 -95 51 -182 31 -74 78 24 215 -221 -232 136 -259 139 142 -126 -126 218 -78 124 137 -107 148
4245A48K6O9k47O2j18J18p8Q1J45o8o0j39Pj0J76k57P6K43k64N9O0K1j60Q5P1
$$ 148 174 243 -4 58 -60 58 -20 61 206 138 78 -61 -54 -64 112 -145 -69 174 -90 -31 29 50 -110 -25 46
4270D6P5j12j24J94l21L07J89j26l4k14K20l9j18LK52k21j33j63K90K24L0k93
$$ 46 121 9 -115 79 -242 65 254 128 94 -120 100 61 -57 -54 198 -23 -156 -319 -29 195 225 -68
4292f8j19M9K17K46o10L50k32K87k59q0O18l90n2O1NQ7J02k02ok16K7M44j86r4
$$ -68 -187 -138 79 325 -285 65 -167 120 -139 -219 399 9 -43 18 23 110 212 10 4 -212 -185 259 73 -21
4316b1J99l18J24K3J17P0j35J6R1l27K00p4r4K00k16J36N2j67L24m08k7K09J07
$$ -21 178 -140 -16 7 124 194 59 75 166 -161 39 -35 -129 71 -145 -9 43 -124 200 -208 -235 -26 81
4339H1j25K30l13o0K65j49J75k0l20K75j96N92l84O5j66j58k0O8L2J00pj54J17
$$ 81 -44 186 -127 -187 78 -71 104 84 -236 39 -157 435 51 116 -50 -208 -228 -160 -128 -28 -35 -189 -72
4362g2R3L1J82m99j76L81J82pj53J72k2k91K52k74R7J38j9j60L59j73J03j20P7
$$ -72 21 52 234 -265 -441 -60 122 115 -38 134 112 -179 73 -201 -104 34 15 -145 214 41 144 24 101
4385A01Q0m3j47J01J9l16J17J53J34j16j30j15L67l80L64M4m68M96k16J65m28
$$ 101 181 138 -9 92 111 -205 -88 65 199 83 -47 -162 205 -175 189 233 -235 261 45 210 -218
4406b18Q8L00l19J09%j0M8j80k3J95j07M8K65k42J85k79l4J27r5K47j86k17M59
$$ -218 -130 170 -149 -40 -40 -50 -2 -182 -205 -10 -117 -69 196 -46 139 -140 -174 -47 -142 105 -81 -298 161
4429A61l59N6m1J5Q2j64M10j62J60j30j25j02K10k26L11k47K3j24M20l21J28j10
$$ 161 -198 -142 -183 -168 -86 -250 160 -2 158 28 -97 -199 11 -215 96 -151 -128 -252 168 -153 -25 -135
4451a35L1j41J06K44m0j28O4p0q5L59n6j58K3j36P8L8m7L00l66J42l6p1J36k20
$$ -135 -104 -245 -139 105 65 -63 1 -69 -154 205 149 -9 14 -122 -44 -6 -53 247 -119 23 -13 -84 52 -168
4475a68K82J3l47J08J59o8j05p0K67J92j85O4j19J3l2q0J4K49p6j46J86j85J67
$$ -168 114 127 -220 -112 47 -21 -126 -196 71 263 78 142 23 36 4 -76 -62 187 111 -35 151 -34 133
4498A33n6O5k37N1L4j7P3j03nq3J13j2M26l16j0j25r1K37k65J5M73l23j43J02
$$ 133 77 142 -95 -44 -10 -27 46 -57 -62 -145 -32 -44 382 66 56 -69 -160 77 -188 -173 300 -23 -166 -64
4522f4J31j60M3J58k90O6m8j8K56j75Q9M6l6q0J81j33p7R9k9j37P6K54k89K04
$$ -64 67 -93 -50 108 -182 -116 -164 -182 74 -101 -12 34 -2 -82 99 -34 -111 -12 -41 -178 -102 152 -137 67
4546F7j63Q2j15o0K88K8j71L70l33J34l2l55L75J39l42NL93m60J06M4L59m51l91
$$ 67 -96 -14 -129 -189 99 127 -44 326 -7 127 95 -260 115 254 -88 -83 310 -150 -44 0 359 -92 -483
4569d83L99J05K97k8l35J71j43O6j33J96m7j3k44j60P17m53k6j02J69J63k17J70
$$ -483 -84 21 318 290 -45 126 -17 49 -84 112 65 52 -192 -352 365 -88 -114 -216 -47 116 -101 69
4591F9L3j40L32n81K25K19n2m6k35j9M07L8j61j40j56Q1L35j07j26j60P8K53l41
$$ 69 102 -38 294 -287 -62 157 105 59 -176 -195 212 250 89 -51 -207 -126 209 102 -24 -184 -106 147 -194
4614a94J38N8j35J49N3j40J50q2j1l57K6J89L2K0K00l3j73K17j13J88p1j66j87
$$ -194 -56 2 -133 16 69 -71 79 -3 -14 -371 -345 -156 -124 -104 96 63 -110 107 -6 182 111 -55 -242
4637b42N18m17J71N3k04j76J02K95j25K97k47k68N08k42J26n1j18l0J81l52L43
$$ -242 276 -141 30 83 -121 -297 -195 100 -25 272 25 -243 265 23 149 98 -20 -50 131 -221 122
4658A22J16j49k0j6m20N05r4n4J16o6K37l14J26J66n12L78M1k13L4k2NJ54J8k12
$$ 122 238 89 69 53 -367 138 44 -10 106 40 277 -37 89 255 -257 121 162 -51 -17 -39 -34 120 138 -74
4682g4K24O3j30j28J88j38N5J05m45K21N6J59N8j04r6n8M5q6j00L85l00Mk63M70
$$ -74 150 213 83 -45 143 5 60 165 -280 -59 -3 156 214 110 14 -44 1 -85 -185 200 -100 -96 -359 111
4706A11r1J38K37m86R9K20m86K50K04k12O8mk8o3J42o3r2l12N74j84j75j59Q16
$$ 111 20 158 395 -91 8 228 -258 -8 196 -16 52 48 20 -43 99 36 -56 -368 206 22 -153 -312 504
4729E04p01O57n88k01M13K11j377J169K97q62l08L77O61p35Q80k92K04q86N89
$$ 504 -197 460 -128 -329 84 295 -1082 87 384 -478 -786 -409 252 -483 397 105 309 -577 12
4748A2j94L33j68K55k46o1r2L7J95j56j53J03l3L56P6k03J04k59j0l0L94m27j0
$$ 12 -182 151 -17 238 -8 -69 -161 -124 71 -85 -238 -135 -168 188 264 61 165 -94 -104 -134 260 -167 -177
4771a77J89o7j33N25m18M2j95J90k3P0L0P1k21l23K32K22nq5j71m7L64K4j6j34
$$ -177 12 -55 -188 337 -81 -39 -234 -44 -67 3 33 104 -117 -440 -208 14 9 -76 -247 -294 70 94 78 -56
4795e6P8L36l03l91M63j64n9J07L7o4r0j20L09j99K17P1j85p9R4n3k1k00J51J97
$$ -56 22 358 55 -336 127 -37 -96 11 48 -16 -106 -226 83 -116 101 172 -13 -92 2 -51 -72 -272 -121 76
4819G6m5k61J39L49j08l19L41k63K23j73J94j06o5R8j95K99l55M06r2j92k0K07
$$ 76 31 -230 -91 258 150 -169 172 -91 132 -41 153 47 -18 80 -115 184 -171 235 143 -49 -69 138
4841A38k55P1J86p1n5k9oOJ10Jk68J35j49K99O0j80J59K2o9J5P1k88Mj61L17k0
$$ 138 -117 -46 140 69 14 -15 -21 -15 95 96 -172 -37 -186 113 173 -7 152 174 105 120 191 -97 -93 -254 63 43
4867D3p0l6L2M9J52l9j16O7l72M85j37O1J2j30l2m5nP9J26q0j17OQM1j86J47O6
$$ 43 -27 -63 -31 18 170 131 15 82 -290 195 58 119 131 1 -31 -76 -81 -2 124 44 -73 -67 -59 -18 -204 -57 9
4894Ir3L78k20j00J36k52K25j52Q5k03K83K3k74Q4j5K84k51J75k82J90k48P6J39
$$ 9 -84 294 74 -26 110 -142 83 -69 16 -187 96 119 -155 -71 -86 198 -53 122 -160 30 -218 -142 -3
4917cO5P8k61nK46k74J94j10J01m6K13j61j26K29p3k24J80J3n4k51j7L31j36J87
$$ -3 62 140 -121 -126 120 -154 40 -70 31 -15 198 37 -89 140 67 -157 23 36 -18 -269 -286 45 -91 96
4941I6J40m54PJM08p3j92P2J49k93r9J82J42J87k91L8j18lK09m0j17k0N1M4J10
$$ 96 236 -218 -211 -210 198 125 -67 5 154 -139 -238 -56 86 273 -18 20 -98 -101 108 68 -49 -69 -18 26 136
4966A36K96j91k39n4P5r4j2L4N7N8l5k26L37j8k2l94J28K4J22o2J09l0Kq4L3L3
$$ 136 432 241 2 -52 23 -71 -83 -49 8 66 31 -195 142 124 102 -292 -164 -140 -18 -80 29 -1 1 -83 -50 -17
4992a7j80P6j65L11j82M07n18L69Q7j42O9J04k56K4k51K96k71K56j62k72L71q5
$$ -17 -197 -121 -286 25 -157 250 -268 101 188 46 115 219 -37 -13 -264 32 -239 17 -145 -417 -46 -131
5014a31K22j73J8K39j42j76j52K3K85l9K24j05L1k77n3L0MJ38R0K9m3k0rj05O7
$$ -131 91 -82 -64 175 33 -143 -295 -272 13 -26 198 93 124 -153 -206 -176 -172 -34 56 85 42 22 13 -92 -25
5039b5K27l21k5J77m24K36J48K9j5o1p3J00JJ63k57j71K19J01M0K70j15k35L6
$$ -25 202 -119 -144 33 -391 -155 -7 22 7 -54 -127 -27 -26 137 -120 -291 -72 29 69 339 224 -11 25
5062B5Q8K6q7j02K18j72Ml6p9Q8J07K26n63L38j2m0m2q6K33k94l2J71J83k06k2
$$ 25 113 139 52 -50 168 -4 0 -36 -115 -27 80 306 -257 81 69 29 -13 -99 134 -160 -192 -21 162 -44 -66
5087f6K01o4j61J33j18j11j4L61k20L1j63J83m6k22M54k14J01k56Q7J87q7j42
$$ -66 135 71 -90 43 -75 -186 -200 161 -59 -28 -191 -8 -54 -276 178 -36 65 -191 -104 83 -4 -146
5109a46K16j22R8j04J59k37J42j77L34j15k65K59q1J73j30K85m77J28J42j81J01
$$ -146 70 -52 46 -58 101 -136 6 -171 163 48 -217 42 -39 134 4 289 -188 -60 82 -99 2
5130BP7j49K16j88J49p6j25J14J45m8j01J67m04K71j54K56p5m8j33L45n6k94N0
$$ 2 79 -70 146 -42 107 31 -94 20 165 117 16 183 -221 50 -104 152 77 29 -104 241 185 -109 -59
5153e9J52k66J89j02K08j86r7l8M16m2%k39P7K00o5J37l34k14L5M05l8l01K15
$$ -59 93 -173 16 -86 122 -64 -161 -199 217 175 175 -64 13 213 148 285 -49 -263 -228 177 139 -162 53
5176E3j22P9L%j25J70j80j27j0Q4K13o3j01J36Pj58Q8K56l76K26r7j19J34k3K55
$$ 53 -69 10 13 13 -112 58 -122 -249 -259 -175 38 -25 -126 10 17 -141 -53 203 -173 53 -44 -163 -29 -52 203
5201B03l58M07m13j6K74QQ5J6k55P7J24j69K22l96J18R7Pj3K97j79J47j92k07
$$ 203 -155 252 -161 -177 97 105 190 206 -49 28 152 -17 205 -191 -73 24 31 18 315 136 283 91 -116
5224a16M3j02M24l21L82m19J96k07j49M09q6q1p9K58k68K18k59L69l87L25j22
$$ -116 -73 -175 249 -72 310 -109 87 -120 -269 140 54 -27 -106 152 -116 102 -157 212 -175 150 28
5245B8j90O6J30k59K69o5l4J07j82J21n9J51P9p4o9j71J53j95m8N60l80K36k3
$$ 28 -162 -96 34 -225 44 -21 -55 52 -130 -9 -68 83 162 88 19 -152 1 -194 -242 318 -62 174 151
5268A51k75J59P8k44K22m3RJ02j44j73J50N0j18J01j32J87J38j75k16N4l0J18
$$ 151 -124 35 113 -131 91 48 57 159 15 -158 -8 42 -76 25 -107 80 218 43 -173 -119 -149 -31
5290c1K18l45J32K6k16M4J08M7o4p2L70l88K80j83J19K02j12k94J94L40l64J59
$$ -31 187 -158 -26 0 -216 -172 -64 -17 -81 -153 217 -171 109 -74 45 247 135 -159 35 375 11 170
5312A70k62J63p8P1l35N14l29J76m8J3R4k4l76O3n8M41o3m1l06J48Q6qJ91j75
$$ 170 -92 71 -7 64 -271 243 -86 90 42 55 149 125 -251 -188 -246 195 132 91 -215 -67 19 11 202 27
5336B7j23K12q0j28J13J40j51r3j27J46L09k21J40j50m8k3J02r2k23K27J5J3K13
$$ 27 -96 116 36 -92 21 161 10 -83 -210 -64 245 24 164 14 -34 -57 45 -47 -270 -43 -28 -15 198
5359A98k86Q6r6PJ43J41l81J17K38k20K67l49M34n12L00M8j79P0j69J32m14N90
$$ 198 -88 -2 -98 -91 52 193 -188 -71 167 -53 214 -135 299 -213 87 135 -44 26 -143 -11 -425 165
5381A65j03m6k89K37J04J67k33L6p6q1L33l8j51j04J34J80j88o5l4p2J92J3k9
$$ 165 62 16 -273 -36 68 235 2 38 -38 -119 214 176 25 -79 55 235 47 -18 -52 -124 68 81 52
5404E2n2K09n12L66K20nm15j8M43j65q3k11m5J33R8K84m02Q7K29j90m8Q5j73K38
$$ 52 0 209 -303 63 283 278 -137 -155 288 123 40 -171 -216 -83 15 299 -103 -16 213 23 -25 60 -113 125
5428A25l64J08N5J45nk05K8j8K22j17o2K57K18m06r4p6L2N6J07J10nJ07k11R0
$$ 125 -239 -131 -76 69 64 -141 -113 -131 91 -26 -88 169 387 -19 -113 -189 -157 -101 6 116 111 218 7 97
5452I7p5Q1l51M4L00J56j05k28j11M24l31J27J97l73J07L4M2m5J04rj81M40j88
$$ 97 22 103 -248 -204 96 252 147 -81 -192 232 -99 28 225 -148 -41 -7 35 -10 94 85 -96 344 156
5475A56j0k8p9j02L53j47j56l14M64m1K2o8P9q1p9O1j7m6L42j28k30J37j23O5
$$ 156 146 118 39 -63 290 143 -13 -327 137 96 118 50 129 48 -31 30 13 -33 309 181 -49 88 -35 30
5499C0o4n9p4p8R3K19O1O8k00J49l84K05r7O0j88M72l92J34J84j38Q9L0k33K2
$$ 30 -34 -93 -167 -245 -152 67 128 196 -4 145 -239 -34 -131 -71 -259 213 -179 -45 139 1 90 120 -113 -91
5523i1o3Q4J72p4k10J36J52k71J89Q9k83q9K4J38J18j66j9k8K47J22R4j98j42
$$ -91 -154 -70 102 28 -182 -46 106 -165 24 113 -170 -259 -235 -97 21 -145 -164 -192 55 177 271 73 -69
5546f9K6n4J39L5n4L9N8j60j44K80q8j55J55j77L1K13j88J08L6mo4q6R1m8J04
$$ -69 -43 -97 42 77 23 62 120 -40 -184 96 8 -147 8 -169 -138 75 -113 -5 31 27 -37 -123 -32 -80 24
5571B4q2m8J01r0J87k38nN0J26R9m0J9k09mL97l80L6K65l64L03l88J61K1N6R2
$$ 24 -58 -106 -5 -95 92 -146 -151 -101 25 124 84 103 -106 -110 287 -93 -57 208 -156 147 -241 -80 -59 -3 89
5596H9J28k29K31m35j7K32j9J19k49Q9Q2l5K4J42k96L45k14L7J09k53Q4J16k27
$$ 89 217 -12 219 -216 -233 -1 -20 99 -150 -61 21 -14 10 152 -144 201 -13 24 133 -120 -36 80 -147
5619a47R5k5K24k57N9l9J29l07L11j2J67j42k27K90k50K71j06j06K70l38J60J44
$$ -147 -52 -77 147 -110 -51 -90 39 -268 43 31 198 56 -171 119 -131 140 34 -72 198 -140 20 164
5641A64k92K21pj94j12K87p4K52l24k53M79l6j86J21j41J33J27l02K75k37L53
$$ 164 -128 93 86 -108 -220 67 -7 245 -79 -332 147 111 -75 46 -95 38 165 -137 138 -99 254
5662B54l23k53M82j00P4p1k9l14L07l0L0p5p8J17N5j9K8j20L9%j55O4K34p3N1
$$ 254 -69 -322 160 60 134 63 34 -280 27 -3 27 -48 -126 -9 46 27 55 -65 -26 -26 -181 -117 117 44 95
5687I5p2N7j57J53O4k5m4k15K27J38m4k80J79J3l52L77j68J01l5N6k26K59l60
$$ 95 23 80 -77 76 140 115 71 -144 83 221 177 -103 76 89 -263 114 -54 47 12 68 -158 101 -259
5710b59J50J15k66K90n6j18K16k47L21l36K02j0k02K20o9o4K8m9J58o6mJ35j18
$$ -259 -109 6 -260 30 -26 -144 72 -175 146 -190 12 2 -200 20 -49 -113 -85 -134 24 -42 -46 89 -29
5733b9n3J46j34K05j1m12L46j43L5Lj83J10J2nk2M11j75K6k23n3L60m59M37J44
$$ -29 -82 64 -70 135 124 -288 58 -85 -50 -47 -230 -120 -108 -113 -135 276 101 127 -96 -149 211 -248 189 333
5757C33k26J44l78J55K50l49J6j1O7K18k60oK18k20P1q0j33J40M1P2K16j86J13
$$ 333 107 251 -127 28 278 -71 -55 -66 1 219 -41 -47 171 -49 22 -58 -191 -51 -10 62 278 92 205
5780B05p0j41O7k83K23K2q6J38J7K0k40K77p9P0j96K3J06M1O7j38QM7k8o8J9j31
$$ 205 135 -6 61 -222 1 23 -63 75 92 112 -128 149 70 140 -56 -33 73 114 181 43 51 98 70 2 21 -110
5806a10j3R7k3J2R9J32j41j41J7K87k97l8p5K70j0nj68J16K77n73K48Q7k2o7J2
$$ -110 -123 -26 -49 -37 62 194 53 -88 -71 216 -81 -119 -194 76 66 61 -107 9 286 -287 -39 48 26 -41 -29
5831b9J64j44J31l96K50L3K54o6r1K6N2l73L33O1k30j2J0K0r4K98n07L56j19J00
$$ -29 135 -9 122 -274 -24 9 263 197 106 132 184 -189 144 205 -25 -37 -27 -7 -101 197 -310 46 -73 27
5855B7j30k6m1j47N06j80k01J88N4k60K61j21J32J79l50K26o3Pj1M1k50J93n5
$$ 27 -103 -129 -170 -317 189 9 -192 -4 50 -210 51 -70 62 241 -109 117 54 61 50 91 -159 34 -21
5878b1J29j13L3j07M6J04R1k73K36l6j02l32P5J64K27p4k9j3l02K26N6J34k07
$$ -21 108 -5 28 -79 -33 71 162 -111 125 89 -13 -345 -270 -106 121 47 18 5 -297 -71 -15 119 -88
5901h8R8l8J33P7l29J15J61k79J34J5P8j81J78r5j38K22j47K97k99N5k37J57L99
$$ -88 10 -28 105 182 -147 -32 129 -150 -16 -1 77 -104 74 -21 -159 63 -84 213 -86 -31 -268 -111 288
5924B88k46Rj0j71N0J43l57P9M91k12j3k7r4J93k13o1L73j54j10J6j47K59J1Q9
$$ 288 42 51 41 -130 -80 63 -294 -215 276 64 51 24 -70 123 -90 -151 222 68 -42 -26 -173 86 97 186
5948A86k0kl17K61m4j17m3R8j35l6J09M13n34L01j47lo6J32k16J25n0J96n9J11
$$ 186 166 164 -153 108 64 -53 -96 2 -133 -169 -60 353 -181 120 -27 -30 -96 36 -180 -55 -105 91 32 143
5972A43j41M1nk5L9J32n19L02N7p8j68L65O2k75J51j57J14O1J78o16K14J20N5
$$ 143 2 43 38 13 52 184 -335 -33 24 -54 -222 143 205 -70 81 -76 38 99 277 -339 -125 -5 50
5995E0m3l27M45p9j01j53L35R5k63J96l98N2J39l5J41P7j92L4J08r8J5J30k34
$$ 50 7 -320 125 46 -55 -208 127 222 -41 155 -243 -191 -52 -87 54 131 -61 -27 81 -17 -2 128 -106
6018a06L5K8K23j46r8J99o7j66J73R0l57K6K90l60J83K07n2J0J34k70O8J0O8J2
$$ -106 -71 -43 180 34 -64 135 68 -98 75 165 -192 -166 124 -236 -53 154 102 112 246 -24 44 54 122 134
6042A34j55J82j49K8r8mQ8r8N6O3o3jj61J7J78J17p5m2o2K95j25k66J53L0K1j40
$$ 134 -21 161 12 40 -58 -62 26 -72 -16 47 -16 -17 -178 -161 17 134 59 17 -45 250 125 -141 12 42 63 -77
6068g7O1K45o43L44J69l3lj9N1j16q6l7Q8k9K49l74J44J02p4j09J99P6k09n7K95
$$ -77 -16 229 -414 -70 99 66 63 44 95 -21 -107 -144 -56 -85 164 -210 -66 36 -38 -147 52 128 -81 -138 157
6093A57j86pN1j24J34k07R9J48j36N6J03l79J50J49j29L52j77n6K29m91L39Q6
$$ 157 -29 -36 15 -109 25 -182 -83 65 -71 -15 88 -291 -141 8 -121 231 54 -2 227 -264 75 161
6115A61j40r4J24J39k88L22r5l58K44R7j65J38r9j23j32K19J10k29L31r5n3j23
$$ 161 21 -73 51 190 -98 224 129 -229 15 112 -53 85 -14 -137 -269 -50 60 -169 162 67 14 -109
6137a09L40j54k30N1j23p3L51n2Q2k00J19k3k08M24k83j22L72j99lR5k54K67K79
$$ -109 231 77 -153 -102 -225 -298 53 1 83 -117 2 -21 -229 195 -88 -210 162 -37 -40 55 -199 68 347
6160C47m24J8l8J94j33k31L63k0p2K78l73J07o4l3Q1L9J48l07J13j17J97k2j11
$$ 347 -77 -59 -97 97 -36 -267 96 76 4 282 -91 16 -48 -81 0 39 187 -120 -7 -124 73 51 -60
6183f0r3J95k63J36m7K14j14J75K7m52K84J61q3k21K40m4P2k27J67J7j43K2K92
$$ -60 -153 42 -221 -85 -132 82 -32 143 170 -282 2 163 80 -141 99 55 127 -100 67 84 -59 -37 255
6206B55k48J18k43N10k54k20k9K31L4j95k6J25k30R3J75j71L04r4k52PJ56P8m9
$$ 255 7 125 -118 392 138 -82 -111 120 154 -41 -67 58 -172 -79 96 -75 229 135 -117 -110 46 124 75
6229G5m0k40K72j20M9j40M5J54R1o9J45k79N4J08j30m8p5N18m48MK43j07J26q4
$$ 75 35 -205 67 -53 -4 -144 -99 55 146 77 222 -57 -3 105 -25 -73 -148 370 -78 -74 169 62 188 104
6253A04j6p5J33l58J18j85M90j29l10K20q9qR6P4l46M64j69k64M91k04Q0J45j19
$$ 104 88 13 146 -212 -94 -279 211 82 -228 -8 -97 -105 -9 65 -281 183 14 -250 241 37 117 262 143
6276A43k85K27j65J20l16N94l46k22N8L38k15K78k11K15j12j93p1LK06N3O0j30
$$ 143 -142 85 -80 40 -276 318 -28 -250 -192 146 -69 209 -2 213 101 -92 -163 -160 46 99 159 29
6298B9n7n9K34l69J8M50j35k21Q1J09j23p9K08k2r4l6K54j81m0%M3k10K71k14
$$ 29 -28 -87 147 -222 -204 246 111 -110 -29 80 -43 -122 86 64 -30 -66 188 7 -33 -33 10 -200 71 -143
6322a43J30k14L50o4j31Q8o9J63j06J27j89j86J36K34k48K70j27O8k61J40j26
$$ -143 -13 -227 123 59 -72 16 -53 110 4 131 -58 -244 -108 126 -122 148 21 89 -172 -32 -158
6343a58L29J27l39k25J95J05Qj47J55L2j64M3j36M3J73mk98R8J64J43k65O2L1
$$ -158 171 298 -41 -266 -71 34 42 -105 50 82 -82 -39 -175 -132 41 37 -261 -163 1 144 -121 -59 -28
6366b8j67Q0J5K11m2N7Pk10m3p2N6J02J06k17R6K29j51j52O2P9n3j67K08k01l0
$$ -28 -195 -115 -100 111 69 126 133 -77 -120 -192 -136 -34 72 -145 -49 180 29 -123 -61 18 -35 -202 6 -195 -225
6391b25L71l00J55k03K42P1O3l5P4j74qJ5J8p5o3J87k98R3pJ64L6P2j56j93L90
$$ -225 146 -154 1 -202 40 111 174 139 213 39 31 46 64 -11 -74 113 -185 -92 -99 65 101 173 17 -176 214
6416B14k35k2j35L24J22k43j10J14j00K33k76J33j85L69m52L97l08K79N8l99N23
$$ 214 -21 -43 -178 146 268 25 -85 29 -71 162 -114 19 -166 203 -249 148 -160 119 177 -222 301
6437C01j28j55Kl2k5K0J99q6j33k82L86j49J60N8K6k21J97k99J31M8m85K56J08
$$ 301 173 18 20 -12 -37 -17 182 96 -37 -319 67 -82 78 136 162 -59 138 -161 -30 18 -467 -211 -103
6460a03p3n4M36j74j29P6k8K02l21K83MP9o9j22J74O6m43J65o6k3n4L04j18l3
$$ -103 -176 -230 206 32 -97 -21 -49 153 -168 115 119 198 129 7 181 247 -196 -31 -97 -120 -174 130 12 -21
6484b1R6l5p0j13Q3j3j28K35L1Q2j23Q6L9k68K67o2Q8j94j9J08p5o1J06j42J58
$$ -21 75 40 -30 -143 -60 -73 -201 34 65 147 24 110 149 -119 148 86 174 -20 -39 69 -6 -67 39 -103 55
6509E5j65q3N21j33j31Q0J22lj65j67P1k13J37J10j93K40j21K29l73J81j87J17
$$ 55 -110 -193 328 195 64 144 266 263 98 -69 2 -211 -74 36 -157 83 -38 191 -182 -1 -188 -71
6531g1O3J24K1j05j41j09K1K16j83L65lk14Q2j16L13j48j90J83l40J41O8o4k5
$$ -71 -8 116 137 32 -109 -218 -197 19 -164 201 198 -16 66 -50 263 115 -75 108 -232 -91 -23 -87 -112
6554a12l9L8J58J38k00J25k69RJ62oj49L35j20k36N9J44m5k15K13J85j74J8P6
$$ -112 -151 -113 45 183 -17 108 -161 -152 10 4 -145 190 70 -166 -107 37 -8 -223 -10 175 1 19 95
6577I5k5l82N03l64K21j91K95l04L26k11j95M20k93j99J39K89l03J08PJ25q4l5
$$ 95 70 -312 191 -173 48 -143 152 -152 174 -37 -232 188 -105 -304 -165 124 -179 -71 -64 61 -23 -58
6599e8q0K33j48K53j15p1J1K5p5K46k30L9K63j48k63J80k15L5J29N5J53q9M1k79
$$ -58 -138 95 -53 200 85 14 25 50 -25 221 -9 30 293 145 -118 62 -153 -118 11 66 219 130 171 -108
6623a08J4KR7P1k1J26K6O1l85k6J49k3l7K6J20m9n6k11L15q1j94K67rj45M65j95
$$ -108 -94 -92 5 76 55 181 207 268 -117 -143 6 -17 -54 -28 92 43 -13 -224 91 10 -184 83 74 -71 394 199
6649A99l7j10J79k78n2j1K12J7o8J36k32p9J42rjj48J14j22K26j15K31k13MJ7
$$ 199 162 52 231 -47 -99 -110 102 119 51 187 -45 -124 18 9 8 -140 -26 -148 78 -37 194 -19 -15 2
6673BM0J40j01k58K96k6j55P5o7n0J99j88R8k8J67J36q5l00Q3j13L32l15K10j47
$$ 2 42 182 81 -177 119 93 -62 13 -54 -104 95 -93 5 -23 144 280 195 -105 -22 -135 197 -118 92 -55
6697e5p2J76k71M07k02j11K13l17M32k43M3J7J17J61l71K57j26j06K26k42j88
$$ -55 -127 49 -222 185 -17 -128 85 -232 200 -43 0 17 134 295 -76 181 55 -51 175 -67 -255
6718b55K54J48k40j43J65J49l27J77Q3j53K33r1N6p5m3o1L2O2p9Q2j2L87l67j16
$$ -255 -1 147 -93 -236 -71 78 -249 -72 11 -142 91 0 56 -19 -62 -123 -91 -29 -108 -26 -38 349 -18 -134
6742a34J75p2J07j79j74J19K71j67n3J60j5j09K60k37J76j92R0j6j58K90p7K68
$$ -134 41 -31 76 -103 -277 -158 113 -54 -107 53 38 -71 189 -48 128 -64 26 10 -148 142 65 333
6764C33k24k09L62m70J13J43j7j94J35k0J37K2m0K88k50M0j25j26J71L4l16L87
$$ 333 109 -100 262 -208 -95 48 31 -163 -28 -48 89 111 71 359 109 149 24 -102 69 103 -213 174
6786A74j99K2M7L2j35jP3j96R0Q6o2j10K25k20J74k6q9J12m6n7K08l25J53J92
$$ 174 -25 -3 44 76 -59 -60 13 -183 -93 -7 -69 -179 46 -174 0 -26 -115 -3 -49 -106 102 -223 -70 122
6810A22j68j84L36j67L1j8k84L25L8k6j24J31k58J92j45K6J95m4K97k97r1Q9j37
$$ 122 -46 -230 106 -61 -30 -48 -332 -7 31 5 -119 12 -246 -54 -199 -173 22 -22 275 -22 -113 -24 -161
6833a61M71n38K04J21k33K7l3R3J97m19K67K5j25J73q4K34l62j05L04j24L21p7
$$ -161 310 -228 -24 97 -136 -109 -142 -49 148 -271 -4 21 -104 69 -15 219 -143 -248 56 -68 253 176
6855A76j36k76M42j55q5O9nk2l0K48k38Q6q1k01J60M6k01J61J04J24j6k91J81
$$ 176 40 -236 206 51 -34 35 30 8 -22 226 -12 74 -7 -208 -48 -2 -203 -42 62 186 170 -121 60
6878F0j92M9P1K44k29J18j88p3R8l81K19J66K0j43p1K46o9k85K00j11K16M9k92
$$ 60 -132 -83 -12 232 3 121 -67 -140 -42 -423 -204 -38 -18 -161 -232 14 -55 -340 -140 -251 -35 14 -278
6901b78K89q0j03K65k37J20r9J86j76J82p0j18K7K26j72j18L05Kj66Q2o1J18l0
$$ -278 11 -69 -172 93 -144 -24 -123 63 -113 69 -1 -119 -92 134 -38 -156 149 151 -15 67 6 124 94
6924I4j75n1L66l42j45K40p6K13p3l86M48Pj63r6lK44j48J6j14K07M2j85Rj91
$$ 94 -81 -132 234 -108 -253 -13 -89 124 51 -335 113 120 -43 -139 -142 102 -46 -30 -144 63 105 -80 -71 -262
6948b62L56m2J69l99K59N0J00j70k05K05j13J22o1k04O15n21O0L2lj7J19k36J65
$$ -262 94 52 221 -178 81 131 231 61 -144 61 -52 70 9 -195 420 -101 -41 -9 -12 -29 90 -146 19
6971A9J56o1j71j00J93j13J42j54O2M3J08k46K36k01J6R2q9R4J66l12O7J5l7j22
$$ 19 175 114 -57 -157 36 -77 65 -89 -27 16 124 -122 114 -87 -71 21 -68 26 192 -120 -53 -38 -75 -197
6995a97R4L16k21j39J47J45j94J29k62J27Q8j08J7L06j48j10J09j79J45Q8k44
$$ -197 -103 213 -8 -147 0 145 -49 80 -182 -55 33 -75 -58 248 100 -10 99 -80 65 153 -91
7016i1K68k59J75J19k95K7j28J80R2k70K80n7oj6l5J10M4p7j01k01N3R1J24O5
$$ -91 177 -82 93 212 -83 -56 -184 -4 88 -182 98 41 35 19 -16 94 138 61 -40 -241 -188 -97 27 92
7040I2j91P8J50j36J52j84K94m29P2L06j05J86l70J14J37l1j30N9j26O4J67j83
$$ 92 -99 -21 129 -7 145 -39 255 -174 -102 204 99 285 -85 29 166 135 5 64 -62 2 169 -14
7062a4O2k56M49k98j5K35k32o7k4O0q9L92j09l07K61k54M08k8q4m7j53K79j63
$$ -14 48 -208 241 -57 -72 163 -69 -136 -160 -100 -189 203 94 -213 48 -206 202 174 90 43 -110 169 6
7085Fp9L9M5k30J30k4J22lP2n3k6q7L99n08K66q2m7p6K86j53K51k56m4L3j37R9
$$ 6 -73 -34 11 -219 -89 -113 9 6 78 25 -1 -88 311 -197 69 -13 -60 -136 150 -3 248 -8 -52 -19 -156 -57
7111e7j3j37K58o8j41J31q8K26k25J16J11l14j9K45N1r4K6r7J54j07j09J16l2
$$ -57 -70 -207 51 -17 -158 -27 -115 111 -114 2 113 -201 -220 25 76 -18 8 -89 65 -42 -151 -35 -67
7134f7M4K30q8q4L7Lj38Q2n5r2R4Kj19Mk3M3J65r6P6O5q5o4R8P1j26j74K98K7
$$ -67 -23 207 119 35 72 75 -63 19 -36 -128 -34 -32 -151 -147 -170 -127 38 -58 18 83 -2 -66 32 103 -23 -197 101 128
7162A28k04N3m2O7P2k4j03J56l03J11K26j27k65O5J46J82m44J97o2m5K67K9l26
$$ 128 -76 -23 -65 2 74 50 -53 103 -200 -89 137 10 -255 -190 -44 138 -306 -109 -171 -216 51 80 -246
7185b46L34p2N8j45j08K20j73J11j13J84J38k05P1K06j64k17J33M5j75l8O2R3
$$ -246 88 16 74 -71 -179 41 -132 -21 -134 50 188 -17 54 260 96 -121 12 57 -118 -156 -94 -1
7207aK46j50p2n6J11mKj40K9k2m9j08L78J5r9p6j20k6J85jPN2j22R7j02J36j72
$$ -1 245 95 23 -33 78 74 76 -64 -35 -57 -106 -214 164 179 80 4 -116 -142 43 42 49 101 -21 76 -26 110 -62
7234f2J29j18J53j30M7k2K7J11p5p8k61K51o5J74k9j04K24j63R1m4k5%O5J0o2
$$ -62 67 -51 102 -28 19 -3 24 135 60 -18 -279 -28 -93 81 52 -52 172 9 100 56 31 31 96 106 44
7259D4n4J49j28o2J52k05J82k43Q9qL8L02j34r0j28j9J12P6j81J79j64j55K63
$$ 44 -10 139 11 -51 101 -104 78 -165 -76 -84 -46 256 122 32 -96 -115 -3 73 -108 71 -93 -248 15
7282A5q3j51K37J62k67j60L50j75J4J78j94N0k9J96j9O6l89R2L27k54o9j8j70
$$ 15 -68 -219 18 180 -87 -247 103 -72 -58 120 -74 -24 -53 143 124 190 -199 -107 220 -34 -103 -121 -291
7305b91M54m9j30J61l14K81l4j25N6K24k0l17K19j56Q2nl9J57k94K6J74q2J19
$$ -291 163 114 -16 145 -169 112 78 -47 9 233 213 -104 115 -41 41 36 -3 154 -140 -114 60 -22 97
7328I7j70k31K47J37k3Q0Nk44J2N9O8o9j10J35M01n15K12k26J28q9m9L97k39j03
$$ 97 -73 -304 -57 80 57 137 142 -102 -90 -31 37 -32 -142 -7 394 -121 91 -135 -7 -96 -145 252 13 -90
7352i0k1JP2n3j07N8K20j90K58l4P3k67L6N4K30r5j10oL22k18k54o1L64r3J01
$$ -90 -111 -110 -38 -91 -198 -140 80 -110 148 114 187 -80 -44 10 240 145 35 29 351 133 -121 -182 182 89 190
7377A90o9q8o1J66j28j64L19k36J74q0k45L18k81o5M21j85J16p4j36J41R4j65
$$ 190 121 33 -28 138 10 -154 165 -71 103 23 -222 96 -185 -250 171 -14 102 28 -108 33 127 -38
7399c8%K16r7k17K20O8m9J37j63P7o7j28L7J20j40L02l52K21m06L19j66K53O0
$$ -38 -38 178 81 -136 84 152 103 240 77 154 87 -41 -4 116 -24 278 -74 147 -259 60 -106 147 207
7422B07l26n5M6K03l27M40k20J68O6l76J16N9J19k98j1L72o8k05m6K00k21J67
$$ 207 -119 -174 -128 75 -252 188 -32 136 202 -174 -58 1 120 -178 -189 183 115 -90 -136 64 -157 10
7444A0j5R7jj03L7j44L14k77N1O6k47J00L8K11J14m60K34r0L81k59m79O10j83
$$ 10 -5 92 91 -12 25 -119 195 -82 -31 35 -212 -112 -74 137 251 -209 25 -65 316 57 -422 188 5
7467EQ9l58M15j99J61L7j84Q8j14J08p4j6K37l38J57J40J9j59r3k1l7J99k29L33
$$ 5 94 -264 151 -48 113 150 -34 54 -60 48 -26 -42 195 -143 14 154 173 14 -79 -100 -137 62 -167 166
7491A66j70p3Q4r1M08l94J69K17k49k12j23L44L8m7K7j06P3j79J77j46R5r0Q1
$$ 166 -4 -77 7 -84 324 -70 99 316 67 -145 -268 76 114 67 94 -12 61 -118 59 -87 8 -82 -1
7514an7L45k59n9j29k8K74j86l6J18J50l62R2K99l88M76k91M0Q3j16l7o6K88q1
$$ -1 -58 287 28 -31 -160 -188 86 -100 -136 -18 132 -230 -138 161 -227 249 -42 -2 81 -35 -72 -138 150 69
7538F9M7Qj73m3O6o2j15K96Q5j08j26j38K32j00ML8J57k31m2K16M9L8k13RJ38
$$ 69 116 124 -49 -92 -26 -88 -203 93 178 70 -56 -194 38 -62 -58 -20 137 -94 -136 80 129 167 -46 -37 101
7563A01K9p3n4J14k08j32J6j4K95j54J37k59Q1N2j23J26J11j93M3K13j53OljK30
$$ 101 130 57 3 117 -91 -223 -207 -221 74 -80 57 -202 -121 -69 -192 -66 45 -148 -105 108 -45 -39 -42 -43 187
7588A87l33J67k5J43j85J10%j2q4J3Q0J08k73K29j1j00j7q8M0J85k10J66j41r
$$ 187 -146 21 -4 139 -46 64 64 52 -32 -19 61 169 -104 125 114 14 -3 -91 -51 134 -76 90 -51 -60
7612f0kK3K31j02r3j66Q0p3J95Q1j42j94K25l01L24J42p0k63J98O2n9J8p1J73
$$ -60 -62 -39 192 90 -3 -169 -89 -162 33 114 -28 -222 3 -298 26 168 98 -165 33 95 36 54 -17 156
7636A56j57J63j39j6r9K45j16j27m6K50j53J08k66K56p0J39m02J16K88l61L07
$$ 156 -1 162 23 7 -92 153 37 -90 -136 114 -39 69 -197 59 -11 128 -274 -158 130 -231 76
7657G6Oj19J2L04j27K36l60n2r7m2m0O2J42JJ12j23k4p8OK45k34L2R3j6K45j34
$$ 76 82 -37 -25 279 152 388 28 -24 -121 -163 -203 -141 1 2 114 -9 -33 -111 -105 140 -94 -62 31 15 260 126
7683A26J03k64r0K5P7q7J6J80j2j81o7J14j24J89j27O6K70k03j64J07m5J3P7J41
$$ 126 229 -35 -125 -100 -23 -110 -94 86 74 -107 -174 -60 -184 5 -122 -56 214 11 -153 -46 -91 -78 -1 140
7707A40k01ML63n83M17l1j96J11j70J92P7j64K2Q7L01l66j16J56p6j07K39j01
$$ 140 -61 -57 306 -277 140 109 -87 24 -146 46 123 -41 -19 68 369 3 -113 43 -33 -140 99 -2
7729bk46K34J73j82p0Q5j04L71m14J04K5O4p2K3J7J27o4j58JJ83j15j61K02K7
$$ -2 -248 -14 159 -23 -93 -8 -112 259 -155 -51 -26 38 -34 -11 6 133 69 -89 -88 95 -20 -181 21 48
7753D8R1k11j01K65k61K40L1K25l24Q0m9l93N59k69k8O5J12l5j2M3K07k64N3j17
$$ 48 139 -72 -173 92 -169 71 102 327 3 83 34 -359 200 -69 -97 -32 80 45 33 76 283 19 72 -45
7777d5k31L24jj57P5r3L00l18J29k04Q4J23j87J83J37J95o90M31j8j51P8j87K91
$$ -45 -276 48 47 -110 -35 -128 172 -146 -17 -221 -137 -14 -201 -18 119 314 -376 55 37 -114 -36 -223 68
7800F8j49J34n8lj02j40J11K26k15L40k63M1n5P7q9R4K0M3k43Q9O1J88j99K48
$$ 68 -81 53 -5 -8 -110 -250 -139 87 -128 212 -51 -10 -65 12 -77 17 37 80 -163 -74 -13 175 -24 224
7824B24l25K05k13J73k17L86k45P5K1j17K10k55n3r7J64l5R7J3J3P8j38J29L2
$$ 224 -101 104 -109 64 -153 233 -12 63 84 -33 177 -78 -131 -228 -64 -99 -2 11 24 102 -36 93 125
7847A25j25K51l24K00k94J21J71L6j75L13m82j0K94J26k59Q8p2l1o7N4J75j77
$$ 125 0 251 -73 127 -167 -46 125 161 -14 299 -183 -193 101 227 -32 56 -16 -47 -114 -60 115 -62
7869f2l0Qj92N93k25J8k39J74K46m35J72J56k35J89r2o9Q0k34J60O6j52l2N3M5
$$ -62 -92 -84 -276 317 92 110 -129 45 291 -144 28 184 -51 138 46 -23 57 -177 -17 49 -103 -135 -82 -37
7893c7n7n1K35k31J82j95K94q2k18J51l7K1p6M4Q1j74K22J94P6l10j06M4q6L00
$$ -37 -94 -145 90 -141 41 -154 140 58 -160 -9 -46 -25 -101 -57 24 -150 72 266 342 32 -74 -30 -116 184
7917A84p8k77J78J01l47L09k56j15rJ86Q4L5J1J74j96l01M58j50j62m5K82l3j24
$$ 184 106 -171 7 108 -239 70 -186 -301 -310 -124 -40 -5 6 180 -16 -317 141 -9 -171 -216 66 33 -91
7940i1K03j84j0qK38l0r8p7M6K81k44P3m4m7N8k21K91m86J76M6K28j72K4J01m8
$$ -91 112 -72 -82 -90 148 118 20 -57 -11 270 26 99 55 8 66 -155 136 -350 -174 -128 100 -72 -48 53 5
7965EQ7m32M28j66M66n06J28K52N7n72K48j54J90K8j79l7K56L3j49r0Nk00K94
$$ 5 92 -340 88 -78 388 -118 10 262 319 -253 -5 -159 31 59 -120 -157 99 132 -17 -107 -102 -302 -8
7988hJ17l0K57l94m0L26r7j88L03n12K91k3J56l06L4K65j71L3q2J21m8J0Lj04
$$ -8 109 79 336 -58 -98 228 131 -57 246 -266 25 2 158 -148 -114 151 -20 13 -69 52 4 14 17 -87
8012h7J16J30o8o1j5M7j31j41J14K11J42k47Q9L08k48oj00P2m6j90k4kl2L08j25
$$ -87 29 159 91 30 15 62 -69 -210 -96 115 257 10 99 407 159 153 53 125 79 -111 -135 -137 -169 139 14
8037A4K1K1j04J28k06K08k89J67K39j60K16l76Q2Q5L9j50jK08m6o5k01J88p8J95
$$ 14 35 56 -48 80 -126 82 -207 -40 199 39 255 -121 -39 46 85 -65 -66 142 96 31 -170 18 -60 135
8061A35k56K28M1m08J43j24L29p4j60M34k92l3J58j89k17K79l3j05J08M1j35M2
$$ 135 -121 107 148 -260 -117 -241 88 14 -146 288 -4 -37 121 -68 -285 -6 -39 -144 -36 5 -130 -88
8083h8L0J46k70K08j45n4J25P5m3O5j2qj93J76j4j61J83j75J18J3J37k43K06K7
$$ -88 -58 88 -182 26 -119 -173 -48 27 -16 49 37 29 -164 12 -2 -163 20 -155 -37 -24 113 -130 76 103
8107A03k1p6k1j76J19J19j11L4j7j0n1K01M4J39k69l5K74k17n3l5J22kLP4j34
$$ 103 82 6 -15 -191 -72 47 -64 -30 -47 -57 -108 93 137 276 7 -28 246 29 -24 -59 63 61 64 138 4
8132DJ14k20J76j53J11l33J91P4P4N2k0L3j39J0n7J53q7m53L52K18j0k09K25m
$$ 4 118 -102 74 -79 32 -301 -110 -36 38 90 70 103 -36 -26 -83 70 -17 -470 -118 100 90 -119 106 102
8156A02j1K4M0j00oj8j8Q2O2J34k64J72k84J74l65K70k17K44j4kj45K46k05J01
$$ 102 91 115 155 55 49 31 13 95 157 291 27 199 -85 89 -276 -6 -223 21 7 5 -140 106 -99 2
8180Bn2M97n54KK21k38K47K2j89j5L09
$$ 2 -50 447 -107 -105 116 -122 125 147 -42 -57 252
8191B52
$$ Imaginary data points
##PAGE= N=2
##DATA TABLE= (X++(I..I)), XYDATA
0@%%%%%%%%%%%%%Qj6J6j6J6k4L2m0M8n6O4p2Q8j04J20j38J62j86K10k40K73l10
$$ 0 0 0 0 0 0 0 0 0 0 0 0 0 0 8 -8 8 -8 8 -16 16 -24 24 -32 32 -40 48 -56 64 -74 88 -98 112 -128 145 -165
35a65L51l95M43m96N55o18O86p62Q46r39J038j143J261j393J535j690J862k052
$$ -165 186 -209 234 -262 293 -325 361 -401 445 -494 544 -599 662 -731 804 -886 976 -1076
53a076K263k498K760l057L396l787M242m779N429o230P247q588J0451j3228J7865
$$ -1076 1187 -1311 1449 -1608 1788 -1999 2243 -2536 2893 -3337 3910 -4678 5773 -7455 10410
68A0410k7495Q4023j55465p2947K77618Q143j71273j3122J42511l3892r3993K3129
$$ 10410 -17085 66938 -88527 -161474 116144 124287 -46986 -60108 82403 48511 -45482 -22353
80b2353M4268M670L0036o9293q8807P3723J34029o6561j50423N7162J29646q5814
$$ -22353 21915 26585 56621 -12672 -101479 -27756 106273 39712 -110711 -53549 76097 -9717
92i717q2923R7333N8578q4607n7225N0474M9680q271P06l2645m3402N7458N5044
$$ -9717 -92640 4693 63271 -21336 -78561 -28087 21593 13322 14028 -18617 -62019 -4561 50483
105E0483m4992k9167L0492J0928l6202J164N0172j803k5722p513l3723J8953Q0622
$$ 50483 5491 -23676 6816 17744 -18458 -17294 32878 31075 5353 -2160 -35883 -16930 63692
118F3692j4971r6639m849R0302j753q6853L8575P5832p3356o6894O4539N7472
$$ 63692 48721 -47918 -52767 37535 35782 -51071 -12496 63336 -10020 -76914 -12375 45097
130D5097l4634l4005J6003j4330q529O2330n01o5943K0733M2182m2030k1475P4696
$$ 45097 10463 -23542 -7539 -21869 -30398 31932 31431 -34512 -13779 28403 -13627 -35102 39594
143C9594K7331r9484k3048R9411p5o5845L2968L9263n8374m0944P2814M5691p1035
$$ 39594 66925 -32559 -55607 43804 43729 -22116 10852 50115 -8259 -49203 23611 69302 -1733
156a733k8519M4959p752k1033K4105J5862k3774k4288Q848N177P608L2656k4974
$$ -1733 -30252 14707 6955 -14078 10027 25889 2115 -22173 -13325 -8148 -540 32116 7142
169G142n9478K7337N2563j7765l3699K1571K3999m4448j9616O0093K0584l9295
$$ 7142 -52336 -24999 27564 9799 -23900 -2329 21670 -22778 -42394 17699 38283 -1012
181a012k2170N837K0013J2889k657j0123j1919Q211P6j3479K9994J8733m4709
$$ -1012 -23182 -17345 2668 15557 12900 2777 -9142 -931 -855 -14334 15660 34393 -10316
194a0316k6076L0711K9456j8795j7049K0742j3252l0795K9231L0526j8475k3409
$$ -10316 -36392 -5681 23775 4980 -12069 8673 -4579 -35374 -6143 24383 5908 -17501
206a7501N85R152k989J2101J8174k5515j7937J8826K442J205J7087m11k7496j4943
$$ -17501 -16916 -7764 -10753 1348 19522 -5993 -23930 -5104 -2662 -1457 15630 15219 -12277 -27220
220b7220L3573K2064k5738k303J1387j8930n670K5690J7193k0348k3439J3068
$$ -27220 6353 28417 2679 376 11763 -7167 -12837 12853 30046 9698 -13741 -673
232f73N007p983K0789M792k7306j3771J2548J9308j164q612j315j4450L83J9510
$$ -673 4334 -3649 17140 21932 -5374 -19145 -6597 12711 11547 2935 1620 -12830 -12447 7063
246G063j339k241M213j3734j4532J1514L2522n50l9033j465K4570k718n022P955
$$ 7063 5724 3483 7696 -6038 -20570 -9056 23466 22916 -16117 -17582 6988 4270 -752 7203
260G203O294j2960j9021J2223K0201K573o559k2357p434K4988R521j1285q047
$$ 7203 13497 537 -18484 -6261 13940 16513 9954 -12403 -19837 5151 14672 3387 -4660
273d660M257l39j7915R260L0208j0440k6707l097J2053J1156l39j543n129j4166
$$ -4660 -403 -742 -18657 -9397 20811 10371 -16336 -19433 -7380 3776 3437 1894 -3235 -17401
287a7401O373J3150m24M007m006j4660j816J2604J6223m248j5341R54k500Q16
$$ -17401 -11028 2122 1698 5705 1699 -12961 -14777 -2173 14050 9802 -5539 -4585 -7085 -6269
301f269J7944K796j3325j0073K136J0353l52M208N934j8489j0552J3520J1816
$$ -6269 11675 14471 1146 -8927 -6791 3562 3210 7418 13352 -5137 -15689 -2169 9647
314I647K419r797q238q18k39J2256P119j0770k924m346m660J1673J1685q22j5959
$$ 9647 12066 2269 -5969 -6787 -7026 5230 12349 1579 -1345 -5691 -10351 1322 13007 12185 -3774
329c774j0553J3793P896k152N193o093j0630j002Q481J3189l725r645l264o322
$$ -3774 -14327 -534 7362 5210 10403 4310 -6320 -7322 1159 14348 10623 978 -2286 -8608
343h608P621J4252l775p948o729k227O130M625O969m459j6415O60P701L478N743
$$ -8608 -987 13265 9490 1542 -5187 -7414 -1284 3341 10310 5851 -10564 -9904 -2203 1275 7018
358G018l873q613o525J800J5523K771r327k725n309N13R415N147Q68j0087p993
$$ 7018 3145 -5468 -11993 -10193 5330 8101 -1226 -3951 -9260 -8747 668 5815 6683 -3404 -11397
373a1397N121N191P851K763j3098o278L497O634O735k090l817n860p165J0085
$$ -11397 -6276 -1085 6766 9529 -3569 -9847 -6350 284 7019 4929 1112 -4748 -11913 -1828
387a828J0003k771l775q603k395O535O171O065o892j1795K261M066N901N069n393
$$ -1828 8175 5404 1629 -6974 -9369 -2834 3337 9402 2510 -9285 -7024 -2958 2943 8012 2619
402B619m912m518O92J0894L510j748o081j0150N286J1922K263l199q488j555L462
$$ 2619 -2293 -6811 -6119 4775 8285 6537 456 -9694 -4408 7514 9777 6578 -1910 -3465 -3
417cl19P793L366q409o856k970Q393J1250m169q182o037O84Q860Q95MN66q389
$$ -3 -322 7471 10837 2428 -4428 -7398 995 12245 8076 -106 -6143 -5459 3401 4296 4300 4866 -3523
434c523m340L925P980O671q453r397L21L153Q321K871p204l579k688J533O360
$$ -3523 -7863 -3938 4042 10713 2260 -7137 -6816 -3663 4658 7529 325 -3254 -5942 -4409 1951
449A951K261J450o630r781N724P739K735j089p552l357M67M034R901k982r380
$$ 1951 4212 5662 -968 -10749 -5025 2714 5449 4360 -3192 -6549 -6082 -2048 7853 4871 -4509
464d509j334k64N063M214m81r32q594l100Q565M538J963l772q827p36N086Q048
$$ -4509 -5843 -6107 -1044 3170 2689 1757 -6837 -9937 -1372 3166 5129 1357 -7470 -8206 -3120 4928
480D928K387r967k738L405r75L481M035J964n028j1945M113J4030K201o463q645
$$ 4928 7315 -2652 -5390 -1985 -2960 521 4556 6520 1492 -10453 -6340 7690 9891 3428 -5217
495e217K0P027P42J470M38l594j250l934Q07J0399L917p939j2464K21J7321L542
$$ -5217 -5197 1830 2572 4042 4480 886 -364 -4298 -3491 6908 10825 2886 -9578 -9357 7964 11506
511A1506j2584l295N145J896o104j54J3579n16j5258m267P985J1131L13j0577
$$ 11506 -1078 -4373 772 2668 -3436 -3590 9989 9473 -5785 -10052 -2067 9064 9377 -1200
525a200m647J559O519L917o809L70N598o599p922N234J5432J44k0690m363J5599
$$ -1200 -5847 -4288 2231 6148 -661 -291 5307 -1292 -9214 -3980 11452 11596 -9094 -13457 2142
540B142N166o336l931K722L57p287L134Q697r50l464n436l741O617P558J179r273
$$ 2142 7308 972 -2959 -237 120 -7167 -4033 4664 3714 250 -5186 -8927 -2310 5248 6427 -2846
556b846p824Q631N416m424J061K723k841p479O16J2587J606r057j883K15L39M489
$$ -2846 -10670 -2039 3377 -1047 14 2737 -104 -7583 -6967 5620 7226 -1831 -3714 -3499 -3160 1329
572A329M229q41r875k439R856J207l341K028J68m739m797O771R909n243p777N07
$$ 1329 5558 4717 -5158 -7597 2259 3466 125 2153 2321 -2418 -7215 -444 9465 4222 -3555 -3048
588c048O67L053M246J57m638o556M674O131l687L55M283m688p035J240J1968L521
$$ -3048 -2381 672 4918 5075 437 -6119 -1445 4686 999 1354 5637 949 -6086 -4846 7122 10643
604A0643j2462m127N168K994J001m54p61j986l428L014J886K7M364l547r684L11
$$ 10643 -1819 -5946 -778 2216 3217 2763 2002 16 -3412 -398 1488 1515 5879 2332 -7352 -7041
620g041J1102O443j0738r232Q729M773o167r17O360K482j0410n795J0804O729
$$ -7041 4061 10504 -234 -9466 -737 4036 -2131 -3048 3312 5794 -4616 -10411 393 7122
634G122l950n801l425K554N209J023j643l808J319J742n674K859R197j611j1025
$$ 7122 3172 -2629 -6054 -3500 1709 2732 1089 -2719 -1400 342 -5332 -2473 6724 5113 -5912
649e912m339J0737P141p977l258L441j123k382K398N566p46p447m67K873J242
$$ -5912 -10251 486 7627 -350 -3608 -167 -1290 -3672 -1274 4292 3546 -3901 -4368 -1495 -253
664b53L892l92m863k756J541N565M26k431K09k564k259M023L938ql886l667K499
$$ -253 3639 3247 -1616 -4372 -2831 2734 3160 729 938 -1626 -3885 138 4076 4068 182 -3485 -986
681i86J665J111K787k642l904j123K388N769j426l657l27j595R42L540Q20j48
$$ -986 679 1790 4577 1935 -1969 -3092 -704 5065 3639 -18 -345 -1940 -998 2542 3362 3214
697C214m636k043L513J290J640O85m226l222J287N012K765n570j759K099j615
$$ 3214 -1422 -3465 48 1338 2978 3663 -563 -3785 -2498 2514 5279 -291 -2050 49 -1566
712a566L44K700K418k228o679Q58N456J566k10l396l510K628K459K46p46m59Q10
$$ -1566 -1222 1478 3896 1668 -5011 -4153 1303 2869 2659 -737 -4247 -1619 840 1086 340 -119 691
729F91m259j616P151L468n037n529Q32N551K79k224J300j362j959L38J172L939
$$ 691 -3568 -5184 1967 5435 398 -5131 -4299 1252 1531 -693 607 -755 -2714 -2376 -1204 2735
745B735j32m437k395P25N338J892m179r54P7n70J639J566J187j471m177O46K812
$$ 2735 2603 -1834 -4229 -3504 1834 3726 -453 -1407 -1330 -1900 -261 1305 2492 1021 -3156 -2510 302
762C02J893J216l078l183J026K166K285n19j895n20j652J185L527p35l55k006
$$ 302 2195 3411 333 -2850 -1824 342 2627 2108 213 -307 -1959 -774 2753 2018 1663 -343
778c43k455J704K974K126j817m563Q14J926K11J840j93j767j945r84L597K435
$$ -343 -2798 -1094 1880 4006 2189 -2374 -1560 366 577 2417 2224 457 -1488 -2472 1125 3560
794C560j664j709k651L15L732P47n28j838j725O89O0K540K089l580k875Q07J738
$$ 3560 1896 187 -2464 -2149 1583 2330 1802 -36 -1761 -1072 -1012 1528 3617 37 -2838 -2031 -293
811b93J987m09r87j358k111K048K530k30o24j865j635J570J550J775q82l066l16
$$ -293 1694 1285 298 -1060 -3171 -1123 1407 1177 553 -1312 -2947 -1377 173 1948 1066 -2000 -2316
828b316N86J360K666j314k550j023M52K687L47J28l84l509P2L307J288j6k484
$$ -2316 -1730 -370 2296 982 -1568 -2591 -2139 548 895 1023 639 -2870 -2798 509 1797 1781 -703
845g03j703R67N61K078J143k554q12r30P87L240K46j035k674j304L039J107j79
$$ -703 -2406 -1439 -878 1200 2343 -211 -1023 -1953 -1166 2074 2320 1285 -1389 -2693 346 1453 1274
862A274K41j740j640Q71J759J993j197k466qj49J846J911j347r60j616J4K002
$$ 1274 1515 -225 -1865 -994 765 2758 1561 -905 -913 -1062 784 2695 1348 388 -1228 -1214 788
879G88P41Q64j587k854R44J999Q26L55j883j546K72K73K835j46j779r76q76J114
$$ 788 1529 2393 806 -2048 -1104 895 1721 2076 193 -1353 -1081 -808 2027 1881 102 -874 -1750 -636
897f36J848Mm64j880j319K074J019P53n81k522j32Q84R05J703q94j510j032j15
$$ -636 1212 1216 752 -1128 -2447 -373 646 1399 818 -1704 -1836 -952 -47 1656 762 -748 -1780 -1895
915a895K044J725j473p72j969M98K105J02R47j402k303N74J091J741O45k082j084
$$ -1895 149 1874 401 -371 -2340 -1842 263 365 1312 -90 -2393 -1819 -728 1013 1658 -424 -1508
932a508k36J040J917r2j011r62r66J227J730J53q0k767n28J800J075P14m81j781
$$ -1508 -1744 -704 1213 1121 110 -852 -1818 -591 1139 1292 1212 -1555 -2083 -283 792 1506 1025 -756
950g56j77K30J262J460o79j122j365k85K224J449r33j217j706R73J348N63O33
$$ -756 -933 -703 559 2019 1340 218 -1147 -1432 792 2241 1308 91 -1615 -642 706 1269 1902
967A902j837r76L66K94J506J206j802j288j087J573K190r59q47q50n48Q43Q61
$$ 1902 65 -911 -545 -251 1255 2461 659 -629 -1716 -143 2047 1088 241 -609 -1157 -314 547
984E47J009O9k698p95J024J477J237j188j702k17J88J730L51j111o2p43r88J365
$$ 547 1556 1625 -1073 -1868 -844 633 1870 682 -1020 -1237 -1049 681 1032 -79 -141 -884 -1872 -507
1002e07J540M16j810j921J024J305L94M72j214j314p0R48J981k02j398l64q78
$$ -507 1033 1449 -361 -2282 -1258 47 441 913 -301 -1615 -1685 -737 1244 1042 -356 -720 -1598
1019a598N82J691O77r29j922m73J409J032O92m20j888q2L69R61J578q60j254n62
$$ -1598 -1016 675 1352 423 -1499 -1972 -563 469 1161 741 -1147 -1229 -860 101 1679 819 -435 -997
1037i97l61J776J315k24j289k031P03K716m13n84p3j025j59J17J957J080k505
$$ -997 -1358 418 1733 1509 220 -1811 -1108 1608 1195 611 538 -487 -646 -529 1428 2508 3
1054Cj224K63P07J811J51q77j816j96K094L53j026L59j20j369n41K066K413k650
$$ 3 -1221 -958 -251 1560 1711 834 -982 -1178 916 1269 243 602 482 -887 -1428 638 3051 401
1072D01k420J321Q70R6O04K05j547o70N84Q56J3K95P52k937q13L046J295j070
$$ 401 -2019 -698 172 268 872 1077 -470 -1140 -556 300 313 608 1360 -1577 -2390 656 1951 881
1090H81k430O11L79L4R40R71o06j339j373Q94J884o61J21j322j531K729L36P79
$$ 881 -1549 -938 -559 -525 415 1386 780 -559 -1932 -1038 846 185 306 -1016 -2547 182 518 1297
1108A297j640j284R65P7J01J371P08j908j366j04K930L56k052N42n81k32P19J111
$$ 1297 -343 -1627 -662 -585 -484 887 1595 -313 -1679 -1783 1147 1503 -549 -7 -588 -820 -101 1010
1126A010O75k557o57J471j84N12J408r66j101j518J576K285j123q76M70o93N37
$$ 1010 1685 -872 -1529 -58 -242 270 1678 712 -389 -1907 -331 1954 831 -45 425 -268 269
1143B69R86M61r59k663J203J519o75J023P17j999r41N86K459n12r18j045N64j277
$$ 269 1255 1716 757 -1906 -703 816 141 1164 1881 -118 -1059 -473 1986 1474 556 -489 75 -1202
1161a202J442J386j006j061j160J310L58K80J216j695k031J249J503O05j073o35
$$ -1202 240 1626 620 -441 -1601 -291 67 347 1563 -132 -2163 -914 589 1194 121 -514
1177e14K89o93j85J537O5j21j962m3J648P51p51J03j062l37P83L93J107q03j186
$$ -514 -225 -918 -1103 434 499 378 -1584 -1627 21 772 21 124 -938 -1275 -492 -99 1008 205 -981
1196i81K17n92R90J812p23j754j034J422J560r58K70j37j516q8J378J447l27j891
$$ -981 -764 -1356 -366 1446 723 -1031 -2065 -643 917 -41 229 92 -1424 -1512 -134 1313 986 -905
1214i05k4M32L9J741R2j381j122L59J431K16n74O24j177j334J712J208j03j010
$$ -905 -929 -497 -458 1283 1375 -6 -1128 -769 662 878 304 928 -249 -1583 129 1337 1234 224
1232B24q35M62j79O42J443j245j241M48L4J139K95l36m88j628R07J544l16k99
$$ 224 -611 -149 -328 314 1757 512 -729 -281 -247 892 1187 851 363 -1265 -358 1186 870 571
1250E71p02p97N45P26P71Kj573l10K30J08J648k36j161m50o76J241Q40K1r6k057
$$ 571 -131 -928 -383 343 1114 1116 -457 -767 -537 -429 1219 983 -178 -628 -1304 -63 777 798 702 -1355
1270a355J43J418J41K56l75j244k90L76J228P33j259q91J05L9J345N86o97j045
$$ -1355 -1212 206 347 603 228 -1016 -1306 -930 298 1031 -228 -1119 -1014 -975 370 956 259 -786
1288g86o68J154K90K68O75j212j321Q15R83P20n47q50J6o31Q85J365p18n70o00
$$ -786 -1454 -300 -10 258 933 -279 -1600 -785 198 918 371 -479 -463 -1094 -209 1156 438 -132 -732
1307g32m18J220P10J07m35j798P47Q95J43N56m39p84k97J45J361K71j001j10r14
$$ -732 -1150 70 780 887 452 -1346 -599 296 439 995 556 -228 -525 -380 981 1252 251 141 -773
1326g73J78J727rm64j127n28J233J66O60O1j312q84O43P13Q92m67o52m72p14J325
$$ -773 -595 1132 1123 659 -468 -996 237 403 1063 1124 -188 -1072 -429 284 1176 709 57 -415 -1129 196
1346A96O81l51l37p24l79R13N12L74p11j174N34K56O74M91r36p60m08P77Q76K40
$$ 196 877 526 189 -535 -914 -1 511 885 174 -1000 -466 -210 464 955 19 -741 -1149 -372 504 744
1366G44o65l99j207Q64J050J51n9j083m79N18L81R22J42j776J68j05P69R80o45
$$ 744 79 -320 -1527 -663 387 538 479 -604 -1083 -565 -184 738 880 -896 -728 -833 -64 916 271
1385B71m41q71L6J345O2j58j43q67j96R27N44M27j074m53J92J16P12O26q47p81
$$ 271 -170 -1041 -1005 340 402 244 101 -766 -962 -35 509 936 -138 -591 -399 -283 429 1055 208 -573
1405e73k94O18R42J32k07q04o79Q88N97K89J22j356l0L01M54P66o76r36J62j80
$$ -573 -867 -249 693 825 618 -186 -865 23 620 909 1031 -325 -355 -54 400 1166 490 -446 -284 -464
1425d64P94N47l62l88q95J77J408l16J19k38j561N48M69P78J63r00m44K8J27J413
$$ -464 330 877 515 127 -768 -591 817 501 620 382 -1179 -631 -162 616 779 -121 -565 -537 -410 1003
1445A003j75j127m30k99O77P12L85n73j074m85J142M02J76P6j199l10N70N50Q58
$$ 1003 828 -299 -729 -1028 -351 361 746 173 -901 -1386 -244 158 334 410 -789 -1099 -529 21 879
1464H79r46l62m06j23J135O11n27n13q42O13N84L15M06r84j021O71O19L28M97
$$ 879 -67 -429 -835 -958 177 788 261 -252 -1094 -481 103 418 824 -160 -1181 -510 109 437 934
1483I34j074k08m10N60J156n66m09l63o55P99P94K14k84j047j8P09K20N39m10
$$ 934 -140 -348 -758 -198 958 392 -17 -380 -1035 -236 558 772 488 -559 -577 132 352 891 481
1502D81p48j69L8J174K69q33j06q02K06J204l2r5o08n99K60P44K54K10j047n23
$$ 481 -267 -436 -398 776 1045 212 106 -696 -490 714 682 587 -21 -620 -360 384 638 848 -199 -722
1522g22M82L09O99o3q84l50k46P50N98k32p6p97l90Q10O03J12n54q14k3N44N33
$$ -722 -240 69 768 705 -179 -529 -775 -25 573 341 265 -532 -922 -112 491 603 49 -765 -788 -244 289
1543B89M23n26q85j45J95J025r2o08j2r53M33J234r5J46q48l36M48J51M59M26
$$ 289 712 186 -699 -844 -649 376 284 -324 -336 -1289 -856 378 283 429 -419 -755 -307 -156 303 729
1563G29j419r7J89O09P24m50m30l78k89O96R46l92l90m27n5O87O0K75k21o84k82
$$ 729 -690 -787 -598 11 735 285 -145 -523 -812 -116 830 438 48 -379 -434 253 313 588 367 -317 -599
1584e99N71Q07K87q28j27n68N2J078J14l00o24n58O54M26K3M40r10o12L83Q62
$$ -599 -28 779 1066 238 111 -457 -405 673 787 487 -137 -695 -41 385 408 848 -62 -674 -291 571
1604E71K73k36p81j13k4K06R08m12l86l46m4P46m8k44L44j286J23O38N77R5j025
$$ 571 844 608 -173 -286 -310 -104 804 392 6 -340 -384 362 314 70 414 -872 -749 -111 466 561 -464
1625d64j83J86p2N88N16o19m85l98N73R97o60k0m03q85P93R32Pm59o18L86m30
$$ -464 -647 -461 -533 55 571 -48 -533 -931 -358 639 -21 -41 -444 -1329 -536 396 403 -56 -674 -288 -718
1646g18P09N24m2q81m42L86O80O6m0l14o72j02J131L02j99m34m90K83J83K64O95
$$ -718 -9 515 473 -408 -850 -464 216 282 242 -72 -744 -846 285 587 388 -46 -536 -253 -70 194 889
1667H89q72q42M34L18M45j08n8k75n51O39P21P5o07m19o3M18J18M94j65r85J07
$$ 889 17 -825 -391 -73 372 264 206 -69 -620 19 740 815 208 -211 -274 144 262 756 591 -394 -287
1688b87J90N32J47l14m54l82K4J006R6l35l25m34M67K84p5M70o36q10O35J22L70
$$ -287 -97 435 582 268 -186 -568 -544 462 558 223 -102 -536 -69 215 140 610 -26 -836 -201 -79 291
1709B91J01m79o0m77K32R52O8p01n47O9M64J45K05J63j130k73J036J0Q6k03j73
$$ 291 392 -87 -147 -624 -392 560 628 -73 -620 -551 -87 58 263 426 -704 -977 59 69 155 -48 -221
1730b21l56j52Q81N23q33k85J90j51K22M18K03o78p20P10N05Q8R9n59k18K32J43
$$ -221 -577 -729 152 675 -158 -443 -253 -404 -182 236 439 -239 -959 -249 256 344 443 -116 -334 -102 41
1751D1N95m45n52L7o9L19N36j34k31l65q6L28M88J38m26p91N49J16L22K91k82
$$ 41 636 191 -361 -324 -393 -74 462 328 97 -268 -354 -26 462 600 174 -617 -68 48 370 661 379
1772C79m02m04M90L02K95n89q4n24L34O22J70n51k00L9k4j04O26P7p40k36M31
$$ 379 -23 -427 63 365 660 71 -13 -537 -203 419 589 38 -162 -123 -147 -251 375 452 -288 -524 -93
1793i3M00j08l8j82j35l45M31M77o03M19o35j37M38J26N91n34q20P07q5L10L23
$$ -93 307 199 161 -21 -156 -501 -70 407 -196 223 -412 -549 -111 15 606 72 -748 -41 -126 184 507
1814E07n67l60l04K02J073l87l26R1n37N70L39P6m03m44L1K23N0N20q4n48j45
$$ 507 -60 -420 -724 -522 551 164 -162 -71 -608 -38 301 377 -26 -470 -439 -216 -166 354 270 -278 -423
1835d23K26L15L88k66m11k59J23O90J6k57J48q38J79M96K79L37n95j47n7jN30
$$ -423 -197 118 506 240 -171 -430 -307 383 399 142 290 -548 -369 127 406 743 148 1 -56 -57 473
1856D73n9l16k71p4K87N38k94k70J7k56K12K08K13j1p33K80k8K73M27m85m33Q1
$$ 473 414 98 -173 -247 40 578 284 14 31 -225 -13 195 408 397 -336 -56 -84 189 616 131 -302 -221
1878b21L6M06J76m38n5m18J85K96J08J43j16n94K38J23L34Q6p42j31K41P2N88
$$ -221 -185 221 397 -41 -96 -514 -329 -33 75 218 102 -492 -254 -131 203 289 -453 -584 -343 -271 317
1899C17j03k89j92l81P10j03K59q5n90j0L28K92K75k81m42N8R2j2N25o55j02j3
$$ 317 214 -75 -267 -648 62 -41 218 133 -457 -467 -139 153 428 147 -295 -237 -145 -157 368 -287 -389 -402
1921d02L34K42n4K16k56o96O97J6J22Q2k99k79J30J13M46j02l29j73j44L13M13
$$ -402 -68 174 120 336 80 -616 81 97 219 301 2 -277 -147 -34 412 310 -19 -192 -336 -23 390
1942C90R9k37m4m85M52K87N1k53l30o5P7M69J29l52k78J94n6L76Q0n85M9k60L0
$$ 390 489 252 208 -277 175 462 513 260 -70 -135 -58 411 540 188 -90 104 48 424 504 -81 -32 -292 -262
1965b62O39nj03l87k70L58j9R5L18p14m3K02J99L56l55l61j70R1M54K43l88P4
$$ -262 377 372 269 -118 -388 -30 -49 46 364 -350 -393 -191 8 364 9 -352 -522 -431 23 266 -122 -48
1987d8k46k91L86N15j38r6n24K18qM45K33k86m23k44J84N67k41Nj61l1q6M57N0
$$ -48 -294 -585 -199 316 178 82 -442 -224 -232 213 446 160 -263 -507 -323 244 3 8 -153 -184 -270 187 237
2010B37m48P0k89N25q6N18l87m42J94J65lK86l7k71j87qN55n4k95o6k91L16J69
$$ 237 -211 -141 -430 95 9 527 140 -302 -108 57 54 340 303 32 -155 -163 392 338 43 -23 -314 2 171
2033A71q3K83l86l18L60O2M39j54j81k78j45J16L81Q4k83j86j42K22n8K59P5k61
$$ 171 88 371 -15 -333 27 89 528 374 193 -85 -230 -114 267 351 68 -118 -260 -38 -96 163 238 -23
2055b3k91J70K19J94l11l3j77J07L14Q9j43j70m03K32L55J52j03K3q99L93k3L9
$$ -23 -314 -144 75 269 -42 -75 -252 -145 169 258 115 -55 -458 -226 129 281 178 201 -698 -305 -328 -289
2077b89L11L4l86j54K07N87q2k27l60j7J44N41l02p8l37Q2N45n97M49P1l02p1
$$ -289 22 56 -330 -484 -277 310 228 1 -359 -376 -232 309 7 -71 -408 -326 219 -378 71 142 -160 -231
2099b31R8L08o9J53k24k66j28N34J37j55k76j24J57K47K74o7m49j8K6L40J18l48
$$ -231 -133 175 106 259 35 -231 -359 175 312 157 -119 -243 -86 161 435 368 -81 -99 -73 267 385 37
2121C7M6j47j71L36L93l38m2r9j98K66j55L52j47n37J58L97M41k97k90k86Q7q8
$$ 37 83 -64 -235 101 494 156 114 15 -183 83 -72 280 133 -404 -246 151 592 295 5 -281 -194 -282
2143b82L70J90k60m4k83M57J99l60J55k5m61K58K58k37J82l45J19L0J0N28l91
$$ -282 88 278 18 -26 -309 148 347 -13 142 117 -344 -86 172 -65 117 -228 -109 -79 -69 459 68
2164F8l11O6k79K96K80k36J37l98N5K92P9j71J45m02J52R6L03L16o23m8O0J09
$$ 68 -243 -177 -456 -160 120 -116 21 -377 -322 -30 49 -122 23 -379 -227 -131 172 488 -135 -183 -123 -14
2186a4K81p9l44J30j21p3J81K64o3k58k71M13J41K79k71j27l47K30K83k2J39l63
$$ -14 267 188 -156 -26 -147 -220 -39 225 162 -96 -367 46 187 466 195 68 -279 -49 234 212 351 -12
2208a2j35J18K81k6j18J2l27J83R5K32n6k83l34L54Q5K65q0k72m3l14M63L11l68
$$ -12 -147 -29 252 226 108 120 -207 -24 71 303 247 -36 -370 -16 69 334 254 -18 -61 -375 88 399 31
2231C1L4j50k89L66l7J02j31J96k62K69o1J88l15j70j3L0L01M62p08J38q8r5J52
$$ 31 65 -85 -374 -8 -45 57 -74 122 -140 129 68 256 -59 -229 -242 -212 89 551 -157 -19 -107 -202 -50
2254e0J88j55k01j82J94J61j90K99K2k37q3J0O36o32j17K03k86J45M84j86r6j96
$$ -50 138 -17 -218 -400 -206 -45 -235 64 86 -151 -234 -224 412 -220 -337 -134 -420 -275 209 23 -73 -269
2276b69M6K97l8J71l4m68K49N5J15K66j98n04L65r8K89j28k45K80m98M89K28j53
$$ -269 -223 74 36 207 173 -295 -46 9 124 390 192 -312 53 -45 244 116 -129 151 -347 142 370 217
2298B17p1l6l51K17J59K2J92m00k06m9N43j7J06m03k00J75J55L1MP5m38l5N43
$$ 217 146 110 -241 -24 135 157 349 -51 -257 -306 237 220 326 -77 -277 -102 53 84 88 163 -275 -310 233
2321B33j89K43j88p05M74J21J21K32n12o8j0P8J71M25m53m3l54L72J78l79N34
$$ 233 44 287 99 -606 -132 -11 110 342 -170 -238 -248 -170 1 426 -27 -70 -424 -52 126 -253 281
2342B81n19J8j39M61M7j11k03j54J0M93k86J71q7k57R0K67J45j90k07j71M29j22
$$ 281 -238 -220 -359 102 149 38 -165 -319 -309 184 -102 69 -18 -275 -185 82 227 37 -170 -341 88 -34
2364c4J16J7P1k97k3o9N67j22k28j42j18K93J14J26p1n01q7K80K2L49O9l88m51
$$ -34 82 99 170 -127 -150 -219 348 226 -2 -144 -262 31 145 271 200 -301 -388 -108 -86 263 332 -56 -507
2387e07M81L7N70n37k20J42j71N06P2l33k58L2L14r2K09nj62j98J69k16J31J03
$$ -507 -26 11 581 44 -176 -34 -205 301 373 40 -218 -186 128 36 245 240 78 -120 49 -167 -36 67
2409F7k88j54M13j49K65N7k36r9J8J87J23j42m0m3j26mP4J38r9l15J01J34J14
$$ 67 -221 -375 38 -111 154 211 -25 -124 -106 81 204 62 22 -21 -147 -151 -77 61 -38 -353 -252 -118 -4
2432dM24n56m4q4j34N44k27M9j05k71K20L03r7L5k71O3K22j53L12k0j83j75kM5
$$ -4 420 -136 -180 -264 -398 146 -81 -32 -137 -408 -188 115 18 53 -218 -155 67 -86 226 206 23 -152 -154 -109
2456a09L65j51rk97O8N3L38Q5m34o8PM19KJ89m98k89J87j00J6L70l41L5J4n4L39
$$ -109 256 105 96 -201 -133 -80 258 343 -91 -159 -152 267 269 458 -40 -329 -142 -242 -226 144 -197 -162 -148 -202 137
2481A37j4J85K2n00L59o5j89J80k44J37M3m34O50l7j62l08J63J51kJ30p5j42k02
$$ 137 123 308 330 -170 189 124 -65 115 -129 8 51 -383 267 230 68 -240 -77 74 72 202 127 -15 -217
2504b17M68j0p4J6m11j46K96J63j3j65M1J65k38K83j79L6p7r1p7K81k10k8J15
$$ -217 251 241 167 183 -228 -374 -78 85 72 -93 -52 113 -125 158 -21 15 -62 -153 -230 51 -159 -187 -72
2527g2k81L70M4P9P0j61p6j64J12N68n22K1M0r9P0j9Q7L03p35j09O09J45n1j97
$$ -72 -353 17 61 140 210 49 -27 -191 -79 489 -33 -12 28 -71 -1 -20 67 370 -365 -474 135 280 229 32
2551C2j38jR5J11J08k72N4q9K38J76k38PN5r1N1j54L6N9l56P1K74r0M50m35j17
$$ 32 -106 -107 -12 99 207 -65 -11 -100 138 314 76 83 138 47 98 -56 -20 39 -317 -246 28 -62 388 -47 -164
2576a64L08k66J57K78k96J18k53J54J20L2Q8k73k45J61J07q6J30j47j91K05j95
$$ -164 144 -122 35 313 17 135 -118 36 156 188 276 3 -242 -81 26 -60 70 -77 -268 -63 -258
2597b58J94N1Q4k11K7K3K34m0l7j88k35L16k1L19k84n8L4p7J57J50k71J31j53
$$ -258 -64 -13 71 -140 -113 -90 144 104 67 -121 -356 -40 -61 258 -26 -84 -50 -127 30 180 -91 40 -113
2620a13ML30k43j09J17k99K36N5J40K34k88j26k83M78L8j8l96J85k65L29M1R6
$$ -113 -109 221 -22 -131 -14 -313 -77 -22 118 352 64 -62 -345 133 171 153 -243 -58 -323 6 47 143
2642A43Jl67N1K66k37K54Ok21K2K77r5K32j20l17m9k03M10J93l18K71l25lJ94
$$ 143 144 -223 -172 94 -143 111 117 -104 -82 195 100 332 212 -105 -154 -357 53 246 -72 199 -126 -129 65
2665F5j50J37l9P0J62j38j87L9p3l8J41P5P9n0k24L16j96q9L69j79l3k28m9J22
$$ 65 -85 52 13 83 245 107 -80 -41 -114 -152 -11 64 143 93 -131 185 -11 -100 269 90 57 -171 -220 -98
2689i8K15R1J25k38j04j36J24K63k22j08Mj33j06L57j3k26j17L20K11r9p3n8k11
$$ -98 117 208 333 95 -9 -145 -21 242 20 -88 -84 -217 -323 34 21 -205 -322 -2 209 110 37 -21 -232
2712b32K91K0J73J43n04J95j64j46K38k7K4k17J31Q6J86k06J07j06n7K68Q1N1
$$ -232 59 79 252 395 -109 86 -78 -224 14 -13 11 -206 -75 11 197 -9 98 -8 -65 203 284 335
2734C35k60l31K95P8N6J52l64J01j25j07J79M36k94N0m53L59j7J82jr7k05p9K84
$$ 335 75 -256 39 117 173 325 -39 62 -63 -170 9 445 151 201 -252 107 90 272 271 174 -31 -110 174
2757A74K3L6m46K30J77j07lk6j06p7j87M91o6n0K5l80J71j86J63J95j42%j55K45
$$ 174 197 233 -213 17 194 87 84 58 -48 -125 -312 179 113 63 88 -292 -121 -307 -144 51 -91 -91 -246 -1
2781aP0q2k14Q7j11lM14j50R5j19k81K48MK01J82m24J8p6J00J8k20J17j19K4J01
$$ -1 69 -13 -227 -140 -251 -254 160 10 105 -14 -295 -47 -43 158 340 -84 -66 -142 -42 -24 -244 -127 -246 -222 -121
2806a21P4K09Mn43M47J28pj09j84j01o2K79j54K91j46k93J83K32pL1k61L14m27
$$ -121 -47 162 166 -377 70 198 191 82 -102 -203 -265 14 -140 151 5 -288 -105 127 120 151 -110 204 -223
2829b23L43K77m74nJ17k34J11o8J44j2J08K2q9J53Nk53L01k94j25J64l3N4J11
$$ -223 120 397 -77 -82 35 -199 -88 -156 -12 -24 84 106 17 170 175 -78 223 -71 -196 -32 -65 -11 100
2852A00K5l11P8J35L19m49j04K57k28J94L89m51l3l0n1N8m8l3O9m0K21k31J50
$$ 100 125 -186 -108 27 346 -103 -207 50 -178 16 405 -46 -79 -109 -160 -102 -150 -183 -114 -154 67 -164 -14
2875a4R8l95K03L65k81k11J09J02j94J91J76k39N5J31l74J62K38m0K1J07k91J7
$$ -14 84 -311 -108 257 -24 -235 -126 -24 -218 -27 149 -90 -35 96 -278 -116 122 82 103 210 -81 -64
2897f4R0K32j04j88j1j52q5M59k1n9j71k85M84j51M6K7o0J2J24L00l10o4NJ35
$$ -64 26 258 154 -34 -45 -197 -282 177 156 97 -74 -359 125 -26 20 47 -13 -1 123 423 113 49 54 189
2921A89j35J42J34l63K60k47n0J20r8L47j2k50k63K38q1K76k01o4M35n46L84k8
$$ 189 54 196 330 -33 227 -20 -70 50 -48 299 287 37 -226 12 -69 207 6 -58 377 -169 215 187
2943A87j80P3M5l2j26J77j24j48k57L34R7j95K14p7N2j31J19L00l14k93M26j45
$$ 187 7 80 125 93 -33 144 20 -128 -385 -51 46 -149 65 -12 40 -91 28 328 14 -279 147 2
2965BJ84O6j04k19j64L3M5J37j47QK3k10K31r2K89O8k9j31J23n9q9J36j85j05
$$ 2 186 252 148 -71 -235 -202 -157 -20 -167 -159 -136 -346 -115 -207 82 150 121 -10 113 54 -35 101 -84 -189
2989a89q5L82j57l3J68k47J35M18n43K62k80R3J16K09R7k57r1R1k8R9Mj61nn5
$$ -189 -274 108 -49 -82 86 -161 -26 392 -151 111 -169 -76 40 249 346 89 -2 89 61 160 164 3 -2 -57
3013e7L04J04k36J82k42j40j5j9J21L4J6o6l03J85K93%j95k4K4K47l56J04k00
$$ -57 247 351 115 297 55 -85 -100 -119 2 36 52 -14 -317 -132 161 161 -34 -58 -34 213 -143 -39 -239
3036b39J75K52k76N8O6J4n0Pr0q3M86p3m26J49k45N65m00j24K03k98K25j3J3P1
$$ -239 -64 188 -88 -30 36 50 0 7 -83 -166 320 247 -179 -30 -275 290 -110 -234 -31 -329 -104 -117 -104 -33
3060c3p5L4j1K28j52j86M30k19j39k56O35j73k71q0K94Q7j76P6O0Ll08J64K04
$$ -33 -108 -74 -85 143 -9 -195 235 16 -123 -379 256 83 -188 -268 26 113 -63 13 73 76 -232 -68 136
3083A36l37K18p8rl55O93k88Q5j1l91L15J81O1o5l77j12j2M25l3K3r3j61J90k96
$$ 136 -201 17 -61 -70 -425 268 -20 65 54 -337 -22 159 220 155 -222 -334 -346 79 46 69 -24 -185 5 -291
3107b91M79q4l01P4j3N1P6k44M04m38L33r9K49K9j05j72q4K50r3P0RJ82l50j60
$$ -291 188 104 -197 -123 -136 -85 -9 -253 151 -287 46 -53 196 225 120 -52 -136 114 21 91 100 282 -68 -228
3131b28J20K13Ok35L12k86K31q4J07l0j74l88N04q0j73J1J25lj18K58j72J22K4
$$ -228 -108 105 111 -124 188 -98 133 49 156 126 -48 -436 68 -12 -185 -174 -49 -52 -170 88 -84 38 62
3154F2k75J62J04p3p3k07J5L12N8j95J38j29l11M03j76L09j24k90o4kL62J62n3
$$ 62 -213 -51 53 -20 -93 -300 -285 27 85 -110 28 -101 -412 -9 -185 124 0 -290 -354 -356 6 168 115
3177A15K15m56Q0J22J06j93om9k0K16j45R2k83J80k18K94O2m2n4M9q8j27K26p1
$$ 115 330 -126 -46 76 182 -11 -17 -66 -86 130 -15 77 -206 -26 -244 50 112 70 16 65 -23 -150 76 5
3201EkP0l57L53o7J39l37K13J81k26J55j89n2M03k12j43K4L01j60k41j38L02J16
$$ 5 3 73 -284 69 2 141 -196 17 198 -28 127 -62 -114 289 77 -66 -42 259 99 -142 -280 22 138
3224A38m6L09m34n7M0K20r6N8n2j9j23J13L03l30J2j02l65L94J02O9k08l4J54
$$ 138 92 401 -33 -90 -50 170 74 132 80 61 -62 51 354 24 36 -66 -431 -37 65 134 -74 -108 46
3247D6k90J52J91k21K48j66oj74L41o4j74q3J27K22j53J87l37p1L14j86L4K10
$$ 46 -244 -92 99 -122 126 -40 -46 -220 121 57 -117 -200 -73 149 -4 183 -154 -225 89 -97 -63 147
3269A47k94P9O3j71K48J70j75Q6l71K02M7L2M9p3k43Q1K3K87k31P5J28J7k9N5
$$ 147 -147 -68 -5 -176 72 242 67 153 -218 -16 31 63 112 39 -204 -123 -100 187 -44 31 159 176 147 202
3293B02j05l0j32J63J40l32j12K46j33P2J48K74k62j9n1k42J50j53M55j52p2j72
$$ 202 97 67 -65 98 238 -94 -206 40 -93 -21 127 401 139 120 69 -173 -23 -176 279 127 55 -117
3315a17k5L55k45M9P4j56Q1j32L89j54k46L9j12J67K73k45r6K68l84p2M31j22
$$ -117 -142 213 -32 17 91 -65 16 -116 273 119 -127 -88 -200 -33 240 -5 -101 167 -217 -289 142 20
3337B0j73m9M5J12j27P5J84k21J7J10K0N7j38J92j65K17k99J96j84J00O1l49L31
$$ 20 -153 -202 -157 -45 -172 -97 87 -134 -117 -7 13 70 -68 124 -41 176 -123 73 -111 -11 50 -299 32
3360C2l7Q8j45L08k17k10N41m18r5J36L7p2J44j56J88l72K23j7J67O1k33O9j88
$$ 32 -5 83 -62 246 29 -181 360 -58 -153 -17 20 -52 92 -64 124 -248 -25 -42 125 186 -47 22 -166
3383a66n1J40M20l66K10k38J57J74K46o96N64l36k14R4j60L39K37m48j05O25l42
$$ -166 -217 -77 343 -23 187 -51 106 280 526 -170 394 58 -156 -62 -222 117 354 -94 -199 426 84
3404H4ol70K08Qm8K0L28o8p1J34j57J09j46j75O8K28k39L25j15n07J46J11K79
$$ 84 78 -292 -84 -76 -124 -104 224 156 85 219 62 171 25 -150 -82 146 -93 232 117 -390 -244 -133 146
3427A46J02m96k06K89K07k24P75k55l07k36J09l2M43p80N45l77J81r2M24N5K9
$$ 146 248 -248 -454 -165 42 -182 593 338 31 -205 -96 -128 315 -465 80 -297 -116 -208 216 271 300
3448C00k80p5J52Q8R8n95R41r08J94j54K15K27P2k46k14L20q99O04J45k9K8J66
$$ 300 20 -55 97 185 283 -312 629 -279 -85 -239 -24 203 275 29 -185 135 -764 -160 -15 -44 -16 150
3470A50N52p3q23L27K06j45j27j2L24J1p6J37l12o7K76j9n13l0K56j9o67P70R7
$$ 150 702 629 -194 133 339 194 67 55 379 390 314 451 139 72 348 329 -184 -214 42 23 -644 126 223
$$ [...]
8191a3
##END NTUPLES=NMR FID
##END=
