##TITLE=1H_Pr Q3
 CDCl3, 8 sc, 
 14.05.2021
##JCAMPDX= 6.0         $$ Bruker NMR JCAMP-DX V2.0
##DATA TYPE= NMR FID
##DATA CLASS= NTUPLES
##ORIGIN= UXNMR, Bruker Analytische Messtechnik GmbH
##OWNER= root
$$ XWIN-NMR		Version 3.5
$$ Fri May 14 10:54:12 2021 Russian Standard Time (UT+4h)  she@DPX200
##.OBSERVE FREQUENCY= 200.131506
##.OBSERVE NUCLEUS= ^1H
##.DELAY= (6, 6)
##.ACQUISITION MODE= SIMULTANEOUS
##.ACQUISITION SCHEME= undefined
##.AVERAGES= 8
##.DIGITISER RES= 18
##SPECTROMETER/DATA SYSTEM= spect
##.PULSE SEQUENCE= zg30
##.SOLVENT NAME= CDCl3
##.SHIFT REFERENCE= (INTERNAL, CDCl3, 0, 15.7039)
##AUDIT TRAIL= $$ (NUMBER, WHEN, WHO, WHERE, WHAT)
$$ ##TITLE= Audit trail, XWIN-NMR		Version 3.5
$$ ##JCAMPDX= 5.01
$$ ##ORIGIN= Bruker BioSpin GmbH
$$ ##OWNER= she
$$ F:/spectra/data/she/nmr/H-F/1/audita.txt
$$ ##AUDIT TRAIL=  $$ (NUMBER, WHEN, WHO, WHERE, WHAT)
(   1,<2021-05-14 10:52:49.62 +0400>,<she>,<DPX200>,
      <created by zg, POWCHK disabled, PULCHK disabled
       configuration hash MD5:
       00 E9 B6 7A A2 85 ED C7 34 08 36 98 17 FE 4E 26
       data hash MD5: 16K
       62 B2 0E 59 05 5D F5 2B 37 FE 93 79 26 04 3B E9>)
$$ ##END=
$$ 
$$ hash MD5
$$ 77 8F 97 3C 97 0B C5 7D B1 14 3A 44 68 B1 63 CA
##$RELAX= 
##$RELAX= 
##$RELAX= 
##$RELAX= 
##$RELAX= 
##$RELAX= 
$$ Bruker specific parameters
$$ --------------------------
##$DU= <F:/spectra>
##$EXPNO= 1
##$NAME= <H-F>
##$PROCNO= 1
##$TYPE= <nmr>
##$USER= <she>
##$AMP= (0..31)
100 100 100 100 100 100 100 100 100 100 100 100 100 100 100 100 100 100 
100 100 100 100 100 100 100 100 100 100 100 100 100 100 
##$AQSEQ= 0
##$AQ_mod= 1
##$AUNM= <au_zg>
##$AUTOPOS= <>
##$BF1= 200.13
##$BF2= 200.13
##$BF3= 200.13
##$BF4= 200.13
##$BF5= 200.13
##$BF6= 200.13
##$BF7= 200.13
##$BF8= 200.13
##$BYTORDA= 1
##$CFDGTYP= 0
##$CFRGTYP= 5
##$CHEMSTR= <none>
##$CNST= (0..31)
1 1 145 1 1 1 1 1 1 1 1 1 1 1 1 1 1 1 1 1 1 1 1 1 1 1 1 1 1 1 1 1 
##$CPDPRG= <>
##$CPDPRG1= <>
##$CPDPRG2= <>
##$CPDPRG3= <>
##$CPDPRG4= <mlev>
##$CPDPRG5= <mlev>
##$CPDPRG6= <mlev>
##$CPDPRG7= <mlev>
##$CPDPRG8= <mlev>
##$CPDPRGB= <>
##$CPDPRGT= <>
##$D= (0..31)
0 1.2 0 0 0 0 0 0 0 0.06 0 0.03 0 0 0 0 0.0002 0 0 0 0 0 0 0 0 0 0 0 0 
0 0 0 
##$DATE= 1620975169
##$DBL= (0..7)
120 120 120 120 120 120 120 120 
##$DBP= (0..7)
150 150 150 150 150 150 150 150 
##$DBP07= 0
##$DBPNAM0= <>
##$DBPNAM1= <>
##$DBPNAM2= <>
##$DBPNAM3= <>
##$DBPNAM4= <>
##$DBPNAM5= <>
##$DBPNAM6= <>
##$DBPNAM7= <>
##$DBPOAL= (0..7)
0.5 0.5 0.5 0.5 0.5 0.5 0.5 0.5 
##$DBPOFFS= (0..7)
0 0 0 0 0 0 0 0 
##$DE= 6
##$DECBNUC= <off>
##$DECIM= 32
##$DECNUC= <off>
##$DECSTAT= 4
##$DIGMOD= 1
##$DIGTYP= 9
##$DL= (0..7)
0 120 120 120 120 120 120 120 
##$DP= (0..7)
150 150 150 150 150 150 150 150 
##$DP07= 0
##$DPNAME0= <>
##$DPNAME1= <>
##$DPNAME2= <>
##$DPNAME3= <>
##$DPNAME4= <>
##$DPNAME5= <>
##$DPNAME6= <>
##$DPNAME7= <>
##$DPOAL= (0..7)
0.5 0.5 0.5 0.5 0.5 0.5 0.5 0.5 
##$DPOFFS= (0..7)
0 0 0 0 0 0 0 0 
##$DQDMODE= 0
##$DR= 18
##$DS= 0
##$DSLIST= <SSSSSSSSSSSSSSS>
$$ [...]
##$SUBNAM2= <"">
##$SUBNAM3= <"">
##$SUBNAM4= <"">
##$SUBNAM5= <"">
##$SUBNAM6= <"">
##$SUBNAM7= <"">
##$SUBNAM8= <"">
##$SUBNAM9= <"">
##$SW= 16.9725357007746
##$SWIBOX= (0..15)
0 0 2 0 0 0 0 0 0 0 0 0 0 0 0 0 
##$SW_h= 3396.73913043478
##$TD= 16384
##$TD0= 1
##$TE= 0
##$TE2= 300
##$TE3= 300
##$TEG= 300
##$TL= (0..7)
0 120 120 120 120 120 120 120 
##$TP= (0..7)
150 150 150 150 150 150 150 150 
##$TP07= 0
##$TPNAME0= <>
##$TPNAME1= <>
##$TPNAME2= <>
##$TPNAME3= <>
##$TPNAME4= <>
##$TPNAME5= <>
##$TPNAME6= <>
##$TPNAME7= <>
##$TPOAL= (0..7)
0.5 0.5 0.5 0.5 0.5 0.5 0.5 0.5 
##$TPOFFS= (0..7)
0 0 0 0 0 0 0 0 
##$TUNHIN= 0
##$TUNHOUT= 0
##$TUNXOUT= 0
##$USERA1= <user>
##$USERA2= <user>
##$USERA3= <user>
##$USERA4= <user>
##$USERA5= <user>
##$V9= 5
##$VALIST= <valist>
##$VCLIST= <CCCCCCCCCCCCCCC>
##$VD= 0
##$VDLIST= <DDDDDDDDDDDDDDD>
##$VPLIST= <PPPPPPPPPPPPPPP>
##$VTLIST= <TTTTTTTTTTTTTTT>
##$WBST= 1024
##$WBSW= 4
##$XGAIN= (0..3)
0 0 0 0 
##$XL= 0
##$YL= 0
##$YMAX_a= 314601
##$YMIN_a= -390552
##$ZGOPTNS= <>
##$ZL1= 120
##$ZL2= 120
##$ZL3= 120
##$ZL4= 120
##$ABSF1= 10
##$ABSF2= 0
##$ABSG= 5
##$ABSL= 3
##$ALPHA= 0
##$AQORDER= 0
##$ASSFAC= 0
##$ASSFACI= 0
##$ASSFACX= 0
##$ASSWID= 0
##$AUNMP= <proc_1d>
##$AZFE= 0.1
##$AZFW= 0.1
##$BCFW= 1
##$BC_mod= 2
##$BYTORDP= 1
##$COROFFS= 0
##$CY= 11.3945322036743
##$DATMOD= 1
##$DC= 2
##$DFILT= <>
##$DTYPP= 0
##$F1P= 15.9154993809931
##$F2P= -4.1035820241983
##$FCOR= 0.5
##$FTSIZE= 0
##$FT_mod= 4
##$GAMMA= 1
##$GB= 0.15
##$INTBC= 1
##$INTSCL= 1
##$ISEN= 128
##$LB= 0.24
##$LEV0= 0
##$LPBIN= 0
##$MAXI= 10000
##$MC2= 0
##$MEAN= 0
##$ME_mod= 0
##$MI= 1.114404
##$NCOEF= 0
##$NC_proc= 0
##$NLEV= 6
##$NOISF1= 3.799351
##$NOISF2= 2.8
##$NSP= 1
##$NTH_PI= 0
##$NZP= 0
##$OFFSET= 15.70392
##$PC= 1
##$PHC0= -11128.78
##$PHC1= 8.000999
##$PH_mod= 1
##$PKNL= yes
##$PPARMOD= 0
##$PSCAL= 0
##$PSIGN= 0
##$REVERSE= no
##$SF= 200.130013532006
##$SI= 16384
##$SIGF1= 3
##$SIGF2= 2
##$SINO= 400
##$SIOLD= 16384
##$SREGLST= <1H.CDCl3>
##$SSB= 0
##$STSI= 0
##$STSR= 0
##$SW_p= 3612.71676300578
##$SYMM= 0
##$S_DEV= 0
##$TDeff= 0
##$TDoff= 0
##$TI= <>
##$TILT= no
##$TM1= 0
##$TM2= 0
##$TOPLEV= 0
##$USERP1= <user>
##$USERP2= <user>
##$USERP3= <user>
##$USERP4= <user>
##$USERP5= <user>
##$WDW= 1
##$XDIM= 8192
##$YMAX_p= 0
##$YMIN_p= 0
$$ End of Bruker specific parameters
$$ ---------------------------------
##NTUPLES= NMR FID
##VAR_NAME=  TIME,          FID/REAL,        FID/IMAG
##SYMBOL=    X,             R,               I
##VAR_TYPE=  INDEPENDENT,   DEPENDENT,       DEPENDENT
##VAR_FORM=  AFFN,          ASDF,            ASDF
##VAR_DIM=   8192,          8192,            8192
##UNITS=     SECONDS,       ARBITRARY UNITS, ARBITRARY UNITS
##FACTOR=    0.0002944,     1,               1
##FIRST=     0,             0,               0
##LAST=      2.4114304,     0,               0
##MIN=       0,             -390552,         0
##MAX=       2.4114304,     314601,          0
$$ Real data points
##PAGE= N=1
##DATA TABLE= (X++(R..R)), XYDATA
0@%%%%%%%%%Qj6J6j6K4l2M0n6O4p2R2j16J36j60J92k24K60l00L48m04M64n32O08
$$ 0 0 0 0 0 0 0 0 0 0 8 -8 8 -8 16 -16 24 -32 32 -40 52 -64 72 -88 104 -120 140 -160 188 -216 248 -284 324
32C24o88P76q80R92j112J248j396J556j732J928k142K372k621K894l195L524l883
$$ 324 -364 412 -468 524 -588 660 -736 820 -912 1016 -1126 1246 -1375 1519 -1676 1848 -2035
49b035M275m710N192n720O309o970P713q557R524j0647J1967j3544J5470j7882
$$ -2035 2240 -2470 2722 -2998 3311 -3659 4054 -4503 5021 -5626 6341 -7203 8267 -9615
63i615K1002k5218L1247m0612N7201r4973L24984K1499o76067M24098J59276k62251
$$ -9615 11387 -13831 17416 -23196 34005 -60968 264016 285515 -390552 33546 192822 -69429
75f9429N2246N6449j46832P9720j0446P1091J07781k09176p6485L27821k8640
$$ -69429 -17183 39266 -107566 -27846 -38292 32799 140580 -68596 -145081 182740 154100
86A54100k80978O0658J21436n0939k6520m5461M1519O8353n3954M1922N5076j82004
$$ 154100 -126878 -66220 55216 4277 -22243 -67704 -26185 42168 -11786 30136 85212 -96792
98i6792Q7821J96458k32693r9215J87529o0524j5241J07943j44354j3758J67940
$$ -96792 -8971 187487 -45206 -144421 43108 -17416 -32657 75286 -69068 -82826 85114
109H5114k7867k1519l3279j16698J41079J16501k49579k802J93443j37079L28
$$ 85114 57247 35728 2449 -114249 26830 143331 -106248 -109050 84393 -52686 -52358
120e2358J93734j74712q7404K51924o2820j55572R1135j0687j2196O2648j04204
$$ -52358 141376 -33336 -120740 131184 68364 -87208 3927 -6760 -18956 43692 -60512
131f0512j0861J37212m7148k5059M5833p2953J3061R5526l4842q7111m3200O1164
$$ -60512 -71373 65839 18691 -6368 39465 -33488 -20427 75099 40257 -46854 -90054 -28890
143b8890J43763q7887j61966J36067R3202j13476M4111M2903j54053M4519J30565
$$ -28890 114873 26986 -134980 1087 94289 -19187 24924 67827 -86226 -41707 88858
154H8858p9805m9304J217r194J20772J761j68096P7978J13124j01243k1331L7478
$$ 88858 9053 -40251 -39034 -48228 72544 74305 -93791 -15813 97311 -3932 -25263 12215
166A2215l3305K3668P780m5484L8088q755j5315R3982m2448j24505R2814J00663
$$ 12215 -21090 2578 10358 -35126 2962 -5793 -21108 72874 30426 -94079 -1265 99398
178I9398r9096n3409J9951J2793N5048J927p1934m205M1424L0789K8012p1704
$$ 99398 302 -53107 -33156 -20363 34685 36612 -35322 -39527 1897 32686 60698 -11006
190a1006n8028O9772L1917k5176j1379m4924Q701R4618k1940o4320K5590J0115
$$ -11006 -69034 738 32655 7479 -3900 -48824 -40123 54495 32555 -31765 -6175 3940
202C940P662K3900n6313l2230P8858k856n6201K2725J1165n154L9769j1782o2288
$$ 3940 11602 35502 -20811 -53041 25817 22961 -33240 -10515 650 -4504 35265 23483 -38805
215c8805K0925N1028L389m6128m8199L7789O3803k3924l7598R765j2240L1662
$$ -38805 -17880 33148 36537 -9591 -57790 -20001 43802 19878 -17720 -7955 -20195 11467
227A1467N2772n5957o3896M0476M5128q499k4376l6669K1113N2867j3159k9611
$$ 11467 64239 8282 -55614 -15138 29990 21491 -2885 -39554 -18441 34426 21267 -8344
239h344L419J584J3299J9511l8920k4082L2543K1287j1221k8982r777M3442L2182
$$ -8344 -4925 -3341 9958 29469 -9451 -33533 -990 20297 9076 -19906 -29683 13759 45941
252D5941m6885k6600K0274J3162J8721p401n6556m129O5812J1057l2031k4062
$$ 45941 -944 -27544 -7270 5892 24613 17212 -39344 -43473 22339 33396 1365 -22697
264b2697m509L7667L1625l0916m0901M154K5027K9073j8390m5032J2357L8806
$$ -22697 -27206 10461 42086 11170 -29731 -25577 -550 28523 10133 -34899 -22542 16264
276A6264K876j5885j2457o467K8752Q863l3273r890J8185J1408K122j4617k5202
$$ 16264 19140 3255 -9202 -15669 13083 21946 -11327 -21217 -3032 8376 10498 -4119 -29321
289b9321K9044L6843k1395l5098k122K6183K5501j3660m3660p18K9986K4682j169
$$ -29321 -277 36566 15171 -19927 -22049 4134 29635 15975 -27685 -28403 1583 26265 25096
302B5096l9604k0422L9024L5592k2935l1834j1363K0605L1709q760l5216m305
$$ 25096 -14508 -34930 4094 39686 16751 -15083 -26446 -5841 25868 17108 -18108 -22413
314b2413K7361J3103k639k2540j0329K4449J3504j9729j7862P094J6652J0734
$$ -22413 4948 18051 15412 -7128 -17457 6992 20496 767 -17095 -10001 6651 17385
326A7385k1922j7612J9095K2205r33k2892j9000J2217L5815l655l6266j4753K1068
$$ 17385 -4537 -22149 -3054 19151 18218 -4674 -23674 -11457 24358 20703 -15563 -30316 -9248
339i248L0310K054k9511k4804K3476L1535k384k8925j9884J5093K8424J090k6295
$$ -9248 21062 23116 -6395 -31199 -7723 23812 21428 -7497 -27381 -12288 16136 17226 -9069
352i069j0894J0732K4387L432k6879r906K0119J4613j3275j5812j421J8656J0041
$$ -9069 -19963 -9231 15156 18588 -8291 -18197 1922 16535 3260 -12552 -13973 4683 14724
365A4724j3383j6201M026K2584Q184j5492k4656M724L0385R476k6269k3241J0607
$$ 14724 1341 -14860 -10834 11750 19934 4442 -20214 -15490 14895 24371 -1898 -25139 -14532
378a4532K8687J3078k5889k2518Q926K4906J2289j9878k6495N258K8683N719j6844
$$ -14532 14155 27233 1344 -21174 -12248 12658 24947 5069 -21426 -16168 12515 18234 1390
391A390j7655O687K1141L561j4385j3649R599J4441k123j5531o602J1021J5590
$$ 1390 -16265 -9578 11563 15124 739 -12910 -3311 11130 9007 -6524 -13126 -2105 13485
404A3485m130k1837k177J8938J7574j4118k8075L940K6121Q166j6400j6661l056
$$ 13485 9355 -12482 -14659 4279 21853 7735 -20340 -16400 9721 17887 1487 -15174 -18230
417a8230K0718J6605o883k5506j1772K7495K3338j6591l0316K073K4680J1884
$$ -18230 2488 19093 12210 -13296 -25068 2427 25765 9174 -21142 -19069 5611 17495
429A7495j5848j5243M632J1696R469q688j2223k17J2489Q478j1597j6193Q722
$$ 17495 1647 -13596 -8964 2732 12201 3513 -8710 -8927 3562 12040 443 -15750 -7028
442g028J9973l137j4379j1117J1671K2930m180k6130q647K2269J7322r899k1647
$$ -7028 12945 9808 -4571 -15688 -4017 18913 14733 -11397 -20044 2225 19547 9648 -11999
455a1999j254J0733J4960O242k1566j7675J2893K8087l89l0318j2140K4197J5562
$$ -11999 -13253 -2520 12440 18682 -2884 -20559 -7666 20421 20032 -10286 -22426 1771 17333
468A7333j1561j1694l021R116P531J075r690j1855J0983J7078j0835j9403P322
$$ 17333 5772 -5922 -8943 173 7704 8779 -911 -12766 -1783 15295 4460 -14943 -7621
481g621J6498L180j6422q804J2294Q493R93p537j3950m11K3042Q910k1573k0483
$$ -7621 8877 12057 -4365 -13169 -875 7618 8611 1074 -12876 -13287 9755 18665 -2908 -23391
495b3391J4456K6729n967j7188q093N627J6183M939j5341j1689N421J3288P753
$$ -23391 -8935 17794 11827 -5361 -13454 -7827 8356 13295 -2046 -13735 -8314 4974 12727
508A2727j3582j1623N422J5424L831j7913p454J4453J0237q801j1670p93J6425
$$ 12727 -855 -12478 -7056 8368 12199 -5714 -13168 1285 11522 2721 -8949 -9742 6683
521F683N314j4360n500K864Q828P618n370j6378l705J8153J6921j5012k6066Q630
$$ 6683 11997 -2363 -7863 -4999 3829 11447 6077 -10301 -14006 4147 21068 6056 -20010 -11380
535a1380K2660O448j5880j5531O209J3629N791n734j4981n251J9198R729j1858
$$ -11380 11280 17728 1848 -13683 -7474 6155 11946 6212 -8769 -14020 5178 14907 3049
548C049j3576K698J5110K169q662q570J289J2883N467j7579p139J4265P660l085
$$ 3049 -10527 -7829 7281 9450 788 -7782 -6493 6390 11857 -5722 -12861 1404 9064 5979
562E979j2381m468J0923J0936l932j4375o909J2107J5644n082j6716q896J6449
$$ 5979 -6402 -10870 53 10989 7057 -7318 -14227 -2120 13524 8442 -8274 -17170 -721
575g21J7034j0494j4736j888Q241J1442Q59j5305q253R909J6076l889j9227K663
$$ -721 16313 5819 -8917 -10805 -2564 8878 9737 -5568 -13821 -3912 12164 8275 -10952 -8289
589h289J2811J649n704m352l68N682L402k481p117l934J4604O423j4662j0293
$$ -8289 4522 6171 467 -3885 -4253 1429 4831 2350 -4767 -8701 5903 12326 -2336 -12629
603a2629J0360J4710l776j4673m387R978Q934J344j2540q569P870J1769M639j3647
$$ -12629 -2269 12441 8665 -6008 -10395 -417 8517 9861 -2679 -11248 -3378 8391 13030 -617
617f17j3812J0054J6956l508j2772n807O847J1112j702q434o185N524J0745k745
$$ -617 -14429 -4375 12581 9073 -3699 -9506 -2659 8453 6751 -1683 -7868 -2344 8401 5656
631E656j1370n66Q120M178k793r945J24R814N487p291j1709L578J2668L566r690
$$ 5656 -5714 -6280 1840 6018 3225 -6720 -6596 3218 8705 1414 -10295 -6717 5951 9517 -173
646a73j0363J194J6030N021j2798j0056K670J4343N290j0865j1024K952J1607
$$ -173 -10536 -9342 6688 11709 -1089 -11145 -8475 5868 11158 293 -10731 -7779 3828
659C828P009r349j2857N341J0875L158q446p462M073Q232K021p806n825M952R196
$$ 3828 10837 1488 -11369 -6028 4847 8005 -441 -7903 -3830 4402 6423 -1383 -7208 -2256 6940
674F940k505q407l007P407Q548n202r744j159R400P529n070j1875o67J0318P426
$$ 6940 4435 -3972 -6979 428 8976 3774 -5970 -7129 2271 9800 4730 -7145 -7812 2506 9932
689I932l320j4286k560J3541Q772p753j1659n5R541O948m902r018l195R480P376
$$ 9932 6612 -7674 -10234 3307 12079 4326 -7333 -7388 2153 9101 4199 -4819 -8014 1466 8842
704H842n790q855p6R485L124o561o300L309O775J321p174n563O148O765l35q392
$$ 8842 3052 -5803 -5879 3606 6730 169 -6131 -2822 3953 5274 -1900 -7463 -1315 5450 5115 -3277
720c277n348O383J0220k084j1668l577P732R860k683j0306n158P561J0348j601
$$ -3277 -8625 -2242 7978 5894 -5774 -9351 -1619 8241 5558 -4748 -9906 -2345 8003 6402
734F402j0552o061Q429R448k204j0164k977O695O948j222q944j903O694N550m032
$$ 6402 -4150 -10211 -1782 7666 5462 -4702 -7679 -984 5964 4742 -4202 -6105 589 6139 2107
749B107o603N7O573M371o141o232K303Q572J642p007o253L414R304J061p435p607
$$ 2107 -4496 -4439 2134 6505 364 -5868 -3565 5007 6649 -358 -6611 -3197 6107 7168 -267 -7874
765g874M304J0076K215r769p235N476Q785J933q398o674L494R248J789q337n750
$$ -7874 -3570 6506 8721 -1048 -8283 -2807 5978 7911 -487 -7161 -3667 5581 7370 -967 -6717
780f717L826Q464l37p082l927M884N820j917n838k479N984M267k771o651p68O735
$$ -6717 -2891 5573 5236 -1846 -5773 -889 4931 3014 -2824 -5303 681 4948 2177 -4474 -5242 1493
796A493N009m842q644J417Q336M190o266p834J086Q656M702o280q117N48R368
$$ 1493 6502 1660 -6984 -5567 2769 6959 693 -7141 -6055 2601 7303 1023 -7094 -6546 2822
811B822M290n751p864P61Q177L722m774p488J547P453K866n841n129K970N538
$$ 2822 7112 1361 -6503 -5742 2435 6157 1383 -6105 -4558 2895 5761 -80 -5209 -2239 3299
826C299J012n794l091L542N615r12o248k254M975O062k495p330k091O883N886
$$ 3299 4311 -1483 -4574 -1032 4583 3671 -2577 -4831 144 6206 3711 -3619 -5710 1173 7059
841G059l439p797j876P587N598l011q254j932O964O325l330q195j086O181N691
$$ 7059 3620 -4177 -6053 1534 7132 4121 -4133 -6065 899 7224 3894 -4301 -5387 794 6485
856F485l539o686o82N584M133l613n375O5N450K215l654m853J746N751Q80m903
$$ 6485 2946 -3740 -4422 1162 5295 1682 -3693 -3628 1822 4037 383 -4470 -2724 3027 3907 -996
872i96m859L863O596p90o869k677M431N618j45p058l328L740P311L9p738m042
$$ -996 -5855 -1992 4604 3814 -3055 -5732 -1301 4317 4172 -2886 -6214 -2474 4837 4876 -2862 -6904
888f904N041P005q36p275l476N932M732j343m900k704M160M426r10n342j391M288
$$ -6904 -1863 5142 4306 -2969 -6445 -513 4219 2876 -2024 -4728 -568 3858 2948 -2394 -3785 503
904E03L989l043m660K93M628L523m778m915K265N611J455m559n070K094O902J124
$$ 503 4492 1449 -3211 -2918 1710 5233 455 -4460 -2195 3416 4871 312 -4758 -2664 4238 5362
920E362n074n623K549O947J423n163n764K257P401J462o518l609K074N300J688
$$ 5362 288 -5335 -2786 4161 5584 421 -5343 -3086 4315 5777 -741 -4350 -2276 3024 4712
935D712n202l647K076N142L79m674k719L199L584m83m387k184M758K800k278l687
$$ 4712 -490 -4137 -2061 3081 3460 -1214 -3933 -734 2850 2367 -2020 -4204 554 3354 1076 -2611
951b611j453M365M060l234n411K16N172L718m192n401R72M832L592l518n807Q07
$$ -2611 -4064 301 4361 1127 -4284 -4068 1104 4822 630 -4771 -3799 1033 4625 1107 -4700 -3893
967c893N598K278k793n085K20N511J503k403m242M95M937J072l174l064J426M408
$$ -3893 1705 3983 1190 -3895 -3675 1836 3339 936 -3306 -2811 2126 3198 24 -3040 -1614 2794
983B794L21m985p26K808K400k3m172j569L424L683j154m803k032M883M218k671
$$ 2794 3115 -1870 -2596 212 2612 2589 -1583 -3152 272 3955 2801 -2002 -4034 849 5067 2396
999B396m766j505M896L728k668m247j218L672M227k078n229k55L508L410k487
$$ 2396 -2370 -3875 1021 4749 2081 -2166 -3384 288 4515 2437 -2792 -3047 461 3871 1384
1014A384m248N07L272J958j950l787M79M327M95k781k722J009M393P7l809k246
$$ 1384 -2864 -2357 915 2873 923 -2864 -2385 1942 2437 -344 -3066 -2057 2336 2413 -1396 -3642
1030c642K380L717K45m585k301K816M196L17n268k171L013L919L42m381k884L182
$$ -3642 -1262 2455 2700 -1885 -4186 -1370 2826 3143 -2125 -4296 -1283 2636 2978 -1403 -4287 -1105
1046a105M028m66l385k873K910L899j173k895j476K262K827j034l017l83K348
$$ -1105 2923 2457 -928 -3801 -891 3008 1835 -1060 -2536 -274 2553 1519 -1498 -1881 467
1061D67K156j499l370R29K653J615k332l193J269L580O96k755k765Q90M236N55
$$ 467 2623 1124 -2246 -1317 1336 2951 619 -2574 -1305 2275 2971 216 -2549 -1659 2577 3132
1077C132l172k485Q41L999J006l453k608J377L116J193l259k283J671K593N53
$$ 3132 -40 -2525 -1684 2315 3321 -132 -2740 -1363 1753 2946 -313 -2596 -925 1668 2221
1092B221k870j665J675K226l29k238j223K151J899j275k250o66K527K234k142
$$ 2221 -649 -2314 -639 1587 1258 -980 -2203 -52 1847 572 -1678 -2344 183 2417 275
1107B75k688J49K882J624j759l539P99L124J683k026l336M00L199J790k088k926
$$ 275 -2413 -2264 618 2242 483 -3056 -2257 867 2550 524 -2812 -2412 787 2577 489 -2437
1123b437L3L232J553k039k245L8K887J170j839k151O12K408O36k154j392J544
$$ -2437 -2404 828 2381 342 -1903 -1865 1022 2192 353 -1798 -1186 1222 1858 -296 -1688 -144
1139a44J680K4k074j123J888J895n37k537p83J962K446j254k605p12K200K400
$$ -144 1536 1560 -514 -1637 251 2146 1609 -928 -1711 251 2697 1443 -1162 -1874 326 2726
1155B726j293k679p53K408K191j155k797o20K150J828o12k738k56J801J544r22
$$ 2726 1433 -1246 -1999 409 2600 1445 -1352 -1972 178 2006 1394 -1344 -1600 201 1745 823
1171H23k247J30J668J051j375j446K59J732O12j810j156Q23K106n5j859j521J502
$$ 823 -1424 -1294 374 1425 50 -1396 -1137 595 1207 -603 -1759 -936 1170 1115 -744 -2265 -763
1188g63J975r6k110j225J583J842J29k425j168J566K083k14j820j224J280K019
$$ -763 1212 1116 -994 -2219 -636 1206 1335 -1090 -2258 -692 1391 1177 -643 -1867 -587 1432
1204A432l07j709q33J178J654m09j561n54J362R97n21j330r2J456P57r82j495
$$ 1432 1125 -584 -1417 -239 1415 1006 -555 -1109 253 1250 729 -601 -693 763 1520 538 -957
1221i57M16J542N25j340j369O29J934M27j672j454N89K101K87j622j344M97J908
$$ -957 -541 1001 1526 186 -1183 -554 1380 1807 135 -1319 -730 1371 1658 36 -1308 -811 1097
1238A097N03j395j487N55J547N13j492j053N23J342L19j355m62M27J029j47j029
$$ 1097 1600 205 -1282 -727 820 1333 -159 -1212 -689 653 972 -383 -845 -418 611 464 -565
1255e65m35Q85Q13p29r56j24J167Q76q80j280n7J440P34o91j604Q4J592J044j111
$$ -565 -1000 -115 698 -31 -987 -1111 56 932 52 -1228 -1285 155 889 198 -1406 -1322 270 1314 203
1274B03j495pJ619R06j030j141j43J412O67p26j063R4J132N23o55r01L34R74K62
$$ 203 -1292 -1299 320 1226 196 -945 -1088 324 991 265 -798 -704 428 951 296 -605 -271 703 965
1293I65r91o76Q51O50kp32o29Q10P49j62j050l96R12R25m02j238n08J043J134
$$ 965 -26 -702 149 799 797 65 -564 246 995 833 -217 -613 299 1224 822 -416 -924 119 1253
1312A253n08j102n29J004Q69k86j148n42J017P22l31r59k15O79N35k98o97j20
$$ 1253 745 -357 -886 118 987 701 -447 -989 28 750 419 -540 -755 -76 459 161 -536 -656
1330f56O87L34m49n57P5P90K02p80n12K83Q69J68j019n75O27R36L9p66p79N93
$$ -656 31 365 -84 -641 -566 224 426 -354 -866 -583 286 454 -565 -1140 -513 423 462 -304 -1083 -490
1350d90J015K22j075p24N59J052K20p59p06L18Q18K13o88n13M67O36j02l77l00
$$ -490 525 747 -328 -1052 -493 559 779 20 -686 -368 450 663 -25 -538 -71 565 463 86 -214
1369b14M38K86o6m70p8M52L47k84n77l7Q03M6m32m30QP74L49o87p01J44P57L43
$$ -214 224 510 444 -26 -104 348 695 411 -166 -203 600 646 214 -216 -208 566 915 228 -473 -329 428 771
1391G71o07o41m9P80K01k36q54j5O83M33l54o31o6O10L26l72m65j23N28K27l84
$$ 771 164 -477 -526 254 455 219 -635 -650 33 466 112 -519 -585 25 351 -21 -486 -609 -81 146 -238
1412b38k35j9N21J70n29k49K77N18j38m36k42M76M00o4o71k75N97N95j38m89m17
$$ -238 -473 -492 29 199 -330 -579 -302 216 78 -358 -600 -124 276 212 -459 -734 -137 458 320 -169 -586
1433e86N45L62N5n51j74J73O17mm45j75K29L57nk73j26J60K54p5k24j35L61O8
$$ -586 -41 321 376 -175 -349 -176 441 437 -8 -183 46 403 398 125 -1 159 413 338 114 -21 340 408
1455D08j95j75J4K20J44l35k19J30L90J38m45k99MO07J57m93n13J21O37k3j79
$$ 408 213 38 52 272 416 81 -138 -8 382 520 75 -224 -220 387 544 51 -462 -341 296 273 94
1476I4o51J18M86J88j84n95J46L80J16m38O6k08M45N6k50j97O9L06P6k68j19K10
$$ 94 -557 -439 47 235 51 -544 -398 -18 98 -340 -274 -482 -37 19 -231 -428 -359 -53 23 -245 -364 -154
1498a54J15J13l25j66L63L49j98l24j62K98L34j11l34j57K72N67k24k60k60L52
$$ -154 -39 74 -251 -417 -54 295 97 -227 -389 -91 243 132 -202 -359 -87 480 256 -4 -264 88
1518H8L13j25k62k91M43J44J60l68k78M21N1J87l02j91K44K14k29q8j01K27L04
$$ 88 401 276 14 -277 166 310 470 102 -176 245 296 483 181 -10 234 448 219 131 30 257 561
1539E61l29j90k6J90Q3j38l29J37J86N4k71j95K0L40L3j07l53j03L83K50j68m95
$$ 561 232 42 16 206 289 151 -178 -41 145 199 -72 -267 -247 93 126 19 -334 -437 -54 196 28 -467
1561d67R3L64Q4k07l76J48K12J88k16j74J19J25O1j72j64K90J06N7k69l41N99
$$ -467 -374 -10 74 -133 -509 -361 -149 39 -177 -351 -232 -107 -46 -218 -382 -92 14 71 -198 -539 60
1582F0J21j01l08r1M14K73j02m08j30K86N58j96m57j59L52M65k43m29m8L27L28
$$ 60 181 80 -228 -319 95 368 266 -142 -272 14 572 376 -81 -240 112 577 334 -95 -143 184 512
1603E12j29m03k41M45L50o2n42j09M51K67k16j95k51L37L62l52l58p6L64K55k48
$$ 512 383 -20 -261 184 534 472 -70 -179 272 539 323 128 -123 214 576 224 -134 -210 154 409 161
1624A61l44QK43K53l76m51J73M62K19l77o59L57L96J34m28l32O7Q12q0m40l09
$$ 161 -183 -175 68 321 -55 -506 -333 129 348 -29 -688 -331 65 199 -229 -561 -494 318 238 -202 -511
1645e11K65L65O1m50j49J44L85M9l03k47K45K62K8l98r0L46L82j20l70l03M21
$$ -511 -246 119 180 -270 -419 -275 110 159 -144 -391 -146 116 144 -254 -344 2 384 264 -106 -409 12
1666A2N84k57n84j4M07L93k77m50m1L75M16k39n66P7M23L28k87n92J58L93K89
$$ 12 596 339 -245 -259 148 541 264 -186 -227 148 564 325 -241 -164 259 587 300 -292 -134 259 548
1687E48k47m51k2L50L49k70m43NN30Q4m43l86J70O22j42l26m11J47O22o9l81l97
$$ 548 301 -150 -172 178 527 257 -186 -181 349 433 -10 -396 -226 396 254 -72 -483 -336 286 217 -164 -561
1709e61K69N68n3o74j01L78M63n6o30l23L88O98l48m99j27L43N60j54l75m02N43
$$ -561 -292 276 223 -451 -552 -174 289 233 -397 -720 -332 366 18 -481 -608 -265 295 141 -234 -636 -93
1730i3L83j01o57k5M04M45K6p63J6M78L82m31n23K55N45L09m36n71J50N51L81
$$ -93 290 189 -468 -493 -89 356 382 -381 -365 113 495 64 -459 -204 341 650 214 -357 -207 344 725
1751G25m66m54K1P44K8m06n29J71O56M4l94n16L32M73J71p59j29K17M91K62p84
$$ 725 259 -195 -174 570 598 192 -337 -166 490 534 140 -376 -44 429 600 -159 -288 -71 420 682 -102
1772a02l80K58O07Q7p39l03N29N39j83n65m72O40N73j39o70l84P23L27j71o32
$$ -102 -482 -224 383 470 -269 -572 -43 496 313 -252 -724 -84 489 350 -320 -704 19 346 175 -457
1792d57k9J97P90l92p31K9M77O54o56n98J30P12K84l15o97K5O48L87m76n53K86
$$ -457 -486 -289 501 109 -622 -593 -116 538 -118 -716 -586 126 410 95 -602 -577 71 458 -18 -571 -285
1813b85N81Q2m12m50K08P20J75o31m67K94O65J26p18k94K68Q32q3q19j26N55L77
$$ -285 296 378 -34 -484 -276 444 619 -12 -479 -185 480 606 -112 -406 -138 694 611 -208 -334 221 598
1834E98j1p50m36Q34M75j44p40k56O30L92j23r13o5O86M86m15o57j45P56L37l02
$$ 598 587 -163 -599 235 710 566 -174 -430 200 592 469 -444 -509 177 663 248 -409 -554 202 539 237
1855B37q75K67P47K56n94o95J39Q09J92n19o64J07R70K10q45n41J56Q64K53p95
$$ 237 -638 -371 376 632 38 -657 -518 291 483 -36 -700 -593 377 587 -258 -799 -643 221 474 -321
1875c21l93K34Q62Jq34m63O40P59j47o15n43O70P01j1q79l95P39N79k05o67l37
$$ -321 -714 -480 382 383 -451 -914 -274 485 338 -277 -820 -150 551 540 -339 -734 5 584 379 -288 -625
1896f25P13O30j53r45k9M57Q16m44q13j75P50O69l43r56O3R29R0m68o88M6J106
$$ -625 88 718 565 -380 -409 48 864 420 -393 -568 182 851 508 -448 -385 544 634 166 -522 -476 630
1917F30q5o30j88j60O79L17m71m54L7O15O03j030m56K88P17J21r26m90O03N74
$$ 630 545 -85 -273 -433 246 563 92 -362 -325 290 893 -137 -593 -305 412 533 -393 -883 -280 294
1937B94k9l19p34R01O92m46k58o81O59N35j76n79n27R38K28k97q66K25O95K87
$$ 294 265 -54 -788 113 805 359 101 -580 79 614 438 -141 -668 270 498 201 -665 -440 255 542
1957E42p3q54L0O79J04l7r62j62J104K71o18o72j58J155L65m83r24M20Q81L01
$$ 542 469 -385 -355 324 428 391 -571 -733 371 642 24 -648 -806 349 714 231 -693 -273 608 909
1977I09r69n40K83R85K12r22o86O57P16J25o83p87O60R16k94o53q66J075O82k52
$$ 909 -60 -600 -317 668 880 -42 -728 -71 645 770 87 -700 -40 876 582 -71 -937 138 820 568
1997E68r29k58M97R61l76r47j03O96O57j99j231J9P34N74m35r64j98J105M04m31
$$ 568 -361 -619 -122 839 463 -484 -587 109 766 567 -664 -645 89 663 228 -736 -934 171 575 144
2017A44q87j09J146J58n33o31J5J006M17q47o44J87P38O58j003o78M35P90L73
$$ 144 -743 -852 294 452 -81 -712 -697 309 726 -121 -765 -578 160 818 -185 -863 -428 362 735
2036G35r67o40N31R46o3o90o07O59Q20l32o42m82O34Q89k48q10k68N36P58k07
$$ 735 -232 -872 -341 605 542 -148 -755 -96 724 392 -250 -732 -98 791 543 -267 -535 1 759 552
2056E52j177J04O85P26m73q30j11P73N68m44q68n5R55L67m60p32n2R37M39p64
$$ 552 -625 -521 164 890 417 -413 -524 249 817 373 -495 -550 405 772 312 -420 -472 465 904 140
2076A40q35K72P95M60j057o28M99Q60K49q80p36M73R44l7p68p43O49Q35j64o74
$$ 140 -695 -423 372 832 -225 -853 -354 506 755 -125 -861 -388 556 519 -249 -992 -343 492 328 -346
2096c46n51O05Q05k8r54k41N47O28k5j069j32N98P33q7j178l1Q05N80m09q61J
$$ -346 -897 -292 513 485 -469 -710 -163 465 440 -629 -761 -163 570 483 -695 -726 79 659 250 -611 -610
2117f10R25N24o77o62j79J088M09o81o90k8J144K15o41p51K22Q44M38o96q91M60
$$ -610 315 839 162 -500 -679 409 818 137 -553 -581 563 778 137 -614 -392 452 890 194 -697 -237
2137b37P00M65r53n77M05R36o6q43m72M84R88j81r41m16P84M82J10j026l79P39
$$ -237 463 928 -25 -602 -197 739 673 -170 -642 -158 830 649 -292 -708 76 558 668 -358 -737 2
2157BO51l08q86l14P24Q67l61j135l5Q59Q01p28p28l11R38O53n27p99l8Q71N13
$$ 2 653 345 -541 -855 -131 736 375 -760 -795 64 865 137 -591 -902 36 689 162 -637 -675 196 709
2178G09o66p85J31P75M81o95p88M14P08L32p65n52K27J023P5q74m62L60J021m6
$$ 709 43 -742 -611 164 645 -50 -838 -424 284 616 -149 -701 -474 549 624 -250 -712 -352 669 623
2198F23q63l89L87J116k90q19n44P14J055m78p72m15Q25N17k9j075j51P52O68
$$ 623 -240 -629 -242 874 584 -235 -779 -65 990 512 -260 -675 150 667 638 -437 -588 164 832
2217H32m33q45j27P42P51p10o92o1R11N03o08p59n3Q76M33o68p35J45Q06K30o20
$$ 832 399 -446 -573 169 920 210 -482 -543 368 871 263 -496 -549 327 760 92 -643 -498 308 538 -82
2238h2o49JR05N69j057l59J3R76K86o95r31P77N10L6m84j044P82Q10J69r30l18
$$ -82 -731 -730 175 744 -313 -672 -659 317 603 -92 -1023 -246 264 300 -184 -1228 -446 364 533 -397 -715
2259g15N28M83K14j338L26Q03M64j95j468K43P82Q05l91r82k91Q17J310r82o40
$$ -715 -187 296 510 -828 -502 301 765 570 -898 -655 127 932 541 -441 -732 85 1395 413 -227
2278b27l94Q00J117j053j165P12K60J028q03j100N06P72M20j124q40R90P54J22
$$ -227 -621 179 1296 243 -922 -210 50 1078 275 -825 -319 453 873 -251 -1091 -101 653 775
2296G75n30o83J91R48J13q47m81K17P80J41r99j49M55Q67l06j173k7P73M68P2
$$ 775 245 -438 -247 701 814 -33 -514 -297 483 624 -375 -524 -69 798 492 -681 -708 65 533 605
2316F05j056k02N26O79R8j159k25N32J030p82p11j36L83J115q84j98m18J048L90
$$ 605 -451 -653 -127 552 650 -509 -734 -202 828 46 -665 -801 -418 697 -187 -385 -803 245 635
2335F35n77q69L45O00N22n94q55K42N58O27q44n44L66P99L17r52n59L24J187L65
$$ 635 58 -811 -466 134 656 62 -793 -551 7 634 -210 -754 -388 411 728 -224 -783 -459 728 1093
2355A093j474k98K95J088k40m73o91P39N24K86j124l18P85L39k29q14q5O31P06
$$ 1093 -381 -679 -384 704 464 -9 -700 39 563 849 -275 -593 192 531 302 -512 -597 34 740
2374G40k38r06j4K31J144n97p04k38N45Q54j40j245j02Q75M60k50j055J47O94
$$ 740 502 -404 -418 -187 957 360 -344 -582 -37 817 677 -568 -670 205 665 415 -640 -493 201
2393B01L78m76r18K59Q70J17o72q49N20P96K42q48l27K74Q56K30q83n00N16O07
$$ 201 579 103 -815 -556 314 431 -241 -1090 -570 226 468 -380 -707 -433 423 653 -230 -730 -214 393
2413C93pm67p93R51K33J95p41m53P30N65j72o68k30M65P92n35r23Q3N15R06m83
$$ 393 386 -81 -874 77 310 505 -236 -689 41 606 434 -234 -464 1 793 258 -665 -582 -67 839 356
2434C56r09J20Q28L77m15r42J52Q83L00m07j025J30R71L98p59o76K64P32N26r20
$$ 356 -553 -433 395 772 357 -585 -433 450 750 343 -682 -552 419 817 58 -618 -354 378 904 -16
2454a6n87K53R69J72r54m60M77O73J78q22p00O83P12k17o10o70O29R17j09r03
$$ -16 -603 -350 619 791 -163 -623 -146 527 705 -117 -817 -134 578 361 -249 -919 -290 627 518 -385
2474c85m56N85Q82l14r44j61N31R22k08j117K1M91Q02k97j030n2Q63N55l83o67
$$ -385 -841 -256 626 312 -632 -793 -262 660 452 -665 -644 -153 649 352 -678 -730 133 688 305 -362
2494c62n07J212L31n52o10k1Q18M38p39o99K98Q39M67r48p14N08Q36J06n79q20
$$ -362 -869 343 674 122 -488 -509 309 747 8 -691 -393 446 913 -35 -749 -241 595 701 122 -698
2514f98M55Q75k7n23r31P64Q47l0o92p60M81R22Or47l01N46P81j59r94r7L86O39
$$ -698 -243 632 605 82 -849 -85 762 732 40 -720 -239 683 689 -258 -559 -13 768 609 -385 -482 -96 543
2536E43j08r44j20P35N87k65r26l07J065L36m39p98r3Q71M32n56q20K14Q07N00
$$ 543 435 -509 -629 106 693 428 -498 -805 260 596 157 -641 -734 137 569 13 -807 -593 214 714
2556G14p47p98L01P59N27r17p35K82R56K99p67o94M02R35P7p04p07N07R26n9o64
$$ 714 -33 -831 -530 229 756 -161 -896 -614 342 641 -126 -820 -418 517 594 -110 -817 -310 616 557 -107
2577a07o22O89P37N4r56m14N91P35r7j069l7O02P45l97q56k37P97P47n08q56k65
$$ -107 -729 -40 697 751 -205 -619 -28 707 610 -459 -496 106 851 454 -402 -639 158 905 397 -459 -724
2598g24R92M27m02p38j53P88O17n94p84J21O06O25o57p68K14Q00L79p80o56K17
$$ -724 268 695 293 -445 -598 190 807 213 -571 -450 156 781 124 -644 -430 370 749 -31 -687 -470
2618d70R66R7o73p35N03Q46j4p95o03N47Q96l4q79o36P31R04j51q82k18K87Q84
$$ -470 496 593 -80 -815 -312 534 520 -275 -878 -331 565 531 -348 -984 -253 651 500 -382 -600 -313 571
2639E71j33r25l59P74O76k86o92l31P64N50m07q25J2P83M91m68p06j7P76N67o91
$$ 571 438 -487 -846 -72 604 318 -374 -705 59 609 202 -623 -611 172 663 195 -511 -528 248 815 124
2660A24o89J30P84L56n09o95K10P49M33q89n52K36R42%o09n61L24Q19M6o02p18
$$ 124 -565 -435 349 705 196 -499 -289 460 893 4 -548 -312 630 630 21 -540 -216 603 649 47 -671
2681f71M86Q60o9q36m27M93P02q7p84l05N78P49l97o96k18M74P71n32n54k49Q24
$$ -671 -185 675 606 -230 -657 -164 538 451 -333 -638 -60 689 292 -404 -622 -148 623 91 -463 -712 112
2702A12N78n33q52M7P48M94l95r37J90Q33M34o81p48L14O70L98n64q34J07R92
$$ 112 690 157 -695 -648 100 594 199 -738 -548 285 719 38 -710 -396 274 672 108 -726 -619 373
2722C73L40p66o40K11R38J71q04m65L28Q61o3o43m38M62O30J39q93m01O46Q01
$$ 373 713 -53 -693 -482 456 627 -177 -642 -314 547 484 -159 -597 -135 495 634 -259 -660 -14 787
2742G87j68q57l17N35O42j77o80k84O15O99m40p40l24Q02N98k69r34r8P47N05
$$ 787 619 -238 -555 -20 622 445 -235 -519 96 795 355 -385 -709 93 691 422 -512 -610 137 642
2762F42m68q13J36P01M27n82o69P4Q55K73n55o34J36P71K93p00n62K55Q62O8p02
$$ 642 174 -639 -503 198 625 43 -626 -552 303 576 21 -613 -477 294 587 -113 -675 -420 442 510 -192
2783a92o15L79R05qp68m24N42N85J46j011j72N68N55n1o63m81N17Q25j62r18k12
$$ -192 -807 -428 477 469 -299 -723 -181 404 550 -461 -633 -65 490 439 -224 -705 -188 637 475 -443 -655
2804f55O76N66k15o38l49P93M69m71o68N7P97K77m78n77J66O68L88o54m63k2Q12
$$ -655 21 587 372 -266 -615 178 647 176 -492 -435 362 639 161 -416 -250 418 806 152 -311 -333 479
2825D79J40n97m29K8J077q6o61n93L81O98J30p98m79N20P52J0o76n83N47N89P4
$$ 479 619 22 -407 -379 698 612 -49 -642 -261 437 567 -231 -710 -190 562 572 -104 -687 -140 449 523
2846E23q92m02P27O39j68q06k61O02P43o27o31L1M36O41m57p20oO25N75k63q34
$$ 523 -369 -771 -44 595 427 -379 -640 -38 705 78 -553 -522 -86 555 98 -622 -628 -3 572 309 -525
2867e25o1P36L35k44q36K54N93L64n39n65J45P34K52p24k75Q3O11K47o40l72L17
$$ -525 -586 150 485 241 -595 -341 252 616 77 -488 -343 391 643 -81 -356 -273 338 585 -55 -427 -110
2888a10N53J48p52k68M74L47O2o28l41N22P27l64o26k63N45M96q7n88j85L88N81
$$ -110 443 591 -161 -429 45 392 454 -174 -515 7 734 370 -256 -519 26 522 435 -153 -338 50 631
2909F31l55p08M6N08M55j79o57j16M24L71k45p73K98N86J84m33n48Q4O55P8m56
$$ 631 276 -432 -386 122 577 398 -259 -375 49 420 175 -598 -300 286 470 37 -511 -427 228 306 -150
2930a50k36J5N58K81o37m68J91Q33j22m75l75L86O45J3p49k98O31K60Q6n70m92
$$ -150 -386 -371 187 468 -169 -637 -446 387 265 -210 -585 -199 446 459 -290 -588 43 303 389 -181 -673
2951f73P34N39k51n38k95L11P48k74o74l3L97N30k95o23M7M74M18l80m10q3O79
$$ -673 61 600 349 -189 -484 -173 575 301 -373 -406 -9 521 226 -397 -350 124 542 162 -248 -331 348
2972C48J73l38n63J06N27L82o26l90Q3M85M05n09m20J49M47L55p50l27L17N67
$$ 348 521 183 -380 -274 253 635 9 -381 -298 187 592 83 -337 -188 259 614 -136 -463 -146 421
2992D21m6l71n64M21M87j33k51m36N05K96p0n97j69L93M16j23n23k7K82M72k85
$$ 421 375 4 -560 -139 348 215 -36 -472 33 329 259 -338 -507 -114 302 179 -344 -371 -89 383 98
3013I8n38l7M19N23m03m16j59M96M20j37p42P9P47k3l80k64M4M60K16m18l47J45
$$ 98 -440 -477 -58 465 62 -354 -513 -17 403 266 -476 -397 350 327 -53 -317 -273 187 403 -15 -362 -217
3035b17M64M04n76k22m7M60K02l85m64L04M24O4m60k07K86L92n0m15j32J24M57
$$ -217 247 651 75 -147 -194 266 468 83 -381 -77 347 411 -49 -256 30 422 372 -43 -175 -51 406
3056D06M9r89J15M70L10j02l46l09K01Q65m96o52L08J78L70J8o65j17N21J77l21
$$ 406 455 -534 -419 51 361 259 -87 -396 -195 670 174 -478 -170 8 378 396 -269 -386 135 312 -9
3077im61pQ22L05p29j61J6L63K17m37k04L56J30J58n93ml43J062l45l7k10m6L57
$$ -9 -470 -477 345 650 -79 -240 -224 139 356 -81 -285 71 201 359 -234 -238 -581 481 136 99 -111 -157 200
3100B00K40m56l83L46K51J72q91O39j45K04J86m64n80Q90J96j30l90r2M05K19
$$ 200 440 -16 -399 -53 198 370 -521 118 -27 177 363 -101 -681 209 405 275 -115 -207 198 417
3120D17J89p64l42P97L9r8n54R7M08Lo5m23K34K64J48j97p25N80L87k36m27p2
$$ 417 606 -158 -500 297 336 238 -316 -219 189 192 127 -296 -62 202 350 153 -572 8 395 159 -268 -340
3142c40N05K33k25M06o82l01P90L8m21j60M57j63O8m19k71N99O08o98r0o31L29
$$ -340 165 398 173 579 -103 -404 386 424 3 -157 300 137 205 -214 -485 114 722 24 -66 -697 -368
3163c68N17Q41j087n00N55N10q00P7k68P41L4n4k34q21Q67L74k31m96q0M79J58
$$ -368 149 990 -97 -597 -42 468 -332 -255 -523 218 252 198 -36 -857 10 384 153 -343 -423 56 214
3184B14o6n03L55L6K03K9n26J02N05l14J23n62K60N06R1n55j48J88N52j59j06
$$ 214 148 -355 0 36 239 268 -258 -156 349 35 158 -404 -144 362 453 -102 -250 -62 490 331 225
3205B25n77L91M97p2m15m02K05K00J75k37m71M33J73q9l44j46M93L49k24m80J02
$$ 225 -352 39 536 464 49 -353 -148 52 227 -10 -481 -48 125 36 -308 -454 39 388 164 -316 -214
3226b14J99L15l00J73k82K08J39l08%j83J49L69k94k47Q2J65J99k62k75L42J69
$$ -214 -15 300 0 173 -109 99 238 -70 -70 -253 -104 265 -29 -276 -194 -29 170 -92 -367 -25 144
3247A44R0l03k81M4M85l2j65l08J04L18J65l04j20Q3K73J73l60k23J11L13kJ5
$$ 144 234 -69 -350 -306 179 147 -18 -326 -222 96 261 -43 -163 -80 193 366 6 -217 -106 207 205 220
3269B20m34K16K96o3l01j32K08K33o2k11j65K64K90j84k37j72K36J88j74j79j4
$$ 220 -214 2 298 235 -66 -198 10 243 181 -30 -195 69 359 175 -62 -234 2 190 16 -163 -177
3290a77K86J94l22j25R8K57Q1k39k94J0K85K24j81l79J28K61J28l08k71J00M50
$$ -177 109 303 -19 -144 -46 211 292 53 -241 -231 54 278 97 -282 -154 107 235 -73 -344 -244 206
3311B06Qk90j44m8L32J91m58L3M8K36J48m61p7J56L51M9n16K06r3L10l4l29j65
$$ 206 214 -76 -220 -268 64 255 -203 -170 -122 114 262 -199 -276 -120 231 280 -236 -30 -123 187 153 -176 -341
3334c41K06N54k43l97k7L77O9Pm07M1K54K46j03l89OL52J09j46k83k01N86l3k36
$$ -341 -135 419 176 -221 -248 129 198 205 -202 -161 93 339 236 -153 -147 205 314 168 -115 -316 270 237 1
3357Anj47K74J09k93j67O0K94J35k13n9Q0OJ18k29k01J56L05P4m24k15J79M74
$$ 1 -4 -151 123 232 -61 -228 -168 126 261 48 -11 69 75 193 -36 -237 -81 224 298 -126 -341 -162 312
3380C12q6k61j02K5L37k36j31l2L2L11k10k09p2L14J8P9l99J14K56K12k36l33
$$ 312 226 -35 -137 -112 225 -11 -142 -174 -142 169 -41 -250 -322 -8 10 89 -310 -196 60 272 36 -297
3402b97J55J40R3j02r7j55M63l6j99k20J59K73O3l09n%J53P8k18q3J44K98n6k59
$$ -297 -142 -2 91 -11 -108 -263 200 164 -35 -255 -96 177 240 -69 -74 -74 79 157 -61 -144 0 298 242 -17
3426a7j56K18R4R9k73j22J21K27ql20l2J72L42r3k81o2J18J11P1l82p4L42R5o1
$$ -17 -173 45 139 238 -35 -157 -36 191 183 -137 -169 3 345 252 -29 -91 27 138 209 -173 -247 95 190 129
3450A29k97l3K72J69k24k43M9K34O2j42k78LM36ok17k18J65N7L94l83j51J70K25
$$ 129 -168 -201 71 240 16 -227 -178 56 118 -24 -302 -299 137 131 -86 -304 -139 -82 312 -71 -222 -52 173
3473A73K0j26m01L91m9J22j51k85K90J53j36q2jL2K63j20p8q2M2J95qk95m3K57
$$ 173 193 67 -334 57 8 130 -21 -306 -16 137 1 -81 -82 -50 213 93 15 -67 -25 170 162 -133 -176 81
3497H1J10q4j30m1J77J79ol95K2K52O8k48r9J45Q3J72k26j21R5L0K11k15k33Q7
$$ 81 191 107 -23 -64 113 292 286 -109 -87 165 233 -15 -114 31 114 286 60 -61 34 64 275 60 -173 -86
3521h6K73q7j29j79L25l0j1k71q0J72L60j08k27j86J53L10j33j68j58J90J26r2
$$ -86 187 100 -29 -208 117 87 76 -195 -275 -103 257 149 -78 -264 -111 199 66 -102 -260 -70 56 -36
3543c6K2l14K55L38j24k36j45K58J39J3k45p2J60K79j78k36k7J38K79k59j36m7
$$ -36 -14 -328 -73 265 141 -95 -240 18 157 170 -75 -147 13 292 114 -122 -149 -11 268 9 -127 -174
3565a74K76R1l07o5N5L28L9k96j58Q9K87n3j50j98L11j2J11j18j12Q3J06O9k90
$$ -174 102 193 -114 -179 -124 204 243 -53 -211 -122 165 112 -38 -236 75 63 174 56 -56 27 133 202 -88
3588h8MJ22K38j35k44j28K70K67k16k35o7K49Q5q5j99l8K34R0N2l97j2K17M1o5
$$ -88 -84 38 276 141 -103 -231 39 306 90 -145 -212 37 122 37 -162 -200 34 124 176 -221 -233 -16 25 -40
3612d0j78P4J66J06j89j76J92J17Jj09j74M7R0K46k69j14Q4J91L9j26l51M71N7
$$ -40 -218 -144 22 128 -61 -237 -45 72 73 -36 -210 -163 -73 173 -96 -210 -126 65 104 -22 -373 98 155
3635A55m2j23k84J35L02O1k36j67J90K20j43j92j25L47J82j81j66J15K2L1K7j58
$$ 155 113 -10 -294 -159 143 204 -32 -199 -9 211 68 -124 -249 98 280 99 -67 48 70 101 128 -30
3657c0j97K55K84j66l61Q9K91N6l4k24P8J58j48k6r8O0K02j20j19j58K07J35L
$$ -30 -227 28 312 146 -215 -126 165 221 187 -37 41 199 51 25 -73 -13 189 69 -50 -208 -1 134 137
3680A37j52K1O6l5N8k54l8J50K41n9k14k38K67J31j1j58j64O9K04J27k80k3K56
$$ 137 -15 6 72 37 95 -159 -197 -47 194 135 -79 -317 -50 81 70 -88 -252 -183 21 148 -132 -155 101
3703A01M6k42n1j3K04j19J84l05P6K08P3j27j1j44K66J5k41o7R9J08q8J72k47
$$ 101 147 -95 -146 -159 45 -74 110 -195 -119 89 162 35 24 -120 146 161 -80 -147 -48 60 -28 144 -103
3726a03O4J94J34k16k56K04K28Mk07j37Q8J62k4q1p8oJ23Qj86J0L1J83n0k82K1
$$ -103 -39 155 289 73 -183 21 249 253 46 -91 -3 159 135 54 -24 -30 93 101 -85 -75 -44 139 89 -193 -172
3751a72K66R7k00k4q8K28l5j9j71OK62j26L1k83O7K11K6k54L1O3K1K02k09j09
$$ -172 94 191 -9 -33 -121 107 72 53 -118 -112 150 24 55 -228 -161 50 76 -178 -147 -84 -63 139 -70 -179
3775a79L6J37J37j04k76K58L6Jq4j02n0K17K8j32k3P2j7J55j96r3J71K38j41j39
$$ -179 -143 -6 131 27 -249 9 45 46 -38 -140 -190 27 55 -77 -100 -28 -45 110 -86 -179 -8 230 89 -50
3799e0j6K49k5j11l7j14K00P1j2k80J35O2K42j01k05j8R2J60k42j2O0N3J68l07
$$ -50 -66 183 158 47 10 -104 96 167 155 -125 10 72 314 213 8 -10 82 242 0 -12 48 101 269 -38
3823c8r8K23j31J98q3r5OJ19p9o2o7L4K29j05l03Q9N9J91q8j8k77L12q2J53j62
$$ -38 -136 87 -44 154 71 -24 -18 101 22 -40 -107 -73 156 51 -252 -163 -104 87 -1 -19 -296 16 -66 87 -75
3848g5l5kJ7m1K2n8J01K03o6j87j99L76j4M1j53jJ08j0K2j03J4K47j1j56k84J06
$$ -75 -110 -112 -95 -136 -114 -172 -71 132 66 -121 -320 56 42 83 -70 -71 37 27 49 -54 -40 207 196 40 -244 -138
3874a38K54N6r4j87P9Q0J21l51P5J43N0L4j4j25M7J50l8l4k58K36mP5j45L6j03
$$ -138 116 172 78 -109 -30 50 171 -180 -105 38 88 122 108 -17 30 180 142 108 -150 86 82 157 12 48 -55
3899e5P1M3j13j04K74Rk03k3qK44o4j08K8RM2K0j13j41l0K72o0j07o6J71J39j8
$$ -55 16 59 -54 -158 116 125 -78 -101 -109 135 71 -37 -9 0 42 62 -51 -192 -222 50 -10 -117 -183 -12 127 109
3925A09q7j37K5J20K6O0l27N4K2K74j71Nq5J00Q3p0j38J28J43J7j32o9J52o4L
$$ 109 22 -115 -90 30 56 116 -211 -157 -135 139 -32 -27 -112 -12 71 1 -137 -9 134 151 19 -50 102 38 41
3950D1n1M4O6m3o6jp8NJ73M5l4p4Q6L3p8j5M5Mk2L3j28rN6J36j69j04m6R5K82
$$ 41 -10 34 100 57 -9 -10 -88 -83 90 135 101 27 113 146 68 53 98 102 80 113 -15 -24 32 168 -1 -105 -151 -56 226
3979B26j81j62J8J31O3k65n6J68N9Q6k24J11J9O7q7o9k0j1J25Q7j59k03K92P3
$$ 226 45 -117 -99 32 95 -170 -226 -58 1 87 -137 -26 -7 60 -27 -96 -116 -127 -2 85 -74 -277 15 88
4003H8k15Kk3J84q7l6l5L9K11k5k06pO6J43j0j19n5J2K02p5j39n0L19l0q0R1j75
$$ 88 -127 -125 -148 36 -51 -87 -122 -83 128 103 -103 -110 -44 99 89 -30 -85 -73 129 54 -85 -135 184 154 74 165 -10
4030a0mJ16K6j58K5Q6q7K05k41k8J1K34r9n6p2N1L00k67k3j3J21j0L2j78j34J15
$$ -10 -14 102 128 -30 -5 81 -6 199 -42 -70 -59 175 76 20 -52 -1 299 32 9 -4 117 107 139 -39 -173 -58
4056e8O7m4k2j31M0K09j1j25J0p6J23L1o1l3R7ON5j11r6K30j41o8j9J44%k5J9
$$ -58 9 -35 -57 -188 -148 61 50 -75 -65 -141 -18 13 -48 -81 16 22 77 -34 -130 100 -41 -109 -128 16 16 -9 10
4083A0j03L6O3m1r1J03o9J71J5r6j8l0QJ82j44K4r7K05k32J4J38JJ37k25M2J0
$$ 10 -93 -57 6 -35 -126 -23 -92 79 94 -2 -20 -50 -42 140 -4 20 -77 128 -104 -90 48 49 186 -39 3 13
4109A3q6K03N0k01l0P8j15J37n9j27K51P0j65j36L30j27m3J7k2j55P2J1J10k63
$$ 13 -73 130 180 -21 -51 27 -88 49 -10 -137 114 184 19 -117 213 86 43 60 38 -117 -45 -34 76 -187
4133a87J72K7O4k18J17j35J07N7n0q6L5Q1K1o8j06J89k3k4r8O9k4M9m0J7q2K70
$$ -187 -15 12 76 -142 -25 -160 -53 4 -46 -132 -97 -16 5 -63 -169 20 -3 -27 -125 -56 -80 -31 -71 -54 -136 134
4159A34j90l7KK4n5N0J04r9j2R5J2j17Q3j69K36M4k71K15q3N1K1jr1R5R1m3m0
$$ 134 -56 -93 -91 -67 -122 -72 32 -67 -79 16 28 -89 -6 -175 61 105 -166 49 -34 17 38 37 -54 41 132 89 49
4186D9On4l4N2K3j66qJ67J84q7j19L4o2K60k59L1k9J4j02qO6P6K8kk07K17J5J16
$$ 49 55 1 -33 19 42 -124 -132 35 219 132 13 47 -15 245 -14 17 -12 2 -100 -108 -42 34 62 60 -147 70 85 201
4214B01j07l85K84n9J41r4j80K5K32Po5j19M2r8J68K6o0K2J1J19j96M7k0J2Q0
$$ 201 94 -291 -7 -66 75 -19 -199 -174 58 65 0 -119 -77 -175 -7 19 -41 -19 -8 111 -85 -38 -58 -46 34
4239C4l0j0R5j3o8P1p9J06L4j07p3j29jK74l9j46MqK15j51N0O8q6O5l7nr2J50
$$ 34 4 -6 89 76 8 79 0 106 140 33 -40 -169 -170 104 65 -81 -77 -85 130 -21 29 97 11 76 39 34 -58 92
4267I2MJ5M5O6J96l95kK86j23k23pm02J82L51j71K66j81k0J19O8k03qpn5M0J3
$$ 92 96 111 156 222 418 23 21 307 184 -39 -46 -448 -266 85 -86 180 -1 -21 98 166 -37 -45 -52 -107 -67 -54
4293e4rJ95j14q2l7J67j23O1o5J96k59JK98l03L09k73j09K04J42j76J2j76m61
$$ -54 -63 132 18 -64 -101 66 -57 4 -61 135 -124 -123 175 -128 181 -92 -201 3 145 -31 -19 -195 -656
4316f56J110n31J61K07k92l0n2J24J52k75J49k79J12K38j51M04K1j96k86L3J53
$$ -656 454 -77 84 291 -1 -31 -83 41 193 -82 67 -212 -100 138 -13 391 412 216 -70 -37 116
4337A16J70J81n20j22ML58j80n75P82p0k63Q4j24O02j89j03j48j7J16k16J08n8
$$ 116 286 467 -53 -175 -171 187 7 -568 214 144 -119 -35 -159 443 254 151 3 -14 102 -114 -6 -64
4359f4lJ53j07n0J15m0M5lk13O7k3J26K8N6j34J00q2nM6m9K6J37j15q0M1j7o1
$$ -64 -67 86 -21 -71 44 4 49 46 -167 -100 -123 3 31 87 -47 53 -29 -34 12 -37 -11 126 11 -69 -28 -45 -106
4386a06R2o7P9j0K2l4J7N5L8o1M2Rl9o9N3N6j1p3O9p0q5J21m7J83k55L7J8K00
$$ -106 -14 -81 -2 -12 10 -24 -7 48 86 25 67 76 37 -32 21 77 66 -7 62 -8 -93 28 -19 164 -91 -54 -36 164
4414A64j6j67l3p1K33K3Kr9j32O7N2o6R8O2l8l3M3m4p9l1J32l9K1p4L2P7r3j5
$$ 164 148 -19 -52 -123 110 133 135 36 -96 -29 23 -43 55 117 79 46 89 45 -34 -65 67 28 49 -25 7 84 -9 -24
4442b4j0R1J07k02PR1j01L3o1J13j98N2N0j14O0L5N9j04P6K3RQ0m3p6p6J35N1
$$ -24 -34 57 164 -38 -31 60 -41 -8 -69 44 -154 -102 -52 -166 -106 -71 -12 -116 -40 -17 -8 72 29 -47 -123 12 63
4469F3n4j92J64R0o1k3l1m5J65J7j16L2j18K09K0j36J09j31J02k1j41J85o0J66
$$ 63 9 -183 -19 71 10 -13 -44 -89 76 93 -23 9 -109 100 120 -16 93 -38 64 43 -98 87 27 193
4493A93j23j07Q0L9o9M4p6K2Q9l3p4L3M3M1R8j51j16J61K2o1R3j31j09L31k77
$$ 193 70 -37 43 82 13 57 -19 3 92 59 -15 18 61 102 200 49 -67 94 116 55 148 17 -92 239 -38
4518c8J5p2K58j64L7j00k5j37R8J44L8k11J51o4m5R2j01L8J04r9l6J7m5j5K42
$$ -38 -23 -95 163 -1 36 -64 -89 -226 -128 16 54 -157 -6 -70 -115 -23 -124 -86 18 -81 -117 -100 -145 -160 82
4543H2q2j17M7j3J22j34K42q5J6q7J48q2j6PJ17K3j12j32Q4L4p1o7L5Q6m5q9Q5
$$ 82 0 -117 -70 -83 39 -95 147 62 78 -9 139 57 41 48 165 188 76 -56 28 62 -9 -76 -41 45 0 -89 -4
4570dJ17j12n3J35m3j5j1l4Q8q0L5R6j04M6j67J27m0Q1p1o4L3n3Q4K5O7Mq5MM
$$ -4 113 1 -52 83 40 25 14 -20 68 -12 23 119 15 61 -106 21 -19 62 -9 -73 -40 -93 -9 16 83 87 2 6 10
4599A0j3J3k5L4r4O0Q4j7j61P9R6q3K6o5L1k5R1j20K3j0L5P8J17j38j46R0J39
$$ 10 -3 10 -15 19 -75 -15 69 52 -109 -30 66 -17 9 -56 -25 -50 41 -79 -56 -66 -31 47 164 26 -120 -30 109
4626A09j24j42J29pJ56j35P5p3J24j67Q5r8O7J98j82p3l6M4J04n2N2lp8M1j9N7
$$ 109 -15 -157 -28 -35 121 -14 61 -12 112 -55 30 -68 -1 197 15 -58 -94 -50 54 2 54 51 -27 14 -5 52
4652E2j29J13K8j23N1j11K12m2R3j67k5L7P2l6k7n2Q1P2p5M5j3p8J53j50J7p2
$$ 52 -77 36 64 -59 -8 -119 93 51 144 -23 -48 -11 61 25 -2 -54 27 99 24 69 56 -22 131 -19 -2 -74
4678g4O9N5j60N9j2N1j1J6J37j75P3l2kr0P8L3J26j97jN2m8Rj7k0N8J82k59N4
$$ -74 -5 50 -110 -51 -63 -12 -23 -7 130 -45 28 -4 -6 -96 -18 15 141 -56 -57 -5 -53 -44 -61 -81 -23 159 -100 -46
4706d6K3Q3O0k4N0j52k0K6j4K0q0N7K32k56K5J15j6J8o8j10J28R8j59lj01J64
$$ -46 -23 60 120 96 146 -6 -26 0 -14 6 -74 -17 215 -41 -16 99 83 101 33 -77 51 149 -10 -13 -114 50
4732E0k1J5Nj59J67K8j05p5P3J06j51J1J27j27J54j9m5j18k5o4J35L1oj26J98
$$ 50 29 44 49 -110 57 85 -20 -95 -22 84 -67 -56 71 -56 98 79 34 -84 -109 -173 -38 -7 -13 -139 59
4757E9j8j27J86k08J58n0r6n9J00J50q9q2o5J35O0k3m0r5M0J61q5j5j0K5L5o3
$$ 59 41 -86 100 -108 50 0 -96 -155 -55 95 6 -76 -141 -6 54 31 -9 -104 -64 97 12 -3 -13 12 47 -16
4783a6L9n8L3P1L0j05J2qN2r5Q6L7L2p1J1j8N3J2M1K4l12K62j10P7j3M3j78L2
$$ -16 23 -35 -2 69 99 -6 6 -2 50 -45 41 78 110 39 50 32 85 97 138 162 -150 112 2 79 66 109 -69 -37
4811c7J14j29rJ39q0J19o9j07M9J40j69k4O3n1k1K04l03J82k1N9k04J11Q9Kj1
$$ -37 77 -52 -61 78 -2 117 48 -59 -10 130 -39 -63 0 -51 -72 132 -171 11 -10 49 -155 -44 45 47 36
4836C6L7m2K0k0l1O5j63J53j30J80j8j60J41j18J84r6k35K66L4j02Jp9J56n7Q7
$$ 36 73 31 51 31 0 65 -98 55 -75 105 87 -73 68 -50 134 38 -197 69 103 1 2 -77 79 22 109
4861A09Q6k53O5J4lR7k02J6J07j10J25k8M5J18m1j48m4Q4r6Q8l1O9JQ6j96j8o8
$$ 109 195 -58 7 21 18 115 -87 -71 36 -74 51 23 68 186 145 -3 -47 37 -59 29 -2 67 68 154 -42 -60 -128
4888a28K7J81L0r7Ml5n5J42m1n0J04Ql19J88J21P7j13j36J2KN3J18j87M5o3J5
$$ -128 -101 80 110 13 17 -18 -73 69 28 -22 82 90 -229 -41 80 157 44 -92 -80 -78 -25 93 -94 -49 -112 -97
4914i7NR9j46Q3KlM9N7j29J09j1j33J19J00q7q5O0J0Mk6m1N4j06J08J3M9k9k6
$$ -97 -92 7 -139 -56 -54 -57 -8 49 -80 29 18 -115 4 104 17 -68 -8 2 6 -20 -61 -7 -113 -5 8 57 28 2
4942BL2jJ07j82P4j27N8J16j03j90K56K5j44J85n7Q8j19j0m4J04j19J40p9P1o7
$$ 2 34 33 140 -42 32 -95 -37 79 -24 -214 42 67 -77 108 51 139 20 10 -34 70 -49 91 12 83 16
4967A6N7j3L8j67J14O1k13J9J82l0j41pk4o3J73R4q5r7k2P7o4J03r3M2q0O9j2
$$ 16 73 60 98 -69 45 106 -107 -88 94 64 -77 -84 -108 -171 2 96 11 -86 -108 -31 -95 8 -85 -43 -123 -54 -66
4994f6P9P4J1k57R3n8O5J25j56j6J25p0J27J3qp4j4p8J15k3o8J30j8k5o1ML5Q5
$$ -66 13 87 98 -159 -66 -124 -59 66 -90 -106 19 -51 76 89 81 7 -7 -85 30 7 -61 69 51 26 -35 -31 4 89
5022H9l0Jr3lJ21j40l8N1J27j3j63R9n6O0J2k0l6k8N5J93j32p9J17Lj5k00K50
$$ 89 59 60 -33 -36 85 -55 -93 -42 85 72 -91 8 -48 12 24 4 -32 -60 -5 188 56 -23 94 97 82 -118 132
5049A32j31o1P3k5j21Q3Q3l9j05j13J63Q4o8J16j37J44j2j47j40J56K74j74P0
$$ 132 1 -60 13 -12 -133 -50 33 -6 -111 -224 -61 23 -45 71 -66 78 66 -81 -221 -65 209 35 105
5072A05j04K7J09r5J02k38R0N8O0j38M4j47J47L0j34j01J22J05j33K43j28NO6
$$ 105 1 28 137 42 144 -94 -4 54 114 -24 20 -127 20 50 -84 -185 -63 42 -91 152 24 29 95
5095I5O8k74J82R2p3L7m3k57K10RJ4j32J17j62J53O6j05L6Q7o2lkj09Q2J8K0n4
$$ 95 163 -111 71 163 90 127 84 -173 37 46 60 -72 45 -117 36 102 -3 33 120 58 55 53 -56 26 44 64 10
5122A0j21J97j9q5j3k3J1L5J55j45o9r5K09N3k55N9J89k84K14n2OK8Q7p4k21J38
$$ 10 -111 86 67 -18 -31 -54 -43 -8 147 2 -67 -162 47 100 -155 -96 93 -191 23 -29 -23 5 92 18 -203 -65
5148f5l5O6M6JJ34q8q7N0o7J17N4J9j57j24L42k02R7j2q2L5m2l2N8N1p7P4j06
$$ -65 -100 -34 12 13 147 59 -28 22 -45 72 126 145 -12 -136 206 4 101 89 7 42 0 -32 26 77 0 74 -32
5175c2r0J44KJ45j50q9K28j13J30j26j78L1K80j09r6J7O4q0K34j92r6J12L6QM4
$$ -32 -122 22 24 169 19 -70 158 45 175 49 -129 -98 182 73 -23 -6 58 -22 212 20 -76 36 72 80 124
5200A24j68o5pQ1P2j58R9NP2p7o2lK2p7Q5R7o4J41j75m1J71j63J78j75l3j15K28
$$ 124 -44 -109 -116 -35 37 -121 -22 -17 55 -22 -84 -87 -65 -142 -57 40 -24 117 -58 -99 72 -91 87 -88 -121 -236 -8
5227hn3M2k7L9M8M0K4k90K92j69K72j71K8j48K24Jm4p3n7O5K0j7k0O8L6p6K3j8
$$ -8 -61 -19 -46 -7 41 81 105 -185 107 -62 210 39 67 -81 143 144 100 27 -30 35 55 38 18 86 122 46 69 51
5255E1n9k6J24j29l9K4J74l1j13k31L70lj76P0J82j23l1j07l7l4J29p1Q6J3l4
$$ 51 -8 -34 90 -39 -78 -54 120 89 -24 -255 115 112 -64 6 188 65 34 -73 -110 -144 -15 -86 0 13 -21
5280b1M0Rm2p3L3P7L7J8j54m3P6j07M0Q3J6P8k4q6J24j94J35J62j86N2j65Q1N0
$$ -21 19 28 -14 -87 -54 23 60 78 -76 -119 -43 -150 -110 -27 -11 67 43 -43 81 -113 22 184 -2 50 -115 -34 16
5307A6j18J03l6J72k0k9nj33N8O0j60J41l2R3J20k45l5q7J76j16O9l5M2P3J4r8
$$ 16 -102 1 -35 137 117 88 83 -50 8 68 -92 49 17 110 230 -15 -50 -137 39 -77 -8 -43 -1 72 86 -12
5333a2m1n5K33k2j87J25jO4j88Q3j01K87m5j87J00L0k8p1n8L1j2J9Q3j58J9M8
$$ -12 -53 -108 125 103 -84 41 40 104 -84 -1 -102 185 140 -47 53 83 55 -16 -74 -43 -55 -36 47 -111 -92 -44
5359d4J13K4p8j36K10j45J10k31O2J44P8j16J03j74O3j8l7R0mp3J1J29Mj28J05
$$ -44 69 93 15 -121 89 -56 54 -177 -115 29 107 -9 94 -80 -17 -35 -72 18 14 -59 -48 81 85 -43 62
5384F2OQ9j61qJ15Q7k28p0N3L3J14j00jn0O6Rj6j61O0J96rjj1j83J66o6Q2k00
$$ 62 68 157 -4 -12 103 190 -38 -108 -55 -22 92 -8 -9 -59 7 16 0 -161 -101 95 86 85 74 -109 57 -9 73 -127
5412a27J73J87p9j00n5o4M1J7k6p9J6K15%j03N7j04L6O7lj12n1j2N5n3K4R6P6
$$ -127 46 233 154 54 -1 -65 -24 -7 -33 -112 -96 119 119 16 73 -31 5 72 69 -43 -94 -106 -51 -104 -80 16 92
5439I2j46k6J66J9M5j16J2j47J95r1o4P8K2K8o2n4M6k8O9n2l7m8J53j20J51k04
$$ 92 -54 -80 86 105 150 34 46 -101 94 3 -61 17 39 67 5 -49 -3 -31 38 -14 -51 -99 54 -66 85 -119
5465a19O7J10n5P2j23P5n5K24p8j37J5N7o1M6M3pq8N2O7q9r8LO0P4j6j46K42j03
$$ -119 -52 58 3 75 -48 27 -28 196 118 -19 -4 53 -8 38 81 74 -14 38 105 16 -82 -79 -19 55 39 -107 135 32
5493C2N0j51K2mP7P2j99P5qJ00j33J58q2J72j76M6j02l3J61L4j45Qj7J01n1J1
$$ 32 82 -69 -47 -51 26 98 -101 -26 -34 66 -67 91 9 181 5 51 -51 -84 77 111 -34 -26 -43 58 7 18
5519A8k04J81K9jl9j7J7l3M1j51K50PMj88RJ26O9M6j21j13O3J19J3n2j72J4J42
$$ 18 -186 -5 24 23 -16 -33 -16 -49 -8 -159 91 98 102 -86 -77 49 118 164 43 -70 -7 112 125 73 -99 -85 57
5546E7J45j83j32Q0m3J95%j41L3PJ69r7j11m8J26P2j54L5J24R9k16R2k62K99l2
$$ 57 202 19 -113 -33 -76 119 119 -22 11 18 187 90 -21 -69 57 129 -25 10 134 233 17 109 -153 146 114
5571A14j56P4p7q2J60J28k29k6N8P1j09M0M6jJ8q6O6o6P6p8L1M1k0M3j34J03j13
$$ 114 -42 32 -45 -127 33 161 -68 -94 -36 35 -74 -34 12 11 29 -57 9 -57 19 -59 -28 13 -7 36 -98 5 -108
5598a08J79j06NJ38k16J11L7P8j14L5m5q7J33l1n7j76K80j15R8J1o3J05M1k49
$$ -108 71 -35 -30 108 -108 3 40 118 4 39 -6 -93 40 9 -48 -224 56 -59 39 50 -13 92 133 -116
5622a16M4n7K87l4j05j92K36K3K3j40%O6p9K2QJ6J12J60l07Q5qr0J43o4j05K06
$$ -116 -72 -129 158 124 19 -173 63 86 109 -31 -31 35 -44 -22 -14 2 114 274 -33 52 44 -46 97 33 -72 134
5648A34k11J07Nj13J14o0J35r6j77R2J05k2p1%j24J51o2J08j22o9J70jOnj07K48
$$ 134 -77 30 35 -78 36 -24 111 15 -162 -70 35 13 -58 -58 -182 -31 -93 15 -107 -176 -6 -7 -1 -6 -113 135
5674A35m6l45L22q7j12J08J08k41J72j00J09j13P1L5R5n0k38qJ85J45j91l0oM5
$$ 135 89 -256 66 -21 -133 -25 83 -158 14 -86 23 -90 -19 16 111 61 -177 -185 0 145 -46 -76 -82 -37
5698c7J64J03k01o8K2R0j44J2L39k36j4K28m36L82n7j89M26j44k87j08K29J00
$$ -37 127 230 29 -39 -17 73 -71 -59 280 44 30 258 -178 204 147 -42 384 240 -47 -155 74 174
5720A74K1j64K78l21J84l97L87n5j9J40j75l43K51K67k02l09M18k43J98J36n00
$$ 174 195 31 309 -12 172 -225 162 107 88 228 53 -290 -39 228 26 -283 135 -108 90 226 -274
5741b74L46k3R0k04M6p7K44k48K64j45J72p0j12K2J74l42K48l3m6j24K68M4j31
$$ -274 72 49 139 -65 -19 -96 148 -100 164 19 191 121 9 31 205 -137 111 78 32 -92 176 220 89
5764H9k39J97j28J68j97l3L61k6j91l95J95M08p1o7q4j6n9J34r6L1M2L6O3R1k99
$$ 89 -150 47 -81 87 -110 -143 218 192 1 -394 -199 209 138 71 -13 -29 -88 46 -50 -19 23 59 122 213 -86
5789h6q6J35J85j73K5n1P1J3K9q4J18K5K6j32j27L5L5M7j26J59m3j0J3r3o9O1
$$ -86 -172 -37 148 -25 0 -51 20 33 62 -22 96 121 147 15 -112 -77 -42 5 -121 38 -5 -15 -2 -95 -164 -103
5815a03O6J23j18o6J01L2m6L4m6J01n9k0j5o5O2K8j00j8J73j10R5lj10L2m3J62
$$ -103 -37 86 -32 -98 3 35 -11 23 -23 78 19 -1 -16 -81 -19 9 -91 -109 64 -46 49 46 -64 -32 -75 87
5841H7ol2p1j18K27rr8MJ25j15O7o9J13p3J37j21OP1o3O5j07o9J9P5j7J90l12
$$ 87 81 49 -22 -140 87 78 -20 -16 109 -6 61 -8 105 32 169 48 54 125 62 127 20 -49 -30 45 28 218 -94
5868i4J32KJ7K2o0j26J51k8q3L3N3j0l9Q3Or6N2K7j42K25m8j08J0p2J02O9j53
$$ -94 38 40 57 79 19 -107 44 16 -67 -34 19 9 -30 53 59 -37 15 42 -100 125 77 -31 -21 -93 9 78 -75
5895g5J57p9n1R3n4J9j5j6O3rr4J37%l3J4P1k37P9K6M2o6n2QN8j78K45p9j3J28
$$ -75 82 3 -48 45 -9 10 -5 -21 42 33 -61 76 76 43 57 128 -109 -30 -4 38 -28 -80 -72 -14 -192 53 -26 -39 89
5924H9m6l2q0J11q3L6K5K2m8J53o8o1j22K46j86QJ9k1J52j03Q5q7m1Q2P8j90O8
$$ 89 43 11 -69 42 -41 -5 20 42 -6 147 79 18 -104 142 -44 -36 -17 -38 114 11 96 9 -32 50 128 -62 6
5951Fr8N2j1N5Onq0p8O5M2o1K15o3M7j48O3r6Q7r4J07j07K18j47j0o2J47N1j55
$$ 6 -92 -40 -51 4 10 5 -75 -153 -88 -46 -107 108 45 92 -56 7 -89 -2 -96 11 -96 122 -25 -35 -97 50 101 -54
5979e4L7j07K26k09J44L8j46P7nn4QJ36k3j51J50n3R3mq1k5J42j91J5J15q1L7
$$ -54 -17 -124 102 -107 37 75 -71 6 1 -53 -45 91 68 -83 67 14 107 103 22 -3 139 -52 -37 78 -3 34
6005C4l8o3P7K9oJ19p9r1k2q2J54j8J04j47q8L9J15R6n3j45Jm1Q4o0J8M4L1K2
$$ 34 -4 -67 10 39 33 152 73 -18 -40 -122 32 14 118 -29 -117 -78 37 133 80 -65 -64 -105 -21 -81 -63 -19 12 34
6033C4n7p3J24j57J34J2l5R9j10J4O1j40J37l9n7O0l9O1J9j9j49O3J43j56j4N9
$$ 34 -23 -96 28 -129 5 17 -18 81 -29 -15 46 -94 43 4 -53 7 -32 29 48 29 -120 -57 86 -70 -84 -25
6059b5N1N0j32O5n5j04J90j48P8j32R2J73l9j0l2j23J14J1On6R4j08P3j91K48
$$ -25 26 76 -56 9 -46 -150 40 -108 -30 -162 -70 103 64 54 22 -101 13 24 30 -26 68 -40 33 -158 90
6084I0j17NQ0j79J70j9j6L2l4P8n2J6r9J43k48K45J26l68J15p9R4J0l6L1J8M4
$$ 90 -27 -22 58 -121 49 30 14 46 12 90 38 54 -45 98 -150 95 221 -147 -32 -111 -17 -7 -43 -12 6 50
6110E0K9n0L3n9R9P4j95L8o9Q6K1M1j10J30j13P9j43j23Q5P9J27j92n7K77k04
$$ 50 79 29 62 3 102 176 -19 19 -50 36 57 98 -12 118 5 84 -59 -182 -97 -18 109 -83 -140 137 -67
6135f7L4n2J46r9Q1p9r7N1J62j18n8J6N9o2N8Nn1J26J04Jp4q7P4j2L2n4j5R8l4
$$ -67 -33 -85 61 -38 43 -36 -133 -82 80 -38 -96 -80 -21 -83 -25 -20 -71 55 159 160 86 -1 73 61 93 39 24 122 88
6164H8K5p4J4l9O5j92Q9P2j31J49Q8q3j16oJ97q1j01k3j2J04j6o3m1L3K1J06j14
$$ 88 113 39 53 14 79 -113 -24 48 -83 66 154 71 -45 -51 146 65 -36 -59 -71 33 17 -46 -87 -54 -33 73 -41
6191d1M6k7n4J0J52j60Q0M4j00m6k1J52n4K6o6K46m4j08l9l6K5J41q5Nj82K3J1
$$ -41 5 -22 -76 -66 86 -74 6 50 -50 -96 -117 35 -19 7 -59 187 143 35 -4 -40 -15 126 41 46 -136 -113 -102
6218a02J42n5k3o9J23r3k0J19p0J18r4M0j20J08m5Q9qj75K99k2k51Q8L1k7K45
$$ -102 40 -15 -38 -107 16 -77 -97 22 -48 70 -24 16 -104 4 -41 48 40 -135 164 142 -109 -21 10 -17 228
6243B28k46K40r8j77N7R7k10K8J47m3k5q2M2O2P3%j5q7j1J04j85J5L1P5k4rL8
$$ 228 -18 222 124 -53 4 101 -109 -81 66 23 -2 -84 -42 20 93 93 78 -9 -20 84 -101 -86 -55 20 -4 -13 25
6270B5JnL9J5j76J63Rk3km4L1K8j39J27j67J28J04p5q8L4J8J5K7p7M0p4J22j6
$$ 25 26 21 60 75 -101 62 71 48 46 2 33 61 -78 49 -118 10 114 39 -49 -15 3 18 45 -32 8 -66 56 40
6298D0j43O7J53l6j02M8J9Ln7J8j08J30O0l3q6pNj3P0j15o7J87jQ6o4r4r3J95
$$ 40 -103 -36 117 81 -21 27 46 49 -8 10 -98 32 92 59 -27 -34 -29 -42 28 -87 -154 33 32 118 54 -40 -133 62
6326F2k0M4M7l05J85L4L6j0r3J35l8j27J4L7P7j63l6n4N8J87l2j41Q1m3J91r2
$$ 62 42 86 133 -172 13 47 83 73 -20 115 77 -50 -36 1 78 -85 -121 -175 -117 70 38 -103 -22 -65 126 34
6352C4j54N2M4Q2j48jQ7J95j11o9p3M8P6p5K1L1j52P9lk8L2n3J75j25nl8K7pJ1
$$ 34 -120 -68 -24 58 -90 -91 -4 191 80 11 -62 -14 62 -13 8 39 -113 -34 -37 -65 -33 -86 89 -36 -41 -79 -52 -59 -48
6381d8Nn2J15pj7k3Qj8J48j30J36k1j7M7j25n7J42j48N3P8l6J44j00jl8l9Q0m1
$$ -48 -43 -95 20 13 -4 -27 -19 -37 111 -19 117 96 79 126 1 -56 86 -62 -9 69 33 177 77 76 38 -1 79 38
6409C8q0l1M0p4J69p4P0j83J00J64j37QM7N1j16P4q0L0l7N3l4j66J61J32j10q5
$$ 38 -42 -73 -33 -107 62 -12 58 -125 -25 139 2 10 57 108 -8 66 -14 16 -21 32 -2 -168 -7 125 15 -70
6435g0j4P4lJ1j42J75j62K03M5jk26J05l1J27q2L5MM0j28J6J7j3M1O8K3l3r2K5
$$ -70 -84 -10 -13 -2 -144 31 -131 72 117 116 -110 -5 -36 91 9 44 48 88 -40 -24 -7 -20 21 89 112 79 -13 12
6463A2j6j07J06J91j62q8N6m3J07j09J63m1j24M3j8Q1j2%N1q6N6q2M2M6L0j57
$$ 12 -4 -111 -5 186 24 -64 -8 -51 56 -53 110 69 -55 -12 -30 51 39 39 90 4 60 -22 20 66 96 -61
6489f1n6J55l4J36m1L7j59O9O7j07j8r7J83o8k7j0J8r9J27k5l8l7N0k9L8J5JO9
$$ -61 -117 38 4 140 99 136 -23 46 113 6 -12 -109 74 6 -21 -31 -13 -112 15 -10 -48 -85 -35 -64 -26 -11 -10 59
6517E9j17o2J12j1K7r2R3rl2N7M9n1j27J93k8M9j21J42j13p4J05j41K8R3Q8n4
$$ 59 -58 -120 -8 -19 8 -84 9 0 -32 25 74 23 -104 89 61 110 -11 131 18 -56 49 -92 -64 29 117 63
6543F3k07J82k2R1L5j79l3R5L2j05l1L0R3J7j56LN9J51q6o1J07j67N3R6Oo8o1
$$ 63 -144 38 16 107 142 -37 -70 25 57 -48 -79 -49 44 61 -95 -92 -33 118 32 -29 78 -89 -36 60 66 -2 -63
6570f3M3p5P7j32R0M3J14j09r7pJ50j37L9k8J37L1p5p2K7p2Q4po5N4K7J25k09
$$ -63 -20 -95 -18 -150 -60 -17 97 -12 -109 -116 34 -103 -64 -92 45 76 1 -71 -44 -116 -32 -39 -104 -50 -23 102 -107
6597a07O5mJ22R8k37k3j6rJ43o1J28p5R0M6r4o6K7J28q8l8j13J19l3MK6n2o2N2
$$ -107 -42 -46 76 174 -63 -86 -102 -111 32 -29 99 24 114 160 66 0 27 155 67 29 -84 35 2 6 32 -20 -82 -30
6625c0L5k9K11l47L06j48K8j1k8jM1j55J3j4J25pl1J32MK0j24K0o0J24m1j34K6
$$ -30 5 -24 187 -160 146 -2 26 15 -13 -14 27 -128 -115 -129 -4 -11 -42 90 94 114 -10 10 -50 74 33 -101 -75
6652g5qJ08r9J15o9j30N0J18K9k8Kl3Pj19J06K6O0r7j07N4k5J60j22Lj05J23L0
$$ -75 -83 25 -74 41 -28 -158 -108 10 39 11 13 -20 -13 -132 -26 0 60 -37 -144 -90 -115 45 -77 -74 -179 -56 -26
6679b6J02q1j02J8N4N2m4LJ03lL0r4q4R0J8K6r3q2K43p5r4lK1l1PJ28k25J10K4
$$ -26 76 -5 -107 -89 -35 17 -27 -24 79 76 106 12 -72 18 36 62 -31 -113 130 55 -39 -42 -21 -52 -45 83 -142 -32 -8
6708hjj1J3J32Kr2r9JL0J12o7J04o6j95J60pn8k0N4NJ51p1j05J00r3J93j33R7
$$ -8 -9 -20 -7 125 127 35 -64 -63 -33 79 12 116 50 -145 15 8 -50 -70 -16 -11 140 69 -36 64 -29 164 31 128
6736A28j98J13j25kP9k5n8Q5m1K3m5K6lp0J07o0J82p3j02M1j2N0o8J52J5o9JJ2
$$ 128 -70 43 -82 -84 -5 -30 -88 -3 -44 -21 -66 -40 -43 -113 -6 -66 116 43 -59 -18 -30 20 -48 104 119 50 51 63
6764F3k32J14N4MO9o7mR2m1q0r3J46R8n9r9p2J02Q3L5q0K9n1n0P0L3j13OO6jJ2
$$ 63 -169 -55 -1 3 72 5 1 93 52 -28 -121 25 123 64 -35 -107 -5 78 113 33 62 11 -39 31 64 -49 -43 23 22 34
6794C4n8j9j27J20J46j84J27Q2j52k7N5J6o8P3J2q3K11j61j00Q1Qj16K13m4q9
$$ 34 -24 -43 -170 -50 96 -88 39 121 -31 -58 -3 13 -55 18 30 -53 158 -3 -103 -22 -14 -130 83 39 -50
6819e0L2P3L9r2j16MJ03N5j11K6j7Mj46O4J18q9J57Nl2n4J5J03p2J3o6L8K0J02
$$ -50 -18 55 94 2 -114 -110 -7 48 -63 -37 -54 -50 -196 -132 -14 -103 54 59 27 -27 -12 91 19 32 -34 4 24 126
6847A26j89JJ36j18K1J41j06j10J74o4K9P9j87J65Jj65k2M5o9J66r8p8J63M8k3
$$ 126 -63 -62 74 -44 -23 118 12 -98 76 12 41 120 -67 98 99 -66 -88 -43 -112 54 -44 -122 41 89 66
6872F6k1M4p4j6r1O6L2L4r3j5R8o4N1k2l1N9%p3P8r8J81r5n3K3K2J4J30l9j75
$$ 66 45 89 15 -1 -92 -26 6 40 -53 -68 30 -34 17 -5 -36 23 23 -50 28 -70 111 16 -37 -14 8 22 152 113 -62
6901f2j2J25n3K8K3nN9j04P3m7k7o0n5J15J05j17n5j9K76k31J3J5J09j68J5K2
$$ -62 -74 51 -2 26 49 44 103 -1 72 25 -2 -62 -117 -2 103 -14 -69 -88 188 -43 -30 -15 94 -74 -59 -37
6927c7M5M6J9O6p5j1nj04J8l2M7J07m6Kj60Q1K49k08j28J24M1R1j52M7J9j56O7
$$ -37 8 54 73 139 64 53 48 -56 -38 -70 -23 84 38 40 -120 -39 210 2 -126 -2 39 130 -22 25 44 -112 -45
6954d5J22J5k28J56%J25k44k4K21n0j78N4M6J8oJ42j67L3J4m9O1o3J7k7PJ67j87
$$ -45 77 92 -136 20 20 145 -99 -123 98 48 -130 -76 -30 -12 -18 124 -43 -10 4 -45 16 -47 -30 -57 -50 117 -70
6981g0j3J33J39k04r5N3j03J96M1L9j92R8j55J62o4j1J76j47N6J14k26L0O8r3
$$ -70 -83 50 189 -15 -110 -57 -160 36 77 116 -76 22 -133 29 -35 -46 130 -17 39 153 -73 -43 25 -68
7005f8O4L3N3l1p2n2P1M2J47j79k5N4m4J20k30N5R5oOKo4K5L6J04k16RR1J15j56
$$ -68 -4 29 82 51 -21 -73 -2 40 187 8 -17 37 -7 113 -117 -62 33 27 33 35 -29 -4 32 136 -80 -71 20 135 -21
7034b1n7J6P5M7o4mRN5j17J3P3n3MN3k8n7m4O1N8K1j13J22j20n1J68l0J35q1K9
$$ -21 -78 -62 13 60 -4 -8 1 56 -61 -48 25 -28 -24 29 1 -56 -100 -39 19 40 -73 49 -71 -122 46 16 151 70 99
7063I9m3r9J02l1O7k1L7j41M0j6P3l3k4J23j23j9n4L9J02l6K8j14J30l6j1p6J3
$$ 99 56 -43 59 28 95 74 111 -30 10 -6 67 34 10 133 10 -9 -63 -24 78 42 70 -44 86 50 39 -37 -24
7090b4R9q1J00j54j4N9L0K7Kq4O7j29J89j42rP4o6M5r1J66n5K0nj14R5OJ03j71
$$ -24 75 -6 94 -60 -74 -15 15 42 44 -40 27 -102 87 -55 -64 10 -56 -11 -102 64 9 29 24 -90 5 11 114 -57
7118e7L3O5m6m5k9P3K2J8lj01l5L19j52j51J0R8j9R5jj60mp4J32m7Ll2L0Q6j27
$$ -57 -24 41 -5 -50 -79 -6 16 34 31 -70 -105 214 62 -89 -79 19 0 95 94 -66 -70 -144 -12 -59 -56 -88 -58 28 -99
7147i9J47mn9k9PK4o3M3J03L4j07o9K8R6j24J3J21Q4q3l5r9J19j72J13J6KQJ13
$$ -99 48 44 -15 -44 -37 -13 -76 -33 70 104 -3 -72 -44 52 -72 -59 62 146 63 28 -71 48 -124 -11 5 7 15 128
7175A28p0k15J41j52J11K16k17P4o2J37m0%p4rj46J49q9rK81j85P1R0j75N4j38
$$ 128 58 -157 -16 -168 -57 159 -58 16 -46 91 51 51 -23 -32 -178 -29 -118 -127 154 -31 40 130 -45 9 -129
7200a29J00O2K1L2j27q5J49j6r9J28n8L5Q2n6m4Q5j76J27n0Q2p7m2qP2l0P4l6
$$ -129 -29 33 54 86 -41 -126 23 7 -92 36 -22 13 95 39 -5 80 -96 31 -19 63 -14 -56 -64 8 -22 52 16
7227A6m3O4n1K6j08k5J49m1M6q1J31m5m2n3l1QK16j21j23R5m3J09pj09K1l2Q9
$$ 16 -27 37 -14 12 -96 -121 28 -13 33 -48 83 38 -4 -57 -88 -80 136 15 -108 -13 -56 53 46 -63 -42 -74 15
7254A5n4P9j9J2L1k68J41K5Q2k2l9M0k4M8mk4L4m6K5n1J5L8l6l1L2Om0rN5n9J43
$$ 15 -39 40 21 33 64 -204 -63 -38 44 22 -17 23 -1 47 43 19 53 7 32 -19 -4 34 -2 -33 -1 5 -35 -44 11 -48 95
7285I5j12J35l6j48O9j11K10L5k50L2N0J09mk28K31j22J17J26k72K4PM9M0Q2n1
$$ 95 -17 118 82 -66 3 -108 102 137 -113 -81 -31 78 74 -154 77 -45 72 198 -74 -50 -43 6 46 128 77
7310G7j24M5l5PJ02j54J29l7k0j01J84r9M0N1M2j72J77j67J29O0j27RJ01j3j10
$$ 77 -47 -2 -37 -30 72 -82 47 10 -10 -111 73 -26 14 65 107 -65 112 -55 74 134 7 16 117 104 -6
7335fR5n6n5N7L9k4o5q5J38n9J09j15l5q4J25J4n1k8M2o1R2l7J70l6j13J69p3
$$ -6 89 33 -22 35 74 50 -15 -100 38 -21 88 -27 -62 -146 -21 -7 -58 -86 -44 -105 -13 -50 120 84 -29 140 67
7362F7n5p2k6J86j57o0P9L8n7r2J06kN3J0l0j40J68o0O5L8l5j67K10j53J66p3
$$ 67 12 -60 -86 100 -57 -117 -38 0 -57 -149 -43 -45 8 18 -12 -152 16 -44 21 59 24 -143 67 -86 80 7
7388GP7r1q3J42n6K2O1n1k0n1J65j88o6O8L7j61J29L6m4J6Q8J1j8j45K37l5j88
$$ 7 84 -7 -90 52 -4 18 79 28 8 -43 122 -66 -132 -64 -27 -188 -59 -23 -67 -51 37 48 30 -115 122 87 -101
7415a01J57p9M8Q5q6j27O1j69K11m3j15J03L8K5n8KL5j5OP4jj03L8K08j84P0m4
$$ -101 56 -23 25 110 24 -103 -42 -211 0 -43 -158 -55 -17 8 -50 -48 -13 -28 -22 52 51 -52 -14 194 10 80 36
7442C6j20K18j41j11Q0J20j02J30n2M3j26%%R6j12l7q1K46j52O6l0O5o5J7m9M3
$$ 36 -84 134 -7 -118 -38 82 -20 110 58 101 -25 -25 -25 71 -41 -78 -159 87 -65 1 -29 36 -29 -12 -61 -18
7468a8J3n2Q6j07P7J7j1q5J57L3k00M2k5j2J12j03J7K8n8J2R0m4k8k8P9m6P6Q7
$$ -18 -5 -57 29 -78 -1 16 5 -80 77 110 -90 -48 -73 -85 27 -76 -59 -31 -89 -77 13 -31 -59 -87 -8 -54 22 109
7496A09r7J16k06R3j14P3MO9k8o7J62j44q9J27R5k03M1J07r5M0K2m5J21r6m1Q
$$ 109 12 128 -78 15 -99 -26 -22 47 19 -48 114 -30 -119 8 103 -100 -59 48 -47 -7 15 -30 91 -5 -46 -38
7522c8Q1j00J03L0o8j07O2R9n3PJ14j41O4k3K7pN8q2K0m1N0n2O9j28j5J33j01
$$ -38 43 -57 46 76 8 -99 -37 62 9 16 130 -11 53 30 57 50 108 26 46 5 55 3 72 -56 -71 62 -39
7549c9P9j42R7k3N9j57M3J20j37KJ02O3j6o0m4O3m6J66k78J55Q1r5J6R1j55M3
$$ -39 40 -102 -5 -28 31 -126 -83 37 -100 -98 4 67 51 -9 -53 10 -36 130 -148 7 88 -7 9 100 -55 -12
7575a2l0L3Mpk7R5J1Km9m4j5nN9Np2m0J5O3j44Q0J70j54M2J13k28K63r8L0k32
$$ -12 -42 -9 -5 -12 -39 56 67 69 20 -24 -39 -44 15 20 -52 -92 -77 -14 -158 -78 92 -62 -20 93 -135 128 30 60 -172
7604a72J85O2O1j17J50m9l1N7j61OL9P4k00J05O2oP3j51l0K27j94J5k5J26j34
$$ -172 13 75 136 19 169 120 89 146 -15 -9 30 104 -96 9 71 65 138 -13 -43 184 -10 5 -20 106 -28
7629b8O0nr1L3N0K0p8mN8p2K3L1r4J18r1Q1J01k50J03j54J76J32p5P8j08O3O8
$$ -28 32 27 -64 -31 19 39 -39 -43 15 -57 -34 -3 -97 21 -70 11 112 -138 -35 -189 -13 119 44 122 14 77 145
7656A45j11Qj63J80Q4j40O7o3N6j49J09K5L8J08j64oM7o5Mr3J20J17k87J89n1
$$ 145 34 42 -121 59 143 3 70 7 63 -86 23 48 86 194 30 24 71 6 10 -83 37 154 -133 56 5
7681Eo3L4R1Q6J7N5k77J10J37j49o5R5l0m3Lo4J81r3q8Q5J51k10O2O3j19M3J98
$$ 5 -58 -24 67 153 170 225 -52 58 195 46 -19 76 46 3 6 -58 123 30 -58 27 178 -32 30 93 -26 17 215
7708B15k22r9P5J14ok3o5K36j98j42J29m3J6j10N6J32j01K2n8J1J15P4j76J10
$$ 215 -7 -106 -31 83 77 54 -11 225 27 -115 14 -29 -13 -123 -67 65 -36 -14 -72 -61 54 128 -48 62
7732F2j67O9J9j15J80K7j2k7j12j5J11P0j4L8k2j7k4J01j83j17K07K9j3j05kq5
$$ 62 -105 -36 -17 -132 48 75 63 36 -76 -91 20 90 76 114 92 75 51 152 -31 -148 59 88 75 -30 -32 -117
7758a17J12l1J2P0n6mJ88j45o3j30J60R6j13k8O7k0l6p6J42k3o9R2r4P1P0kL3
$$ -117 -5 -36 -24 46 -10 -14 174 29 -34 -164 -4 92 -21 -49 18 -2 -38 -114 28 5 -64 28 -66 5 75 73 106
7785A06j39J18p3o3K8K4J02m5j11O0N0j51R2J22j83jJ61n2l6k7lo7J95k70P2O9
$$ 106 -33 85 12 -51 -23 1 103 58 -53 7 57 -94 -2 120 -63 -64 97 45 9 -18 -21 -88 107 -163 -91 -22
7811b2R9p8q0L6J1J09o3M9k24J03j21K77j02p9J02qjp9P2m1J70Mj72P9j8l7Q0
$$ -22 77 -1 -81 -45 -34 75 12 61 -163 -60 -181 96 -6 -85 17 9 8 -71 1 -40 130 134 -38 41 23 -14 66
7838F6p2Q6nm9j3Pj8J18q8j54J47J0Q3j08N3r9L2P0L7j38j1R2J1m4m4K8Qn3r6
$$ 66 -6 80 75 26 13 20 2 120 32 -122 25 35 118 10 63 -36 -4 66 103 -35 -46 46 57 13 -31 -3 5 -48 -144
7867a44J44K1j5k4l2L4n5N8L6RJ05p0k04J71O1j50J6P9P6k2r6L1rpJ08l4j70K2
$$ -144 0 21 6 -18 -50 -16 -71 -13 23 32 137 67 -137 34 95 -55 -39 40 116 94 -2 29 20 13 121 87 -83 -61
7895f1N1j5M7K2k9rM9l6j19N3J51n5p6J01p4J5O1j46R7kK5m7l1L5%n4n5J86j31
$$ -61 -10 -25 22 44 15 6 55 19 -100 -47 104 49 -27 74 0 15 76 -70 27 25 50 3 -28 7 7 -47 -102 84 -47
7924d7J77j11M2n6m5o7J28K5p4p0m5K45j40o1J07kJ8j37J05L6j8q3J74j71J68
$$ -47 130 19 61 5 -40 -107 21 46 -28 -98 -143 102 -38 -99 8 6 24 -113 -8 28 10 -73 101 -70 98
7949I8K2j65L2j09O2j34J41k2L1O9o3J31k62L72l59K7J80O7j72J7q3R9J48j57
$$ 98 120 -45 -13 -122 -60 -194 -53 -75 -44 25 -38 93 -169 203 -156 -129 51 118 -54 -37 -120 -21 127 -30
7973c0R9q3P9lML7q6J56k74K33Jj86M9k6P1r2J64j93j4J63q6j19K57o3j18P1P0
$$ -30 69 -14 65 62 66 103 17 173 -101 132 133 -53 -4 -30 41 -51 113 -80 -94 69 -17 -136 121 58 -60 11 81
8000H1p6k5l5R7L8j92P3M7p9J55j35O8n4m1J72r0R0j89J41M3k15K43m7K2j37J69
$$ 81 5 -20 -55 42 80 -112 -39 8 -71 84 -51 17 -37 -78 94 4 94 -95 46 89 -126 117 70 92 -45 124
8026A24p2o2Mr8K26k04q8J40j8R6j63J62l4o8M7Q0M9k1k44K52k47J30N7l7K8j11
$$ 124 52 -10 -6 -104 122 -82 -170 -30 -48 48 -115 47 13 -55 -8 72 121 100 -144 108 -139 -9 48 11 39 -72
8052g2N1O6q8o2J91j05L6j19J20o2O2J21j45q9J91j05n5O2j09J02n8J55j31K8
$$ -72 -21 45 -43 -105 86 -19 17 -102 18 -44 18 139 -6 -95 96 -9 -64 -2 -111 -9 -67 88 -43 -15
8076a5kJ00j38P4p5J68k04J31k02O8N2m9J48q1rM6L7r1N9L7M9j14N3l3L5n1j41
$$ -15 -17 83 -55 19 -56 112 -92 39 -163 -95 -43 -92 56 -25 -34 12 49 -42 17 54 103 -11 42 9 44 -7 -148
8103a48J40pP1m8L4j14K5oP6k9o0oN9j19M4M3jJ06Mp6nk5j5Q0O2j14J2L0J07q9
$$ -148 -8 -15 56 8 42 -72 -47 -53 23 -6 -66 -72 -13 -132 -88 -45 -46 60 64 -12 -17 -42 -57 23 85 -29 -17 13 120 31
8133C1m7j3N1j04J80j17l7Q3J03p9l0K6n2J75j33P5q5MrJ4M1j69J26j07m6K12
$$ 31 -16 -29 22 -82 98 -19 -56 27 130 51 21 47 -5 170 37 112 27 31 22 36 77 -92 34 -73 -119 93
8159I3p9j3nl7k2R8l1l5K8r4K19j16r7K02k21P4lp3J68n3L9j15J13K4q9m2j4K5
$$ 93 14 1 -4 -41 -63 35 4 -31 -3 -97 122 6 -91 111 -110 -36 -39 -112 56 3 42 -73 40 64 -25 -67 -81 -56
8187e6K9j02J66r7
$$ -56 -27 -129 37 -60
8191f0
$$ Imaginary data points
##PAGE= N=2
##DATA TABLE= (X++(I..I)), XYDATA
0@%%%%%%%%%%qJ6j6J6k4L2m0M8n6P2q8J04j23J47j76K08k40K76l20L68m23M87
$$ 0 0 0 0 0 0 0 0 0 0 0 -8 8 -8 8 -16 16 -24 24 -32 40 -48 56 -67 80 -96 112 -128 148 -172 196 -227 260
32B60n54O28p13Q06r06J018j142J276j424J584j757J951k161K388k639K913l212
$$ 260 -294 334 -379 427 -479 539 -603 673 -751 833 -924 1027 -1134 1254 -1385 1528 -1684
49a684L537l896M295m732N215n755O359p039P812q701R733j0950J2411j4203J6462
$$ -1684 1853 -2043 2252 -2480 2735 -3020 3339 -3700 4112 -4589 5144 -5806 6605 -7598 8864
64H864j9405K3426k9292L8748n7177J52762m16778O1245N52208l71096r8013K19277
$$ 8864 -10541 12885 -16407 22341 -34836 117926 -298852 -237607 314601 -56495 -154508 64769
76F4769q5268n2942J15965q475Q7407j34945j37206K61911N0987l51981Q4314
$$ 64769 -20499 -73441 42524 34049 121456 -13489 -150695 111216 162203 -189778 -105464
87a05464K12231j27095l9268M9825m507R7144m4844p8455R5862q8301l5135K19799
$$ -105464 106767 -20328 -59596 -9771 -14278 82866 38022 -40433 55429 -32872 -68007 151792
99A51792j86724j87670K75363K8309j38059J20958q7093p4274K20979l5445j32912
$$ 151792 -34932 -222602 52761 81070 -56989 63969 -23124 -97398 123581 88136 -44776
110d4776K0805p3130Q7851J64778k31970q3899K67309p8952r0004J98415j27511
$$ -44776 -23971 -97101 -9250 155528 -76442 -160341 106968 28016 -61988 136427 8916
121H916j60022K51448m364k13896R5609L8423m7936P1140n6763l4876J32294m0338
$$ 8916 -151106 100342 95978 -117918 -22309 16114 -31822 39318 -17445 -52321 79973 39635
133C9635p0534O4022m7496j3523P8655m1405p1772M532N9893J03695p3997j61514
$$ 39635 -30899 33123 -14373 -27896 50759 9354 -62418 -57886 2007 105702 31705 -129809
145a29809J35912J25938j43859k4275P6428j04230J1301J41258p8728q2183N0871
$$ -129809 6103 132041 -11818 -36093 40335 -63895 -52594 88664 9936 -72247 -21376
156b1376K3998O3738J040j55439M3566J48410r8312p2074O2321n507K534K6696
$$ -21376 2622 66360 67400 -88039 -44473 103937 5625 -66449 -4128 -9635 -7101 19595
168A9595l9518J2531K3186k3335N5651j8239j17422O2620J18824r5287q1497O1656
$$ 19595 -19923 -7392 15794 -7541 48110 29871 -87551 -24931 93893 -1394 -82891 -21235
180b1235L1146K0907L363o2249r686N9643J4882q688m7094n0540O8891M7109m7795
$$ -21235 9911 30818 34181 -28068 -37754 21889 36771 28083 -19011 -69551 -660 46449 -1346
193a346j8488k731N519P0391j0854q4391K7980L7195j8087M356k6487l0892P2280
$$ -1346 -19834 -22565 -17046 53345 42491 -41900 -13920 23275 5188 9544 -16943 -47835 24445
206B4445J7964p7196J8564M2048j5772J2631n239o0138K1320O3298j6911m9487
$$ 24445 42409 -34787 -16223 25825 10053 22684 17445 -42693 -21373 41925 25014 -24473
218b4473k7659M3019O5947k7490o0133J7724J4177R410L9386n0850o7243N1340
$$ -24473 -52132 -9113 56834 29344 -30789 -13065 1112 10522 49908 -942 -68185 -16845
230a6845N8964k5194l0613j7330J8523N3301j6242m3183P320J1666J326J3855
$$ -16845 42119 16925 -13688 -31018 -12495 40806 24564 -18619 -11299 367 1693 15548
242A5548k6656k4658L9094J9171k0030k0278J366L4505K1460m9357l0527L8982
$$ 15548 -11108 -35766 3328 22499 2469 -17809 -16443 18062 39522 -9835 -40362 -1380
254a380J6550k911j1052l8251M548O7607N475n2918j5529J3289L4720J7420l9797
$$ -1380 15170 12259 1207 -37044 -32496 35111 40586 -12332 -27861 -14572 20148 37568 -2229
267b229l9520K0927L5244J3461k1588m1470J9179M5462l853k9706r650K787K2097
$$ -2229 -41749 -20822 14422 27883 6295 -35175 -15996 29466 25613 -4093 -13743 -10956 11141
280A1141J0084l4534j0029K5921J2825o661j1676j5164K1437L3138k7132l6474
$$ 11141 21225 -13309 -23338 2583 15408 8747 -2929 -18093 3344 36482 9350 -27124
292b7124Q493L0511J3054j8990l5560O975L9684J1842j4684l3569r371L9461K8191
$$ -27124 -18631 11880 24934 5944 -29616 -22641 17043 28885 14201 -19368 -28739 10722 38913
305C8913l3363l5287P151K5760K3101j5699l3131K367L3884P931j6745j7571n241
$$ 38913 5550 -29737 -22586 3174 26275 10576 -22555 -20188 13696 21627 4882 -12689 -17930
318a7930K4904J0788k3344j6813J5861J8191J834j9425j5918K3296K0539j0707
$$ -17930 6974 17762 -5582 -22395 -6534 11657 13491 -5934 -21852 1444 21983 11276
330A1276k5234r669J7894K9393p482l9183m729K9875K5190r623l0652j5705K7139
$$ 11276 -13958 -23627 -5733 23660 16178 -23005 -27734 2141 27331 17708 -12944 -28649 -1510
343a510L0366j4011l0995j0603K2706K5554n143k8461o033J8958J7343j766k7116
$$ -1510 28856 14845 -16150 -26753 -4047 21507 16364 -12097 -18130 828 18171 16405 -10711
356a0711p168K2973J2366j7373j4468O800J7012O392j7234j1948R090K0353O19
$$ -10711 -17879 5094 17460 87 -14381 -7581 9431 15823 -1411 -13359 -4269 16084 16703
369A6703k0699j6829J0727K9753R28k9705j7164K0817K7317J551k9072k0048J9304
$$ 16703 -3996 -20825 -10098 19655 20583 -9122 -26286 -5469 21848 23399 -5673 -25721 -6417
382f417K4176K492k4792k0904J2855L0049Q09k3950j2240J1324K1373j833j8340
$$ -6417 17759 20251 -4541 -25445 -12590 17459 18268 -5682 -17922 -6598 14775 12942 -5398
395e398j0173J1974J4712o107j4901k458J3953J0654o632j9363J730K0463R184
$$ -5398 -15571 -3597 11115 5008 -9893 -12351 1602 12256 5624 -13739 -12009 8454 17638
408A7638j6351k4415R651K8239K086k2349j2124O915K0141J0811j5974k0934k851
$$ 17638 1287 -23128 -13477 14762 16848 -5501 -17625 -10710 9431 20242 4268 -16666 -19517
421a9517K7954J7704k3133k7870R780K8928N454k0293j5047J1492J3859K883j0544
$$ -19517 8437 26141 3008 -24862 -15082 13846 19300 -993 -16040 -4548 9311 12194 1650
434A650j2329M733J2255M999j2640j2041R617J9897o622j7881l142J2095J8886
$$ 1650 -10679 -5946 6309 11308 -1332 -13373 -3756 16141 9519 -8362 -11504 591 19477
447A9477r025k5861k671K5181J3586j6054k0602L990J8008P735j726k0081j2204
$$ 19477 10452 -15409 -18080 7101 20687 4633 -15969 -11979 6029 13764 12038 -8043 -20247
460b0247J7912K3020o574l0384n897K7518J5167j8943j3208L379J0927O098n152
$$ -20247 -2335 20685 14111 -16273 -22170 5348 20515 1572 -11636 -8257 2670 8768 3616
473C616q216p366J0696J4470j0999j8721J0143J8212k779j5881p409J6025Q759
$$ 3616 -4600 -11966 -1270 13200 2201 -16520 -6377 11835 9056 -6825 -14234 1791 10550
486A0550o217q679q202M382J9604M853k3737j4448J8093K5910j0926k3489p97
$$ 10550 4333 -4346 -12548 -8166 11438 16291 -7446 -21894 -3801 22109 11183 -12306 -13103
499a3103J1086J3425J17j6879r229J1853J2155K418j3819j0824J0331J3148J43
$$ -13103 -2017 11408 11525 -5354 -14583 -2730 9425 11843 -1976 -12800 -2469 10679 10822
512A0822j7221o130J6463Q985j1964j0546M207J3719M291j7120m916R099P158
$$ 10822 -6399 -12529 3934 12919 955 -9591 -5384 8335 12626 -4494 -9410 -311 6847
525F847K515q244j2558J363J8545R700j6635k3037J3066K5341j706j9340j2762
$$ 6847 9362 1118 -11440 -10077 8468 18168 1533 -21504 -8438 16903 15197 -4143 -16905
538a6905J1759J5702l06j0620j0743k16J8327Q234j7122j1315O556J5695m39j2846
$$ -16905 -5146 10556 10250 -370 -11113 -11329 6998 15232 -1890 -13205 -6649 9046 8607 -4239
552d239n175M892J0796K500j5499p215J7674O699q481j0091j491J2687P721p657
$$ -4239 -9414 -4522 6274 8774 -6725 -13940 3734 10433 1952 -8139 -9630 3057 10778 3121
566C121j3484j173J3800J2367r583j6660j519J6747J4550j4975j6368M408J2024
$$ 3121 -10363 -11536 2264 14631 5048 -11612 -13131 3616 18166 3191 -13177 -8769 3255
579C255P106l519j4326m671J3684J1927n995j8939L293J6780r30q926l366K523
$$ 3255 10361 6842 -7484 -12155 1529 13456 7461 -11478 -8185 8595 7665 -1261 -4627 -2104
593b104N253K201m767m713p99J1053N582j6035p661J2575J3021p611j5446n81
$$ -2104 3149 5350 583 -4130 -4929 6124 11706 -4329 -11990 585 13606 5995 -9451 -10032
607a0032J3344P093m584j1407o027J1812J0299j842j3412r915J2459J6068p117
$$ -10032 3312 10405 5821 -5586 -11613 199 10498 8656 -4756 -14671 -2212 13856 6739
620F739j5569j114R615R558m690j0203k134O602R285m623j1224R50J0112K067
$$ 6739 -8830 -9944 -329 9229 4539 -5664 -7798 -1196 8089 3466 -7758 -6808 3304 5371
634E371n266p125J578J0428K095q231r363N982J2832m10j1507p357O131J3599
$$ 5371 105 -7020 -5442 4986 7081 -1150 -10513 -4531 8301 7891 -3616 -10973 -4842 8757
648H757K354j5898p142Q025J2822J859j3779q348P120J1999K138j0640j0688P871
$$ 8757 11111 -4787 -11929 -3904 8918 10777 -3002 -11350 -4230 7769 9907 -733 -11421 -3550
662c550J2528j199r681o202O966P839q59q360l990O458P801l713r324L66P388
$$ -3550 8978 7779 -1902 -8104 -1138 6701 5842 -2518 -6508 -50 7751 4038 -5286 -4920 2468
677B468O439o758r564K171J0028M390p846r938K175J2034L781p084j1387K57J4700
$$ 2468 8907 2149 -7415 -5244 4784 9174 1328 -8610 -6435 5599 9380 2296 -9091 -8834 5866
692E866N734j1024j1008M049J0976M001p708q597J016R348N911q247q052K571
$$ 5866 11600 576 -10432 -6383 4593 8594 886 -7711 -6695 2653 8564 317 -7735 -5164
706e164R546J556q358m709N148O718j283o716l974P196O352l460p638k886Q150
$$ -5164 4382 5938 -2420 -7129 -1981 4737 3454 -3262 -7236 -40 6312 2852 -4786 -7672 478
721D78P686m128j1746m55J0008P191n154j0961r13R114Q558n030j0911k253R999
$$ 478 8164 4036 -7710 -8165 1843 9034 3880 -7081 -7994 1120 9678 4648 -6263 -8516 1483
736A483Q097n534j0021p48R058M742l249q647l75Q120L651n149o580K300O646
$$ 1483 9580 4046 -5975 -6723 2335 7077 3828 -4819 -5194 2926 6577 1428 -5152 -2852 3794
751C794K445o891n224M199P586p3q510l893N379Q249j431q963m510O314R267j375
$$ 3794 6239 -652 -5876 -1677 5909 5836 -2674 -6567 -1188 7061 5630 -3333 -7843 -1529 7738 6363
767F363j0329n208Q155Q284j843q854m895O217Q444o77r550l679N997P556k104
$$ 6363 -3966 -9174 -1019 7265 5422 -3432 -8327 -2110 6334 5657 -3893 -7572 -1575 5981 3877
782C877q178j719N979N314l841n858l78O209L472m471n798J138P325K519n583
$$ 3877 -4301 -6020 -41 5273 1432 -4426 -4804 1405 4877 406 -5392 -4254 3071 5590 7
797Gp312L413Q905J289p466o563M288Q477K251q259o454L622R035K149p904o389
$$ 7 -7305 -3892 5013 6302 -1164 -7727 -3439 5038 7289 -970 -7424 -3802 5233 7382 -522 -6911
813f911L061Q876J604o675o068L382P601Q05o503m431M779N050n95n885k341M969
$$ -6911 -3850 5026 6630 -45 -6113 -2731 4870 5675 -828 -5259 -480 4570 3975 -1910 -4251 718
829G18M178k061o374l08N553M544m269p006K25P591M046n644o844K54Q540L686
$$ 718 4896 2835 -3539 -3847 1706 6250 1981 -5025 -4800 2791 6837 1193 -5651 -5397 3143 6829
845F829n476p420N40Q175M009n136p786J209P159L851m962o765J651O080L062
$$ 6829 1353 -6067 -5527 2648 6657 1521 -6265 -5056 2103 5954 992 -5773 -4122 1958 5020
860E020n207m684J774N532J142m779l342K354N845o69n338l095M721N846k481
$$ 5020 -187 -4871 -3097 2435 3577 -1202 -4544 -2190 3655 2986 -2352 -5447 -726 5120 2639
875B639o830j144O195M200k087o870j528N816N467j907q009j828O490O126l269
$$ 2639 -4191 -5335 860 5060 2973 -3897 -5425 391 5858 3951 -4058 -5886 604 6730 3461
890C461p446j426O929M373l769m880r49M721L795k525n033n44N257K761l653m884
$$ 3461 -3985 -5411 1518 5891 2122 -2758 -3707 1014 4809 2284 -2749 -3293 1964 4725 1072 -3812
906c812K082M504J769m845m506L764N369m70n519l270L390O569r22o216l440L734
$$ -3812 -1730 2774 4543 -302 -4808 -1044 4325 3855 -1664 -4934 -1544 5025 4103 -2113 -5553 -1819
922a819O958q09o307m021M011O959m44p375k889M815M234K96n604k988L790M579
$$ -1819 5139 4330 -1977 -5998 -1987 4972 4528 -2847 -5736 -921 3313 3609 -1995 -4983 -1193 3386
938C386n72n415j604L978L552k238l898q83M683K855m043l041L55M311K680l870
$$ 3386 2814 -2601 -4205 -227 3325 1087 -2811 -3694 989 3844 -199 -3240 -2885 1426 4106 236
954B36m932K054N403J733m519n250L074N199J543m217n155K368O104P12m346l756
$$ 236 -4696 -2642 2761 4494 -25 -5275 -2201 2998 4541 324 -4831 -2463 3641 4353 7 -3749
970c749J240N907O03l992l172J379M975K56m272k068K511L632m83m956l87M193
$$ -3749 -2509 3398 4001 9 -3163 -1784 3191 3447 -825 -2893 -382 3250 2767 -2189 -2576 1617
986A617J050j092l426q35L803K695k489m321m45M871L513m268m537M06N041L053
$$ 1617 2667 1575 -1851 -2686 1117 3812 1323 -2998 -3443 1428 4941 673 -3864 -3458 1583 4636
1002D636m287m151O37M107L069k837n429J002M545J991k822m339J731L738P40
$$ 4636 349 -3802 -3165 942 4011 1174 -4255 -3253 1292 3283 461 -3878 -2147 1591 2331
1017B331k552k901J058M354j49l811j275J756L978q17m278j007L177L251j061
$$ 2331 -221 -3122 -2064 2290 2141 -1670 -2945 -1189 2789 1972 -2306 -3313 -136 3115 2054
1032B054m534j229L988L234q84n122j515M867K802j401m265j593M068L545j948
$$ 2054 -2480 -3709 279 3513 2629 -2493 -4008 859 3661 2260 -2005 -3598 470 4015 2067
1047B067l638j315L030L843k326l418l09K759K477j918l131M32K840J132j789
$$ 2067 -1571 -2886 144 3987 1661 -1757 -2066 693 3170 1252 -1879 -1447 1393 2525 736
1062G36k979J146L184K30k679k375J846L418k55l217j823J578L966k82m277j285
$$ 736 -2243 -1097 2087 2317 -362 -2737 -891 2527 2272 -945 -2768 -1190 2776 2494 -1783 -3068
1078c068J883L597l9l853j973K527K995k19l193k088K864K415m34k812j222K354
$$ -3068 -1185 2412 2373 -1480 -3453 -926 2069 1850 -1343 -3431 -567 1848 1414 -1398 -2620 -266
1094b66K074r37k701k07K042K131j975k134K58K422J653k441k337J010K910R12
$$ -266 1808 871 -1830 -2037 5 2136 161 -1973 -1715 707 2360 -81 -2418 -1408 1502 2414
1110B414k535k706J403L409N81k539k787J521L390P13k776k447J200K966J081
$$ 2414 -121 -2827 -1424 1985 2566 27 -2760 -1239 2151 2864 88 -2359 -1159 1807 2888
1125B888k836k028J025K795M16k461j264J007K349j10k181j079J694J641p09j854
$$ 2888 52 -1976 -951 1844 2260 -201 -1465 -458 1891 1781 -400 -1479 215 1856 1147 -707
1141g07r19K351J408j368k332oK357J531j698k782K68K608J717j943k716K20K758
$$ -707 -1626 725 2133 765 -1567 -1573 784 2315 617 -2165 -1897 711 2428 485 -2231 -2011 747
1158G47J464j832k596J82K552J186j273k436K13K428O84j156k007M48J990N06
$$ 747 2211 379 -2217 -2035 517 1703 430 -2006 -1793 635 1319 163 -1844 -1396 594 1100
1174A100j599j060O53J773L31k073p94J425J642m40k115n41J771J841j086j972
$$ 1100 -499 -1559 -906 867 1198 -875 -1669 -244 1398 958 -1157 -1698 73 1914 828 -1144
1190a144n62J924J758q11k328n59K118J716p55k446l94J800J697p95k195O0J406
$$ -1144 -1706 218 1976 1165 -1163 -1722 396 2112 1357 -1089 -1483 317 2014 1219 -976 -916 490
1207D90J286q70j751J08J487P62j076j276K42J668K02j171j280R71J568k22j530
$$ 490 1776 906 -845 -737 750 1512 436 -840 -598 1070 1272 101 -1179 -208 1360 1138 -392
1224c92r66J062J552O3j950j064J072J922j33k042r59J302J730k99j704j133J176
$$ -392 -1358 -296 1256 1319 -631 -1695 -623 1299 1166 -876 -1835 -533 1197 898 -806 -1939 -763
1241g63J699r2j474j070J098J375k1j460o85J254Q35m11j096k13J066Q23q79j012
$$ -763 936 844 -630 -1700 -602 773 752 -708 -1393 -139 696 285 -811 -1024 42 865 -14 -1026
1259a026L52J152N90j083j126N79J429L44j093j219M03J832J77j106j308O04J539
$$ -1026 -674 478 1068 -15 -1141 -562 867 1211 118 -1101 -698 1134 1311 205 -1103 -499 1040
1276A040M26j198j246O88J136M98j034r63M00J227K28j282m47L32J066j43q48
$$ 1040 1466 268 -978 -290 846 1344 310 -653 -253 974 1202 -80 -527 -195 871 728 -120
1293a20o55R11P24n15p01l34R05N94n59j098J07R87M90m37j430J89J121P15p06
$$ -120 -775 136 860 345 -356 -690 215 809 250 -848 -741 246 736 299 -1131 -942 179 894 188
1312A88j284K6R05J003o61j107j93J135M84n41q39k42J245L51m94p15K77N50J52
$$ 188 -1096 -1070 -165 838 177 -930 -1123 12 496 -45 -884 -1126 119 470 -24 -739 -462 88 240
1331B40l98n40N03N65J50p92m83O89O72j78p28k76O32P12k56p49l50O04J101l28
$$ 240 -158 -698 -195 370 520 -272 -755 -66 606 428 -300 -576 56 768 512 -237 -587 17 1118 790
1351G90r02m86O84R73k52r29l19L88Q11Lq05k55M26N50j59o42j84N02L23k34m33
$$ 790 -112 -598 86 1059 807 -122 -441 -53 758 761 -44 -299 127 677 518 -124 -308 194 517 283 -150
1372a50j18N65J84m54m17J63O36Rn05m32K02O19J41q07n18M58O81R4n42p84L67
$$ -150 -268 297 481 27 -390 -227 409 418 -87 -519 -317 302 443 -364 -882 -424 257 351 -191 -975 -608
1393f08Q75J28p62m06k2J042j04k45n94J65O58J00k87l77N1M90M6j64k95L21J88
$$ -608 267 395 -367 -773 -795 247 143 -102 -696 -531 127 227 -60 -437 -386 104 150 -14 -309 12 200
1414B00q4l25o2M87K24j48n85l2N81K66k68m28k0M75N44m08n79l6N30L08k06n32
$$ 200 116 -209 -271 216 440 292 -293 -325 256 522 254 -174 -194 281 825 417 -162 -198 332 640 434 -98
1436i8N2L09K40J02o56J4K11L32j60m07j19K98J49j74q0k41K76K8o7j34K4K70
$$ -98 -46 263 503 605 -51 -37 174 506 346 -61 -180 118 267 93 13 -228 48 76 9 -125 -101 169
1458A69j16m22j57L78K38R3m26k54Q7N87M6n53k79K23M21P7m23l08J22P21m3m50
$$ 169 53 -369 -526 -148 90 183 -243 -497 -410 177 223 -330 -609 -386 35 112 -311 -619 -497 224 181 -269
1480b69k64K50M81n6k64l44L05K97K5l33k23L49J24J10j68k25K93K94j17l66n9
$$ -269 -533 -283 198 142 -122 -466 -161 136 161 -172 -395 -46 78 188 20 -205 88 382 265 -101 -160
1501a60M02K53k99l13J7L60L49l50m11J24M48Q8j26m75J0J84K58km22r8L35K27
$$ -160 242 495 196 -117 -100 260 609 259 -152 -28 420 508 382 -93 -83 101 359 357 -65 -163 172 399
1523C99k90k45o2L04J00j84k37M4R0K62k38q8j1K05K0k70j88K11J67J41l74k68
$$ 399 109 -136 -198 106 206 22 -215 -171 -81 181 -57 -145 -156 49 69 -201 -389 -178 -11 130 -244 -512
1545e12J36M02lk11j97j27O70j41j94l48J16M12J52k73l08J10L26L25m33j49Q9
$$ -512 -376 26 23 -188 -385 -512 158 17 -177 -525 -409 3 155 -118 -426 -316 10 335 -98 -247 -158
1566a58M0L43k41j03K17L4J92k94j7P3K46r5k36j65L31L05k03k75j8K08L50k25
$$ -158 -118 225 -16 -119 98 132 324 30 13 86 332 237 1 -164 167 472 269 -6 -24 184 534 309
1588C09m80K02J50L20k29n11J82L83K04k81n25P3M03J12q7l02l39O24J34k57l42
$$ 309 -171 31 181 501 272 -239 -57 326 530 249 -276 -203 200 312 225 -77 -416 208 342 85 -257
1609b57j40N30L5k00k98J17K03K33m80k29K03K92L59n11k40l3L35J84k79l36J30
$$ -257 -397 133 168 -32 -330 -213 -10 223 -257 -486 -283 9 368 -143 -383 -416 -81 103 -176 -512 -382
1630c82O40q0l14k86J74L50N0l18k16J63L05K74n75q3O9M05K04n56rJ51N14j65
$$ -382 258 178 -136 -422 -248 102 152 -166 -382 -219 86 360 -215 -298 -229 176 380 -176 -185 -34 480 315
1652C15l57j29M18K54k63l25j66N95J74j50n22p7N50K92k70n90J60L42L06l53
$$ 315 -42 -171 247 501 238 -87 -253 342 516 366 -156 -233 317 609 339 -251 -91 251 557 204
1672B04n62J48M55L13m00m65K7N31j0k16l98L4N66M4l25l72J68L68J73m19l30
$$ 204 -358 -210 245 558 158 -307 -280 251 241 25 -373 -339 227 271 -54 -426 -258 110 283 -136 -466
1693d66K97L29j5n83o7K05M60l2m89k28N03M03j38n08k19M52K30P1n02l07P17
$$ -466 -169 160 145 -438 -505 -300 160 128 -361 -589 -86 317 179 -329 -548 -96 134 205 -297 -604 113
1714A13L62l30m25j40M14N26k07p77K8M74M42k98m62n6P13J72k68n74j1O19K78
$$ 113 475 145 -280 -420 -6 520 313 -464 -436 38 480 182 -280 -336 377 549 281 -293 -304 315 593
1735E93l62n38K62L91L97n74n79L79N35nl62m54J09P19J44o75m64K80P37j06l81
$$ 593 231 -307 -45 346 743 169 -410 -31 504 499 137 -317 -208 511 655 -20 -484 -204 533 427 46
1756D6m46L22O02j35n82k27L27M17L7p09k62L88N99k87n43l4L60M36j86o67o3
$$ 46 -400 -78 524 389 -193 -420 -93 324 361 -348 -610 -222 377 90 -453 -487 -127 309 123 -544 -607
1777f07O00M08m25n07j18N50O80n09o64n0P48K40j10q11J37N85L74m97o44L14
$$ -607 -7 401 -24 -531 -649 -99 581 72 -592 -642 106 346 236 -575 -438 147 521 24 -620 -306
1797c06N36M22n67o09K97O74J06n44m31K12Q96l5o25m46L14O66L7o06m68M78O42
$$ -306 230 652 85 -524 -227 447 553 9 -422 -210 686 651 26 -420 -106 560 597 -9 -477 1 643
1818F43O1p29m31N93N62p7r67l1N10L87j49o29k72N71O06m21n89j51N73N33n98
$$ 643 704 -25 -456 137 699 622 -345 -376 134 521 372 -257 -529 42 648 227 -362 -513 60 593 -5
1839en06j3O12L41l58p55J25Q32L42o86q32M21O80L13o19o63L23R36m3o60n86
$$ -5 -511 -524 88 429 71 -684 -559 273 615 -71 -903 -482 198 511 -108 -771 -448 488 445 -215 -801
1860h01M16R12j83n67m15L07R32j7q83l82O76M93P2r22k04O29M42m3p04l12P35
$$ -801 -385 527 344 -223 -638 -331 601 584 -299 -681 -5 488 560 -362 -566 63 505 462 -242 -554 181
1881A81O96m28o18m04Q72M79m19o08j98Q16O15o80o43r4Q51M66m49j019J02P87
$$ 181 877 449 -169 -573 299 778 359 -249 -447 369 984 304 -339 -433 418 884 435 -584 -482 305
1901C05M20m03j067N28O25L86o26p98K22Q06J47m57r27K54J105J07q21m62K75
$$ 305 725 322 -745 -217 408 794 168 -630 -408 398 545 88 -839 -585 520 627 -194 -656 -381
1920c81P48L3q23m56O54P47Q3j106m99P56M84K40j042j11P86J84L72q19o34O22
$$ -381 367 400 -423 -879 -225 522 605 -501 -1000 -244 240 480 -562 -673 113 297 669 -150 -784 -162
1940a62O35k34m96o03P99R72n69m24o89Q66N33n91p40N91O4R28l95j321L12J070
$$ -162 473 239 -257 -860 -61 911 342 -82 -771 95 628 37 -703 -112 -48 880 485 -836 -524 546
1960E46K89o46o73r1J100L25q54n91L38J124j39j012j00L70M81J85p03m61M26
$$ 546 835 189 -484 -575 525 850 -4 -595 -257 867 728 -284 -384 -14 467 652 -51 -512 -86
1979h6Q67j24q87n55P62O95k24r15l14P08P23n14n96l14O87R57p34p18q6P00P61
$$ -86 781 657 -230 -785 -23 672 448 -467 -781 -73 650 136 -460 -774 -87 870 136 -582 -668 32 793
2000G93m95j018K6Q20M19n85q93L43P85N12o47p96o3J103M12p35o40J93Q27M65
$$ 793 298 -720 -694 126 545 -40 -933 -590 195 707 60 -736 -799 304 716 -19 -659 -466 361 826
2020H26q99n69K01R00K36q71o19O89N62J65p50n35O86O87r4q68l70N28J062m50
$$ 826 -73 -642 -441 459 695 -176 -795 -106 456 621 -129 -664 22 709 615 -253 -623 -95 967 517
2040E17p49k70O37Q24n73p74o1N48O32k43j030LQ15L86k02j216L87O64L29l73
$$ 517 -232 -502 135 959 386 -388 -449 99 731 488 -542 -539 276 662 460 -756 -369 295 624 251
2060B51p53m4R49K49o62p72K06J048K99r25p76L39R70N5n98q15O18P12L3o27q45
$$ 251 -502 -546 403 652 -10 -782 -576 472 771 -154 -930 -591 379 434 -164 -979 -361 351 384 -243 -1088
2081a088R56N69P8r64n76Q62P72k32q55l30N10J065m42q39o5O07Q01m90p79k98
$$ -1088 -132 437 515 -449 -1025 -163 609 377 -478 -808 -298 767 325 -514 -579 28 829 339 -440 -738
2101g38R38N14l63r90R3P71M60k01j185J51J050L92p02q02J19J043M60r72o07
$$ -738 200 714 351 -639 -546 225 685 484 -701 -550 500 892 190 -612 -493 550 1010 38 -569
2120e69K43Q77M71j122n26K43J035J67q80o85P04P95j39o67p16O33P91r8q57m53
$$ -569 -326 551 1022 -100 -626 -383 652 819 -61 -746 -42 753 614 -53 -769 -136 655 557 -300 -753
2140g53O53O23j67r04l7N87Q16n74p65l46Q19P62n17q12j59Q04O49m34j026K2
$$ -753 -100 523 356 -548 -585 2 818 244 -521 -867 -48 714 197 -615 -774 30 679 245 -781 -759
2160g59Q85O31o25p28j16J086L53q07p18J66Q59O80r83o37J81J091J03o48o75
$$ -759 126 757 132 -596 -712 374 727 -80 -798 -632 227 907 -76 -713 -532 559 662 14 -661
2179f61L24J173k61o65n82N28P99j10p53m84O87N74J17j047l17O97Q85k04j014
$$ -661 -337 836 575 -90 -672 -144 655 545 -208 -692 -5 569 686 -361 -678 19 904 700 -314
2198c14r7N38P29l57q47k99Q29P42m42r63k27J095K74l37q66l5Q76M20l65j067
$$ -314 -411 127 856 499 -348 -647 182 924 482 -481 -708 387 661 324 -542 -577 299 719 354 -713
2218g13J67P93M72p16p01L31O99L54r96l45J57Q42L06j155l14N53P33J30q59o47
$$ -713 -546 247 719 3 -698 -367 332 686 -310 -655 -498 344 650 -505 -819 -266 467 597 -262 -909
2238i09O87J180m15p67o11O71R55m99q64j47M91J266o21q91n24Q17J014o57r42
$$ -909 -222 958 543 -224 -835 -164 791 292 -572 -719 -228 1038 417 -474 -998 -181 833 176 -766
2257g66M79L98P00l57q12m18J110M30j021M2L7M04N33m83p34M67J40O45r95m82
$$ -766 -287 111 811 454 -358 -776 334 764 -257 -215 -178 226 759 276 -458 9 149 794 -201 -683
2277f83L83N07M4p03KM93Q79m06p42m43M1J491m9q35q06P28M33M76j297j43O4
$$ -683 -300 207 251 -452 -450 43 922 516 -226 -669 -628 863 814 -21 -827 -99 334 810 -487 -630 -566
2298e66J189k05q45k53N48O74Q3j303j5P41M88j20j034J85M20P74l78p56j62N19
$$ -566 623 418 -427 -680 -132 542 625 -678 -693 48 536 416 -618 -433 -13 761 383 -373 -535 -16
2318a6N76k52r57K23R34K52o72o44K28O20L08r29k75M53N62M52j066n10O29M02
$$ -16 560 308 -649 -426 508 760 88 -556 -328 292 600 -329 -604 -151 411 863 -203 -713 -84 318
2338C18L03l24j034P89P30k40j010J24K26Q33n5q95m97Q96N58J26j292j28Q00
$$ 318 621 297 -737 52 782 542 -468 -344 -118 715 660 -235 -732 164 722 848 -444 -572 228
2357B28L78p4j139j95J169N83p07m22o16J045M51p10n10k85O77Q01m46q04O3Q08
$$ 228 606 532 -607 -802 367 950 243 -179 -795 250 701 -9 -519 -804 -127 674 228 -576 -513 295
2377B95P00j052q69J64J163K93n42p92J12J017j07l74q23M50Q20Q8j063J81j09
$$ 295 995 -57 -926 -762 401 694 152 -640 -528 489 382 8 -815 -365 455 543 -520 -339 -448
2396d48J032J0p51l32L46P86J91j241k90N94O40L29j130l15P92O81k80p62m52
$$ -448 584 594 -157 -489 -143 643 834 -407 -697 -103 537 866 -264 -579 213 894 614 -148 -600
2415f00Q02N20n32m56l48Q64O53p29o70J19N47O46n49o85J34N79M58m71j051J37
$$ -600 202 722 190 -266 -614 250 903 174 -496 -377 170 816 267 -418 -284 295 753 282 -769 -632
2435f32J054L26o67o36j21J280j19o84m13R8R74J71p91n65L42P92J05r88k26M80
$$ -632 422 748 81 -555 -676 604 485 -199 -612 -514 460 631 -160 -725 -383 409 514 -474 -700 -220
2455b20O42K29j121n03Q52N91o7q20m60P59Q68o32o66l46P63R73n87p66k31Q26
$$ -220 422 651 -470 -973 -121 470 403 -417 -877 -118 750 118 -548 -894 -131 842 255 -511 -742 84
2475H4P66n20j088NQ72P33n26j123K72O86N63k31j096J41Q80M16n85o92j31J106
$$ 84 850 330 -758 -753 119 852 326 -797 -525 161 724 493 -603 -462 418 834 249 -443 -574 532
2495E32J22n23o58J16R26K52q33m89M58O12K37q93o13Q41M63N8q56n07N87Q56
$$ 532 654 131 -527 -411 515 767 -66 -555 -97 515 752 -141 -754 87 550 608 -248 -755 -168 688
2515F88j97p29n44N99J018n13p27k83O11P29m62o40o3M30O19j96q78q1O82N58
$$ 688 491 -238 -782 -183 835 322 -405 -688 -77 652 190 -450 -513 -83 536 340 -538 -619 63 621
2535F21n30p99J69P64L24n18n92J28Q31J55o95m21j0R50L78r42l70K38P60K01
$$ 621 91 -708 -539 225 549 31 -561 -433 398 553 -142 -563 -573 377 755 -187 -557 -319 441 642
2555F42p82o76N63P62J96r19n37N64Q03P5r84l00L69J034k59q17k62M77Q58l62
$$ 642 -140 -816 -253 509 705 -214 -751 -187 616 691 -293 -593 -224 810 551 -266 -528 -51 807 445
2575D45p12m31Q18N70k51q06j49O69N01k56q87m7Q11N06m63q38j7P20N68p60o69
$$ 445 -267 -698 120 690 439 -367 -516 153 654 398 -489 -536 275 781 318 -520 -537 183 751 -9 -678
2596f78J43Q61L47o60p73K37J010R2o04q53L86Q50R6n80o32M17Q30L0o68o08M34
$$ -678 -535 326 673 13 -760 -523 487 579 -25 -878 -492 358 454 -126 -758 -341 489 519 -149 -757 -323
2617c23P45Q5q38l40M37Q75k16q96k41N18Q63k95q18k61P80N94j63r53j07P83
$$ -323 422 507 -331 -671 -234 641 425 -471 -712 -194 669 374 -444 -705 75 669 506 -447 -554 229
2637B29N31k68r74N1O14M57k90q67N8P34O22n94p16M5Q05M53p73p11J48R21K97
$$ 229 760 492 -482 -431 183 640 350 -517 -459 275 897 303 -413 -368 437 890 117 -594 -446 475 772
2658G72p09o77K99R42J58p72q11N67Q69K4r75m25O19P57j07q29l31K82R76j60
$$ 772 63 -614 -315 627 785 13 -798 -231 638 662 -313 -738 -119 638 531 -298 -629 -347 629 469
2678D69p57m40O26O58j72q70k82P30N45k65q91j21Q14M21l31q94J55O85N78o26
$$ 469 -288 -728 -102 556 384 -486 -768 -38 507 242 -649 -770 44 465 134 -760 -605 80 658 32
2698C2p46J77Q35J89m16p37R8Q80M63q49o18K63Q23K33o47p14M08O98R0n37o01
$$ 32 -714 -537 298 487 71 -666 -568 312 775 -74 -692 -429 394 627 -20 -734 -326 372 462 -75 -676
2719f76L64R44R0r53j63L46O56m0p62k38K66Q51k41p89k26L82Q21k29p23j78P58
$$ -676 -312 632 722 -231 -394 -48 608 568 -194 -432 -166 685 444 -345 -571 -189 632 403 -320 -498 260
2740B60L94k91o79l34P38P27n64q18N6P68L70o96n06k4Q01L75n93p31J71P61K87
$$ 260 654 363 -316 -650 88 815 251 -567 -511 257 627 -69 -575 -599 202 577 -16 -747 -576 185 472
2761D72n14o55L65O06J38n48n05L48P38Q1o73m82L99N33J12p26k39L58P37k39
$$ 472 -42 -697 -332 274 412 -136 -641 -293 445 526 -147 -629 -230 303 415 -311 -550 -192 545 306
2781C06o12j83L63O89r3q12k47P52M16q7q76k72J036M35n00n38l46Q88L22m80
$$ 306 -306 -489 -126 563 470 -342 -589 163 579 492 -384 -656 380 815 315 -223 -569 319 641 161
2801A61n40N6O55N07p48o31K65O78J44m46o16J63R61o6l44q03K64Q10pn16n35
$$ 161 -379 -323 332 839 91 -540 -275 403 547 101 -515 -352 609 543 199 -604 -340 470 463 -53 -588
2822e88K48P59J73q55l61L90P54J0q61l91L75P44O7q75l67O80N22k45m39m88P98
$$ -588 -340 419 592 -263 -624 -234 520 530 -331 -722 -347 397 464 -411 -778 -98 424 179 -260 -748 50
2843E0M95l27p05l16Q83N57k99r24J10N34N41m63p57K32P36L46o87n87L16O11
$$ 50 545 218 -487 -803 80 637 338 -586 -476 58 599 136 -621 -389 347 693 6 -581 -265 346
2863C46K09l31q38K99Q35J21n49o67L02Q42O5p45l70K60O85K06q26k08K84N75
$$ 346 555 224 -614 -315 520 641 92 -575 -273 569 634 -111 -481 -221 464 670 -156 -364 -80 495
2883D95k9o84j49L30N19j36o44l25O58M90k43n33j46N48L80j52p52j85O86M47
$$ 495 466 -218 -367 -37 482 346 -298 -623 35 525 282 -251 -397 151 531 379 -373 -558 128 575
2903E75m51o25J46N67L00m35p22K43N99L09o85m83J78O86K08l96o60J95P36R5
$$ 575 124 -501 -355 212 512 77 -645 -402 197 506 -179 -662 -484 202 410 14 -646 -451 285 380
2923C80o26k50J35Q13r4n13l19K67O97k2p83j16M22M21j35p27l9O38N57m63n38
$$ 380 -246 -496 -361 452 358 -155 -474 -207 490 468 -315 -431 -9 412 277 -450 -489 149 706 243 -295
2944b95k52N93N57l29o36o9N50O49n59n69Q2M85L09k94o72J08M04O33l98p89K66
$$ -295 -547 46 603 274 -362 -431 119 768 209 -360 -278 207 516 222 -450 -342 62 695 297 -492 -226
2965b26M27K88m38m08K3P11j8l70m04J5P65M1n23l14J69O46N4o36l09K63M25J61
$$ -226 201 489 51 -357 -334 377 359 -11 -415 -400 365 406 -117 -431 -262 384 438 -198 -507 -244 181 342
2987C42m99l51M21L71p8m31k64L63M65k29k81k62L19M71l17m10o3M60K72j22n95
$$ 342 -157 -508 -87 284 206 -225 -489 -126 339 110 -171 -433 -114 357 40 -370 -433 27 299 177 -418
3008d18J6N75K05j78n44l4O10J84k90n47L22M34J43l91k93j67Q30n1k58l76n9
$$ -418 -402 173 378 200 -344 -378 232 416 126 -421 -99 335 478 87 -206 -373 457 406 148 -228 -287
3029b87P76j88k49m38L39L32K38n79l37K87O36r7n03k02K75M97m35l26J3K44L92
$$ -287 489 301 52 -386 -47 285 523 -56 -393 -106 530 433 -70 -272 3 500 65 -261 -248 -4 388
3050C88m03k83k86N97M93l31n38j11M55J60J63p50L7O28j36on22j23P36K26k51
$$ 388 -15 -298 -584 13 506 175 -363 -474 -19 141 304 -446 -409 219 83 77 -445 -568 168 394 143
3071A43n50K91L11L79n03k90j52L15P40o98l77K44Q03k99m75k22N39L11j00m36
$$ 143 -407 -116 195 574 71 -219 -371 -56 684 -14 -391 -147 656 357 -118 -340 199 510 410 -26
3091b6j70j4P93l52j71m33L61M72k45l82j45N06J83k27l57j79N68L55m09l57K12
$$ -26 -196 -210 583 231 60 -373 -12 460 215 -167 -312 194 377 150 -207 -386 182 537 128 -229 -17
3112a7K8M24k57m54J6N91R0m47m8q3M29m9j98m67J86R0K15p5k23l63P60K61m91
$$ -17 11 435 178 -276 -260 331 421 -26 -74 -157 272 223 25 -442 -256 -166 49 -26 -249 -612 148 409 -82
3135h2j22l56Q39l6n19k8M7M58M26j139L01k8M92L9n14k23p5O85K7k56n4p1N08
$$ -82 -204 -560 279 243 -276 -304 -257 201 627 -512 -211 -239 253 292 -222 -445 -520 165 192 -64 -118 -189 319
3158C19K1k95p26R16K34j59r14P8O47r3j00mn16N58R60q17k84P12j12J22p82j1
$$ 319 340 45 -681 235 469 310 -604 -526 121 28 -72 -76 -592 -34 926 109 -175 537 425 547 -235 -246
3180b46l24P66j5K22m93j83M58RK95q80O65j13K06o24r3L79o7L20m46j44Q0M78
$$ -246 -570 196 181 403 -90 -273 185 194 489 -391 274 161 367 -257 -350 29 -38 282 -164 -308 -228 250
3202B50j10q4q66O32O55l07p26K32O46j21Q7l56j70J77K13j2l0n47L00L95l11
$$ 250 140 56 -810 -178 477 170 -556 -324 322 201 288 -68 -238 -61 152 140 110 -437 -137 258 -53
3223e3m4j0k61J063q63J40m48L77M96p82K71m3M08m3k86k08K51L21j72q9l92L87
$$ -53 -97 -107 -368 695 -168 -28 -476 -99 397 -385 -114 -157 251 208 -78 -286 -35 286 114 25 -367 20
3245B0R7K09l91k15J77M17q2l04p7N8M45n5l97n3J10K71J6k85j45J75L03j06l10
$$ 20 117 326 -65 -280 -103 314 232 -72 -149 -91 354 299 -98 -151 -41 230 246 -39 -184 -9 294 188 -122
3268a22q4K82K05q4m02K9K85J53j76k53o3L50J82k58l44O9M37j16k26k73J39J52
$$ -122 -206 76 281 197 -205 -176 109 262 86 -167 -230 120 302 44 -300 -231 206 90 -136 -409 -270 -118
3290a18K48j59k50m8L68R9j86r5n0L47m5k35j21R9K22J55m13p1O3M65k14k28n2
$$ -118 130 -29 -279 -327 41 140 -46 -141 -191 156 111 -124 -245 -146 76 231 -182 -253 -190 275 61 -167 -219
3313b19J67J23J16k48k18L36L8Q2j91l01M13K20r3m62K71nL99m09j97J05J56L59
$$ -219 -52 71 187 -61 -279 57 95 177 -14 -315 98 318 225 -237 34 29 428 19 -178 -73 83 442
3335D42k63l15LJ99J63K3l87nM53k4j84l33R4L35Q2k15k84R2M08n1m74J32J0J85
$$ 442 179 -136 -133 66 229 252 -135 -140 313 289 105 -228 -134 201 283 68 -216 -124 284 233 -241 -109 -99 86
3359H6J77m59ok9K64m7j48j69K12K34L3l59j15L88J25j89q2j26N0L61K5l53j16
$$ 86 263 -196 -202 -231 33 -14 -162 -331 -119 115 148 -211 -326 62 187 -2 -84 -210 -160 201 226 -127 -243
$$ [...]
8191h0
##END NTUPLES=NMR FID
##END=
