##TITLE=1H_Pr Q1
 CDCl3, 8 sc, 
 3.08.2021
##JCAMPDX= 6.0         $$ Bruker NMR JCAMP-DX V2.0
##DATA TYPE= NMR FID
##DATA CLASS= NTUPLES
##ORIGIN= UXNMR, Bruker Analytische Messtechnik GmbH
##OWNER= root
$$ XWIN-NMR		Version 3.5
$$ Tue Aug  3 12:40:04 2021 Russian Standard Time (UT+4h)  she@DPX200
##.OBSERVE FREQUENCY= 200.131506
##.OBSERVE NUCLEUS= ^1H
##.DELAY= (6, 6)
##.ACQUISITION MODE= SIMULTANEOUS
##.ACQUISITION SCHEME= undefined
##.AVERAGES= 8
##.DIGITISER RES= 18
##SPECTROMETER/DATA SYSTEM= spect
##.PULSE SEQUENCE= zg30
##.SOLVENT NAME= DMSO
##.SHIFT REFERENCE= (INTERNAL, DMSO, 0, 15.7039)
##AUDIT TRAIL= $$ (NUMBER, WHEN, WHO, WHERE, WHAT)
$$ ##TITLE= Audit trail, XWIN-NMR		Version 3.5
$$ ##JCAMPDX= 5.01
$$ ##ORIGIN= Bruker BioSpin GmbH
$$ ##OWNER= she
$$ F:/spectra/data/she/nmr/H-F/1/audita.txt
$$ ##AUDIT TRAIL=  $$ (NUMBER, WHEN, WHO, WHERE, WHAT)
(   1,<2021-08-03 12:39:05.09 +0400>,<she>,<DPX200>,
      <created by zg, POWCHK disabled, PULCHK disabled
       configuration hash MD5:
       00 E9 B6 7A A2 85 ED C7 34 08 36 98 17 FE 4E 26
       data hash MD5: 16K
       B0 F7 77 DF 93 B8 F2 87 8A 0D 8A 4E EF A7 E9 1F>)
$$ ##END=
$$ 
$$ hash MD5
$$ 50 15 6A 40 1A 45 99 29 FA 86 C3 64 01 DC 33 23
##$RELAX= 
##$RELAX= 
##$RELAX= 
##$RELAX= 
##$RELAX= 
##$RELAX= 
$$ Bruker specific parameters
$$ --------------------------
##$DU= <F:/spectra>
##$EXPNO= 1
##$NAME= <H-F>
##$PROCNO= 1
##$TYPE= <nmr>
##$USER= <she>
##$AMP= (0..31)
100 100 100 100 100 100 100 100 100 100 100 100 100 100 100 100 100 100 
100 100 100 100 100 100 100 100 100 100 100 100 100 100 
##$AQSEQ= 0
##$AQ_mod= 1
##$AUNM= <au_zg>
##$AUTOPOS= <>
##$BF1= 200.13
##$BF2= 200.13
##$BF3= 200.13
##$BF4= 200.13
##$BF5= 200.13
##$BF6= 200.13
##$BF7= 200.13
##$BF8= 200.13
##$BYTORDA= 1
##$CFDGTYP= 0
##$CFRGTYP= 5
##$CHEMSTR= <none>
##$CNST= (0..31)
1 1 145 1 1 1 1 1 1 1 1 1 1 1 1 1 1 1 1 1 1 1 1 1 1 1 1 1 1 1 1 1 
##$CPDPRG= <>
##$CPDPRG1= <>
##$CPDPRG2= <>
##$CPDPRG3= <>
##$CPDPRG4= <mlev>
##$CPDPRG5= <mlev>
##$CPDPRG6= <mlev>
##$CPDPRG7= <mlev>
##$CPDPRG8= <mlev>
##$CPDPRGB= <>
##$CPDPRGT= <>
##$D= (0..31)
0 1.2 0 0 0 0 0 0 0 0.06 0 0.03 0 0 0 0 0.0002 0 0 0 0 0 0 0 0 0 0 0 0 
0 0 0 
##$DATE= 1627979944
##$DBL= (0..7)
120 120 120 120 120 120 120 120 
##$DBP= (0..7)
150 150 150 150 150 150 150 150 
##$DBP07= 0
##$DBPNAM0= <>
##$DBPNAM1= <>
##$DBPNAM2= <>
##$DBPNAM3= <>
##$DBPNAM4= <>
##$DBPNAM5= <>
##$DBPNAM6= <>
##$DBPNAM7= <>
##$DBPOAL= (0..7)
0.5 0.5 0.5 0.5 0.5 0.5 0.5 0.5 
##$DBPOFFS= (0..7)
0 0 0 0 0 0 0 0 
##$DE= 6
##$DECBNUC= <off>
##$DECIM= 32
##$DECNUC= <off>
##$DECSTAT= 4
##$DIGMOD= 1
##$DIGTYP= 9
##$DL= (0..7)
0 120 120 120 120 120 120 120 
##$DP= (0..7)
150 150 150 150 150 150 150 150 
##$DP07= 0
##$DPNAME0= <>
##$DPNAME1= <>
##$DPNAME2= <>
##$DPNAME3= <>
##$DPNAME4= <>
##$DPNAME5= <>
##$DPNAME6= <>
##$DPNAME7= <>
##$DPOAL= (0..7)
0.5 0.5 0.5 0.5 0.5 0.5 0.5 0.5 
##$DPOFFS= (0..7)
0 0 0 0 0 0 0 0 
##$DQDMODE= 0
##$DR= 18
##$DS= 0
##$DSLIST= <SSSSSSSSSSSSSSS>
$$ [...]
##$SUBNAM2= <"">
##$SUBNAM3= <"">
##$SUBNAM4= <"">
##$SUBNAM5= <"">
##$SUBNAM6= <"">
##$SUBNAM7= <"">
##$SUBNAM8= <"">
##$SUBNAM9= <"">
##$SW= 20.0188882624521
##$SWIBOX= (0..15)
0 0 2 0 0 0 0 0 0 0 0 0 0 0 0 0 
##$SW_h= 4006.41025641026
##$TD= 16384
##$TD0= 1
##$TE= 0
##$TE2= 300
##$TE3= 300
##$TEG= 300
##$TL= (0..7)
0 120 120 120 120 120 120 120 
##$TP= (0..7)
150 150 150 150 150 150 150 150 
##$TP07= 0
##$TPNAME0= <>
##$TPNAME1= <>
##$TPNAME2= <>
##$TPNAME3= <>
##$TPNAME4= <>
##$TPNAME5= <>
##$TPNAME6= <>
##$TPNAME7= <>
##$TPOAL= (0..7)
0.5 0.5 0.5 0.5 0.5 0.5 0.5 0.5 
##$TPOFFS= (0..7)
0 0 0 0 0 0 0 0 
##$TUNHIN= 0
##$TUNHOUT= 0
##$TUNXOUT= 0
##$USERA1= <user>
##$USERA2= <user>
##$USERA3= <user>
##$USERA4= <user>
##$USERA5= <user>
##$V9= 5
##$VALIST= <valist>
##$VCLIST= <CCCCCCCCCCCCCCC>
##$VD= 0
##$VDLIST= <DDDDDDDDDDDDDDD>
##$VPLIST= <PPPPPPPPPPPPPPP>
##$VTLIST= <TTTTTTTTTTTTTTT>
##$WBST= 1024
##$WBSW= 4
##$XGAIN= (0..3)
0 0 0 0 
##$XL= 0
##$YL= 0
##$YMAX_a= 81410
##$YMIN_a= -137176
##$ZGOPTNS= <>
##$ZL1= 120
##$ZL2= 120
##$ZL3= 120
##$ZL4= 120
##$ABSF1= 10
##$ABSF2= 0
##$ABSG= 5
##$ABSL= 3
##$ALPHA= 0
##$AQORDER= 0
##$ASSFAC= 0
##$ASSFACI= 0
##$ASSFACX= 0
##$ASSWID= 0
##$AUNMP= <proc_1d>
##$AZFE= 0.1
##$AZFW= 0.1
##$BCFW= 1
##$BC_mod= 2
##$BYTORDP= 1
##$COROFFS= 0
##$CY= 11.3945322036743
##$DATMOD= 1
##$DC= 2
##$DFILT= <>
##$DTYPP= 0
##$F1P= 2.36226072786647
##$F2P= -0.459571619588291
##$FCOR= 0.5
##$FTSIZE= 0
##$FT_mod= 4
##$GAMMA= 1
##$GB= 0.15
##$INTBC= 1
##$INTSCL= 1
##$ISEN= 128
##$LB= 0.24
##$LEV0= 0
##$LPBIN= 0
##$MAXI= 10000
##$MC2= 0
##$MEAN= 0
##$ME_mod= 0
##$MI= 1.114404
##$NCOEF= 0
##$NC_proc= 0
##$NLEV= 6
##$NOISF1= 3.799351
##$NOISF2= 2.8
##$NSP= 1
##$NTH_PI= 0
##$NZP= 0
##$OFFSET= 15.70392
##$PC= 1
##$PHC0= -13368.13
##$PHC1= 27.20099
##$PH_mod= 1
##$PKNL= yes
##$PPARMOD= 0
##$PSCAL= 0
##$PSIGN= 0
##$REVERSE= no
##$SF= 200.130013532006
##$SI= 16384
##$SIGF1= 3
##$SIGF2= 2
##$SINO= 400
##$SIOLD= 16384
##$SREGLST= <1H.CDCl3>
##$SSB= 0
##$STSI= 0
##$STSR= 0
##$SW_p= 3612.71676300578
##$SYMM= 0
##$S_DEV= 0
##$TDeff= 0
##$TDoff= 0
##$TI= <>
##$TILT= no
##$TM1= 0
##$TM2= 0
##$TOPLEV= 0
##$USERP1= <user>
##$USERP2= <user>
##$USERP3= <user>
##$USERP4= <user>
##$USERP5= <user>
##$WDW= 1
##$XDIM= 8192
##$YMAX_p= 0
##$YMIN_p= 0
$$ End of Bruker specific parameters
$$ ---------------------------------
##NTUPLES= NMR FID
##VAR_NAME=  TIME,          FID/REAL,        FID/IMAG
##SYMBOL=    X,             R,               I
##VAR_TYPE=  INDEPENDENT,   DEPENDENT,       DEPENDENT
##VAR_FORM=  AFFN,          ASDF,            ASDF
##VAR_DIM=   8192,          8192,            8192
##UNITS=     SECONDS,       ARBITRARY UNITS, ARBITRARY UNITS
##FACTOR=    0.0002496,     1,               1
##FIRST=     0,             0,               0
##LAST=      2.0444736,     0,               0
##MIN=       0,             -137176,         0
##MAX=       2.0444736,     81410,           0
$$ Real data points
##PAGE= N=1
##DATA TABLE= (X++(R..R)), XYDATA
0@%%%%%%%%%%%%%Kj0J6j6J6k2L0l2M0m8N6o4P2q8J04j20J36j54J77k02K28k59
35a38K93l31L72m14M62n16N73o36P06p82Q66r57J056j163J281j412J556j713J889
54I92k087K307k556K841l172L556m011M561n243O118p281Q911j1383J5620k4865
69a5692Q5209p2815q5688J69655P41j29475j1603J02310j5437o2712l236L9164
81D21M804j2882k5434N335L7749R405n1112l738O0849Q771o1616N954N7930j0394
95B6042m2767K2467K1674k2120k278J5713j7998l284K1563j6475k3667K5819J0106
108A4795l3729k193K7574j0369j7345J4074M012j4102J1848J3107k1220l113L2874
121A6213l726l3127K0474L3387l3097k1883M7263O622n3151J1685M8881l1078
$$ y = [0, 0, 0, 0, 0, 0, 0, 0, 0, 0, 0, 0, 0, 0, 2, -8, 8, -8, 8, -14, 16, -16, 24, -24, 32, -32, 40, -48, 56, -64, 72, -82, 95, -107, 121, -138, 155, -176, 196, -218, 244, -272, 301, -335, 371, -411, 455, -502, 554, -609, 672, -740, 816, -897, 992, -1095, 1212, -1344, 1497, -1675, 1881, -2130, 2431, -2812, 3306, -3975, 4936, -6447, 9173, -15692, 69517, -3298, -88986, 80669, 81410, -48065, -59668, 42642, 27205, -35507, -38743, 421, 5225, -7657, -33091, -27756, 9993, 19398, -31714, -35452, 25397, 34168, -27448, -21494, 36436, 26042, -16725, 5742, 27416, 5296, 3018, 18731, 733, -2551, 19012, 2537, -21130, 4689, 14795, -18934, -21127, 6447, -3922, -21267, -7193, -3181, -17283, -5435, 7672, -13548, -16661, 16213, 12487, -20640, -166, 33221, 124, -21759, 25504, 32126, -21025, -9340, 39541, 8463]
133H463l9026L9721J9089m5774m147L7276j1473k8794J5656J4863j6518j560J1172
146a052q525j616J8450m596k0830J4685K5340j8782k0376K4817J6304k2769q581
159g531J7444M185q419m851n234Q107J4592k0259k4059K8911K4123l9932k3680
172c6603M3292J8306m2831j3894L9089J0953l0088q823K4101J2053j3129j3857
184a1431O865K1598J390k7896m577L6933M228m3902p94M5799p753m5651J3854
197a1337L7191k1419k8907K1710J6631k0668q110J5333J478r001K027M087j600
210b585J397J938j800K416L442m107l56Q454k838j0166Q344J0259j4385q704J8077
225I386K622k1452J379J9722p852j7735R608J1478j0658p113P916L862m085j684
$$ y = [8463, -30563, 9158, 28247, -17527, -21674, 15602, 4129, -24665, -9009, 5854, -10664, -12224, -1052, -9577, -11193, 7257, 2661, -18169, -3484, 21856, 3074, -17302, 7515, 23819, 1050, -7531, 9913, 14098, 5679, 828, -4406, 3701, 18293, -1966, -26025, 2886, 27009, -12923, -36603, 6689, 24995, -17836, -31730, 7359, 18312, -11776, -20599, 3502, 15555, 2426, -11431, -4566, 17032, 18422, -9474, -14051, 22882, 27110, -16792, -17586, 28213, 20460, -25191, -11337, 25854, 4435, -24472, -2762, 13869, -6799, -14909, 424, 1902, -7099, -5072, -985, -2585, -1188, 750, -1050, 1366, 4808, 701, 345, 8799, 5961, -4205, 4139, 14398, 13, -8691, 9386, 12008, -9444, -8065, 11657, 3805, -13930, -4322, 7156, -3502, -10615, -2699, 1163, -2922, -4606]
239d606P24K839M286l551n538P560Q029j0111o197J3807M610j6030j573J7143
253A1392k573j6957M964J3408q628j0756P890N406p078l057L054P77P12q86m075
268f407K753P744m899p997Q347R070r510o735J1329O145j1020l481J0131J521
282F991q151k92M734q0k692j810q92L227J441o689k340Q695N47j0383J031J1195
298D532l377r758N665R126o531n676P105M678n989j681N072J130k811q98J173
313A760Q78J09l027q33M052k58o319N94P026l264p773M946O849o699n547Q025
329E19M112q235j925Q401J220o580j52O453J96m274o39L943J940l236l847L371
345A267M597m720n959N400N825p355n907P691M464q531m147R084K331p863k022
$$ y = [-4606, -3882, -1043, 3243, -308, -5846, 1714, 9743, -368, -6565, 7242, 11852, -4178, -5751, 11392, 8819, -8138, -3174, 10234, 1606, -9150, -1260, 4146, -2932, -5989, -2935, -2158, -1446, -2332, -6407, -3654, 4090, -809, -8806, -459, 8611, -899, -7634, 3695, 9840, -1180, -4661, 5470, 6991, -1160, -1452, 3282, 3202, 510, -1300, -2192, 1035, 2476, -4213, -6553, 2142, 2689, -7694, -6663, 4532, 1155, -8603, -2938, 6188, -343, -6019, 1086, 5764, -225, -1906, 3166, 4296, 1485, 587, 1760, 2638, 2747, -280, -1113, 2939, 2681, -3638, -3044, 3982, 718, -7055, -2109, 4740, -1959, -7506, 519, 4631, -3604, -5529, 2872, 4092, -2488, -2640, 3813, 4009, -265, -904, 3039, 4979, 1743, -2104, 1267, 5864, 1144, -4815, 585, 6410, -945, -6852, 839, 5303, -3228, -7375, 1709, 4040, -3823, -5845]
360e845Q021J021n526j003N249J682l660k443L569L778l569m377M003M750m416
375A234n066M407M741n606m548N624L209o229k582N547J604n014j381M073J467
390A480k901j799K157L142j814l175K073M103j807m083K775M294k922m028K862
405C57L351l363k826K795J799k492j993K011J086k114o97J024P78p67r44O74J742
422D21n41j933J681K329k248j727L119J499k632j443L185R92k970j488L196J391
438B831l333j670K672J797k477k340K042J846j012l427Q13M095q47m096J437M492
454B823j275l978J206L975r35k729J85K680J09k260r2J724K99j368k92L12n80
471a96N95j19q66k46J096J0j224l57J092J344r60k191J166L179j402l250J753
$$ y = [-5845, 2176, 3197, -2329, -3332, 1917, 3599, -61, -2504, 1065, 4843, 1274, -3103, 900, 5650, 1234, -3832, 575, 5316, -290, -4838, 786, 3995, -2234, -4816, 731, 2335, -2679, -4060, 13, 1480, -1421, -3220, -1063, 2079, 265, -2910, -837, 3266, 1459, -2624, 151, 4445, 1523, -2505, 357, 3708, 345, -2481, 314, 2113, -379, -2372, -361, 725, -1389, -2086, -1062, -284, -1051, -1995, -1321, 421, -120, -2053, -372, 1957, -291, -2018, 1101, 2600, -32, -1475, 1710, 2702, -268, -1756, 1440, 2831, -502, -2172, 500, 2297, -180, -2520, -478, 1368, 356, -3071, -2258, 1837, 990, -3106, -1669, 2823, 1548, -2430, -1224, 2751, 1816, -913, -728, 1952, 2061, -199, -291, 1433, 1732, 364, 72, 384, -196, 399, 280, -586, -832, 264, 274, -950, -1307, -215, 1129, 169, -2022, -856, 2323, 921, -2329, -576]
488e76K935q44k412j67K739J331l067k264L986K309m243l346M507K853l824l714
504c797L354M452l969m823L932M812m467l444L992K325l318r99K164O01p51l18
520b54J93N21K83r64O19K97p85J44P88j300O7N23l44l0j34p47O90J757j969k370
540c015K774K100k658k328K834K581j583l522J674M857k160n902L281N528l225
555A236m828K768L888j853k693l6K307J192k385j854J662J889p68k581l50L533
571A127J446m931j590N854J882o653q01O347J72m802j75L384Q04j748j868J074
587d78K154n06k142K55J155P61p48k169N33L711j222m370J484M586j846l916J240
604a518L252j99l118l16L603R06l780n02L755o10k521Q06J482q55J75l81r98J316
$$ y = [-576, 2359, 1515, -897, -1064, 1675, 3006, -61, -2325, 1661, 3970, -273, -3619, 888, 3741, -83, -3797, -443, 4009, 40, -4783, -851, 3961, -506, -3950, 42, 2367, -951, -1950, 214, 815, 64, -254, -61, 460, 743, -221, 398, 695, -90, 54, 842, -458, -391, 132, -212, -242, -376, -1123, -433, 1324, -645, -3015, -241, 1859, -799, -3127, -293, 2288, 705, -2817, -1143, 3714, 1554, -4348, -1067, 4461, 1236, -3592, -824, 3064, 1211, -1482, -1518, 789, 1981, -404, -2258, -596, 1293, 525, -2056, -2406, 1127, 2573, -2358, -3948, 1906, 3788, -2865, -3666, 2681, 2853, -1949, -2124, 1260, 2064, 316, -1552, -478, 1676, 1170, -972, -717, 438, 1199, 451, -1718, -1185, 2526, 1304, -3066, -1582, 3004, 1158, -2758, -1518, 1734, 1535, -1583, -1899, 1704, 2610, -1170, -1672, 2083, 1473, -1048, -242, 1240, 385, 560, 179, -819, 497]
622D97J149k088o10J664L76j339n59J195N86j659K27J810p36k682K065K515k865
639d54j956M045N97l958K11L735o39k895M65K239K81k407j080K674J241k604j112
656a617J897P64j006r03m89K142L80k232j109K707J246k804j040K416J635j866
672A21k368J293L026j014l816J650L537j741k658J368J863p25j454j12Q54J350
688A174j432j279J109J707p01k530Q25K289K57k810l59K950N21l468J98L102j199
705C54j474J077O23m94k31n81N63Q52m43q05J88R51k02p43m3M57M75m68r37R89
725A08L42o35n03O18L18j66o0j2M34J66j005L18R52o43j058Q64R97j328m3Q58
745E22l33m73K61oL94nq79K73Q24l64p03L72P24l38o38k0J004K54j338K93J210
$$ y = [497, 1646, -442, -1052, 612, 988, -351, -910, 285, 871, -788, -561, 1249, 513, -2169, -104, 2411, -454, -2410, 1635, 2232, -1726, -1515, 2220, 1581, -1314, -849, 1390, 1671, -736, -1816, 858, 2099, -505, -1617, 280, 1044, 38, -865, -1354, 788, 1168, -1064, -2173, 534, 1780, -1024, -2064, 352, 1987, 121, -2247, -954, 2072, 1058, -2758, -1108, 2429, 688, -1970, -602, 1261, 536, -918, -1030, -176, 1174, -258, -1537, -428, 1279, 578, -1952, -1127, 1162, 1419, -1391, -1750, 1200, 1721, -1747, -1549, 1553, 354, -1120, -43, 580, 86, -145, -726, -163, 689, 246, -559, -371, 580, 378, -365, -408, 49, 524, 56, -881, 108, 450, -185, -688, -70, 248, 82, 22, 10, 444, 610, -395, -77, 875, 232, -826, 38, 1035, -293, -336, 522, 189, -284, -23, -29, 365, 360, -519, -246, 578, 214, -489, -117, 607, 269, -369, -389, 615, 869, -469, -176, 1034]
766A034m66j066M21J246o90p05K03L38R3l29k44k9Q12n74l73M45J38l75J16k0
786b5J07J75j86m63L37M88n85p1J85M08j13n10j83O25K21p99K40N50K04r29N0
807b74M61j62l10Q2J34J46m9n11M70K48q64L61P8M14l54k53L22K04k71l14J40
828c02L76n14K01L39K29l18L09m21j70M07j67m7j66J59l03M31k05m5L59k34k80
849c62K96N1L3l04LJ78l3n1K30J54j53n5j25L33j89k35m2M62j31j33J3N40k89
872A91k05k92M82J78n23j70N29j35k04K05J75j68N8N5m9J99j78J00k9K9k97L73
894C24l64K94K63o02K8J99J42o6k34J03J73j27l47J21L18l32j56J42K54J83n08
915a92L97p9p3J9j77K51J05k04o4L38m2l46q4L12N0j03j47J77j63m5O2q3M3j9
$$ y = [1034, 568, -498, -77, 1169, 479, -226, -23, 315, 408, 79, -165, -194, 618, 44, -329, 116, 254, -121, -5, -25, 82, 257, 71, -392, -55, 433, -152, -223, -38, 370, 257, -253, -436, 189, 410, -389, -149, 401, 605, -324, -274, 187, 25, -285, -203, -69, 77, 28, -483, -13, 235, -629, -268, -190, 224, -130, -383, -61, 143, -128, -442, -302, 74, -440, -239, 100, 329, 11, 320, -101, -271, 136, -31, -78, -244, -85, -388, 43, -162, -207, 152, -82, -362, -66, -15, 18, -286, -283, -105, -138, -189, 41, 195, 42, -13, -138, 195, 6, -229, -271, 191, 60, -73, -60, 480, 191, -14, -306, 176, 354, -169, -339, 190, 55, -149, 56, 231, 63, 121, 176, 127, 326, 148, 248, 219, 248, -49, 324, -40, 254, 517, -85, -57, 142, 284, 218, -16, 87, 260, 133, -214, -93, 225, -107, -263, -121, 133, 316, -192, 205, 126, 53, 72, -105, 146, 251, 47, -17, 321, 279, -67, -151, 161, 211, 108, -39, 138, -25, -70, -8, -91, -48, -67]
939f7l8k6J55Kj92L68l42m5K98m57L17l0J53l48L8J37L24l99K1j04K57j00m19
962d97K72q6L73k77J51j30J1J01m2k58N16k4n62L84k32M19k03l96M80K00j47m60
984d07J70L18P9l22l9K52M57l77n34M54J70j95m23K74K44l3k26j86L46J25j75
1005b8j46J98K05k98o4M1N43n39j77J17K43l11qK54j50K53j90J52k52J96K11j94
1027E6o3P9J16l88K44J5L19k61o41P47m0j16k29L81K65l14l48J3O14j75O6n21
1049a81K68q1m3J02k31Q2L00L6n40L55N27m88l30K94ok2M4l42M08J9P4j43m70
1072c68N87O5J95p36M29J39n37l28O51N14q84j60P25n8m05l86N43J62r4l97k01
1093e44R36m09l98K03K22J56k78m4N5P55p21m40L35N01n81j78K86O05j08o64k46
$$ y = [-67, -105, -131, 24, 26, -166, 202, -140, -185, 113, -344, -27, -57, 96, -252, -214, -77, 247, -152, -131, -235, 22, -78, -497, -225, -311, 62, -215, -64, -194, -183, -82, -124, -382, 134, 110, -452, -68, -300, 119, -84, -480, 0, 200, 53, -407, -237, 81, 160, -162, -201, 51, 508, 131, -403, 51, 221, 26, -397, -123, 121, 88, -138, -324, 22, 147, -28, -174, 24, 229, -69, -133, -92, 451, -88, -265, -148, 95, -216, -224, 30, -120, 133, -57, 95, -157, 39, 250, 56, -7, 72, 188, -200, 44, 59, 378, 117, -524, 223, 183, 67, -162, 219, 484, 170, -178, -165, 449, 274, 340, -181, 87, 6, -37, 65, -166, -84, 216, 252, -288, 67, 594, 106, -224, 70, 64, 42, 86, -256, 152, 171, 245, 102, -368, 219, 284, 479, -257, 172, 311, -226, -554, 97, 611, -273, -433, 292, 234, -171, -557, -14, 148, 54, -343, -544, 392, -17, -415, -212, 10, 166, -112, -156, -101, 654, -67, -507, -172, 329, -252, -430, -144, 461, 353, -311, -557]
1114e57O57J97q28R2L95L2j56J00J7k57J64K49j8l4K23l55k08L26J85l0m41K15
1136c2K96m33j36L00j94j0L54j26l27q3Q23l3o67L02K15k6l37J98r7K06m44j1
1158b62K81J18Qj17J70Q2j83l55J19J44M17k45m22K7K54K9j68K68L6k07k93M88
1180A89J19m9o03L53N62l62n83K14M75l42j30O0j78K84N91o79J88k7J48n06L71
1201I5J01j75j02j09P25j96p71J38K89Q3m27K42J23p6L1K17k56N5J76n78O35j8
1223B02m70P1N5K22k5j47l2kJ39j83J66RJ91m51M25q3r0n6j45Q1J21k45k01L14
1247a34K22l32J64J45j69k09M87l01J01o6Oj48L04k94J98jL5j94k22L78k01K74
1269D3J8N9j07j72j5M02j8o04K96K78kk36m5K8L8K53Q3m66q5M53N5l72K57k20
$$ y = [-557, 100, 297, -531, -439, -44, -12, -168, -68, -51, -308, -144, 105, 87, 53, 276, -79, -287, 39, 224, 194, -247, -32, 264, -169, -305, -5, -199, -209, 145, 19, -308, -391, 432, 399, -268, 34, 249, 223, -114, 84, -13, 193, -251, -262, 19, 137, 145, 28, 198, 280, 97, -258, -139, 5, 422, 177, -245, -218, 36, 65, -103, 165, 201, -6, -299, 189, 308, 259, -344, 9, 571, 209, -374, -160, 315, -27, -157, -97, -275, 9, 600, -79, 109, 82, 230, -276, 95, 196, 21, -81, -190, 535, 339, -432, -294, -5, 78, -349, -107, 16, -60, -29, 188, -68, -13, 163, -415, 220, 202, -268, -197, -142, 80, 55, -92, -124, -126, 13, -170, -4, 5, 196, -255, 170, 87, -3, -59, -204, -123, -2, -247, -448, -134, 88, -244, -80, 65, -104, -313, 174, -127, -26, -92, -86, -234, 70, -224, -26, -27, 8, -186, -408, -30, -231, 43, 61, 120, 13, -159, -174, 228, 210, -394, -98, 180, 178, -58, -103, -75, -37, 216, 299, -167, -252, 201, 256, -116, 141, -79]
1293g9j3J26J41k26rQ7J68m6l27R7J68k68J80K95o56L35M44l62k08K97Lk47J40
1316D0J36k39K38k02m6M10k40j0L4j5k5k04J95J01l9l8j67j01M28k93R7r0J08
1339G8m8k97K45j67K37j04Lj19K91j97J10o1J29P5j04J22ok16L4L04l37o9L90
1362B93l37K09j59j37j45M08j00N2j24m7J67j00l2p1M7K18l59J17j63lR5oN1l6
1386a62O1J99o7j76j20K04K19%r5l5j50k44L96L6k47J95J70j14l20K61J97k86
1408g8J50k45L94j42k10K95l40J05M2k31K05M0M5j07J86K52j91l56J55NJ62k19
1430h3j93L09p9J16q2K00l14L97k16j74J37j27K84j47k10J53J9P2k09O6N2l5K39
1453A75l27Q8J57n7k2J22J0j52K46k6n80M46m1L6k76K0J39K05l7j69r8M37j43
$$ y = [-79, -92, 34, 175, -51, -60, 27, 195, 149, -178, -81, 87, -181, -1, 294, -362, -27, 417, 55, -153, 144, 147, -100, 40, 176, -63, 175, -27, -73, 337, 97, 87, 121, 106, 81, -123, 72, 173, 134, 96, -71, -172, 256, -37, 60, -30, 78, 30, -267, -22, -189, 48, -56, -53, -172, 119, -78, 32, -29, 100, 175, 71, 193, 187, -29, 5, 309, -28, -97, 293, -44, 165, 6, -131, -276, 132, 32, 84, -40, -87, 80, -20, -52, -123, -76, 142, -217, -100, -263, -266, -171, -177, -126, -162, -101, 98, 31, -145, -265, -61, 158, 158, 63, 28, -122, -366, 30, 66, -181, 14, 184, 70, -250, 11, 208, -78, 72, -173, 221, 79, -131, 164, -176, -71, -29, -260, -55, -15, 30, -77, 109, 361, 170, -186, -31, -26, 136, -83, -276, 33, -46, 70, -12, 188, -126, 271, 55, -119, 18, -109, 175, 28, -182, -29, -10, 62, -147, -81, -29, -64, 175, -152, -64, 93, 36, 14, 136, 146, -6, 240, 214, -366, 80, 39, 75, -201, -181, -42, 163, 126, -43, -141, 296, 153]
1476A53r9j44j86M14j60K64j69K5k39M1K35k83J21L4k14J87P0K8k72K11k1J87
1498A83j40k42k9M55k48P3J96k40J43n31L29K21k41k44N36k44O0m23M90j39o6
1519a01R7o7q4K64j76M9o8j10K4K24r7J26k72P5J05m9K43m34J74R9K8pQ0K40j86
1544A77l53J08L5lr7L09k22M3k97K24k06M15l44J4K28L3n6K82k93K2j93rK1K61
1568I9K1r5j27j13M1K03K5J5m3j3J40Pk90n1L70l49K00K69r4j75p2J06J53l58
1592a31L93k57nq2M9q5J04N8k60M75k26J33k95J35L6o9P5J12m6j33ql0K01k76
1616a32L40N2j72j61J09J4L04n18J93j92J40J57k45K31K1r0k20L66j64o0l87L93
1638b1K34k30j85M7L02o4n0k18M76k47k49J87MO2K4k52K26l09K28J21K7j57m0
$$ y = [153, 54, -90, -276, 138, -22, 242, 73, 98, -141, -100, 135, -148, -27, 7, -207, -20, 50, 78, -194, 17, -4, 183, 43, -199, -228, 227, -21, 52, 248, 8, 151, -380, -51, 170, -71, -315, 221, -23, 37, -386, 104, -35, -101, -4, -71, -155, 109, -67, -18, -86, -196, -172, 52, -45, 81, -191, -116, -11, -60, 183, -251, -77, 22, 50, 43, 123, 363, 177, -176, -68, -33, -36, -133, 176, -46, -3, -300, -76, -282, 133, -211, -197, 31, 64, 8, 290, -3, 19, -174, -183, -162, 99, 120, 25, -102, -215, -174, 29, 54, 69, 26, 13, 153, 160, -130, -181, 189, -160, 40, 309, 215, 40, -32, 74, 227, -131, 262, 5, 0, -82, -33, -118, -14, 44, -216, 259, 33, 166, -129, 6, 42, -27, 48, 160, 114, -19, -27, -57, 144, -132, 208, 260, 88, -73, 36, 50, 354, -164, 29, -163, -23, 134, -111, 120, 141, 51, -169, 197, 33, -27, -414, -21, 213, -17, -202, -155, 147, 83, 33, -185, 291, 44, -205, -18, -14, 48, 72, -180, 46, -263, -35, 86, 113, -44, -84]
1661h4J35k13RJ64J3K28j54m40K44l1J60p0j38j4O5K85k22Ol8j18P6L17k96P4
1685d2j23K23l6oj3K85l25N8O8j52K20J9q2j70R6QJ09j63J60J46l03K40j61k15
1709a59j35L92J63k87K0q3K38l2k94L10q1r3P7J71l58J39KJ72l73M46j07j70k2
1732f4J27j67J90O6j49O0J4k27m5L11J22m98Q3k6L16k22M7J00J23n6k16K66k16
1755f1j01J6L51l53J18R7Nj75J90k58K48J91k91k20L9N14m04j70k9M85k42l2J46
1778F4N6r4j61J43R8r0j3M6k07J53L5L6N5k2l00j04L88P3k91K62rk90K98j70K82
1803B38k58l32N35j66J29k33J52N4k2k28K37jl8n7p7L19k23k19L38Oj71j3K1K33
1827B24k25l7k66M36l47L03k03K66j40k00O7N8K13J1n7J08j81N0OK06r5l44j17
$$ y = [-84, 51, -162, -153, 11, 24, 252, 98, -342, -98, -129, 31, -39, -177, -191, -126, 159, -63, -57, -95, -213, -137, 180, -116, -42, -165, 58, 22, 16, 3, 288, -37, 21, 89, -63, 157, 176, 94, -76, 20, 28, 137, -26, 134, 280, -23, 217, 56, -159, -294, 98, 261, -26, -6, -89, 149, 117, -177, 133, 52, -41, 36, 207, -151, -12, -10, 162, -211, 235, 128, -42, -64, 63, -104, 86, 152, 3, 63, 77, -150, -195, 116, 238, -260, -177, -203, 113, -109, -62, 38, 161, 105, -111, 155, -61, -162, -146, 205, -148, -30, 67, 72, -103, 87, -171, 77, 268, -23, -243, -204, 310, -94, -264, -293, 192, -50, -82, 64, 120, 26, -135, 8, 106, 16, 3, 49, -158, -5, 30, 66, 121, 99, -201, -305, 83, 156, -135, 127, 118, -172, 126, -44, 238, -20, -352, 183, 17, 146, -87, 65, 119, 97, -131, 106, 105, 67, 10, -67, 252, 29, -190, 148, 154, -17, -30, -9, 224, -1, -38, -304, 132, -215, 88, -115, 151, 11, -189, -122, -64, 149, 160, 103, 211, 30, 80, 86, 292, 197, -147, -264]
1850b64N63m23J16J17k1o2k8j21L51m52J16L96j4m54M03k94n9M25k94q3K17o7
1872F8M7j96K79J9k42J64j03mO0Q3M2m03J59J32p3J43k04J43N1O7l16r5J28M37
1896C86k63l92M51j27j08K21r5M9l95J6M35Qj69J16J3j07M7o0J70j78j50K44J21
1919B33j93m2k60J13J96j05k3k1j13L54k44K94l4k37J19J63j43k85J92L08k60
1940A2j13j73M55l02m8J53J97r0k28m1K21K54j77m16M9K77j69K05%l29KK11Q0
1963C0J01l33K82K22j67p3q1Q7j68j40J73M66l41o8j17N7K67l67L6Q3K39l37j57
1986c06L24n0j6JJ11O9l42L49p9J5N6r8K52k48r1J16K8k58L25k80J47Q7j0k92
2010a90K24j23j12L18l4J01l29K30K45mj60m26K20K54q0k89K71j31k42J14Q6P6
$$ y = [-264, 299, -124, -8, 109, 88, 26, -2, -123, 228, -224, -108, 288, 274, -180, 223, -71, -130, 295, 1, -82, 135, 68, 115, -81, 198, 217, -25, 139, 36, 32, 92, 175, 217, -186, -27, 105, 32, 175, -29, 114, 165, 232, -84, -179, -51, 386, 123, -269, 182, 55, -53, 168, 73, 122, -273, -257, 178, 186, 17, 133, 146, 39, 86, 26, 196, 18, -132, 112, 233, 40, -2, -262, -149, 47, -58, -81, -102, -215, 139, -105, 189, 155, -82, 37, 200, 57, -228, -36, 272, 12, -101, -274, 181, -121, -169, -16, 181, 91, -137, -178, 43, 297, 120, -296, -247, 30, -139, 66, 66, -263, -261, -50, 30, 131, -202, 80, 302, 135, 62, -19, 68, -100, -240, -67, 399, 58, -10, -127, -70, 197, -170, -134, -51, 188, -149, -306, 18, -32, -48, -47, 64, 133, -209, 140, 61, 76, 132, 34, 286, 38, -53, 63, 91, -167, 158, -122, 25, 112, 102, -190, 34, -89, -201, 117, 83, 184, -145, 85, 330, 326, 166, -260, -40, 214, 134, -155, 116, -15, -257, -143, -57, 19]
2032A9J07k18Q9K1j00j5J92o3P7j44rqJ25k1K62j09k86J20m3o6J72l31L37J99
2056C07l93L67j18r6k25J98Q8R7m62L14J21K15o73K9K56J23j84n1L22m15J58j67
2078a89J12L1r6N3Q6Q8m7N8P6j54l01J66J93q1k67L57Ol2l38J1R4K53k0k90J49
2103h2L71l47O8J45Q3l46M2L70n20J60p4L47j34l58L91R6l64r5M48N1k08m7k22
2126b25M46j5oj32l5Q0j63J5M0K86m57J2J10N8m0j58J90O4Q4k24R2K31l47j65
2150b59M1L56k33Q4K22J6k10j56L27j1k72MK10j97m0r2J53p9R2j57p4L24l9j20
2174a10K77l84R6r0N72l90n2J1J14J24p0j55J00l6p7J41K8m8j94J75k42J51j04
2197a63j89L68q6L1m8l5J06j54J9K40j23J29Q8k70J7j58K76l5k13P5Q4J16L7j15
$$ y = [19, 126, -92, -3, 18, -82, -97, 95, 32, 109, -35, -44, -52, 73, 52, 314, 205, -81, 39, -4, -70, 102, -229, 108, 307, -86, 281, 163, 67, -158, 40, 128, 225, -237, 77, 198, 413, -260, -231, 25, 148, -36, -87, 235, -180, -22, -189, -77, -46, -142, -89, -3, 85, 38, 96, 172, 18, -283, -117, 76, -5, -272, 85, 91, 59, -279, -268, -174, 79, 59, -231, -82, 289, -58, 10, 155, 238, -108, -66, 304, -216, -56, -130, 217, 83, -275, 116, 212, -152, -247, 201, 252, 44, -3, -225, 221, 206, 200, 68, 33, 113, -50, -35, 5, 291, -166, -154, -44, 14, -26, -184, 6, 70, 154, -70, 22, 253, -94, -259, -218, 138, -95, -11, 211, 227, 17, -139, 188, 177, -95, -91, 119, -78, -118, -210, -57, -136, -44, -201, -275, 49, 10, -110, 167, -217, -121, -211, 361, -29, -81, -70, 44, 168, 98, -57, 43, 7, -70, 71, 99, 51, -143, 32, -210, -59, -163, -352, 16, -70, -39, -87, -122, -16, -170, -151, 89, -34, 95, 183, -87, -70, -228, 48, 13, -200, -125, -41, 75, 112, -3]
2221cm2p6N29p10K07j69M06K6k34j7p8k5J36J08k9r2J83m6j6j03K8j46p9QJ45
2246h9L36k97J7l2m0M6l69K20kK56o6N9n6l3j59M08j62r5J43k39L65j95J12n8
2270G0j39J77k40J18K6J30m8n0j33J05K34o72M68J46nk80L5K80k59k2J81j5mj29
2294b6O5J80k52rJ60j1k7k25J25RJ79k97K55j13j2k01R7O6k21Q9K09K30l96K3
2318a03J67k71N3K11k36kM33j26m7r3nj0m0K39p4k12K52Q4m18LK36l73M52j09
2342A1J58p7j95J79l6Q1p9k77K60j03j22K07o2Q0k64L65q4m7q4K08n5n0L0k34
2366a90L25j71Q6j76J1R8J35k26J14qk46j3J66M81k42k98J35J64j17j11J33j94
2388a44K02p2J65j16k44L9J22K45k05J85l17J41J32j16j05j85M76Mo9k14o2Q9
$$ y = [-3, -45, -121, 408, -302, -95, -264, 142, 168, -66, -83, -161, -186, -50, 58, 29, -63, 120, 74, 58, -45, -17, -163, -242, -234, -89, 247, -50, -33, -65, -105, -59, -428, -208, -210, 46, -20, 39, -17, -50, -209, 199, 37, -58, 85, -154, 211, 16, 128, 70, -69, 108, -132, -14, 12, 142, 94, 44, -89, 16, 250, -422, 46, 192, 187, -93, -58, 222, -37, -59, 122, 107, 103, -26, 39, 219, -33, -42, 118, 107, 80, -145, -20, -11, 168, -129, 126, 13, 1, -200, -103, -37, -258, -169, 40, 270, -126, -103, 64, -207, -154, 57, -179, -181, 252, 126, 79, -14, -19, -29, -69, 170, 96, -116, 136, 220, -198, -195, 41, -332, 120, 11, 169, 92, -103, 76, 40, 121, 42, -235, 25, -78, -200, 7, -55, 25, -239, 126, 42, -5, -89, 119, 64, 14, 44, -190, 135, -36, 50, -126, -115, -17, 118, -108, 6, -2, -248, -261, -95, 386, 144, -154, -19, 145, 28, -83, 50, -144, 58, -14, 151, 35, -209, -170, -48, 197, -8, 177, -140, 1, 133, 17, -88, -273, 203, 207, 138, -76, -138, -49]
2410d9Q1j97J10o2Q8K13l10p3J37J24j11K87J8m18K05o3N2L34k66j05L91n33L43
2433A96l35J0L05j25P9l34J43j74J13K30J2k2j50K79j56l43R4K65L1k03j06K79
2455H8K26J1k94j38K8k5L40k52k05J04K75k34P7o8m2K53K6j7k37K23q1j67R9j01
2479a11K44l66K74l7J62k24R5O6k21M08l12M0r6R3l24L87K72j63k80J52j89J32
2501Bm3J06r8J61m3J19j77M11l91k4o6J11j21J27j50J90M2j88J21k48M6R6J85
2524A68l11J78r3Q5L8k37J13K57k46k23L32J3k22j59J94L11j33K91l13j63J15
2545ejJ2K0k40KL89k55k06K8K56J11k28K94k20P6j66K7j18K93j08O9p1J90j33
2569A6l09J07N8J21K06k15J10k07p6J56lQ3k1rK4Q8M5m3n2J30q6j92N2J33k96
$$ y = [-49, 32, -165, -55, -117, -29, 184, -126, -199, -62, 62, -49, 238, 256, -162, 43, -20, 32, 366, 100, -5, 386, -147, 196, -139, -129, 176, 51, 130, -204, -61, -235, -122, 108, 120, 98, -52, 227, 71, -272, -178, 87, 118, -85, -191, 88, 314, 325, 31, -107, -79, -104, 236, -16, -221, -117, 158, -76, 1, -67, -109, 144, 170, 153, -84, 139, 58, -109, -10, -111, 133, -233, 41, 4, 166, -58, 37, 103, -118, 290, -22, 18, -78, 15, -309, 78, 350, 187, -93, 59, -130, 2, -41, 65, -33, 128, 85, 204, 27, 438, 47, 23, -43, 68, -53, 74, -76, 114, 156, -32, 89, -159, -113, -17, 168, -143, 35, -58, 27, 65, -172, -59, 198, -48, -271, 61, 74, -148, -307, -113, 198, 65, 356, 43, -120, -5, -6, 6, 26, -214, -212, 177, -78, -284, -256, 0, 111, -117, 177, -43, 33, -133, -106, -224, 69, -39, 30, -41, 149, 16, -293, -186, -128, -7, 199, -16, 94, -113, -189, -33, -36, 47, 26, 17, 41, 129, 174, 131, 79, 209, 123, -69, -17, 116, -180]
2594a80P7J13J98j84m5J27k4j9j92L30l85N3k9L67k84p4K45j11j66J06R1R4M2
2617A50k04No6J2Q8L41k10q4m8J20j55Q2J08j98M6J7q4J40l6k31Q5m2L59l20J04
2642b1J97o2j12J73j93K73P0m01L44k52N4n8Nm9J12j3n4j6Jm7r4J98j14o1j48
2667b68L9L90k15M30o99M69k14j48L94l00j1j83K50L32m54J21n6p0J24j11K12
2688C2Q5J2j89Mj30K79n3n8R2Jj47R2r8J36J3j3J05j4k7j82rj46J85ML75l72l2
2715e5L12j50k97J16L7m6K22k59L09J96l70k20P9J84j15l7L19k11J30k53L97n55
2737b67R3K53j77K74l61k4n4Q1J76j57R1Q9N9J0N8q2J27J46m73O3L5MJ07j19R4
2762D6l41L09k93L93Q3k10J7j26r4J65L3j56L08k6K43n22K46j2j56K51l77J65
$$ y = [-180, -103, 10, 208, 24, -21, 106, 82, 63, -129, 201, -184, -131, -160, 207, -77, -151, 94, -17, -183, -77, 14, 108, 150, -54, -49, -115, -103, -15, 326, 116, 32, -16, 104, -51, 31, 139, -59, -13, 4, -80, 60, 24, -207, -122, -164, 195, -125, -21, 176, 114, 2, 175, -18, 255, 325, -76, 268, 16, 70, 12, 17, -32, 80, 67, 13, -3, -2, -49, -143, 55, -59, -120, -268, -229, 161, -54, 376, -323, 146, -68, -216, 178, -122, -133, -316, -66, 266, -188, -67, -123, -193, -69, -180, 32, 117, 129, -60, -56, -186, 93, 40, -18, 74, 75, -72, 20, -78, 58, 71, 58, 163, 149, 122, -60, -69, -215, -30, -26, 349, -23, -55, 257, 107, -190, -74, -37, -83, 139, -120, 189, 385, 15, -205, -126, 58, -57, -94, 225, 14, 144, -109, 288, -267, -174, 79, -98, 176, -185, -209, -263, -182, -6, -163, -72, 17, 76, 86, 144, 62, 189, 335, -138, -75, -40, -36, 71, -48, 46, -295, 14, -279, 114, 197, -13, 4, -122, -216, -51, -18, -174, 134, 108, 351, -171, 75, 63, -93, 158, -219, -54]
2784e4j1l6J3k04K63Q9j13J55k06q5J30K22l91M65k02N4p9k24L45J29k01l5q4
2807f0R0P9n8j4j34O0J30j51j0k9K32k25P8J77p3q3J57N6j11k91J26M0o7p4K6
2832a29L82N6l85L60m15Q3N8m6j67N68n1l60K9J15j42J27k3pqK60m79L5J17N2
2856C0K02k49P4j75J13%j21k9J73NP2j89J87l07O5Q6K0K9k27K18R6rJ34n27J77
2881a52L08J74k32J35m4k02k12L00k27L05NR0l03m0K27k18K27k66K25k61K06j6
2903B9j49J26k06K42j5r1J09j61L04J71k40r3j06N5n5J94N4j25K01m66J93q1J88
2926G8j66J18j70R8q0L57j72l4j94K7J76l6p8K5R1j44K26J6o2kM7j28j78O8M92
2951C75l35l3J46j2k34K78k32j67L82Q9k50j27K7J46j48oK53j97J43K2j50J0J54
$$ y = [-54, -65, -101, -88, -292, -29, 60, -53, 102, -104, -189, -59, 163, -228, 237, 35, 89, 10, -214, 131, 260, 59, 24, -60, 30, 109, 51, 37, -97, -37, 93, -58, -68, -97, 135, -90, -12, 165, 92, 9, 166, 222, 111, -180, -54, -14, -81, -155, -129, 253, 309, -76, 284, -131, -48, 10, -36, -203, 365, 314, -46, -17, 98, -44, 83, 60, 53, 45, 305, -174, -139, -22, 30, 232, -17, 57, -118, -5, -5, -126, -155, 18, 23, 95, -94, 93, -214, -149, -63, -43, -14, -241, -23, 73, 64, 198, -329, -152, 156, 330, 98, 233, 189, -13, -225, 75, -152, 153, 158, 248, -55, -95, 132, -86, 141, -125, 100, -161, 45, 29, -120, 6, -200, 42, 27, -64, 45, -116, 188, 359, 119, 26, -80, -25, -80, 114, 168, 43, 244, -222, -29, -110, 78, -88, 30, -140, -42, -122, 235, 63, 29, -165, -138, 38, 2, -76, -51, 40, -104, 122, 138, 76, 74, 121, -7, -185, -117, 375, 40, 7, 153, 141, -93, 185, -47, -214, 168, 257, 7, -120, -93, 53, -95, -101, 152, -45, 98, 120, -30, -20, 134]
2974A34kj67q0J15j2kl0J32K23j30m13j13K22ML3J27K24j44r5n2K4j38K55j72
2998e7J47l08M1K73k61j59L77J51m47J90O5oJ7j48L14l04J78j04k7j4K64l51K9
3021a40K4O1K6p5L53k57K44l71k9J35l1m3L78o2k12M1N3K39k35j68L20j00n8l24
3045b31J09J35J3J19k32J95j15J33j99k26M20qm6K79l73P6nj01P6J20j88p6K69
3068A44M1q2j65J21n1J74k28n4N2l6N1J18j14J26j1l22K95l53L47L8j25q8M7j66
3092b41J61J68m70K79M0J78k33l6R7R0l1r2j02L05j96K57l12J55k50J59L3k24
3114b65L03j71M8j26L50k87J72j45j8J06j0j92J50L6j55K19j05J88M0K45k06R
3136A86j64n1j55K44l23K38L11m50k11L79j96m3M42j1j19P9k08J73k00K55j51
$$ y = [134, 132, -35, -115, 0, -12, -14, -44, 88, 311, 181, -232, -345, -123, -119, -86, 41, 265, 121, 26, -26, -2, -140, 115, -57, 90, -218, -177, 96, -165, -324, 53, 204, -243, -53, 12, 6, 23, -125, 189, -115, 63, -41, -68, -82, 182, -169, -140, -116, -55, -29, -104, 249, -8, 236, -135, -164, -29, -60, -103, 275, 213, 1, 42, 95, 334, 99, -69, 251, 151, 93, -231, -122, 13, 26, 145, -87, 108, -7, 126, -73, -299, 121, 113, 67, 346, -27, 49, 44, -57, 19, 139, -49, -125, 144, 185, 103, -62, 59, 8, 182, -46, -100, -48, -84, -33, 85, -29, 97, 86, -236, 59, -294, 53, 91, -34, -122, -75, -241, -80, 88, -382, -103, -63, 115, -118, -154, -57, 33, 2, -90, -192, 113, -83, 174, -138, 17, -233, -74, -41, -265, 38, -133, -85, -211, 139, -148, 24, -121, -139, -33, -43, -235, -85, -49, -204, 15, -90, 98, 138, 383, 177, 186, 22, -29, -184, 60, -263, -25, 286, -164, -375, 4, -192, -235, 207, 196, 77, 156, -52, 121, -79, 176, 25]
3157B5j06J94j61R7k12L88j52j11L7J46j92N0o7J31l21j1L74j05k09kJ9R8K22
3180A32Q5r4N9k37J39m29L15k5j47K96n0R1k66M14l18J19m6j19K5o8N0L08j49
3203H5j59K54j58j67J47J8Q0M1j48J29k18L23m38n8K17Ok83M44j54K16k7l9J3
3226A24K89j19k16J40o2j32j71nJ69M3j51K24j95L3J53m9j41%k6J61n6O9k31r4
3250b43K05J3P9j86K5j22K53j08K76l27J8M28l28j9J22q7p9J81O7k25J03k71K38
3273A3O2o4K29k03J83l18K72j25k2N0k66K46k21K58j35J16j47Q8K19n8k48K64
3295A93k30J55j53p6L65n00K44n7J77k57P1Kj32K42M0P2J91k34q5J1J35k62j99
3318b87K87oo2k37K96L3j52L40k28Ql8K32k16K56o13L94J57k46J77r2m4k50K93
$$ y = [25, -81, 113, -48, 49, -163, 225, 73, -38, -1, 145, -47, 3, -64, 67, -254, -265, 109, 4, -205, -207, -188, -90, 132, 217, 123, 182, -55, 84, -345, -30, -55, -202, 94, 44, 135, -131, 283, -35, 84, 38, -81, -56, -124, -74, 234, 85, -74, 180, 22, -145, 2, 20, 100, 141, -7, 122, -96, 227, -211, -269, -52, -46, -329, 115, -39, 177, 150, 111, 124, 413, 294, 78, 218, 156, 24, -147, -152, 17, 60, -91, 133, -62, -29, 124, 75, -66, -66, -92, 69, 13, 82, -149, -243, -38, -25, 54, -132, -107, -229, 24, -84, 192, -135, -117, 311, -17, -36, 86, -1, -80, 101, 168, -57, 46, -225, 13, 75, 11, 240, 37, 220, -98, 174, 49, 27, 77, -189, 57, -164, 94, -41, 75, -72, 16, 235, 177, -71, 193, -37, 118, -35, -111, 254, -246, -2, -59, 118, -139, -68, -66, -198, 44, 84, 156, 347, 113, 28, 39, 174, -88, -287, 0, -6, -68, -305, -9, 24, -128, 212, -16, -8, -46, 186, -30, 226, -387, 7, 164, -82, 95, 3, -41, -291, 2]
3341Bl6R1Q0q7j12n6K9J95p1j06N6j83O7L34k90oJ65LK3k12j2j15L81on8n1R8
3368A23k85J85n8k01L89m8k46K78j92j31M3R0J89k97k1K63j94L75j17k37J80L5
3390A23n2k92J16K30k55K11j57J69j92J60p5j07j59M23j69o0O0j58J79j68M13
3411B40j96j38N6k1P8j5P7j35K56l52J98j9j14L1J68j28P7j33R5o9j21J46J33
3434A14l4j28J60J30j08k25M1k20K78Q0om8q2K35k73L73k64J35ro1l09J59J16
3457E4j29j12QJ24L91k33k15j21M6J14K8p1J35J15j1k2j12K90l23n2J4K00k44
3480a26J82o4l8K06k72J45J12R7j72j64J25K35m63J05oN7R0k22J64J90m15M43
3502B09l27J69m6Q9k24L26k52L7p6J75J74n3k98K25k08N1O8l6J15p4r1m3L1O7
$$ y = [2, -34, 57, 137, 50, -62, -118, -89, 106, 35, -71, -15, -198, -131, 203, -87, -93, 72, 75, 98, -114, -126, -241, 140, 134, 76, 25, 123, -162, 23, -35, -236, 153, 105, -141, 137, -55, -186, -143, -53, 136, -161, -182, 81, -113, 262, 145, -92, 88, 123, 71, -221, -105, 125, -130, 81, -76, 93, -99, 61, -14, -121, -280, 143, -26, -86, -26, -184, -5, -173, 240, 44, -94, -38, -59, 19, 4, 81, -54, 202, -150, 48, 29, -85, -54, 114, -14, 63, -70, 25, -44, -165, -19, 114, 80, -48, 112, 242, 134, -91, -50, -270, 8, 88, 82, 34, -48, 187, -86, 287, 23, 158, 149, 88, -221, -62, 54, -75, -187, -179, -55, 336, 103, -112, -233, -187, -73, -45, -116, 19, 134, 123, 101, -11, 279, -44, -96, -82, 118, -126, 56, -8, -46, 160, -112, 33, 145, 242, 70, -94, 31, 266, -197, -92, -98, -41, 49, -173, -9, 181, -234, 209, -118, 51, 5, 94, -130, 196, -56, -19, -95, 80, 254, 201, -97, 128, -80, -29, 39, 3, 118, 44, -47, -90, -59, 8]
3526HJ16m3P0p8j82L50k15J25J40l17JL1j02k6J42J78m09K17r3Pk60K74J8J20
3550G2O7j34Mj28L45r1J26k44O8j44j03J39Q1j43J3J85P7pk89J21J02j66J10j72
3574a11L27j66j08j88L77j65L6k26J25k2L57j45P6j16L1R6k02J05j9J0J03k71
3596i6mJ55j55n7K01K79k36j6N3k01J42k9Q6J7k33J28o3M7J19k32n4Q4J47n9L0
3621E3j4L04l09J30j65j93L32j43j09K46J2j6p0k64KJ10R5j22j94J01K34M4Q4
3644A48l70L02k82L46j56J77r3l36K30R3K78o22N51j75n7R6k61J91j74P3L15k02
3666G2o4j77L17j97o2J97pM6r3j20K26p3J65j84j69J36j41K95m3l4j6k73K07k4
3690a6Q1l1J73m6k11j83J61r8J66k41K79M5o5J18q9o8kpNP8l14M88k65NJ7p9J35
$$ y = [8, 124, 81, 151, 73, -109, 241, 26, 151, 291, -26, -25, 6, -96, -122, 20, 198, -211, 6, -87, -80, -340, -66, -48, 72, 139, 5, 9, -119, 226, 135, 261, 17, 85, -59, -162, -23, 58, -85, -72, 113, 190, 183, -106, 15, 117, -49, 61, -111, 216, 50, -58, -246, 131, -34, 2, -224, -99, -121, 236, 91, 167, 51, 82, 178, -24, 81, 62, 72, 175, -96, -100, 55, -100, -157, 44, 323, 87, 71, 124, -77, 65, 36, 122, 139, -94, 34, -29, 18, 137, -95, -149, -65, 82, 23, 53, 39, 343, 34, 164, -1, -194, 138, -5, -114, 132, 144, 128, 58, -206, -204, -94, 1, -121, -315, -214, 20, 64, 148, -222, 80, -202, 144, -12, 165, 72, -264, -34, 59, 337, -285, 266, 91, 34, 130, -131, 60, -114, -41, 274, 72, 8, -169, 148, -49, -111, 86, 79, 125, 32, -88, 138, 65, 230, 46, -123, 13, -128, 167, 124, 90, 74, -199, 8, -16, 65, 34, 207, 161, -50, -233, -72, -170, -4, -245, 34, 79, 14, 132, 43, -25, -27, -34, -29, 49, -265, 223, -42, -37, -20, -99, 36]
3717C6J11J56k96j52J56p4J70J8j07l44J94k3p2J03Q5p4L06l14J62p4m5q7M02
3740B37k98K22k29K62j92q9k4J89m5j25Q3J12k17J21k9k00K49j45J05l6p0N8M05
3763C44n18J16P9j24pJ39J04n5M3j19k4p2J30j15O5J62o7j23p6j11N62l70P2k30
3787a95L88k53N4J23j75J2l7j19K52J79k89K43m55K50J11l4r8k21L00j55J04l4
3809d9J39q9K94j30l01L2J31r8L75m06r1K71J31k86j86L39j58J97j84J61K5j40
3831b3J0J66l81J10k9j08N02l45o4K15j20J52K0r8L14m08J74J61j99k68j6J69
3853f6K07j69K21k35PL1k45L29k02L48j79q5r5K07m3J10l12K52J1j3n7j34J6p8
3877a74K63Qn7K2j98j52L21m1k5j82J81J80j27J24N0j91n7J19p1k71N85k74j85
$$ y = [36, 147, 303, 7, -145, 11, -63, 107, 125, 18, -326, -132, -155, -227, -124, -39, -113, 193, -121, 41, -33, -78, -165, 237, -61, 161, -68, 194, 2, -87, -111, 78, 33, -92, -9, 103, -114, 7, -22, -222, 27, -118, -13, -49, -119, -61, 344, -174, -58, 21, -103, -110, 29, 133, 78, 121, 2, -22, -94, 36, -79, -14, 148, 81, -42, -118, -229, 333, -37, 35, -195, 193, -60, -6, 117, -58, -46, -83, -202, 50, 229, -60, 183, -272, -22, 89, 55, -43, -264, 36, -119, -15, -49, 90, 1, 295, 165, -136, -104, 27, -71, 304, -102, -193, 78, 209, -77, -263, 76, -82, 115, -69, 92, 117, -23, -13, 153, -228, -118, -147, -255, 247, -98, -162, 53, -67, 85, 105, 7, 321, -87, 87, 248, 49, -219, -235, -66, 141, -28, 193, -42, -35, -4, -249, 80, -122, 226, 47, -38, -133, 74, 31, 141, -171, 81, 92, 79, 22, -112, -96, -174, 89, 97, 40, 62, -136, -288, 33, -8, -33, -215, -34, 146, 19, 143, 193, 2, -55, 64, -7, -278, 307, 33, -152]
3900a52J73L8p7j86K45j80K23J07pj08J44j24k29jMN2L76l19K7J76J15l71Q0J01
3924A07l8n6l18j8M90m3k4k62R4q1K79N4l67K53Qk20K79J03k93Q2J70j77n2J26
3948I6m0m26J33J97m5R9j08j59J93o5J08m05K06L76%j47p5k00M58k50J52r9l8
3971c9l9j1L2J72j33j34K92k11J41l60N7q3K17J31R6J53k95L8p3K8j21J71N4j28
3995d5p7k7O2Q3K90p0j67k67K86q4l3k2J71k31O8K39p0J01m9m12O4K57q1L1J08
4020A25m8jr8J72J25n61K81P6J18n9l31K83K46k84N9j96M1j11J47Ln4j95K62j96
4044a96Q3PP9m1m0K20r1p7P4JM8k98J87P3Q1J7m13K85J42k22j9J3L80l93j14j0
4070b24K94NP5k20L9m9J69n2J05j91J07J4J34K2m41K31k7n6J29k68N1L3P9m3P8
$$ y = [-152, 21, 59, -18, -204, 41, -139, 84, 191, 184, 76, 220, 96, -133, -134, -130, -78, 298, -21, 6, 182, 297, -74, 6, 107, 69, 13, -305, -323, 167, 124, 100, -162, -68, -149, 130, 184, -183, 70, 78, -142, 137, 240, -53, 29, 199, 22, -30, 96, 56, -370, -237, -40, -85, 14, -94, -253, -60, -125, -17, -422, -216, 160, 160, 13, -62, -262, 196, -54, 98, -1, -39, -78, -89, -57, 115, -18, -152, 140, -71, 70, -290, -233, -316, -99, 32, 128, 281, -14, 24, -49, -21, -142, 29, 83, -45, -122, -149, -87, -4, 286, 216, 49, -218, 68, -16, -49, -71, 100, -131, -63, 176, 106, 207, 158, -254, -190, 67, -14, 17, 125, 77, 76, -22, 150, 275, -286, -5, 71, 189, 130, -201, 82, 328, 44, 103, -93, -52, -163, -16, -13, -67, -262, 0, -196, -113, -106, -27, -68, -108, 112, 21, -56, 18, 19, 67, -231, -44, 29, 110, 127, -286, -1, 141, -81, -100, -87, 293, -100, -214, -224, 70, 75, 150, -70, -31, -80, 89, 37, 142, -49, 58, 72, 206, 228, -213, 18, -9, -65, 64, -204, -153, -120, -41, -84, -6]
4095fl4K79k10q6P7p3j6j32K06K23l11J42n6L9j24Q2LJ1L82k96m4J18L5n6m9q6
4121A8q3q8L4K08j31O0K90l26q1L06k26J96j3j6j20j19J63k14L00m03K05j65M6
4144a59k20J59L33m9m77J88j19K70QJ48n5J3k7k22J30qO6l2j59K45K38n32O7L61
4168A67j36J55j62k7k79L60j03k04K47o7L33k87J59o7o5J11n5j27n4K77n8k33
4190a15N7P8j49J17Q4o7j13KJ89n4k3K76m37L2Q5k34K83j2Q6nj28L89n15N7J40
4215B3j53L1J62n2J54J90k37m2k64L00k65J74L75m26J20k20K73k46N4k8M8p2Q5
4238a6K4j98L72l22kl8J71k2L6l32J95K62J42l09n6P8n0N6k72M60q9n1j65K57
4262A31n8k25J12k61L34Q7q4N6j50q2p8K44P8k31L71k48K45k91N9M1j84J17J40
$$ y = [-6, -40, 239, 29, -57, 20, -53, -69, -201, 5, 228, -83, 59, 3, 42, -82, 0, 3, 14, 396, 100, 56, 174, 209, 153, 104, 18, -65, -153, -119, 89, -42, 18, 308, -18, -99, 207, -19, 177, 164, 148, 28, -91, 72, -142, 158, -245, -40, -205, -159, -379, -220, 113, 64, -413, -225, -344, -74, -66, 82, 27, 40, 13, -209, -79, -87, -21, -53, -212, 33, 271, -261, -194, 167, 31, 186, 24, -3, -282, 78, -25, -229, 18, -49, 284, -3, 156, 89, 24, 135, 80, -47, -101, 176, 118, -115, -58, 20, -129, -12, 72, 5, -108, -106, 83, 29, 6, 282, -155, -123, -38, -272, 11, -1, 85, 80, -48, 341, -174, -117, 23, -130, -99, 63, 11, 165, 355, 118, 76, -188, 112, -153, 21, 396, -30, 90, -130, 143, -103, -49, -77, -29, -101, -16, 8, -190, 182, -140, -142, -180, -9, -31, 5, -327, -132, 130, 272, -37, -93, -15, -65, -9, -281, 179, 90, 39, -126, 131, 73, -152, -40, -301, 33, 120, 36, 92, -58, -140, -218, 26, 104, -127, 244, -4, 241, -50, 9, 50, -134, -17, 123]
4285A23q4K21m37K45K2j19J77rm04Q4J48J52q0j63J01j11J68l9p3L2J55n1j69
4308a11j26L40k0j51j13N41l26Q1K0l35J36J52j99j00K53m4j90K61j84K97j89
4329gN3M3k88K68q1j43K45k16R9N4p1K37q3k06N7P1K5k08J91j43J14k06J43r6
4353a48J26J52k32J13J33k05M41j20k77J04j93j0K68k03K0P4m4pj36oJ55j14K82
4376A73l34J29K15k85o5J00p1J85k13O4K34j25N3j74J23J85q4J44l31M25k28q6
4398C4K01k20pM6Q5n2j18P3J37j90j71K23J65k13j97K77p8J66kj7k77M47l69K17
4422A60l85K24J29l07J67ko0p1J74J35l4M9j23k29K70j33j30K89j20jK0K26k18
4445C0J18k51K55j74n9p4O5N3J07k94L72j35K83l28K49n0k23k23lJ56L53j37j5
$$ y = [123, 39, 260, -177, 68, 90, -29, 148, 139, -265, -181, -33, 119, 39, -124, -23, -134, 34, -5, -78, -46, 109, 58, -111, -237, 103, 83, -68, -181, 360, 34, 115, 135, -200, -64, 88, -111, -211, 42, -2, -192, 69, -115, 182, -7, 46, 89, -199, 69, -12, -155, 90, -126, -27, 27, -44, 193, 110, -96, -39, 32, 57, -151, 40, -103, 11, -195, -52, -148, -22, 130, -102, 11, 144, -61, 380, 260, -17, 87, -106, -116, 152, -51, -31, 43, -1, -8, -144, -150, 5, -109, 173, -161, -32, 183, -102, -167, -67, -138, 47, -166, -102, 132, 7, 60, -114, 9, 194, 110, 254, -77, 348, 120, 34, 235, 15, 8, 54, 139, 87, -31, 42, 179, -11, -182, 41, 206, -7, -204, 73, -5, 161, 159, 142, -135, 312, -57, 160, -225, -1, 128, -179, -12, -14, -74, -145, 29, 164, 130, 179, 56, -173, 97, -36, -166, 123, 3, 2, 22, 248, 30, 148, -103, 152, -22, -81, -155, -90, -37, 70, -224, 148, 13, 296, -32, 217, 167, -56, -279, -282, -126, 227, 90, 75]
4468G5j86J51L6k4j88J89j43L12J17j76k83j8p7rQ1J97k87R8K34J56n42J4K30
4491d3J00l3l78M99k8k66N6Jnm1N4J18j45Mk43N85k73K0R3kJ30k42J24j22L3j1
4517a5p1L8P1M0k1J89j79J35p5o1Q6j28j49J35k46L30k80J90p0J4r7M21l03k4
4541g0J20j55L91k97r7J06j6J1K61l67J67j55k8K23j93j34N5L37o06L38K17j3
4563I5o4j93J81O9L7j34J41n7J32j62P2l5j6j03M3k33k4K87J13k83J4J05n6J60
4587H9J39k88K34l31L91j00j41p4L9k5q3K99q9k04L14o6K95l49J91k74J13J78
4609B58p25L62K04m7k16k0K37n7K24l61K6L9R7P7J93k47j17J72q3j72J39j78j21
4632c16M75l69K20K66k59j52P9M3O5P5j24N7j65M7K63J3j34j05K39k73nL59m26
$$ y = [75, -111, 40, 76, 52, -136, 53, -90, 222, 339, 163, -120, -138, -215, -224, -143, 54, -233, -135, 99, 255, -287, -273, -43, 57, 24, -354, 145, 117, -149, -93, -92, -97, -138, -84, 34, -111, -107, -350, 235, -38, -18, 75, 73, 203, -39, 85, -37, -4, -15, -86, -48, 23, 63, 42, 231, 52, 187, 112, 51, 137, 9, -140, -5, -251, 79, -201, -11, -81, -67, -164, 257, -46, -70, 50, -105, 286, -11, -108, -2, -18, -7, 254, -113, 54, -101, -129, 94, -99, -233, -178, 159, -447, -109, 108, 95, 31, -162, 19, 88, 125, -9, 132, 75, 207, 45, 117, 82, 66, -37, 6, -227, -251, 36, 149, -134, -120, -15, -71, 89, 228, -60, 174, -157, 234, 134, -7, -81, -42, -67, -150, 149, 60, -144, 170, 104, 399, 50, 241, -33, 80, 258, -467, -105, 99, 52, -164, -184, 53, -4, 220, -141, -115, -76, 21, 98, 291, 44, -73, 99, 16, -156, -17, -195, -316, 159, -210, 10, 276, 17, -135, -56, -13, 52, 127, 3, 60, -105, -58, 205, 218, 84, -21, 218, -55, -60, 299, -127]
4655a27K07j85J21J76k08O6j67p7L04L1l29J55P0M7k19K26n0mj56K82j75L12L8
4678C38k98R1k78J81k67K11j22M7RK00j05L7J07j68J40k22O0m0J75k22q7J55j42
4701b00M41m28O5r4o3J57Q5J50k82K74q3J33j63Q0J57l48Q9J0K91K1o6l04K7J59
4725A08j67J17M5l56L53m73L83K12n6k11O7p6j20K72k62R7K83k53j9M0Q8m6K48
4748B74j04k88pj95L95Jr2N4j45k4K49j60J66p8l2J10Q5m80K4J64o9j12M44J3
4772A93j16l9k4j21J74r5m3nj18L97j68j67Rj3M93n06p7K47q9J04Q2j63lQ3k09
4797a74N21j92k09J2p4L32j26k38LJ63j76J58P1j38J35M9k60l6J51K8K8p2J06
4820F2k89K96J33j83K89o2O9m20K09k72Q1J84j08J01j84J59J04j10M2j81O1J76
$$ y = [-127, 80, -105, 16, 192, -16, 50, -117, -194, 110, 141, -188, -33, 37, 84, -135, 91, 41, 37, -119, 163, -12, 300, 338, 40, 131, -147, 34, -233, -22, -144, -97, -88, 112, 7, 44, 151, -17, 123, -99, -39, -79, 96, -126, -213, -58, -200, 241, -187, -122, -216, -279, -122, -37, 113, -169, 105, 22, 155, -8, 72, 229, -119, -30, -20, 271, 292, 226, -78, -51, 108, -59, 58, 103, -253, 100, -373, 10, 222, 166, -45, 22, -54, -174, 98, -164, -67, 216, -37, -56, -16, 72, 26, 274, 170, -118, -125, -320, 75, 76, -16, 38, -107, -131, 118, -42, 124, 46, 14, 124, 209, -271, -247, -83, -152, -264, 180, 193, 77, 38, 14, -107, 67, -28, -71, -76, -194, 203, 35, -132, -123, -136, 357, -149, -226, 21, -68, 36, 118, -45, -48, 35, -174, 347, 155, -54, -42, -116, 216, 90, -148, -145, 18, -158, 0, 71, -67, 68, 117, -143, -179, -28, 0, 28, -44, 62, -227, 69, 202, 19, 308, 246, 315, -105, 104, -168, -87, 97, -11, 90, -94, 65, 169, 59, 101, -80, -19, 157]
4842A57l94J21M6Q7j6J08k9j20K5k21P6J71J52l76L77j25M1j88M24j58l29j51
4864c22M19j51O0J67q0n3k23n4K99K34k17k67L08p7n3rO7R0nl17j07J84qR9Q1
4889F5j32K28o6k9J36j84N7j10Q8J41l41J42R4k38L23j57l26M86k85J06N4j10
4911e8K49k57K60k75j04J46j00P4P8J44l07J13K3L73n70M16j48j71K59Om76J85
4933a40J00j1J31J4K06j79k7J5M6k24j35J85j76K41Q3k8l76R9J21q3K18j44nl
4957g2J08J50l70N85o11K60m0k43M02k07p0J30MJ55k83MJ97Jpj51J53k81K18j01
4981f9L43m47M5O5p6K17mk66L5K37l75L00J13p9q7J1J91j68j41K28j44R0k68J93
5005e6J54J52l20J74Qkl35K79j25N7K3K42o4l15n6J95L08l93K01J6j89j27R3P0
$$ y = [157, -237, -116, -70, 17, 1, 109, 80, -40, -15, -236, -160, 11, 163, -213, 164, 39, 80, -108, 316, 158, -171, -322, 97, -54, 6, 173, 93, 40, -183, -237, 62, 296, 79, -188, 120, 43, -10, -19, 48, 138, 133, -184, -291, -107, -115, -16, 65, -67, 161, 95, 66, 202, 18, 75, -35, 53, 194, -147, -5, 89, -149, 174, 17, -309, 177, -108, -2, 52, -58, 191, -66, 194, -81, -185, -39, -139, -65, 13, 157, -150, -37, -14, 359, -211, 205, 57, -114, 145, 151, -325, -140, -40, -51, 80, 94, 300, 121, 94, 109, 155, -69, -204, -19, -195, 46, 129, 101, -275, -176, -55, -138, 80, -64, -69, -72, 36, 186, -184, 401, -210, 50, 10, -233, 169, -38, -108, 22, 26, 181, -102, -98, 99, 100, 93, -58, 95, -186, 32, -69, 274, -173, -128, -63, -139, 78, 74, -192, -157, 80, -295, 5, 118, 39, -48, -37, 154, -14, -155, 73, -71, 19, -249, -56, 98, 250, -70, 104, 112, 110, -225, 54, -71, -14, 9, 251, 187, -128, -184, 11, 319, -74, 127, 143, -46, -173, -80, -10]
5029a0r7J35LJ90k99j53M79l03K19k67J25j67L30j16M9M18m39j30N8p2M3J7lK78
5053B88l50L29l49J02J89l63J58k45q5N48k77M1M1R1J2k35J91L8j46O0Q9J19r4
5076A52j76j3n1m3K54m02O8N6L9L6L7q3J43J46Nl22J00K9l6L23r4j36j60K72k37
5101i3K17l30L72k31q9M1K11k57J22J4l5K79j54m4L8j72K80k04rK00J9l3k06j21
5125a85K16N7J77k42KJ56m62L50J11k16J29p4MN3j10q9O4J43j55K66j28J06l42
5148a69K81O6l70L7l6J57r1M40m00K5P1n17N02j40L3J15j02J93J12k30r7J4K88
5171A82j59k00J46K5j00O01k32j73q9k11J05j70M84l84PJ83n4Q3J48j57mN8k26
5194a37M27j62q7j98J3M7J20lk02K87j19J10o6j72R1J80j00J31j16r9p3K39k06
$$ y = [-10, -107, 28, 31, 221, -78, -231, 248, -55, 164, -103, 22, -145, 185, 69, 118, 536, 97, -33, 25, -47, -4, 13, 10, 288, -62, 267, -82, 20, 209, -154, 4, -241, -326, 222, -55, -14, 27, 118, 130, -105, 86, 124, -22, 38, 127, 246, 152, -24, -37, -88, -131, 123, -279, -211, -155, -116, -80, -43, -126, 17, 163, 168, -154, -54, -25, -61, 262, 168, 32, -128, 144, -93, 124, -206, 166, -65, -154, -113, 98, -159, -37, -23, -58, 221, 67, 23, 61, -111, 169, -35, -44, 156, 175, 142, -64, -185, 31, 88, 265, 23, 25, 181, -281, 69, 180, -36, 93, 19, 23, 76, -34, -123, -59, 84, -71, 195, 67, 173, -169, 112, 178, -192, -155, -191, -34, -125, 315, -85, -60, 11, -506, -4, -144, -111, 4, -98, 95, 207, -23, -120, -106, 182, 23, -177, -31, -6, -106, 495, 263, 90, 1, -210, -105, -275, 209, -175, -168, 15, -39, 44, 192, 35, 31, 89, -137, 290, 128, 41, -157, -144, -97, 23, 20, -182, 105, -14, 96, 30, -142, -51, 129, 29, 160, 44, -55, -128, 111, -95]
5217i5q2K91rp8k2K1j1rj84J48j84J83j39J75R8j60K32K2k33P6r4n7J80q2k53
5242b66K08j0L52l98M7K3j06j96L63K75m0j8p02O08r1n7L31n80L97j47R8k20m9
5265a78J48Q8r8K16k75K57j85J03qk8J5l33L03k2j23Kl6K15j5j86M0M1j56L14
5289I9j94J76j28Rj51L1L33k07n5m3O7j76M24j42J92l77J11q4J19m7m6M5K76l51
5313a19J82m1J43j13L8k96L16n3m22M73m4r4K04j45j82J34O3j99J93r2K4J11k09
5336a28K45jl08L33k44j48J39J11L62o0l60K42j10J9j33j0K22m19N4P0L18j74
5358B0L7j86K67L7n5k77P3J97j6p3J62r1j91N9Q4J66K18m93K73l79M4J26J47r1
5382E8r5j4j90K10K14k09m1J26m7K03m67L27n0n2J8rj33R9J00m5L9k35L58o0P6
$$ y = [-95, -177, 114, 105, 27, 5, 26, 15, 6, -178, -30, -214, -31, -170, 5, 103, -57, 175, 197, -36, 40, -54, -111, 69, -13, -266, -58, -68, 284, -114, -67, -44, -150, -346, 17, 292, 252, 234, -468, 140, 49, -8, 323, -257, 140, -7, 91, -129, -178, -30, 58, -40, 176, -99, 158, -27, 76, 68, 40, 55, -278, 25, 3, -120, -118, -154, 61, 46, -140, -100, -59, -215, 99, -95, 81, -47, -38, -189, -158, 175, -32, -87, -130, -63, -239, 185, 43, 235, -142, -31, -115, 4, -43, -89, -44, 232, -119, 63, 22, 165, 52, 90, -206, 110, 57, -365, 108, 64, -30, 174, 29, -153, -19, 44, -155, 38, -54, -30, 81, -128, 117, 116, -192, 141, -103, -251, -112, -1, 361, 301, -59, 183, 73, 92, -41, -51, 171, -248, -194, -124, 194, 20, 57, -129, 138, 175, 120, -157, -84, 113, 97, 24, 186, 95, -96, -37, 47, 213, 431, -62, 211, -168, -124, 2, 149, 58, -37, -51, -241, -31, 183, -26, -67, 59, 12, 215, -252, 75, 25, -27, -9, -18, -151, -52, 48, 3, 42, -193, 165, 105, 181]
5407A81j55q0j49j23K00qN0L37m07K92l66K73j1l39K00L4J89j55J12k73P8K02
5429H2O2k97K34q9j9n4L3J0l4l7q5K66k32J71p8K42j41j3l9M79o01L1k62N48l73
5454a96l9O09l42J58k46K7j95L78R9l25j6J46o0N0q3l6J20j45K40r8j83M8K39
5477A50m37O14j59n3l2j67P2k2k22K25P5J07pj74J40m6l53K47J9K11m58R9R7J71
5501I7K1l44l5Q0K07Ql1j9K14j99o2j95M18j05j72K43J77l18j26L5K19j00p4j
5525f2M8R5j5ko0j8j82K32j12L89o60M42j71n3K8R4Nj36K82n49M27k4j35Q7%Q4
5551C4J71j04K74l48k07n6J17m2J07k39L51M8k70L13K6p4N7j73m2N0r2K53k00
5574d6J60j71L4Q8m12L37l36J16K68N7kJ48j48j90M2q8J15pK60m59J88j50J83
$$ y = [181, 26, -54, -203, -326, -126, -134, -84, 253, -154, 138, -228, 45, 34, -305, -105, -71, 118, -37, 75, -198, -120, 82, 144, -153, 81, -8, -27, -81, -48, -38, -72, -109, -194, 72, -160, 11, -67, 175, 34, 21, -18, 461, -140, -109, -371, 177, -196, -235, 374, 32, 190, -56, -29, -224, 154, 253, -72, -88, 58, -2, 48, -35, -71, 49, -96, 144, 46, -137, -89, 150, -287, 327, 168, 115, 83, -84, -12, -34, -256, -31, 44, 151, 144, -30, 110, 64, -289, -42, -23, 188, -270, -171, -74, 97, 118, -226, -261, -181, 26, 34, 3, -16, 198, -1, -63, -258, 160, 55, -117, 126, 303, -15, -141, -106, 113, 13, -61, -62, -14, 81, 66, 64, 4, -14, -196, 36, -76, 313, -347, 95, -76, -129, -101, -7, -2, -138, 144, -405, 22, -2, -137, -50, -50, 34, 205, 101, 375, 27, -180, -236, -119, -161, -54, -293, 58, 106, -164, 149, 175, 101, 158, -15, -57, -7, -99, 154, -46, 114, -57, -23, 65, -347, -10, -346, -230, 38, 95, 93, 241, 93, -97, -55, -143, -28, -35, 225, -234, -46, -196, -13]
5597a3J08q8L0j21l59M95k10L77q2l86L67Q5L8l96R3k04M23j21l19K62J56J9j92
5620c8J26k06J03J7j60M8J83K4k73K29l52L66L1o0q6K12n7k40L21r0j73K18q2
5643F1J20k53K37%l77M4P8K99j39o9k05J4J61o2MQ2r6J96k26o6kJ52J95j73R3
5668F8m1j10Q1j12L26k38j22r8L51k09j27Q1M9J66p3k1J55r9K00q1k01j0L7K65
5692B37m13K61k47J46j30J41J6q4J38J96k73J6j60K78j08PJ02j23j11J04L5j92
5714a64K52k15J58q7K45k04K39l90K32J16j73p8m5m1K00j40K9l70O07l2m4O1l9
5737A17m3j0k7p4lJ64j38l5K62K6k38k45pL01k3k75O29n35K7J63j38j71M59l9
5761A47j58J07J26k53K89Pj01Q0j74k5n2O2k19K27j08J74J5l37J79Nn5J48q3j96
$$ y = [-13, 95, 7, 37, -84, -443, 52, -158, 219, 137, -249, 118, 203, 241, -155, -62, -266, 157, 36, -283, -21, 135, 154, -38, 88, -118, -15, 2, -158, -110, 73, 97, -176, 53, -299, 67, 98, 38, -48, 164, 107, -133, 188, 98, -75, 143, 61, 181, -72, 165, 165, -212, -168, -90, 209, 70, 1, -204, -190, -29, -91, -87, -5, -101, 95, -131, -197, -199, -47, 148, -25, 68, 27, -83, -2, -114, 212, -26, -148, -246, 105, -104, -231, -150, -101, 65, -8, -29, 126, 27, 227, 146, -55, -65, -28, 237, -176, 85, -162, -16, -146, -5, 11, -73, 65, 261, -12, 4, -156, 122, 14, 21, 123, 0, -111, -7, 28, -164, 88, -127, 31, -56, 189, -15, 224, -166, 66, 182, 9, -69, -114, -155, 45, -95, -66, -436, 171, 139, 95, 156, 117, 74, 64, 37, -37, -40, 124, -14, -49, 213, 239, 1, -244, -251, 50, 27, -248, 381, -154, -127, 36, -102, -273, 186, 147, -11, 96, 222, -31, 258, 265, 164, 244, 70, 45, -7, 55, -164, 63, -45, 129, 144, -193, -14, -9, -64, 84, 1, -195]
5785a95K21Q7n64L46Q8j43L20L6m31L52k1o1J12j59K13R4l19Q7n9Qn9r1K38q7
5809A3j12K19r7q2l8jP8K0L42n50K14q4L61j37k09P9j51K42j10J3k8J88k09j45
5833a84J67R6nj59K22p4J03m3q3nj33K9r5o8M32l51K03Q1j04k1L3N3o0LN4p3q8
5860g0q7L71l32J29J03j96J87N9l62K11K68l14J56J82n58L41j50q5K06m7K45k56
5882Am4K16j21P4k56J56J01J77l92J80m6N9k2P0P7q7k22P5j67L91m8j96J01R5
5906A72j57J97j81j95K73j38N1l8J98k15k3N7P4KK2k16J57P8l33L12p5O2m09L45
5930B0P1j23k24K35K31j93M9j65L06k98J02m7Q1r1n9L25j60K11l67j18K00l6K37
5953A87j83K0J40p1N4l0L4n2j37j40J22k65K79q6M59l2n60K13k9J77k19R5l8L1
$$ y = [-195, 26, 113, -451, -105, -17, -160, 160, 196, -235, 117, 96, 35, 147, -12, 201, 295, -24, 63, 4, 12, -47, -138, 100, 13, -99, 120, 23, -59, -97, -98, -20, 0, 342, -208, 6, -78, 283, 146, -63, 16, -135, 107, -3, 10, -18, 170, -39, -184, -17, 79, 74, -85, 137, 63, 166, 123, 40, 35, -98, -69, -164, -232, 200, -151, 52, 133, 29, 8, 41, 94, 34, 37, 91, 18, -70, -157, 214, -118, 11, 114, -82, 105, 164, -198, 13, 281, -33, 123, 305, -253, 88, -62, -147, 59, 12, 257, 1, -43, 173, 52, 126, -130, 26, 127, 304, -88, 92, 46, 105, 83, 153, 230, 143, -79, -4, -171, 220, 172, -24, 77, 172, 15, 212, 31, -164, 109, -29, 22, -16, 182, -33, -56, 1, 75, 77, 99, -117, 40, 118, -215, 97, 22, 84, -325, 20, 91, -32, -256, -21, 210, 17, 66, -99, 207, -91, 11, -36, 45, -46, -105, 220, 60, 271, -96, -214, -14, -50, 187, 4, 24, 164, 93, 147, 117, 151, 99, -38, -178, -56, -321, -42, -128, 331, 299, -261, -48, -77, 100, -119, -24, -62, -31]
5977c1J49k99J20J16j93K30R0n8k1k9p7J60k83K03nq2l4J08j41pJ15j67J98j19
6001e7J39q2k40R6L80p5N9k39j01m3MJ70k2J52k32p4j7L90J16l45o7K4j71J59
6025g6J52j38R1J25k22L36l70J17j97k5K89k41K27k10L47k38j78J44J04j69K24
6046I2k27k72L55J04Q5o7R8j90K12k32k18P8N7J85q8Q1j59K04k0L9J05m75J82
6069g1P4O1j91k2J37j68Q9M24n63L42j55K6PK25J6j36m7r0j03j54L69j58J82k42
6093a48R8m1M6K33lk72l6J97p5j64n1J24K21m10L75k53q1L45k92K5K45j48L8j86
6117b13K29R9j91K51k35K86l04J39N1J15k04j72M1K09k9o5oJ20j41or4QK80j74
6141fj22J78J74k83J57Q8j99o6L7J59l54J11M1J35r2k3J2J09j20L36m49K05j60
$$ y = [-31, 118, -181, -61, 55, -138, 92, 182, 124, 103, 74, -3, 157, -126, 77, 72, -10, -44, 64, -77, -84, 31, -136, 62, -57, 82, 0, -240, -144, 236, 161, 220, -19, -120, -163, -159, 11, -11, 141, -91, -165, -182, 208, 324, -21, -88, -64, -235, -76, 76, -62, 29, 154, -68, 268, -102, 15, -182, -207, 82, -159, 68, -142, 205, -33, -211, -67, 37, -132, 92, -135, -407, -52, 52, 137, 70, 168, -22, 190, -42, -260, -182, -125, 60, -28, 53, -106, 98, 78, 117, 222, -253, -71, 3, 64, -127, -149, -12, -180, -91, 333, -230, 112, -43, -17, -10, 215, 231, 95, 48, -42, -145, -299, 70, -88, 94, -148, -50, -91, -45, 188, 185, -87, -123, 74, -1, -165, -216, -92, 129, -281, 94, -159, -240, 105, -187, -162, 83, -65, -27, -213, 16, 115, -76, 175, -60, 226, -78, 61, 112, 227, 23, -149, -108, 101, 72, 7, 1, 121, -20, -26, -120, -112, 168, -6, -128, 50, 224, -59, 98, 186, -13, -79, -42, 117, -237, -126, -85, 50, -42, -65, -53, 56, -64, 272, -177, 28, -132]
6164a32oM05k11j85K55k44N7P9l2J2k9K15K0k90j31R8J68J70o51M98J40j00j83
6187g7K9J1J12l98O12l73L6J13j43n7J40L74m4l06j97J77J6J84j85n5N0J96l60
6210a45J35j39J12j81L12K9j8j14k83nN93j66j14J57R2l55R6K09k92N8k6n0M3
6233e2J0j60L42j41j78K47l4o8K3M7k31J72j26K69m8L26k65j30N2R4j42q0J87
6256A14K6j41J98L1k66l13K23J64j99K62k16N9j2J18q4J87R3m40K45K6qM4k31
6279a20K7J67M0q9n6M0K55j41j01J37Mk97K03J55l72J30R6J54p0m00j0M62m76
6302b62L26M6k29J67Q1N1l70Q8J64J14k40o7K77k16k5J62j45K77l13J39O0Q4k62
6325i3K25j88K27j22k08K86j19j08J02K45j14Kj93O5r1L86k90k69K80l13K59R8
$$ y = [-132, -138, 267, 56, -129, 126, -118, -61, 18, -14, -2, -31, 184, 204, -86, -217, -119, 49, 219, -432, 66, 206, 106, -77, -48, -37, 75, -323, 289, -84, -48, 65, -78, -135, 5, 379, 335, 29, -168, 9, 25, 209, 24, -31, 19, 215, -145, -10, -149, -37, -218, 94, 123, 105, -9, -292, -297, 296, 130, 16, 173, 265, -90, 6, 215, -77, -19, -45, -95, -52, -42, -202, 140, -1, -179, 68, 34, -34, -11, 36, -195, -23, -149, 120, 72, 398, 133, 3, 55, 149, 7, -73, 114, 140, -1, 197, 228, -38, -351, -128, 36, -163, 99, -117, -58, -70, 48, -36, 151, 244, -196, 49, 75, 67, 111, -120, -93, 74, 114, 25, -31, 9, 264, 123, 22, 159, 163, -134, 69, 224, -148, -18, 78, 232, 162, -238, -248, 214, -262, 64, 110, -119, 48, 129, 180, -190, -102, 62, 176, -64, -131, 146, -70, -95, 67, -78, 199, -114, 25, 85, 169, -93, 132, -56, 171, 49, -159, 127, 8, -100, 2, 247, 133, 135, -58, 7, -84, 302, 12, -257, 23, -290, -31, 67]
6347F7r5l4K3k1K68l59K63K44m39J06l4J6N5p8K7J44q9j89J05N9r7J0J50j02p8
6372g8P0j8O4m8J93l25q2L90j05j49j49M62j21j91k2j46J55O3J68lk30J55K85
6395C38l43P3j48p1R4MK19q3o6oJ81j42j12J39j0J19j90L6J4J95J1j64j52L92
6419C28m69m4K86j40J06k79J79j29J56k1N8k12J27K82m6Mj46K3j50J05K4j56K86
6442A72j28j39J17l57K45L25j41l36M94j65k83m2M57k46j72L50l02K68j32o7r0
6463a72J03p8R5K0rj06L90m83L27K39o18L94l72L67K02l77L8L1J03p8n9Q2J18
6486A57P9n06K64j06J9K39j42m3j2K33j33j27Q8j52J82j23K59o9l41L72j54J4
6508bk0k28J20J49P0m0k25J09R9o9R8q2J35m01J31L05l10L55j47j86K24l19L52
$$ y = [67, -28, -62, -39, -60, 208, -151, 112, 356, -83, 23, -11, 5, 60, -18, 9, 153, 64, -125, -20, 39, -58, -48, 102, 0, -78, -8, -26, 38, -10, 183, -142, -224, 166, 61, -88, -237, 225, 104, -87, -109, -255, -100, -37, 131, 128, -102, 53, 338, -5, 68, -80, -151, -57, -53, 166, 83, 17, 11, 192, 50, -62, 77, 67, 186, -4, 32, 46, 241, 252, 88, -64, 328, -141, -185, 101, -39, 67, -212, -33, -162, -6, -27, 31, -181, -54, 228, 182, 186, 40, 63, -87, 18, 42, -114, 172, 44, -95, 22, -335, -90, 235, 94, -242, 252, 87, -196, -238, 219, -27, -199, 151, -151, 117, -15, -82, -172, -69, -147, -52, -32, -41, -147, 243, -240, 87, 326, -292, 102, -270, 97, 299, -78, -40, -9, 94, 16, -43, 39, 157, 236, -270, -6, -112, -93, 146, 4, -39, -51, 182, 49, -78, 10, -142, 40, -83, 176, 107, -234, 138, -16, -2, -22, -250, -130, 19, 89, 49, -176, -67, 32, -37, 61, -21, 114, -287, -156, 149, -161, 194, 47, -139, 85, -234, 118]
6531A18j37M06o18K82o4L08l59J11k79L03r2R1l1K1O9l76N2J96m1n6K7L11m08
6554a66J05K46k98L12j88R5l30L26m6R6j92J41O3k88K64J41l62J54%J04l11J58
6576B4L11m29L9J40Q6q0J75l89K08k03K42O9k59K3N1p9L68j47q7N4m6k62J81J1
6600Ao9Q6mn4J54k57O9j42LL59r2k7l0k9J42p8K09k36n7K9N2K01k33N3kK30l77
6627i9K91j05r6p4l9K01Q5l0J77l68j43K80j07J85k9j18ON8k3o4Po3M2K0r3J25
6653B6q0K47k51N4J20mr6J68j49j05J29P3k99j54K98L47k13q4R8r2j9o5J66l5
6677H0j17m9l7j0K53k74J92J41j23q4K5qJ22J6j07L0j08J52o7K1m22K09J74k67
6701b58M6R2L45l47L93m81J74n7P0Q1M6k36OK66j04KJ25l5k30J79M3o5K16l27
$$ y = [118, -19, 387, -231, 51, -13, 295, -64, 47, -232, 71, -21, 70, 39, 60, 129, -247, -195, 1, -40, -96, -69, 242, -166, -61, 185, -113, 199, 11, 106, -224, 102, 56, 152, -40, 101, 164, -124, 140, 281, -81, 73, 73, 177, -134, 24, 335, -94, -55, 85, 171, 91, 266, -123, 85, -118, 124, 193, -66, -43, 8, -71, 297, 150, 63, 117, 71, -191, -10, 1, -68, 18, 14, -40, 114, -143, -74, -216, -213, 146, 54, 27, -3, -32, 110, 32, 241, 5, -52, -23, 29, 230, -3, 50, 48, 278, -99, 192, 87, -9, -83, -122, 79, 164, 134, 311, -57, -200, 80, -27, 158, 129, 11, 17, 75, 52, -12, -5, -68, -26, -6, -99, 26, -54, 193, -58, -4, 116, 112, 16, 184, 35, -70, 59, 132, -167, -321, -23, 324, 111, 27, 125, 33, 14, -51, 115, 80, -37, -86, -123, -133, 120, -154, 38, 179, 56, -28, -3, -11, 111, 127, 20, 50, -58, 94, 27, 48, -374, -165, 9, -258, -212, -120, 225, -122, 271, -210, -36, -93, -23, 58, 104, -132, -126, 140, 36, 38, 163, 128, -102, 77, 120, 55, 271, -56]
6725e6K7m4K4L6j08K11j67P9r8j51K53q8j1P7O8p5j81J59N8L8J6j13n1J43O2m8
6751F0O8Pl65L21j8r0J60j4n4o2j34n3K41L1p8j46P1J14p1J85m36J83J04r0J73
6776A07k9J93k88O0l5J69l82J86Q6Pj92K99k34j79J6J31q1P0j5N3P7o5K3J00q6
6801iN9K21k11l8k8RJ7M9j97q6K45K53j03j19m29L62j6Q8j80M36j87l52K26K92
6825C02l10J01k43L27k07Oo4j27J03J62J16k84P8j89J54j40L34l2j54J22k1J59
6847A93l79mP1N3J34j05r8M4J97l83L73l14K80k5k99K59J86p2n4k87J32J55M0
6870I7J4k64J58q2KJ20R1k34K52r3k28J93j14J42K38n51K32k39K74j76K36j20
6892e2p0n9J15J64ML4L8k13K6q9k2M4n3J61j58M73k14l40L02l49K32q1M2J10M6
$$ y = [-56, -29, -73, -49, -13, -121, 90, -77, 2, -96, -247, 6, -82, -93, -16, 52, -23, -204, -45, 13, 51, 67, -46, -97, 46, 108, 60, 128, 135, -230, 91, 73, -17, 143, 129, 75, 13, -121, -174, 67, 98, 20, -126, -55, 59, -12, 173, -263, -80, 24, -66, 107, 78, 271, -17, 43, 8, 177, -205, -19, 67, 74, -118, 181, -53, -232, -216, -85, -166, -96, -111, -58, 19, -46, -23, 77, -9, 50, 271, 60, 22, -6, 3, 20, 69, -128, -214, 31, 284, 181, 62, -367, -5, -21, 67, -113, 323, 136, -216, 10, 302, -8, 93, -150, 177, -30, -24, -88, -215, -112, 50, 166, -118, -40, -229, -75, -215, 119, 87, -67, 55, 34, 193, -186, -190, -119, -66, 68, -37, -135, -91, 106, -277, 96, -218, 62, 37, -262, -3, 183, 111, 57, -230, -98, 57, 97, 111, -153, 5, -77, -75, 45, 136, -98, 154, 61, -167, 26, -88, 54, 292, -259, -27, -266, 8, -168, 68, -52, -122, -181, -66, 98, 102, 136, 174, -39, -13, -102, -124, -80, -133, 28, -130, 343, 129, -211, 91, -258, -26, -107, -65, 45, 91]
6917I1k08N7Q1j39L2p1l03L90M0J38P0m9k29q2m8J31O5L9j29J36k18k1J07J89
6941F9j58K93j52J19j86J53l84J50J72j18K4j30Q4L94m82Q3k15J42Q8K06k17J48
6963H3Q7l68J37K4l7l7%L99k83J88j85l6J88j00M9m08M15j68J95m21N10k22o0
6986e0n9J38L8J00k89q0K99l7J0l49M88k26J70j63Q9J45l86m7L11j20J45j84j31
7009a88J44mK76k43J06j59p1l5J45J60k41L9k0J03p9j84L29j68J01J06pj02P0
7032G8K24j83j56k98K74J75o2L46l99J47l3k59M0M4j25K44J84l57M1L21k93P9
7054C2k09K12O8j20j1n0m4J37K90k68J05j80L1j7J28k16k6K78m1j02J63j96m8
7077h4Q0L3O2j84pJ39O5j74n0R8J56j02j50R0k61M73Lq2j37J02J48j31j28L4k26
$$ y = [91, -117, -60, 21, -118, -86, -157, -460, -70, -30, 108, 178, 129, -100, -182, -230, -99, -34, 5, -124, 12, -206, -227, -120, 69, -89, 204, 52, 171, -15, 138, -246, -96, 76, -42, -18, -148, -64, 330, -152, -69, -284, -142, -54, 152, -65, 83, 170, -198, -61, -37, -74, -111, -111, 288, 5, 193, 8, -28, 160, 60, 109, -299, 116, -52, 143, -278, 232, 10, -50, -109, 29, 67, 167, -122, -202, 97, 60, 70, -279, 209, -17, 153, -10, 79, 224, -162, -209, 102, -18, 127, -57, -188, -44, -48, 228, -15, 91, -68, -139, -174, -29, 131, -110, -71, -91, 12, -67, -251, 78, -90, 11, 117, 110, 8, 78, 302, 119, -37, -335, -61, 114, 52, 398, -1, 146, 113, -146, -106, -62, -187, 57, 241, -116, -75, 246, -47, 32, -177, 35, 103, -17, -28, -78, -122, 15, 305, 37, 142, -38, -7, -24, 104, -112, -138, 140, 99, -3, 160, -36, -84, -4, 29, 91, -93, -100, 39, 104, -70, -120, -22, 134, 32, -118, -28, -289, 184, 187, 105, -32, 70, 218, 87, -41, -7, -233]
7102b33K59k84K71k57K81J60m89M01J80k86j07k0lN2k08M25j83k47J09p3M01N2
7124B01k74p5R5K65k13m4P7K02l17l8N6P9j91L4J25n3K38m5o3j46J98j51K20k30
7148e0J19K32l34O4j17O2k38K63J23o4j56J60l0k3O8k26L85j74o8M7j0K7J31j85
7172FO7J21O8k98j7K9l01p0K17J71J29j00J56j48J58j45K29k81k87K87j41j25
7194b75L33m5R4j13M4m7R0L3n4j13l1K03k3p7Qk05K44Q1k15O6J45l84J40m6P1
7219g6Q8n9k0M6J0K09j80Q6Qk78J56J87j58q9OJ80n6j44L28j97k17k2K84q9K7
7244C0o5j80oL4K70q1l60K05J65j27rK22J64j72j99j13M33k84O0K42o6Ll13K16
7268F9K01l65M6m6M61l81J73k48R8j04J03j4M2R3k58q2L08J73l02J71j72M9j76
$$ y = [-233, 26, -258, 13, -244, 37, 197, -292, 109, 289, 3, -104, -124, -127, -75, -283, 142, -41, -288, -179, -252, 149, 201, -73, -148, -53, 212, -1, -45, 32, 234, -83, -121, -65, 14, -177, -143, -18, -71, 167, 122, 59, -87, 111, -40, 180, -50, 69, 301, -33, 31, -86, -24, -262, 1, 124, 60, -96, 64, 34, 11, 79, -147, 238, 64, -4, 43, 33, 60, 191, 6, 73, 194, 262, -36, -53, -24, -325, -395, -178, -7, 122, 22, 178, 30, 188, 43, 272, -9, -296, -9, -150, -275, 58, 13, 107, -6, 38, -9, 81, 114, 60, -53, -84, 119, 96, 19, 27, -178, 66, 147, -68, -2, 143, -241, -101, -147, -76, 12, -47, -67, -21, -11, 198, 18, 104, 112, -166, -10, 177, 19, -70, -64, 116, 60, -84, 244, 47, -170, -192, 92, 3, 30, -35, -215, -221, -187, 83, 2, -358, -153, 12, -115, -124, 98, 262, 90, -109, -222, 211, -73, -13, 229, 163, 166, -147, 69, 270, -95, -49, -95, 366, -15, 158, -90, 8, -96, 7, -7, 35, 128, -130, -212, 96, 269, -33, 138, -34, 15, -161]
7291a61L34L8l78K64j16P6j77j19J27K95J55m36R8K59l94J27j28J11K00r1o5J46
7313A65k0o7j11j8L3J09o4p2p4L41j68k4k18L51l88M61k53J29j78K09j54K6P7
7336I2j29l0N6j67M46p3j56J17j37r7L62l54O7p8q2N24n95J49M8p8o5K83p1Oj38
7361a00K02k97R8L9NN3Jj04K36k42K29Ql25J56o0K95m20J76J25k71J95M4P6r2
7385B7k3p5j33K82n2k27P1K01j44J17k9Qk0J74o5O7k70J02j29l7M85l00M8nJ09
7410A82j14k26L06m21M06O6l89J78j46J78R7j74N1J36q9L2k72k3J29L2L37m23
7432a47O7O2L31l52j90K61j26J14j34K18O0j71j47J24M4J36j52J3P4k28K20j6
7454F1j30l2K91l83J97N0j52L24k86m4j57K48o6k4K32r0l4r1J08J0L9J60q7j69
$$ y = [-161, 173, 211, -167, 97, -19, 57, -120, -239, -112, 183, 338, -98, 0, 259, -135, -8, -136, -25, 175, 84, 19, 165, 145, 78, -33, -51, -18, 91, 27, -45, -119, 222, 54, 30, -188, 163, -225, 236, -17, 112, -66, 143, -11, 15, 92, -37, -67, -11, -178, 268, 195, 39, 156, 19, -78, 284, -70, -3, -81, -163, 361, -234, -85, -37, -115, -180, 103, 32, 38, -100, 102, -195, -97, -58, -53, 0, 1, -103, 133, -109, 120, 128, -197, -41, -101, 194, -226, -50, 75, -196, -1, 43, 119, 27, 4, -71, -204, 78, 26, -201, -130, 71, -73, 44, 15, 23, 3, 177, 112, 179, -91, 11, -118, -155, 330, 30, 78, 73, 182, 68, -158, 148, -273, 133, 199, -190, -12, -158, 20, 117, -57, -6, 130, 41, 73, -199, -222, -93, -61, 276, -147, -80, -18, 313, -39, -229, 32, -94, 20, -114, 104, 164, -7, -154, -30, 14, 150, -2, 11, 85, -143, 77, 61, -69, -101, 190, -193, 4, 54, -98, 226, -60, -104, -261, -13, -79, -103, 129, 39, 5, -86, 22, 32, 71, 231, 144, -25]
7478b5Pr1P5L10j94j78MJ20N3j28J63j58L03k39l02L46n3j96Q3J36j69J48j02
7501h7K09J6j80K33k68Q6K04J8m3l63J38J52j95J52j35j0R5o3q5J82M9j25l4j04
7525a58L08Q2m18j2P5J80M4M0k06j60L56k57K55k7j13O1R%j12J37K14j49k07K86
7549B28j55j8j08K7J76k99P3K1J63m6j02j8N8L7k34N17l98J34J67j63rm8J64N2
7573B19l56J49qk3k34R3K99qL0k08M53m66L78m13J08N7%O5k4k19K60j28Kn4L8
7598A0k62L12J46l3J00l16j83L15J72l44K39j94N0j69J65J13Q7k12R9j08k45K13
7620d5J88k90L86k12qj12o7K67J08l48L29l1k8j17J83p9j54r4Q5K26k87M66m70
7643a04J82l4o9Nr2j37L27j35k8L7J18j08J84j46j78Q2r5j03K33K55l03k10M14
$$ y = [-25, -18, -109, -34, 276, 82, -96, -92, 28, 81, -47, 116, -42, 261, 22, -280, 66, 13, -183, -100, 36, -133, 15, -87, 122, 138, -42, 191, -77, 9, 213, 231, 188, -175, -37, 115, -80, 72, -63, -73, 22, -41, -126, 56, 105, -20, -54, -158, 150, 232, -186, -198, -123, 57, 101, 141, -65, -225, 131, -126, 129, 102, -11, 50, 59, 59, -53, 84, 298, 149, -58, 228, 73, 55, -53, -26, 150, -149, -76, -55, 108, 62, -40, -58, 0, 37, -197, 320, -78, 56, 223, 60, 51, 3, 167, 219, -137, 12, 4, -19, -253, -160, 139, 131, 161, -47, 406, -60, 318, -95, 13, 70, 70, 135, 111, -108, 152, 24, 26, -28, 10, -252, 60, 206, 173, 273, -43, -226, 89, 261, -83, 156, -38, 12, -157, 8, 121, 208, -4, 95, -13, -258, -45, 143, -147, 239, 27, 19, -93, -160, 107, 215, -133, 196, 165, 137, 20, 203, 124, -30, -124, -39, 187, -100, 366, -104, 78, 44, -25, -20, -112, -249, 78, -57, -85, -48, 70, -38, 146, 0, -178, -96, -191, -294, -61, 194, -109, -319, 95]
7666I5K14l53K32n57K74m0K5j0Q3J36l37R8K56j24k5M6o7L7k56M18k27K21n8j73
7690i2L51k05R7N3j81jo8JlQ6J69l64k19K23l1k47M45l1k48J77j6K12P0n48M24
7715E4p7nJ48j00K35n54N11k07L56m36M13l58l65M27j14j54K80j70J49N7P2r4
7737F8O0l27J22L20j00J85m86K62k9j39j87K41r0J10L07l88J09J7k64K1M3J92
7759D7J4l63J51K83j1M0p3k32J45k55K77M7k99K28J76l11k3J04j33J73p9j39K40
7782Gp1K8O6j34L52m91K74j16j41L61l7k36N0J27O8k25J52J4k18J87J30jk31k
7806h7J61o1k34J21K69j04j79j19J93k91PQ6L98q9j51q8R5j78M49k51K9Q6j38
7829g6M6l20L10n2J41J48r5o0o4P6O3j81J33j20J4N4j41J68Jo2R3k55L40j47J53
$$ y = [95, 309, -44, 188, -369, -95, -135, -110, -120, -37, 99, -238, -140, 116, -8, -33, 13, -54, -17, -273, 145, -82, 139, 81, -92, 259, 54, 151, 204, 23, 22, -46, -45, -48, 38, 207, -157, -376, -153, -184, -431, 14, -17, -265, -88, -104, 108, 178, -370, 54, -23, -28, 120, 20, 255, -299, 212, 5, 361, -75, 338, -20, -385, 42, -72, -226, 54, -116, 33, 90, 162, 68, 128, -199, -77, 243, 143, 328, -158, 104, 75, -64, -251, -10, -100, 10, 317, -71, 38, 55, -209, -188, -145, 47, 61, -302, -151, 132, 121, 161, 88, -144, 1, -254, 23, 70, -229, -1, 175, -136, -159, -55, -188, -15, -94, -233, 7, -64, -36, 30, -104, 248, -243, 31, -85, -226, 135, 98, -138, -88, 39, 107, -118, 34, 48, -170, 17, 147, 146, -85, -87, 74, 13, -221, -100, 169, 65, -114, -233, -40, -331, -324, -238, 160, 71, -80, -168, -73, -251, 198, -53, -24, 62, -76, -30, -350, -40, -92, 49, 197, 102, 42, -22, 54, 117, -64, 69, -51, -37, 17, -124, 44, 45, -17, 76, -179, 161, 14, 167]
7854A67j73K52l87L23r6K77k79o1J35k65j8o0nK31l5Q8k99J77j9K1J09k06K07
7877H4Jj9Q5q4j36j36j8K34j9q1J60j28o2R6k03L22k29J73r8N1oq8j4MK49k58
7903a20J98m0R5rO2l7k09J08j20N6J43l00J48k9R1n3k31K88j79P1J95K4l17J65
7927@J76j59m6J63M6k56Nm4K16j6r9K62O3O7m19O1R8j26j49M24l53j1j03l0K74
7952D4j13j30J83L05n89J18J57P2L4k59j7K49M0j05j36L2J79j63K25L1m4j33n9
7975g9k2r9K70mj20k36L10L27l00J5l24K26J37N8o1j33J06k62L79l42L33j46N9
7998I2j19L2j29n0J43j90K66j91J95j60J83k62J57N2pJ36J07k29k6j39L61k04
8020A8r1j04M34j95P9k12m0J29k38o9L35q4r0L8K81k33K53l91K02J25j54J3R2
$$ y = [167, -6, 246, -141, 182, 86, 363, 84, 23, 158, -107, -125, -185, -190, 41, 6, 94, -205, -28, -47, -26, 83, -123, 84, 85, 66, 151, 67, -69, -205, -223, 11, -8, -89, 71, -57, -119, -23, -226, 96, -133, 40, -58, -7, -13, -101, -115, -111, 138, -120, 78, 38, 133, 124, 186, 149, -60, 48, -72, -16, 127, -173, -25, -54, 37, -16, -247, 41, -138, -67, 128, 152, -165, 0, 176, 17, -29, 134, 180, -76, -71, -115, 101, 85, -14, 248, 311, 378, -41, 20, 118, -8, -157, 267, -86, -97, -200, -230, 44, -69, -199, -16, 289, -300, -182, -25, 47, 81, -178, -195, 54, 94, -11, -147, -115, 64, -99, 126, 157, 113, -20, -79, -101, -200, 70, 66, -54, -290, 20, 347, 47, 62, -262, -36, 101, 159, 98, -35, 71, -191, 188, -154, 179, 33, 92, -27, 5, -124, -174, -31, -221, 45, -146, 49, -111, 72, -190, -33, 19, 12, 148, 255, 26, 0, -139, 222, 18, -73, -177, 257, 62, 141, -71, -111, 18, -220, -289, 46, -38, -128, -90, 191, -42, 211, -180, 22, 147, -7, 6, 98]
8043I8j38J52L4k86J5J49pL9q1k58J24K33l39K17r4J33J53l01J6J53L15j55j68
8066DJ17k58q7k4M69k15K06r6k53J19j1r2L5J83j4k49J50j64J76J10k40N9J81
8089A06l42k2J91K79k31k22L59j71J1j8R8m5lj81L56q9k35oJ18j5L26o7k85J48
8113F0r0n6j10K39J81k98J44j12M9J3o7K60k61r1J13J48l1k04K0J99K04l97l8
8136a25R1J77k01K99m20o3R4J22j07J64j0r1J03j79m1M07l02k53M04L8p6km5L7
8160B1k4nJ58l54NL31p3m5J79lj99K57k12q3J40J31k61M7J56l12K31J62p1j42
8184C4P2L8r2k04J90R5k13
$$ y = [98, -40, 112, 146, -140, -125, 24, 17, 56, -25, -283, -159, 74, -265, -48, -142, -9, 144, -157, -141, 12, 327, 172, 4, 121, -137, -224, -248, 221, 6, 212, 116, -137, -18, -29, -121, -86, 97, 83, -166, -16, -180, -4, 106, -134, -75, 106, -236, -258, -67, 212, -19, -241, 118, -53, -42, -60, 38, -7, -10, -191, 165, 76, -159, -165, -47, -62, 264, 197, -88, 60, -30, -86, -196, 43, 224, -74, 70, -42, 7, 20, -47, 213, -48, -139, -26, 122, 91, -113, -93, 106, 310, -87, -125, -34, 143, -58, 241, -179, -242, -148, -26, -133, 31, 21, -70, 33, -146, -187, 220, -82, -335, 69, 107, 31, 29, -16, 21, -3, -8, 150, -204, -199, 132, 59, 14, 193, 190, -9, 248, 36, -47, 93, 224, -37, 10, 166, -146, 85, 247, 176, 34, 106, 144, 52, -152, 38, 133, -80]
8191h0
$$ Imaginary data points
##PAGE= N=2
##DATA TABLE= (X++(I..I)), XYDATA
0@%%%%%%%%%%%%%%%%Qj6J6j6J6j7K5l2L2m0M8n6O4p2Q3r1J04j20J36j52J70j91
38a01K15k39K65k95L27l63M01m41M86n37N93o53P20p94Q75r67J069j183J313j462
58g71J638j846K095k400K788l297L993n011O644r671J7085o8636p9787J73361
72C6185K6083j42615j0202J22027n338p7249O738N4772L276k0843j4036J1993
84i209L2793N265m4206n102N6582Q123o3078j523N9876r021n3181J6359L1017
97B4695k5216j3843J8908j0812j1053J9388o612k4108K1651J7577l0207n103L2552
110G817l093k1816J4175J2748j3167N201J5106j5828p275K7687J62l3755J1227
123h11L3663k7478k9674L9502J3465n2890J164N1370k2695m6259L5646K9311m4066
$$ y = [0, 0, 0, 0, 0, 0, 0, 0, 0, 0, 0, 0, 0, 0, 0, 0, 0, 8, -8, 8, -8, 8, -9, 16, -16, 16, -24, 24, -32, 32, -40, 43, -48, 56, -64, 72, -80, 90, -101, 114, -125, 140, -155, 172, -191, 210, -231, 255, -282, 311, -342, 378, -416, 459, -508, 561, -622, 691, -771, 867, -979, 1116, -1284, 1504, -1793, 2200, -2811, 3833, -5838, 11247, -57389, -137176, 36185, 62268, -80347, -90549, 31478, 26140, -51109, -44371, 10401, 13677, -7166, -21202, -9209, 23584, 28849, -15357, -20459, 36123, 44246, -18832, -20355, 39521, 30500, -22681, -6322, 24695, -521, -14364, 4544, -6268, -17321, 2067, -4545, -28653, -7002, 10575, -19632, -24735, 7817, 4724, -17092, -2917, 9831, -3336, 1865, 16971, 1143, -6132, 21555, 21717, -12038, -811, 32852, 5374, -24300, 15202, 28667, -24223, -23059, 28311, 5616, -40643, -4997, 24314, -19752]
136a9752j0929M2729m201l2744J5635K2831j5966o518J5437k889n476J4353k84
149A2226k0002R938K3781j7012k3829K1550J8280k5545j3614J9948M798j4507
161c988m373N95N045J0325j4240k0191K4770K5257l4547k3734M3225K1644m2776
174a2988j4904M2458J2727l4332q633K7343J0253j8243j2575R499J7167l376k4998
187a0602m168L1497M165m1138l680M4714m083m6695J0583M1598j8039l3132K2425
200f555K3005k0916j1513J8589N534j1682J340O890j001j097J846j698K83K646
214E671l206k281N564j599r857M617R687j1865j0352J6146N297k0086j408K1126
228G454m835j8411R545J4593r893q670J0162N813n526j815K541K551K150l029
$$ y = [-19752, -30681, 12048, 7847, -24897, -9262, 13569, -2397, -8915, 6522, 3633, -1843, 12510, 12226, -7776, 2162, 25943, 8931, -14898, 6652, 24932, -613, -14227, 5721, 10519, -3988, -8361, -7766, -2721, 7604, -6636, -26827, -2057, 23200, -11347, -35081, 8144, 29788, -12988, -27892, 14566, 27293, -7039, -15672, 11671, 21924, 3681, -8894, 605, 17772, 14396, -10602, -14770, 16727, 20892, -20246, -23926, 20788, 16705, -29990, -19407, 22191, 4152, -28980, -6555, 16450, -4466, -15979, 2610, 8144, -3538, -2198, 4692, 3691, 2594, 4440, 2742, 3025, 5671, 2465, 184, 5748, 4149, -5708, -1091, 8596, -3269, -13621, 2525, 7822, -12264, -13672, 7454, 2619, -15792, -6247, 8346, -1547, -10217, -55, 5758, 232, -1583, 958, 3509, 5659, 2630]
242B630m801N274O611q913p406J1425N446j5893l503J6284j241j7755M019J4795
256F972p384j1762Q462Q030p809l316N939J875j243j68j723K243O540l254q031
271d629O663Q960q896q520J0391O567j1772n099J0595K055r787j474O388k87l857
286b702j144P26K676J338m775j993P773K147r043N10J1301j883j0490M774J0100
301I315o308p229O789N076o524l269N122J154m424q51J701N05j155k322j87K906
317B99L90n399N99O722j553p595M503P263n426o031P948N137q133k606Q280J810
333F208p525q00O173K51n408n24L663J148l863k820K718L971m014n537M637O072
349D350o428n874P858N100q191l642Q856L352p867k240Q103J536o217j327N654
$$ y = [2630, -2171, 3103, 9714, 801, -6605, 4820, 10266, -5627, -9130, 7154, 5913, -11842, -7823, 6972, -412, -12174, -3712, 4318, -3491, -6807, -868, 1007, -236, -404, -2127, 116, 6656, 3402, -4629, 2034, 10994, 2098, -6422, 3969, 10536, -1236, -6335, 4260, 6315, -3472, -4946, 1442, 1155, -2702, -3846, -3120, -444, 894, -3881, -5874, 1899, 4046, -4997, -4487, 6814, 4931, -5559, -785, 9315, 3007, -4222, 2567, 7643, 1119, -2150, 2972, 4126, -298, -1149, 552, 1057, -98, -2420, -2607, 299, 689, -4710, -4111, 2611, 1058, -6537, -2034, 5229, -197, -6228, 1720, 6857, -1276, -3882, 4398, 6208, -1317, -2117, 4056, 4307, -1101, -1625, 2038, 3186, -677, -3497, -779, 3192, -822, -6359, -1722, 4350, -2078, -7952, -94, 5006, -3185, -6827, 2029, 5381, -2486, -4726, 3377, 4913, -1304, -2631, 3023]
364C023J297m318k195L292K806l198m634L531M261m173n272M579M655n382m662
379f390N917L866n944k963O044K384n252j201M771J391k617j817K505K413j880
394A227k774J312M213k238m405K100M314k909m265K762L627l285l300K863K460
409A702l161j720K642J407k081o47J539J226q14p63N56J783l61j943J473K287
425C125j734k604K564J640k899j519K555J407l139j788K941J373l031j895L046
440D2J716k471j823J880K557j369k751J179L560o3m444Q53M830r89m639J181M073
457C322j147l216N44K388rk679m54K184j55j698l53R51J5k4J92o87q2J200J57
476D49j079P1P04R01n49j745R93K740j215l330J612L520j747k849P30K242Q58
$$ y = [3023, 4320, 2, -2193, 1099, 3905, 707, -3927, -396, 3865, -308, -5580, -1001, 3654, -1728, -6390, -473, 3393, -2551, -5514, 530, 2914, -2338, -3539, 1232, 2623, 6, -1811, 694, 3107, 1227, -1547, -235, 3978, 1740, -2665, -565, 3749, 840, -3425, -663, 2964, -321, -3621, -758, 1702, -1459, -3179, -537, 870, -1211, -1858, -319, 907, 93, -670, -114, 1669, 1308, -635, 838, 3125, 1391, -1213, 1351, 2991, 92, -1427, 1128, 2535, -604, -2392, 549, 1922, -1109, -3004, 42, 1758, -713, -2536, -656, 1901, 532, -2219, -1040, 2520, 2457, -1987, -1134, 3696, 2707, -1932, -751, 3322, 2175, -1041, -497, 1891, 1882, -797, -1251, 933, 778, -920, -1273, -322, -307, -331, -139, -826, -908, 292, 449, -630, -559, 145, 1046, 497, -1248, -255, 2485, 1270, -2060, -448, 3072, 1325, -1524, -794, 1448, 2306]
493B306l045k134L283K444m371k852M287L082m125l371L804L988l640m337L785
508h96M664l496m127L853L438m075j083K741L74j512k48N28L83k03q15J62P23
525D11o77l97P29p38l53P40O5m93K15o64M19J715j125k220K434K270k563k124
543b356K772K291k405k645J747M286k090n442K766N709l149n643L197M388k479
558I47l447R61K523N15k231j621K145K136j261k389N25K797J149m168j768N633
574B446K182p015j005P017K08n800k52M050N57k375j833J550K191q32k429M59
590h81J806P4j076j745Q06L182j044m101J579M433j386m273J316L920p26l570
606a686N1L749N6l229p39L620J64l365N98J999r94l94j79n37O39J209j490q93
$$ y = [2306, -739, -2873, 410, 2854, -1517, -4369, -82, 3000, -1125, -4496, -692, 3296, -344, -4681, -896, 3768, 272, -3855, -2, 3436, -639, -1722, 1019, 1393, -119, -367, 161, 544, 341, -474, -312, 411, -266, -663, 66, -672, -1025, -285, -220, -713, -498, -1162, -743, 972, -153, -2373, 61, 2331, -232, -2356, 416, 2707, 302, -2343, -596, 3690, 1600, -3842, -1076, 4633, 1484, -4159, -962, 3426, 947, -2500, -1539, 984, 1499, -732, -2353, -208, 1928, 667, -1722, -1197, 1600, 2749, -1419, -3187, 2446, 4628, -2387, -3392, 3625, 3833, -1967, -2219, 1831, 2388, 13, -1820, -270, 1921, 1089, -1340, -881, 925, 999, -77, -1822, -1016, 2166, 1122, -2979, -1400, 3033, 1647, -2626, -1310, 2610, 1884, -1686, -1635, 2114, 2170, -1059, -1798, 1822, 1986, -1379, -781, 1218, 224, -170, -349, -886, -247, 962, -528, -1421]
624a421K008M64j674o63J428N43j085n80J927k17k451J170L121k440l058M039
640A111J499m248k92L802n03l226N92K657j30k577n59K454R78k616j381K530J010
657A101j478n86m3J763M27k092j244K860J234k711j169K479J491k161k107J551
673f85L067j577l261J147L727j374l338J673K134j090j492k34J598O29j040j282
689a398J280J520j021j908M34K533M2k666n15K970O05l249n0K946m31k124N83
706d49J668q27n81K09o3M35k0j203N94R00m45l04p9O92K16m70p39M43Q64m91m88
727a38N72J48m23j10J16m7L36r58K66R47n95r43J005P97j184k55J056l20p98L04
747b24N76j28m21j94K82O89j77r87K17J019n10l92QN80L59j156o4J237l42j201
$$ y = [-1421, 587, 1051, -623, -1286, 142, 685, -400, -980, 947, 730, -1721, -551, 2570, 130, -2928, 1111, 2610, -1638, -1930, 1872, 1369, -1857, -1265, 1392, 1262, -1315, -1874, 580, 1558, -1058, -2439, 91, 1101, -377, -963, -1006, 757, 1184, -908, -2152, 708, 1942, -769, -1938, 541, 2032, -129, -2236, -685, 2382, 805, -2456, -1309, 2418, 1044, -2294, -621, 1513, 423, -1069, -1303, 295, 924, -116, -1398, -118, 1402, 381, -1527, -1093, 1440, 1482, -1184, -1699, 1271, 1876, -1373, -1423, 1523, 1092, -1032, -449, 1219, 392, -189, 20, -43, 392, 372, -831, -237, 663, 218, -86, -165, 527, 743, 273, -466, -23, 841, 350, -138, 434, 582, 159, 49, 165, 118, 454, -504, -238, 709, 114, -829, 176, 973, -211, -466, 590, 270, -528, -224, 352, 224, -197, -391, -109, 580, 403, -584, -367, 652, 142, -250, -242, 338, 697, -459, -523, 714, 372, -829]
767h29L40J412p30o36L75J70J00m96k22J44P33n79m47M33L75l09q1l6R9L20k78
788a42j92K99L09m52k64L82L35o3n37j27L14N34q01j15R89l19q23K91K11l9O8
809a42l09K43N74m70l45N37K55m81m32O14L7l7M3L8K18j34m43K37J42m59J27L97
831B10k4j24Q0q7m29J88K69l34J87K53k96kj23L84j16pl21N02J58k1m42L02J58
854C65j85j11l0K31K82p28J81J09J67m60J84K25k41o8m9J95N7k79l4K05K83l28
876b9K59R9j85m32J18L49r5oq2J29m7j60J94K5o9k88p1K38o8J66k2l22K42K09
900A52k13K3R9J09n7k0q8K34l35j34J38M48m23r7j81M37j86k22J77M00k84l24
922c47J22j24N07n66K58J17K08l55k14L59l27O7K79k63L84k74P6R1j77L4Q4j56
$$ y = [-829, -489, 923, 193, -443, -68, 102, 202, -294, -516, -372, 361, -218, -665, -232, 143, -166, -247, -283, -184, 136, -142, -334, -35, 274, -178, -442, -60, 275, 212, -325, -452, -138, 396, -405, -520, 469, 150, -673, -382, -171, -210, -142, -451, -208, 366, -104, -449, 88, 343, -138, -570, 44, 81, 44, 87, 125, 343, 209, -234, 3, 145, -314, -187, 210, 186, 62, 142, 55, -374, -186, 83, -251, -64, 189, -107, -109, -232, 152, 36, 29, -292, 210, 368, 347, -95, 207, 365, 180, 69, 39, 270, 552, -176, 5, 114, 281, -179, 5, 230, -11, -79, -128, 67, 124, -155, -189, 16, 299, -29, 230, 329, 144, -288, -170, 179, 84, 78, -4, 125, 78, -82, 112, 137, 68, -220, -291, -53, -121, 45, 23, -299, -57, 152, -61, -38, 61, 170, 113, 93, 5, 239, -96, -230, -92, 356, -67, -164, -345, 92, -94, -316, -139, 261, -23, -347, -225, -349, 158, -408, -150, -33, 175, -180, -394, -35, -362, -295, -16, -279, 105, -169, -93, -2, -179, -145, -61, -217]
944b17J07J07k41%P8J92j60k81Q3L45j52J97l77K60M26n34J4J19J13m2j67K23
966I3k97J82q3J40l15K63K98k37l9K67o2L54q25L02L62j54l77n8K69J23j84k54
988b32N95J06n61k40N48L17m63l56M98R1j50m65L78J53o7K6k07K26l4q1q7j5L93
1011C73m25o5k6L67j18j08p8L04l14L47j81p8L74j37l20j0K95J16n04j09L70k4
1033D9j39qP7J51l7j27J32k6o8m1l09J69J97k43k8K12j7O1J0j42n3K70m2m07L2
1058c27M22k08l75K87O3J31n1M7r9m5O6j18j51L06K33l64q0n3O20o78J9N89M86
1081G20j002l92Q89L76j107n0P55K77m19m02q2O42j66q4j17J96L9l52J85J3L65
1102B84m39n17O51N98l65q83N98M99k62k01l25M67L30n45k22O03j91m43K66M34
$$ y = [-217, -110, -3, -244, -244, -166, 26, -134, -415, -332, 13, -139, 58, -319, -59, 367, -167, -153, -34, 79, 37, -130, 93, -204, -22, -105, 35, -280, -17, 281, 44, 5, 272, 210, 564, -261, 41, 403, 249, -128, -186, 83, 206, 22, -232, 363, 469, -92, -332, 216, 533, 70, -286, 212, 303, 153, -312, 66, 219, 152, 178, -29, 197, 163, 82, -5, -20, 373, -52, -117, -143, 224, 106, -2, -80, 224, -90, 257, 76, -2, 372, 235, -85, -95, 200, 316, -188, -297, 73, 49, -90, -98, -21, 130, 93, -34, 98, 72, 4, -37, -346, -177, 20, -223, -251, -39, -56, 5, 15, -127, -180, 90, 48, -359, -327, 95, -113, -488, -201, -138, -7, -58, -11, -110, -155, -89, -207, -358, -52, 181, -183, -263, -316, 304, -374, -355, 234, 720, -282, -674, 215, 591, -516, -566, 189, 466, 47, -355, -437, 205, 39, -45, -162, 34, 73, -279, -94, -81, 284, -155, -672, -21, 577, 212, -671, -73, 426, 164, -37, -362, 105, 435, -110, -332, 271, 80, -363, -97, 337]
1122C37n66L50K49o90O6K90q1NJ81Mn0l12qM99q4l29J36oK09j5l9j54l88O86j71
1147A19m10K11M24l26l31N01r6k08K29p0J62j77l86r3L97K41k7k52K19m8K2Rl16
1170b06K30J37LJ62n13M64k41N5o0L99l61m47O9P98l55m61R3N48l53j72J41lm9
1193a22N69o60o3M36J89m65K6K04j20j91k84Q61k69n56K4P58l23l89M20R4j87
1214d8l2J31k54J13n8j21K93j3K3k86L34J84l45k4J38n0K35j92j23j06L35j64
1236c0K06k32j46KL74j53l4J78l88J21n2P3j64K62p8j34M71k52j44J86L7K7j91
1259f1q4j09K46Q5j77j78j9N15l5k26m0J43L8j00j13J62m4K18j68j02j53J67J08
1282G3l02N46K4l68K89N5Nl77j30L99k86L21k52j10J56J60k44J56k37J36K00m46
$$ y = [337, -229, 121, 370, -320, -254, 36, -45, -40, 141, 145, 95, -217, -225, 274, 190, -139, -3, -9, 200, 185, 146, -8, -396, 290, 119, -291, -80, 344, 18, -313, 188, 92, -116, 113, 43, 205, 28, -358, -451, -54, 187, 160, -92, 127, 79, 101, 110, -206, 24, 161, 164, 326, -187, 277, 36, 91, 31, 430, 69, -378, -309, 489, 134, -327, -234, 314, -39, -211, -70, -73, -122, 447, -213, -276, 160, 349, -116, -90, 114, -6, -197, -481, 380, 111, -445, -421, 337, 14, -375, 45, 139, -48, -80, 51, -203, -90, -148, -269, 24, 11, 34, -252, 82, 266, -79, -103, 35, -15, 220, 28, -95, -201, 134, -30, 176, -56, -202, -200, 174, 21, -13, 165, -223, -102, -154, -81, -245, 17, -61, -195, 276, 24, -120, 66, 103, 130, -61, -145, -254, -8, 77, -100, -278, -297, 218, 183, -43, -83, 60, 98, -2, -115, 47, 3, 221, 53, -49, -202, -35, 73, -229, 317, 341, -27, 262, 317, 322, -55, -185, 214, -72, 249, -3, -113, 43, 203, -41, 115, -122, 14, 214, -232]
1304b32L97j81k65JN66l6m31J6L32k95K40J82k95k92L33K26m45K73Q1o23N47j06
1326gq8k04L44J44J39l02j35L8j84N13kk12j90J39J22o0J42Q5l40K14j57j13j16
1349b30M33j29k92M8J15n0q0K22n2j5j27K30k32O8Q3j08j6K12P7j71r4J9pq5J79
1374bJ37k13J57J0k35mR2k9j40o1K02J14n8P5l72K23On1Jq9L37J56m44l6K60j44
1400a08pK87j6j60K58q9j69j50L73p1j94J50r9m2J59r8K24k10k9R1j44j23J32
1423c5Q8L8Q1kj3j49L8j59J50n6K74m65J80J23j77Q3K1R4q2l4k84K26J25PJ08
1448A80r9k16K53Op6j12J04J65j61J0J0r5l2k58N4J51p8m9K25J43l4k60J15l05
1472c59L25Q0j42J45j26J19J45j48m28L20J16j33QJ64lK5j56q0L3J26r1K2M9j57
$$ y = [-232, 165, -16, -281, -280, 286, 250, -181, -165, 167, -128, 112, 294, -1, -293, 40, 266, -179, 94, 175, -448, 99, -7, -95, -299, 45, 189, 328, 26, -109, -71, -255, 258, 256, 44, -146, -7, 115, 55, 197, 282, -58, 156, -1, -114, -230, 203, 74, -218, -170, -55, -105, -185, 37, -15, -30, -157, 73, -159, -91, -8, -116, -132, 80, 157, -14, -108, -89, -96, -181, -2, 135, -78, 79, 89, -146, -150, -58, -87, -227, -288, -86, 28, -30, 45, -327, -104, -98, -149, -148, -237, 100, 256, -188, -224, 36, -108, -115, 172, 156, -4, 254, 165, -4, -154, 219, 148, -46, 104, 5, -37, 122, 24, 248, 38, 9, 100, -44, -167, -35, 53, 91, 172, 170, 157, 8, 46, -113, 37, -19, 255, -210, -30, 93, -84, -1, 20, 114, 32, -2, -286, -60, 65, 72, 180, 81, -135, 118, 124, 48, -64, 40, 205, 44, 54, 64, -31, -63, -321, -267, -116, -194, -243, -18, 125, 91, -169, -54, -359, -34, 46, -96, 49, -77, 42, 187, 39, -389, -69, 47, -86, -78, 86, 83, 108, -48, -128, -95, 31, -60, -38, 11, -146]
1496a46L72l79L82m13J55o5R2K65m53J48J1J63j90j66K85j75K85k90L8J46k88
1517b23K52L09n43K17j01L5j57M04k41Q0j31P9N1k5J06j57p9N1mk3K53k69o7n6
1541b39K79Q4J24O1m63J24o2mQ5L7j70j5q1L75k58J67k16M78k40J48k36R3R3o2
1565A02q9r5K07l30L20j44M7P4n1Q6l13Q0M12k32l44L04j7r0K11kj24L0J1o7K51
1590B37k47n7o3K04o2k5L65o30K77J08l15J67o7k6J1J87K04L1j46l26R1L3N0P9
1614H0j95M8K02j52j42j52K81J43M5j41j64J23J43j92l5l5J81j39mJ40p8M9M4
1637E0q0J44l71K67j36J17k46K04K09m64J59K41k27L3j2K5K0o7P2J39J22N5j61
1660I3k12J13J96k75L2j06mk71K73J47Rn3N6O6nk24L62J30k92j40K05j09J86l65
$$ y = [-146, 226, -153, 229, -184, -29, -94, -2, 263, -190, -42, -31, 132, -58, -224, 61, -114, 171, -119, -81, 65, -223, 29, 338, -205, 12, -89, -54, -211, 193, -48, 32, -99, -20, 31, 6, 112, -45, -124, -73, -77, -100, 153, -116, -183, -239, 40, 124, 248, 309, -154, -30, -92, -96, -11, 26, -144, -159, -240, 135, -123, 44, -172, 306, 66, 214, -22, 71, 164, 102, 13, -82, 125, -205, 115, -29, 18, 92, 41, 127, -186, -106, 306, 74, -270, 34, 17, -73, 138, 136, 12, 42, 53, -14, 237, -10, -67, -130, 74, 12, -13, 352, -278, -1, 107, -208, -41, -108, -134, -123, 64, 268, 299, 153, -173, -82, -49, 1, 80, -115, -67, 135, -17, -159, -311, -30, 113, 158, 17, -147, -24, 119, -73, -108, -143, 38, -101, -105, 35, -43, 6, 50, -30, 114, -257, 10, -126, -9, -255, -51, 158, -306, -147, 94, -133, -100, -112, -87, -67, -134, -62, 77, 199, 254, 93, -119, -6, 190, -85, -53, -159, -163, -434, -161, -14, -5, -58, -2, 64, 59, -165, 197, 327, 35, -105, 100, -9, 177, -188]
1684a88K75j7j20m2lK70k58L0J49j70J31q1J65k63k1q1J38q0K22j71L62q6j93
1707c2j5K39j94r6K58o9j28J84p1j48L1M8J16k41K05M7k02o0L13j89N4r3K04k37
1731g6lL22j00k05J3K47k03k69M60o6j57J75n8k2j2P9q5r9J32J0Q5j12O5J8J1
1756A50l86K22j80J95k92L37n7j51M52j25l93M30N6m38L21k88P1L33k64j21m4
1777a72N15l17j90J67k4O4j31O3L1K15m98N14k52R0j13J26j4RO8j8j98J41Np5
1801FN7L2k17J08J15J29m83L98m6J6l8k45L90l69J06K4J22l00J39q9M2n2J24k5
1825e6J40m0j31j36J36j4k47L75L38m22j33M30l34J99k02M1K63r2m7k42K32j63
1847a05l8K53j48J25m5K15j86P6l41M06p2l26K5K08R8j61l15J57J09l5J77kJ55
$$ y = [-188, 87, 70, -50, -92, -95, 175, -83, -53, 96, -74, 57, -24, 141, -122, -143, -224, -86, -166, 56, -115, 247, 161, -32, -47, 192, -2, -98, 160, 91, -37, 147, 76, -72, -41, 7, 123, -118, 87, 134, -68, -128, 185, -4, 50, -43, 161, -76, -79, 243, 143, -62, -49, 198, -5, -274, 186, 120, -37, 138, 80, 58, 46, 125, 40, -59, 73, 83, 168, 56, 121, 139, 150, -236, -14, -194, 1, -291, 46, -11, -162, 290, 165, -228, 202, 258, -180, 141, -147, -76, 257, -7, -128, -172, 343, 26, -164, 3, -21, 43, -88, -25, 6, 221, -277, 237, -15, 75, -38, 88, 74, 83, 151, 133, -65, 76, 81, 6, 63, 95, -122, -14, 101, 230, -253, 145, 99, 115, 77, -168, 222, -147, -41, -17, 105, -195, -56, -145, -103, -155, -31, -56, 84, 44, -87, -223, -87, -101, -348, 27, 365, -57, -190, 240, -94, 105, -97, -56, 207, 115, 68, -174, 58, -105, -143, 110, -38, 87, 42, 257, 71, 147, -194, 212, 140, -186, -161, 47, 145, -16, -331, -174, -65, -100, 77, 75, 230]
1870B30k81r6J29K00j30j92K91j74J77k08K61j55l0K9l07K08n5o9m8J68l45J33
1892b64N5M30k17j62L09M1o8j12r1P7j46R6K21k36j49K18n5J54o0M7m7K7K12m82
1916b02K03N1k58k9K05Q9j60j5L85j05j50j81K62n6k2j17L2J20Q0k91K27l0j85
1939a47O4K9O8j16n0j93O05n22K84l3K15k87J02J83l34J36j17j34K06L3j87L50
1961A55k30M3J6N23k15m41m6O1L99k57J21m47N37j01m85J91L99m04K04q8L17P9
1983C31m26q6K15R3k6j27k6K1J9p7J04P0j36L0k04j6l3P1K53J33l05k71M00j90
2007a83O8K88j40j0rR5O7n2k78N9J41k52O5Q6L22n08K88k3L9n4N9J0J1j22J60
2032A27j29o9k4j3J24l7l6j83j1K30oj51J91J21r4j72K33J41j42l63J04J41K00
$$ y = [230, -51, -147, -18, 182, 52, -140, 151, -23, 154, -54, 207, 52, 22, 51, -256, -48, -103, -172, -220, -52, -397, -264, -209, 221, 4, -158, 151, 192, 124, 12, -79, -2, -148, -52, 169, -67, -216, 2, -53, 101, 41, 88, 41, 68, 280, -202, 1, 52, -206, -235, -30, 59, -101, -116, 269, 164, 14, -167, 95, 39, 17, -100, -68, 52, 132, -159, 68, 38, -147, -83, -54, 14, -102, -152, -345, 260, -262, 22, -11, 204, -83, 19, 202, -132, 4, -113, -247, -41, -8, -195, 155, -75, -32, -16, 507, 292, -149, -195, -134, 265, 8, 129, -318, 219, 118, -367, -176, 223, -181, 23, -65, 252, 331, -95, -181, 34, 127, 101, -26, -52, -31, -12, -89, 15, 85, -51, -21, -225, -241, -274, -203, 50, 183, -122, -393, 7, -183, -115, 173, 33, 23, 14, 109, 176, 124, -154, -95, 46, -206, -141, -55, 267, -241, 47, 24, 63, 9, 68, 78, 89, -33, 127, -2, -71, -95, -108, 16, -21, -57, -240, -251, -21, -27, -178, 13, 134, 40, -132, 101, 242, 100, -263, -159, -18, 182]
2055A82qk01o4J65k9Q2J62j69j59m4Q9J32R0l53K10o3k55J03J14J45l18q4K54
2078a9k6k21K41J53l00J32%J71K48l69j01L9J00j19LJ99l89M7J47P6k6j68R1L50
2102B59l32n5j28K68l9j30L7J58K4J7K2R7j37l67J53J05J53j41J77l23K18j19
2124h3q7J47P9p8J75k83M94p29N79k24L6o3k75L91k85K06j49L61j41l52jL42L3
2147I3k87J36O0J24l10K01J40J75l22M8O6j20Q8j15j5p4n9Q8L62j96j71J55J55
2170B22m9k3k56Q1K87m29J05J05O7q9l5M9J11k2l08P9K70l10J16J87o4l68J55
2193a19M7J8N9j84K82J79n32L79k51J76q7p7J43L2M1j99K75ll22J12j61K11q5
2216f6M0R0Km48L99R0k07n4J86J04j5j45j6J69l39J62J55j87K28k78q2M85k66
$$ y = [182, 174, -27, -91, 74, 45, 127, 289, 120, -39, -83, 6, 138, 228, -125, 85, 22, -233, -130, -16, 129, -189, -273, -19, -45, -266, -25, 128, -172, -40, -40, 131, 379, 10, -91, -52, 48, -71, -68, 131, -258, -211, -64, 12, -14, -182, -91, 259, -73, -128, -256, 12, -27, -157, -120, 38, 62, 79, 101, 198, 61, -306, -153, -48, 105, -36, 141, -182, 36, -83, -170, -23, 56, -22, 153, -130, 364, -365, 214, -10, 26, -37, -312, 79, -206, 0, -149, 212, 71, -281, -282, 60, 93, -194, -58, 2, 126, -184, 17, 157, 332, 10, 58, 124, 4, 92, -23, -38, -112, -171, -83, 279, 83, -88, 67, 222, 173, 150, -106, -25, 262, -167, -62, 43, 110, 21, -14, 35, 146, 124, -184, -105, 165, -145, -29, 158, 94, -274, -119, -72, -54, 5, -179, 103, 282, -250, 129, -122, 54, -33, -110, 33, 65, 106, -93, 182, 179, -143, -31, -192, 19, -66, -26, 64, 66, -382, 17, 107, -100, -154, 32, 136, 121, -24, -40, 129, -210, -48, 107, -80, 148, -130, -212, 273, 7]
2239Gj67K68j47p2K13j51R7J44j00l04M68m19N4j24L11n1j52k8K37q6k27K7J63
2262c9J83j77K05k61n5L69n04L95L0m18K28K73m2l40J75J35q1k28J37K32O1l46
2284f8K38k65K38K9k79J38J86m9l13m5K62k82R7J23k66K65O4j06K6m1J80o5n1
2307A6l51J96M37k85o7j17n3N03n08K08J98l33Q9k4K46k79m0J1O8J73j34L9n2
2330e9J2O5k98L30p7k1j65K66J31j82L46M2j73k69r8J69Oj78Q2J82j8k60J24J6
2354b7K05k00l8j8N6p8O0k1m4j84K45p7J13j83L49j29j52R7j87L52j06l2k36L45
2378A10k98K34J51k28J4k02j57O13l63K41j55qJ74j00j19K71N1m03P0J31J52n07
2400c28L05q8O2k57o8J35J02l3L9J44J36l23K83K89l11m16J47J6k9K38j00j48
$$ y = [7, -160, 108, -39, -111, 102, -49, 48, 192, 92, -212, 256, -163, -109, -233, 78, 27, -125, -153, 84, -2, -229, -202, -39, 144, -33, 172, -89, -144, 225, -279, 116, 146, -272, -44, 229, 187, -153, 22, 157, 76, -152, -15, 217, 278, -68, 170, -95, 143, 172, -107, 31, 217, 168, -145, -190, 72, -210, -113, 10, -256, 9, 73, -33, -7, -48, 132, 67, 16, -335, -139, 298, 13, -54, -171, -224, 279, -229, -21, 177, -156, -67, -91, 155, -124, -164, -153, -85, 88, -46, -7, -59, -47, 18, -280, 50, -27, -48, -213, 53, 184, 2, 348, 390, 217, -52, -150, 19, 25, -153, -71, 111, 93, -167, -43, -27, 178, -22, -60, -78, -22, -100, -40, -61, -105, -289, -44, -121, -8, -191, 158, 29, -123, -26, -213, 139, 33, 1, -235, 110, -188, 46, 197, -31, -17, -219, -376, 237, -126, 115, -40, -48, 126, 26, -93, 178, 229, -174, -104, 27, 179, -328, -23, -111, -49, -306, -374, -239, -137, -170, -131, 13, 149, -174, 109, 398, 87, -329, -182, -166, -195, 43, -57, -205]
2422b05L02l19L83j52l2M6N0k81K10J14j5j95R6n1j0N9J4n58M67K88k15K55p7
2445A74Jn2m52J88J76K56R0m44j2J57n8nL0J21k62l8L62m63J44J00P2%k60Q8J5
2470g2n4J60j85K54j70J14j67K52k55J31l1J18j40j71L56k81L14l8%l84J30K36
2492A17j51j15L70j70k54K49n2P3n7J99N8m0m01J24J80j09M2j57J57j99Q5K99
2514B48m01J01M9j17J69q3l29N25k01K08l95L6J21j22K39p7L02k90J35P5k71K2
2536e6J82j85j9P7j98K15j09j26J78pJ97m61M18l07K74k9j74P7j11K5L27n2j99
2559f3K44j90N3k40K37L7j77N6K14l54J57P9m2l6N5J46l50J41j6O0K94j91j87
2582g3J2Q3j79J86M6j49j91O4R2K38r9M3q5p1J93j73j18K38k03K40k10Q9J28j24
$$ y = [-205, 97, -222, 161, 9, -23, 23, 73, -208, 2, 116, 101, -94, 2, -49, -59, 0, 14, -544, -77, 211, -4, 251, 174, 175, 123, -329, -141, 35, 291, 381, -63, -75, 82, 24, 19, 49, 170, -92, -130, 232, -231, -87, 13, 85, 85, -175, -87, -72, -126, 34, -151, 103, -67, 47, -120, 132, -123, 8, -23, 95, -45, -216, 140, -141, 173, 135, 135, -249, -119, 117, -34, -149, 221, 51, -203, 46, -6, 67, 10, 209, 267, 227, -174, -50, 130, 21, 63, -94, 63, -136, -51, 248, -153, -52, -3, -120, 49, -34, -363, 162, -39, 169, -226, -190, -69, -191, 48, -29, 273, -17, 118, 193, -78, -56, 126, -59, -78, -1, -199, 16, -93, -219, -41, -48, 149, -312, 106, -201, 73, 44, -130, -53, -164, -139, 188, 136, -63, 181, -9, 44, -196, 41, 78, -99, -43, 171, -183, -26, 53, 11, -25, 30, 176, -174, -33, -49, 11, 305, 114, -73, -61, 22, -157, 29, 75, -74, -265, -201, -109, 129, 30, 73, -12, -83, 110, -63, -181, 57, -146, 94, -116, -27, 101, -23]
2606b3j23L48j42k02J42n5l9K06j16j02K04j81K82l52J96R9J18J09o9k36r2K22
2628A94j80m1k29M76J77l63k21P3rJ96k25N5o3J28j15L17k03MP7J14l17J91j69
2651a33K42j59K57p0n4P4O6k54r8L1O4L78k02J6K9k57N7j16r8J43j15J68P3N3
2675I5k54J0N2K2M0O1p1K22l81K17j47K00m11K97o9J11J38Lk16K06k57o1J68Q5
2699F0m8j11K67n34L31J07l18K48j69m1L51j16J82n15J32L98n10L3L86j59k8J50
2721I6l12K27P3k13J79R2j53K35l26L7J70n6k11J58K7j05o7K06j39K11L4l49L14
2744A28r3l3k6Q4j58N9J09j76o3J33M1J14j38j62r3k5J45J91M0j95J52j94J97
2767C7k00J56j9K5M9J21k90J99k38J43K03o0k45J22j37J1j2j28N71m82O1K60j62
$$ y = [-23, -146, 202, 60, -142, 0, -55, -94, 112, -4, -106, 98, -83, 199, -153, 43, 142, 260, 369, 300, 64, -28, 194, 14, -27, -256, 220, 397, 34, -187, -114, -123, 73, -152, -97, -160, -32, -147, 170, -33, -29, 48, 162, -155, 36, -133, 109, -50, 207, 137, 83, 157, 223, -31, -129, -98, -34, 344, 142, 158, 187, -70, -13, -129, -227, -84, -199, -31, 42, 95, -159, -149, -97, -75, -35, 26, -45, 177, -204, 13, -134, 66, -345, -48, -117, -6, 132, 135, -81, 125, -132, -193, -25, 60, 12, -99, 168, -366, -35, 72, -246, 2, -167, -208, 143, 27, 209, -306, -174, 224, -286, -253, 133, -26, -54, 96, -216, 11, 84, -129, 50, 142, -11, 224, -102, -65, 105, 49, -162, -4, 23, -82, -149, 57, -82, 129, 163, -186, 128, 35, 2, -24, 60, -98, -39, 70, -106, -169, -36, 5, 119, -19, -181, -274, -299, -154, 37, 77, -118, 34, -160, 37, -163, -7, -26, -1, 48, 169, -121, 78, -160, -17, 186, 126, -119, 3, -134, -123, -135, -263, 308, -174, -113, 147, -15]
2790a5J13K00k52J92j89k62N9M3k4O19j29l76J29k36K45j54J48j03n8K11j37j69
2812a45J14k0J82m04J60K48l01N2j24K66Pq0n7O3j58P9K05j08J5k39K00j52l9
2835b36L8L09k69oJ45j85J99K00p7n9Kn1K78l26K68l30K09j91O0j31K34M3j31
2858gO0j9J14k01J49k82L75k43L2n8J75k01J44j79J02pJ23j13M8l5q8o0K64j23
2882c0j79P8K5M1l8K9j23L48l56j1L19p3J85j91k33K98L0j77k13M6K87K6k90J24
2906g8O4J01k16J14L31k72k31K44j81K50j30P7l6Q4Jo7J67k80j6J81j00k45Q0
2929a58K37j75jp0L14l98K24K71l92L0L46k87o7J24J95l15n2K23K9j89J6O2J81
2952A48j82K64k93L21l65J9qK04j86O5J51k28q4K02l7k01J87Om7K59n3kj28n1
$$ y = [-15, 98, 298, 46, 238, 49, -213, -154, -111, -135, 484, 355, -21, 108, -128, 117, -37, 111, 8, -50, 161, 24, -145, -31, -51, 131, -273, -113, 135, -166, -114, -238, 28, 35, -45, -102, -39, -197, -118, 87, -21, -6, -245, -45, -197, -236, -198, 111, -158, -164, -19, -204, -5, 195, 118, 59, 61, 10, 288, -38, 230, -100, 109, -82, -22, -153, 81, 124, -7, 53, 34, 148, -53, 96, -186, 189, -54, -22, -80, 95, -106, 38, -141, -39, -46, 77, -36, 12, -23, -111, -171, 93, -30, -209, -131, -106, -65, -103, -74, -197, 151, -205, -216, 103, 30, 215, 24, -209, 89, 119, -58, -271, -225, 62, 88, -202, -78, -14, 87, -129, -15, 316, 44, -187, 57, -124, 126, -4, 73, 37, 121, 122, 55, 222, -58, -74, 107, 7, -238, -158, 79, -96, -97, -167, 147, -251, -27, 244, -148, -118, 228, -59, -126, -2, 193, -122, -174, 49, 78, -111, -95, -33, 148, -34, 230, -63, 258, -107, -88, -96, 108, -78, -13, 138, -90, -174, 28, -9, -210, -23, -17, -64, 195, 142, 140, 12, -39]
2976c9M1J80l5k34j58L24k8O7r3j58K2J40n1J01k54M34j10j11P0k8j54K2l8K39
3000A49l42P1L05k41j58K85k35J04j96K51J7j91J84p2m9L3k54K67k65K19K84k29
3022f3K84j99K2j52K1j29K20j41K39k78M11l10K21k7j85N6p0J47j82r1J84jJ50
3045A27j20j42L5P2J42j25nk9K25j63K0l1J5K25l69j49K21Q4R2N3J9m36K58j59
3069a40J42J09k35K56k72K72k29J69j48N2L02m05J86l68K76J95j56o7J73j28p6
3090i2L60j53K48k30l8j12l8K3K9m4K80O4l41o3m6K68k06K90j20j23M1J70j49
3113A8P0k37K03o8L14j41L27l89j57Q1j16K76j65r9l6j53L52N0J12k02Mk5j27
3136a08R9M8Q6J00k37J35m3Qm8J69k74k01J95l1K17l80r0K36M16n42K31M9J8j88
$$ y = [-39, 2, 182, 147, -87, -245, 79, 51, 118, 25, -133, -111, 29, -22, 79, -175, 259, 149, 38, 108, 80, -74, -52, -90, 149, -193, -122, 183, -58, -216, 69, -166, -62, -258, -7, 10, -181, 3, -69, -118, -85, -339, -72, -337, -118, 166, -63, 221, 22, 44, -108, -87, -216, 4, -137, 102, -176, 235, -75, 146, 119, -66, -10, -80, 67, -115, -206, -22, -23, 127, 7, -135, -100, -28, 114, -11, -16, -45, 180, 17, 37, 6, 21, 246, -123, -272, -51, 33, 125, 178, 197, -239, 19, -140, 2, 111, -124, 132, -140, 132, -97, 72, -76, -24, 278, -127, 59, -309, -33, 162, 6, -61, 112, -16, -92, 268, 115, 363, 133, 95, -17, -55, -32, -3, -47, 233, 297, -44, -107, -153, 115, -91, 199, 79, -44, -3, 167, 18, 88, -149, 54, -14, 300, 159, 486, 97, -60, 21, -95, 181, 16, -83, -119, -272, 80, 130, 242, 40, 44, 19, -108, -9, 39, 125, 225, -12, 123, 80, 88, 40, 209, -65, -266, -71, -102, 115, -265, -355, -119, 297, -245, -14, 35, 53, -135]
3160a35PR9K7J65r2k87L32p3N2K60m50r7jL6J14L17k35J06l34j85M16r8K39k73
3184i0l0J39Rk05J20J69k07J15J63j93N4O4m30K67R0J50m66L62N3n95M53K12k77
3207g3K9L7J47J39j26r6j82J91j36J04k7j67l8J72J30k02J03j07P7m0J68k66J97
3230C4r9l23K23K3P3L01l29K6J83l4K6l7%J07k61m9K26R3p7n5P6Kj91L42n39J18
3256a41K04N0j42K85j76n4Qk8L82m62J84o6j44J09K1o1N6p1K54O9l79J7j32L67
3280A50j58n4J64J73j76J58k42o2K21n08M16Q1p1r5J01n0J79j53j16p1K30j79
3302f2l3K26p4j34k27J81m1L84m46R0O5K20k35K5O1J33j19r1J97m1O5n9m4O4l78
3327b73M28q7k84M58j50J31j54N5K3j40k32L50j07O5j32K49J1l32MJ83J06j83
$$ y = [-135, -128, -29, -2, 163, 71, -216, 116, 43, 95, 355, -95, -192, -193, -157, -43, 274, 39, 145, -189, -374, 42, -56, 183, -90, -120, 19, 28, -177, -57, 112, -95, 20, 183, -10, 44, 108, -322, -55, 35, 185, -281, 81, 134, -461, -8, 204, -73, -44, -7, 140, 279, 153, 57, -125, 66, -70, 34, 7, -160, -198, -26, 104, -98, 5, -102, -25, -65, 103, -163, 34, -65, -388, -165, -142, -69, 232, -97, -71, 112, 78, 104, 67, 67, 174, -87, -136, 90, 183, 106, 51, 127, 129, -62, 280, -259, -141, 63, 113, -29, 256, 80, 26, 34, 6, 388, -74, 110, 44, -100, 9, 30, -31, 25, -46, 208, 277, -102, -85, -217, 150, -8, -62, 102, 275, 99, 257, 15, -47, 174, -334, 82, 163, 92, -3, 98, 48, 227, 74, -42, -113, 117, -62, -95, 131, 57, -77, -304, -123, -164, 220, -226, -136, -71, 149, -86, -61, 0, 133, 14, -77, 120, 79, 144, 85, 41, 105, -273, 155, 68, -216, 242, 92, 223, 69, 124, 147, 7, -225, 125, 18, 83, -49, 200, 211, -121, -117, 66, 172, -11]
3349a1k07j2J42P6J79k33k8Q0J93k67q1J99P3l53J67R0n3J96N8l49K9n1OJ93k6
3374A0j26k9rP4N6L7N9k21j04M07J49n71K64l1l7J0r2Q8j4R7k37K28J21j09l23
3399c03J29K80j95j9L4J33Q2r2oO6k41K88n2j03l4j22K04K95L7k44m58M96P4k53
3423dJ74k55k6J3Q2j14L12j96k0K01l05K83j44J69J7k75N1q2j65J96j73M03o8
3446G4k39M8K15k46M36j98k75J81k24L52j18J18l45L3J08l7P9J35j71J01J71k8
3468A70j05k08l3M00l42k9l0NK40j5M7j31j05k0J24J49j66J04J33j22m3M7p0Q6
3492H6j47r0L37l6j89j26L59k92J50N7k39Q1L7l46K11K35p8%l44M73R1k08R4j07
3516Ik80M26j19j0l26M68j62P5k59K20P4k76O4P8j54p4Q0K71j69K76o3m3n29M89
$$ y = [-11, -218, -230, -88, -12, 167, -66, -94, -14, 179, -88, -169, 30, 103, -250, -83, 7, -46, 150, 208, -141, -112, -163, -157, 36, 10, -116, -145, -154, -80, -24, 13, 72, -149, -253, 154, 303, -268, -4, -35, -72, -62, -154, -66, -80, 17, -220, 8, 129, 20, -303, -174, 106, -89, -108, -74, 59, 141, 49, 43, 109, -132, 156, 104, 1, -33, -155, 49, 344, 381, 137, -321, 175, 249, -4, 170, -85, -111, -98, -16, -130, 182, -14, -34, 167, -138, 145, 1, 170, 187, -88, -37, -119, -284, -88, -261, 142, 74, -165, -117, 98, -148, 288, 90, -185, -4, -228, 124, 6, 124, -221, -188, -80, -117, -38, 97, -74, 27, 198, 170, 65, -143, -176, 224, -118, -147, -177, -172, 68, 53, 100, -31, -136, -156, -32, 117, -49, 55, 188, 66, 23, 70, 0, 86, -61, -151, 186, 150, -39, -165, 194, -98, 52, 109, -130, -49, -12, -358, -147, 88, 10, 10, -334, 139, 230, 22, 116, 9, -271, 155, 36, 26, -300, 168, 6, 81, -178, 42, 116, -160, -96, -18, -172, -246, -166, 105, -64, 212, 149, 106, -423, 66]
3540F6j97J76J18n4l14o8L73k84K88l20L59J3j76Q0K32ml08j48J94q7N7J85m4
3563A37j23Q6j1M0k47J09m3Q6QK7q2j51J8J80j10j15K35J37J16k71K77j54l69
3586b20M39k42P4j69Q3n6J69l07K06J29l2K03m23K97k27M7J97k15Q7k40N8J9O1
3609f2M9J0M2j71J56J02j71k12M44l67L38k32J73l5k51K19K23k58J5k0k62J29
3631a41o1M54k98R1q3j45J09J31k23K30k2R6r6L02l37j2j11R3K69k76J70M2j11
3654G1J81k75R4j09j24K19L3k5J93k18j36J90k11K49p4j9k84K51r8l9J90j87k81
3677d09J74k7K60m00L43k0l8L10l27J64n3R3N6j69J26k77K37J27k80k8J36j1J35
3700A22j89K54m34k6L60P6k64J13J01r7j82J78J45o2N8k98L55j90K4l33J80J69
$$ y = [66, -131, 45, 163, 109, -205, -273, 100, -184, 104, -216, 143, 156, -20, 60, 292, 288, -20, -168, 26, -61, -4, 181, 137, 14, 100, 89, 129, -118, -9, -52, 34, 42, 69, -13, -164, -146, 34, -76, -191, 44, 181, 297, 26, 303, 149, -220, 219, -23, 51, -118, -35, -91, 78, -229, -23, 106, 74, 277, -146, 151, -76, -29, 168, -47, 40, -200, -142, -123, -62, -13, -3, 39, -132, 24, 126, -45, -257, 187, -180, 158, -74, 99, 64, -187, 32, 255, -3, 12, -8, -270, -141, -202, 252, -46, 45, -38, -183, -74, 57, -166, 64, 42, 138, 42, 344, 7, -5, -116, -23, 246, -30, 140, 182, 71, 252, -23, 71, -38, -162, 57, 90, 65, 258, 40, -96, 94, -117, 132, 58, 39, -245, 6, -92, -131, 59, -128, -409, -235, -262, -2, -402, -59, -79, -117, 193, -134, 30, -23, 70, 126, -43, 83, -194, 43, 170, -110, -138, -2, -13, 122, -67, 187, -247, -273, 87, 163, -101, 12, 113, 16, -166, 12, 157, 95, 153, -145, 210, 20, 44, -289, -109, 60]
3722F0R2J06n54J91J55L09n23R6KJ32l5r6n6Q0L6K41k52k42L45m4O2j80K40j33
3746C2r9J99N7k52Q1J77k01n4m1N5K67j24l04O9p0J70J38p4j56Q9j0j33J93N8
3770F7k20J92M95q45J92J12r3J92J35k47m0Q0k13L42j46j14m0N7J11j44J76Mn7
3793dmJ48j33O2m4mJ56k71L30k86j36L72k68j35R9K02R0k82K01n2k81J27kJ30
3817A5j00j18K99r6JJ14j04j40K10j67n9K95l04K84j58J62j84L0J72m2m18L40
3839C2N1k57K04O4j60J08J33K8m45K78j68J15J70k13j8k88M02j69J69p4RK72l20
3862g7J86p3j02j88L47R1j68RJ8q8Q6J15l19J0K89l4j13J33L7k29MO5n2P9k76
3887b50K37q9O9r2J55J08L0n6j21k11K70J6j1P1P2l88r5N09k8j84OR0j92j39R
$$ y = [60, 152, 258, -296, -105, 50, 359, -164, -68, -66, 66, 31, -65, -121, -41, -5, 236, -16, -258, 87, 43, 105, -75, 165, 32, -67, 132, 189, -63, 18, 195, -6, -60, -101, -46, 221, 97, -207, -138, -208, -38, 100, 26, -130, -41, -51, -184, 9, 67, -153, 39, 534, -311, -119, -7, -100, 92, 227, -20, -60, 20, -193, 149, 3, -111, -151, -94, 17, -127, 49, 53, -4, -8, 140, 7, 69, 25, 21, 177, -94, 236, -50, -186, 186, -82, -217, -118, 84, 174, -108, 93, 41, -240, -113, -115, 15, -85, -203, 96, 0, 1, 115, 11, -129, 81, -86, -145, 150, -154, 130, -28, 134, -50, -20, 152, 110, -308, 32, 83, -174, 30, 94, -66, 42, 175, 203, -242, 36, -132, -17, 153, -60, -78, -366, 36, -133, 36, -38, -29, 243, -77, 109, 36, -66, -254, 93, 184, 16, 25, 43, -45, 41, 156, -163, -153, 136, 102, -11, 122, 159, -70, -66, -1, -53, 26, -250, -13, -102, -33, -125, 30, 138, 168, 112, -9, -220, 50, 66, 55, 126, 198, -190, -285, 224, 196, 12, 18, 108, -84, -223, -214]
3912b14J50J5K44k9pj06j30J70J22k49n6r3J58j20%j37P5J8K09J60J19j72l63
3935b36K70J18k78K18j8l4k91M98l71J4L0j3K96j28q3j48J81q2l4O3j60L14j62
3958c6J1J7j6r6J83K24m51J64N2J27l70mJ92P8p3J26M8m19K90l16O7m8M18o9o0
3983C9n8P7rj40J72k02J9L25j33Oo2k48Q6Q4J67j89J82j71j83J86M7P0k5k0k36
4008b16M4K49P7j53K3l1j10J5j38L60k65J4K43%j29K70k69k1K3R3n4J05j06P5
4032I9R9j51%ll3j59M7J5N2K55k17k56J58k14L68r6L8j16L56k64P8l45N50l56
4056i5K09l15K0N7mL29J4q6l33J27j25L05m0J92k55N4l28M18j70J10j65J8K88
4079B25m86M36l02n1J35J11k71J58J45k14j40M23l45j41K61M8J63l03J62p9K3
$$ y = [-214, -64, -49, 195, 166, 159, 53, -77, 93, 215, -34, -90, -183, -25, -145, -145, -282, -207, -189, 20, 180, 299, 127, -236, 34, 152, -126, 92, 74, 40, -251, 247, -124, -110, -80, -93, 203, 75, -8, -156, 25, -57, -91, -28, -188, 126, -36, -25, -8, -24, -120, 63, 287, -164, 0, 52, 179, -191, -195, -3, 75, 2, 128, 176, -243, 47, -269, -202, -250, 168, 99, 39, -19, 58, 49, -91, 81, -121, -102, 223, 90, 96, 34, -214, -128, -44, 123, -66, 116, -55, -238, -52, -5, 65, 40, 20, -216, -172, 77, 154, 1, 24, -7, -117, -102, -240, 120, -145, -131, 112, 112, -17, 253, -16, -37, -14, 79, 25, 130, 24, 99, 198, 47, 47, 44, 11, -148, -101, -86, -34, 221, 4, -252, -94, -308, 60, -36, 2, -114, 242, -22, 56, -289, 261, -95, 114, -201, -181, -124, -128, 201, 215, 129, -204, -77, -202, 103, 63, 255, 0, 54, -274, 144, -26, 84, -81, -63, 225, -261, 175, -127, -178, -43, 68, -203, -45, 100, -114, -254, 169, -176, -317, -56, -8, 155, -148, 14, -65, -42]
4100d2j59J55N9n6J45J31p3o6p7j12J41l7j06Q6O3k12O9k1J77j32j11p2J33m7
4124a64Q9J71j40J09j97K64k16J49p1k5J54j60J30n4j01j8K46j20l13J63J96j04
4146a2J09j16J5J72j91M4k46O6J52j70J11J43o7k10m0M41j59J13n0j00O5l39J02
$$ y = [-42, -201, -46, 13, -43, 102, 233, 160, 94, 17, -95, 46, 9, -97, -11, 52, -160, -91, -112, 65, -67, -178, -250, -117, -164, -75, 96, -44, 65, -132, 132, -84, 65, -6, -31, 123, -37, 93, 39, -62, -80, 166, 46, -267, -104, 92, -12, 97, -19, -4, 168, -23, 21, -225, -159, -7, -177, -66, 77, 10, -200, -240, 201, 42, 155, 105, 5, 70, -269, -167]
$$ [...]
8191d7
##END NTUPLES=NMR FID
##END=
