##TITLE=1H_Pr Q06
 CDCl3
 8 sc, 
 6.12.2021
##JCAMPDX= 6.0         $$ Bruker NMR JCAMP-DX V2.0
##DATA TYPE= NMR FID
##DATA CLASS= NTUPLES
##ORIGIN= UXNMR, Bruker Analytische Messtechnik GmbH
##OWNER= root
$$ XWIN-NMR		Version 3.5
$$ Mon Dec  6 13:04:58 2021 Russian Standard Time (UT+4h)  she@DPX200
##.OBSERVE FREQUENCY= 200.131346
##.OBSERVE NUCLEUS= ^1H
##.DELAY= (6, 6)
##.ACQUISITION MODE= SIMULTANEOUS
##.ACQUISITION SCHEME= undefined
##.AVERAGES= 8
##.DIGITISER RES= 18
##SPECTROMETER/DATA SYSTEM= spect
##.PULSE SEQUENCE= zg30
##.SOLVENT NAME= CDCl3
##.SHIFT REFERENCE= (INTERNAL, CDCl3, 0, 15.7039)
##AUDIT TRAIL= $$ (NUMBER, WHEN, WHO, WHERE, WHAT)
$$ ##TITLE= Audit trail, XWIN-NMR		Version 3.5
$$ ##JCAMPDX= 5.01
$$ ##ORIGIN= Bruker BioSpin GmbH
$$ ##OWNER= she
$$ F:/spectra/data/she/nmr/H-F/1/audita.txt
$$ ##AUDIT TRAIL=  $$ (NUMBER, WHEN, WHO, WHERE, WHAT)
(   1,<2021-12-06 13:03:59.06 +0400>,<she>,<DPX200>,
      <created by zg, POWCHK disabled, PULCHK disabled
       configuration hash MD5:
       00 E9 B6 7A A2 85 ED C7 34 08 36 98 17 FE 4E 26
       data hash MD5: 16K
       32 1A 7D 39 D7 AA 4D 20 FA 87 02 34 79 5E 72 40>)
$$ ##END=
$$ 
$$ hash MD5
$$ 10 31 F0 3C 7C 18 E9 9D D0 ED E6 B9 9B C2 20 0A
##$RELAX= 
##$RELAX= 
##$RELAX= 
##$RELAX= 
##$RELAX= 
##$RELAX= 
$$ Bruker specific parameters
$$ --------------------------
##$DU= <F:/spectra>
##$EXPNO= 1
##$NAME= <H-F>
##$PROCNO= 1
##$TYPE= <nmr>
##$USER= <she>
##$AMP= (0..31)
100 100 100 100 100 100 100 100 100 100 100 100 100 100 100 100 100 100 
100 100 100 100 100 100 100 100 100 100 100 100 100 100 
##$AQSEQ= 0
##$AQ_mod= 1
##$AUNM= <au_zg>
##$AUTOPOS= <>
##$BF1= 200.13
##$BF2= 200.13
##$BF3= 200.13
##$BF4= 200.13
##$BF5= 200.13
##$BF6= 200.13
##$BF7= 200.13
##$BF8= 200.13
##$BYTORDA= 1
##$CFDGTYP= 0
##$CFRGTYP= 5
##$CHEMSTR= <none>
##$CNST= (0..31)
1 1 145 1 1 1 1 1 1 1 1 1 1 1 1 1 1 1 1 1 1 1 1 1 1 1 1 1 1 1 1 1 
##$CPDPRG= <>
##$CPDPRG1= <>
##$CPDPRG2= <>
##$CPDPRG3= <>
##$CPDPRG4= <mlev>
##$CPDPRG5= <mlev>
##$CPDPRG6= <mlev>
##$CPDPRG7= <mlev>
##$CPDPRG8= <mlev>
##$CPDPRGB= <>
##$CPDPRGT= <>
##$D= (0..31)
0 1.2 0 0 0 0 0 0 0 0.06 0 0.03 0 0 0 0 0.0002 0 0 0 0 0 0 0 0 0 0 0 0 
0 0 0 
##$DATE= 1638781438
##$DBL= (0..7)
120 120 120 120 120 120 120 120 
##$DBP= (0..7)
150 150 150 150 150 150 150 150 
##$DBP07= 0
##$DBPNAM0= <>
##$DBPNAM1= <>
##$DBPNAM2= <>
##$DBPNAM3= <>
##$DBPNAM4= <>
##$DBPNAM5= <>
##$DBPNAM6= <>
##$DBPNAM7= <>
##$DBPOAL= (0..7)
0.5 0.5 0.5 0.5 0.5 0.5 0.5 0.5 
##$DBPOFFS= (0..7)
0 0 0 0 0 0 0 0 
##$DE= 6
##$DECBNUC= <off>
##$DECIM= 32
##$DECNUC= <off>
##$DECSTAT= 4
##$DIGMOD= 1
##$DIGTYP= 9
##$DL= (0..7)
0 120 120 120 120 120 120 120 
##$DP= (0..7)
150 150 150 150 150 150 150 150 
##$DP07= 0
##$DPNAME0= <>
##$DPNAME1= <>
##$DPNAME2= <>
##$DPNAME3= <>
##$DPNAME4= <>
##$DPNAME5= <>
##$DPNAME6= <>
##$DPNAME7= <>
##$DPOAL= (0..7)
0.5 0.5 0.5 0.5 0.5 0.5 0.5 0.5 
##$DPOFFS= (0..7)
0 0 0 0 0 0 0 0 
##$DQDMODE= 0
##$DR= 18
##$DS= 0
##$DSLIST= <SSSSSSSSSSSSSSS>
$$ [...]
##$SUBNAM2= <"">
##$SUBNAM3= <"">
##$SUBNAM4= <"">
##$SUBNAM5= <"">
##$SUBNAM6= <"">
##$SUBNAM7= <"">
##$SUBNAM8= <"">
##$SUBNAM9= <"">
##$SW= 18.0517287032376
##$SWIBOX= (0..15)
0 0 2 0 0 0 0 0 0 0 0 0 0 0 0 0 
##$SW_h= 3612.71676300578
##$TD= 16384
##$TD0= 1
##$TE= 0
##$TE2= 300
##$TE3= 300
##$TEG= 300
##$TL= (0..7)
0 120 120 120 120 120 120 120 
##$TP= (0..7)
150 150 150 150 150 150 150 150 
##$TP07= 0
##$TPNAME0= <>
##$TPNAME1= <>
##$TPNAME2= <>
##$TPNAME3= <>
##$TPNAME4= <>
##$TPNAME5= <>
##$TPNAME6= <>
##$TPNAME7= <>
##$TPOAL= (0..7)
0.5 0.5 0.5 0.5 0.5 0.5 0.5 0.5 
##$TPOFFS= (0..7)
0 0 0 0 0 0 0 0 
##$TUNHIN= 0
##$TUNHOUT= 0
##$TUNXOUT= 0
##$USERA1= <user>
##$USERA2= <user>
##$USERA3= <user>
##$USERA4= <user>
##$USERA5= <user>
##$V9= 5
##$VALIST= <valist>
##$VCLIST= <CCCCCCCCCCCCCCC>
##$VD= 0
##$VDLIST= <DDDDDDDDDDDDDDD>
##$VPLIST= <PPPPPPPPPPPPPPP>
##$VTLIST= <TTTTTTTTTTTTTTT>
##$WBST= 1024
##$WBSW= 4
##$XGAIN= (0..3)
0 0 0 0 
##$XL= 0
##$YL= 0
##$YMAX_a= 557984
##$YMIN_a= -717690
##$ZGOPTNS= <>
##$ZL1= 120
##$ZL2= 120
##$ZL3= 120
##$ZL4= 120
##$ABSF1= 10
##$ABSF2= 0
##$ABSG= 5
##$ABSL= 3
##$ALPHA= 0
##$AQORDER= 0
##$ASSFAC= 0
##$ASSFACI= 0
##$ASSFACX= 0
##$ASSWID= 0
##$AUNMP= <proc_1d>
##$AZFE= 0.1
##$AZFW= 0.1
##$BCFW= 1
##$BC_mod= 2
##$BYTORDP= 1
##$COROFFS= 0
##$CY= 11.3945322036743
##$DATMOD= 1
##$DC= 2
##$DFILT= <>
##$DTYPP= 0
##$F1P= 2.36226072786647
##$F2P= -0.459571619588291
##$FCOR= 0.5
##$FTSIZE= 0
##$FT_mod= 4
##$GAMMA= 1
##$GB= 0.15
##$INTBC= 1
##$INTSCL= 1
##$ISEN= 128
##$LB= 0.24
##$LEV0= 0
##$LPBIN= 0
##$MAXI= 10000
##$MC2= 0
##$MEAN= 0
##$ME_mod= 0
##$MI= 1.114404
##$NCOEF= 0
##$NC_proc= 0
##$NLEV= 6
##$NOISF1= 3.799351
##$NOISF2= 2.8
##$NSP= 1
##$NTH_PI= 0
##$NZP= 0
##$OFFSET= 15.70392
##$PC= 1
##$PHC0= -15526.47
##$PHC1= 29.6008
##$PH_mod= 1
##$PKNL= yes
##$PPARMOD= 0
##$PSCAL= 0
##$PSIGN= 0
##$REVERSE= no
##$SF= 200.130013532006
##$SI= 16384
##$SIGF1= 3
##$SIGF2= 2
##$SINO= 400
##$SIOLD= 16384
##$SREGLST= <1H.CDCl3>
##$SSB= 0
##$STSI= 0
##$STSR= 0
##$SW_p= 3612.71676300578
##$SYMM= 0
##$S_DEV= 0
##$TDeff= 0
##$TDoff= 0
##$TI= <>
##$TILT= no
##$TM1= 0
##$TM2= 0
##$TOPLEV= 0
##$USERP1= <user>
##$USERP2= <user>
##$USERP3= <user>
##$USERP4= <user>
##$USERP5= <user>
##$WDW= 1
##$XDIM= 8192
##$YMAX_p= 0
##$YMIN_p= 0
$$ End of Bruker specific parameters
$$ ---------------------------------
##NTUPLES= NMR FID
##VAR_NAME=  TIME,          FID/REAL,        FID/IMAG
##SYMBOL=    X,             R,               I
##VAR_TYPE=  INDEPENDENT,   DEPENDENT,       DEPENDENT
##VAR_FORM=  AFFN,          ASDF,            ASDF
##VAR_DIM=   8192,          8192,            8192
##UNITS=     SECONDS,       ARBITRARY UNITS, ARBITRARY UNITS
##FACTOR=    0.0002768,     1,               1
##FIRST=     0,             0,               0
##LAST=      2.2672688,     0,               0
##MIN=       0,             -717690,         0
##MAX=       2.2672688,     557984,          0
$$ Real data points
##PAGE= N=1
##DATA TABLE= (X++(R..R)), XYDATA
$$ plain form
0 0 0 0 0 0 0 0 0 8 -8 8 -8 13 -16 16 -24 32 -40 48 -56 64 -80 96 -112 136 -160 184 -216 248 -288 328
30 328 -376 431 -487 551 -624 703 -789 885 -990 1107 -1228 1365 -1517 1681 -1858 2054
46 2054 -2266 2498 -2754 3035 -3342 3683 -4060 4479 -4946 5476 -6078 6767 -7566 8506
60 8506 -9635 11015 -12746 14995 -18049 22448 -29377 41922 -71837 297223 -27823 -634041
72 -634041 139145 479251 -34848 -408056 -31005 188302 121774 53540 -18022 -189285 -19608
83 -19608 240562 19634 -385254 -144057 328201 200884 -229267 -148490 169110 139752 -82604
94 -82604 -120160 -78382 -5987 124408 102206 -121655 -101168 188184 180898 -156256 -195509 80394
106 80394 121968 -62244 -63508 43425 38064 39944 65492 -54369 -137283 21890 111554 -75063
$$ packed form
0@%%%%%%%Qj6J6j6K1k9L2m0N6p2Q8j04J20j44J76k08K48k96L44m00M64n36O16
30C28p04Q07r18J038j175J327j492J674j875K097k335K593k882L198l539L912
46B054m320M764n252N789o377P025p743Q539r425J0422j1554J2845j4333J6072
60H506j8141K0650k3761K7741l3044M0497n1825P1299j13759L69060l25046o06218
72f34041P73186L40106n14099l73208L77051K19307o6528o8234p1562j71263J69677
83a9608K60170k20928m04888K41197M72258j27317m30151Q0777L17600k9358k22356
94h2604l7556M1778P2395J30395k2202k23861K0487K89352p286l37154l9253K75903
106H0394M1574j84212j264J06933n361J880K5548j19861q2914J59173Q9664j86617
$$ plain form
118 -75063 -141890 78703 146245 -57060 -87934 85193 42129 -135705 -44649 125055 -4040
129 -4040 -141340 48720 191691 -14770 -153157 32464 130362 -47978 -124159 23296 80916
140 80916 -3147 -9919 34120 -2777 -23801 19475 -7299 -74659 -24897 57872 13624 -44817
152 -44817 12802 54312 -14179 -48924 6337 13136 -42529 -20611 52318 32494 -28795 4054
164 4054 54229 4420 -47222 -7055 21645 -12285 -10034 30962 16535 -17449 8642 29129
176 29129 -18518 -47459 -7569 15685 -9177 -13521 8427 6705 3209 18605 -2777 -49551 -23160
189 -23160 47233 23244 -57616 -26328 79209 62118 -51478 -56928 41996 54673 -31960 -56210
201 -56210 10356 50617 21683 -17113 -23477 4093 29039 1546 -50750 -36402 29760 35869
$$ packed form
118g5063o6827K20593O7542k03305l0874J73127m3064j77834R1056J69704j29095
129d040j37300J90060J42971k06461j38387J85621R7898j78340p6181J47455N7620
140H0916q4063o772M4039l6897k1024M3276k6774o7360M9762Q2769m4248n8441
152d4817N7619M1510o8491l4745N5261O799n5665K1918P2929j9824o1289L2849
164D054N0175m9809n1642M0167K8700l3930K251M0996j4427l3984K6091K0487
176B9129m7647k8941L9890K3254k4862m344K1948j722l496J5396k1382m6774K6391
189b3160P0393k3989q0860L1288J05537j7091j13596n450R8924J2677q6633k4250
201e6210O6566M0261k8934l8796o364K7570K4946k7493n2296J4348O6162O109
$$ plain form
213 35869 -21660 -33856 16128 31745 -7596 -29836 -12885 2989 7918 11291 176 -12338
225 -12338 12224 39918 6938 -41002 -14911 38292 18076 -33571 -16704 33891 28604 -12534
237 -12534 -20606 -2454 5954 -339 -15215 -22386 -1007 24560 7883 -24295 -11748 21240 8293
250 8293 -27634 -18358 17830 14919 -9576 -1544 20083 9653 -7244 1903 7307 -7478 -6803 12175
264 12175 9130 -7160 979 14073 1037 -13029 -6231 -1262 -7898 -6092 502 -3376 -3152 7647
278 7647 3930 -13303 -9515 9011 3232 -14996 -5029 18814 12574 -7683 -1223 15585 6111 -10390
292 -10390 -2294 8773 1487 -2065 6804 5276 -3648 847 4075 -8488 -12492 873 1552 -9557
306 -9557 -5052 6455 546 -7599 -529 2382 -7105 -6345 5093 4365 -4471 1838 13486 6759 -5811
$$ packed form
213C5869n7529j2196M9984J5617l9341k2240J6951J5874M929L373j1115j2514
225a2338K4562K7694l2980m7940K6091N3203k0216n1647J6867N0595n287m1138
237a2534q072J8152Q408o293j4876p171K1379K5567j6677l2178J2547L2988j2947
250H293l5927R276L6188k911k4495Q032K1627j0430j6897R147N404j4785O75J8978
264A2175l045j6290Q139J3094j3036j4066O798M969o636J806O594l878K24J0799
278G647l717j7233L788J8526n779j8228R967K3843o240k0257O460J6808r474j6501
292a0390Q096J1067p286l552Q869j528q924M495L228j2563m004J3365O79j1109
306i557M505J1507n909q145P070K911r487P60J1438p28q836O309J1648o727j2570
$$ plain form
321 -5811 284 10755 1981 -8055 1329 10008 1884 -3236 3419 2759 -4317 -3013 -1781 -8112 -5881
336 -5881 3304 -529 -8781 -1430 6846 -2301 -10398 -1487 5126 -1881 -4576 3795 7583 2425 1642
351 1642 5475 3049 -1302 1971 5131 77 -2456 4401 6616 -961 -4117 363 132 -4673 -4144 -2836
367 -2836 -5257 -1775 3481 -2085 -8520 -1184 5949 -1998 -9283 -1344 6640 3572 -1411 889 4798
382 4798 5985 3351 -173 -1127 2240 5228 2979 -2109 -1834 4651 4605 -3774 -6976 -1186 718 -3529
398 -3529 -5223 -2845 -1882 -614 562 -3095 -5387 -383 2817 -1382 -3047 1207 4072 3723 2719 2440
414 2440 1468 2445 3505 2541 79 -160 2205 3885 1795 -2358 -3093 -751 596 -1446 -6063 -6996 -458
431 -458 5108 -1116 -11497 -5251 8785 5109 -10707 -9400 7308 11358 -1231 -7777 1456 10831
$$ packed form
321e811O095J0471q774j0036R384Q679q124n120O655o60p076J304J232o331K231
336e881R185l833q252P351Q276r147q097Q911O613p007k695Q371L788n158p83
351A642L833k426m351L273L160n054k533O857K215p577l156M480k31m805N29J308
367b836k421L482N256n566o435P336P133p947p285P939P984l068m983K300L909
382D798J187k634l524r54L367K988k249n088K75O485m6q379l202N790J904m247
398c529j694K378R63J268J176l657k292N004L200m199j665M254K865l49j004k79
414B440r72R77J060r64k462k39K365J680k090m153p35K342J347k042m617r33O538
431d58N566o224j0381O246J4036l676j5816J307J6708M050j2589o546R233R375
$$ plain form
445 10831 7747 -2515 -5521 2646 9912 5046 -5103 -5854 4093 10038 526 -11965 -7490 6612
459 6612 5935 -8683 -11940 343 7693 -125 -9830 -6463 4135 6405 -2819 -7393 607 7404 4226
474 4226 -462 -68 2353 3971 4703 1416 -2421 472 6051 3109 -3121 -2717 2199 1339 -3068 -3305
490 -3305 -1340 -3379 -4462 787 2250 -6415 -9047 4245 9340 -6504 -13894 3455 15401 1478
504 1478 -11873 -1347 12943 8414 -4913 -5750 4580 10084 3792 -5080 -4834 2913 7631 2164
518 2164 -8074 -8536 3482 8951 -3948 -15999 -5075 11096 5681 -12860 -12637 6259 12247 -3602
532 -3602 -13897 -344 13851 5119 -8267 -2840 8547 6624 -68 -1083 -263 1842 6683 3996
546 3996 -5881 -4631 6054 5321 -7449 -8889 3386 5578 -5941 -9792 1623 5223 -5906 -7982
$$ packed form
445A0831l084j0262l006Q167P266m866j0149p51R947N945r512j2491M475J4102
459F612o77j4618l257J2283P350p818r705L367J0598K270r224m574Q000O797l178
474D226m688L94K421J618P32l287l837K893N579k942o230M04M916q60m407k37
490c305J965k039j083N249J463q665k632J3292N095j5844p390J7349J1946j3923
504A478j3351J0526J4290m529j3327q37J0330N504o292q872K46P747M718n467
518B164j0238m62J2018N469j2899j2051J0924J6171n415j8541K23J8896N988j5849
532c602j0295J3553J4195q732j3386N427J1387j923o692j015Q20K105M841k687
546C996r877J250J0685p33j2770j440J2275K192j1519l851J1415L600j1129k076
$$ plain form
560 -7982 4251 5381 -6655 -5819 7082 6102 -5709 -3144 8448 7331 -2141 -3289 4009 6106
574 6106 948 -1709 1133 2256 91 -128 881 -2996 -4705 1560 3639 -6025 -10072 1886 7990
589 7990 -4672 -12466 -688 9612 867 -10035 -3122 8963 6044 -4430 -3268 5533 6102 757
603 757 -62 1049 1245 3444 3842 -2561 -4255 3929 6014 -4348 -8205 663 4364 -3561 -7196 -938
619 -938 3153 -1745 -5961 -1290 2872 -977 -3757 996 4315 99 -2497 2206 4914 1347 -1011
634 -1011 2121 4127 2187 -417 271 1998 1128 -434 -270 -489 -2526 -1714 1192 -1242 -6259 -3046
650 -3046 3199 -248 -6808 -3423 3603 2246 -3935 -3991 2638 5129 1136 -2230 88 4445 4987 483
666 483 -2343 1533 5980 3191 -3532 -2822 3287 3572 -2734 -4508 -114 1651 -1706 -3861 -2985 -1033
$$ packed form
560g982J2233J130j2036Q36J2901r80j1811K565J1592j117r472j148P298K097
574F106n158k657K842J123k165k19J009l877j709O265K079r664m047J1958O104
589G990j2662p794J1778J0300q745j0902O913J2085k919j0474J162Q801N69n345
603G57q19J111J96K199L98o403j694Q184K085j0362l857Q868L701p925l635O258
619i38M091m898m216M671M162l849k780M753L319m216k596M703K708l567k358
634a011L132K006j940k604O88J727q70j562J64k19k037Q12K906k434n017L213
650c046O245l447o560L385P026j357o181n6O629K491l993l366K318M357N42m504
666D83k826L876M447k789o723P10O109K85o306j774M394J765l357k155Q76J952
$$ plain form
682 -1033 389 -738 -3532 -2647 1043 1402 -1308 -1406 1502 2529 1216 1321 1181 1206 2490 3171 937
699 937 -824 1184 3622 868 -3160 -665 3023 -62 -4585 -2301 1094 -1099 -3432 -1860 -1005 -1504
715 -1504 -1491 -993 -1504 -507 1154 68 -661 845 2318 1242 570 2069 2515 1337 1008 2012 1487 41
733 41 553 1300 9 -2038 -1034 770 -1254 -3412 -1166 386 -1859 -3145 -1102 -456 -852 -944 -980 -750
751 -750 942 1817 -94 -673 2304 3486 725 -154 2822 3290 825 -22 1065 1987 -75 -563 58
768 58 -328 -1217 -1604 -498 -1647 -2250 -1467 -571 -1825 -2131 -588 -35 -848 -554 652 444 677 1682 1040
787 1040 354 1681 2577 1008 470 2140 1892 599 118 759 614 -435 -1108 -943 -495 -1437 -1833 -1220
805 -1220 -1213 -1913 -1560 -761 -1131 -1441 -597 221 -15 370 527 797 1411 1765 1043 773 2034 1908 843 531
$$ packed form
682a033J422j127k794Q85L690L59k710r8K908J027j313J05j40K5J284O81k234
699I37j761K008K438k754m028K495L688l085m523K284L395k193k333J572Q55m99
715a504J3M98n11R97J661j086p29J506J473j076o72J499M46j178l29J004n25j446
733D1N12P47j291k047J004J804k024k158K246J552k245j286K043O46l96r2l6K30
751g50J692Q75j911n79K977J182k761q79K976M68k465q47J087R22k062m88O21
768E8l86q89l87J106j149o03P83Q96j254l06J543N53q13K94J206k08K33J005o42
787A040o86J327Q96j569n38J670k48j293m81O41j45j049o73J65M48r42l96O13
805a220Pp00L53P99l70l10Q44Q18k36L85J57K70O14L54p22k70J261j26j065l12
$$ plain form
825 531 1418 1596 204 -544 -45 312 -373 -1525 -1786 -748 -787 -1964 -2157 -1548 -567 -892 -1242 -1089 -381
844 -381 661 455 -199 520 1590 1622 750 1224 1478 1419 1573 1326 499 616 1056 688 -510 -816 -469 -299
864 -299 -846 -1755 -2036 -879 -855 -2287 -1524 -631 -590 -887 -186 175 -347 535 1522 698 484 925 1750 1823 1393
885 1393 719 1097 1862 1324 -158 -458 29 588 -371 -1629 -1929 -671 -113 -1654 -2617 -1428 -29 -743
903 -743 -1775 -1499 -326 409 515 -384 -311 1086 2411 881 90 1136 2232 1908 569 497 970 1065 333
922 333 -583 -519 -92 -251 -850 -1419 -1686 -1185 -510 -896 -1945 -1734 -339 24 -827 -837 -113 396 775 549
942 549 490 1005 1769 1961 898 450 1386 1743 1298 225 -467 291 1167 65 -1892 -1945 352 373 -2084
961 -2084 -3102 -890 734 -1111 -2375 -1378 637 459 -504 -756 102 1207 1746 1113 -127 297 2757
$$ packed form
825E31Q87J78j392p48M99L57o85j152k61J038l9j177j93O09R81l25l50J53P08
844c81J042k06o54P19J070L2q72M74K54n9J54k47q27J17M40l68j198l06L47J70
864b99n47r09k81J157K4j432P63Q93M1k97P01L61n22Q82R87q24k14M41Q25P3m30
885A393o74L78P65n38j482l00M87N59r59j258l00J258N58j541r63J189J399p14
903g43j032K76J173P35J06q99P3J397J325j530p91J046J096l24j339p2M73R5p32
922C33r16O4M27j59n99n69k67N01O75l86j049K11J395L63q51j0P24N09L79k26
942E49n9N15P64J92j063m48R36L57m45j073o92P58Q76j102j957n3K297K1k457
961b084j018K212J624j845j264R97K015j78r63k52Q58J105N39o33j240M24K460
$$ plain form
978 2757 2739 -386 -682 1923 2801 -562 -1758 511 1430 -808 -1653 -1085 -373 -1118 -1450 -1105 -1150 -1099 -572
997 -572 -325 -1067 -1521 -119 1132 224 -334 677 1748 1046 407 1081 1643 1082 504 725 792 294 128
1016 128 320 381 -849 -1814 -470 512 -1216 -3011 -1045 630 -937 -2748 -1178 672 174 -1033 -291
1033 -291 430 235 786 1161 606 334 1652 2250 372 -653 1457 2723 582 -1810 -473 1501 50
1050 50 -2019 -1360 251 -486 -1285 -1431 -1391 -906 -322 -451 -1155 -630 270 330 -441 -343 698 1338 1216 634
1070 634 571 1314 1842 994 -77 757 1431 57 -577 274 400 -583 -1211 -851 -528 -1126 -1505 -477 -594
1089 -594 -1582 -1780 -185 178 -959 -959 731 685 -197 772 806 397 697 1801 1356 171 466 1712 649
1108 649 -670 30 900 215 -1007 -1153 -440 -150 -946 -1453 -961 -1103 -650 -760 -1000 -916 -171 442 6 -550
$$ packed form
978B757j8l125k96K605Q78l363j196K269R19k238q45N68P12p45l32L45m5N1N27
997e72K47p42m54J402J251r08n58J011J071p02o39O74N62n61n78K21O7m98j66
1016A28J92O1j230r65J344R82j728j795J966J675j567j811J570J850m98j207P42
1033b91P21j95N51L75n55k72J318N98j878j025K110J266k141k392J337J974j451
1050E0k069O59J611p37p99j46M0M85N84j29p04N25R00O0p71R8J041O40j22n82
1070F34o3P43N28q48j071Q34O74j374o34Q51J26r83o28L60L23n98l79J028j17
1089e94r88j98J595L63j137%J690m6q82R69L4m09L00J104m45j185K95J246j063
1108F49j319P00Q70o85j222j46P13K90p96n07M92j42M53j10k40Q4P45O13m36n56
$$ plain form
1128 -550 713 1357 369 661 1277 1009 1151 1178 463 553 1319 1137 -167 -388 442 79 -945 -766 -388 -838
1148 -838 -1138 -1317 -790 -719 -963 -793 -671 -496 -542 171 454 289 299 1266 1139 308 883 1429 688 336 1322
1169 1322 1171 -155 98 610 -334 -438 -99 -362 -1045 -929 -771 -960 -926 -962 -657 -614 -876 -580 19 380
1189 380 -350 142 823 602 450 836 1004 290 1017 1379 878 318 800 478 -111 -5 -276 -583 -705 -246
1209 -246 -722 -1277 -912 -831 -968 -977 -741 -518 -365 -437 87 29 173 227 917 714 386 956 1249 684 489 1055
1231 1055 1023 579 209 440 146 -306 -321 -47 -623 -863 -600 -829 -1059 -1271 -963 -633 -616 -939 -612 169 -25
1252 -25 -91 403 687 526 789 861 780 968 1024 933 197 609 947 242 62 -232 -25 -382 -656 -752 -961 -854
1274 -854 -566 -693 -1133 -518 -425 -464 -548 -347 -36 379 299 186 683 892 623 825 1087 614 913 772 475
$$ packed form
1128e50J263O44r88K92O16k68J42K7p15R0P66j82j304k21Q30l63j024J79L78m50
1148h38l00j79N27P1k44J70J22J75m6P13K83j65J0R67j27q31N75N46p41l52R86
1169A322j51j326K53N12r44j04L39k63o83J16J58j89L4l6L05M3k62K96N99L61
1189C80p30M92O81k21j52L86J68p14P27L62n01n60M82l22n89J06k71l07j22M59
1209b46m76n55L65Q1j37rK36K23J53p2N24n8J44N4O90k03l28N70K93n65j95N66
1231A055l2m44l70K31k94m52j5K74n76k40K63k29k30k12L08L30J7l23L27P81j94
1252b5o6M94K84j61K63P2q1J88N6r1p36M12L38p05j80k94K07l57k74r6k09J07
1274h54K88j27m40O15R3l9q4K01L11M15q0j13M97K09k69K02K62m73K99j41k97
$$ plain form
1295 475 346 448 272 -220 -502 44 -358 -701 -983 -540 -776 -1116 -814 -994 -708 -837 -350 -209 -385 -167
1315 -167 322 200 528 412 894 897 767 846 768 396 651 443 534 120 -142 23 -378 -391 -562 -688 -807 -622
1337 -622 -650 -908 -537 -462 -318 -409 -164 -615 -52 25 308 197 484 502 733 791 845 854 668 454 704 567 389
1360 389 -68 -137 -27 -193 -834 -677 -475 -692 -564 -663 -509 -593 -684 -420 -414 -248 -216 385 350 271 417 835 937
1383 937 658 554 904 930 564 306 604 359 -7 43 -187 -190 -495 -591 -726 -675 -636 -621 -758 -612 -502 -513 -270
1406 -270 -170 -113 -160 414 447 399 364 788 785 617 874 531 728 628 666 500 227 -110 27 -16 -276 -714 -467
1429 -467 -235 -980 -1207 -807 -525 -491 -711 -376 -148 61 142 -70 610 481 665 686 650 682 494 668 915 393
1451 393 430 162 392 105 -405 -130 -109 -436 -512 -397 -610 -736 -675 -933 -594 -674 -378 -312 73 33 -15 258 263
$$ packed form
1295D75j29J02j76m92k82N46m02l43k82M43k36l40L02j80K86j29M87J41j76K18
1315a67M89j22L28j16M82Lj30P9p8l72K55k08R1m14k62J65m01j3j71j26j19J85
1337f22k8k58L71P5J44r1K45m51N63P7K83j11K87J8K31N8N4Rj86k14K50j37j78
1360C89m57o9J10j66o41J57K02k17J28r9J54q4r1K64OJ66L2O01l5p9J46M18J02
1383I37k79j04L50K6l66k58K98k45l66N0k30ll05r6j35N1L9J5j37J46J10j1K43
1406b70J00N7m7N74L3m8l5M24lj68K57l43J97j00L8j66k73l37J37m3k60m38K47
1429d67K32p45k27M00K82L4k20L35K28K09Q1k12O80j29J84K1l6L2j88J74K47n22
1451C93L7k68K30k87n10K75K1l27p6J15k13j26O1k58L39q0K96O6L85m0m8K73N
$$ plain form
1474 263 603 408 725 927 499 545 519 1038 396 467 169 367 175 -303 -247 -582 -636 -536 -358 -678 -752 -583
1496 -583 -210 -576 -592 -436 243 -94 -68 259 532 456 354 666 710 667 688 813 464 425 564 323 106 129 26
1519 26 -268 -321 -564 -608 -472 -651 -915 -500 -414 -644 -657 -110 -74 -323 -271 154 319 632 161 278 455 780
1541 780 591 453 622 565 374 -59 497 152 -99 33 -123 -390 -797 -578 -539 -951 -640 -495 -532 -516 -503 -207
1563 -207 3 -307 -65 78 751 368 339 844 772 530 695 667 396 502 584 180 84 -97 147 -115 -505 -304
1585 -304 -355 -626 -835 -735 -726 -625 -233 -462 -436 -77 -61 3 -27 426 286 616 449 625 783 613 301 456
1607 456 765 343 166 335 17 -198 -160 64 -665 -673 -497 -573 -799 -513 -497 -491 -526 -309 -69 96 367 201 247
1630 247 351 348 388 455 641 562 512 677 347 285 21 126 16 202 -171 -300 -306 -229 -539 -935 -504 -365 -765
$$ packed form
1474B63L40j95L17K02m28M6k6N19o42P1k98J98j92m78N6l35n4J00J78l20p4J69
1496e83L73l66j6J56O79l37K6L27K73p6j02L12M4m3K1J25l49l9J39k41k17K3j03
1519B6k94n3k43m4J36j79k64M15Q6k30j3N47L6k49N2M25J65L13m71J17J77L25
1541G80j89j38J69n7j91m33N56l45k51J32j56k67m07K19L9m12L11J45l7J6J3K96
1563b07K10l10K42J43O73l83k9N05p2k42J65k8k71J06Q2m04r6j81K44k62l90K01
1585c04n1k71k09J00RJ01L92k29K6L59J6O4l0M53j40L30j67J76J58j70l12J55
1607D56L09m22j77J69l18k15L8K24p29qJ76p6k26K86J6Ol5K17K40J65K71j66M6
1630B47J04lM0O7J86p9n0J65l30o2k64J05j10J86l73j29oP7l10l96M31J39m00
$$ plain form
1653 -765 -238 -202 -545 -419 86 232 -100 308 158 331 328 855 684 607 460 785 582 269 493 307 148
1674 148 44 -66 -126 -230 -583 -792 -642 -546 -651 -322 -423 -485 -414 77 -206 -351 94 224 249 534 591 322
1696 322 683 772 677 408 384 342 531 121 24 157 -94 -301 -223 -200 -370 -531 -559 -420 -720 -519 -546 -254 -256 -179
1720 -179 187 -199 95 552 379 191 380 779 385 515 660 653 364 425 549 175 -199 -200 -20 5 -299 -397
1742 -397 -114 -702 -512 -519 -354 -716 -335 -409 -336 -46 -72 181 23 348 454 517 462 546 406 462 520 649 637 175
1766 175 134 82 -68 29 -354 -203 -334 -620 -578 -311 -743 -475 -211 -210 -428 -170 129 -5 92 287 449 482 10
1789 10 589 323 437 703 419 505 463 286 223 151 42 -24 -272 -181 -195 -449 -417 -494 -471 -436 -564 -478 -456 -159 -238
1814 -238 -222 154 -167 214 490 401 461 628 566 282 415 455 443 240 491 142 66 -27 -271 -159 -326 -426 -550
$$ packed form
1653g65N27L6l43J26N05J46l32M08j50J73lN27j71p7j47L25k03l13K24j86j59
1674A48j04j10o0j04l53k09J50R6j05L29j01o2P1M91k83j45M45J30K5K85N7k69
1696C22L61Q9r5k69k4m2J89m10r7J33k51k07P8K3j70j61k8J39l00K01k7K92kP7
1720a79L66l86K94M57j73j88J89L99l94J30J45pk89O1J24l74l74jJ80K5l04r8
1742c97K83n88J90pJ65l62L81p4P3K90k6K53j58L25J06O3n5Q4j40N6N8J29j2m62
1766A75m1n2j50R7l83J51j31k86M2K67m32K68K64Jk18K58K99j34R7J95J62L3m72
1789A0N79k66J14K66k84Q6m2j77o3p2j09o6k48R1j4k54L2p7K3L5j28Q6K2K97p9
1814b38J6L76l21L81K76q9O0J67o2k84J33M0j2k03K51l49p6r3k44J12j67j00j24
$$ plain form
1837 -550 -559 -554 -574 -557 -465 -599 -174 -363 -22 -59 251 223 201 388 121 212 608 405 522 329 494 272 427 211
1861 211 236 163 -73 -127 -394 -562 -356 -456 -499 -583 -334 -519 -688 -262 -275 -110 177 139 144 45 532 485 451 540
1885 540 434 352 439 727 460 437 256 141 -155 6 -172 -255 -145 -377 -299 -522 -629 -646 -153 -399 -259 -415
1907 -415 -197 -216 98 84 399 235 401 497 260 174 442 113 553 545 326 261 374 235 -203 82 -446 -332
1929 -332 -90 -203 -352 -430 -398 -647 -438 -366 -248 -285 19 64 133 44 -45 348 566 182 265 708 340 171 177 250
1953 250 178 23 27 102 -102 -388 -374 -385 -489 -501 -121 -290 -542 -307 -259 -228 -99 -151 81 -70 275 324 171 233
1977 233 170 363 498 505 496 439 335 239 351 -6 168 -37 -52 -179 -217 -344 -283 -310 -382 -343 -583 -518 -181 -103 -62
2002 -62 -136 -227 210 108 216 283 67 247 356 617 240 364 101 373 138 -6 89 -295 -324 -182 -259 -455
$$ packed form
1837e50rNk0J7R2j34M25j89L41l7L10k8k2J87k67R1L96k03J17j93J65k22J55k16
1861B11K5p3k36n4k67j68K06j00m3q4K49j85j69M26j3J65K87l8Nr9M87m7l4Q9
1885E40j06q2Q7K88k67k3j81j15k96J61j78q3J10k32P8k23j07j7M93k46J40j56
1907d15K18j9L14j4L15j64J66R6k37q6K68l29M40qk19o5J13j39m38K85n28J14
1929c32K42j13j49p8L2k49K09P2J18l7L04M5O9q9q9L93K18l84Q3M43l68j69OP3
1953B50p2j55MP5k04k86J4j1j04j2L80j69k52K35M8L1J29n2K32j51L45M9j53O2
1977B33o3J93J35Prn7j04r6J12l57J74k05j5j27l8j27O1k7p2L9k40O5L37P8M1
2002f2p4r1M37j02J08O7k16J80J09K61l77J24k63K72k35j44R5l84k9J42p7j96
$$ plain form
2024 -455 -310 -604 -283 -265 -444 -374 -410 -76 -306 -99 11 -189 63 329 396 405 519 471 366 304 458 345 424
2047 424 115 26 -18 -117 -55 -171 -217 -130 -212 -545 -206 -172 -659 -398 -264 -92 -279 -223 -107 -67 229 327 315 198
2071 198 507 328 463 375 176 559 370 425 16 196 -72 -94 -166 -157 -376 -570 -585 -394 -304 -371 -194 -431 -540
2094 -540 -334 -185 -168 98 127 236 194 412 339 247 240 246 433 473 502 70 331 252 28 324 -240 -536 -249 -199
2118 -199 -430 -440 -444 -534 -483 -201 -354 -398 -93 97 -45 66 302 104 300 471 213 471 500 382 96 388
2140 388 369 -138 33 -24 86 -185 45 -293 -194 -447 -463 -690 -359 -400 -408 -401 -77 -69 41 -3 233 20 79 102 55
2165 55 395 261 310 465 509 126 142 267 186 206 94 115 -114 -11 -72 -268 -410 -426 -262 -375 -277 -471 -260
2188 -260 -137 -54 -165 192 -115 168 384 160 429 319 505 268 389 635 368 97 153 162 -54 -210 58
$$ packed form
2024d55J45k94L21J8j79P0l6L34k30K07J10k00K52K66O7RJ14m8j05o2J54j13P9
2047D24l09q9m4r9O2j16m6Q7q2l33L39L4m87K61J34J72j87N6J16M0K96R8j2j17
2071A98L09j79J35q8j99L83j89N5m09J80k68k2p2Rk19j94j5J91R0o7J77k37j09
2094e40K06J49J7K66K9J09m2K18p3r2pOJ87M0K9m32K61p9k24K96n64k96K87N0
2118a99k31j0mr0N1K82j53m4L05J90j42J11K36j98J96J71k58K58K9j18k86K92
2140C88j9n07J71n7J10k71K30l38R9k53j6k27L31m1qPL24QJ10m4K36k13N9K3m7
2165E5L40j34M9J55M4l83J6J25q1K0j12K1k29J03o1j96j42j6J64j13R8j94K11
2188b60J23Q3j11L57l07K83K16k24K69j10J86k37J21K46k67k71N6Rk16j56K68
$$ plain form
2209 58 -429 -323 -502 -244 -468 -255 -348 -233 -491 -541 -128 -78 4 -32 114 85 97 122 492 303 185 253 448
2232 448 611 160 480 142 16 25 20 -92 -216 -234 -454 -248 -372 -358 -365 -236 -295 -481 -397 -105 -30 -89 -11 197
2256 197 225 436 254 159 454 270 166 425 388 79 329 43 0 -181 -59 -107 34 -395 -275 -320 -582 -409
2278 -409 -150 -412 -247 -327 -139 -50 105 -69 54 223 59 219 352 188 100 408 421 279 364 393 31 -118
2300 -118 197 32 -100 -13 -51 -290 -373 -515 -284 -259 -262 -282 -313 -12 -15 -156 82 -191 90 248 310 203 531 455
2324 455 377 311 581 215 139 156 142 -80 -240 -119 148 -212 -380 -331 -281 -431 -372 -206 -331 -177 -369 -167 63
2347 63 -137 104 91 265 310 287 424 145 1 272 334 361 149 132 193 -37 -85 -116 -62 -58 -645 -425 -189 -304
2371 -304 -492 -464 -68 -102 -326 -136 -121 -51 -99 57 8 418 402 203 305 421 325 291 161 161 175 -28 221 3
$$ packed form
2209E8m87J06j79K58k24K13r3J15k58n0M13N0Q2l6J46k9J2K5L70j89j18O8J95
2232D48J63m51L20l38j26Rnj12j24j8k20K06j24J4pJ29n9j86Q4K92P5n9P8K08
2256A97K8K11j82r5K95j84j04K59l7l09K50k86m3j81J22m8J41m29J20m5k62J73
2278d09K59k62J65q0J88Q9J55j74J23J69j64J60J33j64q8L08J3j42Q5K9l62j49
2300a18L15j65j32Q7l8k39q3j42K31K5lk0l1L01lj41K38k73K81J58O2j07L28p6
2324D55p8o6K70l66p6J7j4k22j60J21K67l60j68M9N0j50N9J66j25J54j92K02K30
2347F3k00K41j3J74M5k3J37k79j44K71O2K7k12j7O1k30m8l1N4Mn87K20K36j15
2371c04j88K8L96l4k24J90J5P0m8J56m9M10j6j99J02J16r6l4j30%J4k03K49k18
$$ plain form
2395 3 1 -162 -243 -175 -264 -318 -406 -342 -281 -369 -340 -397 -267 -136 98 -278 90 2 93 188 345 467 21 384 412 56
2421 56 108 144 176 17 -42 -167 85 -364 -336 -465 -131 -305 -279 -214 -365 -237 -205 -388 75 33 65 13 93 198
2445 198 227 218 383 139 291 188 292 390 164 229 173 8 44 -116 -203 -222 -320 -213 -344 -359 -335 -462 -364 -90
2469 -90 -176 -109 -229 71 -241 131 533 230 399 377 322 433 353 567 428 -15 106 197 177 -108 -65 -22 -415
2492 -415 -116 -285 -399 -279 -558 -226 -80 -320 -193 -223 -161 -70 126 -87 135 318 80 299 533 146 346
2513 346 417 343 166 374 200 54 -111 -108 -97 -99 218 -281 9 -256 -143 -247 3 -310 -343 -7 -125 -166 128
2536 128 169 46 56 138 493 377 274 274 492 387 28 8 204 522 -52 -105 181 173 -21 -243 27 -297 -98
2559 -98 -441 -207 -275 -328 3 -232 -76 186 186 82 105 57 126 158 72 52 474 592 223 -8 255 196 -122 120
$$ packed form
2395Ckj63q1O8q9n4q8O4O1q8K9n7J30J31K34l76L68q8R1R5J57J22m46L63K8l56
2421E6N2L6L2j59n9j25K52m49K8j29L34j74K6O5j51J28L2j83M63m2L2n2Q0J05
2445A98K9rJ65k44J52j03J04R8k26O5n6j65L6j60q7j9r8J07j31j5K4j27R8K74
2469i0q6O7j20L00l12L72M02l03J69k2n5J11q0K14j39m43J21R1k0k85M3M3l93
2492d15K99j69j14J20k79L32J46k40J27l0O2R1J96k13K22J83k38K19K34l87K00
2513C46P1p4j77K08j74j46j65LJ1kL17m99K90k65J13j04K50l13l3L36j18m1K94
2536A28M1j23J0Q2L55j16j03%K18j05l59k0J96L18n74n3K86qj94k22K70l24J99
2559i8l43K34o8n3L31k35J56K62%j04K3m8O9L2q6k0M22J18l69k31K63n9l18K42
$$ plain form
2583 120 172 -251 -185 -366 -300 -373 -154 -161 -267 -337 -191 -297 -267 -202 -64 10 12 275 284 367 107 73 627 263 403
2608 403 452 280 189 50 212 157 -140 -241 -14 -210 -405 -80 -316 -405 -213 -173 -273 -279 -157 -241 96 222 84
2631 84 -27 9 91 328 211 14 412 34 259 119 -116 152 163 99 104 75 -172 -132 -224 -285 -264 -173 -190 -234 -229 40
2657 40 -305 -201 -84 -229 155 235 35 377 174 314 83 420 408 186 247 112 184 -171 -26 -109 -14 -68 157
2680 157 -180 -275 -100 -203 -157 -336 -193 -151 22 -163 -9 -265 -170 114 144 102 340 278 25 326 158 347
2702 347 175 66 53 165 127 68 -83 -39 -271 -195 -262 -178 -124 -105 -284 -380 -198 -105 -255 -116 -81 23 100 -193
2726 -193 147 158 122 305 342 160 502 189 48 247 -104 103 -5 92 -140 -116 -208 -206 42 -197 -159 -206 -380
2749 -380 -324 -320 -86 -83 95 -12 -340 -198 176 320 37 212 342 296 109 81 64 174 132 -27 56 64 95 -245
$$ packed form
2583A20N2m23O6j81O6p3K19pj06p0J46j06L0O5J38P4KK63RQ3k60l4N54l64J40
2608D03M9j72r1j39J62n5k97j01K27j96j95L25k36q9J92M0j00oJ22q4L37J26j38
2631H4j11L6Q2K37j17j97L98l78K25j40k35K68J1o4Nk9k47M0r2o1K1R1j7m4NK69
2657D0l45J04J17j45L84Q0k00L42k03J40k31L37j2k22O1j35P2l55J45q3R5n4K25
2680A57l37r5J75j03M6j79J43M2J73j85J54k56R5K84L0m2K38o2k53L01j68J89
2702C47j72j09j3J12l8n9j51M4k32P6o7Q4N4J9j79r6J82R3j50J39L5J04P7k93
2726a93L40J1l6J83L7j82L42l13j41J99l51K07j08R7k32K4r2KK48k39L8m7j74
2749c80N6MK34LJ78j07l28J42L74J44k83J75J30m6j87k8j7J10m2j59Q3QL1l40
$$ plain form
2773 -245 -43 -292 -157 47 -184 -110 20 -233 -210 -62 -298 -325 -25 -129 -6 -1 217 356 223 469 178 334
2795 334 308 107 63 269 -32 92 1 52 -86 121 85 -209 -139 -448 -306 -112 -129 44 -249 -305 -17 71 -185
2818 -185 45 142 294 155 -83 251 80 234 408 288 35 -50 124 46 -9 -134 -20 -283 -203 -266 -302 -397 -339
2841 -339 -144 -506 -255 47 -150 -275 74 -278 99 275 133 146 215 122 207 245 311 158 98 -31 160 372
2863 372 103 78 155 96 14 -333 -41 -433 -96 -29 -338 35 -274 -155 -165 -42 55 34 -40 377 131 121 179 285
2887 285 297 195 216 351 142 174 201 54 -48 -181 -12 -300 -101 -178 -40 -315 -167 -100 -97 -323 -384 -126 99
2910 99 -40 -40 -58 -43 -20 198 90 -109 212 145 -56 373 454 239 209 68 83 107 -86 -61 -23 -199 -401 -309 -120
2935 -120 -445 -200 -180 -341 -171 -21 -70 66 108 -37 221 -32 355 162 65 144 87 215 241 221 159 215 212 -149
$$ packed form
2773b45K02k49J35K04k31P4J30k53K3J48k36k7L00j04J23NK18J39j33K46k91J56
2795C34k6k01m4K06l01J24r1N1j38K07l6k94P0l09J42J94j7J73k93n6K88Q8k56
2818a85K30R7J52j39k38L34j71J54J74j20k53q5J74p8n5j25J14k63Q0o3l6r5N8
2841c39J95l62K51L02j97j25L49l52L77J76j42J3O9r3Q5L8O6j53o0j29J91K12
2863C72k69k5P7n9q2l47K92l92L37O7l09L73l09J19j0J23R7k1p4M17k46j0N8J06
2887B85J2j02K1J35k09L2K7j47j02j33J69k88J99p7J38k75J48O7Lk26o1K58K25
2910I9j39%j8J5K3K18j08j99L21o7k01M29Q1k15l0j41J5K4j93K5L8j76k02R2J89
2935a20l25K45K0j61J70J50m9J36M2j45K58k53L87j93r7P9n7J28K6k0o2N6ll61
$$ plain form
2959 -149 112 -7 -65 -2 -158 -120 -208 -198 -151 -262 -360 -359 -139 -88 264 116 112 84 306 167 215 223 61 12 166 340
2985 340 169 93 180 137 -24 67 -47 74 -18 -306 -123 -315 -161 -286 -75 -80 -100 33 -240 -201 21 128 35
3008 35 342 131 254 285 124 324 27 16 67 227 368 119 -116 -19 42 -15 -91 -321 -36 -169 -264 -70 -137
3031 -137 -200 51 -248 -162 -3 158 -144 191 8 199 105 121 -109 77 105 116 -16 125 334 120 -163 -55
3053 -55 -64 -203 -64 -203 -145 -82 -281 -285 -101 68 -371 -145 17 -188 236 75 52 -166 80 243 250 246 376 65
3077 65 20 273 298 110 148 -187 -96 -178 147 -35 -157 -388 21 -79 -120 -120 -321 -136 -179 -2 -38 -51 28 144
3101 144 127 -15 34 148 193 96 -22 191 188 302 220 83 117 -141 -59 94 -43 -60 -143 -296 -198 -248 -228 -128 -170
3126 -170 -264 -167 -34 -14 -30 -27 17 78 -144 195 72 274 32 91 162 234 145 36 8 -20 16 -194 25 -132 -261
$$ packed form
2959a49K61j19n8O3j56L8q8J0M7j11r8JK20N1L52j48mk8K22j39M8Qj62m9J54J74
2985C40j71p6Q7m3j61R1j14J21r2k88J83j92J54j25K11nk0J33k73L9K22J07r3
3008C5L07k11J23L1j61K00k97j1N1J60J41k49k35R7O1n7p6k30K85j33r5J94o7
3031a37o3K51k99Q6J59J61l02L35j83J91r4J6k30J86K8J1j32J41K09k14k83J08
3053e5rj39J39j39N8O3j99mJ84J69m39K26J62k05M24j61k3k18K46J63PmJ30l11
3077F5m5K53K5j88L8l35R1q2L25j82j22k31M09j00m1%k01J85m3J77l6j3P9J16
3101A44j7j42M9J14M5r7j18K13lJ14q2j37L4k58Q2J53j37j7q3j53R8n0K0J00m2
3126a70r4R7J33K0j6LM4O1k22L39j23K02k42N9P1P2q9j09k8k8L6k10K19j57j29
$$ plain form
3151 -261 -223 89 -292 -190 -259 -120 -101 -221 -104 2 -135 -42 -137 48 148 215 129 287 104 -359 -27 120
3173 120 -54 -22 123 60 17 96 -7 24 -50 38 -138 -78 -98 -178 -240 -68 6 -177 -113 -139 -169 111 100 -124 70
3198 70 139 115 215 225 235 312 415 266 156 183 -83 40 176 -168 -96 -228 -166 -200 -46 -220 -100 -145 68 -135
3222 -135 -178 -4 -34 -29 125 87 -110 284 -45 167 24 196 88 237 70 207 -63 -8 -104 92 10 -36 12
3245 12 -349 -288 -295 59 17 -178 -62 204 -4 72 111 -111 -110 -116 148 177 27 410 -2 173 157 395 175 247 140
3270 140 166 80 -56 107 170 82 -87 -225 -14 -10 -217 -114 -131 -130 -110 -38 -12 -181 -56 27 11 -30 127 -32 45
3295 45 40 -40 200 123 65 -206 44 110 5 -69 66 -287 14 63 -192 -27 -274 84 -161 -202 -33 -105 109 24
3319 24 77 188 161 157 90 326 -30 -151 228 239 -152 207 187 220 310 -65 20 -100 -263 -152 35 -292 27 -205
$$ packed form
3151b61L8L12l81J02o9J39J9j20J17J06j37R3r5J85J00O7q6J58j83m63L32J47
3173A20j74L2J45o3m3P9j03L1p4Q8j76O0k0q0o2J72P4j83O4k6l0K80j1k24J94
3198G0O9k4J00J0J0P7J03j49j10K7k66J23J36l44P2j32O2l4J54j74J20m5K13k03
3222a35m3J74l0NJ54l8j97L94l29K12j43J72j08J49j67J37k70N5r6J96q2m6M8
3245A2l61O1pL54m2j95J16K66k08P6L9k22JoK64K9j50L83m12J75j6K38k20P2j07
3270A40K6q6j36J63O3q8j69j38K11Mk07J03j7JK0P2K6j69J25Q3j6m1J57j59P7
3295D5nq0K40p7n8k71K50O6j05p4J35l53L01M9k55J65k47L58k45m1J69p2K14q5
3319B4N3J11k7mo7K36l56j21L79J1l91L59k0L3R0l75Q5j20j63J11J87l27L19k32
$$ plain form
3343 -205 -268 -144 -25 -198 -121 -41 34 111 16 40 -137 54 76 76 59 313 -66 -94 191 293 44 -3 124 -168
3367 -168 -22 11 6 -12 -91 -51 -43 -22 -286 -211 -21 -331 -5 -80 -60 41 227 38 -66 119 257 11 -167 212
3391 212 75 21 64 -41 45 164 -217 -134 -89 -49 -119 -55 -203 -285 -314 -3 -78 -189 -51 -57 -56 -23 73 25 61 53 -26
3418 -26 -140 -115 -30 236 211 -18 67 -151 -96 251 -5 99 133 -143 -128 -200 -158 -129 -241 -228 -163 -272 -89 -279
3442 -279 -64 50 23 -167 50 16 -43 -76 191 77 89 94 122 142 84 114 -133 -40 -235 135 -65 -212 -320 -233
3466 -233 -219 -293 -49 -91 -174 17 -20 -231 -183 122 138 -196 -27 145 103 39 106 291 -28 253 176 106 149 243 7
3491 7 351 43 -140 53 -78 13 -399 -180 -329 -303 -363 123 -80 -178 -52 121 -362 14 78 31 118 9 234
3514 234 -237 169 -65 59 130 192 -27 -108 190 -120 -11 -128 -74 -148 -107 -39 -131 -258 -234 21 -199 44 -5
$$ packed form
3343b05o3J24J19j73P7Q0P5P7r5K4j77J91K2%j7K54l79k8K85J02k49m7J27k92
3367a68J46L3nj8p9M0QK1k64P5J90l10L26p5K0J01J86j89j04J85J38k46j78L79
3391B12j37n4M3j05Q6J19l81Q3M5M0p0O4j48q2k9L11p5j11J38oJL3R6m8L6qp9
3418b6j14K5Q5K66k5k29Q5k18N5L47k56J04L4k76J5p2M2K9j12J3O5j09J83j90
3442b79K15J14k7j90K17l4n9l3K67j14J2NK8K0n8L0k47R3j95L70k00j47j08Q7
3466b33J4p4K44m2q3J91l7k11M8L05J6l34J69J72m2o4O7J85l19K81p7p0M3R4k36
3491GL44l08j83J93j31R1m12K19j49K6o0M86k03r8J26J73m83L76O4m7Q7j09K25
3514B34m71M06k34J24P1O2k19q1K98l10J09j17N4p4M1O8r2j27K4K55k20K43m9
$$ plain form
3537 -5 -35 46 -45 33 -8 -122 350 -21 123 115 6 192 190 202 245 181 201 246 114 -8 -12 -71 3 -94 -109 -85 -43 264
3565 264 -179 21 74 -50 -149 -46 -73 234 -97 -25 124 40 86 193 99 263 316 150 364 86 -19 -156 80
3588 80 -69 -180 -233 -222 0 -261 -253 -239 -110 -264 -25 20 -319 22 -4 144 -202 -156 262 117 9 180 192
3611 192 164 336 28 -157 67 191 -154 -107 203 -111 -52 -261 -189 -62 -180 12 -354 -103 -53 -76 -142 274
3633 274 241 -27 168 110 165 25 500 81 104 159 -5 104 28 238 -103 5 54 -72 -341 30 14 -363 -91
3656 -91 -99 -90 -255 23 -333 -46 -59 -79 114 87 256 -147 190 38 2 191 267 13 8 401 9 -55 -27 -140 -87
3681 -87 125 24 -99 -38 -109 -146 -192 -107 -240 -247 -281 -211 79 -54 49 198 207 -90 -32 182 -50 181 126 116 76
3706 76 -6 -38 66 14 106 29 21 -61 -176 13 -305 111 -105 -365 -208 -43 -161 -163 -232 -139 118 -136 35 147
$$ packed form
3537el0Q1r1P8m1j14M72l71J44qj09J86kJ2M3o4K0M5j32j22mn9P4r7j5K4M2L07
3565B64m43K00N3j24r9J03k7L07l31P2J49q4M6J07r4J64N3j66K14k78j05j37K36
3588H0j49j11n3J1K22k61QJ4J29j54K39M5l39L41k6J48l46M6M18j45j08J71J2
3611A92k8J72l08j85K24J24l45M7L10l14N9k09P2J27j18J92l66K51N0k3o6M16
3633B74l3k68J95n8N5j40M75m19K3N5j64J09p6K10l41J08M9j26k69L71j6l77K72
3656i1qRj65K78l56K87j3k0J93k7J69m03L37j52l6J89P6k54nL93l92o4K8j13N3
3681h7K12j01j23O1p1l7m6Q5j33pl4P0K90j33J03J49Rk97N8K14k32K31n5j0m0
3706G6q2l2J04n2R2p7qq2j15J89l18M16k16k60J57J65j18ko9R3K57k54J71J12
$$ plain form
3730 147 -43 183 18 139 -20 -5 22 138 -50 -62 80 -24 104 -210 -18 -134 -24 26 -119 -220 -150 -200
3752 -200 -55 -194 85 -6 17 -119 4 52 297 121 50 25 79 41 235 122 -266 4 122 304 60 -134
3774 -134 359 56 176 -343 62 20 176 -197 -297 -289 -154 146 44 -20 -65 191 48 135 145 5 300 86
3796 86 67 238 -30 115 138 -42 212 116 195 92 -88 38 -117 87 -29 -37 -121 -191 -257 -245 -156 -321 -73 -144
3820 -144 -145 157 -16 100 149 301 245 211 -99 -40 122 249 178 43 -84 -69 175 162 -285 -211 -13 -189 1
3843 1 -274 -61 -140 -135 -41 -167 -126 -124 6 -18 10 89 38 81 279 -104 310 271 9 77 -13 -55 -51 80 -64 -14 -374
3870 -374 -63 -126 -289 -13 -7 -300 -83 -306 -272 2 -27 -169 -59 -30 13 120 120 -109 82 18 188 221 -119 -122
3894 -122 24 30 149 302 -77 110 71 29 -178 -242 56 22 -9 -31 -147 -244 -68 -206 13 -100 17 -101 -16
$$ packed form
3730A47j90K26j65J21j59J5K7J16j88j2J42j04J28l14J92j16J10N0j45j01P0n0
3752b00J45j39K79r1K3j36J23M8K45j76p1k5N4l8J94j13l88K70J18J82k44j94
3774a34M93l03J20n19M05m2J56l73j00QJ35L00j02o4m5K56j43Q7J0j40K95k14
3796H6j9J71k68J45K3j80K54r6P9j03j80J26j55K04j16qq4p0o6J2Q9j65K48p1
3820a44jL02j73J16M9J52n6l4l10N9J62J27p1j35j27J5K44j3m47P4J98j76J90
3843Ak75K13p9NR4j26M1KJ30k4K8P9n1M3J98l83M14l9k62O8r0m2MJ31j44N0l60
3870c74L11o3j63K76Ok93K17k23L4K74k9j42J10K9M3J07%k29J91o4J70L3l40l
3894a22J46OJ19J53l79J87l9m2k07o4K98l4l1k2j16r7J76j38K19j13J17j18Q5
$$ plain form
3917 -16 106 243 310 81 383 5 109 70 34 452 200 35 -47 -142 23 14 -52 -110 -218 157 -207 -200 -199 -138 57
3942 57 -93 -147 16 190 -80 184 248 33 114 -125 -4 43 117 244 110 199 7 127 47 84 -122 -91 -94 -166
3966 -166 -97 -379 -102 -186 -279 -184 -14 -53 -215 -183 11 -149 -32 -3 -104 111 94 183 170 137 17 -142 251 21
3990 21 3 137 185 -59 -120 36 -153 -29 -138 -227 -53 -8 -120 58 -138 -48 40 -198 -108 -131 13 110 98 124
4014 124 210 139 39 132 358 333 142 112 116 179 -72 118 -152 -143 -266 -58 159 4 -144 -196 -323 -420 -60 -118
4038 -118 66 -192 -109 -249 -23 169 -158 15 -78 73 124 126 166 140 128 247 103 -112 -122 -227 -105 -81 -310
4061 -310 -183 -235 26 -51 -242 -82 -339 10 -250 91 -33 -148 177 93 236 188 143 196 164 -47 146 27
4083 27 45 131 277 -201 -158 231 34 93 -265 -2 -35 -241 -63 -210 -27 -366 102 -205 -158 -227 161 88 113
$$ packed form
3917a6J22J37O7k29L02l78J04l9l6M18k52j65q2r5J65ro6n8j08L75l64PJO1J95
3942E7j50n4J63J74k70K64O4k15Q1k39J21M7P4J27j34Q9j92J20q0L7k06L1lp2
3966a66O9k82K77q4r3R5J70l9j62L2J94j60J17K9j01K15j7Q9j3l3j20j59L93k30
3990B1j8J34M8k44o1J56j89J24j09q9J74M5j12J78j96R0Q8k38R0k3J44R7j2K6
4014A24Q6p1j00R3K26k5j91l0MO3k51J90k70Rj23K08K17j55j48n2j27r7L60n8
4038a18J84k58Q3j40K26J92l27J73r3J51N1KM0k6j2J19j44k15j0j05J22K4k29
4061c10J27n2K61p7j91J60k57L49k60L41j24j15L25q4J43m8m5N3l2k11J93j19
4083B7J8Q6J46m78M3L89j97N9l58K63l3k06J78j47J83l39M68l07M7o9L88p3K5
$$ plain form
4106 113 245 201 78 36 180 171 247 1 60 248 50 -25 -84 -146 -157 -10 57 -93 93 -254 -320 -179 -92 -122 -296
4131 -296 -1 -54 -181 252 -214 170 61 343 142 115 266 -206 49 -96 -43 -11 75 150 -132 119 14 -58
4153 -58 -280 -26 18 -114 88 -295 -160 -69 -106 -181 -80 -128 -137 -96 264 75 69 302 67 -3 8 178 46 142 15
4178 15 51 173 -71 -178 40 79 -59 104 -335 -151 -31 -125 -121 -52 -64 -85 174 120 -151 65 164 41 -67 65
4202 65 -154 -13 221 52 70 186 103 54 66 -108 -42 -9 -104 111 61 -402 -155 -205 -116 -85 -49 -14 -344 17 -189
4227 -189 69 17 8 20 135 358 143 142 -160 79 140 -163 170 99 -18 -43 -106 -193 -75 -247 -165 9 -166 52
4251 52 -125 -159 -241 -56 -224 -90 -218 -17 103 16 -57 198 93 132 -69 144 78 91 62 187 157 61 90 51
4275 51 -8 -225 -19 -140 -13 -139 -79 171 -309 -132 -30 -410 -104 1 94 89 154 7 -27 129 41 40 59 205
$$ packed form
4106A13J32m4j23m2J44rP6k46N9J88j98p5n9o2j1J47O7j50J86l47o6J41Q7l0j74
4131b96K95n3j27M33m66L84j09K82k01k7J51m72K55j45N3L2Q6P5k82K51j05p2
4153e8k22K54M4j32K02l83J35R1l7p5J01m8rM1L60j89oK33k35p0J1J70j32R6j27
4178A5L6J22k44j07K18L9j38J63m39J84J20r4MO9j2k1K59n4k71K16R9j23j08J32
4202F5k19J41K34j69J8J16q3m9J2j74O6L3r5K15n0m63K47n0Q9L1L6L5l30L61k06
4227a89K58n2rJ2J15K23k15jl02K39O1l03L33p1j17k5o3q7J18j72Q2J74j75K18
4251E2j77l4q2J85j68J34j28K01J20q7p3K55j05L9k01K13o6J3k9J25l0r6K9l9
4275E1n9k17K06j21J27j26O0K50m80J77J02l80L06J05R3nO5j47l4J56q8jJ9J46
$$ plain form
4299 205 -75 36 104 323 132 287 -21 42 -120 -139 -126 -117 -211 -120 -192 -150 -252 -278 -265 9 -85 -11 11 34 -113
4324 -113 70 -206 107 261 -43 182 116 185 196 44 246 83 5 -41 -94 -96 27 -164 -67 25 -236 24 -69 -237
4348 -237 -120 -92 -39 27 6 -91 62 113 50 6 -28 50 73 127 23 439 266 -290 -2 204 -116 50 -21 128
4372 128 -23 -237 215 -20 -64 -206 -274 -37 -72 -242 -67 -227 -171 144 136 107 -107 228 100 129 -86 224 22
4395 22 -42 51 -42 -8 -82 -3 -122 115 -124 207 45 -143 -30 -205 -256 93 55 -76 -258 -89 -223 122 -180
4418 -180 22 83 112 266 183 -114 36 -23 52 -125 -76 173 28 -126 -102 -63 70 -14 -141 -154 79 36 -308 -118
4442 -118 68 48 -149 72 115 -66 145 68 18 -9 327 127 36 201 37 14 -178 133 37 140 73 14 -42 98
4466 98 -84 -148 -192 -107 -243 -202 -128 -112 -160 -171 161 -181 -44 83 -86 109 -113 -71 256 266 -251 169 89 -59
$$ packed form
4299B05k80J11O8K19j91J55l08O3j62j9J3Rr4R1p2M2j02k6J3K74r4P4K2K3j47
4324a13J83k76L13J54l04K25o6O9J1j52K02j63p8m6n3kJ23j91R7R2k61K60r3j68
4348b37J17K8N3O6k1r7J53N1o3m4l4P8K3N4j04M16j73n56K88K06l20J66p1J49
4372A28j51k14M52k35m4j42o8K37l5j70J75j60N6L15qk9k14L35j28K9k15L10k02
4395B2o4R3r3L4p4P9j19K37k39L31j62j88J13j75n1L49l8j31j82J69j34L45l02
4418a80K02O1K9J54q3k97J50n9P5j77M9K49j45j54K4L9J33q4j27j3K33m3l44J90
4442a18J86k0j97K21M3j81K11p7n0k7L36k00r1J65j64k3j92L11r6J03o7n9n6J40
4466I8j82o4m4Q5j36M1P4J6m8j1L32l42J37J27j69J95k22M2L27J0n17M20q0j48
$$ plain form
4490 -59 14 67 375 34 100 -227 -101 -139 -20 21 -258 -162 -332 50 -344 -32 -12 -70 -86 108 57 82 81 175 -26
4515 -26 182 5 -70 92 252 277 -109 211 236 13 -101 240 36 -107 31 -92 -156 -47 -204 -101 -11 -48
4537 -48 -185 -74 -74 -147 131 -26 -87 130 -19 -114 261 255 103 71 244 297 108 141 -83 -40 -55 -22 -275 -5 -106
4562 -106 -175 -205 -61 -190 51 63 -128 -30 178 166 -89 -120 92 163 141 78 12 21 -92 109 71 -14 -28 -14 87
4587 87 46 -62 -6 140 12 -203 29 153 42 -280 -290 -43 2 -143 -337 -83 -242 121 -57 -86 -7 -63 152
4610 152 18 148 -130 50 199 -22 160 2 -42 269 19 126 -126 -188 90 -158 -92 -206 -38 11 259
4631 259 -90 -182 -35 114 53 114 53 -98 28 188 -193 -53 45 14 278 197 -74 -65 -115 54 -44 -94 -49 -201
4655 -201 179 -346 139 -27 -68 78 -58 -19 -229 66 -111 96 -4 -33 233 -116 -57 208 241 137 -106 -53
$$ packed form
4490e9P3N3L08l41O6l27J26l8J19M1k79R6j70L82l94L12K0n8j6J94n1K5jR4k01
4515b6K08j77p5J62J60K5l86L20K5k23j14L41k04j43J38j23o4J09j57J03R0l7
4537d8j37J11%p3K78j57o1K17j49r5L75oj52l2J73N3j89L3k24M3j5L3k53K70j01
4562a06o9l0J44j29K41J2j91R8K08j2k55l1K12P1k2o3o6Rj13K01l8q5j4J4J01
4587H7m1j08N6J46j28k15K32J24j11l22j0K47M5j45j94K54j59L63j78k9P9n6K15
4610A52j34J30k78J80J49k21J82j58m4L11k50J07k52o2K78k48O6j14J68M9K48
4631B59l49r2J47J49o1O1o1j51J26J60l81J40R8l1K64q1k71Rn0J69r8n0M5j52
4655b01L80n25M85j66m1J46j36L9k10K95j77K07j00k9K66l49N9K65L3j04k43N3
$$ plain form
4677 -53 145 21 157 302 70 -136 -150 4 -278 -4 -255 66 -193 -244 -21 -52 41 -149 -55 -143 147 31
4699 31 234 -5 84 0 112 -58 24 199 184 -35 -39 208 233 -203 90 122 142 -192 -91 4 -12 103 -154 102
4723 102 -110 -338 -42 36 -53 -19 262 -118 -204 149 -118 -47 -15 197 -30 -44 81 81 -169 29 -102 -33 234
4746 234 9 -92 -213 -89 65 -451 -101 -51 -233 -47 -178 0 -37 -44 -176 166 31 -93 80 -89 105
4767 105 -77 -53 -89 -155 34 218 276 -141 159 82 71 61 115 43 -144 -93 -14 101 -95 -60 -120 -86 12 -57 127
4792 127 54 198 -55 -58 161 227 246 -19 130 -10 49 127 11 144 -72 -175 -37 33 17 76 -80 -122 109 57
4816 57 -138 -126 -43 -56 -316 126 38 -44 -39 -40 237 34 -3 2 17 -26 268 -19 -1 106 -145 15 74 -337 -29 115
4842 115 -40 -92 5 18 -22 188 -113 -287 4 -145 60 133 150 -61 17 12 -10 69 -11 175 188 -68 174 31
$$ packed form
4677e3J98j24J36J45k32k06j4J54k82K74k51L21k59n1K23l1R3j90R4q8K90j16
4699C1K03k39Q9q4J12j70Q2J75j5k19mK47K5m36K93L2K0l34J01R5j6J15k57K56
4723A02k12k28K96P8q9L4K81l80q6L53k67P1L2K12k27j4J25%k50J98j31O9K67
4746B34k25j01j21J24J54n16L50N0j82J86j31J78l7pj32L42j35j24J73j69J94
4767A05j82K4l6o6J89J84N8m17L00p7j1j0N4p2j87N1P9J15j96L5o0L4R8o9J84
4792A27p3J44k53lK19O6J9k65J49j40N9P8j16J33k16j03J38P0j6N9j56m2K31n2
4816E7j95J2Q3j3k60M42q8q2NjK77k03l7NJ5m3K94k87J8J07k51J60N9m11L08J44
4842A15j55n2R7J3m0K10l01j74K91j49K05P3J7k11P8nk2P9q0J86J3k56K42j43
$$ plain form
4866 31 48 111 -7 226 31 -199 -44 -275 -161 59 -154 -84 -98 170 -120 -129 -21 4 10 -89 8 341 22 -17
4890 -17 281 44 -136 57 114 -78 158 -58 -274 -18 -79 128 -65 -19 -17 -232 -175 -118 -288 -74 -12 19 -27 -74
4914 -74 217 -127 -60 145 17 -49 18 71 -124 99 -27 -116 -18 43 -38 236 -170 268 2 -57 -46 -133 -64 -60 48
4939 48 4 -182 -183 15 -76 -59 115 184 90 140 -400 -4 194 225 -155 341 36 16 215 -61 30 147 -84 -132
4963 -132 151 -94 -60 -68 229 -85 -304 59 -240 48 -117 -79 -49 12 141 -25 124 142 53 -92 231 210 269
4986 269 124 259 2 160 234 -11 -18 108 -71 -195 187 84 -127 -213 22 -18 -7 -54 87 -171 293 111
5008 111 -92 31 216 -252 193 -8 55 365 -16 40 186 209 -259 49 74 72 -152 69 159 66 -397 -2 -9
5031 -9 111 -36 -177 109 -262 -153 41 -176 -243 -25 -239 30 16 -8 -64 53 38 150 91 216 86 -30 216
$$ packed form
4866C1J7O3j18K33j95k30J55k31J14K20k13P0j4K68k90rJ08K5Or9R7L33l19l9
4890a7K98k37j80J93N7j92K36k16k16K56o1K07j93M6Kk15N7N7j70K14O2L1m6m7
4914g4K91l44O7K05j28o6O7N3j95K23j26q9R8O1q1K74m06M38k66n9J1q7O9MJ08
4939D8m4j86jJ98r1J7J74O9r4N0n40L96J98L1l80M96l05k0J99k76R1J17k31m8
4963a32K83k45L4qK97l14k19L63k99K88j65L8L0O1J29j66J49J8q9j45L23k1N9
4986B69j45J35k57J58P4k45pJ26j79j24L82j03k11q6K35m0J1m7J41k58M64j82
5008A11k03J23J85m68M45k01O3L10l81N6J46K3m68L08K5kk24K21R0r3m63L95p
5031iJ20j47j41K86l71J09J94k17o7K18k14K69j4k4n6J17j5J12n9J25j30j16K46
$$ plain form
5054 216 -87 -94 190 -81 -47 -209 121 -145 -43 -74 -62 -270 -114 35 -92 -255 131 152 -2 206 28 248
5076 248 126 124 46 284 162 -103 76 242 65 -14 65 -247 -118 170 -47 39 -53 150 -112 -308 -82 71
5098 71 -8 95 137 -17 -172 19 129 -93 137 -92 66 42 148 211 181 72 -30 156 -94 -221 131 -131
5120 -131 -247 140 -487 -174 -238 -119 135 -244 -67 -121 -100 -212 63 -153 74 -77 77 94 14 -59 96 31
5142 31 95 -36 128 -32 -35 -106 -225 -2 -10 45 47 -125 -25 -20 84 193 -168 10 -246 -69 -21 160 26 -47 42
5167 42 -57 -220 40 -2 221 11 438 165 6 -25 -166 197 181 -132 35 171 97 -146 -33 -36 -114 36 131
5190 131 119 18 20 125 -33 -151 -83 22 142 46 -72 80 85 355 186 177 -46 195 61 -97 140 -36 -128
5213 -128 -11 27 -103 -197 -176 81 -247 127 -31 -180 31 107 -84 -170 -94 58 93 31 21 53 138 13 -22 175
$$ packed form
5054B16l03pK84k71L4j62L30k66J02l1J2k08J56J49j27j63L86K1j54K08j78K20
5076B48j22kp8K38j22k65J79J66j77p9P9l12J29K88k17Q6r2K03k62j96K26J53
5098G1p9J03M2j54j55J91J10k22K30k29J58k4J06O3l0j09j02J86k50j27L52k62
5120a31j16L87o27L13o4J19K54l79J77n4K1j12K75k16K27j51J54J7q0p3J55o5
5142C1O4j31J64j60lp1j19K23qN5Kj72J00NJ04J09l61J78k56J77M8J81j34p3Q9
5167D2r9j63K60m2K23k10M27k73j59l1j41L63j6l13J67J36p4k43J13lp8J50R5
5190A31j2j01KJ05j58j18O8J05J20r6j18J52NK70j69rk23K41j34j58K37j76r2
5213a28J17L8j30r4K1K57l28L74j58j49K11P6j91q6P6J52L5o2j0L2Q5j25l5J97
$$ plain form
5237 175 95 -92 -26 -167 117 130 212 252 -227 133 -31 -110 -29 -247 -28 41 3 40 -207 -134 -83 212 21 -225
5261 -225 -160 133 182 144 -3 136 131 -20 18 50 16 196 -155 66 67 141 333 -242 -176 -49 -95 137 4 -43 -235
5286 -235 -250 -56 -277 -22 48 -112 -102 12 44 -56 174 188 104 309 -192 9 98 31 -19 263 12 -207 196
5309 196 113 -68 27 -72 78 -200 -23 -81 10 133 49 106 -257 88 186 200 -126 154 -178 55 37 14 -55 -238
5333 -238 74 -37 191 74 -183 227 68 -221 -116 -36 -115 191 -175 -49 -325 -258 -9 -450 -197 26 -39
5354 -39 -97 241 -130 12 119 47 154 77 -46 231 143 64 -53 -74 -53 88 -316 -6 -124 -96 41 144 -20
5377 -20 65 133 -241 238 98 -48 63 -94 -71 -80 -71 -38 96 108 -213 113 122 230 190 154 211 -23 17 40 -80 -145
5403 -145 -129 -93 -209 -19 72 97 -360 87 26 11 16 -21 29 -61 -4 53 -37 7 -31 -286 244 10 64 -70 -36 73
$$ packed form
5237A75q0j87O6j41K84J3Q2M0m79L60j64p9Q1k18K19O9l8L7k47P3N1K95j91k46
5261b25O5K93M9l8j47J39nj51L8L2l4J80l51K21JP4J92n75O6J27m6K32j33m7j92
5286b35j5J94k21K55P0j60J0J14L2j00K30J4q4K05n01K01Q9o7n0K82k51k19M03
5309A96q3j81R5r9J50k78J77n8R1J23q4N7l63L45R8J4l26K80l32K33j8k3o9j83
5333b38L12j11K28j17k57M10j59k89J05Q0p9L06l66J26k76O7K49m41K53K23o5
5354c9n8L38l71J42J07p2J07p7j23K77q8p9j17k1K1J41m04L10j18K8J37J03j64
5377b0Q5O8l74M79j40j46J11j57K3rRL3J34J2l21L26RJ08m0l6N7k34M0K3j20o5
5403a45J6L6j16J90R1K5m57M47o1j5Nl7N0r0N7N7r0M4l8k55N30k34N4j34L4J09
$$ plain form
5429 73 -88 -12 73 24 85 -44 -231 66 0 -44 66 -213 -56 171 -31 -17 -142 -321 198 -16 -19 34 -12 -63
5453 -63 139 -75 218 -75 -125 43 102 75 118 65 -55 -43 -107 -60 157 -113 -81 -75 -78 75 -64 -45 -236 -133 -72
5478 -72 109 171 25 -66 -65 -9 -83 235 -11 -2 76 -129 11 13 4 -62 -39 -101 -54 -160 -184 110 92 116 52 160 120 -165
5506 -165 -71 144 282 -161 55 50 8 -124 136 27 -150 228 -58 -62 -2 363 -215 184 -84 76 130 22 115
5529 115 -240 -158 -95 86 -259 -107 53 -68 -216 -157 -3 243 -70 -108 177 -6 -158 46 82 -149 185 7
5551 7 -158 -171 38 80 -18 194 -72 -121 -72 65 -46 -15 -231 -314 -317 -47 -94 -61 -116 -157 -38 0 61 83 235 -52
5577 -52 26 -138 117 -239 28 28 73 4 21 -59 56 -135 184 368 -39 -248 -104 29 -314 -272 48 -41 31 -66
5601 -66 -11 343 27 57 -5 -19 204 -115 251 -26 55 108 -34 7 47 17 -54 -93 -4 100 -305 78 21 -166 -247
$$ packed form
5429G3j61P6Q5m9O1j29j87K97o6m4J10k79J57K27k02J4j25j79N19k14lN3m6n1
5453f3K02k14K93k93n0J68N9k7M3n3j20J2o4M7K17k70L2OlJ53j39J9j91J03O1
5478g2J81O2j46r1JN6p4L18k46RP8k05J40Kro6K3o2M7j06k4K94j8K4o4J08m0k85
5506a65R4K15J38m43K16nm2j32K60j09j77L78k86mO0L65n78L99k68J60N4j08R3
5529A15l55Q2O3J81l45J52J60j21j48N9J54K46l13l8K85j83j52K04L6k31L34j78
5551Gj65j3K09M2r8K12k66m9M9J37j11L1k16q3lK70m7L3n5m1J19L8O1K2J52k87
5577e2P8j64K55l56K67%M5o9J7q0J15j91L19J84m07k09J44J33l43M2L20q9P2r7
5601f6N5L54l16L0o2j4K23l19L66k77Q1N3j42M1M0l0p1l9Q9J04m05L83n7j87q1
$$ plain form
5626 -247 -122 -116 -220 81 -453 85 36 72 -99 -219 -56 208 -106 8 134 177 82 200 23 -18 349 -2
5648 -2 64 -201 94 -127 69 -75 90 -103 -83 -250 40 -23 -389 -31 -57 -62 49 21 -206 35 -102 7 -121
5671 -121 77 7 -50 91 44 133 -220 -36 -53 314 -47 -146 51 106 -86 -95 -55 1 -139 -23 -70 -157 14 -21 -56
5696 -56 166 100 53 -169 -78 118 2 -98 -52 38 147 152 -30 104 76 -72 157 -104 -108 -227 -62 -64 -25 -113 -73
5721 -73 -142 -91 -176 -370 -81 28 -98 197 -97 97 88 21 88 78 280 -9 104 19 -21 -103 157 111 22 78 -143
5746 -143 -158 -311 -92 -155 -221 -107 -112 -218 -128 -243 -72 -114 127 54 65 17 44 160 -181 83 -102 70 -96 16
5770 16 127 4 107 85 -101 -59 -28 -98 16 -14 106 39 76 131 -64 -192 -46 -99 126 -208 -35 -25 137 183
5794 183 2 -43 -30 -42 9 187 41 -45 198 -57 -49 -77 -109 83 -88 8 -100 194 -84 -24 -263 0 -73 -134
$$ packed form
5626b47J25Oj04L01n34N38m9L6j71j20J63K64l14J14J26M3r5J18j77m1L67l51
5648bO6k65K95k21J96j44J65j93K0j67K90o3l66L58k6nJ11k8k27K41j37J09j28
5671a21J98p0n7J41m7Q9l53J84j7L67l61r9J97N5j92rM0N6j40J16m7q7J71l5l5
5696e6K22o6m7k22R1J96j16j00M6R0J09Nj82J34k8j48K29k61mj19J65kL9q8M0
5721g3o9N1q5j94K89J09j26K95k94J94ro7O7j0K02k89J13q5m0q2K60m6q9N6k21
5746a43j5j53K19o3o6J14nj06R0j15J71m2K41p3J1m8K7J16l41K64j85J72j66J12
5770A6J11j23J03k2j86M2L1p0J14l0J20o7L7N5j95j28J46n3K25l34J73J0J62M6
5794A83j81m5J3j2N1J78j46q6K43k55Qk8l2J92j71R6j08K94k78O0k39K63p3o1
$$ plain form
5818 -134 -146 55 150 42 46 55 258 181 63 234 -18 227 217 -12 175 82 -45 113 -196 0 -12 -104 -27 121
5842 121 -92 32 19 13 -93 29 157 -40 -100 -87 -20 -138 -90 50 165 -156 94 -329 -1 318 106 -128
5864 -128 79 -11 -114 280 -134 37 -108 -29 -119 -129 58 70 -90 -47 -86 68 100 39 -101 20 -75 -232 91
5887 91 -30 -157 242 -44 173 206 -261 253 113 -85 -11 -265 -123 102 -49 171 -213 -24 -173 -210 62
5908 62 -27 -120 -286 -90 -75 -51 -222 103 169 82 -19 3 101 -5 -130 164 60 147 116 35 158 158 188 -25 -82
5933 -82 -132 122 -20 -208 -119 13 -13 68 -25 -130 -142 -104 -99 -67 -94 91 39 -103 -95 77 -56 -165 8 -24 211
5958 211 71 270 151 -49 133 -52 -132 -22 296 21 15 -93 -160 -32 3 72 -247 -92 12 305 -35 -18
5980 -18 179 196 90 -94 -41 -119 335 117 60 105 -55 -39 4 104 91 -194 -213 209 97 -71 -85 -225 7 -30
$$ packed form
5818a34j2K01R5j08MRK03p7j18J71k52K45j0k29J87r3j27J58l09J96j2r2P7J48
5842A21k13J24j3oj06J22J28j97o0J3O7j18M8J40J15l21K50m23L28L19k12k34
5864a28K07r0j03L94m14J71j45P9r0j0J87J2j60M3l9J54L2o1j40J21r5j57L23
5887I1j21j27L99k86K17L3m67N14j40j98P4k54J42K25j51K20l84J89j49l7K72
5908F2q9r3j66J96J5K4j71L25O6q7j01K2R8j06j25K94j04Q7l1q1J23%L0k13n7
5933h2n0K54j42j88Q9J32k6Q1r3j05j2L8NL2k7J85n2j42QJ72j33j09J73l2K35
5958B11j40J99j19k00J82j85q0J10L18k75oj08o7J28L5O9l19J55J04K93l40J7
5980a8J97J7j06j84N3p8M54k18n7M5j60J6M3J00j3k85j9M22j12j68j4j40K32l7
$$ plain form
6004 -30 -88 -3 -98 -44 135 -57 204 26 -8 -188 -121 146 290 46 -49 -119 14 -148 -94 -61 -20 151 -85 2
6028 2 79 -301 -72 -345 66 177 71 -160 75 -201 74 112 -92 -50 -53 -176 -83 169 94 115 146 335 -225 30
6052 30 99 82 -122 69 8 -135 -31 -53 -20 -13 92 -194 -71 -33 111 -131 56 -231 162 -68 67 -128 235
6075 235 136 25 24 88 169 123 72 -37 128 156 10 -18 -116 -19 -17 -213 -104 -223 -109 16 92 -86 50 -103 57
6100 57 -259 53 115 58 -86 58 199 -17 179 258 104 46 24 224 159 -192 173 41 -232 31 -52 -117 -74
6123 -74 34 -126 -17 -101 64 -251 -156 -53 24 59 24 58 -173 -26 18 -1 134 106 109 184 -28 -18 -292 203 76
6148 76 -16 62 6 43 -5 -33 -167 -26 190 -319 -111 71 -179 -39 -81 -21 -165 -181 151 18 112 20 -86 7
6172 7 260 -191 315 -180 29 -22 193 23 83 101 27 -106 -110 -85 -218 12 53 2 -185 -134 -59 -37 -61 -15 -73 180
$$ packed form
6004c0n8Q5r5N4J79j92K61j78l4j80O7K67J44k44r5p0J33j62N4L3M1J71k36Q7
6028BP7l80K29k73M11J11j06k31K35k76K75L8k04M2lj23R3K52p5K1L1J89n60K55
6052C0O9j7k04J91o1j43J04k2L3PJ05k86J23L8J44k42J87k87L93k30J35j95L63
6075B35r9j11jO4Q1m6n1j09J65K8j46k8r8R7Kj96J09j19J14J25P6j78J36j53J60
6100E7l16L12O2n7j44J44J41k16J96P9j54n8k2K00o5l51L65j32k73K63q3o5M3
6123g4J08j60J09q4J65l15R5J03P7L5l5L4k31J47M4j9J35k8LP5k12J0k74M95j27
6148G6r2P8n6L7m8k8j34J41K16n09K08J82k50J40m2O0j44j6L32j33R4r2j06R3
6172GK53m51N06m95K09n1K15j70O0J8p4j33mK5j33K30M1n1j87N1P5K2k4M6n8K53
$$ plain form
6198 180 -238 141 -89 13 78 12 84 -52 7 -93 171 84 -233 61 -41 12 227 -229 207 -70 -64 -179 -125
6221 -125 -269 -1 -122 37 -55 -154 -33 -7 119 20 191 -116 -126 -282 -101 -94 292 193 44 180 -32 90 -37
6244 -37 -69 -143 83 -431 -106 114 231 27 -51 -161 -45 15 -25 28 76 24 -101 20 38 50 217 -74 83 125
6268 125 205 -221 248 69 84 146 -172 -36 -157 58 -61 250 166 66 65 -224 54 -150 105 22 4 112 -186
6291 -186 176 139 -31 -37 -40 92 -47 1 59 52 153 -78 122 -19 -125 64 41 -36 45 245 39 226 -166 70
6315 70 -2 85 -112 150 40 112 92 52 -242 22 -247 4 26 1 86 -169 204 -127 132 156 120 -205 -64 -311
6339 -311 15 347 -134 118 57 -256 -41 131 -40 -14 -24 -212 8 -61 -63 71 -125 204 316 133 -3 53
6361 53 93 27 -36 288 140 13 12 -109 -33 -153 -78 -177 -114 52 -178 -28 -210 160 -270 -216 -19 -46 140 -184
$$ packed form
6198A80m18L79k30J02O5o6P2j36N9j00K64q7l17K94j02N3K15m56M36k77Oj15N4
6221a25j44K68j21J59r2r9J21K6J26r9J71l07j0j56J81PL86r9j49J36k12J22j27
6244c7l2p4K26n14L25K20J17k04p8j10J16O0m0N3M8n2j25J21J8J2J67k91J57M2
6268A25Q0m26M69j79J5O2l18J36j21K15j19L11q4j00jk89K78k04K55q3j8J08k98
6291a86L62l7j70olJ32j39M8N8pJ01k31K00j41j06J89k3p7Q1K00k06J87l92K36
6315G0p2Q7j97K62j10P2k0m0k94K64k69K51K2k5Q5k55L73l31K59K4l6l25J41k47
6339c11L26L32m81K52o1l13K15J72j71K6j0j88K20o9kJ34j96L29J12j83j36N6
6361E3M0o6o3L24j48j27jj21P6j20P5r9O3J66k30J50j82L70m30N4J97k7J86l24
$$ plain form
6385 -184 174 177 73 -4 -27 -88 105 114 153 7 188 194 11 -112 -47 -265 59 110 -28 51 -55 -74 -237 139 -135
6410 -135 16 -52 -223 0 -255 -245 -37 87 87 -61 12 212 -36 287 -5 -8 265 192 155 -50 -111 -109 5 -81
6434 -81 -147 -186 -136 127 -14 -187 33 -116 -367 10 64 239 -44 -45 80 94 18 108 145 144 -189 15 -77 6 -39
6459 -39 126 135 -7 -159 41 228 -79 -172 39 132 -342 -155 33 -110 359 21 -209 -42 -80 -173 245 32
6481 32 8 -85 102 -50 -168 -236 306 -44 -241 39 -41 -190 48 34 -181 -127 -106 -50 -134 -130 36 -210 -141 107
6505 107 -21 -180 30 93 19 -68 -51 -2 -67 364 -68 -36 79 264 37 -31 -193 199 83 -33 33 -62 -139 -68
6529 -68 -89 46 -354 -125 109 67 -196 76 86 -57 34 -257 229 128 -210 -1 -108 39 -49 -11 138 -9
6551 -9 144 34 -148 10 -121 -215 -39 212 -40 157 -83 129 -161 8 74 -158 -109 -135 -59 -3 -36 63 -10 24
$$ packed form
6385a84L58Lj04p7k3o1J93RL9j46J81Oj83j23O5k18L24N1j38P9j06j9j63L76k74
6410a35J51o8j71K23k55J0K08J24%j48P3K00k48L23k92lK73p3l7k05o1KJ14q6
6434h1o6l9N0K63j41j73K20j49k51L77N4J75k83jJ25J4p6R0L7jl33K04r2Q3m5
6459c9J65Rj42j52K00J87l07r3K11R3m74J87J88j43M69l38k30J67l8r3M18k13
6481C2k4r3J87j52j18o8N42l50j97K80q0j49K38j4k15N4K1N6q4MJ66k46O9K48
6505A07j28j59K10O3p4q7J7M9o5M31m32L2J15J85k27o8j62L92j16j16O6r5p7P1
6529f8k1J35m00K29K34m2k63K72J0j43R1k91M86j01l38K09j07J47q8L8J49j47
6551iJ53j10j82J58j31r4J76K51k52J97k40K12k90J69O6k32M9k6P6N6l3R9p3L4
$$ plain form
6575 24 -203 -231 97 204 231 -95 158 -32 62 92 -151 51 -257 65 -21 -90 -162 0 -31 91 3 66 1 -35
6599 -35 178 -18 152 -45 -25 86 3 115 185 146 -159 84 -115 33 119 139 49 -23 34 136 -233 -28 -62 54
6623 54 -140 79 32 -199 -158 -35 -183 31 -84 -235 224 -191 97 -41 280 36 -71 23 75 27 -84 -127
6645 -127 -80 -29 51 -165 -251 155 19 -194 -89 -20 201 -113 -190 97 13 -178 -57 97 -69 -210 103 -167
6667 -167 -4 5 -4 -197 12 70 65 36 31 123 10 188 91 -6 -80 -184 -235 31 -25 21 -285 -148 -133 0 -202 25
6693 25 121 -32 46 -230 155 -29 -42 180 -123 160 139 73 80 136 125 -6 115 -193 233 113 67 211 -246 -74
6717 -74 -87 -262 122 -19 -142 -40 25 -107 -75 19 42 -27 -9 32 85 262 112 -85 34 -21 -204 -184 -161 -51
6741 -51 42 1 -69 -17 111 118 -202 187 -69 45 -131 4 -68 161 67 -30 -113 -133 -64 115 -290 156 176 148 50
$$ packed form
6575B4k27k8L28J07K7l26K53j90R4L0k43K02l08L22q6o9p2J62l1J22q8O3o5l6
6599c5K13j96J70j97K0J11q3J12P0l9l05K43j99J48Q6K0r0p2N7J02l69K05l4J16
6623E4j94K19m7k31M1J23j48K14j15j51M59m15K88j38L21k44j07R4N2m8j11m3
6645a27M7N1Q0k16q6M06j36k13J05O9K21l14p7K87q4j91J21J54j66j41L13k70
6667a67J63Rrj93K09N8nk9nR2j13J78r7r7p4j04n1K66n6M6l06J37J5J33k02K27
6693B5R6j53P8k76L85j84j3K22l03K83k1o6PN6j1j31J21l08M26j20m6J44m57J72
6717g4j3j75L84j41j23J02O5j32L2R4K3o9J8M1N3J77j50j97J19n5j83K0K3J10
6741e1R3m1p0N2J28Pl20L89k56J14j76J35p2K29r4r7q3k0O9J79m05M46K0k8r8
$$ plain form
6766 50 -141 -17 -60 119 92 156 123 -44 -113 -140 -17 -140 -191 88 -106 10 -75 -365 46 -293 30 21 -20 86
6790 86 -147 -84 -60 134 -83 25 74 119 181 8 103 17 8 -16 67 -126 165 -19 42 -228 64 -79 -133 -91 7
6815 7 -24 -97 58 157 60 -103 229 193 -186 -3 177 250 -236 36 -54 -42 100 54 -14 81 141 272 -60 111 -31
6840 -31 109 -44 103 -13 -54 -3 -160 -230 -29 -26 35 132 171 -62 -200 -18 -213 75 22 69 266 -26 233 247
6864 247 -126 -58 -344 -209 -17 180 -46 -14 -66 231 109 6 -122 -322 -47 -91 47 112 -32 -30 102 46 57
6887 57 -107 75 149 40 234 219 134 -100 -114 129 137 -97 -143 -136 -69 166 -48 13 76 23 -101 9 -218 -110 -20
6912 -20 -6 59 1 -33 -174 28 -27 70 -229 124 110 -75 228 232 -145 -56 -89 -28 91 -285 -75 -175 35 72 29
6937 29 -45 209 -3 -197 -36 104 -113 -24 -149 96 39 252 -31 167 -111 -113 -60 -54 -66 -103 98 4 130 -234
$$ packed form
6766E0j91J24m3J79k7O4l3j67o9k7J23j23n1K79j94J16q5k90M11l39L23rm1J06
6790H6k33O3K4J94k17J08M9M5O2j73R5q6rk4Q3j93K91j84O1k70K92j43n4M2R8
6815Gl1p3J55R9r7j63L32l6l79J83J80P3m86K72r0J2J42m6o8R5O0J31l32J71j42
6840c1J40j53J47j16m1N1j57p0K01LO1R7L9k33j38J82j95K88n3M7J97k92K59J4
6864B47l73O8k86J35J92J97k26L2n2K97j22j03j28k00K75m4J38O5j44KJ32n6J1
6887E7j64J82P4j09J94j5q5k34j4K43Qk34m6PO7K35k14O1O3n3j24J10k27J08R0
6912b0J4O5n8l4j41K02n5R7k99L53j4j85L03Ml77Q9l3O1J19l76K10j00K10L7m3
6937B9p4K54k12j94J61J40k17Q9j25K45n7K13k83J98k78kN3Oj2l7K01r4J26l64
$$ plain form
6961 -234 243 31 10 -94 -26 -63 98 1 -131 -68 96 -48 -36 32 134 -150 49 67 138 39 -13 33 165 5
6985 5 -250 44 90 -105 36 -28 156 101 96 159 86 -283 -59 -41 -446 -66 23 18 -22 -62 -263 -71 -144 38 -149
7010 -149 -336 76 139 108 28 108 51 59 -124 94 68 2 -255 57 352 8 17 -66 -156 -56 -42 -25 -214 195 -106
7035 -106 29 -158 35 82 -6 39 160 56 -117 -56 -194 -101 402 -31 36 290 119 42 -308 175 -83 214
7057 214 -29 4 -127 89 16 -13 -49 19 -141 -87 -2 114 -101 -20 196 -160 -49 -213 77 -177 116 37 55
7080 55 59 -73 -70 97 -103 29 -79 202 -232 -144 -183 115 95 -59 -50 101 57 -21 -241 35 -159 -85 -154 -45 -66
7105 -66 74 113 131 30 218 253 129 -40 -73 256 -71 85 89 72 -262 85 -64 15 -152 23 126 -54 -58 4
7129 4 -219 -128 -50 113 163 -99 -54 67 43 143 118 -81 44 238 85 102 31 14 67 193 162 -85 -250 8
$$ packed form
6961b34M77k12k1j04O8l7J61r7j32O3J64j44J2O8J02k84J99J8P1r9n2M6J32j60
6985Ek55K94M6j95J41o4J84n5nO3p3l69K24J8m05L80Q9nm0m0k01J92p3J82j87
7010a49j87M12O3l1q0Q0n7Qj83K18k6o6k57L12K95l44Rq3r0J00J4J7j89M09l01
7035a06J35j87J93M7q8M5J21j04j73O1j38R3N03m33O7K54j71p7l50M83k58K97
7057B14k43L3j31K16p3k9l6O8j60N4Q5J16k15Q1K16l56J11j64K90k54K93p9J8
7080E5Mj32LJ67k00J32j08K81m34Q8l9K98k0j54RJ51m4p8k20K76j94P4o9J09k1
7105f6J40L9J8j01J88L5j24j69l3L29l27J56Mj7l34L47j49P9j67J75J03j80mO2
7129Dk23R1P8J63N0k62M5J21k4J00k5j99J25J94j53J7p1j7N3J26l1k47j65K58
$$ plain form
7153 8 6 -34 -24 76 -26 -89 17 -46 -164 92 -187 -111 81 10 -34 53 126 42 -13 -92 -159 146 -45 65 143 -166
7179 -166 -79 55 -108 -99 122 130 64 -63 -3 -240 -70 -18 -119 -74 13 -26 -171 29 24 -246 -167 20 117 7 115
7204 115 -48 337 73 28 -10 22 46 -190 -56 10 152 60 -77 -149 63 35 -40 -10 -172 -244 92 -128 -13 22
7228 22 81 87 141 -156 -45 37 -20 166 178 -48 68 270 -78 -26 -82 93 33 -143 -201 12 -140 -152 -101 110 -113
7253 -113 -127 29 -2 -52 -85 -7 -172 24 -82 -4 98 -128 134 212 -135 370 8 -119 -181 -172 -46 57 -52
7276 -52 -84 10 106 -16 -212 -94 81 44 113 28 -156 188 -96 -34 95 93 -167 -5 -88 -138 -76 -180 -60 -4 -2
7301 -2 5 92 7 137 -10 123 -36 -153 93 173 7 -201 -12 29 -57 43 -175 -31 97 -119 208 -185 -101
7324 -101 -105 28 -70 103 -165 -36 87 -171 29 -124 -12 -32 52 -52 -318 131 -153 58 154 -19 105 -69
$$ packed form
7153Hkm0J0J00j02o3J06o3j18K56k79P6J92p1m4Q7P3q4n5p9o7L05j91J10P8l09
7179a66Q7J34j63RK21Qo6j27O0k37J70N2j01M5Q7l9j45K00nk70P9J87R7j10J08
7204A15j63L85k64m5l8L2K4k36J34O6J42r2j37p2K12k8p5L0j62p2L36k20J15L5
7228B2N9ON4k97J11Q2n7J86J2k26J16K02l48N2n6J75o0j76n8K13j52j2N1K11k23
7253a13j4J56l1n0l3P8j65J96j06P8J02k26K62P8l47N05l62j27o2RJ26J03j09
7276e2l2R4R6j22j96J18J75l7O9q5j84L44k84O2J29kk60J62q3n0O2j04J20N6K
7301bPQ7q5J30j47J33j59j17K46Q0j66k08J89M1q6J00k18J44J28k16L27l93Q4
7324a01mJ33r8J73k68J29J23k58K00j53J12k0Q4j04k66M49k84K11R6j73J24j74
$$ plain form
7346 -69 126 48 -269 -129 -117 -152 -126 -19 58 -198 179 28 -60 -138 165 -149 59 -257 -129 -33 -38 155 -30 110
7370 110 -51 -198 -222 -46 -103 -95 60 97 -66 -35 24 -125 -13 57 9 -158 69 240 -25 -41 167 148 -34 43
7394 43 -161 -168 -11 -46 188 45 -160 -86 -21 -81 -48 3 69 -254 -276 67 115 32 110 160 -93 232 243 150 -18 -109
7420 -109 -133 39 -30 145 123 -318 103 145 -84 -124 -247 93 -31 -94 -46 -94 -47 -37 81 22 -61 -93 -109 -116 13
7445 13 -152 88 -135 183 -99 47 261 -78 74 208 67 -1 274 67 -53 96 64 -72 -109 11 -149
7466 -149 30 -93 115 -148 63 4 -40 220 -4 -24 -27 -14 -63 154 298 80 98 216 -45 -53 -138 60 59 38 48
7491 48 259 66 120 -113 141 -87 -7 -146 -259 128 -99 53 -16 168 -116 55 17 -1 221 -86 -111 -29 -51
7514 -51 98 -58 -27 23 262 -128 -48 -21 178 72 336 -43 26 -106 -77 -87 73 -161 -272 21 137 -25 67
$$ packed form
7346f9J95p8l17J40J2l5K6J07P7k56L77j51q8p8L03l14K08l16J28R6nJ93j85J40
7370A10j61j47k4J76n7QJ55L7j63L1N9j49J12P0m8j67K27J71k65j6K08j9j82P7
7394D3k04pJ57l5K34j43k05P4O5o0L3N1O6l23k2L43M8q3P8N0k53L25J1r3j68r1
7420a09k4J72o9J75k2m41M21M2k29m0j23L40j24o3M8m8M7J0J18n9q3l2j6pJ29
7445A3j65K40k23L18k82J46K14l39J52J34j41o8K75k07j20J49l2j36l7J20j60
7466a49J79j23K08k63K11n9m4K60k24k0lJ3m9K17J44k18J8J18k61qq5J98jk1J0
7491D8K11j93N4k33K54k28Q0j39j13L87k27J52o9J84k84J71l8j8K22l07k5Q2k2
7514e1J49j56L1N0K39l90Q0K7J99j06K64l79O9j32K9j0J60k34j11K93J16j62R2
$$ plain form
7537 67 299 47 -84 110 45 125 50 191 -76 1 160 -112 49 19 -110 76 73 -14 53 110 -101 -69 -129 -152 -53
7562 -53 -145 -135 107 48 153 11 -98 44 103 -50 -26 77 -58 -101 49 54 -80 40 -34 114 2 -2 135 -22
7586 -22 -43 58 56 80 76 -93 -163 108 -177 160 -51 43 -142 -204 -31 160 -152 -145 3 -18 162 -26 -126 -37 108
7611 108 -209 114 162 71 -144 -122 73 144 32 58 -7 -26 318 152 147 -225 219 96 -73 -98 82 23 93 19
7635 19 64 -149 13 -328 -82 -1 151 61 48 123 172 241 -33 24 -45 14 -68 87 159 169 -15 37 -172 -85 -184 -69
7661 -69 -42 50 238 -10 -197 -113 -42 -167 64 21 15 -102 170 37 -37 -2 156 171 -65 15 -31 72 -89 -170 -33
7686 -33 179 7 -196 -139 -152 87 61 10 181 -86 92 42 -28 62 -2 -47 191 22 -15 147 -199 -6 -16 -97
7710 -97 -82 89 13 -92 -51 -111 -111 59 126 21 -164 57 34 90 -200 90 96 33 -8 73 -8 133 108 -213 138 163
$$ packed form
7537F7K32k52j31J94o5Q0p5J41k67P7J59k72J61l0j29J86lq7O7N7k11L2o0k3R9
7562e3r2J0K42n9J05j42j09J42N9j53K4J03j35m3J50Nj34J20p4J48j12mJ37j57
7586b2k1J01kK4mj69p0K71k85L37k11R4j85o2J73J91l12PJ48k1J80j88j00Q9J45
7611A08l17L23M8r1k15K2J95P1j12K6o5j9L44j66nl72M44j23j69k5J80n9P0p4
7635A9M5k13J62l41K46Q1J52r0j3P5M9O9k74N7o9N9q2J55P2J0j84N2k09Q7r9J15
7661f9K7R2J88k48j87Q4P1j25K31m3oj17K72j33p4L5J58J5k36Q0m6J03j61q1J37
7686c3K12j72k03N7j3K39k6n1J71k67J78n0p0R0o4m5K38j69l7J62l46J93j0q1
7710i7J5J71p6j05M1o0%J70O7j05j85K21k3N6k90K90Oo3m1Q1q1J41k5l21L51K5
$$ plain form
7736 163 -37 -104 -151 180 40 91 203 7 165 33 -72 89 67 -102 -181 227 121 -93 53 -175 81 159
7758 159 86 -129 -2 27 -37 -317 -216 149 198 49 -103 -4 -26 60 70 331 -166 -166 -20 -44 136 188 267 26
7782 26 -119 -180 -51 -29 67 -106 155 89 223 6 -70 140 -99 110 -130 -52 -81 49 97 -33 76 -78 -167
7805 -167 15 -230 -23 43 138 -333 -14 -67 -72 -38 -177 72 68 86 -169 -51 -27 -133 -198 -104 -1 140 94 75 188
7830 188 137 76 -126 -21 56 -33 -51 93 113 -70 47 -17 -182 38 -6 -98 -292 63 29 -78 305 60 59 -49
7854 -49 74 -212 -230 111 365 138 142 -28 99 56 33 -208 142 -108 -52 -145 -24 -38 -24 -69 -194 49 157 -193
7878 -193 55 -45 83 -346 -114 -236 -155 195 38 31 86 -22 -118 34 199 95 -212 198 -74 188 212 112
7900 112 -303 -97 171 -45 3 -15 96 -90 148 -69 41 174 76 -129 237 48 31 55 2 44 92 233 -110
$$ packed form
7736A63k00o7m7L31j40N1J12j96J58j32j05J61k2j69p9M08j06k14J46k28K56P8
7758A59p3k15J27K9o4k80J01L65M9j49j52R9k2Q6J0K61m97%J46k4J80N2P9k41
7782B6j45o1J29K2R6j73K61o6J34k17p6K10k39K09k40P8k9J30M8j30J09j54q9
7805a67J82k45K07O6R5m71L19n3nL4j39K49mJ8k55J18K4j06o5R4J03J41m6j9J13
7830A88n1o1k02J05P7q9j8J44K0j83J17o4j65K20m4r2j94L55l4j07L83k45jj08
7854d9J23k86j8L41K54k27Mj70J27m3k3k41L50k50N6r3J21j4J4m5j25K43J08l50
7878a93K48j00J28m29K32j22Q1L50j57pN5j08r6J52J65j04l07M10k72K62K4j00
7900A12m15K06K68k16M8j8J11j86K38k17J10J33r8k05L66j89j7K4n3M2M8J41l43
$$ plain form
7923 -110 -27 229 85 107 -1 69 101 150 -108 -224 -190 -50 -128 92 274 114 -86 -54 -64 203 167 36 31 17
7947 17 94 54 -45 203 -70 -164 -37 37 -65 -105 21 138 -91 -183 -263 -246 -287 -53 -36 -39 -180 -21 -38 46 61 -146
7973 -146 110 -208 14 72 -62 121 119 -101 48 -183 -81 36 172 3 -21 -39 68 -218 11 3 -143 2
7995 2 26 -18 58 -139 -64 -146 58 120 -108 -146 -59 -76 48 -182 91 42 88 -134 102 164 167 41 -123 191 -85
8020 -85 100 -55 -46 7 -55 89 -42 40 80 -19 94 -159 -60 -96 20 -60 -245 34 56 276 -107 -31 32 165 149
8045 149 -222 158 294 -13 -79 108 120 -304 -151 75 -153 -5 -34 -198 48 -172 1 94 -55 -114 47 -73
8067 -73 332 -77 24 -112 -67 -23 59 -155 -93 7 56 -6 43 -26 9 11 -16 -117 75 198 -121 1 -7 37 -188
8092 -188 -135 24 4 48 -40 -110 94 -104 -33 102 -56 -13 293 348 -75 -196 108 -87 167 44 -182 88 17
$$ packed form
7923a10Q3K56j44K2j08P0L2M9k58j16L4J40p8K20J82j60k00L2j0K67l6j31nj4
7947A7P7m0r9K48k73r4J27P4j02m0J26J17k29r2q0J7m1K34J7lj41J59j7Q4J5k07
7973a46K56l18K22N8j34J83kk20J49k31J02J17J36j69k4j8J07k86K29qj46J45
7995BK4m4P6j97P5q2K04O2k28l8Q7j7J24k30K73m9M6k22K36O2Lj26j64L14k76
8020h5J85j55RN3o2J44j31Q2M0r9J13k53R9l6J16q0j85K79K2K20l83P6O3J33j6
8045A49l71L80J36l07o6J87J2m24J53K26k28J48k9j64K46k20J73R3j49n9J61j20
8067g3M05m09J01j36M5M4Q2k14O2J00M9o2M9o9L5Kk7j01J92J23l19J22qM4k25
8092a88N3J59k0M4q8p0K04j98P1J35j58M3L06N5m23j21L04j95K54j23k26K70p1
$$ plain form
8115 17 -171 31 -72 -266 -184 68 -115 160 37 73 -131 43 190 -322 -32 181 163 -469 131 59 -139 70
8137 70 46 -98 -38 -23 -354 -110 65 158 46 -58 105 -196 97 -158 126 42 26 -49 -49 -27 -205 -275 -156 -145
8161 -145 -151 -138 -101 120 16 -79 206 -62 64 96 13 25 54 117 521 17 14 187 -69 63 -188 -29 -121 -171 -81
8186 -81 96 47 123 -11 -48
$$ packed form
8115A7j88K02j03j94Q2K52j83K75j23L6k04J74J47n12K90K13j8o32O00p2j98K09
8137G0k4j44O0J5l31K44J75R3j12j04J63l01K93k55K84q4j6p5%K2j78p0J19J1
8161a45oJ3L7K21j04r5K85k68J26L2q3J2K9O3M04n04lJ73k56J32k51J59r2n0R0
8186h1J77m9P6j34l7
8191d8
$$ Imaginary data points
##PAGE= N=2
##DATA TABLE= (X++(I..I)), XYDATA
$$ plain form
0 0 0 0 0 0 0 0 0 0 0 0 8 -8 8 -8 8 -16 16 -24 24 -32 40 -44 50 -64 72 -82 96 -112 129 -146 168 -191 215
33 215 -243 273 -308 345 -385 430 -478 532 -589 654 -722 798 -882 973 -1072 1180 -1298
50 -1298 1432 -1578 1741 -1920 2126 -2361 2626 -2933 3298 -3731 4260 -4919 5770 -6913 8529
65 8529 -10983 15133 -23443 46379 -239765 -717690 121913 557984 -47065 -424518 44719
76 44719 330490 118645 -45283 -54544 -125647 518 212425 17095 -323994 -77041 373123
87 373123 191175 -276836 -178924 188965 130959 -148220 -153300 -15101 56913 111402 64768
98 64768 -121345 -102681 152041 133005 -190955 -204910 116078 168870 -58349 -76242 72236
109 72236 66357 5923 14050 -54545 -110854 35819 129962 -40189 -116448 88571 152577 -67794
$$ packed form
0@%%%%%%%%%%Qj6J6j6J6k4L2m0M8n6P2q4R4j14J36j54J78k08K41k75L14l59M06
33B15m58N16n81O53p30Q15r08J010j121J243j376J520j680J855k045K252k478
50a298K730l010L319l661M046m487M987n559O231p029P991r179J0689j2683J5442
65H529j9512K6116l8576O9822k86144m77925Q39603M36071o05049l77453M69237
76D4719K85771k11845j63928r261p1103J26165K11907j95330l41089K46953M50164
87C73123j81948m68011R7912L67889n8006k79179n080J38199P2014N4489m6634
98F4768j86113J8664K54722j9036l23960j3955L20988N2792k27219j7893J48478
109G2236n879o0434Q127o8595n6309J46673R4143j70151p6259K05019O4006k20371
$$ plain form
121 -67794 -126281 55047 47724 -124146 -51092 128519 21798 -129980 30583 167540 -38863
132 -38863 -183884 14991 136665 -42848 -124656 45315 116273 65 -34767 24182 4791
143 4791 -30043 9798 7377 -46071 -3150 74873 26796 -47462 -405 44815 -22803 -64072
155 -64072 -947 22565 -29425 -17149 49916 28070 -42259 -18061 36013 -6419 -56561 -8411
167 -8411 37074 4682 -6377 31784 22265 -18352 -701 24420 -14464 -38714 8122 36548
179 36548 3942 -10133 12457 10736 -5985 -1188 -12488 -43615 -17022 44650 20961 -53176
191 -53176 -24386 67910 41666 -70673 -65639 43570 55193 -35930 -51716 28603 62020 13230
203 13230 -28113 -19781 12324 28240 118 -39218 -16009 45300 40655 -23564 -35337 16110
$$ packed form
121f7794n8487J81328p323j71870P3054J79611j06721j51778J60563J36957k06403
132c8863j45021J98875J21674j79513q1808J69971P0958j16208l4832N8949j9391
143D791l4834L9841k421n3448M2921P8023m8077p4258M7057M5220o7618m1269
155f4072O3125K3512n1990J2276O7065k1846p0329K4198N4074m2432n0142M8150
167h411M5485l2392j1059L8161r519m0617J7651K5121l8884k4250M6836K8426
179C6548l2606j4075K2590j721j6721M797j1300l1127K6593O1672k3689p4137
191e3176K8790R2296k6244j12339N034J09209J1623r1123j5786Q0319L3417m8790
203A3230m1343Q332L2105J5916k8122l9336K3209O1309m645o4219j1773N1447
$$ plain form
215 16110 28482 -18205 -38757 -9685 12232 8058 2724 -5156 -13642 3760 23212 -6525 -44586
228 -44586 -12325 41420 20179 -30880 -10966 40401 28296 -19713 -22626 6392 15329 3732
240 3732 -7735 -8078 10356 25668 4840 -26831 -14406 17745 4320 -30390 -18001 19662 14914
253 14914 -15386 -10012 12117 2915 -16262 -6213 5884 -4028 -4603 14024 13259 -4187 800 14993
267 14993 2933 -12119 -1708 8299 1313 195 6796 3104 -1166 4245 239 -15146 -11551 6106
281 6106 1939 -15488 -6756 14480 6707 -15635 -9616 9579 2004 -14125 -3647 11967 5273
294 5273 -1197 7506 8015 -1683 950 6662 -2634 -5878 7158 9572 -2761 -2056 8261 1844 -9462
309 -9462 -4464 545 -7683 -8481 2525 2367 -7581 -3725 7069 196 -11972 -4728 7559 761 -7767
$$ packed form
215A6110J2372m6687k0552K9072K1917m174n334p880q486J7402J9452k9737l8061
228d4586L2261N3745k1241n1059J9914N1367j2105m8009k913K9018Q937j1597
240C732j1467l43J8434J5312k0828l1671J2425L2151j3425l4710J2389L7663m748
253A4914l0300N374K2129r202j9177J0049J2097r912n75J8627p65j7446M987J4193
267A4993j2060j5052J0411J0007o986j118O601l692m270N411m006j5385L595J7657
281F106m167j7427Q732K1236p773k2342O019J9195p575j6129J0478J5614o694
294E273o470Q703N09r698K633N712r296l244J3036K414j2333P05J0317o417j1306
309i462M998N009q228p98J1006j58r948L856J0794o873j2168P244J2287o798q528
$$ plain form
324 -7767 2485 12659 4466 -2255 4303 6281 -1056 -502 3822 -43 -250 7262 3960 -5719 -1318
339 -1318 6096 -3551 -12533 -3273 4248 -3950 -7956 -95 3173 -3018 -4802 -501 -833 -3692 -209
354 -209 4408 1284 -666 5524 8685 1147 -2437 3674 4616 -358 213 3210 947 1554 4945 -795
370 -795 -7849 -1812 4019 -4201 -11252 -2998 4929 -370 -6616 -3997 1043 1265 -2211 -3847 -1867 2284
386 2284 5134 3285 -719 898 6849 6386 -1385 -3171 3626 6220 861 -1792 991 2010 1024 -19
402 -19 -3523 -6014 -2120 1115 -3554 -6168 -1547 1106 -1379 -2825 -2245 -2041 -634 1300 1102 -402
418 -402 1478 4140 4976 2808 76 528 3564 4613 1594 -1544 -1067 3453 6168 -764 -9661 -4112
434 -4112 7777 2592 -13254 -10449 6285 7564 -6976 -11978 -657 7827 1700 -7695 -6845 3372
$$ packed form
324g767J0252J0174q193o721O558J978p337N54M324l865k07P512l302r679M401
339a318P414r647q982R260P521q198m006P861L268o191j784M301l32k859L483
354b09M617l124j950O190L161p538l584O111R42m974N71K997k263O07L391n740
370g95p054O037N831q220p051Q254P927n299o246K619N040K22l476j636J980M151
386B284K850j849m004J617N951m63p771j786O797K594n359k653K783J019r86j043
402a9l504k491L894L235m669k614M621K653k485j446N80K04J407J934j98j504
418d02J880K662Q36k168k732M52L036J049l019l138M77M520K715o932q897N549
434d112J1889n185j5846K805J6734J279j4540n002J1321Q484o127r395Q50J0217
$$ plain form
448 3372 9305 3151 -5058 -2498 7398 11256 1027 -8615 -1791 11772 8792 -6298 -8160 4780
462 4780 10023 -1193 -10517 -5673 4481 3688 -6444 -9538 -1164 4655 -281 -6117 -4146 259 1665
477 1665 993 -1017 -2548 1573 6792 4099 -2027 -23 5758 4848 -176 -40 2671 1512 -314 2659
493 2659 2943 -4437 -6616 3390 6776 -8021 -14609 2619 12423 -3849 -16078 -3374 10935 3787
507 3787 -9573 -7723 5155 9410 1612 -5867 -1955 6786 9101 2202 -5250 -2939 8295 10818
521 10818 -2587 -11434 126 13903 4646 -13504 -11030 7327 10577 -7283 -16308 -1139 11521
534 11521 534 -13407 -5743 7088 4041 -4646 -3615 689 2619 5394 3187 -3729 -1684 8426
548 8426 8044 -4450 -4879 7414 9230 -3815 -7124 4231 6705 -4854 -8050 3437 4754 -7715
$$ packed form
448C372N933o154q209K560R896L858j0229r642O824J3563k980j5090j862J2940
462D780N243j1216r324M844J0154p93j0132l094Q374N819m936n836J971M405J406
477A665o72k010j531M121N219k693o126K004N781r10n024J36K711j159j826K973
493B659K84p380k179J0006L386j4797o588J7228R804j6272j2229J2704J4309p148
507C787j3360J850J2878M255p798p479L912Q741K315o899p452K311J1234K523
521A0818j3405q847J1560J3777r257j8150K474J8357L250j7860r025J5169J2660
534A1521j0987j3941P664J2831l047q687J031M304J930K775k207o916K045J0110
548H426l82j2494m29J2293J816j3045l309J1355K474j1559l196J1487J317j2469
$$ plain form
562 -7715 -8177 4323 3471 -8689 -6940 5476 4197 -6507 -6047 3414 5185 -273 -2128 1980 4188
577 4188 2149 1333 2567 1017 -616 4472 6016 -2923 -6430 4302 9172 -4148 -11553 405 9087
592 9087 -1587 -12290 -4693 6958 2568 -8899 -6686 3425 3840 -2797 -2976 564 1314 2630 3038
607 3038 -1148 -1789 5944 7624 -1918 -4951 4369 7821 -632 -4972 1678 5056 -1095 -5711 -963
622 -963 2345 -1902 -5356 -1560 1635 -2711 -5381 -557 2255 -1415 -3484 275 3197 702 -1056
637 -1056 867 3277 2696 1006 1343 2253 1317 1417 3310 1408 -2981 -506 4716 984 -6170 -3149
653 -3149 3710 995 -6311 -5421 859 2429 -2597 -5576 -2073 2409 1898 -2505 -3235 1130 5322 2655
669 2655 -3065 -1450 5381 5509 -851 -2091 3182 4813 583 -1872 -375 1404 1660 -479 -3107 -2589
$$ packed form
562g715m62J2500q52j2160J749J2416j279j0704M60R461J771n458j855M108K208
577D188k039q16J234j550j633N088J544q939l507J0732M870j3320p405J1958Q682
592I087j0674j0703P597J1651m390j1467K213J0111M15o637j79L540P50J316M08
607C038m186o41P733J680r542l033R320L452q453m340O650L378o151m616M748
622i63L308m247l454L796L195m346k670M824K812l670k069L759K922k495j758
637a056J923K410n81j690L37R10r36J00J893j902m389K475N222l732p154L021
653c149O859k715p306Q90O280J570n026k979L503M482n11m403p30M365M192k667
669B655n720J615O831J28o360j240N273J631m230k455J497J779K56k139k628N18
$$ plain form
685 -2589 731 114 -3668 -3456 -562 -145 -1784 -2188 -1201 -824 616 909 -205 -1064 1579 4011 1478
702 1478 -1565 1129 5298 2627 -1673 437 4029 1520 -1620 -364 1188 -441 -1235 -986 -1633 -1566
718 -1566 -803 -1735 -3267 -1927 -2 -1093 -2383 -514 463 -391 -409 1357 1393 652 1452 2465 1813 289
736 289 1496 2969 1375 -888 537 2604 -98 -1922 -415 625 -1181 -1614 -1642 -2067 -1089 -655 -2553
753 -2553 -3181 -435 852 -2012 -2383 750 1958 -118 -652 1623 2613 1121 740 2156 2342 1092 1104
770 1104 1711 1031 12 426 899 -897 -1628 -475 -545 -1901 -1871 -1221 -1463 -1713 -1199 -1305 -1761 -508 451
789 451 -583 -674 980 1647 727 555 1830 2129 1400 1229 1525 1745 1071 445 738 684 -255 -728 43 -667
809 -667 -1717 -1020 -741 -1486 -1854 -1320 -1435 -1180 -940 -959 -870 171 942 -196 -141 1392 2129 954 590 1848
$$ packed form
685b589L320o17l782K12K894M17j639m04R87L77J440K93j114q59K643K432k533
702A478l043K694M169k671m300K110L592k509l140J256J552j629p94K49o47O7
718a566P63r32j532J340J925j091j290J869R77q54j8J766L6p41Q00J013o52j524
736B89J207J473j594k263J425K067k702j824J507J040j806m33k8m25R78M34j898
753b553o28K746J287k864l71L133J208k076n34K275R90j492l81J416J86j250J2
770A104O07o80j019M14M73j796p31J153p0j356L0O50k42k50N14j06m56J253R59
789D51j034r1J654O67r20j72J275K99p29j71K96K20o74o26K93n4r39m73P71p10
809f67j050O97K79p45l68N34j15K55K40j9Q9J041P71j138N5J533P37j175l64J258
$$ plain form
829 1848 2372 1628 922 743 1711 1661 -65 -640 -10 70 -451 -1365 -1556 -1338 -829 -1331 -2356 -1636 -652 -578
849 -578 -1228 -1076 -373 360 800 519 351 716 1603 1706 1035 889 1762 2020 975 200 384 1188 727 -756
869 -756 -613 -94 -568 -1332 -1303 -1310 -1514 -1392 -456 -935 -2000 -978 -2 11 -488 -209 328 1194 1271 647 673 1867
891 1867 2036 1359 480 424 1298 1819 305 -1241 355 1316 -148 -1737 -1683 -677 -190 -1172 -1832 -1881 -754
910 -754 185 -1172 -1873 -540 1115 637 -325 19 942 1898 1144 601 1159 1817 1568 1198 753 417 663
929 663 1039 -31 -1049 -758 -269 -130 -1447 -1686 -1185 -718 -986 -1481 -1715 -992 -292 0 -969 -598 505
948 505 1305 994 420 595 1489 2293 1665 -238 306 2276 2200 -670 -1361 770 1495 -643 -2484 -1304
966 -1304 322 -350 -2084 -2190 -945 -624 -739 -1071 -1835 -850 1377 1241 -1530 -1117 1922 2654 -2 -934
$$ packed form
829A848N24p44p06j79R68n0j726n75O30Q0n21r14j91K18N09n02j025P20R84P4
849e78o50J52P03P33M40k81j68L65Q87J03o71j46Q73K58j045p75J84Q04m61j483
869g56J43N19m74p64K9pk04J22R36m79j065J022R76J3m99K79N37Q66P7o24K6J194
891A867J69o77q79n6Q74N21j514j546J596R61j464j589N4J006M87r82o60m9J127
910g54R39j357p01J333J655m78r62L44R23R56p54n43N58O58k49l70m45l36K46
929F63L76j070j018K91M89J39j317k39N01M67k68m95k34P23P00K92r69L71J103
948E05Q00l11n74J75Q94Q04o28j903N44J970p6k870o91K131P25k138j841J180
966a304J626o72j734j06J245L21j15l32p64R85K227j36k771M13L039P32k656r32
$$ plain form
984 -934 1665 3151 1189 -350 1086 1666 659 44 227 -86 -256 -246 -225 -1291 -1752 -459 13 -1271
1002 -1271 -2229 -1284 -80 -671 -1246 -368 428 301 81 616 1084 877 685 1224 1770 816 208 1077 2167
1021 2167 696 -1047 404 1671 -50 -2171 -1086 807 -278 -1803 -1567 -767 -1021 -974 -735 -1114 -1095
1038 -1095 143 769 -582 -1300 1087 2850 476 -1238 953 3123 1444 -534 537 2301 1062
1053 1062 -261 -290 345 -134 176 -362 -977 -1197 -403 -766 -1586 -1728 -605 -170 -779 -1152 -953 236 847
1072 847 73 -191 813 1543 839 504 1059 1698 883 430 1226 1167 311 115 389 532 -812 -1218 248
1091 248 -190 -1628 -1593 -633 -646 -1535 -1287 -278 -742 -924 357 16 -648 -139 1273 970 1 1046 1879
1110 1879 1455 233 457 1218 1388 703 -276 162 337 -145 -430 -864 -970 -555 -418 -1233 -1736 -662 -110
$$ packed form
984i34K599J486j962j539J436N80j007o15J83l13j70J0K1j066m61J293M72j284
1002a271r58R45J204n91n75Q78P96j27k20N35M68k07j92N39N46r54o08Q69J090
1021B167j471j743J451J267j721k121J085J893j085j525K36Q00k54M7K39l79J9
1038a095J238O26j351p18K387J763k374j714K191K170j679j978J071J764j239
1053A062j323k9O35m79L10n38o15k20P94l63q20j42J123M35o09l73J99J189O11
1072H47p74k64J004P30p04l35N55O39q15m53P96n9q56j96K74J43j344m06J466
1091B48m38j438L5R60j3q89K48J009m64j82J281l41o64N09J412l03r69J045Q33
1110A879m24j222K24P61J70o85r79M38J75m82k85m34j06M15J37q15n03J074N52
$$ plain form
1129 -110 -1230 -1104 -204 -60 -135 481 -96 173 900 1283 -26 340 1658 1277 519 435 1123 591 -117 124
1149 124 496 168 -416 -799 -589 -430 -1160 -934 -410 -1173 -1231 -500 -535 -1142 -326 525 -238 -462 781 922
1169 922 120 406 1395 1047 711 1208 1172 615 601 706 280 -112 -33 -170 -293 -818 -1055 -777 -700 -1387 -1085
1190 -1085 -693 -821 -842 -399 -173 -575 -306 347 280 18 890 1022 811 928 1247 832 757 1154 943 357 523
1211 523 546 27 -560 -266 -296 -608 -902 -1067 -932 -615 -848 -892 -447 -473 -503 -195 -259 -307 158 656 503 362
1233 362 1104 1116 741 945 1094 538 355 678 492 48 -96 41 99 -416 -1141 -660 -510 -916 -1028 -639 -859
1254 -859 -719 -624 -504 -260 -36 72 223 85 487 677 834 644 632 1092 735 730 708 662 301 502 273 -177
1276 -177 -446 -79 -479 -929 -1086 -842 -472 -1074 -906 -800 -676 -629 -373 -78 -34 155 573 477 357 728 1078
$$ packed form
1129a10j120J26R00J44p5O16n77K69P27L83j309L66J318l81p58q4O88n32p08K41
1149A24L72l28n84l83K10J59p30K26N24p63n8P31l5o07Q16Q51p63k24J243J41
1169I22q02K86R89l48l36M97l6n57j4J05m26l92P9j37j23n25k37K78P7o87L02
1190a085L92j28k1M43K26m02K69O53o7k62Q72J32k11J17L19m15p5L97k11n86J66
1211E23K3n19n87K94l0l12k94j65J35L17k33m4M45k6l0L08o4m8M65M98j53j41
1233C62P42J2l75K04J49n56j83L23j86m44j44J37N8n15p25M81J50m06j12L89k20
1254h59J40R5J20K44K24J08J51j38M02J90J57j90j2M60l57nk2m6l61K01k29m50
1276a77k69L67m00m50j57K44L70o02J68J06J24M7K56K95M4J89M18r6j20L71L50
$$ plain form
1297 1078 586 520 949 823 513 338 567 317 38 -10 -341 -517 -392 -598 -470 -1127 -646 -754 -468 -618
1317 -618 -619 -582 -463 -341 135 344 41 20 638 898 703 576 1136 870 773 695 758 468 291 406 -64 -173
1339 -173 -262 -396 -672 -579 -720 -950 -841 -450 -847 -516 -563 -531 -255 -35 39 144 566 460 579 711 729 779
1361 779 705 991 522 406 608 692 155 18 187 -167 -424 -524 -607 -736 -662 -680 -717 -725 -988 -411 -443 -535 -360
1384 -360 134 260 34 156 518 783 745 578 820 559 768 769 368 323 175 151 105 -197 -136 -500 -298 -136
1406 -136 -689 -926 -549 -611 -879 -857 -688 -331 -310 -110 100 257 631 470 757 515 425 713 830 667 540
1427 540 436 695 292 54 29 -77 -324 -594 -659 -425 -480 -669 -857 -497 -656 -692 -583 -558 -82 -118 -3 17
1449 17 280 256 483 738 694 570 1130 804 750 476 290 520 196 -97 -30 -191 -463 -264 -510 -567 -800 -457
$$ packed form
1297A078m92o6M29j26l10j75K29k50k79m8l31j76J25k06J28o57M81j08K86j50
1317f18jL7J19J22M76K09l03k1O18K60j95j27N60k66r7p8O3k90j77J15m70j09
1339a73q9j34k76R3j41k30J09L91l97L31m7L2K76K20P4J05M22j06J19J32J8N0
1361G79p4K86m69j16K02Q4n37j37J69l54k57j00q3j29P4j8l7qk63N77l2r2J75
1384c60M94J26k26J22L62K65l8j67K42k61K09Jm01m5j48k4m6l02O1l64K02J62
1406a36n53k37L77o2k68K2J69L57K1K00K10J57L74j61K87k42r0K88J17j63j27
1427E40j04K59m03k38k5j06k47k70o5K34n5j89j88L60j59l6J09K5M76l6J15K0
1449A7K63k4K27K55m4j24N60l26n4k74j86K30l24k93O7j61k72J99k46n7k33L43
$$ plain form
1471 -457 -641 -684 -837 -267 -306 -319 -301 -265 272 428 252 300 690 690 631 533 520 604 613 526 260 88 -169 33 -26
1496 -26 -381 -715 -506 -176 -590 -733 -584 -571 -669 -448 -360 -97 -292 -50 93 241 552 416 558 485 542 836
1518 836 588 589 524 570 785 147 59 -6 -112 -200 -463 -539 -657 -687 -708 -509 -556 -651 -667 -682 -16 -317 -196 -261 257
1543 257 403 -171 373 848 1045 492 727 695 523 556 497 527 121 130 214 -9 -716 -504 -509 -603 -803 -869 -686 -608
1567 -608 -643 -448 -298 -143 -68 269 241 16 217 437 521 693 572 713 558 668 432 651 124 193 339 -428
1589 -428 -19 -11 -349 -695 -325 -346 -764 -794 -542 -431 -646 -313 -243 -69 -5 67 179 447 206 421 644 635 525
1612 525 369 787 454 136 751 597 94 83 7 -347 -610 -388 -471 -692 -588 -383 -654 -510 -416 -592 -371
1633 -371 -43 -257 78 120 178 385 517 550 440 739 625 338 370 424 268 308 309 -92 -476 -170 -247 -623 -859
$$ packed form
1471d57j84m3j53N70l9j3J8L6N37J56j76M8L90%n9r8j3Q4Rq7k66j72k57K02n9
1496b6l55l34K09L30m14j43J49J3r8K21Q8K63j95K42J43J48L11j36J42p3N7K94
1518H36k48Jo5M6K15o38q8o5j06q8k63p6j18l0k1J99m7r5j6j5O66l01J21o5N18
1543B57J46n74N44M75J97n53K35l2j72L3n9L0m06RQ4k23p07K12nr4k00o6J83P8
1567f08l5J95J50J55P5L37k8k25K01K20Q4J72j21J41j55J10k36K19n27O9J46p67
1589d28M09Ql38l46L70k1m18l0K52J11k15L33P0J74O4P2J12K68k41K15K23rj10
1612E25j56M18l33l18O15j54n03j1p6l54k63K22q3k21J04K05k71J44R4j76K21
1633c71L28k14L35M2N8K07J32L3j10K99j14k87L2N4j56M0Jm01l84L06p7l76k36
$$ plain form
1656 -859 -241 -493 -941 -643 -620 -580 -458 -408 -130 -308 23 28 42 159 343 709 606 287 242 636 669 383 324
1679 324 266 213 -249 171 -82 -482 -458 -299 -483 -935 -641 -522 -625 -585 -306 -588 -313 -313 15 -226 -31 494
1701 494 400 477 647 503 581 302 770 780 374 577 358 71 -235 -48 95 -337 -521 -549 -249 -435 -637 -303
1723 -303 -369 -500 -292 -207 -107 -279 191 154 -44 65 618 674 283 732 784 744 456 513 545 149 184 55 55 -387
1747 -387 -140 -248 -365 -513 -359 -166 -473 -286 -305 -148 -481 120 105 -122 -22 227 599 339 509 320 558
1768 558 48 700 460 624 340 194 477 -21 -184 198 -125 -425 -266 -213 -558 -715 -497 -181 -574 -529 -293
1789 -293 -447 -19 60 133 207 78 29 438 535 400 617 526 462 380 482 291 -10 135 132 -24 -212 -180 -173 -522
1813 -522 -616 -70 -558 -497 -481 -449 -393 -309 -336 -14 -83 278 51 236 124 518 509 402 441 533 545 100 411 421 57
$$ packed form
1656h59O18k52m48K98K3M0J22N0K78j78L31NJ4J17J84L66j03l19m5L94L3k86n9
1679C24n8n3m62M20k53m00K4J59j84m52K94J19j03M0K79k82K75%L28k41J95N25
1701D94r4P7J70j44P8k79M68J0m06K03k19k87l06J87J43m32j84k8L00j86k02L34
1723c03o6j31K08Q5J00j72M70l7j98J09N53N6l91M49N2m0k88N7L2l96L5j29%m42
1747c87K47j08j17j48J54J93l07J87j9J57l33O01j5k27J00K49L72k60J70j89K38
1768E58n10O52k40J64k84j46K83m98j63L82l23l00J59N3l45j57K18L16l93M5K36
1789b93j54M28P9P3P4j29m9M09R7j35K17r1o4q2J02j91l01J45lj56j88L2Pl49
1813e22r4N46m88O1J6L2N6Q4k7L22o9L61k27J85j12L94rj07L9R2J2m45L11J0l64
$$ plain form
1838 57 -13 -82 -82 -104 -307 -352 -593 -407 -601 -214 -665 -407 -195 -333 -206 -426 49 204 185 158 340 317 426
1861 426 650 513 483 408 495 496 -19 293 -155 0 -247 33 -85 -411 -402 -481 -549 -496 -284 -548 -425 -280 -231 -212
1885 -212 -74 -77 272 461 224 265 209 543 717 396 317 612 44 97 166 65 81 -336 -144 -293 -388 -170 -456
1908 -456 -312 -574 -477 -498 -300 -454 -148 -115 43 65 108 329 385 319 253 688 589 364 362 471 515 65 85 82 -111
1933 -111 -79 -333 -64 -268 -471 -312 -269 -346 -376 -563 -396 -420 -557 -9 -59 -194 296 134 248 244 355 517 484
1956 484 611 242 193 563 455 202 391 290 -132 -374 -32 -299 -468 -518 -503 -638 -772 -499 -497 -342 -145 -307
1978 -307 -181 -170 223 120 289 197 139 358 595 387 542 481 335 256 163 144 90 -78 -8 143 -173 -506 -472
2001 -472 -509 -420 -535 -490 -364 -412 -375 -284 -286 -229 -260 -66 243 176 260 481 474 367 538 191 390 265 135 181 95
$$ packed form
1838E7p0o9%k2k03m5k41J86j94L87m51K58K12j38J27k20M75J55j9k7J82k3J09
1861D26K24j37l0p5Q7Jn15L12m48J55k47K80j18l26Rp9o8N3K12k64J23J45M9J9
1885b12J38lL49J89k37M1n6L34J74l21p9K95n68N3O9j01J6m17J92j49r5K18k86
1908d56J44k62R7k1J98j54L06L3J58K2M3K21N6o6o6M35r9k25kJ09M4m50K0lj93
1933a11L2k54K69k04k03J59M3p7l0j87J67k4j37N48n0j35M90j62J14mJ11J62l3
1956D84J27l69m9L70j08k53J89j01m22k42L42k67j69n0J5j35j34K73KJ55J97j62
1978c07J26J1L93j03J69r2n8K19K37k08J55o1j46p9r3j9n4j68P0J51l16l33L4
2001d72l7Q9j15M5J26m8L7R1kN7l1J94L09o7Q4K21pj07J71l47J99j25j30M6q6
$$ plain form
2026 95 -10 -223 -207 -159 -350 -368 -109 -21 -453 -693 -395 -390 -353 -281 -145 -44 -72 28 230 59 198 411 483 614
2050 614 635 356 239 589 120 46 124 8 -26 -14 -300 -304 -287 -179 -256 -284 -666 -542 -293 -449 -274 -36 -196
2073 -196 113 -198 7 325 283 203 273 7 446 351 514 511 269 462 82 -160 76 -18 -375 -193 -469 -245
2095 -245 -320 -299 -349 -565 -316 -330 -282 -268 -269 -102 -106 16 1 304 245 470 319 268 370 276 211 99 268 303 45
2120 45 -96 -130 -161 -114 -517 -687 -512 -379 -428 -428 -506 -143 -408 -220 -327 -294 116 95 253 88 -40 143 406
2143 406 362 176 435 257 217 351 107 -23 54 -206 -35 -165 -355 -355 -472 -471 -483 -536 -366 -189 -329 -264 -51
2166 -51 -253 -175 244 235 393 277 252 415 145 366 433 194 434 230 293 308 111 68 -90 -129 -123 -72 -217 -57
2190 -57 -307 -174 -499 -413 -382 -323 -243 -312 -169 152 294 208 85 333 363 604 488 278 592 345 436 309 264
$$ packed form
2026I5j05k13J6M8j91j8K59Q8m32k40K98NL7P2J36J01k8J00K02j71J39K13P2J31
2050F14K1k79j17L50m69p4P8j16l4J2k86mJ7J08p7k8l82J24K49j56J75K38j60
2073a96L09l11K05L18m2q0P0k66M39r5J63lk42J93l80k42K36r4l57J82k76K24
2095b45p5K1n0k16K49j4M8J4jJ67mJ22j5L03n9K25j51n1J02r4o5j12J69L5k58
2120D5j41l4l1M7m03j70J75J33m9%p8L63k65J88j07L3M10k1J58j65j28J83K63
2143D06m4j86K59j78m0J34k44j30P7k60J71j30j90%j17Jj2n3J70J77j40O5K13
2166e1k02P8M19rJ58j16k5J63k70K21O7k39K40k04O3J5j97m3j58l9ON1j45J60
2190e7k50J33l25Q6L1N9Q0o9J43L21J42q6j23K48L0K41j16k10L14k47R1j27m5
$$ plain form
2213 264 19 266 -32 -179 2 -391 -465 -436 -258 -468 -327 -438 -255 -198 -324 -236 -206 150 76 -48 243 254
2235 254 -105 176 403 438 365 334 408 268 102 49 124 93 -110 0 -391 -378 -308 -432 -251 -476 -394 -180 -117 -435
2259 -435 -114 -61 16 112 85 -8 254 413 377 463 478 455 322 417 473 366 353 -33 -23 -82 -27 -189 -377 -253 -398
2284 -398 -364 -100 -426 -551 -317 -230 -212 66 -111 -47 239 159 136 216 168 450 473 448 470 429 407 291 210 -82 86
2309 86 20 -14 -271 -55 -411 -225 -458 -147 -319 -491 -238 -248 -177 -103 -104 -1 -86 92 448 101 713 213 344
2332 344 400 460 280 210 247 79 102 92 114 56 -225 -233 -385 -452 -588 -484 -202 -216 -345 -100 7 -485 -40 38
2356 38 255 155 186 162 277 388 333 248 343 223 177 123 200 316 83 -28 -194 -225 -20 -86 45 -344 -392 -455
2380 -455 -288 -376 -411 -236 -161 -195 -135 -31 -15 -19 24 338 152 385 303 452 274 515 261 349 96 16 77 -113
$$ packed form
2213B64k45K47k98j47J81l93p4K9J78k10J41j11J83N7j26Q8L0L56p4j24K91J1
2235B54l59K81K27L5p3l1P4j40j66n3P5l1k03J10l91J3P0j24J81k25Q2K14O3l18
2259d35L21N3P7R6k7r3K62J59l6Q6J5k3j33R5N6j07j3l86J0n9N5j62j88J24j45
2284c98L4K64l26j25K34Q7J8K78j77O4K86q0k3Q0m8K82K3k5K2m1k2j16q1k92J68
2309H6o6l4k57K16l56J86k33L11j72j72K53j0P1P4jJ03q5J78L56l47O12n00J31
2332C44N6O0j80p0L7j68K3j0K2n8k81qj52o7j36J04K82j4j29K45J07m92M45P8
2356C8K17j00L1k4J15J11n5q5R5j20m6n4P7J16k33j11j66l1K05o6J31l89m8o3
2380d55J67q8l5J75P5l4O0J04J6mM3L14j86K33q2J49j78K41k54Q8k53q0O1j90
$$ plain form
2404 -113 -14 -337 -441 -382 -225 -139 -378 -382 -280 -263 -187 -340 -239 20 188 167 -13 112 75 254 287 173 247 433
2428 433 432 244 547 111 203 -211 -172 138 -198 25 -272 -160 -247 -192 -430 -295 -194 -319 -89 -216 -69 -12
2450 -12 73 81 21 271 296 177 522 417 297 593 340 416 94 -56 -37 -78 65 29 178 -137 -296 -139 -367
2473 -367 -312 -301 -86 -215 -255 -245 -316 -57 -78 137 206 261 320 224 417 294 288 344 313 203 290 -74 -101 133 -68
2498 -68 -303 -166 -53 -258 -225 -362 -381 -299 -245 -320 -170 -102 -161 -137 104 -135 36 68 205 230 37 258 116 235
2522 235 314 159 170 74 -14 -70 190 -193 -203 -123 -137 -152 -387 -476 -338 -427 -202 -473 -205 -214 -345 94 -113 21
2546 21 250 76 395 275 470 433 272 40 179 110 -5 3 171 76 28 61 -345 -359 -441 -240 -142 -328 -86 -152
2570 -152 -262 -371 -311 -37 -33 -36 -64 10 236 180 46 258 229 90 31 373 406 122 -105 -39 22 -38 -83 -307 -113
$$ packed form
2404a13R9l23j04N9J57Q6k39mJ02J7P6j53J01K59J68k1j80J25l7J79L3j14P4J86
2428D33jj88L03m36R2m14L9L10l36K23k97J12q7N5k38J35J01j25K30j27J47N7
2450a2Q5Qo0K50K5j19L45j05j20K96k53P6l22j50J9m1J43l6J49l15j59J57k28
2473c67N5J1K15j29m0J0p1K59k1K15O9N5N9r6J93j23oN6l1j10Q7l64k7K34k01
2498f8k35J37J13k05L3j37j9Q2N4p5J50O8n9K4K41k39J71L2J37K5j93K21j42J19
2522B35P9j55J1r6q8n6K60l83j0Q0j4j5k35q9J38q9K25k71K68rj31M39k07J34
2546B1K29j74L19j20J95l7j61k32J39o9j15QJ68r5m8L3m06j4q2K01R8j86K42o6
2570a52j10j09O0K74Mlk8P4K26n6j34K12k9j39n9L42L3k84k27O6O1o0m5k24J94
$$ plain form
2595 -113 -25 -77 -419 -202 -332 -505 -106 105 -436 -117 192 -226 -36 325 332 193 62 377 113 6 270
2616 270 261 221 236 184 115 4 -97 -30 -95 15 11 -528 -279 -189 -272 -107 -375 -372 -92 -83 -120 -201 12 79 -15 165 98
2643 98 -26 343 329 164 407 96 248 210 99 -137 108 -181 -201 -315 -356 -70 -300 -554 -190 -84 -341 -106
2665 -106 -153 75 -80 62 190 -30 88 114 215 276 360 408 185 283 276 246 216 22 112 49 -186 -98 -12 10 -56
2690 -56 -298 -425 -322 -253 -317 -127 5 -26 -35 -254 126 -46 -6 356 230 321 461 240 191 227 263 195 192 99 21
2715 21 -121 3 -163 -27 -67 -318 -144 -377 -235 -106 -135 -224 -129 14 34 81 -57 -144 228 179 310 68 366
2738 366 247 305 144 210 155 249 28 59 78 157 119 -220 -325 -202 -196 -230 -168 -250 -353 -172 -157 -13 -193 -246 -78
2763 -78 -66 252 114 -27 -152 131 260 144 350 33 184 294 271 9 310 -147 170 -88 -153 -8 -244
$$ packed form
2595a13Q8n2l42K17j30j73L99K11n41L19L09m18J90L61Pj39j31L15k64j07K64
2616B70rm0J5n2o9j11j01O7o5J10mn39K49R0q3J65k68LK80Rl7q1K13O7r4J80o7
2643I8j24L69j4j65K43l11J52l8j11k36K45k89k0j14m1K86k30k54L64J06k57K35
2665a06m7K28j55J42J28k20J18K6J01O1Q4M8k23R8pl0l0j94R0o3k35Q8Q6K2o6
2690e6k42j27J03O9o4J90J32l1rk19L80j72M0L62j26R1J40k21m9L6L6o8lr3p8
2715B1j42J24j66J36m0k51J74k33J42J29k9q9R5J43K0M7j38q7L72m9J31k42K98
2738C66j19N8j61O6n5R4k21L1J9P9l8l39j05J23Ol4O2q2j03J81J5J44j80n3J68
2763g8J2L18j38j41j25K83J29j16K06l17J51J10k3k62L01m57L17k58o5J45k36
$$ plain form
2784 -244 -295 -226 -476 -321 -224 -2 -172 -166 -69 -62 76 90 -100 21 13 93 527 328 183 234 414 203 360 139
2808 139 151 112 -96 -158 -291 -264 -244 7 -341 -226 -113 -133 -210 -116 -155 -84 -162 -89 -12 -73 242 -36 38 170 6
2833 6 153 203 29 211 109 -88 89 -48 -70 -155 -58 -139 -31 -77 -28 -370 -185 -36 -213 -91 48 -216 -192
2856 -192 42 203 -138 88 -12 45 164 236 96 487 234 217 -26 180 88 49 -102 -193 166 -85 0 -58 -79
2879 -79 -350 -127 -179 -255 -154 -409 -203 -11 -170 40 -132 -79 -131 217 32 -68 178 113 144 294 -189 122
2901 122 114 -60 14 -36 52 7 -159 -318 -79 -322 -288 -363 66 -10 -45 8 -302 -201 117 296 48 102 355 260
2925 260 269 23 216 222 198 185 143 149 85 -167 -393 -45 288 -88 -68 -348 -164 -97 -358 -81 -253 -154 -244 -3 -16
2950 -16 -55 58 70 153 -13 309 172 68 23 202 263 108 332 60 -106 23 177 -100 -75 -27 -156 -148 -186 -222
$$ packed form
2784b44n1O9k50J55R7K22j70OR7PJ38J4j90J21qQ0M34j99j45N1J80k11J57k21
2808A39J2l9k08o2j33K7K0K51l48J15J13k0p7R4l9P1p8P3P7o1L15k78P4J32j64
2833FJ47N0j74J82j02j97J77j37k2q5R7q1J08m6M9l42J85J49j77J22J39k64K4
2856a92K34J61l41K26j00N7J19P2j40L91k53j7k43K06r2l9j51r1L59k51Q5n8k1
2879g9k71K23n2p6J01k55K06J92j59K10j72N3n2L48j85j00K46o5L1J50m83L11
2901A22qj74P4n0Q8m5j66j59K39k43L4p5M29p6l5N3l10J01L18J79k48N4K53r5
2925B60Rk46J93Ok4j3m2Oo4k52k26L48L33l76K0k80J84O7k61K77j72R9r0K41j3
2950a6l9J13J2Q3j66L22j37j04m5J79O1j55K24k72j66J29J54k77K5M8j29Ql8l6
$$ plain form
2974 -222 -148 -330 -151 -221 -253 8 -232 145 53 -2 69 144 26 260 172 379 173 384 290 89 249 76 87
2997 87 -171 -77 62 36 -193 -197 -24 -265 -173 -466 -237 -81 -252 -139 -131 -126 -21 39 33 4 -82 -1 58 318 411 264
3023 264 193 470 59 -101 14 155 -36 96 59 -96 -356 -175 -120 -156 -156 -187 -205 -174 -169 -165 -87 -220 64 -15 314
3048 314 67 45 -6 277 390 80 280 -63 272 0 174 -70 -151 -65 -64 -58 -199 -220 -197 -146 -111 -234 126 -108
3072 -108 -192 171 -111 -158 -123 8 128 186 261 322 139 -11 104 187 268 335 182 186 -151 -48 28 108 -1 -56 -355
3097 -355 -212 -261 -261 -312 -207 -215 -82 -62 -60 -26 82 115 -92 103 145 323 194 28 121 102 103 180 245 241 107 109 -113
3124 -113 59 -38 -89 122 47 -246 -263 4 -399 -54 -162 -256 -92 155 -147 -201 -19 31 -13 278 218 187 62
3147 62 45 275 219 23 44 -7 -96 129 -74 -65 -5 -206 -60 -352 -229 -182 -129 -268 -229 -154 -123 -28 167 27 83
$$ packed form
2974b22P4j82J79p0l2K61k40L77r2n5P1P5j18K34q8K07k06K11r4k01J60j73J1
2997H7k58R4J39k6k29mJ73k41R2k93K29J56j71J13QNJ05O0ok9q6Q1N9K60R3j47
3023B64p1K77m11j60J15J41j91J32l7j55k60J81N5l6%l1j8L1NMP8j33K84p9L29
3048C14k47k2n1K83J13l10K00l43L35k72J74k44q1Q6JOj41k1K3N1L5j23L60k34
3072a08q4L63k82m7L5J31J20N8P5O1j83j50J15Q3Q1O7j53Ml37J03P6Q0j09n5k99
3097c55J43m9%n1J05qJ33K0KL4J08L3k07J95M2J78j29j66R3j9JP7O5mj34Kk22
3124a13J72r7n1K11p5k93j7K67m03L45j08r4J64K47l02n4J82N0m4K91o0l1j25
3147F2j7K30n6j96K1n1q9K25k03RO0k01J46k92J23M7N3j39L9P5L1R5J95j40N6
$$ plain form
3172 83 -49 277 110 199 349 174 155 271 206 182 50 263 -94 -218 -107 -50 19 -165 -270 -278 81 4 145
3195 145 -140 -382 -272 -176 -347 -64 42 -54 121 42 93 257 188 366 208 63 47 199 144 -17 50 115 -29
3218 -29 -61 -43 -259 -33 -174 -131 -117 -208 -164 40 84 -254 -34 -42 26 -253 -244 326 160 383 144 265 157 172 131
3243 131 125 60 241 -57 154 58 342 -143 -212 -140 -186 -50 -120 -263 -535 -337 -236 -189 -153 -345 -79 93 -88
3266 -88 165 49 73 91 137 168 232 434 209 34 149 354 -61 -334 32 -66 -61 -82 -190 78 -242 -265 -151 -173
3290 -173 -94 -219 -77 -281 43 119 -47 7 190 37 -40 311 173 363 278 86 30 348 292 198 -46 29 118
3313 118 2 -156 -114 -23 17 -123 -168 -234 -439 72 65 -49 -205 113 -76 -26 86 187 145 4 319 308 176
3336 176 58 110 126 -55 215 188 -52 -228 -90 102 -204 -322 -242 -388 -132 -159 -7 30 -286 -58 51 -87
$$ packed form
3172H3j32L26j67Q9J50j75j9J16o5k4j32K13l57j24J11N7O9j84j05qL59p7J41
3195A45k85k42J10R6j71K83J06r6J75p9N1J64o9J78j58j45j6J52n5j61O7O5j44
3218b9l2J8k16K26j41M3J4r1M4K04M4l38K20qO8k79RN70j66K23k39J21j08J5m1
3243A31oo5J81k98K11r6K84m85o9P2m6J36p0j43k72J98J01M7L6j92K66J72j81
3266h8K53j16K4J8M6L1O4K02k25j75J15K05m15k73L66r8Nk1j08K68l20k3J14k2
3290a73P9j25J42k04L24P6j66N4J83j53p7L51j38J90q5j92n6L18n6r4k44P5Q9
3313A18j16j58M2R1M0j40m5o6k05N11pj14j56L18j89N0J12J01m2j41L15j1j32
3336A76j18N2J6j81K70k7k40j76J38J92l06j18Q0j46K56k7J52L7l16K28J09j38
$$ plain form
3358 -87 8 -1 43 160 112 189 204 177 99 213 255 -26 -24 123 3 -66 -72 71 197 -390 -51 -169 -74 -56 -299 79
3384 79 -314 -168 -227 13 -55 -30 -50 -59 7 201 246 279 160 116 -44 184 92 233 103 -201 215 -5 187 -151
3408 -151 -108 -200 25 -283 -289 -137 -242 -328 120 -1 -119 -69 -239 103 73 -46 210 316 136 170 135 322 276
3431 276 250 395 126 57 -45 -9 -84 -180 -241 -72 -185 -24 -11 -77 -172 -209 18 -308 -412 -24 215 -35 -33 94
3455 94 102 102 169 107 -21 115 197 -15 158 284 142 -39 -143 -28 102 -151 -143 150 -216 13 25 -329 -226 -5
3479 -5 -367 -216 40 -74 186 245 41 101 -110 -68 -95 126 98 126 146 361 78 129 131 -139 27 24 38 -150 -341
3504 -341 -349 -216 -274 -62 142 -207 -205 -11 3 -283 240 -66 -187 120 82 152 32 65 232 320 31 119 77 121
3528 121 67 -57 -113 148 -68 -68 -28 13 -211 -179 -68 -369 -162 -147 -322 38 43 -76 113 113 193 15 70 117 76
$$ packed form
3358h7R5rM4J17m8P7J5k7p8J14M2k81KJ47j20o9oJ43J26n87L39j18R5J8k43L78
3384G9l93J46n9K40o8K5k0rO6J94M5L3j19m4j60K28r2J41j30l04M16k20J92l38
3408a51M3r2K25l08oJ52j05q6M48j21j18N0j70L42l0j19K56J06j80L4l5J87m6
3431B76k6J45k69o9j02L6p5r6o1J69j13J61J3o6r5l7K27l26j04L88K39k50KJ27
3455I4Q%O7o2j28J36Q2k12J73J26j42j81j04J15J30k53QK93l66K29J2l54J03K21
3479el62J51K56j14K60N9k04O0k11M2k7K21k8K8K0K15k83N1Kk70J66lJ4j88j91
3504c41qJ33n8K12K04l49KJ94J4k86N23l06j21L07l8P0j20L3J67Q8k89Q8m2M4
3528A21n4j24n6K61k16%M0M1k24L2J11l01K07J5j75L60Nj19J89%Q0j78N5M7m1
$$ plain form
3553 76 192 327 206 85 155 306 -10 88 -104 215 54 -136 -293 -95 -102 -318 -206 -146 -7 39 -88 -249
3575 -249 32 -34 209 159 52 42 -70 -6 352 72 283 191 169 244 36 46 67 -119 -294 -26 -158 -15 -19 -278
3599 -278 -33 -102 -152 -35 -265 -340 -70 146 -17 -153 171 -78 225 170 81 293 249 114 198 323 47 87 116
3622 116 43 -37 -70 -56 31 -86 -72 -154 -79 -152 83 -312 -173 -261 -100 -64 -327 -2 -122 47 -78 -73 -64 78 -138
3647 -138 15 -16 196 45 -62 -23 197 0 -134 -131 -5 -196 -59 -83 -169 -310 -109 -205 115 -155 -342 -13
3669 -13 -24 -31 0 76 -22 119 256 -196 -245 245 217 140 110 -20 66 29 16 -210 -24 -29 -38 7 62 -190 -36 63 -268
$$ packed form
3553G6J16J35j21j21P0J51l16R8j92L19j61j90j57J98pk16J12O0J39M6j27j61
3575b49K81o6K43n0j07j0j12O4L58k80K11r2k2P5k08J0K1j86j75K68j32J43mk59
3599b78K45o9n0J17k30p5K70K16j63j36L24k49L03n5q9K12m4j35Q4J25k76M0K9
3622A16p3q0l3J4Q7j17J4q2P5p3K35l95J39q8J61L6k63L25j20J69j25NRJ42k16
3647a38J53l1K12j51j07L9K20j97j34LJ26j91J37k4q6j41K01r6L20k70j87L29
3669a3j1pL1P6r8J41J37m52m9M90k8p7l0j30Q6l7j3k26J86nrM5N5k52J54R9l31
$$ [...]
8191A6
##END NTUPLES=NMR FID
##END=
