##TITLE=1H_Pr Q
 200.13MHz, DMSO,
 8 sc
 
 2.10.2025
##JCAMPDX= 6.0         $$ Bruker NMR JCAMP-DX V2.0
##DATA TYPE= NMR FID
##DATA CLASS= NTUPLES
##ORIGIN= UXNMR, Bruker Analytische Messtechnik GmbH
##OWNER= pz
$$ XWIN-NMR		Version 3.5
$$ Thu Oct  2 16:23:31 2025 Russian Standard Time (UT+4h)  she@DPX200
##.OBSERVE FREQUENCY= 200.1313
##.OBSERVE NUCLEUS= ^1H
##.DELAY= (6, 6)
##.ACQUISITION MODE= SIMULTANEOUS
##.ACQUISITION SCHEME= undefined
##.AVERAGES= 8
##.DIGITISER RES= 18
##SPECTROMETER/DATA SYSTEM= spect
##.PULSE SEQUENCE= zg30
##.SOLVENT NAME= CDCl3
##.SHIFT REFERENCE= (INTERNAL, CDCl3, 0, 14.3821)
##AUDIT TRAIL= $$ (NUMBER, WHEN, WHO, WHERE, WHAT)
$$ ##TITLE= Audit trail, XWIN-NMR		Version 3.5
$$ ##JCAMPDX= 5.01
$$ ##ORIGIN= Bruker BioSpin GmbH
$$ ##OWNER= she
$$ F:/spectra/data/she/nmr/H-C/1/audita.txt
$$ ##AUDIT TRAIL=  $$ (NUMBER, WHEN, WHO, WHERE, WHAT)
(   1,<2025-10-02 16:22:07.07 +0400>,<she>,<DPX200>,
      <created by zg, POWCHK disabled, PULCHK disabled
       configuration hash MD5:
       00 E9 B6 7A A2 85 ED C7 34 08 36 98 17 FE 4E 26
       data hash MD5: 16K
       E6 34 59 DB A7 F2 14 39 2C D5 32 D6 B3 18 B1 A7>)
$$ ##END=
$$ 
$$ hash MD5
$$ 19 12 72 C8 A7 95 7A 3D 4E 5D C3 42 1B 8D AB BA
##$RELAX= 
##$RELAX= 
##$RELAX= 
##$RELAX= 
##$RELAX= 
##$RELAX= 
$$ Bruker specific parameters
$$ --------------------------
##$DU= <F:/spectra>
##$EXPNO= 1
##$NAME= <H-C>
##$PROCNO= 1
##$TYPE= <nmr>
##$USER= <she>
##$AMP= (0..31)
100 100 100 100 100 100 100 100 100 100 100 100 100 100 100 100 100 100 
100 100 100 100 100 100 100 100 100 100 100 100 100 100 
##$AQSEQ= 0
##$AQ_mod= 1
##$AUNM= <au_zg>
##$AUTOPOS= <>
##$BF1= 200.13
##$BF2= 200.13
##$BF3= 200.13
##$BF4= 200.13
##$BF5= 200.13
##$BF6= 200.13
##$BF7= 200.13
##$BF8= 200.13
##$BYTORDA= 1
##$CFDGTYP= 0
##$CFRGTYP= 5
##$CHEMSTR= <none>
##$CNST= (0..31)
1 1 145 1 1 1 1 1 1 1 1 1 1 1 1 1 1 1 1 1 1 1 1 1 1 1 1 1 1 1 1 1 
##$CPDPRG= <>
##$CPDPRG1= <>
##$CPDPRG2= <>
##$CPDPRG3= <>
##$CPDPRG4= <mlev>
##$CPDPRG5= <mlev>
##$CPDPRG6= <mlev>
##$CPDPRG7= <mlev>
##$CPDPRG8= <mlev>
##$CPDPRGB= <>
##$CPDPRGT= <>
##$D= (0..31)
0 0.7 0 0 0 0 0 0 0 0 0 0.03 0 0 0 0 0 0 0 0 0 0 0 0 0 0 0 0 0 0 0 0 
##$DATE= 1759407726
##$DBL= (0..7)
120 120 120 120 120 120 120 120 
##$DBP= (0..7)
150 150 150 150 150 150 150 150 
##$DBP07= 0
##$DBPNAM0= <>
##$DBPNAM1= <>
##$DBPNAM2= <>
##$DBPNAM3= <>
##$DBPNAM4= <>
##$DBPNAM5= <>
##$DBPNAM6= <>
##$DBPNAM7= <>
##$DBPOAL= (0..7)
0.5 0.5 0.5 0.5 0.5 0.5 0.5 0.5 
##$DBPOFFS= (0..7)
0 0 0 0 0 0 0 0 
##$DE= 6
##$DECBNUC= <off>
##$DECIM= 32
##$DECNUC= <off>
##$DECSTAT= 4
##$DIGMOD= 1
##$DIGTYP= 9
##$DL= (0..7)
0 120 120 120 120 120 120 120 
##$DP= (0..7)
150 150 150 150 150 150 150 150 
##$DP07= 0
##$DPNAME0= <>
##$DPNAME1= <>
##$DPNAME2= <>
##$DPNAME3= <>
##$DPNAME4= <>
##$DPNAME5= <>
##$DPNAME6= <>
##$DPNAME7= <>
##$DPOAL= (0..7)
0.5 0.5 0.5 0.5 0.5 0.5 0.5 0.5 
##$DPOFFS= (0..7)
0 0 0 0 0 0 0 0 
##$DQDMODE= 0
##$DR= 18
##$DS= 0
##$DSLIST= <SSSSSSSSSSSSSSS>
##$DSPFIRM= 0
$$ [...]
##$SUBNAM0= <"">
##$SUBNAM1= <"">
##$SUBNAM2= <"">
##$SUBNAM3= <"">
##$SUBNAM4= <"">
##$SUBNAM5= <"">
##$SUBNAM6= <"">
##$SUBNAM7= <"">
##$SUBNAM8= <"">
##$SUBNAM9= <"">
##$SW= 18.0517328524113
##$SWIBOX= (0..15)
0 0 2 0 0 0 0 0 0 0 0 0 0 0 0 0 
##$SW_h= 3612.71676300578
##$TD= 16384
##$TD0= 1
##$TE= 0
##$TE2= 300
##$TE3= 300
##$TEG= 300
##$TL= (0..7)
0 120 120 120 120 120 120 120 
##$TP= (0..7)
150 150 150 150 150 150 150 150 
##$TP07= 0
##$TPNAME0= <>
##$TPNAME1= <>
##$TPNAME2= <>
##$TPNAME3= <>
##$TPNAME4= <>
##$TPNAME5= <>
##$TPNAME6= <>
##$TPNAME7= <>
##$TPOAL= (0..7)
0.5 0.5 0.5 0.5 0.5 0.5 0.5 0.5 
##$TPOFFS= (0..7)
0 0 0 0 0 0 0 0 
##$TUNHIN= 0
##$TUNHOUT= 0
##$TUNXOUT= 0
##$USERA1= <user>
##$USERA2= <user>
##$USERA3= <user>
##$USERA4= <user>
##$USERA5= <user>
##$V9= 5
##$VALIST= <valist>
##$VCLIST= <CCCCCCCCCCCCCCC>
##$VD= 0
##$VDLIST= <DDDDDDDDDDDDDDD>
##$VPLIST= <PPPPPPPPPPPPPPP>
##$VTLIST= <TTTTTTTTTTTTTTT>
##$WBST= 1024
##$WBSW= 4
##$XGAIN= (0..3)
0 0 0 0 
##$XL= 0
##$YL= 0
##$YMAX_a= 490763
##$YMIN_a= -596964
##$ZGOPTNS= <>
##$ZL1= 120
##$ZL2= 120
##$ZL3= 120
##$ZL4= 120
##$ABSF1= 10
##$ABSF2= 0
##$ABSG= 5
##$ABSL= 3
##$ALPHA= 0
##$AQORDER= 0
##$ASSFAC= 0
##$ASSFACI= 0
##$ASSFACX= 0
##$ASSWID= 0
##$AUNMP= <proc_1d>
##$AZFE= 0.1
##$AZFW= 0.1
##$BCFW= 1
##$BC_mod= 2
##$BYTORDP= 1
##$COROFFS= 0
##$CY= -3
##$DATMOD= 1
##$DC= 2
##$DFILT= <>
##$DTYPP= 0
##$F1P= 0
##$F2P= 0
##$FCOR= 0.5
##$FTSIZE= 0
##$FT_mod= 4
##$GAMMA= 1
##$GB= 0.15
##$INTBC= 1
##$INTSCL= 1
##$ISEN= 128
##$LB= 0.25
##$LEV0= 0
##$LPBIN= 0
##$MAXI= 10000
##$MC2= 0
##$MEAN= 0
##$ME_mod= 0
##$MI= 1.114404
##$NCOEF= 0
##$NC_proc= 0
##$NLEV= 6
##$NOISF1= 3.799351
##$NOISF2= 2.8
##$NSP= 1
##$NTH_PI= 0
##$NZP= 0
##$OFFSET= 14.38212
##$PC= 1
##$PHC0= -2183.949
##$PHC1= 7.592241
##$PH_mod= 1
##$PKNL= yes
##$PPARMOD= 0
##$PSCAL= 0
##$PSIGN= 0
##$REVERSE= no
##$SF= 200.129724274929
##$SI= 16384
##$SIGF1= 3
##$SIGF2= 2
##$SINO= 400
##$SIOLD= 16384
##$SREGLST= <1H.CDCl3>
##$SSB= 0
##$STSI= 0
##$STSR= 0
##$SW_p= 3205.1282051282
##$SYMM= 0
##$S_DEV= 0
##$TDeff= 0
##$TDoff= 0
##$TI= <>
##$TILT= no
##$TM1= 0
##$TM2= 0
##$TOPLEV= 0
##$USERP1= <user>
##$USERP2= <user>
##$USERP3= <user>
##$USERP4= <user>
##$USERP5= <user>
##$WDW= 1
##$XDIM= 8192
##$YMAX_p= 0
##$YMIN_p= 0
$$ End of Bruker specific parameters
$$ ---------------------------------
##NTUPLES= NMR FID
##VAR_NAME=  TIME,          FID/REAL,        FID/IMAG
##SYMBOL=    X,             R,               I
##VAR_TYPE=  INDEPENDENT,   DEPENDENT,       DEPENDENT
##VAR_FORM=  AFFN,          ASDF,            ASDF
##VAR_DIM=   8192,          8192,            8192
##UNITS=     SECONDS,       ARBITRARY UNITS, ARBITRARY UNITS
##FACTOR=    0.0002768,     1,               1
##FIRST=     0,             0,               0
##LAST=      2.2672688,     0,               0
##MIN=       0,             -596964,         0
##MAX=       2.2672688,     490763,          0
$$ Real data points
##PAGE= N=1
##DATA TABLE= (X++(R..R)), XYDATA
0@%%%%%%%%qJ6j6J7k5L2m0N6o5Q1j04J20j44J75k07K41k83L32l87M50n20N98o82
31c63P80q91J010j139J285j447J620j813K026k256K509k787L086l415L779m173
47b189M603n073N590o160O784p475Q247r106J0071j1166J2415j3860J5551j7565
61i333K0010k3052K6963l2193L9592n0955P0826j15500L97058n3820n99076M30406
73A00926K66050l12827l89325J84190J75357j10510k06738m4918m483K26551L54761
84B39034K4124l42407N5028M49176O406n31756q3610N11577J48918n64095l84139
95d71744K44316K36624k02488j63800J72547K14906N3012k1373r1722m1616K36751
106A65413L10059j21257l99623q748L27634j10171n34979p5968M79584J43642
$$ y = [0, 0, 0, 0, 0, 0, 0, 0, 0, -8, 8, -8, 9, -16, 16, -24, 32, -33, 48, -56, 64, -80, 95, -112, 129, -154, 178, -209, 241, -279, 319, -363, 417, -474, 536, -603, 682, -765, 855, -958, 1068, -1188, 1321, -1466, 1620, -1795, 1984, -2189, 2414, -2659, 2931, -3229, 3555, -3920, 4327, -4779, 5292, -5874, 6541, -7319, 8232, -9333, 10677, -12375, 14588, -17605, 21987, -28968, 41858, -73642, 323416, 269596, -329480, 100926, 366976, 54149, -335176, -150986, 24371, -86139, -292877, -337795, -342278, -115727, 239034, 263158, -79249, -24221, 424955, 431361, -100395, -184005, 327572, 476490, -87605, -471744, -227428, 9196, -193292, -357092, -184545, 30361, 83373, 62000, -29722, -71338, 165413, 475472, 354215, -45408, -54156, 273478, 163307, -371672, -447640, 31944, 175586]
116A75586m05254k06408K73776K40040m7869n2247J06762J42390R0744l6390k37734
127D3396j85456J88841K40610k35074l98043Q5168L20467j10628l61395O3613
137c48501M35590J70231k12742j22703J55743J61478j0117j09670q8206M1435
147G2538J10650r3026l19690j37486K35109K00481j70405k13714J68171L06071
157A58699l5557k30976N1528K97770J19489j71663j92729m358J01044j1004j75652
168i3409j41802P8197J72602l9357k38574l5953K97612K10125j35462j41332J54342
179H6989K07298o8308k28039n5491J47958P5394j48067k09039l8346J39897Q0807
190h947j28449j13106J65492K48336k4950j95901R317K28313J03312j55839j55885
$$ y = [175586, -229668, -436076, -162300, 77740, 29871, -22376, 84386, 226776, 317520, 281130, 43396, -142060, 46781, 287391, 52317, -345726, -260558, 59909, -50719, -412114, -348501, 87089, 257320, 44578, -78125, 77618, 239096, 228979, 119309, 31103, 72538, 183188, 90162, -229528, -367014, -131905, 68576, -101829, -315543, -147372, 158699, 123142, -107834, -56306, 241464, 360953, 189290, -3439, -7797, 93247, 82243, -93409, -235211, -157014, 15588, -23769, -262343, -298296, -684, 209441, 73979, -67353, 86989, 294287, 225979, -2060, -57551, 90407, 165801, 17734, -191305, -229651, -89754, -8947, -137396, -250502, -85010, 163326, 138376, -57525, -48208, 180105, 283417, 127578, -28307]
201b8307N0571J02634o9090j91479r2513J02467J37945m7706j64732J4520K21443
212C5753J14194j20585q7008J49069J76863p2962k08426l7410J27139K9832j44294
223c7835j37803K1595J17257K0435j21101o0942J44826J84421j4880j44918Q400
234b0545J90630O9769j72782j34470R2499J06816r8044j82419l4227J14128O5752
245b893p4647q2594N7539J52015O8164q5733p2808J09952J51761n8864j85868
256b3976k5572J30722J6458j68356j17093Q2000J12534m2510j06696J3087J28094
267a308R4301k9162p5807K9927J27960L4721j28239j05688O2112R3466p6607j69989
279a44313j7853J34023M3219j09980o0153J03234J31196J912q4320n559J06769
$$ y = [-28307, 22264, 124898, 55808, -135671, -228184, -125717, 12228, -35478, -200210, -185690, 35753, 149947, 29362, -57646, 91423, 268286, 195324, -13102, -50512, 76627, 106459, -37835, -175638, -154043, -36786, -16351, -137452, -198394, -53568, 130853, 115973, -28945, -20545, 170085, 239854, 67072, -67398, 25101, 131917, 33873, -148546, -182773, -68645, -2893, -77540, -160134, -102595, 49420, 117584, 31851, -40957, 68995, 220756, 161892, -23976, -49548, 81174, 97632, -70724, -187817, -105817, 6717, -35793, -142489, -129402, -1308, 92993, 63831, -11976, 17951, 145911, 180632, 52393, -53295, 8817, 102283, 25676, -144313, -162166, -28143, 15076, -94904, -155057, -51823, 79373, 81285, -3035, -8594, 98175]
290I8175O9235p0103j13569q083Q3874Q188j31870r9808P2066J07109m0215j09985
302a34986K0019J46559P3709p6796o1618Q1024J04602k7430j11767m3097N9939
313C0158L9946p9655j13343K752R4479K7953q0654m9568Q9502J22522j0633r1942
325a8483J2451J16068M0253r4979q8282L2796O9341l9141j16737l8437P1365N5205
337A420m3585o8082L1268J15646M9932o6310m4351P4876Q9421l5136j12897k6366
349c4164P9170K1600j04592q7404M1223Q0620r776p6304j0205R5292Q0456k9232
361D6684o1468K6384R0784K3530q7276p4545M1504O2242n3427j10409j5039Q0452
373c0584L7984o1370n2194N9005R9586J1653o0756j2231P3653N9754m8208r3449
$$ y = [98175, 167410, 97307, -16262, -24345, 59529, 67717, -64153, -163961, -91895, 15214, -25001, -134986, -114967, 31592, 105301, 28505, -33113, 47911, 152513, 125083, 13316, -29781, 30158, 70104, -9551, -122894, -120142, -25663, 2290, -78364, -127932, -38430, 84092, 73459, -18483, -6032, 110036, 150289, 55310, -32972, -176, 69165, 30024, -86713, -125150, -53785, 1420, -42165, -110247, -78979, 36667, 86599, 20289, -24062, 50814, 140235, 105099, -7798, -34164, 45006, 66606, -37986, -125390, -84167, -3547, -13323, -89627, -99832, -4540, 75916, 46684, -14784, 11600, 102384, 125914, 38638, -35907, 5597, 67839, 14412, -95997, -111036, -30584, 7400, -53970, -106164, -47159, 52427, 64080, 3324, -8907, 64746, 124500, 76292, -17157]
385a7157m619O8255p77r5535o1064M7343O6145k3843p0394J0997R6164N6436l8501
398C3450m6980L5628P9588K544q9594m9399N5214M3470o7994r6481N297Q0020
410a5237J7971o6462k5856P2119P3255r659m9616J475O8344M6863n0091q2254
422a9148O66O0759p797r6562m9582P0358O4999n3292p1444M2000R3666J9927m1940
435A2610j0394M6632M2709k0221o4583l3170L5884M0775m6172r4294k538Q6120
447f642J2847q4198j4976J04388O9779m9249n6032L7725O5517k520m7625k5825
459C189O777J6338j3855o7900n0215N2414P8235k9679q1978K5889J08149J6446
471F3810q2342n988J01905M1736p5390o2782J3712K2579j1320k9287k9394k353
$$ y = [-17157, -21776, 46479, 45702, -49833, -110897, -63554, 2591, -21252, -91646, -80649, 15515, 71951, 33450, -13530, 22098, 101686, 104230, 14636, -34763, 20451, 63921, -4073, -100554, -95257, -15237, 2734, -63728, -89584, -17465, 55790, 46131, -3485, -2010, 66334, 113197, 63106, -19148, -18482, 42277, 34480, -62082, -111664, -41306, 23693, -29599, -101043, -59043, 34623, 54550, 12610, 2216, 48848, 91557, 71336, 6753, -26417, 9467, 50242, 4070, -90224, -92762, -6642, 6205, -77993, -92969, 11419, 81198, 31949, -24083, 13642, 79159, 76639, 29014, 3189, 9966, 26304, 12449, -55451, -105666, -53252, 24983, -4696, -86674, -60785, 47364, 63810, -18532, -24520, 77385, 119121, 43731, -19051, -5339, 17240, 5920, -23367, -52761, -55114]
483e5114L6792J6950n3235m0030P7876J05782k6661q8698L0021R3566k2544r7793
495b3088m841P2698Q566o9231m8694K082J5558J9151J1075j9169J754O8093L6505
508G0459p1659m8571Q7234Q6641n9889r6552K2153O0590m6533q7104J0845O6340
520f046J2366k8554j8984o457K3702N6211J8295l9804M64P1112J0264j05743o0565
533g3739Q2168O4810p5488p8337L8266M7479l8923m2633L1590N8009K8926L242
545D5370k0807l2666J3551N7539l184p2750n266P2436j4476j17506l6168R1086
557b2841N3396n1638l2847M7965L5637k3289j5788J9402K4561K9136J3379n3253
569B3820o9196J8109N6942k9877p2830K4115Q2026j8207r4761k124R4568M2315
$$ y = [-55114, -18322, -1372, -54607, -94637, -16761, 89021, 62360, -26338, 3683, 97249, 74705, -23088, -27929, 44769, 53335, -15896, -64590, -62508, -46950, -27799, -16724, -35893, -34139, 33954, 70459, -1200, -49771, 37463, 124104, 64215, -32337, -10184, 50406, 3873, -83231, -72386, -6046, 6320, -22234, -41218, -47675, -23973, 32238, 50533, 10729, 11193, 82305, 92569, -13174, -73739, 8429, 73239, -2249, -80586, -42320, 5159, -33764, -76397, -44807, 13202, 42128, 45370, 24563, -8103, 5448, 62987, 59803, -12947, -18213, 54223, 39747, -77759, -113927, -22841, 30555, -21083, -53930, -5965, 29672, 6383, -9405, 9997, 34558, 63694, 77073, 23820, -45376, -27267, 29675, -202, -73032, -48917, 33109, 14902, -79859, -81983, 12585, 54900]
581E4900l2551r388K5551M968j6408j8296k0962J238M0222J2887p0086o5054M2489
594e0490O6914l2384n1784N6857Q2665k7283p3963P858O1356J7394k4565j4802
606A7773p108j2243m512j5268l9633K527P0651K6572p1191l9998O8496N6950m1001
619A2015l4846N6932N3345m2439o4892k011K3664L203l876j3839k5703M903L0710
632b834j3428m4233K6026Q8706J7976p4571k6995O4912K7403n8228k9852M2713
644A7595K2995l8934m2716r261J1851K3322J9076j2234k0891K6909M5822k1386
656B2148n3474K9252P8548q053q0205k0449M6198N080n0631j8507L4388K1298
668E593j4200j6356o924Q828L9206L0073k5943k8164L4552L5193m4265n9585K5224
$$ y = [54900, 22349, 12961, 38512, 43480, 27072, 8776, -12186, -10948, 29274, 42161, -27925, -92979, -50490, 16424, -15960, -67744, -10887, 71778, 44495, -29468, -21610, 39746, 57140, 32575, 17773, 10665, -1578, -6090, -21358, -60991, -58464, 12187, 38759, -32432, -72430, -3934, 53016, 12015, -22831, 34101, 87446, 45007, -19885, -21896, 1768, 4971, 1095, -12744, -38447, -33544, -2834, -16262, -60495, -34469, 54237, 72213, -2358, -29353, 35559, 62962, 4734, -25118, 17595, 40590, 1656, -41060, -50321, -38470, -15148, 3928, -8306, -29197, -2288, 43534, 22148, -31326, -2074, 76474, 68421, -11784, -32233, 13965, 19045, -31586, -50093, -15705, 5593, -8607, -24963, -31887, -23059, 16147, 46220, 20277, -7887, 26665, 61858, 17593, -41992, -16768]
681a6768N9240j9701o8047o470M3350N701k7291q54K6648K4147J0037j1972k3757
694e737N123L9654J1510m6582l1823L5122K5212n1444m9245L3903N2595j2792
706E496m0584N215L8983J6015j4200r237J1372K0295Q696k3358l8859k03L6568
719A6199N3m9182j8090M1674K5796l4487k9988L4199M9261m001l1438k39K4966
732B4723J1059j5376k5386p134J9172R774k9272l4928J1157M0440L822l6458m925
745c3332M6535K6553k8003k4802K1886L2972n348l5492j7615J6685J4518j8236
757c679l0953k962K9380J8256k2194k3498K3393M1694J154l0977o105L1808J9305
770D4622k7787l5426O660K7349m432l4619j7535K1235K6082q531k5500N960L5914
$$ y = [-16768, 42472, 22771, -45276, -51746, -8396, -2695, -29986, -30840, -4192, 19955, 29992, 18020, -5737, -614, 39040, 50550, 3968, -27855, 7267, 32479, -18965, -68210, -34307, 18288, 5496, -35088, -29873, 9110, 25125, 10925, 1688, 13060, 33355, 42051, 18693, -20166, -20369, 16199, 16252, -32930, -51020, -9346, 16450, -18037, -48025, -13826, 35435, 31434, -4, -243, 24723, 35782, 20406, -4980, -12114, 7058, 16832, -12440, -47368, -36211, 4229, 8051, -28407, -33332, 13203, 39756, 11753, -13049, 8837, 41809, 36461, 969, -16646, 39, 14557, -3679, -34632, -37594, -8214, 10042, -12152, -35650, -12257, 29437, 30591, -386, -6491, 25317, 44622, 16835, -18591, -11931, 15418, 10986, -23633, -41168, -19933, 6149, -2382, -27882, -21922, 13992]
783A3992J8084j8725k0336J3922K9800l534l6592j6428K1783J5565k3211l2734
795c8414M792L3676Q440k7329j1386K9715L0048p322k5034Q60K8263J0967k6752
808A0524k6842P214K1593m316l2125j6435K4934K6656j4233k6803J1778L8394
820B0339J1362k6140j5554K3755K4543j5750l2235m925J9712P462k2308k5422
832c5161P859K9074N028k3971r317K7720K9483r559k8228M682L1824M795l1577
845B652k1111J3835J8918j1821l0137n330K5337J5631j4595j7319J1960L1025
857A9045R092k3429j3749K1975K2140j5514l2236l896K4538O757k9429k2347J8324
870a8729K6768n201k3023j22K8463J9591j4090k0183Q613K4044J689k6203k0067
$$ y = [13992, 32076, 13351, -6985, 6937, 36737, 33203, -3389, -19817, 1966, 17531, -5680, -38414, -33622, 54, 8494, -18835, -30221, -506, 29542, 22220, -2814, -1954, 26309, 37276, 10524, -16318, -9104, 12489, 8173, -23952, -40387, -15453, 11203, -3030, -29833, -18055, 20339, 31701, 5561, -9993, 13762, 38305, 22555, -9680, -14605, 5107, 12569, -9739, -35161, -27302, 1772, 6800, -17171, -26488, 1232, 30715, 21156, -7072, -2390, 29434, 34229, 2652, -18459, -4624, 14294, 2473, -27664, -32994, -7657, 7974, -6621, -23940, -11980, 19045, 28137, 4708, -9041, 12934, 35074, 19560, -12676, -16572, 7966, 14723, -14706, -37053, -18729, 8039, 2838, -20185, -20307, 8156, 27747, 13657, -6526, 2087, 26131, 27820, 1617, -18450]
883a8450J2420K0775j1928l1687k353K9158J3700k0567j7360K0007L1308k386
895B2637k4953k643K2210J0796j7028k2628N0J8385L146k3222j8314J3333K5481
908G250j027k4832k042L3142J7933k3278j9861J7972K4587q406k7845p789J6025
921A829P493j5404j7860J703J9885J2869j4994j9603J5433L3095p46k8908l427
934h635K9667J1031k9770k4134J5304K0600r880k1639m323J2096J1965k577j4055
947a4350J25K4716J8092j6738k5236J0178L0271m412l4166n200K7162M575k8462
960a3445j6578J4895J9336M62j1051m164R174J4308K223j6293p696K3721J9212
973C4104k5555l3316J1391K8204r172k9396K577K7700M156k2167q756J4753J6031
$$ y = [-18450, -6030, 14745, 2817, -28870, -31223, -2065, 11635, -8932, -26292, -6285, 25023, 22637, -2316, -4959, 17251, 28047, 11019, -11609, -11559, 6826, 9972, -13250, -31564, -18231, 7250, 6223, -18609, -20651, 12491, 30424, 7146, -12715, 5257, 29844, 21438, -6407, -14196, 1829, 9322, -6082, -23942, -22239, -2354, 10515, -4479, -24082, -8649, 24446, 23700, -5208, -8635, 21032, 32063, 2293, -21841, -6537, 14063, 4183, -17456, -21779, -9683, 2282, -295, -14350, -14225, 10491, 28583, 11845, -13391, -3213, 27058, 22646, -11520, -16720, 10442, 15017, -13445, -30023, -15128, 4208, 4670, -6381, -10545, -1371, 12937, 15160, -1133, -8829, 14892, 34104, 8549, -24767, -13376, 14828, 5656, -23740, -21163, 6537, 10693, -11474, -20230, -5477, 10554]
986A0554O942m646j3456o18J7452L49k7846j0177K9053J7784k9976l0663J7567
999a7681K8634r644j9351J2357K2180k64j3327q140J083J1942J3303p001k3354
1012i263m056K0466l02l1703n635L8210J7755l0084k0531K0639J9893r105j0213
1025c929J0229J1491l221r746j2465j0484J1194K2809p671k9461L272K8938m776
1038F180l2179M816M2161J2181l0752j5371J7210P473j1558k436N545m40J703
1051D533n72j9538j5860K1604L0700j0549k8532J1487L0480j2592l3331J1195
1063a0975L6686O13k6310q805N568j887k815L773o00j411J2147N985k4172j7220
1077b9423K9443L1340j8226k5991J6946K1306k1671k8503J2744K7245k518j7372
$$ y = [10554, 17496, 12850, -606, -1224, 16228, 16577, -11269, -21446, 7607, 25391, -4585, -35248, -17681, 10953, 1309, -18042, -5685, 16495, 16231, 2904, -5236, -4153, 7789, 21092, 14091, -9263, -13319, 7147, 6845, -24858, -30493, 7717, 25472, -4612, -25143, -4504, 15389, 6284, -3929, 6300, 17791, 14570, 4824, -7641, -18125, -6931, 15878, 8207, -21254, -17982, 10956, 6180, -25999, -21183, 20978, 33159, 2407, -12964, 4246, 11719, 161, -2275, 3270, 2830, 4533, 3961, -15577, -31437, -9833, 20867, 10318, -18214, -6727, 23753, 11161, -22170, -10975, 25711, 26324, 14, -8791, -3223, -5110, -7925, -4152, -4752, -6163, 5984, 11969, -12203, -29423, 20, 31360, 13134, -12857, 4089, 25395, 3724, -24779, -12035, 15210, 12692, -4680]
1089d680l818o79l649Q270Q536q207O22K3200L126l3696j4693L2602K2861k4975
1103D820k1479K0058J3773k5741j9449J6582J8161n79k633k785r168P63J5771
1116H094K616j5973L512K6459l385l9182j0141L2722J2754k4251r303J9516O406
1129I844j7973r045J1554J1414M901L775p599j5720L949J7498o943k0616J0121
1142d840K5867j0119l4408k108K9287Q432j8054k199J7078K454j2394m354K697
1155b661M127J0546M584j6528j6118J0585J5185j3156j8164J6515K5687j2302
1167H300k7815N025K3394K435j1230K41P528M71n299o282o175K668J4793M048
1181A2102j9689j1823J7592J2699j6263j1139J9274J8310j1693j9386L029J4435
$$ y = [-4680, -8498, -9177, -12826, -4556, 3980, -4227, -3605, 19595, 22721, -10975, -25668, 6934, 29795, 4820, -16659, 3399, 17172, -8569, -28018, -11436, 6725, 6146, 3513, 728, -8440, -7677, 8094, 10710, -5263, -1751, 24708, 21323, -17859, -28000, 4722, 17476, -6775, -16078, 3438, 9844, -8129, -17174, -5620, 5794, 10695, 14470, 6871, -8849, -4900, 12598, 5655, -14961, -4840, 21027, 10908, -23500, -25608, 3679, 12111, -5943, -8142, 8936, 11390, -1004, -5358, -2661, 1466, 12012, 16596, 68, -16050, -5465, 9720, -3436, -21600, -5085, 20602, 8300, -19515, -14490, 8904, 11339, 109, 350, 7878, 8349, 3050, -3232, -9407, -6739, 8054, 12102, -7587, -19410, -1818, 10881, -5382, -16521, 2753, 21063, 9370, -10016, -6987, 7448]
1193G448J355p780k751J157J998J146p900j0749P366J9138J12j8839m003J8457
1207F155P972j6255q879J6447J2711j1715j4982P36Q045L253l928o614q2Q800
1221A664M743r687j0322R994J8942l009j9005m69J6889K020j5639o468J0553Q681
1235H887o230j1451j858P800P035j782q210n07J2662O241j2971j0077J1393J3711
1249A4643o739j5713k49J2650K042j2285o184Q345R001j550q854l859Q810J0376
1263A0434m221j1485J299J2752K911j3719r564R869J1585p244j3551J621J1753
1276B440L428q360o609O405J1326o0j0456m252Q613Q800n886j3165O71J2870J726
1291G491j3118o715R232J0050l979j0843N78J1929N131p978p492M356J0115J97
$$ y = [7448, 8803, 1023, -1728, -571, 1427, 2573, -5327, -16076, -8710, 10428, 10540, -8299, -12302, 6155, 14127, -2128, -11007, 5440, 18151, 6436, -8546, -7810, 235, 3488, -440, -7054, -7136, 1664, 6407, -3280, -13602, -3608, 15334, 12325, -6680, -7149, 9740, 11760, -3879, -10347, 206, 8887, 2657, -8794, -10652, -2852, 4183, 2401, -5809, -6316, 6346, 12587, -384, -10461, 932, 14643, 7904, -7809, -8058, 4592, 6634, -5651, -11835, -3490, 5511, 3961, -4893, -8752, 58, 10434, 6213, -5272, -3973, 8779, 11690, -2029, -11593, -1724, 9861, 2617, -10934, -9313, 2440, 5868, -2492, -9101, -2696, 8630, 8570, -1886, -6138, 2475, 11275, 5389, -7776, -7105, 5765, 7491, -5627, -12342, -3110, 6940, 2961, -7882, -7304, 4625, 9756, 1778, -5714, -1358, 8757, 8954]
1305H954j1930n957R235P880p233j1108J752J1656L417j0183o478R063J0597l422
1319F243j0495r29J0383N768r141j0195M575J0268j439j1087m446Q788Q721n269
1333A745j0471K422J2076L578r193p123O828J0630l521j2635j577J0323M415q548
1347a051q938L879J0677N06j0039l595Q988Q334l875r826J61J1155L928j0519
1361b15q008O302R119l127j1328k246J0396N965p730p820M718J0185J403r005
1375a391n102Q031Q683n218j0999M2R957L496r790q406O659J0354k871j0208q26
1390g589R863O496o046q890L245J0636P29j0377n547P119Q187m911j1407L51J0832
1405B691L270q281n924N546R550l69r729l031R280O960o349r980J492J0269J266
$$ y = [8954, -2976, -8933, 302, 8182, 949, -10159, -8407, 3249, 6666, -3517, -9995, -932, 9665, 6243, -4252, -5181, 5202, 10970, 1829, -8366, -3791, 6477, 5038, -6049, -10495, -1707, 7014, 1745, -8726, -6304, 5772, 9350, 157, -6966, -138, 10492, 6971, -5664, -7241, 3082, 7497, -1051, -9989, -6110, 4567, 5073, -4966, -8561, 427, 8761, 4886, -4940, -4779, 6376, 10304, -215, -8223, -1921, 7198, 4071, -7257, -9503, 893, 6858, -872, -8692, -3974, 6211, 7614, -1391, -6493, 1538, 10221, 5003, -5996, -5954, 4003, 7499, -2291, -10697, -4038, 6316, 3445, -6763, -7589, 2274, 8770, 2724, -6166, -2921, 7715, 8444, -1933, -7480, -361, 7826, 2915, -8492, -8141, 2691, 5961, -2320, -8244, -2698, 6852, 6483, -3246, -6277, 3003, 9963, 3614, -6366, -4874, 5395, 6661]
1420F661j1263n369Q843P643m816q552N01Q965M791o120o730L969R034P3j0377
1435b747n665Q806Q945p179j1631L303J0969j77r904l025Q744P398l954p729l59
1450d205O530M841l904q339R73J0457J056j3039o214J1017R722p196j0659M520
1464d440J0901j642r134m35P194M599j670o521m837M375P434k992j0046P50J2434
1479E970J963j4806o156J4080R824q933q037N952O641l316o283p33M014M696R16
1494E792o788q343M006J1392k604j2547L512J5764j041j6708l353J4371P024q648
1508A829n616N098K563m187k911j167K91P184N636r081j1310O811J3280m465j2667
1523h712N924J6088l948j7925j279J3067K959o334j078J991j337o63r7m215q66
$$ y = [6661, -4602, -9971, -1128, 6515, 1699, -6853, -6352, 2613, 7404, 1284, -5446, -1477, 7557, 7630, -2747, -8412, 394, 9339, 2160, -9471, -6168, 4801, 4624, -5280, -8305, 439, 7837, 3883, -3846, -4205, 2325, 7166, 3262, -5077, -4104, 6353, 7409, -5630, -11844, -827, 8895, 1699, -8960, -4440, 6461, 4819, -4315, -4750, 2444, 7043, 5373, -1148, -5985, -1610, 5824, 2832, -7214, -6464, 5970, 7933, -6873, -13029, 1051, 10875, 1942, -6095, -143, 6498, 3182, -3101, -3834, 180, 4876, 5792, -996, -9339, -5333, 6059, 3455, -9092, -5580, 10184, 9143, -7565, -10918, 3453, 10477, 1829, -3787, 1311, 3874, -313, -3224, -4391, -4100, 3084, 8720, -361, -11671, -4860, 8420, 3955, -8712, -2788, 13300, 9352, -8573, -9852, 3215, 6174, -160, -1238, 753, -584, -1247, -1344, -5559, -6425]
1538f425J1096Q269j1728j3390R296J3537q530j1927R953J3472p916j5081O15
1551h759R018J633j710J482j336k917L588J188r080q20J6542O988j6517j1519
1565a2219J1599R535j1030q467J2069J0296r318j0734K107L874J336M721J581
1578E350o229j273P324j781j2816R11J8756M817j8417q779J2784N097j1721k922
1592h899J2187N715o766n590o04n56L551Q296o75r791J083R944n916j5768N094
1607h695J9709M67j6921l758J0955J271r058Q34R813K397l512j806m993m735P493
1622e39R987n899j0251O035R467r776j4490Q233J8189j978j3641K49P795k229
1636A152n181K766M157Q48J585j438r502n208J0421R397q769q857R964Q503j2277
$$ y = [-6425, 4671, 12940, 1212, -12178, -2882, 10655, 2125, -9802, 151, 13623, 5707, -9374, -8759, 259, 1892, 182, 1664, 328, -2589, 999, 2187, -6893, -7713, 8829, 15817, -700, -12219, -620, 8915, -2115, -10582, 1487, 11783, 2465, -8269, -6162, -2288, -952, 3769, 5350, -879, -2152, 5172, 3391, -9425, -8514, 10242, 15059, -3358, -12137, 647, 5744, -5977, -8899, 3288, 9003, 2237, -3353, -3957, -4513, -962, 7334, 6659, -3132, -2049, 7895, 1979, -13789, -8695, 11014, 11481, -5440, -9198, 1757, 3028, -6030, -5196, 4617, 7014, 3502, 1696, -3297, -8032, -539, 9448, 3549, -6702, -667, 8800, -976, -15466, -7233, 10956, 8978, -4663, -4414, 3381, 1152, -4029, -1263, 2894, 3742, 5327, 3889, -5613, -10821, -400, 8997, 228, -8629, 1335, 9838, -2439]
1651b439j1236J0359J3576l228q684O19L097k496j770J703n01J041O129j724j3088
1666h642k834J3936O114j0829m512J1606N223j2277q081R301Q916l484m753qj129
1681a453p86K092j496l735M706Q856l797j3057J22J3919L048j1259j858J0974
1695F276J890j0755n082N658N108m29k254k532j713K572L623l634m905O831R902
1710A0556n763j2516K465J1576j98r587q66P992J293p591l954L159L896K276n34
1725B204m586j485O226L177o932m405Q102P649o942j0637K934R319j498p840J08
1740d606N938J758l464l528K16M728M442j992n964k59O810J728q274m296P901
1755A138N908o662p774K846P194J96n455j403M847L713j849m402j313M455M690
$$ y = [-2439, -13675, -3316, 10260, 7032, -1652, -1033, 2064, -432, -2202, -499, -1000, 41, 6170, 4446, -8642, -11476, 2460, 8574, -2255, -6767, 4839, 10062, -2215, -10296, -995, 7921, 4437, -316, -324, -1453, -2239, -147, -1643, -5378, -672, 8184, 4387, -8670, -8548, 5371, 8419, -2840, -4698, 6276, 8166, -2589, -7671, -2013, 3095, 2666, 412, -2120, -3833, -1261, 2362, -1272, -6177, 654, 10556, 4793, -7723, -5258, 6318, 6120, -3467, -4333, 3659, 4952, -2639, -6593, -3434, 462, 2738, 2204, -2382, -3867, 2359, 5536, -1396, -5801, 2301, 9950, 3008, -7629, -4695, 4624, 3126, -4714, -4606, 1332, 3090, -374, -3902, -3686, 1042, 5484, 3492, -2472, -2731, 4079, 5807, -2467, -6763, 1138, 7046, 384, -7390, -4544, 2650, 2846, -2609, -4012, 835, 4548, 2699, -1703, -3016, 1439, 6129]
1770F129l315p210P75O979L17p581l113O639N641m468o442K496O800Q57m616k688
1786b800L144M697j213o333k042N172L795m038o214J422P095Q74o625k346O102
1801F90N033k925n726M35O141J968n605m389L035M845j185o040k060N352M351
1816C920l615n109J946O258J643n238l708M453N483k821o609k41N538K092n143
1831a151m780L007N839p26n328j074M964M222k486n398Q27O143J294n788l989
1846d424L450N017k123o677n46O302K608m649l752L022N669K46n266k034M723
1861A566L805k943n496j82N255J951n601m482L871N532j556n449m10N746L479
1876E086l854m424K398N128L8n101l164L409M422k681o038K49N673K040m426l580
$$ y = [6129, 2814, -4396, -3621, 3358, 3675, -3906, -7019, -380, 5261, 793, -5649, -3153, 3647, 4504, -112, -2800, 344, 5041, 3828, -2505, -4547, 625, 4420, 382, -5832, -4410, 2685, 3559, -3066, -5412, 690, 5723, 2798, -2928, -2493, 3648, 5616, 11, -4378, -1343, 3502, 2317, -3723, -5783, -431, 3920, 305, -4804, -2858, 3400, 5043, -195, -3903, 550, 6033, 3212, -3397, -3638, 1900, 3992, -1151, -5931, -2924, 2915, 2189, -3139, -4213, 751, 4973, 2487, -2911, -2084, 4059, 5353, -435, -4424, -974, 4043, 1920, -4757, -5303, 999, 3607, -1042, -4794, -1772, 3897, 4143, -1123, -3157, 1566, 5371, 2428, -3068, -3250, 2005, 3956, -1645, -6127, -2256, 3276, 1720, -3729, -4139, 1607, 5086, 1232, -3192, -794, 4334, 4372, -729, -3893, -484, 3938, 1257, -4781, -4532, 1141, 3181, -1245, -4825]
1892d825L409N704p37n353q45M871L013l409n248Q31N424M11n938k724M187M225
1908B996k113m825M13N667K364l916l367K408M620r1n419k741M530L782l966n525
1924e183J344N583R49m955k300M575M259k132m037R6M026K483k964m737Q36M829
1940B672J41n629k782M690M884l310n796K100O250K89m381j184L445K859j606
1955B642m188j347L144K974k188n141r7N864J391o363k352O732M698m133m835
1970c199K147M616l36l714j108J970J681n40l649l192L113N642j672o061J021
1985c281O788O25o525j675O803L830m871m417J681K165o69j419j262K94K960J239
2001B266m274l797M225O963j632o784J465O991j511p563j57O334J629m058k851
$$ y = [-4825, -1416, 4288, 3551, -1802, -2647, 2224, 5237, 1828, -3420, -2589, 2835, 3246, -2692, -5416, -1229, 2996, 883, -3942, -3529, 2138, 4502, 586, -2781, -373, 4247, 4156, -1263, -4004, 526, 4308, 342, -5183, -3839, 1744, 2693, -2262, -4562, 13, 4272, 2140, -1897, -1801, 2225, 4708, 1744, -2993, -2157, 2672, 2813, -2816, -5598, -908, 3976, 666, -5130, -3030, 3220, 3509, -872, -2056, 1389, 4248, 2642, -1546, -2893, 251, 3225, 1037, -4104, -4201, 1663, 3054, -3309, -5661, 1071, 5769, 1636, -3199, -1052, 3564, 3228, -486, -1594, 376, 2057, 1517, -2132, -5324, -2211, 3431, 1759, -4302, -3281, 3507, 4132, -2393, -4068, 2735, 6565, 1694, -2723, -1042, 1123, 454, -965, -2227, -1933, 1027, 2266, -2008, -5805, -1580, 5383, 3751, -3033, -1568, 5423, 3912, -3651, -3808, 2526, 4155, 97, -2754]
2016b754L39Q07Q40N73j294m41M435K763o075n254O100P099m096o553K850N179
2032D518l614o560J289N537Q77j913o84j479n93L550J809l707l99O464J597q533
2048a841n292O732O065n146n191M356L618m811l855K678L379J420J242r92m060
2063a698n84M734Q60n676o9P963J24j0644l562Q203L993n031j696M862J423m201
2079i99j715K113J085J833L393k420p118L80O204j792o791L023Q784j858j0009
2094e887j012P971K157m018J104L879j531l056J9r91j261M199M291m798p353K521
2110c766O456l321o082N737Q859l767q551J120N506j99j842J816R47k473j181
2125g41P8l257j474O784M909o650o063N628N098n495l878P146O333m909o679J135
$$ y = [-2754, -2415, -1608, -768, -195, -1489, -1930, 2505, 5268, -807, -6061, 39, 7138, 3042, -3511, -661, 4518, 904, -5656, -4367, 1170, 2047, 134, -550, -2029, -2622, 928, 2737, -970, -1369, 5095, 6692, -1841, -7133, -401, 5664, 518, -4673, -317, 3301, -1510, -5365, -2687, 692, 2112, 3354, 2362, -1698, -2282, 2452, 3312, -2364, -2433, 5530, 5654, -4990, -8552, -349, 3644, -1387, -3083, 1779, 3202, -999, -2714, -601, 484, 2317, 5710, 3290, -3828, -3448, 2756, 964, -5827, -2804, 5980, 4122, -5887, -6899, 1072, 3229, -789, 315, 4194, 2663, -393, -374, -1365, -2626, 1573, 5864, 1066, -6287, -3766, 2690, -631, -6713, -976, 7883, 4116, -4435, -3315, 2191, 1992, 150, 1966, 2913, 440, -741, -663, -3920, -5394, 1390, 6299, -351, -6414, -786, 4312, -1183, -5061, 2085, 8418, 3509, -3170, -2035]
2141b035K609j445K18K201j539j891K313m98n575N50R059L318p492l918O236K755
2157D866o829k534P002L410n009l810M09r7K20K678Q54k436O08L974j796o553
2173e043J844R360P91q292j760N604j72o135p82N268K171k769j860l81p59K014
2189i01L900j097l273L040M085m690o653L177P491j304o994k43M743r28m516P48
2205c415L910J469N7o19k611q15L803K456l573k973L920L167n821n969M155O316
2221C457k156m692J231L412l17k038K4J866J912J081j592m050p04M398J006n312
2237b474j722N245K030n433l516M210N023j242l295Q91K568L2j420j396l35K217
2253A383J927l134m554J093M606j13m603l52N541K118m579k546L761L431j132
$$ y = [-2035, 574, -871, -653, 1548, 9, -1882, 431, -67, -5642, -5092, 3967, 7285, -207, -4125, 2111, 4866, -1963, -4497, 2505, 5915, 906, -2904, -2495, -2592, -2372, 306, 1160, -1276, -668, 3306, 1510, -5043, -3199, 6161, 6952, -1340, -3100, 2504, 2332, -3803, -4585, 683, 2854, 85, -1775, -2156, -2915, -901, 2999, 1902, -1371, 1669, 5754, 1064, -5589, -2412, 5079, 3775, -3219, -3462, 1281, 353, -4163, -3415, 495, 1964, 2021, 1402, -1209, -2024, 1779, 4235, 662, -2311, 1609, 4776, -1045, -7014, -2859, 3457, 1301, -3391, -2160, 1252, 935, -1103, -1079, 787, 2699, 3780, 2188, -1862, -2566, 1832, 2838, -2474, -4196, 1049, 3079, -2354, -5870, -1660, 3363, 2121, -1174, -283, 2285, 2317, 897, -499, -834, 1383, 3310, 176, -4378, -3285, 1321, 1208, -3395, -3747, 1794, 3912, -667, -3213, 548, 3979, 2847]
2268B847k683q66J397J169j540l032n14L074K237k957l805K390N215o03m269N00
2284a440M598J276l616k925J795K910q52l319j472J596K260q33l358k8M560K271
2300C423l206k641K648L994q95m338o86L662J098l606l030J116L046L26l158j558
2316c805L031L307j004l008K32L971J848l438l383K099L299j480m278j068L123
2331e54K133k601l043J743M014P17k721j478K733L333j324m026l11L311R64l455
2347e65l313J398L675m54l972n96L951K713j863k807J262M062N25l699k047K254
2363E24K278j571l983r63L352J931l048k741K234M180K82l441r50L914K615k603
2379B010l384P05K837K39l538k806J934L230j076l527j71L929K667k282k924K133
$$ y = [2847, 164, -702, 695, 1864, 324, -2708, -3222, -148, 2089, -868, -4673, -2283, 2932, 2329, -1940, -1440, 3158, 4434, 818, -2107, -312, 2598, 1746, -1573, -3045, -1449, 811, -22, -3380, -3408, 1152, 3423, 217, -2424, 224, 4218, 3323, -1015, -1701, 1961, 3059, -547, -3577, -2461, 585, 911, -2247, -3805, -774, 2533, 1529, -1479, -1247, 2724, 4572, 1134, -2249, -150, 3149, 1669, -2609, -3677, -554, 1579, -1022, -4065, -2322, 1692, 2409, -312, -1790, 943, 4276, 2952, -1074, -1385, 1926, 2890, -565, -3878, -2480, 1195, 741, -3231, -3827, 124, 2837, 974, -1833, -571, 3491, 4016, 317, -1730, 524, 2802, 1231, -2752, -3715, -363, 1568, -1480, -4221, -1987, 2193, 2475, -966, -1916, 1998, 4613, 2010, -1374, -669, 2168, 2407, -1131, -3937, -2003, 1227, 151, -3376, -3547, 382, 3049, 767, -2157, -24]
2395b4M132m69l828j387K500J999k291l973O5L427R22l044k033K430M007j47l587
2412a301k41M125J889k889l075J023L008l94m101j982K561K467j447l070K73M113
2428I59K188k954k417K902L690j084l809q90K857J321l158l201R94K832N00k653
2444a923j958K489M055n51l667L92M379J439l728l136K173L077j775l867m34K232
2460h03J170j347k260N06L874K069k652k594K434M012j089m663k37M289L58m818
2476a751k401K297K305o62j963l22K065K204m10k306j94L903K580l757m392K285
2492e19L851k571m676Q99M083J09l704j267K463K350M73m11r21N32K583j44m434
2509a304j313M663K225m962m389K846L870k575l515K710M300m89k318l88O51J458
$$ y = [-24, 4108, 3639, -189, -1576, 924, 2923, 632, -3341, -3276, 151, 1073, -1971, -4004, -1574, 2433, 2286, -1301, -1542, 2583, 4472, 1583, -1492, -469, 2539, 2145, -1956, -3938, -1377, 1090, -357, -3427, -3154, 959, 3147, 193, -2224, 678, 4368, 3284, -525, -1415, 1442, 2763, -395, -3596, -2602, 230, 730, -1923, -3881, -1392, 2663, 2112, -1555, -1163, 3216, 4655, 927, -2209, -36, 3041, 1266, -2601, -3035, -803, 367, -980, -3240, -2734, 1140, 3209, 557, -2037, 397, 4409, 3320, -1343, -1580, 2709, 3067, -1751, -4152, -1855, 450, -212, -2175, -2497, -432, 1772, 1362, -944, -1138, 2765, 5345, 1588, -2804, -519, 3332, 761, -3915, -3016, 1067, 1176, -2528, -3795, -1332, 1018, 1491, 1080, 159, 691, 3274, 3130, -1304, -2617, 2046, 4271, -691, -5080, -2234, 1636, -939, -4454, -1744, 2556, 2067, -251, -639, 12, 1470]
2525A470J819p72l043j93K923q47n569j042O202K587n460k827M347K775k715j348
2541a693K994K463p05j628j595j564R54K979j050m483O36M595j630n925J185P337
2557B870J847m827j571L698R09l125m83K163K19n03k32l046l145K654M607j564
2573D71m065K539N157k474n975K319P063l7m787m81J733j556k011N79N60j58J663
2590E40Q93l875l097M624N358k838l669M229L818m950n297K852M707j209l136
2605a050J11R3j879J27J727o17M38M366R18n759k431N618L435m294k774M274J904
2622D207n824m088L281L138r69k55Q20j414p77K294Q54k062J320M955n82p115
2638b217k084N627J535n097q78M655L54m789j491K815J949O27J502p8k701m2K799
$$ y = [1470, 3289, 2517, -526, -719, 2204, 1357, -4212, -5254, 948, 3535, -1925, -4752, -405, 2370, -345, -1693, 1301, 3764, 3059, 1431, -164, -1728, -774, 2205, 1155, -3328, -2692, 1903, 273, -5652, -4467, 2870, 4717, -110, -1681, 2017, 2926, -199, -682, 1481, 1700, 1197, 965, -2081, -5226, -2572, 2035, 471, -3594, -1055, 4102, 1628, -4347, -2028, 5035, 4998, 211, -270, 1463, -93, -2104, -1525, -965, -1123, 540, 1433, -2442, -5539, -915, 4443, 1605, -2064, 2165, 5983, 1033, -4264, -1412, 3295, 2086, -1050, -939, -846, -2725, -2598, -871, -1488, -1050, 3316, 4234, -1525, -3956, 1662, 5097, 803, -1971, 2303, 4207, -1617, -5705, -2424, 714, -255, -510, 310, -1104, -1881, 413, 1267, -795, 525, 5480, 4898, -2217, -4301, 1326, 2861, -2236, -3114, 1541, 1895, -2894, -4385, -1570, 379, 1006, 2508, 2430, -271, -313, 2486]
2655B486j273l793K420N113k679o966l1M989K01l464J212M234k58l116j55J288
2671B08K32J769J875k477l505J351K156l154l211L647M858k910n365J608M473
2686A555n95j992K045K350r98j610o60j089k68K432J296l501k781K881K137l778
2702b576j857N084L853l068l359J819K418j091j248J088M97j060m42j014k496
2717c452N02L977O61l711n48L905J026l586q05M389K246l138k568J021N85j006
2733e02k81m9m43O78Q85j487k044J794M061P2l451J30L560j83l798n55K917Q21
2751B125k280j784J62O06K81J86k65r0J830J583j946k225K322L144j461l230L62
2768f80K277p35l022n26K205R50j038p77jQ95J554K06j409J29K213N23k620j961
$$ y = [2486, 1213, -2580, -160, 4953, 2274, -4692, -4723, 266, 467, -2997, -1785, 2449, 2191, -925, -1080, 208, 440, 2209, 4084, 1607, -1898, -547, 1609, -1545, -4756, -1109, 3749, 839, -4526, -2918, 1555, 960, -1032, 1013, 3363, 2365, 755, 95, -994, -1262, 1170, 2466, -1035, -3816, -935, 1202, -2576, -4433, 651, 4504, 1436, -1923, -104, 2314, 1223, -25, 1063, 1560, 500, 58, -956, -3452, -2950, 1027, 1688, -2023, -2571, 1334, 2360, -1226, -2031, 2358, 4604, 1466, -1102, -81, 504, -502, -783, -832, -1275, -597, 288, -1199, -3243, -1449, 2612, 2684, -767, -637, 2923, 2740, -1058, -1613, 1304, 2125, -155, -1939, -1777, -1171, -890, -704, -969, -1059, 771, 2354, 408, -1817, 505, 3649, 2188, -1042, -680, 1597, 862, -2160, -2686, -481, 469, -569, -1346, -1347, -452, 1102, 1308, -101, 28, 2241, 2764, 144, -1817]
2786a817J728K033j722k753O86K102l21j631j22J594J596l9j173l37J175J148
2802B147o85j992k81J902J55k728j364J863J698j034j642P19K199N67j371n26
2818c73J204J206k64j626j102J038J058j329j950K97J874M04j686q05J930J886
2834A762p26j442M61J578M25j427j454N66J292o25j865n92J224J205o67j429N88
2851a126K168N65j380p10J251J451p22k057k61J491K12j689j169O69J367N1j338
2868a227k83J654J352n73j179K11J645M67j801j307J043J060j000j706j49J436
2884c57P79j127q86J070J622J41j063m88J180J186r49j790M2J296M6j573j137
2901b008R48J484n14j347L35J650Q08p14r51N46J422o6j635p80Q81P96r18j650
$$ y = [-1817, -89, 1944, 222, -2531, -1845, 257, -64, -1695, -1817, -223, 1373, 1334, 161, -176, 999, 2147, 1462, -530, -811, 1091, 1246, -1482, -2846, -983, 715, -319, -1961, -1242, 957, 1524, 153, -373, 831, 2037, 1773, 147, -955, 83, 1141, -188, -2138, -1841, 33, 437, -1249, -2054, -124, 1762, 1036, -406, 55, 1633, 2058, 631, -823, -257, 1035, 410, -1455, -2047, -823, 382, -285, -1714, -1126, 1042, 1607, 227, -483, 768, 2219, 1497, -560, -821, 670, 882, -807, -1976, -1307, 60, 111, -1227, -1510, 144, 1496, 923, -256, -45, 1600, 2067, 266, -1041, 2, 1062, 62, -1644, -1793, -357, 422, -705, -1591, -521, 1101, 1242, 179, -309, 871, 2057, 1108, -682, -640, 656, 702, -871, -2008, -1060, 424, -90, -1437, -1102, 548, 1356, 642, -309, 237, 1659, 1593, -42, -822, 59, 855, -63, -1713]
2919a713N1J629M11j294m55J212J291n0j082k20J329P52j128j421J93J127n7j707
2937a132q14J369J102r19r74O46J381N37p40o78P20J108l29j417p06Q79R07j134
2955a94j725N89J658k36j319J3J507R98n43q76L14Q98J79o90r90j3J053l6j867
2974a280q14J599J203j049j129J010J702k68j348K48J304K22o21o97n75K29O20
2991C56n92j306K44J658K28j833n74K223J397j428q73J394Q27j111r77J19L92
3008A44J70j27p75r71L82J390k20j473Q28K541k38k441o0K162M46j579n44J001
3026F36j7j278n48J89j8P67J053r04j421J160J847q51j544J357K299j093k891
3043a257O1J911l65j421M68P50o13m26L01l26L4J796J369j540j776J426J591j918
$$ y = [-1713, -1662, -33, 378, -916, -1371, -159, 1132, 1082, 0, -220, 1109, 1861, 733, -688, -495, 632, 575, -1132, -1946, -577, 525, -394, -1368, -722, 659, 1196, 456, -222, 498, 1606, 1277, -140, -846, 33, 940, -194, -1919, -1330, 328, 92, -1227, -1214, 293, 1291, 748, -128, 186, 1084, 1263, 573, -417, -430, 623, 587, -1280, -2094, -495, 708, -341, -1470, -460, 1242, 974, -374, -126, 1178, 1400, 779, 82, -493, -264, 356, -236, -1542, -1298, 360, 588, -1245, -1819, 404, 1801, 373, -500, 894, 1721, 610, -367, -248, 144, 314, 187, -588, -1559, -1177, 213, -7, -1480, -652, 1889, 1651, -790, -850, 1312, 1758, 179, -365, 636, 619, -659, -1207, -1018, -1036, -269, 784, -120, -1541, -381, 1466, 615, -929, 428, 2727, 1634, -1257, -1196, 715, 350, -1071, -603, 147, -466, -892, -591, -917, -883, 913, 2282, 742, -1034, 392, 1983, 65]
3061F5j768K140J871k169k342P84J168m90j18J185L21o62L21M16j321k22K683
3078A862J027k900j646J937O16k551q36K785J445k111j369J237M90n18J103J208
3094A779q97n72R95o46k418K45L082L35l196q90K452L8k651N32L226N81j698k61
3112C6M56p46q7J516K60j645p9J403j544l000J410L764m15k805O05K214r42j999
3130a598J199K458k10j230Q6p22j714O83K047q71j717J504J552k414k369K457
3146h59L419r36k261J202J410j944j549J498J043p08J6J15j794j318J832J894
3162A060j345r72K516J281l160j895K924K205j713j267J109M2j924o30J137K84
3178c48q7J242J62k456o23K861J075k158o5K770J9l431j227K386J135j569m18
$$ y = [65, -1703, 437, 2308, 139, -2203, -1419, -251, -741, -859, 326, 647, -15, 306, 722, -599, -821, 1862, 2889, -11, -1657, 280, 896, -1655, -2491, 294, 1739, -372, -1741, -504, -14, -532, 571, 1779, 882, 310, 1305, 659, -1759, -1514, 1568, 1903, -1293, -2183, 269, 307, -2344, -1812, 1414, 1995, 297, 36, 492, -254, -341, 1175, 1435, -210, -289, 1114, -430, -3430, -2020, 1744, 1329, -1476, -871, 1343, 401, -1598, -399, 2059, 1849, 619, 705, -17, -1731, -1048, 999, 128, -1589, -85, 1467, -947, -3316, -859, 2560, 1624, -637, 565, 1975, 31, -1518, -20, 1023, 315, 331, 446, -1348, -2666, -834, 1060, -285, -1257, 1259, 2540, -620, -2515, 409, 2614, 901, -366, 743, 785, -1139, -1769, -632, -348, -435, 807, 969, -1487, -2110, 751, 1826, -332, -397, 2373, 2392, -1039, -2266, 120, 1255, -314, -732]
3195g32J062o16j206O36O12n16J023J987p42k707R1K589k5k456L11K585o85l142
3213a931l11J915M07m94N17L82o37n8P12l20q09J418J863j598k870P45K123r93
3231F1j921J048J971o31j901N2J297L78J64N93l79q43O46M95j602q47J920J281
3249A782j998k008J165J769q96j324J314J614o06r88O5K01K75O74j23j207l72
3266f63J010M6j790n13K201J144j848j191J507J196p50o99O49Q43j69p55n95k72
3284f49M00P89m28j399K40J577j73j617J35J989P28j317r62R78Q91o95q10J12
3302b11L49J56k68r66l70J053R33p02r70O49J495j32j528j6J580L58j310p90M20
3321b70N85j73p94l78O15P27j77q13j58J178R56q45j061P15J162m47j297l05R64
$$ y = [-732, 330, -286, -1492, -856, -244, -760, 263, 2250, 1508, -1199, -1108, 1481, 1456, -1000, -689, 1896, 1211, -1931, -2242, -327, 80, -414, 103, 485, -152, -210, 502, 182, -627, 791, 2654, 1056, -1814, -1069, 1054, 61, -1860, -812, 1159, 528, -1373, -1321, -24, 354, 518, 1111, 732, -111, 535, 1030, -572, -1419, 501, 1782, -216, -2224, -1059, 710, -186, -1510, -196, 1418, 812, -176, -111, 90, 365, 1039, 916, -291, -663, 347, 393, -1397, -1910, 291, 1435, -413, -1604, -97, 1099, 349, -350, 299, 1142, 973, 218, -377, -649, -249, 540, 112, -1287, -1047, 530, 357, -1260, -1125, 864, 1592, 275, -687, 291, 1182, 487, -323, -211, 138, 294, 26, -940, -1310, -257, 676, -26, -996, -347, 1148, 1016, -512, -528, 1052, 1410, 100, -690, -270, 315, 142, -652, -1030, -415, 312, 135, -678, -836, 342, 1298, 453, -608, 107, 1269, 822, -475, -780, 184]
3340A84N09r64r36M51R17P3n85l88O59J045j45j045r6R85M84q38j087K86J077
3359E86k16j285k41R95O23n11p52L06J134L37q22n09N71P27k10j080m38Q78N52
3378F45r24q98M24J020J65r33l74J070Q63n70p87K05Q18K21q24q25L87P97k69
3397B11r64k81P82P87n16r15M81J226P4r03l16O46O68m64j028o4P84J89p27o69
3417i99L10R58J51r53k33J051O94n47p75K42R01Q2r95n43N30N14l28p62k38Q18
3437a22O57o09p35N47J028K0q24l48P81N78o95q55J78O12M8n72n98L13R04k2q25
3458e39r7R65O39n59q83L78R71k12r82j57N22K54l75o41o0O80M92m18n07K51R51
3479F73J51j020l49J130N06r94p51M03N30k40n88p4M57L14q7l47l05N71R51l25
$$ y = [184, 693, -271, -1207, -756, 161, 234, -351, -739, -80, 965, 820, -225, -321, 664, 1148, 310, -777, -491, 586, 370, -915, -1156, -161, 462, -49, -801, -495, 639, 976, 154, -355, 216, 943, 733, -347, -785, 93, 645, -279, -1177, -753, 267, 432, -501, -875, 195, 1058, 488, -299, -94, 724, 945, 121, -704, -317, 480, 211, -753, -1034, -252, 535, 19, -896, -415, 811, 885, -18, -334, 312, 980, 516, -512, -576, 208, 397, -330, -999, -689, 269, 420, -533, -766, 285, 979, 432, -343, -101, 800, 882, -113, -656, -126, 388, 60, -702, -940, -122, 535, -74, -809, -262, 766, 786, -38, -386, 395, 973, 278, -577, -399, 213, 261, -311, -909, -596, 308, 286, -539, -636, 329, 968, 409, -474, -96, 875, 663, -319, -476, 46, 300, -75, -716, -776, -96, 396, -22, -529, -278, 673, 824, -196, -545, 585, 1091, 97, -654, -251, 279, 39, -549, -623, -166, 148, 61, -286, -591, -20, 931, 606]
3499F06j039L02J072k80j259j52J028L67r17n69N35L08k06N4M9L0N67K79p61o67
3519f53P57R30n82j163L57J057n57j318L38J171J6n39K1J39m3K09K04k41j67O61
3539E97L65j203j024J061J069r73q72Q64P82q42q13O36R11n9k11J80l40m90N10
3558A48L64q70j65J199J53j662o79J392Q68r40m47J185L95j184l94P69J95j33
3576A94M19m3j061l14Q37R8r82K34J610p9j879k29J625K92r74K80R81l61j066
3595d18l5L51k07J76Q75k58j429Q9J254l64j091J014J635o70j776J63J238k32
3613C15p52O63P14r26p38M48j37n44R73J213q42j329O45J049q56r00J404J381
3631A781j267j516O09N55p24K4J052K9q63J6L68o52l41J495J061j314j110J071
$$ y = [606, -433, -131, 941, 661, -598, -750, 278, 645, -272, -841, -306, 2, -204, -150, -101, -71, 496, 775, 14, -653, 104, 1034, 452, -711, -354, 703, 146, -1172, -834, 337, 353, -186, -165, -26, -69, 140, 344, 103, -64, 597, 962, -241, -1265, -204, 865, -108, -980, -116, 666, -176, -989, -353, 558, 499, 288, 468, 128, -362, 148, 512, -358, -523, 676, 829, -833, -1512, -120, 748, -192, -639, 546, 941, -243, -637, 132, 327, 194, 613, 570, -491, -805, 32, 130, -852, -618, 992, 913, -966, -1195, 430, 722, -252, 28, 1009, 648, -418, -453, -102, -309, -133, 742, 484, -945, -856, 398, 34, -1057, -43, 1592, 922, -854, -691, 547, 315, -437, 226, 940, 14, -724, -276, -413, -957, 16, 1229, 387, -942, -297, 752, -104, -1004, 400, 1781, 514, -1002, -393, 162, -562, -538, 514, 543, -320, -304, 64, -588, -929, 566, 1627, 313, -797, 274]
3649B74M43j441l28J681O31j321p49N51K4n88O16J038m05o64N98M7j295K2J820
3668I54M06j566n21J079j02j447J57J717K22j136l6M33o28k06J107M82p83j06
3686B6P24n71j455M14J811q3j512J88R81o82j059Q10J180j69n00K22j59p91J56
3705d69J087j32q88M84P29j125j212R89J400m55q84N45N80q01o58Q22O73m40O
3724B51L28p50p75O63Q02n88m85Q65M63j197q10J143J033p23m45P16M0q66j35
3743d70N28M0j40L43P5r10m00Q95N44q31r2J140O5j230k85R68L48n32j02L74j99
3764A29n62R7K80k38J27O99k19r02J21Q83j4o79J66Q65j38j036j39O87O8l79J22
3785f2J41k90l9K28j16j76M36N68l89p39K30P44k63o99L25O03l36o07J8L31R5
$$ y = [274, 717, -724, -1052, 629, 1260, -61, -810, -259, -235, -823, -207, 831, 426, -238, 360, 407, -888, -866, 954, 1360, -206, -727, 352, 250, -1197, -1040, 677, 899, -237, -273, 160, -468, -674, 433, 915, 132, 26, 750, 179, -1276, -862, 949, 866, -646, -458, 523, -159, -1218, -408, 772, 603, 103, 325, 166, -625, -469, 618, 486, -402, 82, 811, -314, -1526, -537, 863, 408, -476, 69, 649, -152, -810, 12, 685, 245, 251, 579, -171, -946, -283, 519, -69, -554, 311, 774, -423, -1233, -90, 943, 220, -225, 491, 531, -335, -470, 58, 98, -42, 301, 376, -534, -934, -39, 505, -326, -418, 722, 787, -443, -728, 240, 588, 56, -46, 328, 129, -433, -336, -56, -294, -167, 532, 313, -589, -468, 415, 401, -278, -112, 753, 615, -421, -560, 127, 195, -184, -62, 79, -211, -250, -22, -138, -314, 122, 690, 301, -438, -208, 536, 273, -426, -101, 502, 166, -441, -423, -92, 3]
3806Cm4N8mr0J68J76l18k19N75L41o11m86L66L70k89m26K09M42j23l75M1K15J03
3829H2J31n4k24N8L21r0m08o9L79J95m60l88L53L79k29k64J77K87N6j74j67J32
3851B3K40qj93k12N5K78p0m46KM14Q2l02j95K63L25n8l29M1L49K8k22j81J3K28
3875A25M8l32j83K10K22r0k45kL49K22l06k22K72K96j14l14r8K56J56l06k45J30
3897a71K05K9j71j57J75L45p4k84J2L12J47k91k82J45L17j45l99J4K43Q7j06k14
3919b63P1L19Q4k13j28J89K58k8l86p1L31P4l35j98J51K22k9k71m4K79K00j25
3941H7j76L8K56J46k95k69K34K69j88l49MK22J17k12k03J97K62j5j67j05J87L12
3963C52q1m05K9L55k2l59j77K10K53j68k69J00K40K8o1q0J0K88J48l11k96K33
$$ y = [3, -41, 17, 13, -77, 91, 267, -51, -270, 305, 646, 35, -451, -85, 285, -4, -430, -221, 221, 98, -277, -236, -21, 82, 213, 159, -65, -7, 314, 224, -184, -253, 126, 321, -139, -527, -174, 205, -24, -288, -111, 176, 232, 58, -109, 23, 263, 255, 62, -150, -95, 183, 113, -333, -331, 83, 165, -137, -332, -69, 256, 198, -131, -90, 259, 287, 65, -116, -103, 125, 173, -159, -342, -132, 90, 0, -245, -247, 102, 324, 18, -204, 68, 364, 250, -64, -162, 94, 250, -56, -301, -171, 34, 63, -108, -265, -90, 255, 181, -103, -91, 221, 368, 77, -205, -60, 257, 112, -287, -273, -30, 57, -49, -263, -192, 127, 211, -2, -130, 59, 317, 289, -97, -168, 163, 237, -98, -296, -145, 77, 48, -223, -267, 12, 212, 87, -89, -51, 205, 351, 56, -213, 21, 290, 102, -247, -243, -21, 96, -116, -319, -122, 140, 125, -42, -147, 40, 352, 271, -134, -105, 250, 228, -131, -308, -98, 155, -13, -282, -182, 58, 86, 25, -55, -45, 243, 391, 80, -216, 17]
3985A7K96j89m39O3M19k5m94m1L73J10p3nk5P2J66l8k57p0L48J97m25m70L37M32
4009B79l68m03L54M29j94k74M6K20Q4J5L5j38j26K25L2n56j26O68K12o40l37M98
4031f5L36m11k51N50L54l38k23J14j01o2L29K3m91k0M45j30o98M6R32K20p60j91
4053c92O71N6n71Q9N31j1k56j4j83l79R7N98k7o51K00P36l78r19M43J064o8p49
4075a13M1M65k90n21K41M19k03q1K37m21o61N52Q62l22o04N72O73p71r09O23R92
4096G81l38o71L03J74o68j62N15N0j59M71K59q08o11Q49Q39o65n42R08M45j218
4116b48p59Q21O15m24j82L53j71n82J85N28k40m2R31J68j336n03J142M25r42j64
4136d25J012Q8j268m50Q57L47k95L35L91o65l77O20J13o44L34J114k49j531l09
$$ y = [17, 313, 124, -315, -252, 167, 142, -352, -393, -20, 90, 17, 12, -13, 59, 225, 187, -70, -140, 208, 405, -20, -490, -153, 279, -89, -492, -138, 291, 97, -177, -131, 89, 173, 188, 223, 85, -41, 184, 216, -340, -466, 202, 414, -226, -563, -65, 271, -140, -391, 159, 513, 175, -48, 66, -35, -97, 232, 255, -236, -256, 189, 59, -639, -593, 339, 559, -201, -392, 279, 335, -236, -147, 384, 373, 117, 103, -80, -459, -362, 236, 209, -442, -242, 494, 116, -803, -360, 704, 636, -113, -72, 393, 103, -418, -177, 242, 39, -42, 195, -226, -887, -335, 527, 205, -399, 173, 846, 75, -834, -211, 781, 443, -228, 75, 249, -419, -581, -66, -16, -175, 296, 555, -253, -864, -15, 824, 159, -383, 525, 970, -248, -1007, -186, 429, 5, -177, 176, 5, -577, -392, 136, -104, -146, 785, 953, -383, -886, 256, 681, -261, -425, 587, 675, -593, -1043, -186, 161, -134, 201, 592, -73, -450, 170, 283, -361, -27, 1087, 838, -693, -1002]
4155a002J186J22r68K84J125k86j069J5N69j4J23O50p3q73j10O54l22q92P27J263
4175A109o44j483K42J041k54o10O39Q30m12p06J26J25k99M26P90n62j005L88O21
4194C62p86o96J088J146p35j178M37Q05m62l52P72L82n79k36K8m81k21Q25O07
4213G26q01o93P43M96r92m65J340Q59r11o91M43J86m17k4M49j0l01J10n9p61k3
4234g96J196L73r98k26R53R1j048j83J094M77p63m96K56m4l32K59K64k97J38N10
4254D28l72q23L30J145Q9r91q6Q70j16j037l8Q12J76m34j69j2j23J55L21p1k31
4275a77M03N62n65q95M39J001l11q55J10O01k00o81j6N22K64r5o8j44j11L83L19
4296D86m63k85O25L59p70p11M52P10k60o57J80N43j10l80N8K62K43J79k00m15
$$ y = [-1002, 184, 306, -662, -378, 747, 461, -608, -593, -24, -38, 85, 735, 662, -211, -321, 333, 11, -881, -154, 1109, 465, -1018, -776, 265, 11, -599, 40, 870, 458, -248, -122, 3, -296, 130, 920, 358, -647, -259, 362, -424, -1120, -32, 1114, 379, -799, -362, 443, -19, -371, 401, 783, 204, -32, -4, -485, -706, 119, 726, -75, -768, -25, 471, -521, -986, 354, 1213, 302, -389, 54, 240, -177, -201, 248, 238, -63, 47, -12, -773, -796, 400, 773, -225, -451, 502, 593, -455, -638, 456, 933, 170, -326, -70, -114, -446, -187, 77, -220, -82, 428, 56, -767, -437, 708, 797, -194, -280, 590, 474, -563, -601, 211, 387, -47, -216, -228, -351, -196, 125, 54, -177, 226, 788, 223, -672, -233, 768, 457, -398, -288, 313, 113, -568, -584, -62, 202, 107, 39, -105, -216, 167, 486, 23, -262, 363, 722, -48, -759, -307, 403, 143, -514, -334, 209, 99, -281, -223, 39, 282, 461, 261, -154]
4316a54L1M48K6n65k60N99L23o91n36N38N88k12l89J07L90J22k52k40J06K73J52
4337D04k96n28P4N48m3o27n1O30K55m29l78L66N95j33m40j3K66J11j91l51j13
4358c44L97J85l93l74K22N34J8m73r6O00K96m31l77K10M03n4m77k21K93K48k26
4379f0l30j1L72L19k63l85K78N46l9m67j64L99K86l85n14J65M62r4l95j62K75
4400a67L80o6l35j0M40K39k86l66J07M63l4n66k33M06K40l15l76J18M71J16l34
4421a08j69L41L11n1l37j48L32K66l93m44J35M05jm51j89M30L71k60l06J90L83
4442C07P7k58k63J56L60j04m60j82L41K31l00m01J93N24k5l79n3L61K78j21l68
4463h6LL26P2l24l43J14L69Pn07j16N01K43k83k40K24L78L1l28j95K43K04j36
$$ y = [-154, -123, 325, 351, -214, -474, 125, 448, -243, -779, -241, 347, 135, -254, -147, 243, 365, 113, -127, -21, 252, 404, 108, -420, -346, 202, 159, -468, -519, 111, 366, -63, -441, -75, 520, 387, -53, -66, 200, 311, 120, -231, -344, 53, 238, -155, -529, -307, 227, 245, -228, -324, 276, 572, 141, -236, -26, 377, 323, -154, -375, -82, 166, -60, -390, -401, -29, 290, 27, -358, -80, 466, 427, -40, -204, 195, 481, 96, -418, -253, 209, 115, -280, -442, -167, 213, 147, -188, -198, 242, 481, 195, -171, -64, 399, 365, -201, -434, -28, 212, -103, -479, -361, 110, 226, -108, -277, 64, 375, 324, -13, -161, 171, 437, 44, -400, -265, 140, 139, -312, -501, -71, 300, 40, -266, -76, 307, 384, 126, -137, 19, 379, 275, -185, -367, -26, 205, -95, -496, -303, 221, 196, -183, -236, 125, 403, 282, -86, -83, 243, 315, -9, -352, -238, 131, 138, -369, -485, 16, 259, -24, -264, -40, 338, 369, 41, -154, 89, 293, 157]
4485A57l36j46L13K09l27m16L08M91o8l73j2M08K04l02k33J57K39m8k57k63N1
4506b44L29nm41m5M54K70l42l35L27M79j25m23Q0K62n2j94j56o0K12J59k22l26
4528c98Q6M49R9m50o1O47K08n88k62L52K47k30k23L3O2l1p9j21r8K72M20j58n36
4551c60K00O00j24n63J35N80m0o16k17L22J13j82M1P3j08J10J73k63j99N04M96
4572F75l97n78K17N06l19o09L05N93k82m72M2J82k8J48K13q9j43K38J56n01k99
4593d42O64N14o84n83M49L25n36l07N52M12k25k81J16l8j15L81K87l98k12M84
4613C63p1q43j06Q89K89o98l33N44J45n70k4O91J39k57O3o8m30j1N56M7n53K7
4635b11N76k64r20J41J079J13o96P5M82k54m55K49L92m0j21J70l03o71J75P88
$$ y = [157, -179, -325, -12, 197, -130, -546, -238, 253, 185, -188, -200, 208, 412, 110, -123, 34, 273, 225, -32, -295, -244, 85, 80, -361, -406, 48, 318, -24, -359, -32, 447, 322, -101, -21, 241, 189, -5, -161, -221, -9, 150, -72, -398, -312, 137, 236, -214, -275, 372, 580, -8, -270, 82, 329, 99, -124, -91, -29, -60, -139, -260, -358, -86, 334, 176, -360, -160, 440, 316, -247, -112, 468, 428, -188, -405, -83, 30, -152, -111, -38, -146, -36, 137, -126, -325, 179, 675, 278, -300, -83, 423, 104, -505, -200, 393, 111, -361, -319, -137, -165, -17, 196, 107, -36, 202, 358, -143, -442, 222, 736, 52, -531, -82, 243, -293, -600, -48, 364, 139, -142, -26, -64, -179, 202, 489, 91, -121, 363, 292, -551, -657, 232, 521, -177, -510, 34, 179, -391, -415, 276, 415, 158, 221, 153, -277, -288, 268, 315, -238, -211, 365, 101, -819, -678, 401, 514, -182, -107, 375, 121, -334, -85, 307, 267, 146, 316, 13, -658, -483, 305]
4655C05j70o08M31O44n70q36M78Q87r6n04J99K53m95l94M24J24k49K88K96o39
4675b32n95N52O92l73l83O62M86p87p15N82N98l46k11L19j40m92RK94j35j0N98
4696C73K49q30m83P90M61o31j60P82J26r15m13M87K60k31R9L12l25l88L28K15
4716A06l87J86Q14n7r85j68P22Q2o32N3P40j18p87r2M16Ll0M27O3m39l0L58j52
4739I3m45L32P59l12r18L8O02j53m93L47N29k09m11N2J61r0K06L99j52n10J37
4760c8L44m54m76N89N87m32o51K17M51j96k67L89L86k42j86Q8j58j55L84K34m35
4781b1l06L11J74m84k68O00M84m11l94L34K19k44n3K44M5j05n1j00k90j4M22J22
4803B14m38j36M89O7m91l4N51K38l21k24J41J07j51p5Q8n6j7R6j46l08J69M54
$$ y = [305, 135, -473, -42, 602, 32, -804, -326, 561, 465, -39, 160, 413, -82, -476, -52, 72, -177, 111, 407, -232, -827, -275, 417, 44, -339, 323, 809, 22, -693, -111, 487, 141, -70, 249, 109, -383, -374, -80, -215, -225, 373, 622, -208, -691, 99, 560, -71, -231, 551, 677, -238, -651, -164, 96, -135, -36, 276, -49, -437, -109, 106, -281, -95, 719, 662, -323, -491, 231, 313, -319, -266, 474, 356, -431, -523, -107, -104, -134, 293, 356, -83, -113, 245, 93, -352, -20, 739, 427, -491, -453, 149, -4, -497, -150, 379, 170, -241, -189, -28, -118, 88, 487, 335, -175, -38, 306, -148, -624, -35, 552, 120, -531, -314, 137, -59, -326, 63, 449, 207, 21, 109, -49, -204, 180, 414, -21, -327, -16, 158, -326, -594, 6, 490, 79, -315, 19, 238, -6, -59, 185, 230, 125, 74, -26, -316, -330, 92, 214, -224, -360, 129, 196, -295, -329, 222, 460, 139, -85, 56, 163, 12, -63, 25, -31, -48, 48, -98, -406, -237, 217]
4825B17k0l67O6L96J5m03j08M03J20k99j55N2qj6K1o6pJ74J42j84j85J86L74p7
4849B71l84J06K93j01l60k0J85R0j37j45K3J37P1Mo4PJ96J37k56j97K18J99j62
4872A11k84k8K70k1k73l8K17J18n6q3KJ42J34n8j59QJ36N7k27k01J47K22j51k67
4896b82P3K54M6j44p8K02J59q9j10j0O4O7n9k24l7K11J3k14j09J66K09m6k22N4
4920a06K89O3k13o8J10R8p4j68j02J19R3j12j43J3K01J36j79j19K25K17j34j85
4942c9L9J64K8k07j40R0Q6l5j36m4J05J90l9k00N6K60N3j74j33J65J47j66k22
4965a52M6J26j9r2r8K5J78O5j38m7J51K05r6k16K5K37%k65p4J24M0o2j24l5J49
4990d7J30p1j12N9J89Q2k03j30J93J62k07k31O6J52k6j26n8R9J15k6q4l4J18K14
$$ y = [217, 197, -170, -104, 292, 307, -96, -204, 199, 319, 20, -135, -83, -91, -107, -86, -152, -159, 15, 157, -27, -212, -26, 348, 271, -113, -7, 286, 185, -175, -195, -10, 80, -57, -202, -179, -42, 29, 33, -31, -24, 172, 309, 53, -144, 74, 273, 111, -173, -201, 69, 48, -225, -263, -46, 72, 16, -67, -65, 77, 211, 153, -6, 2, 138, 195, -32, -233, -86, 136, -15, -282, -209, 45, 91, -53, -131, 71, 230, 141, 31, 21, 85, 152, 93, -131, -168, 43, 56, -158, -267, -101, 108, 62, -160, -106, 183, 246, 33, -35, 75, 173, 99, -69, -171, -52, 41, -71, -214, -201, 0, 136, -43, -162, 63, 280, 146, -39, 0, 164, 192, -15, -155, -65, 21, -14, -150, -194, -89, 101, 62, -138, -82, 178, 231, 57, -76, 89, 236, 70, -152, -106, 20, 1, -91, -189, -164, 14, 79, -59, -106, 45, 250, 154, -62, -37, 200, 200, -65, -139, -15, 25, -37, -161, -196, -47, 83, 12, -100, -41, 148, 230, 27, -103, 90, 252, 45, -186, -120, 32, 6, -120, -178, -79, 36, 10, -74, -108, 10, 224]
5014B24k9k62J7K50l9k84q0J96J11j61j53Q5J26Nl7L6lJ18J32j91k18J75K52j62
5038A08k84L0K77q3l05QK95M4j27J0J3K0R3L1j14p3J86J28l00l02K53L00k18k72
5062b82K13K21j39j91J03J76M4J1j0j26j09J61P2k81q4L59J07m44k22L52K59k09
5084a9j22K47J28k05j41J15L1j3J75m8l49m9K85K2l42M5M83P9m87j50M21J31k43
5107fJ9K15q0j83k3l1r8J10K80o0m30L5M31r7m04K39N48j52m65j7K63l4j51J01
5131A0J19j56r6J10j46k22L52M32k53m29K04L70k44l33K86M31j95m32J9J44j40
5152a69M2K29k3j83J41R4l18j46M65L80l54l95K69K36m06k47L89K85k45j67J6
5173a07m0o6K10K34j72j25K94L1n11j45N71K64m44k31K51Q1l23r4L61J30j10J5
$$ y = [224, 195, -67, -50, 200, 161, -123, -203, -7, 104, -57, -210, -125, 1, 6, -31, 5, 2, 120, 252, 61, -157, 18, 270, 108, -176, -146, 131, 48, -257, -249, 46, 90, -37, -27, -14, 6, 99, 130, 16, -57, 129, 257, -43, -345, -92, 208, -10, -282, -69, 152, 13, -178, -75, 101, 145, 156, 146, 20, -89, 72, 144, -137, -221, 138, 245, -199, -421, -69, 190, -19, -141, 106, 234, 29, -112, 3, 34, 21, 196, 148, -201, -250, 35, 57, -285, -240, 243, 322, -165, -315, 106, 237, -6, 13, 228, 148, -35, -58, -89, -187, -77, 203, 143, -287, -252, 179, 82, -322, -83, 465, 313, -152, -169, 94, 60, -91, 10, 129, -27, -123, -13, -159, -381, -29, 403, 150, -279, -75, 295, 51, -282, 4, 435, 240, -192, -173, -29, -169, -127, 102, 79, -104, 37, 131, -187, -333, 132, 512, 158, -237, 32, 268, -138, -385, 4, 289, 44, -123, -107, -147, -213, -3, 231, 59, -66, 228, 259, -252, -397, 174, 438, -6, -237, 14, 95, -228, -322, 39, 169, 59, 74]
5195G4j0k36l4M08P7l46K7L38j22n49n7N47J88l99r6K62m3k33Q1K14J8L5Q5j76
5219E3l55J26L85n0l88J20L95k06n11J13M77N3k10J4Q2n5j11N9L1l2J44J35l14
5242d5l71K61L63j77k78K30L25k30l76J11L46K5j26K8l9j42P1L9j71j3L09J11
5264B51l69k64K88L11j86k11K61K42k51k39P1J49K7K4p6j39k1J53%k12J7L85R9
5287C10l93j65L06J80k05j32J36J34j29j91NN0R6J04q3k18Q9K32o4k21Q5L13K0
5310B59l04j58K33J26j53j20P6P0jp7r1J4K07J17j52j88J26K27j00k70P0K94m8
5333A57k69q7J34J23n9r3j5J06Q4k2j54RJ79J41j97j86J33J74j01k36K0K47K6
5356A14j93j09J35J38kq7o5J00J46n8k31K2J91M7j92j50J05K03r5j95M8J89Q9
$$ y = [74, 64, -172, -206, 202, 279, -67, -40, 298, 176, -373, -430, 117, 305, -94, -190, 72, 29, -204, -123, 91, 109, 144, 229, 53, -302, -176, 209, 159, -229, -109, 286, 80, -431, -318, 159, 212, 2, 16, 98, 43, -68, -9, 22, -10, 134, 269, -45, -416, -155, 208, 31, -247, -17, 308, 78, -298, -187, 159, 184, 58, 86, 47, -95, -24, 15, -156, -169, 140, 251, -118, -382, -94, 217, 31, -180, 81, 323, 72, -167, -96, 53, 80, 104, 28, -111, -132, 21, 21, -191, -174, 211, 310, -83, -248, 58, 238, 33, -99, 37, 171, 42, -149, -144, -94, 2, 106, 23, -195, -106, 126, 62, -159, -74, 239, 259, -45, -203, 30, 156, 3, -117, -41, 29, 28, -49, -140, -126, 81, 198, 46, -142, -16, 211, 111, -159, -89, 205, 157, -112, -199, -65, 58, -1, -94, -109, -3, 81, 59, -95, -86, 93, 234, 37, -149, -16, 158, 57, -179, -159, 88, 114, -79, -188, -53, 85, 83, -4, -69, 31, 177, 119, -112, -90, 101, 148, -44, -194, -89, 114, 19, -176, -128, 61, 150]
5379A50j42j27R7J38J8j44r4R4J14m8j99j2J92Q1j69j17J02J97j2j85j4J66P8
5402A64j32j26M7J13L7j35j12Q3J33m1j47j7J88J06j24j56J08J76m9j54o4J18
5424A6J06j24j41L5J32N1j32r2Q0J85Jj75l0J76R5j31j70M7J91l6j82n3J35Q9
5448G3o7j20%J71R6j55q5Q1J37J1j82q8J52R9j48j45P7J34K1j38n7Q7J51m9j05
5473d9k2J22J00j33j35O8J53l6j61m4J06J02p1j40M9J66M8j15p2P4J36j6j64o9
5497a03J50N6j00j58M3J63J5j38o0J31Q1j5j23KJ22R3j35j49Q8J23l3j48m8J62
5521A9O1j15r7P5J39J5q1o8N9J27l7j48j6J28L9j11j82R9J74m8j43K7J40M1r1
5546Fq4M3J17K4p5j05J6J17Kk01m4K23Q8j79r0R8J26m1q5L8R7%n0o3n3N6J48r9
$$ y = [150, 8, -119, -22, 116, 134, -10, -104, -10, 104, 56, -143, -155, 37, 118, -51, -168, -66, 131, 119, -66, -80, 86, 164, 32, -94, -47, 66, 103, -32, -144, -61, 72, 31, -116, -133, 55, 161, 37, -119, -11, 165, 116, -38, -102, 16, 122, -2, -143, -108, 24, 75, -57, -149, -69, 116, 117, -58, -88, 88, 183, 52, -118, -71, 120, 84, -98, -151, -16, 73, 6, -114, -114, 57, 153, -2, -87, -6, 131, 142, -40, -128, 24, 123, -25, -170, -93, 41, 62, -76, -133, -46, 105, 56, -49, -71, 51, 151, 18, -117, -49, 104, 68, -93, -137, -31, 71, 0, -140, -91, 75, 123, 8, -64, 10, 146, 130, -34, -103, 47, 103, 3, -155, -112, 51, 66, -72, -132, -1, 80, 65, -58, -56, 66, 159, 24, -125, -37, 86, 53, -95, -143, 19, 80, -35, -132, -57, 82, 97, 16, -52, 7, 134, 97, -51, -67, 61, 100, -11, -193, -94, 80, 32, -111, -84, 56, 97, 6, -78, -35, 82, 106, 31, -74, -58, 59, 61, -140, -184, 39, 127, -52, -142, -44, 82, 41, -44, -6, 91, 91, 41, -22, -75, -19, 129, 30]
5574C0j70O0J57m4j96M2K19P9j83q2J28M4p3l5M0oL7Mj40j09J29J63n9j68R4K06
5600A67j18k21P5K43%j47k2M3m1m2K0mrJ06N8j78j59K32K01j63j25J84J15j97
5624A8j92J01J93o0r0K3k4p7M2Q1q0JK10K7k59j14K39J60j94j16J98Q1k66j32
5648b30J62Q6j9L2M1j31l2J32K9j39N1K68l9l41r7K83L6j82QK01qk59j5J26K8
5673iM2R5J7k10k6K09r6j94J53K93j37l69K0K34j3j47J14J90q1j63L6M2o0J40
5697H0J53j37k22P0J59j73j73K15K99j96l07J27J62r0m5J50J14j45m6lq3p1J95
5720C3J85k18k09J92R4k46p6K93K28k18j70R1P8q3KJ49j8j16M3m0j90jL02P5k23
5745d3q7K01N5k64l9L32J02k27q6P2m9r1R8P4p4j2J00r0k15Q4L23J8k59J4K14
$$ y = [30, -140, -80, 77, 33, -163, -121, 98, 177, -6, -88, 40, 84, 11, -24, 16, 10, 47, 51, -89, -198, -69, 94, 35, -133, -39, 167, 49, -172, -97, 146, 146, -1, -23, 20, -21, -63, -43, -47, -56, 50, 108, -70, -229, 3, 204, 41, -84, 100, 215, 18, -174, -73, 120, 60, -30, -7, -31, -108, -66, 15, -65, -64, 146, 173, -86, -200, 39, 199, 5, -111, 87, 168, -98, -230, -68, 18, -1, 31, 72, -59, -91, 41, 70, -69, -18, 250, 211, -130, -227, 56, 92, -90, -82, 119, 111, -148, -163, -37, -9, 33, 128, 145, -65, -91, 118, 22, -172, -19, 274, 137, -232, -212, 22, 9, -138, -24, 166, 85, -78, -42, 0, -60, 80, 233, 96, -126, -56, 103, -70, -243, -28, 271, 75, -232, -105, 57, -33, -78, 72, 186, 41, -5, -8, -91, -162, 33, 218, 0, -209, -17, 77, -169, -245, 48, 276, 58, -112, -21, 57, -26, -24, 125, 107, -9, 34, -6, -196, -197, 105, 180, -43, -130, 71, 126, -138, -177, 155, 257, 30, -56, 16, -33, -124, -26, 48, -26, -38, 62, -28, -243, -159, 164, 182, -77, -63, 151]
5770A51p1k41N1K06M2j25n5Ko4J0J01J7p7O8J54j59k00J39K44n1k16M7J47r5j97
5795a72P4J48j0n4L2o8o5J04Q9o1p0J12J22k03j98J92J69j06j54R7R1j17r4R0
5819e2O0M9J4rj00j5J23M7j42l6J49L0k00r1J26J26p7q7Q0O9o7o6M6L9L7M5p1
5846B7j13K1J22pj58J1J52J9j67o4J61Q4p1m9M8L9Km7m4L0O9J6r0j08N7J39n9
5873B0j29M6J65l0j27k6J14P3p8p4PM6J9l8p6J2J02K2j15l5P3J09o1q6K5J50n
5900A03j24n5Q5O0m8r2MO5M0n3o4M4R0J5q2n6R5P0o3r5J7J06J9j28o3R1O7n2o3
5929f7rP8P0m0q3L3Q9J0j12o9R2R3o4j12K1J32j7r2k9P6Q9m4q5PQ6L5o6q8N0R0
5959G4Pj29o5R4J13q2j29L7J35J7r3n2P1Q7m3r9j5Q0N6p0r4K8J02L3j20n2J18
$$ y = [151, 80, -161, -110, 96, 138, 13, -42, -40, -104, -94, 7, 24, -53, 15, 169, 10, -190, -51, 193, 142, -74, -27, 120, 25, -172, -98, 50, 40, -14, 18, -50, -115, -11, 78, 17, -53, 59, 181, -22, -220, -28, 141, 35, -119, -22, 69, -48, -142, -52, 8, 57, 71, 62, -38, -53, 70, 117, -25, -61, 88, 118, -82, -173, -47, 79, 2, -85, -5, 64, -3, -69, -23, 16, 53, 98, 27, -86, -65, 57, 50, -108, -97, 55, 74, -93, -157, 4, 88, 17, -32, 16, 55, 57, 10, -34, -4, 65, 81, -9, -117, -60, 79, 20, -109, -63, 102, 72, -55, -81, 33, 106, 28, -46, -39, 7, 26, -12, -88, -76, 26, 48, -67, -102, -29, 80, 19, -67, -42, 108, 103, -21, -76, 9, 69, 21, -71, -67, -2, 38, -15, -79, -35, 55, 70, -12, -68, 27, 97, 34, -61, -44, 62, 81, -47, -110, -19, 48, -4, -67, -76, 2, 72, 32, -51, -18, 71, 81, -31, -100, -8, 85, 21, -91, -70, 62, 45, -47, -76, 0, 89, 45, -40, -33, 53, 88, 22, -66, -16, 74, 81, -48, -113, -19, 94, 12, -117, -80, 55, 72, -21, -73, -2, 85, 42, -57, -72, 8, 64, -6, -100, -72, 30, 63, -57, -109, 9]
5986IR9q9j04N0J26Qj14l8N3Q4l6j33j6J16O6p0j27M3J59Pj45m0J09Q0q3r4KJ29
6014E1Rr2p3N7J08k6j24l9J71R0j22r1M1J30nj38l3J25O7r1q9j6J14O8q3j04O9
6041b6J26k1j45qJ15J05j40j07M6J14j9j14j8N6J23m9j21l0J31R6j25r4O4J78
6065A37n5j77pJ51O0j06r9N2Q0L4j15p8J04J56j6j63q3J67J01j64j24J30J50q0
6089E5j47l6J32P9p8q7K8Q1M6r0j17J00J86m0k19l0J94O8j57j17J25J43p1j46
6113i8J3R2O0J3r6m0J19O7j59j30Q5K20k2k21n0J92M0j62m7J11J13l0j19p0P8
6138d1J10J3j39m5J44R4j89j80J63K09m2k06OJ51L5j52k8J24P5Qr9j37M1J71M2
6163A28k21l4J96R8k47j46J73K30o5j95L0J12nq3j5mJ12N8j38j57J9K40K3j97
$$ y = [9, 108, 19, -85, -35, 91, 99, -15, -53, 0, 84, 48, -85, -101, 15, 81, 11, -116, -73, 86, 93, -52, -92, 17, 97, 14, -80, -78, 51, 60, -32, -105, -48, 60, 34, -90, -129, 42, 132, 10, -81, -40, 90, 85, -53, -86, 39, 106, 15, -74, -90, 24, 92, 9, -95, -26, 100, 79, -66, -74, 41, 146, 6, -101, -55, 59, 40, -74, -92, -36, 87, 38, -83, -113, 18, 114, -11, -105, -41, 137, 82, -95, -102, 49, 109, 3, -96, -44, 36, 70, -45, -123, -19, 137, 121, -42, -125, 42, 143, -21, -145, -15, 135, 55, -92, -128, 4, 83, 5, -82, -54, 27, 73, -17, -134, -34, 152, 112, -107, -137, 57, 125, -32, -149, -24, 119, 48, -98, -85, 7, 67, 80, -16, -56, 63, 130, -29, -159, -74, 146, 124, -97, -147, 45, 85, -77, -124, -13, 100, 70, -49, -119, -41, 69, 82, -57, -102, 42, 136, -53, -233, -70, 139, 97, -109, -103, 48, 83, -69, -97, 27, 102, 110, 11, -126, -85, 86, 128, -93, -127, 69, 167, -80, -226, -53, 177, 112, -83, -53, 59, 54, -29, -44, -48, 64, 122, -16, -173, -154, 86, 109, -88]
6187h8k7K18N1k30j04J77J74p9j28JK9L8k6q7J1J26J29j74k35J15K51k6k06j1
6211a01K41J8k14j07J30J28j0q7o3k1J04Kj30j8J92J63k13k14J17K67q7j88K2
6234f9J87j2j98n7N8J37M4n9j19L5J05L2j74l5K58R5k43j97J39J89n7j59K9J35
6258F4J0j13q1M5J05J13n4k18K8K18k8k17k6K65R8k31j84J39J62o4r6K7Q1M7q3
6283Gp5l6J60J30j27j86N3K08n7k27MK65N8k09j28R8J35j2p7m0Q5N4j8j62m3J83
6309D3J43j66k06J06J97p4k02M8K04N9j85p3P0Q2L9o7q2N3J20l6k00k6K13J09
6333A69j67j76J28J71q2j54L0J71L5j04j22K4J20N0j12r3O0J38k3j84m6K32R4
6356A59j57j37J01J26l9j29MJ19N2r0j14jJ36Q5j07j33J04J54o6j56k6J96P9j53
$$ y = [-88, -115, 103, 154, -76, -180, -3, 171, 92, -36, -35, -6, 32, 6, -81, -70, 56, 185, 11, -224, -109, 142, 116, -90, -101, 140, 158, -56, -163, -33, 95, 85, -2, -65, -86, 18, 20, -110, -128, 64, 227, 14, -200, -83, 184, 97, -91, -69, 118, 106, -92, -149, -91, 46, 90, 31, -88, -53, 52, 84, -90, -125, 133, 228, -15, -212, -73, 116, 59, -100, -71, 64, 74, -39, -120, -75, 30, 143, 89, -129, -101, 117, 89, -128, -154, 111, 209, -22, -206, -67, 95, 31, -65, -38, 43, 90, 7, -68, -104, 56, 186, 59, -127, -74, 134, 77, -150, -146, 119, 177, -32, -160, -62, 73, 61, -16, -56, 29, 83, 65, -97, -140, 43, 186, 20, -186, -80, 117, 43, -159, -111, 93, 152, -33, -106, -36, 46, 85, 18, -64, -11, 109, 73, -127, -153, 60, 169, 2, -174, -46, 125, 43, -111, -81, 90, 125, 21, -101, -77, 43, 93, -19, -112, -52, 86, 63, -121, -167, 65, 159, 2, -135, -34, 92, 53, -76, -72, 47, 99, 9, -105, -106, 30, 115, 8, -125, -21, 133, 67, -89, -115, 81, 160, 7]
6380Gj19Q3J06j3j31l3J02Q7n7j49PJ70M3j07j19R6J45k5j78mJ48O6j14j27O9
6405d7J33J2j52p0J42R4o6j35J5J45O4j26j00P8J19m5j70pJ42P6j20r5O4J10J1
6430G2j35m6J11J21p6j34oJ39N8j15j20R4J32k8j37l0J28Q3p6j41N3J39K8j35
6454b1p6J10P9l3j52J6J34N2j24j04P3J31%j65k9J50Q0r2j18K1J49J8j47o3R1
6479b0J17o8j26OJ30P4j29q5Q0J20Jj46m2J21Q8j08j00M9J04K3j30n8R3R3k7j39
6505g9oJ41N3j09j18Q8J29l8j18m7J18O3o6j24K5J31M4j38o0R0J08m0j20J7J17
6530F1N7j34p5O7J04k0r9m1J11O3o7j19K6J45L0j26q0R6J03o4j03PR4L2r2p6M3
6557e7J19rr6m8R7R6p1j51N7J48J1j27o6R2Q8n7j01lJ26M7q9r6P6R4%j10l7J12
$$ y = [7, -112, -29, 77, 64, -67, -100, 2, 89, 32, -117, -110, 60, 103, -4, -123, -27, 118, 93, -85, -89, 59, 125, 11, -116, -47, 86, 98, -54, -124, 18, 112, 46, -89, -74, 71, 135, 9, -91, -13, 106, 61, -109, -116, 26, 102, -18, -113, -49, 61, 72, -63, -109, 2, 123, 47, -87, -93, 46, 104, -11, -131, -37, 95, 67, -70, -100, 28, 111, 35, -106, -53, 86, 114, -21, -97, 13, 92, 59, -93, -77, 57, 109, -15, -119, -46, 85, 85, -80, -109, 41, 121, 29, -89, -68, 81, 99, -48, -111, -20, 97, 29, -97, -91, 39, 113, -16, -101, -21, 99, 100, -46, -88, 33, 121, 13, -87, -38, 66, 89, -41, -99, -6, 87, 60, -79, -85, 56, 109, 0, -118, -30, 99, 61, -57, -104, 14, 77, 11, -113, -88, 43, 87, -51, -111, -21, 87, 47, -73, -56, 61, 118, -16, -91, -24, 80, 60, -39, -80, 31, 94, 27, -92, -66, 79, 109, -17, -97, -1, 102, 38, -65, -58, 36, 68, -24, -100, -57, 62, 53, -43, -91, 6, 102, 31, -120, -63, 85, 96, -31, -97, -5, 83, 26, -75, -78, 48, 95, 6, -90, -14, 80, 80, -30, -67, 45]
6585D5P6r8j24L0J53%j19n9P2R1m8j00LJ28M5q3q7L2R7K3j02o6J09R0j02j23N2
6612f5J29K7j31m0Q0R5n9r4J3O7R8q0j19K1J33Nj27p3J35R2q9j31M7J39rp3m1
6639e0N2O4k0j10n5J33P0n8j25K6J37Oj31k4J39N7p5j15J7J20L6r9n1M5Q7k8j02
6666e4l8J06J04r7j09M4J26Jj54k0J12P3o3j01OQ2L7p2o5N7R3k1j26m0J52Q3r9
6693A7j06P0R6rj26mR3N4o1q7RP1M3n7o5N0J00k8j38k6J62P3j19j06M8J10l0r1
6721e7k6Q8Q8o9j14j7J21P3o7j17P2J12k4j42j5J44P4j08r4L3J10k0j00j0P7Q2
6747I4l2j16l6J27Q1j20p5N0J24m4j31j3J22P1j17p6L9J07lr5n2R9R4j9j62OJ10
6774C3N6j00q2R3J07m3j35j2J03P0p4r6M5R3L1r8p9R6J21o1j41j1J18P2j19q7
$$ y = [45, 121, 23, -101, -71, 82, 82, -37, -96, -24, 67, 19, -81, -78, 50, 95, 12, -75, -43, 54, 77, -25, -91, 18, 108, 6, -117, -65, 64, 91, -40, -80, 0, 95, 36, -58, -45, 22, 120, 40, -79, -58, 75, 80, -47, -120, 15, 107, 18, -113, -66, 73, 64, -9, -50, 2, 66, 46, -64, -119, 14, 84, 26, -99, -73, 64, 70, -61, -85, 54, 111, 36, -79, -62, 58, 94, -5, -56, -11, 76, 48, -54, -92, 14, 118, 21, -88, -44, 82, 83, -71, -91, 21, 94, 31, -70, -64, 18, 55, -17, -82, -25, 68, 47, -79, -119, 33, 116, 17, -89, -19, 77, 68, -58, -62, 31, 85, 24, -63, -54, 17, 60, 3, -62, -12, 88, 60, -78, -104, 58, 131, 12, -94, -46, 64, 34, -57, -83, 5, 93, 24, -90, -107, 14, 87, 20, -97, -25, 87, 63, -79, -94, 50, 124, 16, -78, -45, 65, 45, -55, -65, 12, 94, 62, -54, -90, 37, 118, -2, -77, -27, 97, 53, -78, -91, 31, 102, -15, -91, -52, 55, 52, -43, -95, 4, 98, 79, -83, -77, 33, 89, -11, -93, 0, 107, 64, -71, -83, 20, 90, 16, -80, -35, 58, 89, -9, -88, 8, 129, 68, -73, -84, 34, 106, -13, -100]
6800a00Q0J04k3j12j4P5P4n6r6oJ22K8j01p9P4J25n1j45jJ59L6j04n1M8R7l2q9
6827c8o8J20R5n8j31jJ35M8j28q8J15J08o5j35K5R8M4p9n6M2P7J0j16n7Q1J04
6853H2m4j34RJ46L3j32p6J08J09l5j32lJ16K9n3r7L8R4L2j08p9R3J19o1j26j5
6879h7J70K8j38p6J03Q4l6r5m9R9Q0n3j20PJ21L4j12p5J03J25q1j31KJ29M6j06
6905b8o0P1J07l1j06k7Q7O6l3j07nJ44Nj23p5J16J26p0j52J8J26N0j06o9L9J19
6931H2j8j12m3R9Q8o7j27RJ22M7j37n4J03J11n9j19JJ13L8p6r1N1J23Rj40p3J14
6958fJ15o9j18K1J18K2j05q0Q5J37p7j14nR4N7n6j00J6J32jj07n3P1J24l9j50
6984h8J0J22M7j35n8Q1Q9J3j17n5J13P5p0j04K8R7O9j24r7J02R9n7j10j4J28Q6
$$ y = [-100, -20, 84, 61, -51, -65, 10, 84, 28, -68, -74, 48, 76, -25, -104, -30, 95, 44, -101, -102, 57, 93, -11, -62, -14, 83, 51, -38, -106, 14, 109, 51, -80, -81, 54, 102, -26, -114, 1, 109, 44, -91, -66, 32, 76, -3, -59, -17, 60, 70, -46, -103, -22, 82, 38, -96, -87, 59, 92, -40, -116, -8, 101, 66, -66, -69, 47, 76, 23, -74, -36, 58, 90, -18, -97, -4, 115, 54, -72, -87, 83, 111, -27, -103, 0, 84, 48, -47, -96, 3, 83, 30, -90, -83, 38, 72, -40, -115, -12, 113, 32, -99, -97, 32, 78, -28, -88, -17, 90, 59, -47, -74, 13, 79, 46, -61, -66, 78, 83, -40, -115, 1, 127, 57, -95, -77, 49, 99, -7, -76, -37, 82, 64, -48, -91, 8, 96, 29, -98, -89, 33, 80, -57, -111, -8, 103, 44, -75, -74, 39, 77, 1, -90, -39, 84, 93, -47, -120, -6, 109, 40, -78, -57, 61, 83, -22, -102, -17, 120, 43, -71, -76, 18, 75, 19, -81, -65, 67, 66, -41, -94, -23, 101, 62, -88, -78, 44, 91, -44, -102, -21, 68, 81, -36, -91, 22, 97, 27, -77, -49, 48, 117, -7, -104, -2, 97, 40, -70, -84, 44, 130]
7010A30j37r0M8J06k5p4o4J03P9l7j35K2J30K2j03q2Q7J12m5j33kJ32K5p0p5L2
7036d4J16qq1o9J04Q2l2j48lJ42M0j18p3O8J18m5j32j5J23P0q4q0K0R8Qj07o0
7063a10J03J05m4j57LJ36O6j32o6P6J04k5j31K0Q0N7n5q9J2Q6L7j03q4O5J56n9
7089E1j35k0J60N6j21p0O7R9k9j20j1N0Q0l3p9k2J02O0j19j02R8J36l7j39nJ39
7115E6K6j07n4P1Q0j4p0m9K2J05j3q9l7J02P2j23j07J04J73o9j65K2J07qp9k1
7141f5P2K6K6o4q9J9J22K8j20o0J63O6j66j03J33J14n6j34M1O4Kl2j6QN2P9o5
7168D5j50K4J58J6j45j9J61K6j84p8J37Q4p2l4J2J3J5kl3k8N7J14q2j63J0K10
7194I2k5j74K5J75pj80k3R1P8k4k8J8k8J0M6p0p1J21J51j28j93O8J68n6j32N7
$$ y = [130, -7, -97, -49, 57, 32, -42, -106, -3, 76, 39, -96, -74, 56, 78, -25, -107, -20, 92, 47, -86, -88, 44, 69, -1, -76, -44, 72, 64, -17, -86, 18, 100, 68, -80, -83, 59, 99, -19, -92, -24, 94, 49, -83, -98, 25, 95, 11, -69, -49, 49, 57, -50, -110, -7, 98, 54, -103, -100, 36, 102, -30, -96, -20, 84, 59, -72, -52, 28, 85, 30, -59, -47, 39, 76, -27, -111, -46, 110, 51, -84, -104, 56, 112, -9, -79, -12, 87, 58, -62, -73, -23, 57, 24, -55, -77, 25, 85, -34, -136, -38, 98, 61, -78, -83, 56, 82, -25, -79, -8, 72, 58, -12, -61, -39, 66, 53, -36, -73, 29, 101, -22, -129, -25, 148, 79, -86, -64, 43, 35, -44, -65, 7, 33, 59, -5, -94, -75, 47, 75, -45, -105, 58, 124, -42, -145, -12, 102, 46, -88, -47, 17, 19, -13, -29, -21, 31, 110, 45, -105, -81, 77, 93, -52, -71, 90, 116, -68, -146, -9, 75, 3, -31, -19, -6, 9, 7, -26, -54, 3, 117, 35, -128, -118, 92, 67, -107, -82, 93, 86, -94, -117, -26, 52, 28, 0, 18, -10, 0, 46, -24, -95, 26, 177, 49, -144, -76, 92, 36, -96, -39]
7220c9J53l1j41m6J05j3L0L0o1n3O3L7r7p3J49J47j40j82J12J31o2j04R4R6n8
7245D7q7PrJ2O1L6q9l8J02L8j67n1K00J17j63j34R1R8q3m8P5M8m1l1l4l3J4J18
7273E6J5j38mJ26k1j43j5J96Q9j84n9Q5K8p2NO5J1k8L5o2o8L5J38jj46K3J48o2
7301E2j89N2J80Oj27k2L2Kl2K8J2lJ8M4q0j12J03J54q9j23O5J25q6j29M4J44Q
7328G7r7qK4j9K0N7m4j7N3L3r7r6J13J05p8j08P7Q1j03q3P0R2J2m8j5l0RK1K5
7357B6p2OJ14K4j82l7J29P8q6q0R5K3l8o5M1N8j6RNp6J9N4j5o3K3J05rj34k3J39
7387E2L6j15j8L9L5l8m0J1K2L9J7n6m0L6O7m6q0N6J06m6j01j4J17K1p0j0K3M4
7415D7n0k7J0RM1K5o0l3O6L8o2n2M4Q2n3p8J1O7K8p4nJ9J7j0k5l9M8O0k6m8k9
$$ y = [-39, 114, 83, -58, -104, 1, -12, 18, 48, -13, -66, -3, 34, -63, -136, 13, 160, 20, -162, -50, 81, 19, -85, 9, 105, 47, -40, -33, -42, -30, 31, 67, -22, -60, 42, 80, -87, -138, 62, 179, 16, -118, -27, 71, -12, -60, 15, 63, 22, -9, -43, -76, -62, 56, 71, -67, -71, 55, 34, -109, -124, 72, 161, -23, -82, 3, 31, -41, -36, 29, 40, 12, 47, -15, -83, -48, 90, 89, -57, -34, 114, 52, -137, -85, 95, 101, -26, -48, -16, -14, -46, -18, -6, -9, 9, 53, -27, -139, -36, 118, 29, -94, -29, 96, 10, -119, -75, 69, 77, -20, -28, -4, -23, -3, 54, 10, -7, 46, 79, -18, -114, -1, 104, 26, -82, -5, 76, -27, -110, -40, 52, 64, 16, 1, -29, -20, 1, 26, -46, -40, 74, 98, -84, -121, 8, 86, 0, -80, 15, 38, 0, -65, -24, 34, 18, 27, 32, -44, -25, 29, 14, -49, -26, 79, 70, -64, -87, 52, 88, -27, -45, -6, 29, -9, -49, -38, -16, 23, 40, -16, -56, -20, 47, 1, -79, -23, 83, 37, -64, -78, 39, 60, -10, -20, 3, 47, -3, -30, -20, -11, 30, 55, -5, -38, 28, 66, 4, -48, -4, 78, 25, -53, -42, 25, 53, -21, -26, -7, 10, 0, -25, -64, -16, 44, 18, -30, -59]
7446e9O1N2p5l9N0Q1l1j11K1N1L2j8m0K4K0J9k4m8L5M3mq0nP5J7p2m1M0Q4k0q8
7477e0LN5L2m4k0jN3ln5l9N0N6k8o5J6O0K2o1k9M5M8j9l1k5M3K4j0o0K3J2M7n6
7509gn5O2M3k1p0K7M7J1l7m4K4N0j8n2MK5K7j5o8K2M3K3n1rL6M7rq0J7Q1ko6l8
7542e3K6M1Rn4pN1L7l6o0pP6L9q2l4N9K5m5l0J9M0J2n8nlL3L2k2n7N1Q1m9q6N
7575e2R2Rm9l2L6N2o3m5L9L0nJ0l9k1O8J4m6k6L3O0l8j06K4Q5mp1K6L7jk6j1j6
7607c6K6L2km9k5M9L9o6n3R6P8j17n3N1O1pl2KJ8Lj8J7m5K0Q9qj24jR0J3j06q
7639f6J10M8j04n8L7Q1p4L6J1l3lL9n5p8O9R8rj14k0J20Jj23J3J43Pq6j5J8j0
7668a7kM5ll5jO8o8r6R7J16m5j46N3J11r2o7M6Q3J8q5qom7M7O9m0n0P7N1j31r0
$$ y = [-59, 2, 54, -21, -60, -10, 71, 40, -71, -50, 1, 33, 15, -25, -1, 19, 38, 14, -34, 1, 44, 40, -40, -45, 30, 47, -25, -66, -26, 58, 38, -50, -47, 8, 40, -4, -24, -25, 28, 25, -30, -69, -19, 37, 9, -56, -40, 20, 42, -19, -48, -3, 45, 26, -5, -30, 13, 37, 27, -33, -10, 2, 49, -7, -62, 0, 43, 22, -48, -21, 26, 37, 0, -44, -20, 30, 12, -40, -36, -11, 16, 1, -67, -45, -2, 21, -30, -39, -3, 44, 35, -45, -28, 53, 51, -15, -53, -27, 14, 23, -31, -38, 13, 50, 14, -46, -53, 23, 62, -20, -54, 5, 30, -15, -45, -26, 14, 26, -32, -37, -40, -7, 25, 3, -54, -3, 78, 29, -57, -52, 40, 49, 0, -32, 4, 56, -7, -52, -13, 17, 12, 22, -17, -38, 30, 44, -2, -28, 5, 65, 27, -79, -55, 30, 26, -45, -19, 18, 17, -9, -20, -36, -10, 22, 20, -29, -54, -5, 34, -32, -85, 11, 89, -28, -81, -30, 31, 24, -8, -6, 12, 15, -3, 14, -31, -11, 78, 70, -54, -55, 35, 48, -58, -66, 44, 92, -12, -70, -33, 48, -26, 10, 21, -12, -15, 24, -31, -109, -40, 58, 49, -65, -85, 35, 36, -87, -74, 69, 76, -10, -25, -7, -17, -19, 26, 23, -12, -13, 55, -13, -109, -12, 104, 59, -87, -34, 77, -15, -82, -36, 47, 65, -20, -28, -34, -81, -34, 35, -5, -55, 22, 73, -58, -148]
7699a48J37J34p6j38R6P2j07o9J14M3m2J7j5p4l3J12N4q3k2J04M0j85q0J87Q3
7724A21j17o0P2K6j17j0O9L2l5O3rj16k8J37L2j44N2J47l0k01k2J60O1r4j1Q5
7750F3m0p9L1N0m9N6R0p4j62M1J43Jj58O8J63q4k14M6J53k1o5N6L6q6k6N5Mo3
7778f5R7J03j11j70N8J73r5j28J34J37j11j35O1P3rj2P1j1j12M0N8j08m8J75Q0
7803A45j73j08J15R7j19n7J45Q5j37p9O2K2l8P0M5j04l4N2K1j15j2J92N9j84q0
7828a30J35O2j16j4J28L2r4m3J1j7J1R3K5j20m3J54n4j39M0K03qj54l4J02Kj07
7854g5K5J17l2o3M0n1n0O1J04n9q9M7J00n4j41N9J74oj64J6O5k7n4M2M7oj6Om8
7883c2o9J02J16r5j07R2R3j02j21J04J04m3p4j1N6k4l4L0jPO5j3j02l0J20N8r1
$$ y = [-148, -11, 123, 47, -91, 5, 77, -30, -99, 15, 58, 16, 33, 18, -56, -89, 23, 77, -6, -28, 76, 116, -69, -149, 38, 121, 4, -56, 16, 42, -75, -85, -16, 16, -19, 44, 35, -81, -109, 28, 60, -84, -32, 115, 85, -116, -138, 22, 83, -11, -22, 63, 23, -56, -25, 25, -24, 32, 122, 48, -114, -73, 70, 71, -87, -19, 144, 60, -154, -108, 45, 24, -41, 15, 51, -35, -61, -6, -2, -65, 32, 135, 24, -146, -88, 85, -10, -138, -4, 133, 22, -113, -52, 21, 12, 0, 71, 60, -52, -12, 46, -62, -110, 65, 145, -28, -136, -21, 76, -43, -100, 45, 130, -7, -86, -24, -2, -40, 30, 75, -29, -63, -11, 10, -105, -117, 75, 134, -50, -130, 5, 67, -49, -63, 65, 97, 3, -40, -29, -46, -35, 58, 83, -37, -80, 74, 20, -119, -79, 124, 116, -38, -72, 30, 32, -75, -50, 67, 35, -28, 12, -39, -89, -28, 76, 17, -72, -25, 75, 21, -120, -61, 113, 107, -57, -41, 24, -3, -57, -15, 32, 26, 10, 16, -32, -101, 1, 117, 22, -85, 7, 100, -2, -123, -19, 85, 42, -32, -43, 13, -11, -45, -15, -16, -9, 56, 43, -59, -89, 31, 89, -2]
7910bp7O9J02j08r9R6R3n2l4QoJ0L3j4k6J3P2j3j27k1J17N4j21k7P0M4r8k1L6
7939b9O0rm2kj3L9K9k5n6L6Q3o1r6K9R8J9r4k9P2O6q6k0L2M1Jom6k8N3J5k6p8
7971g3N9P0m0q3RJ21Kj05j6O5K8l2m7oM2J8rm9k9O4N5m8p9O8Q0m0p8%R1Oo5l1
8003e2P4K3l3j7k4J9N7m0l9qP2K8o2m7M3Q5n3r5M1O0Np0j3KO1Nm3k9K4M7L0r1
8035d0k4J15K3j08l8N7N3l0n3JP1Qn0j0L1QK9j6n9K5O2l7o7LQ3L0r2o4R0M2n5
8066a2k6K6RPJ3n0j8O2L0m6n2K2Q7l6j08J7J26lq1qK9M5mj7LnK6j0n4l1O8N2n2
8099Ir8Q2M8m9n1J9J00j0o9LK0k0Qlj6lP5k4j04KR6N8p1o7Q0P2j05m2P6L5l2J4
8131C3j9k9LL3mm9J7R1j0j41k0J59%r3j5Q9kq8j4M5K7j0K5pq0j0R6k5j01Q8J20
$$ y = [-2, -79, -10, 92, -16, -115, -19, 74, 22, -12, -4, -10, 0, 33, 19, -7, 6, 78, 65, -62, -83, 34, 88, -33, -60, 10, 54, -44, -65, -29, 31, 22, -20, -22, -35, 4, 33, 8, -48, -12, 71, 10, -86, -57, 41, 60, -34, -63, 9, 75, -11, -31, 1, 42, 43, 37, -9, -37, 16, 31, 5, -73, -14, 56, 16, -67, -58, 63, 65, -40, -56, 9, 37, 5, -42, -48, -6, 12, 3, -46, -75, -11, 44, -4, -83, -15, 65, 25, -53, -53, 38, 44, -21, -52, 22, 45, 12, -5, -29, -10, 47, 7, -32, -40, 32, 60, -2, -49, -6, 79, 26, -69, -28, 32, 37, -33, -46, -44, 17, 22, -21, -50, -26, 21, 51, -40, -64, 51, 74, -34, -72, -15, 38, 8, -45, -44, 27, 35, -15, -25, 6, 14, 43, 27, -32, -7, 55, 18, -49, -46, 37, 67, -25, -89, 1, 43, -12, -38, -12, -3, 4, 17, -33, -51, 11, 41, -5, -57, -35, 52, 16, -92, -75, 51, 48, -33, -41, -12, 33, 29, 12, 15, 10, 36, 26, -28, -59, 9, 61, 9, -89, -7, 41, -8, -59, -40, 60, 50, -19, -16, 4, -16, -8, -11, -27, -30, 45, 21, -83, -81, 15, 73, 2, -65, 15, 87, -18, -60, 16, 51, 19, 33, 14, -15, -12, 21, 17, -32, -15, 76, 66, -75, -95, 64, 64, -29, -44, 45, 43, -45, -59, -14, 13, 3, 28, 21, -59, -69, 27, 2, -99, -11, 109]
8162A09o1j48K4J20mr4L2R9o9o1L9L0o5O8Q4p7j09Q1O0p0p7R4J40j35j10M8J00
8189D8o4n1
$$ y = [109, 48, -100, -76, 44, 40, -54, -22, 77, 8, -53, -14, 16, -49, 19, 103, 26, -83, -2, 58, -12, -89, 5, 145, 10, -100, -52, 48, -16, -67]
8191f7
$$ Imaginary data points
##PAGE= N=2
##DATA TABLE= (X++(I..I)), XYDATA
0@%%%%%%%%%%%nJ1j4J6j6K4l2L2m0N0n8P0q3R8j11J27j49J73j95K20k54K88l25
34a73L68m14M64n20N82o46P17p99Q85r79J085j199J320j454J603j766J945k143
52a124K365k611K886l198L554l963M442n012N699o548P632r062J1039j3966J8739
67A0872k7802N0798k14423m16409N73943M67509k77990l10051K67744K44150j93865
78A74476k72237k8666M5941J03813J38139j35758l79712K0673M26444L1963m23228
89b98152L8427N91337J59151n30956k73803L91764K96134k57333k49713J27474
99e670J27056j21849j64298r0420J1636K14045K31499j32122l10241J01270M06864
110B67770j7421m11077K4892M96503O5809n14025k48619K83921J87738j80218
$$ y = [0, 0, 0, 0, 0, 0, 0, 0, 0, 0, 0, 0, -5, 6, -8, 8, -8, 16, -16, 16, -24, 26, -32, 38, -45, 53, -58, 69, -80, 93, -102, 118, -136, 152, -173, 195, -219, 245, -275, 307, -339, 378, -421, 464, -515, 570, -629, 691, -763, 840, -926, 1019, -1124, 1241, -1370, 1516, -1682, 1872, -2091, 2351, -2661, 3038, -3510, 4122, -4940, 6099, -7867, 10872, -16930, 33868, -180555, -596964, -23021, 444488, 166498, -143553, 124191, 368341, 174476, -97761, -126427, -80486, 23327, 161466, 25708, -354004, -333331, 93113, 125076, -298152, -259725, 331612, 490763, -40193, -313996, 77768, 373902, 116569, -133144, -5670, 121386, -463, -164761, -255181, -243545, -29500, 201999, 69877, -240364, -139094, 267770, 250349, -160728, -135836, 360667, 426476, -87549, -336168, -52247, 135491, -44727]
120d4727j53581Q3946J17471J9167n6180j17712j4102K75593K56966k00685l34218
131a68062J33466L22410j44580l86614N0611L67840K1925l54932j62235J97330
141a22841J79840l3586q2987J0708J16768J25787o0426k21051k9563K65018J39639
152B87306k49622k60522J22146K25422j23355k72518O3126K99959P0451k02484
162d0091j23818J20068J84298K3198j29748p1512J07104J21005j06953k53885
172a70334l4071K48341J10655k26440j75135J61580K02021p7833j79587M7935
182i2868K26935Q8996j46733j55424L6247J51387L0127j69207j31501J20036J60117
193A18112j11786k26366L3231K43844Q3347j58756r9934J31345J51037n1494j49971
$$ y = [-44727, -198308, -114362, 3109, 22276, -33904, -151616, -165718, 109875, 366841, 166156, -168062, -34596, 287814, 143234, -243380, -192769, 175071, 196996, -157936, -320171, -122841, 56999, 23413, -59574, -48866, 67902, 193689, 133263, -87788, -117351, 147667, 287306, 37684, -222838, -100692, 124730, 1375, -271143, -208017, 91942, 162393, -40091, -163909, -43841, 140457, 163655, 33907, -37605, 69499, 190504, 83551, -170334, -204405, 43936, 154591, -71849, -246984, -85404, 116617, 38784, -140803, -92868, 134067, 223063, 76330, -79094, -42847, 108540, 138667, -30540, -162041, -42005, 118112, 6326, -220040, -186809, 57035, 140382, -18374, -118308, 13037, 164074, 112580, -37391]
204c7391k0827J30829Q8904j11664j90895Q72J75657M0201j72665q9725J57297
215b9407J59707q4079j67011M5862J94878M9022j35642r4448O5376J04087l0217
226G8128j51527o6816J17111J12319q6540j62654K6198J92969N9041j55919p7124
237a14814J56849J36189r3404j52792J8689J31778K7769j23110j02203M6402J05009
248C6362j773j18572n9786J19174J38309o1290j48222L7972J76115K8675j52793
259e829p7362J10772R6029q7654j36664P508J05190L3654q0471p9644M4727J24318
271E4574K4532j08634n0516J13290J10286o9272j40356J6819J37163J0139j46489
282d8464p2685R2983Q7744n4234j05986O746J14672N8483p0062p3875M8158J11560
$$ y = [-37391, -58218, 72611, 161515, 49851, -141044, -140172, 35485, 75686, -96979, -186704, -29407, 130300, 46221, -120790, -74928, 119950, 168972, 33330, -61118, 4258, 108345, 78128, -73399, -140215, -23104, 89215, 2675, -159979, -133781, 59188, 118229, -37690, -114814, 42035, 178224, 84820, -67972, -49283, 82495, 110264, -12846, -115049, -68647, 36362, 34589, -83983, -143769, -24595, 113714, 52424, -95798, -57826, 118289, 146964, -5829, -83191, 27581, 123610, 35956, -100708, -93200, 11990, 45644, -34827, -114471, -69744, 54574, 79106, -29528, -80044, 33246, 143532, 74260, -66096, -49277, 87886, 98025, -48464, -121149, -28166, 59578, 5344, -100642, -93896, 20776, 79259, 9197, -64678, -16520, 95040]
294I5040J2305j13245o4654Q9625Q7133p7811j29869J4752J19347K2437j12366
305e7306o1809R3962J02584l6323r1850Q151R9577M9027p1573q5311L0455R0669
317G0253n687j07830n5566P4400Q0771n2016j04767K2371J21191L1213r0023m9465
329f5155P7601Q8719l4174r9188q877Q3040L1602p5992p9016K5087Q5408O360
341C5415r1018m0389Q4736Q3249l9809q7247J7623J07498K9254r5200o2349O3558
353E321P1586m1759r5704j4232P7750M1453o3932o7633L8633R1215J3784p5452
365a8970l6647P6140P6259m7639r2421J1043Q5049J2679q7269o0300N0325P1164
377C9413k5959p8951m318Q0072N0438m7677o4975L3337R0637N069q5797l7459
$$ y = [95040, 107345, -5900, -70554, 19071, 106204, 28393, -101476, -86724, 32623, 55060, -57306, -119115, -25153, 77431, 41108, -50742, -42591, 56986, 106013, 34440, -50871, -20416, 70253, 64566, -43264, -98830, -24430, 56341, 4325, -100442, -78071, 43120, 74333, -15690, -65155, 12446, 101165, 66991, -32197, -41074, 41966, 73568, -2424, -81440, -56353, 29055, 35415, -55603, -95992, -11256, 71993, 32184, -55063, -37440, 70058, 99312, 4112, -58237, 5321, 76907, 35148, -60556, -74788, 2962, 44415, -19517, -87150, -48517, 42698, 56482, -18970, -55617, 20523, 96782, 49143, -43278, -32235, 52814, 65493, -21776, -82076, -31751, 39413, 13454, -65497, -69815, 10257, 60695, 13018, -51957, -18620, 72017, 77086, -8711, -46170]
389d6170O2080N1605n0310q3438O405P7777J9677o8145m7551M7171P6965k649
401D3417p2576j4745Q2632N1457o3803p6451K8568P8842n647q7725l4822O1468
413i385M5268m2698n8770J4117P1962L6362m8157n5290L4686P8499k646q2091
425a8143k7470P4682M5939p6478q2490L8963P9163j1915o6263j0119N3385L8059
437C7313k2404m3335M538N9613M0827m3994p5378J2267Q0656l220r6817k2638
449g2572Q9139L8797p8883o1213N1397P3870o596m5571k585L4009K3997j1774
461C2015m6664k3826N4095N5248n4070r3251J8855R1130m362r1325l444J03280
473C7681L4262q1405m5818N2332N0181q401k7461j5675L918K1533l160n5747l4193
$$ y = [-46170, 15910, 67515, 17205, -66233, -59828, 17949, 37626, -30519, -78070, -30899, 46066, 43417, -29159, -43904, 38728, 90185, 26382, -50069, -21501, 57341, 51694, -36031, -70853, -9385, 35883, -6815, -65585, -51468, 20494, 56856, 8699, -46591, -11905, 66594, 63948, -18143, -45613, 29069, 75008, -1470, -83960, -44997, 34166, 22251, -44012, -54131, -746, 37313, 14909, -28426, -23888, 35725, 76552, 32558, -42820, -30553, 50103, 46883, -49934, -72572, 16567, 55364, -23519, -84732, -33335, 40535, 33939, -11632, -14217, 19792, 43789, 32015, -14649, -38475, 15620, 70868, 16798, -76453, -57598, 33532, 29170, -62155, -65599, 37681, 71943, -9462, -55280, -2948, 47233, 38832, 11371, -4304, -386, 21147, 17987, -37760, -71953]
486g1953O4481P3850n1772r6127L3716J00854j5422q4747J9403R2811Q427p5898
498b377l7298K7762K6077K096r861k7129j1826L8801J5600o7513l3874R2995Q0129
511I3582o5663q7475M3517Q0622l3822p5585K5764P1738q767o0559k7892L744
523d0796K0736L5403K575m2472k713O1260J0177q2264k7359J02693O7458q2034
535B2664q0634M6476N3040m6960n0559L2746M9554k265k9573k5498j3285K7237
547a7057N7553K608n8336J586P1363r865j01522j4894J02054M0870p8896n2841
559e7377M1718L0507l4828k0346L1004L0755J2835j603m0062l9740L9540O6676
571E9079k4003o8861J9543O7087l2419r7409M932R7618K6913o0547k3800L1721
$$ y = [-71953, -7472, 66378, 14606, -81521, -47805, 53049, 37627, -47120, -27717, 65094, 73521, -2377, -39675, -11913, 14164, 16260, 6399, -20730, -32556, 6245, 21845, -45668, -79542, 13453, 93582, 27919, -59556, -16039, 64583, 30761, -44824, -19060, 52678, 43911, -16648, -44540, -40796, -20060, 15343, 17918, -24554, -27267, 33993, 44170, -38094, -65453, 37240, 104698, 22664, -57970, -11494, 41546, -5414, -55973, -23227, 26327, 24062, -5511, -31009, -44294, -17057, 40496, 43104, -15232, -13646, 57717, 47852, -53670, -68564, 33490, 74360, -4536, -57377, -15659, 14848, -19980, -40326, -9322, 21433, 34268, 32665, -7397, -47137, -7597, 59079, 35076, -33785, -14242, 52845, 20426, -76983, -72051, 25567, 52480, -8067, -31867, -146]
583a46J1527j4278l623N675J5932L1664J23o4622m7857N0581O3021m0227o2623
596e4853M1932O4665m4297p7189K4242P8416J5594l6009j3871Q128o79j387l755
609I37j9478O093N0183L854q0448l9220O9901N2578m8622l9213N5003M8501m7459
622A2610n7452K3847M9199N367j5446j4573j9548R85K1576j3413l8290K1792O8627
635D5281l353q1385k0020P6018L5257n4645k3584N2902K4722m6111l9256R743
647b4431K4451J4142k9k2558k3988J7638L4199k0372m3305L3618P3420j5216p9016
660c1447o206O3545J2751m9837j5008L7985J4019l1559k5082J134J3982K6961
672A1238J4870k9238k5745L4413L5613l5933m3673L7828O0045k5856p0214m3N0720
$$ y = [-146, 11381, -2897, -6520, -845, 15087, 46751, 46874, -17748, -65605, -15024, 47997, 7770, -54853, -12921, 51744, 7447, -69742, -45500, 32916, 48510, 12501, -1370, 6758, 6079, 4692, 937, -18541, -12448, 37735, 41589, -38859, -78079, -8178, 44400, -4222, -43435, 11568, 60069, 12610, -44842, -20995, 28204, 33571, 18125, 3552, -15996, -15011, 6565, -6848, -45138, -23346, 45281, 41928, -39457, -59477, 16541, 51798, -2847, -26431, 26471, 51193, 5082, -34174, -24431, 20, 14162, 14133, -8425, -32413, -14775, 19424, -948, -44253, -10635, 62785, 47569, -31447, -37653, 25892, 38643, -11194, -26202, 11783, 25802, -5757, -30839, -29705, -15723, 11238, 26108, -3130, -28875, 5538, 41151, 5218, -38455, -627, 59418, 33562, -36652, -36695, 14025]
685A4025K161l8276m737K6732J2923p297j6256j2912J5141L8522P889m0884k1456
698b4425L9645K5917m7425m1263L9705M7527k8037n1184O354M0004Q009k2835
710h008p985J8313J9725J789k0138k2678J2509L7781k400m7701j4132M0598J7194
723B4867m1862k9631L5237M2182j6558l7842N685L3082J0203j6690j5963M925
735b365K1757N568k9196k7200J6451L4348o912m1146n435M2684J7899l4644k1584
748b9775L0358L3917j0201l2656n757K5966J4570k1093k7096L648K6324O877k9108
761a4026k2660K3844L5240q294l2936P87L6058J6565k7667k6525J7585L0647q652
774A9966l5574j1063K4049J8494j7887k7936P444L2883Q677k4336j5251K0949
$$ y = [14025, 16186, -22090, -26827, -95, 12828, 5531, -10725, -23637, -8496, 30026, 37915, -2969, -24425, 15220, 41137, -6288, -47551, -7846, 39681, 11644, -39540, -33186, 6818, 14827, -8008, -15993, 2320, 22045, 23834, 3696, -18982, -6473, 31308, 28908, -18793, -32925, 7673, 24867, -16995, -46626, -11389, 30793, 14235, -23607, -17922, 15160, 25363, 8673, -7290, -2365, 19392, 24960, -4236, -31436, -14985, 19363, 12451, -28695, -34130, 8554, 26453, -8191, -29775, 583, 34500, 24299, -8357, -14114, 11852, 26422, 5329, -21767, -18119, 8205, 15082, -14026, -36686, -12842, 22398, 14104, -18832, -18045, 18013, 34578, 6911, -19614, -2029, 28618, 19966, -15608, -26671, -2622, 15872, -2015, -29951, -22507, 10376, 19053, -5283, -20534, 415]
786D15K9484n902l2212o214K8672J3628k6594k8615J0019K9929j142l3094j0633
799c2259L0210K3367j5561k4003Q321L1171Q417k6203j8606J6757K2584r239l1286
812a6330j0296K5200J8752k2264k8180J4009L5064K701k9029r671K9396K3966
824C3318j7940k8065N273K4889L440k5124k0928J1538K4547m031k8442o989K7962
837e52K2335j5456k5443J1168L4190K573l1089j3102K1832J7906j6464k8994o62
850b1758K4955Q069k2016j7005J4834K6999J757k4049p804K6864K1059j7729k7231
863a3055N023K6704K337l1289j8771K0972K2224j3852k5957L406K8288J3146j8105
876A071j6599J5272K5634j847k5094j1633J7876J8097j6012l0655J448K8054O055
$$ y = [415, 29899, 23997, -8215, -14429, 14243, 27871, 1277, -27338, -17319, 12610, 11468, -21626, -32259, -2049, 21318, 5757, -18246, -9925, 21246, 29663, 3460, -15146, 1611, 24195, 14956, -16330, -26626, -1426, 17326, -4938, -33118, -19109, 15955, 18656, -10373, -20044, 9352, 33318, 15378, -12687, -7414, 17475, 20915, -4209, -25137, -13599, 10948, 6917, -21525, -28514, -552, 21783, 6327, -19116, -7948, 26242, 28815, -2274, -15376, 6456, 24362, 7898, -21096, -21758, 3197, 11266, -10750, -27755, -12921, 14078, 15835, -8214, -16018, 10846, 31905, 14176, -13055, -8032, 18672, 21009, -10280, -29051, -8079, 14145, 293, -25664, -22258, 6030, 19176, 1071, -15528, -256, 25378, 23531, -1563, -13196, 4680, 22777, 6765, -23890, -22442, 5612, 11667]
889A1667k6132j5311K2405K7612p943k5257L307K7148Q983j9020j7270P188J8577
902A5954j766k5194j4477J5907K0097q376k5479P22L1822J3191k5366j5607K4341
915E769K5080j2139k6839j260K0167N026j9537j6329N984J6892M026j8324j5801
928b7285J7884L0038m783k7974J762L1906Q532k9977j8717K1355K0588j6045k5354
941a8070p65J4473O803p700j2383L627K2602J1788j8466j9067J6369L0380o228
954B3363l3102k206K8341J361l1914j3768J9925J7239p677j5744j702J2414J2320
967H850j53j1776j629K2416J4028k6231k8533J6693K8985j2895l1824L026K6311
980G268p49k5851n539K1779J6487m74q002q571L385J6724Q10k3191o124K6613
$$ y = [11667, -14465, -29776, -7371, 20241, 12298, -12959, -9652, 17496, 26479, 7459, -9811, -2623, 15954, 14188, -11006, -25483, -9576, 10521, 2145, -23334, -22612, 9210, 22401, -2965, -18572, 5769, 30849, 18710, -8129, -9389, 10778, 15804, -3733, -20062, -14078, 2814, 6840, -11484, -27285, -9401, 20637, 15854, -12120, -10358, 21548, 30080, 103, -18614, 2741, 23329, 7284, -18070, -18835, -4362, 2441, -5259, -17642, -14015, 8587, 20375, 1909, -17158, -789, 29591, 23363, -9739, -11945, 16396, 17757, -14157, -27925, -8000, 9239, 1562, -14182, -15884, -3470, 8850, 8697, -3079, -4708, 17708, 31736, 5505, -23028, -6335, 22650, 9755, -22069, -19043, 7268, 6519, -19332, -24871, -3092, 13395, 12921, 4919, -3652, -267, 16457, 17267, -5924, -12048, 14565]
994A4565J0448l4101k8254K1822K9710j2814k2975J2802K2906m470j5782j384
1006g527J0437J3229P253j0947k1222j804J8770p62k8147l823L4560J0808l5498
1019a4673j9244K7659K4040j0599j1509J2022J2009p263j2409o223j247J0996
1031C559J4879j2718l0139K612K7999l758k8590Q297M0919O208l5504j3247K5541
1044F058J3568j3069m872P069k026n996m363j3871q471K1719K4464j5593k9421
1057b4804J1903L1569r228k8651J5563L7758n245l3977q099J3031J691n360J471
1070b378m51m199M563K514j7656q737L1461K8708k1472k7927J7670K3266j9901
1083E461k5264J6895K7010j0174k6602m838O065nO058Q601n817j925J7169K057
$$ y = [14565, 25013, -9088, -37342, -15520, 14190, 1376, -21599, -8797, 14109, 9639, -6143, -7527, 2910, 16139, 23392, 12445, -8777, -10581, 8189, 7427, -20720, -24543, 10017, 20825, -14673, -33917, -6258, 17782, 7183, -4326, 7696, 19705, 12442, 33, -6190, -7437, 3559, 18438, 5720, -24419, -21807, 6192, 2434, -26156, -17859, 23060, 29268, -6236, -19483, 6058, 19626, 6557, 1685, 8754, 6728, 732, -3631, -17502, -25973, -4254, 20210, 4617, -24804, -12901, 18668, 9440, -19211, -3648, 34110, 28865, -5112, -13211, -180, 1511, -3849, -2378, -2829, -7028, -2465, 49, -17607, -26344, 5117, 33825, 12353, -15574, 2096, 25362, 5461, -19803, -2908, 24102, 13928, -12674, -17512, -11447, -11452, -5394, 3207, -2610, -4535, 12634, 14691]
1097A4691k7352o508L5993K0389k9545k5054J8884J4162k5897j8324K1156J9387
1109A1982q461j0923j549k222M752J6296M451j3343J462K0501n567l5427n003
1122b3051L5443J0554l0652j3686J9494O375j8762o108J7969J4037m08k592n977
1135B636r458O500J7527n450k0186O535K0094j4009l3271K851L2616O892k2362
1148i085m389J8776L782j3056j102J0157O309M541j287j6588j3280J1411J4099
1161A0288j3039j7610J4198K1367j4963k6624J0661K9026K058j4812K01R655l11
1174A0095p392m645j437L532Q767j861k0113r949J8389J3200j5365r751K0221
1187C691J6606j4315j7957Q463J8317p3j1805l836K067l45k497o749o830P889
$$ y = [14691, -12661, -19169, 16824, 37213, 7668, -17386, 1498, 15660, -10237, -28561, -7405, 11982, 3521, -7402, -8951, -11173, -6421, 9875, 14326, 983, 2445, 22946, 17379, -18048, -23051, 12392, 22946, -7706, -21392, -1898, 4477, -14285, -20393, -2424, 11613, 11205, 8613, 2636, -6822, -322, 17205, 11755, -8431, -1896, 18198, 4189, -29082, -26231, 6385, 13277, -9085, -13474, 5302, 9084, -3972, -5074, 5083, 11392, 15933, 14646, -1942, -15222, -3811, 10288, -2751, -20361, -6163, 15204, 241, -26383, -15722, 13304, 15362, 550, 751, 10406, 10095, 2703, -1942, -3379, 153, 8920, 7059, -13054, -23003, -4614, 8586, -6779, -16530, 3691, 20297, 5982, -11975, -3512, 14805, 14732, 2927, -909, 1158, 813, -1684, -8433, -15263, -7374]
1201g374J5626l228j8499p49K0756Q406j5145o748J7456J0832j5460j5842M410
1214e559J0037j50p496o634Q03P370K596q385n623J2408J7130m789j8195J852
1228d635J8399R84j7218n503J1471N618j0554j2188J012R712N107l807o304K257
1242e649J2310N120j1527p013J3184J2093j0067j6400J333J2373m92j4115n274
1255a4124J0033P731m541q093L18J0924R316m974r932L518J2295J15j4542p742
1269i698J0287R119j0321j4219L666J2630J321r138l695R204J0981j707r908j249
1283b727J0043O368q214j2474J679J1522j131j4624n168J1041Q691n893r450L754
1297f583J3333L991q814n421O765Q851k748j2352m643R206N455r830j0742M076
$$ y = [-7374, 8252, 5024, -13475, -14224, 6532, 14938, -207, -6955, 10501, 21333, 5873, -9969, -5559, 4478, 4328, -3168, -9802, -8999, -1629, 967, -7418, -13041, -633, 16497, 11708, -6487, -4635, 13764, 14748, -2470, -7973, 3498, 9116, -1438, -13626, -12614, -2902, 2205, -1602, -7906, -5649, 6661, 11781, 254, -6759, 6425, 18518, 8451, -7949, -6616, 5757, 5265, -8850, -14124, -4091, 3640, -901, -8994, -8676, 2248, 11564, 6590, -3342, 176, 12471, 12586, -1956, -9698, 589, 9708, -613, -14832, -11166, 1464, 2785, -6353, -10048, -844, 10137, 8430, -1478, -2727, 7316, 13684, 5470, -7004, -5325, 6197, 5066, -9558, -14726, -3685, 5006, -887, -10337, -6583, 6750, 10741, 1927, -3494, 3271, 12122, 9374, -2978, -7621, 1585, 7040, -2790, -13532, -9456]
1311i456J1536J417j0090l714J1444J0312m985r610J917J0702L045j0914r475
1324g871N451Q881m565j2011k205R911P041o296q585N440J3090K002r667m636
1338d020Q368Q802n998j3047m16J0220J553j0821p595N932J0173j012r565p21
1352h147J1260P464n363q337K453J0690J381j2085p349P165P240o072j1329j16
1366a1145J1081M680q381n814P814J0547m14q768k778Q810O729p642j1192J410
1380e063R261M19j1077o723Q205R854m165r438K435J1561N015p001p167N000R841
1395A0957j984j1745m385P559N652p233j0810K321J1531K044q837l446Q375R145
1409I144j884r022q86R768M634q909r745K620Q953j235j1811l891J0268O977o245
$$ y = [-9456, 2080, 3497, -6593, -10307, 1137, 11449, 6464, -3146, -1229, 9473, 12518, 1604, -7871, -2420, 6461, 1896, -10115, -12320, -2409, 4632, -1664, -10249, -4809, 8281, 10283, 616, -4020, 4348, 13150, 7152, -5895, -6311, 3909, 5462, -5359, -12954, -7022, 3151, 2139, -7426, -8147, 3113, 10577, 5214, -3123, -670, 10020, 11401, -684, -8033, -868, 6372, 300, -11029, -11145, -64, 4616, -3765, -9579, -1765, 8782, 8368, -400, -3178, 5632, 12361, 4719, -6473, -5063, 4198, 4617, -6460, -13183, -4978, 4876, 711, -8727, -6292, 5269, 10284, 3283, -3884, 1116, 10957, 8973, -2772, -7157, 402, 6054, -1179, -11989, -9668, 1863, 3907, -4930, -8376, -1, 9144, 7260, -1762, -2648, 7120, 11754, 2845, -6900, -4280, 4673, 3438, -8373, -12264, -1996, 4981, -1264]
1424a264p245L991J0271L511o744n326N337P676k886j0896m075Q542O328r158
1438a938j1257N068J1665j150r511j48J0851O571n588p319K155P304K172o097
1452B778p827J149Q213j242j2803l854J2544Q646q369r402O896J2105j957r294
1466b417J289Q580K125n543p062k972M513N394m476r286J818J1404R76j2903k786
1481a1346J6284R562j0766q726P337O994n330p308M55M399J729k981o949n149
1495a1795N817J0887k112j0836M259J5143j818j5992o42J6124N294j2348p833
1508e852N275K690n784l286J588K107M781L020p961p743R394J3830m402j2249
1522d592N252J3756o207j8595K88J5174J746j0450k877L427l44q32J608j26J546
$$ y = [-1264, -8509, -4518, 5753, 9264, 2520, -2806, 2531, 10207, 7321, -3575, -7650, 892, 7220, -1938, -13195, -8127, 3538, 2388, -7123, -7271, 3580, 10151, 4563, -2756, -601, 6703, 8875, 2778, -5049, -3900, 4313, 3071, -9732, -13586, -1042, 7604, -765, -10167, -3271, 8834, 6877, -2417, -1128, 7452, 9577, 4034, -3028, -6000, -1487, 3907, -569, -9855, -8037, 3367, 4343, -8560, -11346, 4938, 14500, 3734, -4992, 2345, 9339, 4009, -3299, -2844, 1555, 3284, 303, -6646, -11795, -5978, 4909, 2797, -8039, -3780, 11363, 9545, -6447, -7089, 9035, 14329, 1981, -5852, -577, 2113, -3671, -6957, -5369, -3262, 1519, 4539, -3422, -11165, -1771, 12059, 7657, -4592, 660, 14416, 8209, -10386, -10098, 5076, 6822, -3628, -6505, -3078, -3422, -4254, -2646, -2772, -1226]
1537a226R060N003j1714j1243J0411J3610r237j3486Q251J1282j0691j5582M035
1550a1527J2960J886m320N82O90j724L080K935n378k34J2932K754j8543j1058
1564a4965J2978J0108j1338q965J1676R400j0928j0452O804R215J526J672K99
1577G030o061k317N791j135j0444J189J5351Q69k0114p883J5757P985j0821k406
1591g209J3319M994r525n918L088L115K629M247l208j0691q72Q583m159j2711
1605a4318O566J8840j920j8353j995J4717L830q709P30R926K51q170l874j940
1619d419j901O309P367p211j0743N622R824p281j0593J0916J8008m471j6366L95
1633d544J0267j519o643K259M086j908k671k543o158j319J1269Q631q698q678
$$ y = [-1226, 7834, 12837, 1123, -10120, 291, 13901, 4664, -8822, -571, 10711, 20, -15562, -11527, 1433, 3319, -1001, -419, 271, -1453, 1627, 4562, -816, -1050, 11882, 14636, -3907, -14965, -1987, 8121, -3217, -12182, -506, 8894, -2034, -12486, -5682, 3533, 5059, 6731, 7030, 969, -1348, 4443, 3308, -7136, -5947, 9404, 10273, -9841, -17724, -1967, 6018, -4803, -7209, 6110, 11104, 1579, -4339, -1251, 1864, 4493, 8740, 5532, -5159, -6031, 2552, -1607, -14318, -7752, 11088, 9168, -9185, -11180, 3537, 7367, -1342, -612, 9314, 9565, 1395, -2479, -4419, -6320, -11, 7356, 145, -10598, -4976, 4848, -2433, -13026, -2110, 15898, 11427, -4939, -4544, 5723, 4204, -2439, -180, 3906, 1998, -673, -3216, -9374, -10693, 576, 9207, 509, -8169]
1647h169R724Q964j0896r298J2116J2759p436j2602K37M626k127k522K321J052
1661a251o2L378j339r234O24J5137N647j2011n532J0490L889j2929p316J0574
1675F5Q422o962p742J025J613J39K665Q40j732M077O601m526j1246J989J3707
1690H935J377j3309l496J0115Q15j1670l609Q795N975k306l361q13Q40L280L311
1705D879k513m007N121O782p549j2428L487J1839j523j0805m88Q848J302p422
1719d477j968O524N065J88k067l732q86N095J879p197m292P030N327q204r663
1734a1378N085J0704j447p925J491P540J199m417k577J923M215J804m200o196
1748d179J03N842O38p770k934Q585N591o991o431N503Q265p10o036q59M970K138
$$ y = [-8169, 1555, 10519, -377, -9675, 2441, 15200, 7764, -4838, -4601, 25, -2102, -4624, -2303, -1251, -1313, 2065, 726, -8508, -7884, 7253, 12900, 889, -4643, 5847, 9736, -3193, -10509, 65, 8487, 1525, -6217, -5192, -3579, -3440, -775, 65, -1667, 2410, 9011, 4485, -6761, -4772, 8935, 10312, -2997, -6493, 3622, 4437, -7233, -10842, -2047, 3928, 1622, -1739, -2552, -1712, 1568, 4879, 2366, -1641, 3480, 10262, 2713, -9715, -6228, 5611, 4088, -6717, -7205, 1643, 2945, -4477, -6445, 79, 5144, 5332, 3265, -467, -1353, 3742, 5621, -1576, -5868, 1162, 6489, -1715, -11378, -6293, 4411, 2964, -4961, -3470, 4070, 5269, 852, -1725, 198, 4413, 6217, 2017, -4179, -4076, 1766, 2404, -5366, -8300, 285, 5876, -1115, -7546, -2043, 6222, 5512, -524, -1383, 3587, 5725]
1764E725m071m850k61M018K687m300o278K172P607K65o709j011P857M945n372
1779B424o184L441O516j238o395k480L289L257k588n827l39O217L449m169m501
1794e128L361P284J70o823j665O343L328n142o087J026N522M87o261l278M561
1809b302N082j665m941J13O383L723m302m808K715N481o38o411l326M346M297
1824C747m003o307J399O490J647m877k968M709N915j588n530k33N002K306m323
1839A386n518J142N464r8o343k639M849N002k345n443J345P172J978n375l212
1854b635L740M447j822o139j730M570K622m196m811J537N749J596n035k758N399
1869E34N523k505n469M70N446J592n427m589K684M445j504n358j565M505M282
$$ y = [5725, 1654, -3196, -3457, 561, 3248, -1052, -7330, -5158, 2449, 2714, -3995, -5006, 2851, 7796, 2424, -3760, -319, 6197, 4959, -1436, -3916, -627, 2630, 42, -5785, -6124, 93, 3542, -627, -5128, -1767, 5517, 5687, -1136, -2801, 3542, 6870, 1728, -4359, -3333, 2189, 2676, -3585, -6863, -2302, 2780, 1115, -3826, -3713, 2670, 6393, 2091, -2717, -2, 5479, 4841, -1570, -4896, -550, 3747, -256, -6563, -5164, 1326, 2973, -1904, -4872, -163, 5752, 4164, -1366, -1599, 3403, 5709, 1386, -4132, -2990, 2474, 2376, -3967, -6606, -1757, 3245, 900, -4543, -3198, 3974, 5952, 577, -2635, 1105, 5552, 3730, -2409, -4139, 431, 3053, -1143, -5954, -4417, 1332, 2928, -2107, -4865, 534, 6057, 3552, -1917, -1447, 3999, 5591, 164, -4425, -1741, 2704, 1200, -4158, -5723, -1218, 3064]
1884C064k632m811K040O430J212m924k889L780M399k547o179n96M762J629m467
$$ y = [3064, 432, -4379, -2339, 4091, 5303, 379, -2510, 1270, 5669, 3122, -3057, -3653, 1109, 2738, -1729]
$$ [...]
8191C5
##END NTUPLES=NMR FID
##END=
