##TITLE=1H_Pr Q-U
 CDCl3
 8 sc, 
 5.4.2024
##JCAMPDX= 6.0         $$ Bruker NMR JCAMP-DX V2.0
##DATA TYPE= NMR FID
##DATA CLASS= NTUPLES
##ORIGIN= UXNMR, Bruker Analytische Messtechnik GmbH
##OWNER= root
$$ XWIN-NMR		Version 3.5
$$ Fri Apr  5 14:48:40 2024 Russian Standard Time (UT+4h)  she@DPX200
##.OBSERVE FREQUENCY= 200.1309
##.OBSERVE NUCLEUS= ^1H
##.DELAY= (6, 6)
##.ACQUISITION MODE= SIMULTANEOUS
##.ACQUISITION SCHEME= undefined
##.AVERAGES= 8
##.DIGITISER RES= 18
##SPECTROMETER/DATA SYSTEM= spect
##.PULSE SEQUENCE= zg30
##.SOLVENT NAME= MeOD
##.SHIFT REFERENCE= (INTERNAL, MeOD, 0, 15.7039)
##AUDIT TRAIL= $$ (NUMBER, WHEN, WHO, WHERE, WHAT)
$$ ##TITLE= Audit trail, XWIN-NMR		Version 3.5
$$ ##JCAMPDX= 5.01
$$ ##ORIGIN= Bruker BioSpin GmbH
$$ ##OWNER= she
$$ F:/spectra/data/she/nmr/H-F/1/audita.txt
$$ ##AUDIT TRAIL=  $$ (NUMBER, WHEN, WHO, WHERE, WHAT)
(   1,<2024-04-05 14:47:34.87 +0400>,<she>,<DPX200>,
      <created by zg, POWCHK disabled, PULCHK disabled
       configuration hash MD5:
       00 E9 B6 7A A2 85 ED C7 34 08 36 98 17 FE 4E 26
       data hash MD5: 16K
       FD 17 7B D0 C2 02 32 50 90 01 D7 E1 5E 57 88 1B>)
$$ ##END=
$$ 
$$ hash MD5
$$ 6C 2D 76 39 58 53 AB DE 88 81 20 3A 47 56 D4 23
##$RELAX= 
##$RELAX= 
##$RELAX= 
##$RELAX= 
##$RELAX= 
##$RELAX= 
$$ Bruker specific parameters
$$ --------------------------
##$DU= <F:/spectra>
##$EXPNO= 1
##$NAME= <H-F>
##$PROCNO= 1
##$TYPE= <nmr>
##$USER= <she>
##$AMP= (0..31)
100 100 100 100 100 100 100 100 100 100 100 100 100 100 100 100 100 100 
100 100 100 100 100 100 100 100 100 100 100 100 100 100 
##$AQSEQ= 0
##$AQ_mod= 1
##$AUNM= <au_zg>
##$AUTOPOS= <>
##$BF1= 200.13
##$BF2= 200.13
##$BF3= 200.13
##$BF4= 200.13
##$BF5= 200.13
##$BF6= 200.13
##$BF7= 200.13
##$BF8= 200.13
##$BYTORDA= 1
##$CFDGTYP= 0
##$CFRGTYP= 5
##$CHEMSTR= <none>
##$CNST= (0..31)
1 1 145 1 1 1 1 1 1 1 1 1 1 1 1 1 1 1 1 1 1 1 1 1 1 1 1 1 1 1 1 1 
##$CPDPRG= <>
##$CPDPRG1= <>
##$CPDPRG2= <>
##$CPDPRG3= <>
##$CPDPRG4= <mlev>
##$CPDPRG5= <mlev>
##$CPDPRG6= <mlev>
##$CPDPRG7= <mlev>
##$CPDPRG8= <mlev>
##$CPDPRGB= <>
##$CPDPRGT= <>
##$D= (0..31)
0 1.2 0 0 0 0 0 0 0 0.06 0 0.03 0 0 0 0 0.0002 0 0 0 0 0 0 0 0 0 0 0 0 
0 0 0 
##$DATE= 1712314054
##$DBL= (0..7)
120 120 120 120 120 120 120 120 
##$DBP= (0..7)
150 150 150 150 150 150 150 150 
##$DBP07= 0
##$DBPNAM0= <>
##$DBPNAM1= <>
##$DBPNAM2= <>
##$DBPNAM3= <>
##$DBPNAM4= <>
##$DBPNAM5= <>
##$DBPNAM6= <>
##$DBPNAM7= <>
##$DBPOAL= (0..7)
0.5 0.5 0.5 0.5 0.5 0.5 0.5 0.5 
##$DBPOFFS= (0..7)
0 0 0 0 0 0 0 0 
##$DE= 6
##$DECBNUC= <off>
##$DECIM= 32
##$DECNUC= <off>
##$DECSTAT= 4
##$DIGMOD= 1
##$DIGTYP= 9
##$DL= (0..7)
0 120 120 120 120 120 120 120 
##$DP= (0..7)
150 150 150 150 150 150 150 150 
##$DP07= 0
##$DPNAME0= <>
##$DPNAME1= <>
##$DPNAME2= <>
##$DPNAME3= <>
##$DPNAME4= <>
##$DPNAME5= <>
##$DPNAME6= <>
##$DPNAME7= <>
##$DPOAL= (0..7)
0.5 0.5 0.5 0.5 0.5 0.5 0.5 0.5 
##$DPOFFS= (0..7)
0 0 0 0 0 0 0 0 
##$DQDMODE= 0
##$DR= 18
##$DS= 0
##$DSLIST= <SSSSSSSSSSSSSSS>
##$DSPFIRM= 0
$$ [...]
##$SUBNAM2= <"">
##$SUBNAM3= <"">
##$SUBNAM4= <"">
##$SUBNAM5= <"">
##$SUBNAM6= <"">
##$SUBNAM7= <"">
##$SUBNAM8= <"">
##$SUBNAM9= <"">
##$SW= 18.0517689322627
##$SWIBOX= (0..15)
0 0 2 0 0 0 0 0 0 0 0 0 0 0 0 0 
##$SW_h= 3612.71676300578
##$TD= 16384
##$TD0= 1
##$TE= 0
##$TE2= 300
##$TE3= 300
##$TEG= 300
##$TL= (0..7)
0 120 120 120 120 120 120 120 
##$TP= (0..7)
150 150 150 150 150 150 150 150 
##$TP07= 0
##$TPNAME0= <>
##$TPNAME1= <>
##$TPNAME2= <>
##$TPNAME3= <>
##$TPNAME4= <>
##$TPNAME5= <>
##$TPNAME6= <>
##$TPNAME7= <>
##$TPOAL= (0..7)
0.5 0.5 0.5 0.5 0.5 0.5 0.5 0.5 
##$TPOFFS= (0..7)
0 0 0 0 0 0 0 0 
##$TUNHIN= 0
##$TUNHOUT= 0
##$TUNXOUT= 0
##$USERA1= <user>
##$USERA2= <user>
##$USERA3= <user>
##$USERA4= <user>
##$USERA5= <user>
##$V9= 5
##$VALIST= <valist>
##$VCLIST= <CCCCCCCCCCCCCCC>
##$VD= 0
##$VDLIST= <DDDDDDDDDDDDDDD>
##$VPLIST= <PPPPPPPPPPPPPPP>
##$VTLIST= <TTTTTTTTTTTTTTT>
##$WBST= 1024
##$WBSW= 4
##$XGAIN= (0..3)
0 0 0 0 
##$XL= 0
##$YL= 0
##$YMAX_a= 134221
##$YMIN_a= -114903
##$ZGOPTNS= <>
##$ZL1= 120
##$ZL2= 120
##$ZL3= 120
##$ZL4= 120
##$ABSF1= 10
##$ABSF2= 0
##$ABSG= 5
##$ABSL= 3
##$ALPHA= 0
##$AQORDER= 0
##$ASSFAC= 0
##$ASSFACI= 0
##$ASSFACX= 0
##$ASSWID= 0
##$AUNMP= <proc_1d>
##$AZFE= 0.1
##$AZFW= 0.1
##$BCFW= 1
##$BC_mod= 2
##$BYTORDP= 1
##$COROFFS= 0
##$CY= 11.3945322036743
##$DATMOD= 1
##$DC= 2
##$DFILT= <>
##$DTYPP= 0
##$F1P= 15.7292609196834
##$F2P= 12.9074282941183
##$FCOR= 0.5
##$FTSIZE= 0
##$FT_mod= 4
##$GAMMA= 1
##$GB= 0.15
##$INTBC= 1
##$INTSCL= 1
##$ISEN= 128
##$LB= 0.24
##$LEV0= 0
##$LPBIN= 0
##$MAXI= 10000
##$MC2= 0
##$MEAN= 0
##$ME_mod= 0
##$MI= 1.114404
##$NCOEF= 0
##$NC_proc= 0
##$NLEV= 6
##$NOISF1= 3.799351
##$NOISF2= 2.8
##$NSP= 1
##$NTH_PI= 0
##$NZP= 0
##$OFFSET= 15.70392
##$PC= 1
##$PHC0= -25297.81
##$PHC1= 9.387311
##$PH_mod= 1
##$PKNL= yes
##$PPARMOD= 0
##$PSCAL= 0
##$PSIGN= 0
##$REVERSE= no
##$SF= 200.130013532006
##$SI= 16384
##$SIGF1= 3
##$SIGF2= 2
##$SINO= 400
##$SIOLD= 16384
##$SREGLST= <1H.CDCl3>
##$SSB= 0
##$STSI= 0
##$STSR= 0
##$SW_p= 3612.71676300578
##$SYMM= 0
##$S_DEV= 0
##$TDeff= 0
##$TDoff= 0
##$TI= <>
##$TILT= no
##$TM1= 0
##$TM2= 0
##$TOPLEV= 0
##$USERP1= <user>
##$USERP2= <user>
##$USERP3= <user>
##$USERP4= <user>
##$USERP5= <user>
##$WDW= 1
##$XDIM= 8192
##$YMAX_p= 0
##$YMIN_p= 0
$$ End of Bruker specific parameters
$$ ---------------------------------
##NTUPLES= NMR FID
##VAR_NAME=  TIME,          FID/REAL,        FID/IMAG
##SYMBOL=    X,             R,               I
##VAR_TYPE=  INDEPENDENT,   DEPENDENT,       DEPENDENT
##VAR_FORM=  AFFN,          ASDF,            ASDF
##VAR_DIM=   8192,          8192,            8192
##UNITS=     SECONDS,       ARBITRARY UNITS, ARBITRARY UNITS
##FACTOR=    0.0002768,     1,               1
##FIRST=     0,             0,               0
##LAST=      2.2672688,     0,               0
##MIN=       0,             -114903,         0
##MAX=       2.2672688,     134221,          0
$$ Real data points
##PAGE= N=1
##DATA TABLE= (X++(R..R)), XYDATA
$$ plain form
0 0 0 0 0 0 0 0 0 0 0 0 0 0 0 0 0 0 0 0 0 0 0 0 0 0 0 0 0 0 0 0 0 0 -2 4 -4 4 -4 5 -5 7 -7 10 -12 12 -12 13 -16 17 -18 21 -23
51 -23 26 -28 31 -34 37 -39 43 -46 51 -53 54 -58 54 -43 15 56 -267 1076 -7734 -73466 -5537 123087
73 123087 134221 43423 -25300 -14341 8150 4095 -10200 -40148 -72341 -54958 18660 72104
85 72104 18395 -72443 -50488 50398 73191 -10962 -75373 -24984 56673 60938 19289 -5527
97 -5527 -7854 2675 15052 14703 -24632 -82946 -70880 12984 53397 2497 -49446 -5054 82246
110 82246 81731 7746 -32103 -12975 14325 7921 -16411 -29844 -38817 -28057 15091 36329 662
123 662 -42945 -24036 40484 49581 -11422 -43108 -7234 37399 32119 -6938 -18394 -3266 4484
136 4484 8822 8786 -6483 -23918 -17750 17623 31380 -7431 -36883 -12876 22868 18968 -16969
$$ packed form
0@%%%%%%%%%%%%%%%%%%%%%%%%%%%%%%%%kOqQqRj0J2j4J7k2K4k4K5k9L3l5L9m4
51b3M9n4N9o5P1p6Q2q9R7j04J07j12J12r7N8M1l23J343q810o5732O7929J28624
73A23087J1134r0798o8723J0959K2491m055j4295k9948l2193J7383P3618N3444
85G2104n3709r0838K1955J00886K2793q4153o4411N0389Q1657M265m1649k4816
97e527k327J0529J2377l49l9335n8314J2066Q3864M0413n0900n1943M4392Q7300
110H2246n15p3985l9849J9128K7300o404k4332j3433q973J0760M3148K1238l5667
123F62m3607J8909O4520R097o1003l1686L5874M4633n280l9057j1456J5128P750
136D484M338l6j5269j7435O168L5373J3757l8811k9452K4007L5744l900l5937
$$ plain form
149 -16969 -27484 477 18582 12759 3044 -1259 915 1075 4338 10261 -4614 -22709 -10373 14651
163 14651 18398 -3349 -15229 4159 17281 2929 -13407 -15563 -5930 -83 -2825 2762 9196
176 9196 5911 7359 13503 12201 -1195 -17744 -15238 -5536 -11500 -17657 -10740 3974 15018 12806
190 12806 12311 18056 14280 5073 -1673 -5678 -6512 -11897 -12980 -4046 -786 -1270 1590 3470 3726 -1496
206 -1496 -6690 -2864 -1768 -4958 -3338 2019 10707 13134 7225 6622 6938 2362 -2173 -8925 -12499 -10605
222 -10605 -8458 -2627 1714 1479 4985 8705 10599 9347 -5 -5171 -3051 -3481 -4950 -7384 -7663 -1254
238 -1254 2519 3744 3937 388 874 3964 2257 1204 -1378 -2644 2143 4020 2629 844 -1634 742
254 742 1907 -2021 -3206 -4576 -4642 -532 -843 -1696 -502 -630 2341 2982 565 907 13 703 2855 285
$$ packed form
149a6969j0515K7961J8105n823r715m303K174J60L263N923j4875j8095J2336K5024
163A4651L747k1747j1880J9388J3122j4352j6336k156R633N847k742N587O434
176I196l285J448O144j302j3396j6549K506R702n964o157O917J4714J1044k212
190A2806m95N745l776r207o746m005q34n385j083Q934L260m84K860J880K56n222
206a496n194L826J096l190J620N357Q688K427n909o03L16m576m535o752l574J894
222a0605K147N831M341k35L506L720J894j252r352n166K120m30j469k434k79O409
238a254L773J225J93l549M86L090j707j053k582j266M787J877j391j785k478K376
254G42J165l928j185j370o6M110l11q53J194j28K971O41k417L42q94O90K152k570
$$ plain form
272 285 -269 1121 22 1354 1152 -854 269 -46 -95 635 -1617 -565 78 -1689 -616 -1264 -2242 -131
290 -131 -1411 -1585 -173 -781 1140 1308 75 1735 1781 1796 2863 387 104 1207 -292 186 -890 -2320
308 -2320 -254 -220 243 1024 -1011 264 1260 -926 -827 -2499 -3877 -1617 -1830 -1340 302 674 3555 4440
326 4440 2850 3303 1256 -268 -44 -2762 -3118 -1536 -914 1224 2237 2070 3860 2368 605 -1296
342 -1296 -5151 -5138 -4195 -5065 -3082 -1130 1781 6323 6549 5170 3505 677 815 -1328 -5490 -5822 -4939
359 -4939 -787 4298 3656 3168 4464 4790 5334 331 -5722 -6951 -6589 -3271 -1033 -3036 -1583 3216
375 3216 6340 7619 2156 -3848 -3266 -1485 -652 -3278 -6391 -1657 5031 8057 7946 2809 494 2432
391 2432 2144 -524 -5822 -10745 -6456 902 3117 399 -3765 17 6999 5480 -465 -5095 -5152 105
$$ packed form
272B85n54J390j099J332k02k006J123l15m9P30k252J052O43j767J073o48r78K111
290a31j280j74J412o08J921J68j233J660M6J5J067k476k83J103j499M78j076j430
308b320K066L4M63P81k035J275R96k186R9j672j378K260k13M90J642L72K881Q85
326D440j590M53k047j524K24k718l56J582O22K138J013j67J790j492j763j901
342a296l855J3R43q70J983J952K911M542K26j379j665k828J38k143m162l32Q83
359d939M152N085o42m88J296L26N44n003o053j229L62L318K238k003J453M799
375C216L124J279n463o004N82J781Q33k626l113M734O688L026j11n137k315J938
391B432k88k668n298m923M289P358K215k718m164L782O982j519n945m630n7N257
$$ plain form
407 105 1625 160 -1048 -2417 1530 7052 6420 1355 -4467 -2870 5178 4254 -3625 -6716 -3273 2560
423 2560 1725 -3436 -3591 -2468 -772 2939 3500 2098 -418 -788 5358 6654 -2523 -8114 -5008 1546
439 1546 1158 -5282 -3411 3650 4762 3599 3178 3773 1909 -3668 -2449 2871 244 -5203 -3106 4189
455 4189 7186 -776 -5044 -648 -1571 -8656 -10646 -5046 244 -2147 -1457 11364 18870 12364 4812
470 4812 4943 7874 49 -12682 -13779 -10205 -11081 -9913 -2519 6280 4948 -863 6631 16051 7995
485 7995 -7402 -10560 2056 8240 -2382 -8026 428 7036 4940 424 -1401 -5192 -13250 -10371
499 -10371 2726 3121 -8091 -7848 12414 28907 16816 -3905 -2433 8760 5427 -10554 -20636
512 -20636 -16587 -11984 -7649 2587 6455 -1520 -3649 10432 25167 13631 -12300 -13417 8294
$$ packed form
407A05J520j465j208j369L947N522o32n065n822J597Q048r24p879l091L443N833
423B560q35n161j55J123J696L711N61j402k516l70O146J296r177n591L106O554
439A546l88o440J871P061J112j163m21N95j864n577J219N320k627n447K097P295
455D189K997p962m268M396r23p085j990N600N290k391O90J2821P506o506p552
470D812J31K931p825j2731j097L574q76J168P394Q799j332n811P494R420q056
485G995j5397l158J2616O184j0622n644Q454O608k096m516j825l791q058K879
499a0371J3097L95j1212K43K0262J6493j2091k0721J472J1193l333j5981j0082
512b0636M049M603M335J0236L868p975k129J4081J4735j1536k5931j117K1711
$$ plain form
525 8294 16848 56 -16294 -8424 7206 7351 216 -4860 -9814 -10835 -2185 8983 4727 -13784
539 -13784 -13224 12524 26935 9459 -14638 -10709 12213 14730 -4598 -16271 -11728 -1531 3919
552 3919 4671 1437 -8252 -9099 9773 21899 6512 -16861 -14004 13091 21436 -1684 -19574 -10706
566 -10706 7280 10283 -1911 -9397 -8010 -3025 7287 13154 2679 -12842 -11658 9901 19670
579 19670 -1185 -21240 -10659 13205 17903 381 -11246 -2343 8286 9676 3878 -6267 -12855
592 -12855 -9947 2425 9819 -2456 -17184 -8237 14155 19174 4 -15141 -4753 11178 9452
605 9452 -1913 -8613 -4887 3734 8762 8607 -176 -10540 -6470 6160 7577 -6919 -19378 -8547
619 -8547 11216 12512 43 -5492 2671 12015 9256 116 -6315 -9880 -6306 869 1072 -5467 -10192
$$ packed form
525H294Q554j6792j6350P870J5630J45p135n076m954j021Q650J1168m256j8511
539a3784N60K5748J4411j7476k4097L929K2922K517j9328j1673M543J0197N450
552C919P52l234r689q47J8872J2126j5387k3373K857K7095Q345k3120j7890Q868
566a0706J7986L003j2194p486J387M985J0312N867j0475j5521J184K1559R769
579A9670k0855k0055J0581K3864M698j7522j1627Q903J0629J390n798j0145o588
592a2855K908J2372P394j2275j4728Q947K2392N019j9170j5145J0388J5931j726
605I452j1365o700L726Q621N028j55q783j0364M070J2630J417j4496j2459J0831
619h547J9763J296j2469n535Q163R344k759r140o431l565L574P175K03o539m725
$$ plain form
634 -10192 -2367 11907 12134 297 -5701 361 9264 6297 -4158 -6464 -2002 2349 3965 888
648 888 -3293 -5234 -3285 2458 1560 -6365 -8682 -2053 6344 6240 -687 -1585 4671 7572 5147 -360
664 -360 -3630 -2162 -1210 -525 -956 -4083 -3955 353 3954 3535 -1307 -2951 1889 3528 977 -2186 -3331
681 -3331 -312 1317 -185 -1171 -1584 -885 945 751 393 -588 -1130 1519 2906 928 -248 -401 1293
698 1293 1779 -656 -1357 -793 -662 574 -746 -1719 -497 -638 -298 191 -1048 -746 -17 235 1107 -120
716 -120 -417 1208 1030 1005 740 -290 752 980 162 123 -959 -266 332 -273 -245 -621 -1022 212 -38 -976
736 -976 -636 -1004 -417 210 -764 -297 151 315 1404 1024 888 902 216 533 529 -811 -397 -333 -252 334 -144
757 -144 108 633 -238 4 -368 -1474 -1134 -1679 -1661 -465 -479 235 1543 1421 2022 1899 1121 927 -513 -1228
$$ packed form
634a0192P825J4274K27j1837n998O062Q903k967j0455k306M462M351J616l077
648H88m181j941J949N743q98p925k317O629Q397j04o927q98O256K901k425n507
664c60l270J468R52O85m31l127J28M308L601m19m842j644M840J639k551l163j145
681c331L019J629j502r86m13O99J830j94l58r81n42K649J387j978j176j53J694
698A293M86k435p01N64J31J236j320r73J222j41L40M89j239L02P29K52Q72j227
716a20k97J625j78k5k65j030J042K28q18l9j082O93N98o05K8l76m01J234k50r38
736i76L40l68N87O27r74M67M48J64J089l80j36J4o86L17mj340M14O4Q1N86m78
757a44K52N25q71K42l72j106L40n45J8J196j4P14J308j22O01j23p78j94j440p15
$$ plain form
777 -1228 -838 -1396 -1152 -348 -92 1180 1217 1117 1458 222 -231 -464 -1574 -1405 -1363 -1582 -77 255 208 769
797 769 251 370 193 -783 -547 -536 -673 650 821 1471 2444 1700 1420 1137 1 -579 -1740 -2666 -1985 -2143
817 -2143 -1415 -251 -571 372 1443 1475 1775 468 -460 361 44 62 -368 -1383 -312 897 746 613 -641
836 -641 -674 914 905 483 -632 -1383 305 1195 605 -455 -1989 -1005 863 376 -588 -1918 -1487 994 1569
855 1569 -202 -1415 -1433 1117 2715 1353 106 -375 984 3401 2103 -835 -2674 -2724 -42 526 -2484
872 -2484 -3949 -2254 1857 3824 1220 -953 -370 1200 2534 710 -2832 -3600 -1588 1855 3044 -210
888 -210 -2145 277 3655 4359 -648 -4687 -2759 799 1392 -299 -2496 -1010 1987 3806 3444 -370
904 -370 -4253 -2639 294 849 -3002 -6397 -1983 4253 5040 2175 -430 1637 4297 2792 44 -2541
$$ packed form
777a228L90n58K44Q04K56J272L7j00L41j236m53k33j110J69M2k19J505L32m7N61
797G69n18J19j77r76K36J1j37J323J71O50R73p44k80k83j136n80j161r26O81j58
817b143P28J164l20R43J071L2L00j307r28Q21l17J8m30j015J071J209j51j33j254
836f41l3J588rm22j115p51J688Q90n90j060j534R84J868m87r64j330M31K481N75
855A569j771j213j8K550J598j362j247m81J359K417j298k938j839n0K682N68l010
872b484j465J695M111J967k604k173N83J570J334j824l542p68K012L443J189l254
888b10j935K422L378P04n007m039J928L558N93j691k197J486K997J819l62l814
904c70l883J614K933N55l851l395M414O236P87k865k605K067K660j505k748k585
$$ plain form
920 -2541 -4134 -2484 411 1732 -511 -3610 -1114 4552 4140 -1508 -5022 -2246 2476 889 -2112
935 -2112 -1582 302 2206 2877 2518 1387 -2021 -2807 1142 2015 -2589 -5364 -1982 4179 3852 -1116 -968
952 -968 2631 3081 882 -1090 -693 -1241 -3564 -1552 1293 -111 -2913 -2568 2454 4069 -743 -2985
968 -2985 1079 3006 740 -1667 252 3051 132 -1762 1385 2746 -270 -3161 -1373 2857 569
983 569 -3757 -2060 1285 796 -1887 -1438 2358 1163 -2507 12 4044 2535 -2618 -3104 2644 4175
999 4175 -1767 -4112 -280 2466 1046 -1115 469 1422 -1384 -1087 2571 2210 -2856 -5320 126 5561
1015 5561 566 -5223 -2445 3706 4448 -833 -3082 -424 67 -770 601 649 -1672 -3204 1165 6814
1031 6814 3853 -4116 -3558 3527 6303 -282 -6750 -3396 1865 1430 -876 -1872 -1862 -1123 794 3938
$$ packed form
920b541j593J650K895J321k243l099K496N666m12n648l514K776M722j587l001
935b112N30J884J904O71l59j131l408p86L949Q73m604k775L382O161l27m968J48
952i68L599M50k199j972L97n48k323K012K845j404k802L45N022J615m812k242
968b985M064J927k266k407J919K799k919j894L147J361l016k891J788M230k288
983E69m326J697L345m89k683M49L796j195l670K519M032j509n153m86N748J531
999D175n942k345L832K746j420k161J584R53k806K97L658l61n066k464N446N435
1015E561m995n789K778O151P42n281k249K658M91q37J371M8k321j532M369N649
1031F814k961p969N58P085K776o585o468L354N261m35k306r96J0P39J917L144
$$ plain form
1047 3938 1836 -4714 -4750 2653 6838 1572 -5751 -2831 5452 6228 -107 -3964 -2430 977 1166 132
1063 132 -1040 -4091 -3433 2367 5642 1313 -4886 -3621 4721 6175 -836 -6069 -3643 2706 3470 -882
1079 -882 -2739 -2048 -84 2941 3524 377 -3348 -2655 3594 5759 -409 -5426 -2491 3734 4695 -1042
1095 -1042 -4546 -1960 1018 2305 111 -2698 -2941 -1152 2568 3818 -518 -4004 -1138 3954 4851
1110 4851 -667 -4242 -698 3126 2816 -386 -2917 -1533 969 1930 1441 -1591 -3040 -638 2202 2096
1126 2096 -1444 -3793 -809 2833 2027 -1000 -2734 -664 2197 1780 139 -1016 -1149 899 2142 995
1142 995 -740 -1887 -47 2289 1197 -1161 -1989 -337 1692 1054 -1340 -1398 -677 523 1068 -547 -938
1159 -938 -969 256 1501 451 -986 -511 527 1474 980 -635 -542 500 1077 654 -558 -608 168 262 515
$$ packed form
1047C938k102o550l6P403M185n266p323K920Q283P76o335l857J534L407J89j034
1063A32j172l051O58N800L275m329o199J265Q342J454p011n233K426O349P64m352
1079h82j857O91J964L025N83l147l725O93O249K165o168n017K935O225R61n737
1095a042l504K586K978J287k194k809k43J789L720J250m336l486K866N092Q97
1110D851n518l575L544L824l10l202k531J384K502R61m89l032j449K402K840j06
1126B096l540k349K984L642q06l027j734K070K861m17j641j155j33K048J243j147
1142I95j735j147J840K336j092k358q28J652K029o38k394n8P21J200N45j615l91
1159i38l1J225J245j050j437M75J038R47m94j615R3J042N77m23j212n0P76R4K53
$$ plain form
1178 515 -324 -1199 -472 157 3 -283 -1393 -430 463 120 116 -336 -183 919 692 358 234 29 414 847
1198 847 103 -123 -292 -190 697 66 -700 -321 -417 124 -276 -912 -327 -205 -196 231 -389 -215 457 251 777
1219 777 286 -274 307 314 291 257 -465 -67 412 -110 131 -49 -181 418 -99 -8 -90 -739 -360 -237 -390 -175
1241 -175 -469 -351 232 -48 253 211 189 319 150 205 469 266 237 502 203 507 406 68 153 -222 -399 -219
1263 -219 -858 -648 -488 -808 -157 71 -486 97 75 505 617 -116 4 167 48 336 291 -117 342 209 490
1284 490 508 -311 -464 -247 -371 -212 -432 -720 -144 24 140 282 -182 -128 -106 -100 260 -255 -478 94 283 514
1306 514 397 -39 550 279 150 447 -281 -354 133 -134 321 113 -659 -410 -78 -47 108 -715 -747 -171 0
1327 0 257 26 -559 90 454 923 663 -303 -243 389 711 879 -32 -789 218 391 499 -346 -1428 -838
$$ packed form
1178E15q39q75P27O29j54k86j110R63Q93l43mm52J53J102k27l34j24k05L85M33
1198H47p44k26j69J02Q87o31p66L79r6N41m00o36N85J22RM27o20J74O72k06N26
1219G77m91n60N81Pk3l4p22L98M79n22K41j80j32N99n17R1q2o49L79J23j53K15
1241a75k94J18N83k80L01m2k2J30j69N5K64k03k9K65k99L04j01l38Q5l75j77J80
1263b19o39K10J60l20O51K28n57N83k2M30J12p33J20J63j19K88m5m08M59j33K81
1284D90J8q19j53K17j24J59k20k88N76J68J16J42m64N4K2OL60n15k23N72J89K31
1306E14j17m36N89k71j29K97p28p3M87k67M55k08p72K49L32L1J55q23l2N76J71
1327@K57k31n85O49L64M69k60r66O0O32L22J68r11p57J007J73J08q45j082N90
$$ plain form
1347 -838 174 405 -73 -1108 -856 647 825 760 -342 -1230 -334 1040 712 -50 -1321 -264 1732 1515
1365 1515 359 -1092 -848 1011 1270 -174 -912 -1287 46 1460 855 -559 -1774 -900 1252 1158 -966
1382 -966 -2442 -1334 1437 1986 -112 -1133 -169 1467 2150 894 -775 -1222 -592 1413 1645 -1125 -2253
1399 -2253 -936 1963 2410 -870 -2579 -827 1274 1381 -688 -1875 -773 453 1439 1408 -491 -1736
1415 -1736 -472 1704 2143 -824 -2842 -479 2571 2219 -602 -1895 332 1875 827 -355 -1345 -1545
1431 -1545 -534 681 1174 -596 -2748 -823 2424 2201 -1260 -2808 -241 2687 1100 -1011 -888 165
1447 165 1130 549 551 261 -1464 -1019 1342 1768 -877 -2708 -515 2731 1482 -1690 -1735 515 1169 -293
1465 -293 -1534 -392 -235 -871 418 1557 619 -1006 -612 2074 2065 -1112 -1987 474 1745 197 -1505
$$ packed form
1347h38J012K31m78j035K52J503J78o5j102q88Q96J374l28p62j271J057J996k17
1365A515j156j451K44J859K59j444p38l75J333J414o05j414j215Q74K152r4k124
1382i66j476J108K771N49k098j021R64J636O83j256j669m47O30K005K32k770j128
1399b253J317K899M47l280j709J752K101J07k069j187J102J226R86l1j899j245
1415a736J264K176M39k967k018K363L050l52k821j293K227J543j048j182r90k00
1431a545J011J215M93j770k152J925L247k23l461j548K567K928j587k111J23J053
1447A65R65n81Kk90j725M45K361M26k645j831K193L246j249l172m5K250O54j462
1465b93j241J142J57o36J289J139r38j625L94K686rl177q75K461J271j548j702
$$ plain form
1482 -1505 -245 1282 -56 -1121 -192 426 -531 -1815 -196 1713 99 -1652 -164 1665 1149 -1048
1498 -1048 -979 1106 375 -1492 -855 972 923 -804 -1061 1734 1982 -383 -900 440 1124 -277 -1533
1515 -1533 -274 272 -993 -1114 447 1105 -760 -2152 287 2212 321 -1509 -510 1535 1660 -75
1531 -75 -507 621 491 -114 131 130 -505 -1775 -354 1881 366 -1847 -1355 1126 2235 -86 -2120 -565
1549 -565 1007 547 -150 -754 -496 -416 132 1394 657 -1161 -1141 998 2285 500 -1963 -838 1633 1551
1567 1551 -23 -1413 -697 482 70 98 -315 -1399 -884 382 1279 329 -1705 -894 1404 1774 43
1584 43 -1387 -663 1372 1157 -207 -408 -587 244 775 543 -25 -1514 -864 957 916 -715 -1344 -623 899
1603 899 1086 -644 -857 -368 651 779 96 -508 -525 -203 881 1149 -399 -779 -83 1102 1089 -430 -808
$$ packed form
1482a505J260J527j338j065R29O18r57j284J619J909j614j751J488J829n16k197
1498a048O9K085p31j867O37J827m9j727k57K795K48k365n17J340O84j401j256
1515a533J259N46j265j21J561O58j865j392K439J925j891j830R99K045J25j735
1531g5m32J128j30o05K45jo35j270J421K235j515k213M92K481J109k321k034J555
1549e65J572m60o97o04K58Q0N48J262p37j818K0K139J287j785k463J125K471q2
1567A551j574j390P16J179m12K8m13j084N15J266Q97r50k034Q11K298L70j731
1584D3j430P24K035k15j364k01j79Q31N31k32n68j489O50J821m1j631o29P21J522
1603H99J87j730k13M89J019J28o83o04j7L22J084K68j548l80O96J185j3j519l78
$$ plain form
1622 -808 104 669 264 -366 -907 -522 -55 194 2 -702 -874 -164 396 232 -338 -810 473 1125 600 254
1642 254 33 348 682 202 4 -420 -634 -101 -127 -469 -492 -495 450 653 212 -110 -78 201 420 -248 -477 -322
1664 -322 -370 105 -165 -144 -173 -147 570 510 -80 131 492 509 761 -7 -52 466 -7 -311 -566 -898 -744 -810 -731
1687 -731 -300 -353 4 446 334 529 455 264 641 411 -96 55 -52 172 -16 -536 -206 -208 -151 65 104 -41
1709 -41 -3 44 499 655 -72 8 -106 -157 -246 -822 -758 -263 -330 -47 265 335 574 634 504 518 324 142 206 -99
1733 -99 -82 -371 -168 107 50 -282 -270 -288 -211 -370 -628 -217 -178 73 503 371 401 489 238 283 -175 -646 -378
1756 -378 -28 -5 208 29 540 785 542 253 -15 -578 -490 -618 -737 -663 -759 -251 531 463 451 56 308 627
1778 627 205 -125 -337 -384 -13 338 92 380 201 210 300 3 -255 -602 -567 44 346 -205 -9 257 485 467
$$ packed form
1622h08R12N65m05o30n41L85M67K49j92p04j72P10N60j64n70m72J283O52n25l46
1642B54k21L15L34m80j98m24k14N33k6l42k3lR45K03m41l22L2K79K19o68k29J55
1664c22m8M75k70K1k9K6P17o0n90K11L61J7K52p68m5N18m73l04k55l32J54o6P9
1687g31M31n3L57M42j12J95p4j91L77k30n07J51j07K24j88n20L30kN7K16L9j45
1709d1L8M7M55J56p27Q0j14n1q9n76O4M95o7K83L12P0K39O0j30J4j94j82O4l05
1733i9J7k89K03K75n7l32J2j8P7j59k58M11L9K51M30j32L0Q8k51M5m58m71K68
1756c78L50K3K13j79N11K45k43k89k68n63Q8j28j19P4r6N08P82o8j2l95K52L19
1778F27m22l30k12m7L71L51k46K88j79RR0k97k58l47L5O11L02n51J96K66K28j8
$$ plain form
1800 467 -154 -415 -341 -735 -467 -492 -317 -163 -17 921 1176 533 345 412 585 452 -142 -682 -205 -425 -24
1821 -24 23 -296 -410 -386 -198 191 52 -476 -41 326 667 334 -77 0 203 421 291 -339 -828 -220 -148 415
1843 415 138 -307 -17 319 729 586 -462 -663 -55 265 488 -341 -812 -112 395 112 -373 -834 -571 118
1863 118 405 511 145 -144 771 1285 953 -42 -1059 -395 418 172 -628 -1248 -575 491 709 35 -297
1882 -297 -484 -58 544 206 -399 -1167 -255 1076 1012 -85 -800 -150 1190 871 -739 -1100 -618 332 730
1901 730 164 -34 -215 234 1263 860 -568 -1439 -927 651 255 -1326 -1342 -91 1154 980 29 -333
1919 -333 198 494 731 524 -283 -752 -241 1199 1218 -589 -1391 137 1048 506 -1148 -1570 -202 586 330
1938 330 -51 -69 -15 469 713 974 -179 -1531 -431 774 657 -907 -1247 267 1369 618 -533 -294
$$ packed form
1800D67o21k61P4l94K68k5J75J54J46R38K55o43j88O7J73j33n94n40M77k20M01
1821b4M7l19j14K4J88L89j39n28M35L67L41l33m11P7K03K18j30o30m89O08P2N63
1843D15k77m45K90L36M10j43j048k01O08L20K23q29m71P00N07k83m85m61K63O89
1863A18K87J06l66k89R15N14l32r95j017O64Q13k46q00o20O73J066K18o74l32
1882b97j87M26O02l38o05p68R12J331o4j097p15O50J340l19j610l61M82R50L98
1901G30n66j98j81M49J029m03j428q71N12J578l96j581j6J251J245j74r51l62
1919c33N31K96K37k07q07m69N11J440J9j807q02J528R11n42j654m22J368P88k56
1938C30l81j8N4M84K44K61j153j352J100J205j17j564l40J514J102p51j151K39
$$ plain form
1956 -294 261 535 119 -27 -38 -945 -449 617 561 -503 -1167 -183 1098 14 -1099 -785 265 969 197
1975 197 -143 456 382 222 369 558 139 -698 -376 734 321 -811 -640 162 741 -23 -846 -278 549 -176
1995 -176 -168 37 252 24 -410 411 753 -221 -516 54 538 204 -680 65 736 156 -211 -160 392 484 -232
2016 -232 -497 297 101 -457 -375 -214 178 -296 -406 382 187 -409 -176 208 540 -45 -514 447 756 30
2036 30 -143 -104 485 305 -271 -54 60 -236 -410 -231 199 -137 -723 10 624 123 -231 -335 234 581 -208
2057 -208 -359 -87 113 -16 15 111 20 -195 7 808 197 -455 -183 269 589 92 -415 -194 144 -56 -245
2078 -245 -376 -275 -193 -232 107 -66 -277 -18 257 723 429 -97 133 490 406 -115 -248 -339 -172 -379 -230
2099 -230 -153 -369 -163 82 333 387 -103 -183 401 439 23 -234 -317 -88 -103 -411 -295 -211 -221 138 87 347 286
$$ packed form
1956b94N55K74m16j46j1r07M96J066n6j064o64R84J281j084j113L14J050P04p72
1975A97l40N99p4j60J47J89m19q37L22J110m13j132J71Q02N79p64q23N68Q27p25
1995a76QK05K15k28m34Q21L42r74k95N70M84l34q84P45O71n80l67N1N52R2p16
2016b32k65P94j96n58Q2J61L92m74j10P88j95n96K33L84L32n85m69R61L09p26
2036C0j73L9N89j80n76K17J14k96j74J79M30l36n86P33O14n01l54j04N69L47p89
2057b08j51K72K00j29L1R6r1k15K02Q01o11o52K72M52L20m97n07K21L38k00j89
2078b45j31J01Q2l9L39j73k11K59K75M66k94n26K30L57q4n21j33r1J67k07J49
2099b30P7k16K06K45K51N4m90q0N84L8m16k57q3K29j5l08J16Q4j0L59n1K60o1
$$ plain form
2122 286 330 606 615 269 96 -110 -53 -154 -595 -363 -197 -619 -603 -224 -140 73 -24 5 523 402 363 355 304 367
2146 367 87 102 27 -331 -429 -505 -404 -34 -294 -33 248 230 469 169 -14 20 -61 -214 -263 -462 -306 -34 -99
2169 -99 200 28 -168 338 376 88 -106 -209 145 220 41 149 304 143 286 133 -223 -365 -519 -202 -239
2190 -239 -337 -246 -186 121 486 180 74 125 -196 -60 -111 -334 -186 94 260 887 425 321 508 183 168 -275
2212 -275 -592 -559 -348 -524 -201 -215 -47 146 161 300 179 -53 406 236 188 -42 -89 105 89 -180 -167 -319
2234 -319 -101 -137 -395 -352 -81 155 472 532 403 331 120 226 285 -336 -572 -605 -460 -269 -416 -580 -142 96
2256 96 190 396 410 487 437 499 592 172 44 -17 -25 -302 -615 -890 -651 -222 -302 -249 -277 115 468 400 524 360 26
2281 26 133 326 96 -270 -433 -246 179 -11 -289 -385 18 189 154 35 94 11 224 444 218 58 -8 -210
$$ packed form
2122B86M4K76Rl46j73k06N7j01m41K32J66m22J6L79Q4K13r7K9N18j21l9qn1O3
2146C67k80J5p5l58r8p6J01L70k60K61K81j8K39l00j83L4q1j53m9j99J56K72o5
2169i9K99j72j96N06L8k88j94j03L54P5j79J08J55j61J43j53l56j42j54L17l7
2190b39r8R1O0L07L65l06j06N1l21J36n1k23J48K80J66O27m62j04J87l25j5m43
2212b75l17L3K11j76L23j4J68J93J5J39j21k32M59j70m8k30m7J94j6k69J3j52
2234c19K18l6k58M3K71K36L17O0j29p2k11J06N9o21k36l3J45J91j47j64M38K38
2256I6R4K06J4P7n0O2R3m20j28o1qk77l13k75K39M29q0N3k8L92L53o8J24j64l34
2281B6J07J93k30l66j63J87M25j90k78r6M03J71l5j19N9q3K13K20k26j60o6k02
$$ plain form
2303 -210 193 -246 -583 -716 -611 35 172 -120 1 286 572 672 255 160 122 -173 206 -109 -73 -242 -339
2324 -339 44 219 -74 -189 -107 -341 -76 -30 -253 23 -201 328 453 98 228 143 -19 343 112 -421 -379
2345 -379 -65 193 152 -55 75 164 266 101 -95 -256 -251 -246 43 -3 -175 -293 147 401 416 -180 -355 84 192
2368 192 275 -191 -71 84 356 451 260 -17 -217 51 159 206 -244 -610 -45 128 135 -364 -654 -124 394 49
2390 49 -243 -246 -163 20 215 406 77 -282 236 542 466 -136 -391 -60 536 276 -331 -268 -38 381 198 -33
2412 -33 -101 -299 -220 92 215 -245 -617 -27 628 315 -253 -254 194 507 239 -152 12 107 122 225 277 -226 -202
2435 -202 -187 366 229 -448 -616 -80 492 146 -429 -347 172 185 179 -83 -129 93 45 299 419 -95 -403 93
2457 93 422 336 -223 -404 188 459 -46 -506 -279 36 153 -41 161 -112 -260 -125 205 135 -303 -515 147
$$ packed form
2303b10M03m39l37j33J05O46J37k92J21K85K86J00m17r5l8k95L79l15L6j69r7
2324c39L83J75k93j15Q2k34K65M6k23K76k24N29J25l55J30q5j62L62k31n33M2
2345c79L14K58m1k07J30Q9J02j65j96j61NNK89m6j72j18M40K54J5n96j75M39J08
2368A92Q3m66J20J55K72R5j91k77k00K68J08M7m50l66N65J73Pm99k90N30N18l45
2390D9k92lQ3J83J95J91l29l59N18L06p6o02k55L31N96k60o07O3K30M19j83k31
2412c3o8j98P9L12J23m60l72N90O55l13n68jM48L13k68l91J64R5J5J03N2n03K4
2435b02J5N53j37o77j68N36N72l46n75Q2N19J3ok62m6K22m8K54J20n14l08M96
2457I3L29q6n59j81N92K71n05m60K27L15J17j94K02k73j48J35L30p0m38k12O62
$$ plain form
2478 147 538 117 -208 -179 395 294 -34 60 197 156 -75 158 40 -78 -462 -126 169 13 -324 -216 -82
2499 -82 345 -177 -357 111 264 64 -86 -96 199 7 -88 152 46 96 -155 109 356 224 -287 -32 215
2520 215 -28 -253 -232 120 52 -392 -264 -18 -120 -71 -25 23 31 -241 120 299 152 61 24 401 387 -105 -125 -15
2544 -15 -45 -176 -163 -170 148 -106 -99 243 44 93 167 224 326 -4 -509 -205 -2 -92 -212 -338 49 137 -84 134
2568 134 118 187 -3 98 147 288 -131 -59 173 193 -221 -294 -268 32 -367 -233 -145 -258 -188 134 186 222 116 88
2592 88 381 192 145 -74 -204 87 -245 -211 -180 50 -113 30 -67 33 2 -341 4 -21 -199 -300 -158 133
2614 133 178 -24 145 177 -45 238 -12 84 -25 12 77 159 9 -67 -75 -12 375 -82 -174 -64 -40 58 -115 -123 142
2639 142 95 112 72 -113 -129 -232 -228 -1 -174 -88 -74 245 360 346 178 281 236 139 168 -46 -181 -220 -234 -64 -275
$$ packed form
2478A47L91m21l25K9N74j01l28R4J37m1k31K33j18j18l84L36K95j56l37J08J34
2499h2M27n22j80M68J53k00j50j0K95j92r5K40j06N0k51K64K47j32n11K55K47
2520B15k43k25K1L52o8m44J28K46j02M9M6M8Qk72L61J79j47r1l7L77j4m92k0J10
2544a5l0j31J3pL18k54PL42j99M9P4N7J02l30n05L04K03r0j20j26L87Q8k21K18
2568A34j6O9j90J01M9J41m19P2K32K0m14p3K6L00l99J34Q8j13P0L22N2L6j06k8
2592H8K93j89m7k19j30K91l32L4L1K30j63J43r7J00l1l43L45k5j78j01J42K91
2614A33M5k02J69L2k22K83k50R6j09L7O5Q2j50p6qO3L87m57r2J10K4R8j73qK65
2639A42m7J7m0j85j6j03MK27j73Q6J4L19J15j4j68J03m5r7K9k14j35l9j4J70k11
$$ plain form
2664 -275 -325 -237 50 86 94 202 258 385 401 347 252 57 32 73 100 -195 -466 -170 -202 -147 -308 -229 -136 227 306 199
2690 199 119 244 200 303 116 -287 -233 -238 -245 -247 -281 -527 -152 -74 169 25 130 417 442 524 165 101 155 -23 -95
2715 -95 -244 -448 -352 -298 -273 -191 -298 -155 131 22 195 193 35 193 122 172 122 -111 15 82 28 -5 -386 -405 42
2740 42 28 -38 11 55 211 357 92 165 128 110 -87 -32 -145 -211 -222 111 122 -79 -122 48 195 342 -147 -162 139
2765 139 -46 185 17 -108 166 86 80 7 -161 -159 -129 -212 107 -285 -108 36 90 151 -80 -164 76 219 112 24
2789 24 -185 90 266 122 228 86 -197 -20 152 62 -151 -180 -168 -20 -123 -161 -188 -70 296 46 -48 138
2811 138 -170 80 -42 -69 -16 -9 -87 170 117 -95 -170 48 306 73 -61 97 -144 -151 118 54 82 -153 -215 104
2835 104 75 -181 -153 -247 -56 245 85 62 294 148 182 126 27 8 -56 36 99 -91 -45 -49 -159 32 105 -199 -188
$$ packed form
2664b75n0Q8K87L6QJ08N6J27J6n4r5j95k5M1K7k95k71K96l2N5j61P9R3L63P9j07
2690A99q0J25m4J03j87m03N4npkl4k46L75P8K43j44J05K87K5Q2l59o4N4j78p2
2715i5j49k04R6N4K5Q2j07J43K86j09J73kj58J58p1N0n0k33J26O7n4l3l81j9M47
2740D2j4o6M9M4J56J46k65P3l7j8j97N5j13o6j1L33J1k01m3J70J47J47m89j5L01
2765A39j85K31j68j25K74q0op3j68KL0q3L19l92J77J44N4O1k31q4K40J43j07q8
2789B4k09K75J76j44J06j42k83J77J72r0k13k9J2J48j03l8k7J18L66k50r4J86
2811A38l08K50j22k7N3Pp8K57n3k12p5K18K58k33j34J58k41pK69o4K8k35o2L19
2835A04k9k56K8r4J91L01j60k3K32j46L4n6r9j9o4R2O3j90M6mj10J91P3l04J1
$$ plain form
2860 -188 114 1 5 -88 -24 149 13 195 124 -64 -137 -59 398 164 -90 -87 32 181 143 -119 -199 38 -246 -55
2884 -55 -142 -71 -95 -138 174 34 -4 -181 -82 147 -54 -251 -22 206 174 -32 68 -64 158 -27 10 175 -186
2907 -186 -293 -118 223 363 36 -369 10 187 -83 -58 -77 -152 198 -45 -40 -8 -36 148 48 59 105 -221 -20
2930 -20 315 -124 -163 -24 107 294 -92 -59 117 44 56 -10 -154 -57 -198 -99 178 256 -90 -28 234 313 -39 -66
2954 -66 31 220 129 -11 -54 165 -14 58 169 204 72 -95 -32 131 104 -190 -233 73 -67 -115 -9 -170 71
2977 71 -43 50 136 -56 -50 194 155 17 -120 31 194 278 41 -13 -43 282 -5 -236 -127 -81 -7 -167 -79 92
3001 92 -128 -127 14 127 39 -138 -63 72 122 -166 1 191 188 89 -20 39 155 -52 -21 196 101 -93 94 65
3025 65 63 -74 -235 29 58 11 -109 -127 210 186 -241 48 39 114 -2 -9 94 137 32 -76 135 -12 -117 -177 148
$$ packed form
2860a88L02j13Mr3O4J73j36J82p1j88p3P8M57k34k54LJ19J49l8k62q0K37k84J91
2884e5q7P1k4m3L12j40l8j77R9K29k01j97K29K28l2k06J00j32K22j85L7J65l61
2907a86j07J75L41J40l27m05L79J77k70K5j9p5L50k43NL2k8J84j00J1M6l26K01
2930b0L35m39l9J39J31J87l86L3J76p3J2o6j44R7j41R9K77P8l46O2K62P9l52k7
2954f6R7J89r1j40m3K19j79P2J11L5j32j67O3J63k7k94m3L06j40m8J06j61K41
2977G1j14R3Q6j92OK44l9j38j37J51J63Q4k37n4l0L25k87k31J09M6P4j60Q8J71
3001I2k20JJ41J13q8j77P5J35N0k88J67J90lr9j09N9J16k07L1K17r5j94J87k9
3025F5kj37j61K64K9m7j20j8L37k4m27K89rP5j16pJ03M3j05j08K11j47j05o0L25
$$ plain form
3050 148 53 -123 -88 -30 -96 -204 -169 34 -44 -151 -227 -9 60 -28 -43 45 176 52 65 95 108 171 -136 -170 209
3075 209 77 39 -67 -20 17 19 -174 158 67 30 96 79 -46 -164 -210 -160 58 -6 16 -14 -183 170 120 60 195
3100 195 16 172 190 154 211 47 -74 65 -50 -185 -305 -256 -64 -72 -317 47 -3 97 137 189 71 -7 32 180
3124 180 247 -10 -170 58 137 40 -115 15 -227 7 98 96 18 -51 37 93 34 14 12 -187 34 -23 -37 -340 -169
3149 -169 -108 51 52 19 -34 45 249 96 131 -11 71 54 149 -20 -255 -134 -218 -27 -171 -289 -280 -23 -75 57 -88
3174 -88 126 77 41 67 15 19 103 74 -109 58 26 57 -13 77 -63 -25 -106 -66 -59 -84 -98 -206 -13 21 -83 -12 -92 -148
3202 -148 -38 79 -9 -117 -268 -95 139 -76 123 -145 -52 138 -19 -33 130 88 77 68 9 78 -21 -11 72 -93
3226 -93 21 -19 -93 149 -179 -317 13 100 170 156 153 61 224 188 186 177 -83 -65 -7 -151 1 -171 -53 92 -20
$$ packed form
3050A48r5j76L5N8o6j08L5K03p8j07p6K18O9q8j5Q8J31j24J3L0J3O3l07l4L79
3075B09j32l8j06M7L7Kj93L32r1l7O6j7j25j18m6N0K18o4K2l0j69L53n0o0J35
3100A95j79J56J8l6N7j64j21J39j15j35j20M9J92qk45L64n0J00M0N2j18p8L9J48
3124A80O7k57j60K28P9r7j55J30k42K34R1kp8o9Q8N6n9k0kj99K21n7j4l03J71
3149a69O1J59Jl3n3P9K04j53L5j42Q2j7R5j69k35J21q4J91j44j18RK57n2J32j45
3174h8K14m9l6K6n2MQ4k9j83J67l2L1p0R0j40L8q1M0Pk5j4j08J93L4j04P1q0n6
3202a48J10J17q8j08j51J73K34k15J99k68R3J90j57j4J63m2j1rn9O9r9J0Q3j65
3226i3J14m0p4K42l28j38L30Q7P0j4lr2J63l6krk60J8N8j44J52j72J18J45j12
$$ plain form
3251 -20 18 -153 7 239 75 13 156 -92 -32 143 -75 125 -127 -56 52 -98 -175 -36 146 44 22 65 168
3274 168 76 154 92 -96 -105 48 -206 -149 -135 -66 -117 -135 111 126 -250 24 207 108 259 74 79 162 126 71 5 65
3300 65 85 29 35 122 -189 -165 -46 -26 -129 49 -149 41 27 -206 28 22 46 265 -85 -131 111 -85 100 -176
3324 -176 209 -36 -79 130 224 171 156 -106 35 110 -17 -49 0 78 -188 11 101 144 -22 -27 -67 41 25 25 95 58
3350 58 -20 26 5 66 167 19 -56 67 -104 -67 -124 96 -74 -201 -320 43 -41 -69 -110 90 53 -17 -74 42 23
3375 23 6 -77 114 136 3 54 -118 48 -126 -106 50 -22 78 -25 -157 46 -64 -164 -93 27 -102 66 -168
3398 -168 -72 67 23 -109 -44 -19 163 25 -94 71 -115 185 -42 38 87 -21 55 138 -165 -93 114 117 5 -104
3422 -104 -34 4 -67 -111 -110 -4 -29 140 46 27 93 -105 -110 3 153 143 -44 35 58 -122 122 -57 -65 -59 -182 -20
$$ packed form
3251b0L8j71J60K32j64o2J43k48O0J75k18K00k52P1J08j50p7J39J82j02k2M3J03
3274A68r2P8o2j88rJ53k54N7J4O9n1j8K46J5l76K74J83r9J51j85NQ3l6n5o6O0
3300F5K0n6OQ7l11K4J19K0j03J78j98J90j4k33K34oK4K19l50m6K42j96J85k76
3324a76L85k45m3K09R4n3j5k62J41P5j27l2M9P8k66J99R0M3j66nm0J08j6%P0l7
3350E8p8M6k1O1J01j48p5J23j71L7n7K20j70j27j19L63q4k8m1K00l7p0n7J16j9
3375B3j7q3J91K2j33N1j72J66j74K0J56p2J00j03j32K03j10j00P1J20j29J68k34
3398a68R6J39m4j32O5K5J82j38j19J65j86L00k27Q0M9j08P6Q3l03P2K07Lj12j09
3422a04P0L8p1m4JJ06k5J69r4j9O6j98nJ13J50j0j87P9K3j80K44j79qOj23J62
$$ plain form
3448 -20 26 -53 48 -77 -137 102 -79 -42 81 84 -65 53 37 302 122 -54 -49 59 34 -52 -13 144 -69 -22 -96
3473 -96 164 -37 -140 17 -28 128 -28 -24 12 -6 -88 -39 -79 113 -42 86 36 167 119 -101 7 -51 -129 -90 96
3498 96 35 0 -64 -3 45 -162 -158 -56 -36 8 -20 -46 60 100 -2 30 185 92 33 -99 137 85 -77 139 81 -55
3524 -55 70 90 -20 135 1 -203 -123 -11 79 -136 -34 100 16 -175 48 -38 137 -63 46 62 -14 28 -38
3547 -38 65 181 166 -79 64 -14 -42 108 10 1 -74 -6 5 -72 -32 -171 -204 -8 -156 28 -20 198 92 -5 30
3572 30 15 56 52 69 -16 78 46 -106 -192 100 14 -186 79 -145 -29 -3 -159 8 -83 0 -124 -69 -51 -126 130 24
3598 24 -47 -102 0 -123 -42 176 74 128 237 -72 157 -5 -45 -67 15 20 -217 -172 -104 -66 -36 -10 -97 -2 139 55
3624 55 19 -26 -58 102 94 -78 244 -132 67 24 72 -147 -13 -61 -158 142 -62 4 -278 4 -161 -45 282 173
$$ packed form
3448b0M6p9J01j25o0K39j81L7J23Lj49J18j6K65j80j76NJ08k5q6L9J57k13M7p4
3473i6K60k01j03J57m5J56j56ML6j8q2M9m0J92j55J28n0J31m8k20J08n8p8L9J86
3498I6o1l5o4O1M8k07MJ02K0M4k8k6J06M0j02L2J55r3n9j32K36n2j62K16n8j36
3524e5J25K0j10J55j34k04Q0J12R0k15J02J34q4j91K23q6J75k00J09J6p6M2o6
3547c8J03J16j5k45J43p8k8J50r8rp5O8J1p7M0j39l3J96j48J84m8K18j06r7L5
3572C0j5M1mJ7q5R4l2j52q6K92q6k00K65k24J16K6j56J67r1Q3j24N5J8p5K56j06
3598B4p1n5J02j23Q1K18j02N4J09l09K29j62m0k2Q2Nk37M5O8L8L0K6q7R5J41q4
3624E5l6m5l2J60qj72L22l76J99m3M8k19J34m8r7L00k04O6k82K82j65J16L27j09
$$ plain form
3648 173 -44 10 82 19 -9 71 74 126 -59 88 -101 -50 139 4 -101 65 20 -45 31 -309 -57 -63 -119 -27 15 -144
3674 -144 142 -44 -112 -20 -22 113 -119 73 -8 -111 -37 121 145 22 -104 -123 28 53 26 -91 -23 123 113 -81
3698 -81 60 -117 -287 77 63 -1 20 2 -20 27 -26 97 -44 73 -61 -81 177 -167 -79 -15 -139 88 -22 92
3722 92 -163 25 -81 -54 21 -39 15 -76 -82 -93 -13 4 -7 23 -106 88 115 -55 45 -91 199 107 60 13 -206 138
3748 138 49 -133 -5 42 27 -17 17 15 -75 -133 158 158 48 -72 -220 -50 145 167 -129 59 147 117 76 -2 -74 -65
3774 -65 163 67 113 -17 -58 -302 75 -71 -156 -115 12 12 -19 85 -1 260 -93 101 -59 18 -85 40 66 187
3798 187 -31 -103 24 92 106 -83 88 -101 55 61 -105 -150 -113 -54 16 5 -88 75 -134 -68 17 -188 -34 -123 38
3823 38 -9 -131 -51 40 174 -149 132 117 116 160 -224 -78 -13 29 -80 -168 -46 -111 12 180 234 -92 82 -14 -31
$$ packed form
3648A73k17N4P2o3k8Q0LN2j85J47j89N1J89j35j05J66m5o5P6l40K52on6R2M2j59
3674a44K86j86o8R2kJ35k32J92q1j03P4J58K4j23j26j9J51K5k7j17O8J46j0j94
3698h1J41j77j70L64j4o4K1j8k2M7n3J23j41J17j34k0K58l44Q8O4j24K27j10J14
3722I2k55J88j06K7P5o0N4r1oj1Q0J7j1L0j29J94K7j70J00j36K90r2m7m7k19L44
3748A38q9j82J28M7j5m4L4kr0n8K91%j10j20j48J70J95K2k96J88Q8l0m1p8p2R
3774f5K28r6M6j30m1k44L77j46q5M1J27%l1J04q6K61l53J94j60P7j03J25K6J21
3798A87k18p2J27O8J4j89J71j89J56Oj66m5L7N9P0j1r3J63k09O6Q5k05J54q9J61
3823C8m7j22Q0R1J34l23K81j5jM4l84J46O5M2j09q8J22o5J23J68N4l26J74r6j7
$$ plain form
3848 -31 115 -3 -78 50 -185 106 187 237 59 -98 -50 144 -83 -106 58 91 -104 4 -2 -76 -62 -9 97 -184
3872 -184 -203 -153 -97 138 142 40 28 137 112 77 42 107 191 -40 95 -125 -11 31 33 -143 40 -11 -144 -40 -66
3897 -66 -145 82 47 95 -49 -218 -62 -32 97 57 -67 -41 8 123 119 -37 -25 -103 -59 -77 -177 157 144 -97 51
3922 51 -133 -16 -131 118 27 -103 -36 -91 132 -127 -160 133 19 29 -69 -38 -70 16 92 -19 4 -67 13 25 89
3947 89 -99 -66 36 26 -76 -42 -134 -13 -174 -82 12 37 -89 45 -32 36 140 -17 23 -3 42 81 -145 107 96
3972 96 -30 -66 14 -54 106 37 -37 -12 -248 -135 136 43 105 -21 -62 -140 49 24 2 -117 17 -23 -41 121 -24
3997 -24 82 -97 -141 -62 -36 -129 -12 24 28 85 22 156 -47 -22 -61 -99 134 -84 -163 9 281 -187 134 200 -52
4022 -52 -86 63 41 91 -73 -140 -93 -86 -172 -93 91 34 -61 -175 -49 -37 -136 -71 -7 132 2 42 14 -141 82 49
$$ packed form
3848c1J46j18p5J28k35K91Q1N0j78j57M8J94k27k3J64L3j95J08op4J4N3J06k81
3872a84j9N0N6K35Mj02j2J09k5l5l5O5Q4k31J35k20J14M2Kj76J83n1j33J04k6
3897f6p9K27l5M8j44j69J56L0J29m0j24K6M9J15mj56J2p8M4j8j00L34j3k41J48
3922E1j84J17j15K49r1j30O7n5K23k59l3K93j14J0r8L1l2Q6P6j11K3p1Q0J2O4
3947H9j88L3J02j0j02L4r2J21j61R2R4K5j26J34p7O8J04j57M0k6M5L9k26K52j1
3972I6j26l6Q0o8J60o9p4K5k36J13K71r3O2j26m1p8J89k5k2j19J34m0j8J62j45
3997b4J06j79m4P9K6r3J17L6MN7o3J34k03K5l9l8K33k18p9J72K72m68L21O6k52
4022e2l4J49k2N0j64o7M7Pq6P9J84n7r5j14J26J2r9O5O4J39j30M0k8j55K23l3
$$ plain form
4048 49 -78 -14 -4 -7 -10 122 196 12 -11 -23 -5 31 -140 36 -220 -1 -204 -152 -55 -127 -33 -13 49 116 -92 -57 171
4075 171 -41 -57 51 121 43 189 51 72 82 -55 -40 -10 -4 98 71 -144 31 42 24 103 -72 -77 82 -11 -21 -50
4101 -50 133 22 15 229 126 26 80 33 105 33 -98 17 -75 -62 65 4 26 -6 -74 23 35 -105 -154 30 -8 -55
4127 -55 -10 144 31 -3 42 0 14 74 -7 -160 167 -149 -74 -29 -16 -12 -44 56 -146 7 -110 39 -150 -193 57
4152 57 -41 -89 89 -55 -30 30 17 129 38 -53 53 -39 50 55 33 -78 70 -126 -39 -49 -145 -95 52 62 -20 1 -195
4179 -195 38 20 -21 -48 25 -34 -111 158 78 36 62 -164 36 38 97 -193 40 67 -7 -144 -80 115 -131 -191 -2
4204 -2 153 -11 -141 -4 -12 -22 -78 -29 229 26 7 -85 170 -53 -40 167 7 70 50 23 -6 148 -2 -71 18
4229 18 38 23 -157 -31 53 21 79 -37 -30 17 -25 -25 81 46 141 12 54 -14 14 94 7 -43 -115 70 80 77 21 68 206
$$ packed form
4048D9j27O4J0llJ32P4j84k3j2J8L6j71J76k56K19k03N2R7p2R4K0O2O7k08L5K28
4075A71k12j6J08P0p8J46j38K1J0j37J5L0OJ02k7k15J75J1j8P9j75nJ59r3j0k9
4101e0J83j11pK14j03j00N4m7P2p2j31J15r2J3J27o1K2l2o8R7J2j40m9J84l8m7
4127e5M5J54j13l4M5m2J4O0q1j53L27l16P5M5J3Ml2J00k02J53j17J49j89m3K50
4152E7r8m8J78j44K5O0j3J12r1r1J06r2Q9Nk2j11J48j96Q7j0r6N0J47J0q2K1j96
4179a95K33j8m1k7P3n9p7K69q0m2K6k26K00KN9k90K33K7p4j37O4J95k46o0J89
4204bJ55j64j30J37qj0n6M9K58k03j9r2K55k23J3K07j60O3k0k7k9J54j50o9Q9
4229A8K0j5j80J26Q4l2N8j16PM7m2%J06l5R5j29M2o8K8Q0q7n0p2J85J0ln6M7J38
$$ plain form
4258 206 -50 -91 -71 -81 -103 54 49 97 -15 -51 -2 30 1 128 9 13 237 135 78 -19 23 42 -243 -94 72 -21
4284 -21 104 -10 -129 9 -28 34 -23 -92 71 -198 -58 82 170 -45 163 85 103 111 52 49 -4 36 13 191 24
4309 24 29 -41 76 -6 -109 -12 61 -66 -195 -187 -94 -84 50 114 -106 -87 181 168 -66 85 165 48 127 -120 -35 13
4335 13 54 -9 5 -18 -16 27 -166 -37 -36 46 -27 -182 190 51 45 13 -37 159 -118 53 165 88 -12 31 3 -66 43
4362 43 -116 -69 68 -91 -71 128 28 -253 52 -21 -11 -98 -43 -70 61 105 -66 -6 86 0 60 -13 16 72 16 27
4388 27 15 20 178 124 122 23 136 -111 -10 23 -145 31 -102 64 -23 92 49 -149 82 28 -94 181 -131 -96
4412 -96 87 74 105 39 53 -11 80 -202 -59 55 -82 -144 -92 -169 111 -96 -54 169 76 -13 58 112 2 225 37
4437 37 -17 -148 27 20 172 218 -68 -44 -36 -69 -17 262 -16 -93 129 4 22 -13 -48 -61 -100 -28 123 43 17 -31 -23
$$ packed form
4258B06k56m1K0j0k2J57nM8j12l6M9L2k9J27j19MK24j02n7r7M2J9k85J49J66r3
4284b1J25j14j19J38l7O2n7o9J63k69J40J40Q8k15K08p8J8Qn9ln3M0k3J78j67
4309B4Np0J17q2j03R7P3j27j29QR3J0J34O4k20J9K68j3k34J51Q0j17P9k47Q5M8
4335A3M1o3J4k3KM3j93J29JQ2p3j55L72j39ol2n0J96k77J71J12p7j00M3k8o9J09
4362D3j59M7J37j59K0J99j00k81L05p3J0q7N5k7J31M4j71O0R2q6O0p3K9N6n6J1
4388B7j2NJ58n4kr9J13k47J01L3j68J76j33J66q7J15m3j98K31n4j22K75l12L5
4412i6J83j3L1o6J4o4R1k82J43J14j37o2N2p7K80k07M2K23r3q9P1N4j10K23j88
4437C7n4j31J75pJ52M6k86K4Ql3N2K79k78p7K22j25J8l5l5j3l9P2J51q0k6m8Q
$$ plain form
4464 -23 130 -11 -93 127 -47 81 191 -113 53 -99 4 132 -39 89 274 54 16 13 -103 -87 21 -64
4486 -64 -74 -103 -139 -7 -33 0 21 -48 58 20 -59 59 -48 75 -66 122 -13 -38 -25 -37 49 -37 -69 -16 -83 33
4512 33 -121 57 -49 19 -100 -100 -15 24 -80 -21 83 -10 158 -105 18 -27 -164 144 45 -72 50 129 -33 -153
4536 -153 22 55 -21 49 8 -91 -115 -7 -66 -35 77 -14 27 38 -59 -63 51 149 79 8 84 40 20 -9 5 123 134 -10
4564 -10 -182 -160 -129 -83 -63 18 106 84 -1 11 -132 -122 -171 -73 45 45 -177 10 -29 3 217 -161 161 132 89 98 37
4591 37 27 -6 -5 -35 -35 143 29 105 55 -218 -5 74 -20 108 -139 108 139 -51 156 101 -20 64 14 141 -44
4616 -44 -154 -46 -124 -186 -29 143 -94 -346 93 -20 -43 -32 -89 -187 10 46 68 60 149 112 32 -120 4 78 96
4641 96 -32 30 40 -42 -53 -5 129 -104 -69 -10 33 136 -90 -120 29 -48 -94 -31 -69 74 -38 -10 -27 26 114 -38
$$ packed form
4464b3J53j41q2K20j74J28J10l04J66j52J03J28j71J28J85k20l8lj16J6J08q5
4486f4j0k9l6J32k6L3K1o9J06l8p9J18j07J23j41J88j35k5J3j2Q6q6l2N3o7J16
4512C3j54J78j06O8j19%Q5L9j04N9J04r3J68k63J23m5j37L08r9j17J22P9j62j20
4536a53J75L3p6P0m1r9k4J08n9L1J12r1M1J1r7mJ14R8p0p1P6m4k0k9J4J18J1j44
4564a0j72K2L1M6K0Q1Q8k2q5J2j43J0m9R8J18%k22J87l9L2K14l78L22k9m3Ro1
4591C7j0l3Jl0%J78j14P6n0k73K13P9r4J28k47K47L1j90K07n5j21Q4n0J27j85
4616d4j10J08p8o2J57J72k37k52M39j13k3J1n7r8J97L6K2qQ9l7q0j52J24P4J8
4641I6j28O2J0q2j1M8J34k33L5N9M3J03k26l0J49p7m6O3l8J43j12K8j7N3Q8j52
$$ plain form
4667 -38 47 -3 -68 -57 -75 36 76 7 3 -80 -258 -56 -99 -122 -94 -60 -78 210 168 97 119 -125 -183 124 92 -91 -51
4694 -51 9 -50 -92 -20 -91 -123 -179 61 64 40 24 42 -16 -49 24 94 139 -79 -140 55 -48 -15 -15 -176 8 -95 -112 103
4722 103 115 -18 -121 62 11 -42 121 -39 14 -112 -146 6 -81 63 -114 -52 50 -106 -86 -131 75 197 73
4745 73 203 -29 99 -87 -42 25 -89 105 -27 41 -47 136 -100 3 89 -99 -69 16 91 -63 -124 -4 -121
4768 -121 -178 28 -124 17 106 -10 3 -31 154 -285 -36 142 -90 -57 82 -134 -109 -157 -70 -51 27 -12 -129 126
4792 126 -243 20 17 -188 53 -49 63 -77 89 189 -99 18 -46 4 0 -161 -24 80 12 81 22 70 -183
4815 -183 -19 57 83 56 -40 152 56 -41 -161 -7 130 -54 -77 16 32 -63 -53 64 -95 46 98 -109 117 99
4839 99 142 44 -99 29 17 -16 -65 -25 -105 -55 -24 52 112 0 -3 28 -53 -35 81 -46 -34 -54 77 -76 132 159 44
$$ packed form
4667c8Q5n0o5J1j8J11M0o9mq3j78K02m3k3K8L4j8K88m2p1K2k44n8L07l2j83M0
4694e1O0n9m2P2p1l2n6K40Lk4j6J8n8l3P3P0M5k18o1J95j03L3%j61J84j03j7K15
4722A03J2j33j03J83n1n3J63j60N3j26l4J52q7J44j77O2J02j56K0m5K06J22j24
4745G3J30k32J28j86M5O7j14J94j32O8q8J83k36J03Q6j88L0Q5P5j54o1J20j17
4768a21n7K06j52J41Q9j16J3l4J85m39K49J78k32L3J39k16K5m8Q7J9P8l9j17K55
4792A26l69K63lk05K41j02J12j40J66J00k88J17o4N0mj61J37J04o8O9n9M8k53
4815a83J64P6K6k7r6J92r6r7j20J54J37j84k3R3J6r5J0J17j59J41N2k07K26j8
4839I9M3r8j43J28j2l3m9M0q0N0L1P6O0j12lL1q1J8J16j27J2k0J31j53K08K7j15
$$ plain form
4866 44 -21 20 -151 -26 66 51 -12 69 -8 87 175 -32 -77 11 149 -62 174 18 37 9 -97 138 120 -89 82
4891 82 131 -45 125 -36 101 25 30 60 -147 -103 77 -35 31 -137 -3 58 -97 -37 88 -127 79 47 33 -63
4915 -63 151 -101 -2 122 88 19 -66 122 -75 194 70 -51 -37 -11 -34 12 -92 -21 -120 -80 32 2 12 81 73 -88
4941 -88 -53 -30 -55 87 119 38 74 40 -26 -75 12 43 -113 -147 94 -100 -37 -76 -101 83 -12 -48 132 66 -83 -76 -31
4968 -31 17 16 23 126 -42 13 37 8 79 99 115 1 211 125 -68 -157 -12 -12 -85 -178 -114 -17 37 110 105 86 -47 21 -89
4997 -89 -98 -29 37 104 0 7 -114 -81 186 -140 -69 104 187 -83 -136 -123 -20 -45 -4 61 -12 44 29 121 114 -107 64
5024 64 -14 86 71 -25 -50 135 -75 -3 -41 -95 -44 2 -9 19 -2 24 10 -142 49 -21 -54 -18 79 -137 124 -64
5050 -64 11 49 71 -10 5 217 -117 34 -28 -36 57 -65 -108 -222 173 -12 86 56 90 -99 -41 122 -53 -114 41
$$ packed form
4866D4o5M1j71J25R2j5o3Q1p7R5Q8k07m5Q8J38k11K36j56J9k8j06K35j8k09J71
4891H2M9j76J70j61J37p6NL0k07M4J80j12O6j68J34O1j55O0J25k15K06l2j4r6
4915f3K14k52R9J24l4o9q5J88j97K69j24j21J4K6k3M6j04P1r9M0J12l0J0O9qj61
4941h8L5K3k5J42L2q1L6l4o6m9Q7L1j56l4K41j94O3l9k5J84r5l6J80o6j49PM5
4968c1M8jPJ03j68N5K4k9P1K0J6j14K10q6j93q9J45%p3r3O4R7N4P3nj9j33O8j10
4997h9rO9O6O7j04Pj21L3K67l26P1J73Q3k70n3J3J03k5M1O5p3N6j5R2pk21J71
5024F4p8J00j5r6k5J85k10P2l8n4N1M6j1K8k1K6j4j52J91p0l3L6R7k16K61j88
5050f4P5L8K2q1J5K12l34J51o2qR3j22m3j14L95j85R8l0L4j89N8J63j75o1J55
$$ plain form
5075 41 -108 57 26 -75 28 -63 165 15 -17 110 -37 -61 -51 58 113 37 164 -90 53 -96 -24 -34 -52 -62
5099 -62 -50 -19 -123 99 114 39 63 -98 -95 78 13 10 -213 93 56 -90 34 -40 -36 17 23 -117 -16 125 83 34 88
5126 88 -9 -136 36 21 -136 -203 -114 -49 -183 75 -54 90 76 -4 39 -17 -4 -90 -78 -24 57 -4 -33 -5 -73 -2 71
5153 71 0 0 -4 4 56 -106 -16 -46 118 -92 178 -9 -69 7 -7 7 22 -24 -14 -69 -40 9 40 -102 28 62 -84 77
5181 77 3 -142 -43 -134 -119 51 -25 -51 -148 89 -95 49 -217 148 98 -38 118 -16 -53 -77 -132 -18 -39 -20 13
5206 13 22 -51 58 -163 1 -192 -54 -30 -29 39 25 6 65 66 -82 65 -181 -62 -151 -23 22 51 34 210 98 -81
5232 -81 74 114 16 26 -102 -97 -94 165 134 180 -5 -76 29 2 65 -57 71 39 57 136 86 36 79 -99 37 -6 103
5259 103 -58 153 -38 -23 54 -22 115 37 7 -11 86 29 33 -98 197 38 119 103 -33 44 79 -91 -27 89 18
$$ packed form
5075D1j49J65l1j01J03r1K28j50l2J27j47k4J0J09N5p6J27k54J43j49P2j0j8j0
5099f2J2L1j04K22J5p5K4j61LJ73o5lk23L06l7j46J24p4MN3Oj40J01J41m2m9N4
5126H8r7j27J72j5j57o7Q9O5j34K58j29J44j4q0M3n6J3q6J2N4Q1o1k9K8o8P1P3
5153G1p1%mQN2j62R0l0J64k10K70j87o0P6j4J4J5m6J0n5K9M9L1j42J30L4j46J61
5181G7p4j45R9r1J5J70p6k6r7K37j84J44k66L65n0j36J56j34l7k4n5J14k1J9L3
5206A3Rp3J09k21J64j93J38K4JO8j4j9N9Jj48J47k46J19q9J28M5K9j7J76j12j79
5232h1J55M0r8J0j28NLK59l1M6j85p1J05k7O3j22J28l2J8P9n0n0M3j78J36m3J09
5259A03j61K11j91J5P7p6J37p8l0j8R7n7Mj31K95j59Q1j6j36P7L5j70O4J16p1
$$ plain form
5284 18 25 99 43 -2 -220 77 81 -15 -49 50 -132 97 -55 -3 91 -43 -1 72 25 0 43 -45 -159 28 109 132 37
5311 37 91 -29 -112 102 -94 -41 -81 142 29 78 -189 144 77 133 -50 -64 27 -38 -77 21 58 -17 -59 -14 42 -16
5337 -16 120 126 82 48 -31 74 89 28 -27 11 -70 127 -137 -44 121 -136 150 -58 -97 -11 86 68 154 35 -36 200
5363 200 106 201 32 37 55 -66 -2 -128 52 -78 -234 -21 -67 -109 -1 -18 233 -26 -97 24 -53 -59 35 37 4 -37
5389 -37 187 -54 13 36 -32 65 44 -44 2 0 -59 24 3 117 -58 5 66 -84 110 60 204 98 45 -90 27 -10
5415 -10 4 105 -66 62 120 9 44 63 50 75 -74 60 -87 -23 -159 -61 -16 130 -145 -10 -56 11 12 26 -69
5440 -69 -35 17 -11 34 -31 -18 -204 93 -61 -88 84 -3 -26 -177 18 13 -125 109 -195 -125 -3 -89 -101 -67 19 -39
5466 -39 111 -45 69 33 -177 98 -3 151 -12 -117 -91 107 -30 -66 -34 64 -44 80 -57 -204 69 -58
$$ packed form
5284A8PP4n6m5k18K97Mr6l4R9j82K29j52N2R4j34M2P3m7k5M3q8j14J87Q1K3r5
5311C7N4j20q3K14j96N3m0K23j13M9k67L33o7N6j83j4R1o5l9R8L7p5m2M5N6n8
5337a6J36Om4l4p9J05J5o1n5L8q1J97k64R3J65k57K86k08l9Q6R7j8Q6j19p1K36
5363B00r4R5j69NJ8j21O4j26J80j30j56K13m6m2J08j7K51k59p1J21p7oR4Kl3m1
5389c7K24k41O7K3o8R7k1q8M6kn9Q3k1J14j75O3O1j50J94n0J44j06n3j35J17l7
5415a0J4J01j71J28N8j11L5J9j3K5j49J34j47O4j36R8M5J46k75J35m6O7JJ4r5
5440f9L4N2k8M5o5J3j86K97j54k7J72q7k3j51J95nj38K34l04P0J22q6j2L4Q6n8
5466c9J50j56J14l6k10K75j01J54j63j05K6J98j37l6L2R8j08J24j37j47K73j27
$$ plain form
5488 -58 -171 16 -185 -26 -70 101 -40 -91 -51 -79 -121 -19 66 -69 -38 150 -27 -66 -29 91 75 -22 -93 -46 -68
5513 -68 -140 31 -120 125 11 -73 98 -103 69 47 -126 193 -58 20 22 -34 -38 -21 -153 -49 80 -40 58 91
5537 91 89 -52 198 105 -14 -113 8 74 -12 -111 -288 37 -7 39 98 -84 -83 13 -16 -59 64 75 93 -46 135 79
5563 79 -7 106 20 14 -147 21 -29 30 -23 -155 24 -10 -76 -10 -160 -132 -95 -39 -70 -48 -63 -5 -16 -94 -103 -60 130 67
5591 67 25 -90 -117 0 -31 -190 -39 46 56 170 -197 -34 -57 0 -27 -100 -141 24 29 61 -35 -110 -40 75 -74 0
5617 0 23 -18 139 91 39 46 47 -41 -47 114 -126 42 56 27 -2 -8 -4 -47 0 30 72 32 105 77 -49 49 -2 10 -234 131
5647 131 154 8 -27 -142 64 87 -66 50 276 -100 53 -42 -30 66 -41 -68 9 143 -117 27 -16 -45 -144 -2
5671 -2 -75 -32 -116 118 34 108 -13 -80 -24 94 98 96 -16 -77 130 3 -87 11 -59 -124 199 81 -60 -99 -14 4 -178
$$ packed form
5488e8j13J87k01J59m4J71j41n1M0k8m2J02Q5j35L1J88j77l9L7J20j6r7p1M7k2
5513f8p2J71j51K45j14q4J71k01J72k2j73L19k51P8Kn6mJ7j32J04J29j20R8L3
5537I1kj41K50r3j19r9J21O6q6r9j77L25m4M6N9j82JR6k9m3J23J1J8j39J81n6
5563G9q6J13q6oj61J68n0N9n3j32J79l4o6O6j50K8L7N6l1K2j5N8j1p8rM3J90o3
5591F7m2j15k7J17l1j59J51Q5J0J14l67J63k3N7k7p3m1J65NL2r6p5P0J15j49P4
5617@K3m1J57m8n2PJq8oJ61k40J68J4k9k9oMm3M7L0M2m0P3k8j26R8n1J2k44L65
5647A31K3j46l5j15K06K3j53J16K26l76J53r5J2R6j07k7P7J34k60J44m3k9r9J42
5671bp3M3q4K34q4P4j21o7N6J18Mkj12o1K07j27r0R8p0o5L23j18j41l9Q5J8j82
$$ plain form
5698 -178 145 -65 9 197 90 -47 117 -62 126 -129 -158 179 -4 -66 -32 -1 -72 19 -110 -127 -62 -85 -81 -87 40
5723 40 -8 -27 -64 67 184 -24 135 134 -74 -53 -95 27 5 48 22 64 -52 -28 -87 -42 -130 -23 48 13 -42 192
5749 192 86 -24 32 -15 22 -23 151 8 157 -119 -64 66 85 11 121 -102 35 48 53 -51 82 -57 -25 30
5773 30 -112 -44 -37 -4 24 182 -39 -4 -23 120 137 -3 93 125 -117 95 -176 -98 9 -73 14 -8 -13 -69 -63 -192 -87
5800 -87 101 -213 105 47 -55 61 -165 139 -15 -58 11 181 94 71 153 29 13 3 129 -35 -38 -128 97 -232
5824 -232 -33 157 43 -155 -18 104 -221 -90 -96 -7 -35 -78 -109 35 -2 88 -24 -111 122 71 11 -31 -37 34 -61
5849 -61 -23 -145 -48 15 53 105 -155 55 28 -99 -207 -139 120 117 -311 -23 246 -37 -114 11 32 -44 -21 -3 52
5874 52 -91 -122 -53 62 72 -83 102 -13 -80 -126 2 62 -83 38 8 87 -41 -42 112 41 -77 -209 33 -23
$$ packed form
5698a78L23k10P4J88j07j37J64j79J88k55k9L37j83o2L4L1p1R1j29j7O5k3MoJ27
5723D0m8j9l7J31J17k08J59jk08K1m2J22k2M3k6M2j16K4n9M5q8J07P1l5n5K34
5749A92j06j10N6m7L7m5J74j43J49k76N5J30J9p4J10k23J37J3Nj04J33j39L2N5
5773C0j42O8PL3K8J58k21L5j9J43J7j40R6L2k42K12k71P8J07q2Q7k2nn6Oj29J05
5800h7J88l14L18n8j02J16k26L04j54m3O9J70q7k3Q2j24j6j0J26j64lr0K25l29
5824b32J99J90j14j98J37J22l25J31oQ9k8m3l1J44l7R0j12q7K33n1o0m2oP1r5
5849f1L8j22R7O3L8N2k60K10k7j27j08O8K59lm28K88K69k83p7J25K1p6K3J8N5
5874E2j43l1O9J15J0j55J85j15o7m6J28O0j45J21l0P9j28jJ54p1j18j32K42n6
$$ plain form
5898 -23 -4 -24 -69 -48 -19 68 67 16 -49 -49 -81 -36 -140 -16 98 122 -77 -105 25 -155 -59 -37 30 -91 13 63 -93
5925 -93 -82 254 -116 94 2 -111 46 -34 -162 95 -214 195 -1 -89 91 -49 -126 41 -45 9 -71 230 197
5948 197 43 -46 96 3 36 -87 -8 -39 144 24 73 -98 -141 142 -132 -2 -174 -22 121 -122 9 -59 -183
5971 -183 -110 -81 -132 -162 44 -40 -45 -175 -80 46 17 87 36 68 52 37 110 -6 -112 -102 79 169 -99 12 13 -104
5997 -104 -95 -60 59 -25 2 -6 -48 -2 43 -57 -111 -76 24 -51 1 -51 -27 26 -22 -29 59 -103 22 146 -56 -156 -10
6024 -10 -137 -15 -74 -66 -54 40 186 105 35 -116 -30 144 -18 52 18 70 112 96 -86 -30 92 -13 -216 -93 -147
6049 -147 98 113 -148 -128 -78 -36 -149 -12 77 -112 122 -53 262 21 -18 207 3 -118 -47 21 -58 -94 -153 65
6073 65 -22 88 76 -80 87 -5 158 -115 -21 -58 20 -174 -138 -88 -48 36 41 -25 281 36 -44 -91 -46 -11 -117 -126 129
$$ packed form
5898b3J9k0m5K1K9Q7jn1o5%l2M5j04J24J14K4j99k8J30j80R6K2O7j21J04N0j56
5925i3J1L36l70K10r2j13J57q0j28K57l09M09j96q8J80j40p7J67q6N4q0L01l3
5948A97j54q9J42r3L3j23P9l1J83j20M9j71m3K83k74J30j72J52J43k43J31o8j24
5971a83P3K9n1l0K06q4nj30R5J26k9P0n1L2j6j5P3j16j06J0J81R0k68J11Jj17
5997a04RL5J19q4K7qm2M6M5j00n4L5J00p5N2n2K4N3m8pQ8j62J25J24k02j00J46
6024a0j27J22n9QJ2R4J46q1p0j51Q6J74j62P0l4N2M2j6j82N6J22j05k03J23n4
6049a47K45J5k61K0N0M2j13J37Q9j89K34j75L15k41l9K25k04j21P1O8p9l6n9K18
6073F5q7J10j2j56J67r2J63k73R4l7P8j94L6N0M0Q4No6L06k45q0m7M5L5j06rK55
$$ plain form
6100 129 -109 -50 -100 -59 -31 32 52 75 127 -221 17 -138 -135 121 1 -30 207 -68 26 -1 111 57 -56 55 115
6125 115 41 -104 13 -185 -21 -203 63 -47 -16 -79 42 -144 67 24 -123 -50 -25 230 50 7 3 13 8 142
6149 142 13 -18 -70 -90 11 67 -93 159 124 148 105 -28 140 18 -7 -6 -34 67 -16 -207 30 69 -70 0 78
6174 78 104 106 16 61 30 16 -86 31 -33 36 98 -3 -4 -1 96 0 3 25 18 -99 -102 -34 -128 -57 93 -35 161 115 -36
6203 -36 -78 -4 -10 -35 -189 116 142 -95 15 -72 -238 64 7 -123 36 -60 -118 -124 -97 2 -46 9 7 58 63 -3 110 165
6231 165 100 37 112 167 -56 -61 46 -11 97 8 -140 21 -44 67 -34 -24 40 86 -113 142 -123 -36 3 68 54
6256 54 -17 -115 57 51 272 -20 70 182 -230 47 -134 -42 48 33 28 22 -102 65 37 -96 -11 4 49 -44 -80 23
6282 23 -74 -119 9 190 32 22 -100 -5 -82 102 -113 53 50 -70 98 -37 -157 -76 -81 184 -100 -16 -12 27 70
$$ packed form
6100A29k38N9n0M1K8O3K0K3N2l48K38j55LK56j20l1K37k75R4k7J12n4j13J11O0
6125A15p4j45J17j98J64j82K66j10L1o3J21j86K11m3j47P3K5K55j80m3mJ0nJ34
6149A42j29l1n2k0J01N6j60K52l5K4m3j33J68j22k5Jk8J01q3j91K37L9j39P0P8
6174G8K6Kr0M5l1j4j02J17o4O9O2j01jLR7r6LK2pj17lO8r4P1J50j28J96m6j51
6203c6m2P4ok5j54L05K6k37J10q7j66L02n7j30J59r6n8oK7R9m8N5kN1No6J13N5
6231A65o5o3P5N5k23nJ07n7J08q9j48J61o5J11j01J0O4M6j99K55k65Q7L9O5j4
6256E4p1r8J72oK21k92R0J12m12K77j81R2R0j5noj24J67k8j33Q5J5M5r3l6J03
6282B3r7m5J28J81j58j0j22R5p7J84k15J66lj20J68j35j20Q1nK65k84Q4ML9M3
$$ plain form
6307 70 -9 39 10 -44 -150 -8 85 9 -30 122 -97 -5 60 172 84 72 19 38 57 15 44 -42 -208 62 -53 31
6333 31 17 -21 86 -88 -50 58 -139 -28 261 -1 134 -195 23 81 109 54 80 -38 16 202 -129 -49 -102 -88
6357 -88 -47 -46 -140 34 161 42 47 129 -113 43 44 115 -24 38 -91 -48 94 -28 32 21 58 249 -35 95 -36
6382 -36 161 39 34 -84 -78 -113 -79 -68 -112 -123 8 57 -188 24 -76 68 -82 144 21 86 45 -98 -139 259 -27
6407 -27 -89 -12 -40 -4 104 -69 -23 27 -99 -73 -55 -42 -133 33 -108 -41 52 -18 135 80 65 114 29 -107 91 -198
6433 -198 -10 65 -52 54 61 -48 -47 -26 -64 -67 -27 40 70 -5 20 97 119 39 -30 -45 52 72 122 -21 -128 76 99 39
6461 39 -93 84 20 45 -50 -233 56 -13 -95 -63 2 -7 -41 -70 55 89 27 97 -96 303 72 -10 85 -28 -17 43
6487 43 9 211 -67 130 68 6 -53 -65 -26 -12 -44 -70 -44 -135 -111 50 184 89 94 64 191 18 -59 62 23 -91
$$ packed form
6307G0p9M8k9n4j06J42R3p6l9J52k19R2O5J12q8j2n3J9J9m2K9q6j66K70j15Q4
6333C1j4l8J07j74L8J08j97J11K89k62J35l29K18N8K8n5K6j18N4J86l31Q0n3J4
6357h8M1Jr4J74J27j19NQ2k42J56JP1j39O2j29M3J42j22O0j1L7J91k84J30j31
6382c6J97j22nj18Ol5L4J1m4j1J31M9k45K12j00J44j50K26j23O5m1j43m1L98k86
6407b7o2P7k8L6J08j73M6N0j26K6J8J3r1J66j41O7R3p0J53n5j5M9q5j36J98k89
6433a98J88P5j17J06Pj09JK1l8lM0O7L0p5K5P7K2q0o9j5R7K0N0j43j07K04K3o0
6461C9j32J77o4K5r5j83K89o9q2L2O5rl4k9J25L4o2P0j93L99k31q2R5j13J1O0
6487D3l4K02k78J97o2o2n9j2L9J4l2k6K6r1K4J61J34r5Nl0J27j73p7J21l9j14
$$ plain form
6513 -91 185 25 97 -35 -98 -117 37 -154 -22 -167 18 -135 23 -4 -17 230 44 101 31 -23 34 6 38 133
6537 133 -55 -102 8 -16 16 21 28 106 -98 47 -104 -47 147 8 -77 -104 -18 -108 -66 46 86 -16 -140 -157 -63 24
6563 24 7 85 -171 227 113 156 -194 -22 15 47 112 -20 -1 10 -83 20 -21 -28 -12 55 89 82 84 -3 29 64 58 21 -23
6592 -23 -23 126 -52 -66 151 24 -18 12 9 -39 19 65 -43 -75 137 135 -92 85 24 -175 -99 -32 -66 -87 12 -172 -27
6619 -27 23 -76 -62 -123 -51 19 63 106 -200 -91 -39 18 -4 7 -36 83 -89 -28 -15 -135 -171 -35 -82 49 -121 92
6645 92 -7 -1 -4 119 3 5 47 40 118 95 16 -8 68 -24 -22 -41 -215 -39 40 -24 -77 41 105 28 21 136 -125 -102 115
6674 115 -187 16 -109 106 77 -130 45 -127 34 5 90 29 53 -156 30 -165 78 -119 -57 -45 80 -63
6696 -63 -10 -104 -20 51 156 -39 -67 -57 -3 127 -142 89 79 164 37 25 93 -98 5 22 4 -18 -59 -65 -43 16 -75
$$ packed form
6513i1K76j60P2j32o3j9J54j91J32j45J85j53J58k7j3K47j86N7p0n4N7k8L2R5
6537A33j88m7J10k4L2NPP8k04J45j51N7J94j39q5k7Q6r0M2J12M0j02j24j7R4Q7
6563B4j7P8k56L98j14M3l50J72L7L2O5j32J9J1r3J03m1pJ6O7L4pKq7L2L5ol7m4
6592b3%J49j78j4K17j27m2L0lm8N8M6j08l2K12kk27J77o1j99P6O7l4k1R9j84J45
6619b7N0r9J4o1P2P0M4M3l06J09N2N7k2J1m3J19j72O1J3j20l6J36m7J31j70K13
6645I2r9OlJ23j16KM2pP8k3p9k4P6r2Kj9j74J76P9o4n3J18O4p7pJ15k61K3K17
6674A15l02K03j25K15k9k07J75j72J61k9Q5o1K4k09J86j95K43j97O2J2J25j43
6696f3N3r4Q4P1J05j95k8J0N4J30k69K31j0Q5j27j2O8j91J03J7j8k2m1oK2N9r1
$$ plain form
6723 -75 84 -156 43 -24 -121 -16 1 28 91 90 67 70 -41 -40 44 65 -17 14 -74 -14 -149 54 -53 -166 52 -90
6749 -90 -78 -76 16 15 -77 -53 -135 -4 -157 45 -120 -98 -19 -54 48 21 -82 -180 -66 -113 100 -103 -85 -88 56 91 147
6776 147 -7 -1 38 -129 17 -48 -10 50 109 184 -27 85 -98 61 -65 92 108 34 34 -15 -134 309 -28 -42 13
6801 13 -111 81 -62 -10 42 -158 46 7 101 125 5 34 115 121 -111 14 -152 7 111 5 -38 -173 -105 36
6825 36 -20 54 -9 98 -25 19 -58 -162 17 -45 -83 -142 -37 -57 -185 -5 -129 85 83 25 -93 -6 3 -48 62 81
6851 81 -117 5 -152 174 26 12 -6 -75 113 13 17 41 -128 -111 -22 -4 -31 -104 88 -96 28 26 225 -87 -52
6876 -52 7 87 -26 -136 -169 55 0 37 118 -81 -63 58 -92 -40 -36 19 82 -87 17 -45 126 110 5 33 -82
6901 -82 -116 54 -64 54 58 8 -37 48 64 -49 49 -57 11 39 36 -45 109 -71 -29 15 25 -15 -35 65 -126 -110 -103
$$ packed form
6723g5J59k40J99o7r7J05J7K7O3jk3Lj11JQ4K1q2L1q8O0j35K03j07j13K18j42
6749i0J2KR2jr2K4q2J31j53K02j65K2P9l5J02k7j03r8J14m7K13k03J8lJ44L5N6
6776A47j54OL9j67J46o5L8O0N9P5k11J12j83J59j26J57J6p4%m9j19M43l37j4N5
6801A3j24J92j43N2N2k00K04l9R4K4j20K9Q1Ok32J25j66J59J04j06m3j35O8J41
6825C6n6P4o3J07j23M4p7j04J79o2l8n9J05k0j28J80j24K14kn8j18Q7Rn1J10J9
6851H1j98J22j57L26j48j4j8o9J88j00MK4j69J7Q9J8k7p3J92j84J24kJ99l12L5
6876e2N9Q0j13j10l3K24n5L7Q1j99J8J21j50N2MN5O3j69J04o2J71j6j05K8j15
6901h2l4J70j18J18Mn0m5Q5J6j13R8j06O8K8lq1J54j80M2M4J0m0k0J00j91J6P
$$ plain form
6928 -103 191 44 -34 -19 -108 -6 100 -74 11 97 205 -18 23 49 43 39 -136 -119 -14 -16 28 146 156 -105 -11 0
6954 0 -8 34 -33 -90 71 -81 -7 18 -57 110 -50 -11 153 -236 -74 61 -23 -170 21 -75 -114 9 114 178 38
6979 38 -61 -25 81 111 -67 35 -18 11 116 31 64 -133 184 -45 4 -10 113 -64 176 -16 -39 22 -46 -45 -211
7004 -211 48 63 -5 -48 108 -47 -82 -80 88 -72 -101 -17 -126 103 -7 -84 7 64 -15 -10 5 23 -40 -221 8 -86
7030 -86 -28 7 -156 45 -5 8 158 -15 -151 45 42 118 -51 184 -56 38 -39 36 174 27 -132 54 -175 17
7054 17 77 -69 187 -18 -48 -75 -81 -51 -85 -123 -21 -151 5 174 69 246 62 95 -40 -35 -63 -27 -69 -18 -13 -174
7080 -174 -85 -84 -175 -19 -62 -62 20 -152 46 -78 81 116 -11 -38 -11 -34 -37 -69 -98 64 -49 -55 72 5 76 18 -85
7107 -85 -7 -89 145 25 -128 -182 -169 36 80 -152 -71 92 -51 -10 -122 -35 15 103 139 149 171 26 -159 153 33
$$ packed form
6928a03K94j47p8J5q9J02J06j74Q5Q6J08k23M1K6omj75J7J05kM4J18J0k61R4J1
6954@qM2o7n7J61j52P4K5p5J67j60L9J64l89J62J35q4j47J91r6l9J23J05O4j40
6979C8r9L6J06L0j78J02n3K9J05q5L3j97L17k29M9j4J23j77K40j92k3O1o8Jj66
7004b11K59J5o8m3J56j55l5KJ68j60k9Q4j09K29j10p7R1N7p9NJ5J8o3j81K29r4
7030h6N8L5j63K01n0J3J50j73j36J96lP6j69K35k40R4p7P5J38j47j59J86k29J92
7054A7O0j46K56k05l0k7oL0l4l8J02j30J56J69j05J77j84L3j35Nk8L6m2N1Nj61
7080a74Q9Jr1J56m3%Q2j72J98j24J59L5j27k7K7k3ll2k9J62j13oJ27o7P1n8j03
7107h5P8q2K34j20j53n4J3K05M4k32Q1J63j43M1j12Q7N0Q8L6J0K2j45j85L12j20
$$ plain form
7132 33 6 -88 2 166 -40 -135 -70 -85 -54 -26 13 43 -84 -109 1 -27 -44 99 36 40 1 -22 -70 -6 48 34 99 9
7160 9 -75 -72 -5 -37 -93 53 174 -141 -188 -191 -9 -102 15 62 -56 139 -65 -30 0 -138 31 -78 53 -32 -108 -34
7186 -34 -34 -24 98 -101 -122 -77 98 -156 -120 3 8 -72 -66 14 -22 32 65 -39 -26 -78 -65 100 51 160 19 81 3
7213 3 -141 50 -99 10 -33 125 44 -21 -44 -11 -82 -11 -33 64 13 -42 -64 -31 18 -44 -136 153 3 -24 46 124 3
7240 3 -37 39 30 -50 89 -63 107 128 -80 2 -63 -52 15 -70 -54 70 170 -8 -136 -24 -20 110 -19 49 106 134
7266 134 22 25 56 81 12 99 -45 -10 137 -15 6 111 -25 31 -51 -58 -57 -145 28 20 89 -132 62 71 130 140 -3
7293 -3 78 58 -79 -12 -43 -109 160 -5 131 -98 -26 49 52 -75 -102 -53 -56 -152 63 32 -13 17 -182 187 -115 161
7319 161 -78 240 -55 102 74 -116 -137 -20 123 -21 -14 9 165 55 27 97 73 -76 -101 32 46 139 -94 -176
$$ packed form
7132C3k7r4R0J64k06r5O5j5L1K8L9L0j27k5J10k8j7J43o3Ml9k3m8O4N4j4O5r0
7160Iq4LO7l2n6J46J21l15m7lJ82r3J17M7j18J95k04L5L0j38J69j09J31q5p6P4
7186c4%J0J22j99k1M5J75k54L6J23Nq0OQ0l6N4L3j04J3n2J3J65m9J09j41O2p8
7213Cj44J91j49J09m3J58q1o5k3L3p1P1k2R7n1n5k2L3M9o2r2K89j50k7P0P8j21
7240Cm0P6rq0J39j52J70K1k08Q2o5J1O7q5J6J24J00j78j28J12MJ30j29O8N7K8
7266A34j12LL1K5o9Q7j44L5J47j52K1J05j36N6q2pJq8J73qO9k21J94RN9J0j43
7293cQ1k0j37O7l1o6K69j65J36k29P2P5Lj27k7M9lr6K15l1m5L0j99L69l02K76
7319A61k39L18k95J57k8j90k1J17J43j44PK3J56j10k8P0k4j49k5J33J4R3k33q2
$$ plain form
7343 -176 3 -82 -13 -22 -88 -42 -35 69 188 4 -145 -99 133 7 41 -72 100 -71 -63 131 65 17 -154 84 -21
7368 -21 25 -61 81 72 152 -10 -93 110 118 84 -56 66 -8 66 59 0 -140 -94 75 -3 91 -33 108 7 -50 -88 -14
7395 -14 -85 -10 53 -41 35 -67 10 77 96 -38 -60 46 9 -80 25 68 90 93 99 -34 -17 -40 -39 41 -82 -70 -18 204
7423 204 29 -22 33 -123 -46 -39 -56 -138 3 110 -122 22 -87 -91 -76 7 57 -103 -31 -76 99 -49 -118 44 172
7448 172 45 -23 -140 56 -78 84 -74 -4 -62 28 -143 65 121 -120 -30 66 -14 82 -46 -58 29 115 -10 37
7472 37 28 1 -133 -47 52 -65 -106 -9 -131 -191 179 76 68 62 -22 -69 -45 129 -117 63 270 52 -92 90 45 -41
7498 -41 83 -54 -15 -97 -118 -54 165 -88 43 92 -15 63 58 -86 9 245 -9 -178 126 44 148 24 -144 69
7522 69 -5 -191 -5 -11 -116 -9 -160 -131 116 -2 47 4 161 115 -14 99 34 -7 -18 71 69 79 -65 -11 116
$$ packed form
7343a76J79q5O9ro6M6PJ04J19j84j49M6K32j26L4j13J72j71QJ94o6m8j71K38j05
7368b1M6q6J42rQ0j62q3K03Ql4j40J22p4P4pn9j40M6J69p8R4j24J41j01n7l8P4
7395a4p1P5O3r4P6j02P7O7J9j34k2J06l7q9J05M3K2LOj33J7k3JQ0j23J2N2K22
7423B04j75n1N5j56P7Pj7q2J41J07k32J44j09mJ5Q3N0j60P2m5J75j48o9J62J28
7448A72j27o8j17J96j34J62j58P0n8R0j71K08N6k41R0R6q0R6j28j2Q7Q6j25M7
7472C7rk7j34Q6R9j17m1R7j22o0L70j03qoq4m7K4J74k46J80K07k18j44J82m5q6
7498d1J24j37L9q2k1O4K19k53J31M9j07P8nj44R5K36k54j69L04q2J04j24j68K13
7522F9p4j86J86oj05J07j51K9K47j18M9m3J57m6j29J13o5m1j1Q9kJ0j44N4J27
$$ plain form
7547 116 63 -3 133 -79 27 56 -97 31 -244 -43 -155 3 -108 -200 -96 -76 2 -72 216 -35 -42 107 -64
7570 -64 -105 246 28 -57 161 -89 -13 101 15 15 19 -35 25 43 -107 141 -4 28 99 -3 28 -108 -58 -211 -24
7595 -24 -152 189 -81 -165 115 -4 -22 132 21 -55 -125 79 -20 59 41 -110 17 -61 -181 105 43 -147 136
7618 136 -32 38 117 -52 6 15 151 14 -49 40 76 -72 -27 -86 -138 -100 177 -78 154 -12 81 31 0 -76 52
7643 52 127 55 -73 -253 -80 -36 203 30 -137 -47 84 38 -194 -80 -46 31 -148 -48 61 65 -49 -58 -130 -22
7667 -22 84 31 -145 94 -9 211 -31 14 -50 131 59 21 -60 -38 -18 -22 -97 -33 -21 -111 41 0 -271 -114 -41 54
7693 54 -64 81 -35 -1 -11 33 32 -126 -36 -129 36 37 5 -10 -60 25 23 -14 57 -204 -77 -41 149 -126 136 87 -29
7720 -29 -7 -75 -115 -54 -266 -46 -51 -23 95 8 26 179 4 36 33 67 185 -90 -37 47 39 -73 -89 98 -148 19
$$ packed form
7547A16n3o6J36k12J06K9j53J28k75K01j12J58j11r2J04K0P8p4K88k51pJ49j71
7570f4m1L51k18q5K18k50P6J14q6%Mn4O0J8j50K48j45L2P1j02L1j36N0j53J87
7595b4j28L41k70q4K80j19j8J54j11p6p0K04r9P9j8j51J27p8j20K86o2j90K83
7618A36j68P0P9j69N8RJ36j37o3Q9L6j48M5n9n2L8K77k55K32j66R3n0l1p6J28
7643E2P5p2j28j80J73M4K39j73j67R0J31m6k32J14L4P7j79J00J09Mj14rp2J08
7667b2J06n3j76K39j03K20k42M5o4J81p2l8q1K2K0mp5O4J2r0J52m1k71J57P3R5
7693E4j18J45j16L4j0M4jj58R0r3J65Jl2j5n0Q5kl7P1k61J27L6J90k75K62m9j16
7720b9K2o8m0O1k12K20nK8J18q7J8J53j75L2lL4J18k75N3Q4qj12j6J87k46J67
$$ plain form
7746 19 -69 -83 -52 -111 -28 67 18 -10 191 -62 -112 -67 72 86 -30 14 -15 -15 -12 -98 12 49 -11 42 -87 155 231 -44
7774 -44 129 147 -92 68 32 -140 -85 70 -50 64 -229 11 -54 -11 -45 79 -100 73 -142 25 -50 186 11
7797 11 -120 9 15 -22 -53 86 165 68 -9 -40 -108 -76 -25 -213 11 -94 5 29 -224 -140 -94 -35 -57 -51 -100 41 -210
7824 -210 -114 18 -66 -40 98 -168 -87 -66 -13 -39 53 -23 -10 -32 -117 -46 -64 10 -72 -110 -64 -119 -94 -28 -24 -81 -13 234
7852 234 30 -96 -66 -120 -152 -17 66 92 24 -1 57 37 -3 78 16 1 193 -157 176 54 -97 162 55 169
7876 169 49 63 78 155 -64 106 31 149 219 105 108 128 -156 -110 -101 98 121 -30 -35 -393 54 -48 -77 -89 -19 -83
7902 -83 -82 -43 -14 117 76 26 13 -19 98 81 104 -111 13 -79 -16 17 -221 -94 -67 -8 9 74 -82 -21 126 -21
7928 -21 -25 -66 -22 -61 23 124 144 -58 149 -55 59 -19 3 81 -74 -104 -33 0 -176 40 45 38 -170 -44 -23 -173
$$ packed form
7746A9q8j4L1n9Q3R5m9k8K01k53n0M5J39J4j16M4k9%Lq6J10L7o0N3j29K42P6k75
7774d4J73J8k39J60l6j72N5J55j20J14k93K40o5M3l4J24j79J73k15J67p5K36j75
7797A1j31J29Ol7l1J39P9r7p7l1o8L2N1j88K24j05R9K4k53Q4M6N9k2Om9J41k51
7824b10R6J32q4K6J38k66Q1K1N3k6R2p6J3k2q5P1j8P4q2l8M6n5K5O6Mn7O8K47
7852B34k04j26L0n4l2J35Q3K6o8k5N8k0m0Q1o2j5J92l50L33j22j51K59j07J14
7876A69j20J4J5P7k19J70p5J18P0j14LK0k84M6RJ99K3j51nl58M47j02k9j2P0o4
7902h3JL9K9J31m1n0j3l2J17j7K3k15J24r2O3L3k38J27K7N9J7O5j56O1J47j47
7928b1mm1M4l9Q4J01K0k02K07k04J14p8K2P8j55l0P1L3j76K16Npk08J26K1j50
$$ plain form
7954 -173 55 -8 22 -25 -97 -140 46 17 13 148 -150 -6 -77 23 -62 144 -40 43 27 28 40 11 96 150 20 -53
7980 -53 -4 -77 35 122 75 -13 78 -116 65 -62 -26 109 10 90 -13 57 7 70 3 150 1 74 64 -152 94
8005 94 -41 -65 -93 6 -108 47 53 -31 81 -4 -48 142 32 -69 8 12 -37 -221 8 -38 -23 -21 -30 1 -17 43 -11 49
8033 49 116 -108 -26 -40 34 -47 -3 16 86 15 61 -46 -51 26 -110 20 -67 -43 -1 123 106 -13 -186 2 98 76 -39
8060 -39 -39 -102 112 -4 -46 -71 -53 41 -201 -48 -85 71 201 27 -43 170 -131 58 121 60 102 -1 72 -8 127
8085 127 104 52 -36 -97 31 18 -43 163 27 -85 126 161 175 -229 12 29 96 -28 -50 27 50 -306 69 123 -96
8110 -96 190 -103 -171 -33 59 42 -10 -187 -26 -140 -73 -80 113 145 -127 -107 -8 80 42 23 39 114 -7 -25 -95 53
8136 53 9 73 -35 67 -55 -22 75 67 73 -54 114 116 -142 30 -6 -22 93 45 46 122 79 52 -155 105 -81 96
$$ packed form
7954a73K28o3L0m7p2m3J86k9mJ35k98J44p1J00q5K06j84Q3j6JJ2k9Q5N4j30p3
7980e3M9p3J12Q7m7q8R1j94J81j27L6J35r9Q0j03P0n0O3o7J47j49P3j0k16K46
8005I4j35k4k8R9j14J55Oq4J12q5m4J90j10j01P7Mm9j84K29m6J5KrL1j8O0n4O0
8033D9O7k24Q2j4P4q1M4J9P0p1M6j07nP7j36J30q7K4M2J24j7j19j73J88R6k2j15
8060c9%o3K14j16m2k5J8R4k42J53l7J56J30j74p0K13l01J89O3o1M2j03P3q0J35
8085A27k3n2q8o1J28j3o1K06j36j12K11L5J4m04K41J7O7j24k2P7K3l56L75N4k19
8110i6K86k93o8J38R2j7n2j77J61j14O7pJ93L2k72K0R9Q8l8j9J6P5j21j8p0J48
8136E3m4O4j08J02j22L3R7qOj27J68Kk58J72l6j6J15m8JP6m3k7k07K60j86J77
$$ plain form
8162 96 -25 34 53 63 -40 -196 37 27 -9 67 116 -66 -70 -5 62 -117 -205 92 315 -50 37 78 -35 -15 38 -82
8188 -82 107 -187 3
$$ packed form
8162I6j21N9J9J0j03j56K33j0l6P6M9j82mO5O7j79q8K97K23l65Q7M1j13K0N3j20
8188h2J89k94J90
8191C
$$ Imaginary data points
##PAGE= N=2
##DATA TABLE= (X++(I..I)), XYDATA
$$ plain form
0 0 0 0 0 0 0 0 0 0 0 0 0 0 0 -8 8 -8 8 -8 16 -16 16 -24 24 -32 37 -41 48 -56 65 -77 88 -98 113 -128 144
35 144 -162 182 -203 229 -254 282 -314 348 -386 426 -470 519 -574 633 -696 767 -845 932 -1029
54 -1029 1135 -1258 1396 -1556 1742 -1960 2222 -2547 2957 -3488 4221 -5291 7012 -10239 18416
69 18416 -86927 -114903 50907 39602 -22936 -45094 36249 88884 82563 38611 1181 -36691
81 -36691 -23216 19798 37730 -26667 -89724 -40547 68664 68046 -31334 -87333 -25301 47081
93 47081 26591 -32211 -36028 -1700 35739 55584 49914 13451 -30619 -21921 32579 27444 -53773
106 -53773 -103102 -45871 42832 39876 -25610 -31731 25101 63650 47553 8339 -10730 -14058 -8828
119 -8828 14286 16770 -24178 -53360 -20190 39197 35877 -30066 -51879 -1654 39008 21055 -20781
$$ packed form
0@%%%%%%%%%%%%%qJ6j6J6j6K4l2L2m0M8n6O9p8Q9j04J21j42J65j86K11k41K72
35A44l06L44l85M32m83N36n96O62p34Q12q96R89j093J207j329J463j612J777j961
54a029K164k393K654k952L298l702M182m769N504o445P709r512J2303j7251K8655
69A8416j05343k7976J65810j1305o2538k2158Q1343N2635o321m3952l7430l7872
81c6691J3475M3014J7932o4397o3057M9177J09211o18r9380n5999O2032P2382
93D7081k0490n8802l817L4328L7439J9845n670l6463m4070Q698N4500n135q1217
106e3773m9329N7231Q8703k956o5486o121N6832L8549j6097l9214j9069l328N230
119h828K3114K484m0948k9182L3170N9387l320o5943k1813N0225M0662j7953m1836
$$ plain form
132 -20781 -23367 7337 19938 15300 8998 -5650 -16539 -5882 20545 24517 -13843 -34486 -117
145 -117 33418 18134 -21679 -29597 1075 15386 -1318 -13595 -10524 186 7802 10843 13336
158 13336 1240 -15139 -4231 14835 8459 -15116 -20677 5171 23010 8475 -5809 -2339 5794
171 5794 4983 -7069 -11840 -8306 -10398 -6189 7187 13307 10109 4662 11123 18963 4881 -13785
185 -13785 -16295 -12139 -11409 -16183 -14863 -398 7751 8850 12690 15393 14466 7459 -931 -238 -2018
200 -2018 -8495 -6782 -2205 959 1775 -113 3502 3428 -5362 -9173 -8098 -5330 -3758 -6712 -1523 8777
216 8777 11525 11514 9525 5308 3841 -291 -5009 -7612 -12474 -10808 -3896 740 4294 3302 3589 9913
232 9913 9722 3882 -1491 -5432 -3639 -2152 -4772 -4588 -4753 -2282 3440 2824 358 -636 -2150 1311
$$ packed form
132b0781k586L0704J2601m638o302j4648j0889J0657K6427L972l8360k0643L4369
145a17L3535j5284l9813p918L0672J4311j6704j2277L071J0710P616L041K493
158A3336j2096j6379J0908J9066o376k3575n561K5848J7839j4535j4284L470Q133
171E794q11j2052m771L534k092M209J3376O120l198n447O461P840j4082j8666
185a3785k510M156P30m774J320J4465Q149J099L840K703r27p007q390O93j780
200b018o477J713M577L164Q16j888L615p4q790l811J075K768J572k954N189J0300
216H777K748j1j989m217j467m132m718k603m862J666O912M636L554r92K87O324
232I913j91n840n373l941J793J487k620J84j65K471N722o16k466r94j514L461
$$ plain form
248 1311 2855 -555 -894 -502 3033 6238 2693 1045 1120 -177 1518 -439 -4135 -3259 -2854 -1366 214
265 214 -2301 -1519 -247 -42 2132 150 -1557 776 441 785 1375 -668 616 1422 572 1658 259
282 259 119 1945 310 386 805 -852 478 -93 -2187 -893 -1557 -1559 -746 -2721 -1225 -140 -765 998
300 998 232 -291 2508 1810 1473 1429 -367 681 990 -506 24 -1156 -476 2435 946 1035 1520 -172
318 -172 823 -319 -2951 -2958 -4117 -3054 -1197 -1926 468 2338 2296 4359 2625 500 855 -1318 -2280 -2300
336 -2300 -2762 151 2159 2876 4601 3594 3229 3147 -1401 -4249 -5455 -6647 -4043 -3143 -2848 523 3293
353 3293 6355 6902 2389 65 -984 -2515 -2364 -5416 -6816 -2150 2640 6079 6141 3306 4032 4452 2358
370 2358 -534 -6923 -8752 -4182 -923 1202 161 -1102 3740 7114 4583 -1181 -7216 -6044 -1686
$$ packed form
248A311J544l410l39L92L535L205l545j648P5j297J695j957l696Q76M05J488J580
265B14k515P82J272K05K174j982j707K333l35L44N90k043J284Q06q50J086j399
282B59j40J826j635P6M19j657J330n71k094J294o64kQ13j975J496J085o25J763
300I98p66n23K799o98l37m4j796J048L09j496N30j180O80K911j489Q9M85j692
318a72R95j142k632pj159J063J857p29K394J870m2K063j734k125L55k173r62k0
336b300m62K913K008P17J725j007l65q2m548k848j206j192K604R00K95L371K770
353C293L062N47m513k324j049j531J51l052j400M666M790L439O2k835P26M20k094
370B358k892o389j829M570L259K125j041j263M842L374k531n764o035J172M358
$$ plain form
385 -1686 -2194 -3182 -3516 -778 6743 9686 7448 2915 -1668 183 3074 -688 -6441 -9249 -3914 4963
401 4963 4123 -1013 -1968 313 4184 2969 -2439 -5251 -5685 -2293 3129 2217 -1905 -3159 936 8460
417 8460 6541 -2559 -3954 1291 5319 3200 -3256 -3660 -1025 -1033 -93 -1198 -3589 -3942 -1982 4447 7329
434 7329 12 -2947 2308 6607 2771 -6574 -7553 -1026 -941 -3272 -1626 1390 2896 1190 2467 6423
450 6423 2236 -5162 -3742 2363 4215 -1091 -2666 5946 8513 1409 -1827 -684 -2543 -10855 -16010
465 -16010 -7720 -1272 -5330 -5182 5752 17226 16735 8021 7191 9150 1488 -6917 -8275 -7426 -10812
480 -10812 -14303 -4309 9138 5313 -4799 -1888 10321 12177 -3241 -11870 -2529 5203 3187 1143
494 1143 3317 4739 980 1197 6497 -1443 -18895 -20656 -4127 8137 -1952 -13420 1466 24155
$$ packed form
385a686n08r88l34K738P521K943k238m533m583J851K891l762n753k808N335Q877
401D963q40n136r55K281L871j215n408k812m34L392N422r12m122j254M095P524
417H460j919r100j395N245M028k119o456m04K635qR40j105k391l53J960O429K882
434G329p317k959N255M299l836r345r79O527Q5k331J646L016J506j706J277L956
450F423m187p398J420O105J852n306j575Q612K567p104l236J143j859q312n155
465a6010Q290O448m058J48J0934J1474m91q714q30J959p662q405j358Q49l386
480a0812l491R994J3447l825j0112K911J2209J856j5418q629R341P732k016k044
494A143K174J422l759K17N300p940j7452j761J6529J2264j0089j1468J4886K2689
$$ plain form
508 24155 24400 9400 703 3272 3575 -3719 -6545 -10374 -19480 -18049 -1105 12624 4312 -13361
522 -13361 -6369 18092 21361 -652 -15793 -4352 12882 10464 -607 -2942 -2389 -527 5121 7789
536 7789 -2265 -19590 -17669 6800 15758 -3883 -19938 -5736 21062 21854 -1031 -10951 -1680
549 -1680 7186 5847 -1361 -7515 -12826 -9750 7102 14846 -2056 -19119 -8334 18605 21774 -4578
563 -4578 -18520 -2295 16151 12771 -4293 -11900 -5948 647 5624 6090 -4906 -14702 -6575 13429
577 13429 18105 -4564 -21276 -5765 15640 12116 -9482 -17728 -2285 12048 10885 3752 -2411
590 -2411 -3422 2471 10089 9104 -6595 -19988 -8792 11143 10462 -9174 -17852 -726 16318 9794
604 9794 -5604 -10090 -3512 4418 5906 2391 -3303 -6475 2236 14733 11857 -4470 -14519 -4699
$$ packed form
508B4155K45j5000q697K569L03p294k826l829r106J431J6944J3729q312j7673
522a3361O992K4461L269k2013j5141J1441J7234k418j1071k335N53J862N648K668
536G789j0054j7325J921K4469Q958j9641j6055J4202K6798P92k2885r920R271
549a680Q866j339p208o154n311L076J6852P744j6902j7063J0785K6939L169k6352
563d578j3942J6225J8446l380j7064p607N952O595M977M66j0996r796Q127K0004
577A3429M676k2669j6712J5511K1405l524k1598q246J5443J4333j163p133o163
590b411j011N893P618r85j5699j3393J1196J9935o81j9636q678J7126J7044o524
604I794j5398m486O578P930J488l515n694l172Q711J2497k876j6327j0049R820
$$ plain form
618 -4699 9666 3254 -13492 -15039 -1810 10171 8535 1204 147 2607 6200 8593 2553 -8010
632 -8010 -12597 -6055 4469 2539 -8699 -9536 2135 11366 7231 -3466 -4255 2390 5254 3980 133
647 133 -2881 -1449 2509 6264 3966 -5025 -7415 -1475 2471 -1211 -8811 -8111 855 5427 3129 347
663 347 141 3876 5282 3263 889 -2977 -3660 -275 1400 -481 -4068 -3538 2362 4358 1023 -1540
679 -1540 -1323 1582 2644 -280 -1817 -1291 -665 907 200 -1242 -1531 -1766 371 1562 -765 -1475 -103
696 -103 1749 2418 335 -600 1128 1142 1342 345 -1130 75 443 -101 126 -1072 -1003 -59 -255 -373 -1113
715 -1113 -1629 64 332 -522 -173 -466 473 1394 347 364 334 352 1323 506 -136 365 -297 626 777 -416
735 -416 -179 -62 -243 251 -756 -1459 -693 -1083 -281 -384 -1044 111 499 608 1240 206 432 896 133
$$ packed form
618d699J4365o412j6746j547J3229J1981j636p331j057K460L593K393o040j0563
632h010m587O542J0524j930j1238q37J1671R231m135j0697p89O645K864j274l847
647A33l014J432L958L755k298q991k390N940L946l682p600P00Q966M572k298k782
663C47k06L735J406k019k374l866o83L385J675j881l587N30N900J996l335k563
679a540K17K905J062k924j537N26O26J572p07j442k89k35K137J191k327p10J372
696a03J852O69k083r35J728J4K00r97j475J205L68n44K27j198O9R44j96j18p40
715a113n16J693K68q54L49k93R39R21j047J7l0J8R71q17o42N01o62R23J51j193
735d16K37J17j81M94j007p03P66l90Q02j03o60J155L88J09O32j034K26M64p63
$$ plain form
754 133 130 -167 -365 416 472 797 1264 603 777 269 -693 -678 -1519 -2327 -1342 -1620 -1086 153 477 1299 1654
775 1654 1112 1615 737 -568 -504 -1393 -1110 -609 -775 295 961 1216 1911 1285 657 433 -866 -626 -763
794 -763 -1658 -755 -445 32 752 126 149 -80 -1187 -971 -1205 -1677 -437 -322 362 2038 2124 2396 2354 1193
814 1193 1146 209 -1067 -1068 -2365 -2378 -956 -953 -412 -77 -288 1029 1174 584 60 -804 -264 656 -119 -297 -839
835 -839 -590 1201 1074 -69 -491 -749 744 1690 355 -436 -762 286 2055 792 -999 -1415 -973 1038
853 1038 1155 -1327 -2309 -1480 384 1268 -950 -2285 -1405 514 2836 2279 -130 123 1899 3765 3092
870 3092 -1218 -3613 -2037 258 689 -2406 -3798 -847 2154 3381 1715 -1298 -1454 390 1464 799
886 799 -3320 -4656 -765 3310 3414 -88 -2506 854 3966 2297 -1549 -4174 -2680 909 1866 1440
$$ packed form
754A33lk97j98P81N6L25M67o61J74n08r62J5q41q08R85k78N34J239L24Q22L55
775A654n42N03q78j305O4q89K83N01j66J070O66K55O95o26o28k24j299K40j37
794g63q95R03L10M77P20o26K3k29j107K16k34m72J240J15O84J676Q6K72m2j161
814A193m7r37j276jj297j3J422LN41L35k11J317J45n90n24q64N40R20p75j78n42
835h39K49J791j27j143m22k58J493R46j335p91l26J048J769j263j791m16M42K011
853A038J17k482r82Q29J864Q84k218j335Q80J919K322n57k409K53J776J866o73
870C092m310k395J576K295M31l095j392K951L001J227j666l013j56J844J074o65
886G99m119j336L891M075J04l502k418L360L112j669l846k625J494L589R57m26
$$ plain form
902 1440 -252 -1173 2250 5129 3228 -2019 -5807 -2958 1286 -623 -4679 -4868 -622 4321 3845 1695
918 1695 973 622 1693 2680 1008 -2591 -4894 -1809 3933 3024 -2067 -3108 999 4541 1510 -3697
934 -3697 -3399 -1134 -108 287 35 108 -472 460 4059 4213 -1395 -4347 -1528 2548 822 -4839 -3767
951 -3767 1758 3083 1526 603 1734 2161 30 242 2154 -443 -3928 -2938 1195 2308 -2604 -4238
967 -4238 705 2916 -50 -2388 -522 2282 -1 -2019 1373 3216 138 -1819 739 4111 1652
982 1652 -3147 -1363 2260 956 -2201 -2051 986 290 -3426 -1135 3054 1090 -3176 -2160 3395 4444
998 4444 -1689 -3804 724 3063 356 -2190 -955 1141 -590 -711 2872 2346 -2051 -3101 1920 5159
1014 5159 -723 -6642 -2421 3790 3477 -1769 -3428 971 2557 465 207 -29 -2723 -3593 -132 3798
$$ packed form
902A440j692r21L423K879j901n247l788K849M244j909m056j89M246M943m76k150
918A695p22l51J071R87j672l599k303L085N742r09n091j041M107L542l031n207
934c697K98K265J026L95k52P3n80R32L599J54n608k952K819M076j726n661J072
951c767N525J325j557r23J131M27k131K12J912k597l485R90M133J113m912j634
967d238M943K211k966k338J866K804k283k018L392J843l078j957K558L372k459
982A652m799J784L623j304l157J50L037o96l716K291M189j964m266J016N555J049
998D444o133k115M528K339k707k546J235K096j731j21L583n26m397j050N021L239
1014E159n882n919M221O211l13n246j659M399J586k092k58k36k694q70L461L930
$$ plain form
1030 3798 323 -5950 -3029 5511 7112 80 -4936 -444 5385 2789 -1752 -2786 -1971 -529 1062
1045 1062 2206 -25 -5000 -3666 3347 5204 -1475 -7344 -3213 5577 5130 -1824 -3995 189 4423
1060 4423 3617 752 -1148 -2795 -2166 2346 3153 -1749 -6126 -2728 5270 6027 -1844 -5518 -950 4969
1076 4969 3966 -1903 -4344 -1741 489 1964 1463 -1865 -3733 -1418 4102 4656 -1882 -5524 -637
1091 -637 5170 4507 -1864 -4364 181 3727 2744 -192 -3026 -2204 172 1981 1679 -2724 -5031 -935
1107 -935 3714 3022 -2037 -4673 406 4446 2354 -1257 -2700 -362 2541 2279 294 -1894 -2360 710
1123 710 3104 1634 -1756 -3409 -219 3509 1250 -2533 -3067 -278 2116 1018 -1422 -1791 -1080 1052
1139 1052 2108 190 -1171 -1326 766 2568 830 -1762 -1228 736 2320 973 -1597 -1023 189 1219
$$ packed form
1030C798l475o273K921Q540J601p032n016M492N829k596m541j034Q15J442J591
1045A062J144k231m975J334P013J857o679n869M131Q790m47o954k171M184M234
1060D423q06k865j900j647O29M512Q07m902m377L398P998P57p871l674M568N919
1076D969j003n869k441K603K230J475n01l328j868K315N520N54o538l642M887
1091f37N807o63o371k500M545L546r83k936k834Q22K376J809l02m403k307M096
1107i35M649o92n059k636N079M040k092l611j443K338K903k62j985k188m66L070
1123G10K394j470l390j653L190L728k259l783n34K789K394j098k440l69P11K132
1139A052J056j918j361j55K092J802j738k592N34J964J584j347k570N74J212J030
$$ plain form
1155 1219 1057 -677 -1246 -553 414 951 -239 -1921 -1022 396 687 17 -1470 -472 958 1038 445 -395
1173 -395 -358 879 998 561 261 -573 167 1021 225 -140 -707 -481 571 -297 -855 -895 -698 305 162 -638
1193 -638 -142 -281 379 732 55 -24 169 322 861 196 -302 132 499 566 430 -389 -157 92 -161 -188 -583
1214 -583 -878 -289 -125 -28 -34 -602 139 451 196 366 -55 25 551 39 47 106 -100 453 118 171 522 43 28
1237 28 416 -105 -151 -347 -475 104 -302 -525 29 -339 -189 69 -126 169 -98 -195 70 -114 365 613 10
1258 10 433 806 385 795 324 -110 214 -205 -170 -245 -906 -609 -191 -125 93 -331 -323 66 3 98 130 -532 81
1281 81 292 138 441 158 202 828 464 321 -2 -308 171 3 -212 -184 -317 -116 197 -92 145 -217 -764
1302 -764 -7 -158 -180 -327 -359 -132 392 32 253 211 -123 354 226 439 463 -243 26 460 199 272 -237 -373
$$ packed form
1155A219j62j734n69O93R67N37j190j682Q99J418K91o70j487R98J430Q0n93q40
1173c95L7J237J19m37l00q34P40Q54p96l65n67K26J052q68n58m0J97J003j43q00
1193f38M96j39O60L53o77p9J93J53N39o65m98M34L67O7j36q19K32K49k53k7l95
1214e83k95N89J64R7on68P41L12k55J70m21Q0N26n12QN9k06N53l35N3L51m79j5
1237B8L88n21m6j96j28N79m06k23N54l68J50K58j95K95k67r7K65j84M79K48o03
1258A0M23L73m21M10m71m34L24m19L5p5o61K97M18O6K18m24QL89o3R5L2o62O13
1281H1K11j54L03k83M4O26l64j43l23l06M79j68k15K8j33K01L13k89K37l62n47
1302g64P57j51k2j47l2K27N24l60K21m2l34M77j28K13K4p06K69M34k61P3n09j36
$$ plain form
1324 -373 117 -73 -247 -436 -985 -313 268 66 162 -647 -456 569 516 434 -265 -492 700 1239 655 5
1344 5 -537 -101 875 513 -530 -1097 -796 328 709 -208 -771 -1019 207 1182 339 -821 -1368 -612 1288
1363 1288 816 -828 -1004 -164 1627 1668 -252 -853 -470 526 1381 428 -860 -1229 78 1897 1483 -1295
1381 -1295 -1995 -567 1241 950 -1739 -2569 -765 977 1191 -85 -1117 -262 701 1968 1538 -1291 -1908
1398 -1908 105 2160 1710 -1408 -2390 380 2372 1287 -1071 -2118 -583 767 569 195 -1264 -1756
1414 -1756 194 2115 1596 -1615 -2939 0 2651 1246 -1949 -2387 608 2528 1307 -215 -371 -149
1430 -149 715 1190 740 -1065 -2643 -387 2328 1090 -2214 -2552 424 2590 595 -2300 -1403 223
1446 223 1126 417 3 -12 -337 -174 1934 1598 -1093 -2293 -288 2560 1126 -2014 -1328 1518 2108 209
$$ packed form
1324c73M90j90j74j89n49O72N81k02R6q09J91J025n3q2o99k27J192N39n84o50
1344En42M36R76l62j043n67L01J124L81r17n63k48J226R75q43j160n47P56J900
1363A288m72j644j76Q40J791M1j920o01L83R96Q55r53j288l69J307J819m14k778
1381a295p00J428J808k91k689q30J804J742K14j276j032Q55R63J267m30k829o17
1398a908K013K055m50l118r82K770J992j085k358j047J535J350j98l74j459m92
1414a756J950J921n19l211j324K939K651j405l195m38K995J920j221j522j56K22
1430a49Q64M75m50j805j578K256K715j238l304l38K976K166j995k895Q97J626
1446B23R03p09m14j5l25J63K108l36k691j200K005K848j434l140O86K846N90j899
$$ plain form
1464 209 -1082 -214 121 -985 -540 328 -457 -1620 -918 1674 1768 -1202 -1568 1040 1925 83 -1630 -156
1482 -156 1541 438 -888 547 1004 63 -1167 -267 1243 -476 -2167 -584 1196 600 -1148 -683
1498 -683 1461 969 -1139 -718 726 287 -1444 -1487 793 1439 -656 -917 837 1767 541 -874 403
1515 403 1180 -322 -846 544 570 -904 -1849 288 1690 -629 -2330 -768 1210 901 -1052 -1108 750
1532 750 993 319 555 736 69 -784 345 1693 130 -2033 -1207 1287 1772 -665 -2090 10 1638
1549 1638 573 -439 -782 -354 -112 -41 596 64 -1703 -1008 910 1716 -263 -2234 -480 2061 1597
1566 1597 -461 -1030 184 1221 829 336 -137 -734 -436 833 806 -546 -1859 -1051 1409 1324 -1029 -1802
1584 -1802 -414 1533 904 -722 -679 -210 509 1137 749 -281 -847 -227 1374 1190 -824 -1430 -185 1192
$$ packed form
1464B09j291Q68L35j106M45Q68p85j163P02K592R4k970l66K608Q85j842j713J474
1482a56J697j103j326J435M57r41j230R00J510j719j691J583J780n96j748M65
1498f83K144m92k108M21J444m39j731m3K280O46k095k61J754R30j226j415J277
1515D03P77j502n24J390K6j474r45K137J402k319j701J562J978l09j953n6J858
1532G50K43o74K36J81o67q53J129J348j563k163Q26K494M85k437j425K100J628
1549A638j065j012l43M28K42P1O37n32j767O95J918Q06j979j971J754K541m64
1566A597k058n69J214J037l92m93m73n97K98J269k7j352j313Q08K460q5k353p73
1584a802J388J947o29j626M3M69P19O28l88j030n66O20J601j84k014o06J245J377
$$ plain form
1602 1192 902 -1092 -1346 -12 712 511 -293 -815 -278 -150 497 480 -747 -1174 101 1050 669 -725
1620 -725 -911 615 1122 650 87 -493 268 686 269 28 -539 -709 250 395 -6 -666 -1114 -54 325
1639 325 -272 -599 -443 264 824 340 248 154 256 697 432 -121 -597 -444 -94 187 -501 -216 14 453 538
1660 538 48 -249 293 150 7 -132 -397 -331 -452 -98 -95 -341 -457 50 47 98 -63 91 602 788 629 664
1682 664 436 450 277 -233 -386 -433 -758 -363 -481 -723 -544 -223 443 362 -98 143 441 425 621 -139 98
1703 98 247 198 -7 -265 -306 -80 -190 -213 202 20 32 776 502 368 129 -142 29 -271 -746 -724 -697 -418
1725 -418 -141 -263 274 -3 235 613 375 140 171 -16 298 372 -41 224 356 295 58 -365 -368 -247 -555 -444
1747 -444 -310 -292 199 167 346 544 67 -19 427 -241 -459 -580 -357 259 133 268 571 550 736 734 369 72
$$ packed form
1602A192k90j994k54J334P24k01q04n22N37J28O47j7j227m27J275R49l81j394
1620g25j86J526N07m72n63n80P61M18m17k41n67j70R59J45m01o60m48J060L79
1639C25n97l27J56P07N60m84r2r4J02M41k65n53m76J53L50K81o88K85K30M39Q5
1660E38m90k97N42j43j43j39k65O6j21L54Lk46j16N07lN1j61J54N11J86j59L5
1682F64k28J4j73n10j53m7l25L95j18k42J79L21O66q1m60K41K98j6J96p60K37
1703I8J49m9k05k58m1K26j10k3M15j82J2P44k74j34k39k71J71l00m75K2K7K79
1725d18K77j22N37k77K38L78k38k35L1j87L14P4m13K65J32o1k37m23lJ21l08J11
1747d44J34J8M91l2J79J98m77q6M46o68k18j21K23O16j26J35L03k1J86kl65k97
$$ plain form
1769 72 -479 -673 -264 -561 -649 -577 -206 670 334 -74 94 168 53 -70 -450 -235 -52 -37 548 368 142 81
1791 81 37 187 131 -506 -572 -115 194 286 259 192 631 291 101 -54 -618 -702 -764 -529 -78 -417 -291 199 611
1814 611 647 466 410 574 473 412 167 -207 -231 68 -14 23 -338 -745 -408 -205 57 -236 -496 -95 520 516 374
1837 374 -70 -181 158 269 -32 -286 -662 -468 202 215 517 -180 -304 540 675 424 -398 -535 197 628
1857 628 212 -264 -757 -291 122 -176 -661 -896 -892 71 688 466 56 -259 658 1575 770 -327 -734 -199
1877 -199 653 163 -549 -719 -212 539 808 147 -614 -677 -207 760 122 -1001 -1070 107 1367 1058 -507
1896 -507 -467 164 529 468 -587 -994 -575 97 1025 957 -151 -410 669 1571 807 -1186 -1601 -238 654
1915 654 -27 -1162 -826 76 657 556 294 -336 -761 301 918 804 -745 -1000 790 1726 738 -700
$$ packed form
1769G2n51j94M09k97q8P2L71Q76l36m08J68P4j15j23l80K15J83J5N85j80k26o1
1791H1m4J50n6o37o6M57L09R2k7o7M39l40j90j55n64q4o2K35M51l39J26M90M12
1814F11L6j81n6J64j01o1k45l74k4K99q2L7l61m07L37K03K62k93k60M01O15mj42
1837C74m44j11L39J11l01k54l76J94O70J3L02o97j24Q44J35k51q22j37P32M31
1857F28m16m76m93M66M13k98m85k35MR63O17k22m10l15R17R17q05j097m07N35
1877a99Q52m90p12j70N07P51K69o61p61o3M70R67o38j123o9J177J260l09j565
1896e07M0O31L65o1j055m07M19O72R28o8j108k59J079R02p64j993m15J363Q92
1915F54o81j135L36R02N81j01k62o30m25J062O17j14j549k55J790R36r88j438
$$ plain form
1933 -700 -833 402 818 -256 -803 -731 -350 100 344 330 -290 -735 392 1313 527 -1108 -1473 157 1150
1952 1150 -89 -971 -641 555 686 243 -38 257 -317 41 988 454 -415 -906 325 1278 113 -1309
1970 -1309 -897 157 318 -603 -955 -345 56 -108 168 426 24 -145 159 980 448 -798 -545 552 662
1989 662 8 -817 -45 654 -201 -358 -30 119 -191 -335 98 412 -359 -583 76 495 -82 -726 -274 429
2009 429 195 -470 -67 364 612 -209 -275 485 315 -93 -124 314 125 -227 -388 138 197 -389 -362 180 349
2030 349 -249 -687 158 487 -133 -400 1 350 357 -38 -73 311 48 153 172 157 -12 -654 -109 486 -24 -752
2052 -752 -337 182 455 -236 -473 133 286 -28 -240 -229 -37 -12 -60 443 99 -392 -137 295 507 164 -346
2073 -346 160 478 400 -147 57 -97 8 -55 -42 -50 -751 -725 -192 88 -380 -639 -72 563 688 187 59 174
$$ packed form
1933g00j33J235M16j074n47P2L81M50K44j4o20m45J127R21p86j635l65J630R93
1952A150j239q82L30J196J31m43k81K95n74L58R47n34q69m91J231R53j165j422
1970a309M12J054J61r21l52O10M01j64K76K58m02j69L04Q21n32j246K53J097J10
1989F62o54q25P72O99q55j57L28J49l10j44M33L14p71k24O59M19n77o44M52P03
2009D29k34o65M03M31K48q21o6P60j70m08l1M38j89l52j61N26N9n86K7N42J69
2030C49n98m38Q45L29o20k67M01L49Pl95l5L84k63J05J9j5j69o42N45N95n10p28
2052g52M15N19K73o91k37O06J53l14k12J1J92K5m8N03l44m91K55M32K12l43n10
2073c46N06L18p8n47K04j54J05o3J3qp01K6N33K80m68k59N67O35J25n01j28J15
$$ plain form
2095 174 556 41 -22 -131 -226 -201 -137 -17 -201 -491 -184 383 246 -51 -82 233 302 340 -253 125 -197 -419
2117 -419 -215 -351 -312 -304 -285 -146 406 140 330 582 757 599 231 213 267 -232 -346 -85 -232 -305 -474 -503 -164
2140 -164 -300 -187 -242 -24 239 237 354 587 328 361 287 -16 -27 -363 -714 -94 -111 -223 -43 21 372 464 308
2163 308 191 -109 -216 72 -184 -177 -363 -397 -16 268 10 53 -140 115 68 -205 -139 28 -8 431 272 234 95
2186 95 40 146 149 -151 -404 -251 -360 47 -44 -187 115 240 194 230 8 -233 -307 -388 -39 -129 -228 329 412 611
2210 611 506 404 505 367 -92 -255 -461 -418 -312 -559 -269 -272 -324 155 157 131 14 -112 291 514 272 196 99
2233 99 41 136 14 -225 -386 -521 -145 -198 -212 -145 165 496 749 351 231 406 435 82 -262 -768 -400 -348 -500
2256 -500 -513 -556 -377 -10 58 466 379 211 669 786 537 533 36 1 357 -262 -615 -727 -485 -394 -435 -213 -148
$$ packed form
2095A74L82n15o3j09r5K5O4J20j84k90L07N67j37k97l1L15O9L8n93L78l22k22
2117d19K04j36L9QJ9J39N52k66J90K52J75j58l68j8N4m99j14K61j47p3j69k9L39
2140a64j36J13n5K18K63kJ17K33k59L3p4l03j1l36l51O20j7j12J80O4L51R2j56
2163C08j17l00j07K88k56Pj86l4L81K84k58M3j93K55m7k73O6J67l6M39j59l8j39
2186I5n5J06Ll00k53J53j09M07r1j43L02J25m6L6k22k41p4q1L49r0r9N57Q3J99
2210F11j05j02J01j38m59j63k06M3J06k47K90ln2M79Kk6j17j26M03K23k42p6r7
2233I9n8R5j22k39j61j35L76n3j4O7L10L31K53l98j20J75K9l53l44n06L68N2j52
2256e00j3m3J79L67O8M08q7j68M58J17k49mm97l5L56o19l53j12K42R1m1K22O5
$$ plain form
2279 -148 -148 263 415 342 145 39 148 363 266 78 -244 -30 115 76 -263 -88 -220 -74 181 16 265 261
2301 261 210 619 456 22 -37 -287 -87 -109 -595 -681 -366 -212 -55 46 29 369 363 428 367 75 -94 14 173
2324 173 111 104 -80 105 63 124 -7 -414 -347 -207 -404 -169 -179 -165 171 205 226 115 -89 34 120 130 -47 -337
2348 -337 -214 156 303 555 -86 96 193 224 293 23 -268 -453 9 124 192 -295 -446 317 262 3 -146 -513
2370 -513 -116 164 -104 30 -324 -69 306 371 370 91 -356 102 651 -99 -383 -459 11 580 -30 -443 -156
2391 -156 -156 158 115 -194 -112 -409 -163 386 157 -218 -354 116 714 121 -271 -325 163 239 171 -39 -147 -87 9
2414 9 345 264 -284 -383 -11 381 211 -635 -417 231 475 32 -362 -137 163 195 131 28 -71 -27 322 447 449
2437 449 -283 -275 136 512 117 -559 -514 121 320 -137 -200 -389 -4 -9 8 141 -216 -278 245 352 255 -188 -413
$$ packed form
2279a48%M11J52p3j97j06J09K15r7j88l22K14J45l9l39J75j32J46K55j65K49m
2301B61n1M09j63m34n9k50K00k2m86q6L15J54J57J01j7L40oO5o1k92j69J08J59
2324A73o2pj84J85m2O1j31m07O7J40j97K35j0J4L36L4K1j11k04J23Q6J0j77k90
2348c37J23L70J47K52o41J82R7L1O9k70k91j85M62J15O8m87j51P63n5k59j49l67
2370e13L97K80k68J34l54K55L75O5jk79m47M58N49p50k84p6M70N69o10m13K87
2391a56%L14m3l09Q2k97K46N49k29l75j36M70N98n93l92n4M88P6o8k10j08O0R6
2414IL36q1n48r9L72L92j70q46K18O48K44m43l94K25L00L2o4j03r9M4L49J25K
2437D49p32QM11L76l95o76M5O35J99m57o3j89L85nJ7J33l57o2N23J07r7m43k25
$$ plain form
2460 -413 354 703 -27 -303 -97 239 260 -240 -110 33 -174 11 228 -24 -339 -459 99 506 -172 -543
2480 -543 -166 358 287 -1 -180 112 233 211 118 177 137 -209 118 346 -48 -482 -101 229 295 -150 -532 -71
2502 -71 122 -62 -188 1 -114 81 -233 220 -132 -66 -120 -8 179 85 -112 199 472 216 -241 110 112 323
2524 323 -45 -191 137 -175 -319 -289 -113 -172 -278 -175 200 -7 -312 -44 317 372 131 -159 313 387 117
2545 117 89 -82 -48 -192 -162 -113 -103 -259 -35 70 274 20 -113 204 470 -27 -158 -122 -108 88 -173 6
2567 6 27 -152 -104 -41 119 255 -159 22 419 302 46 -14 57 270 82 -159 -222 -14 -228 -375 -356 -204 -190
2590 -190 -218 298 238 48 203 180 334 204 -68 -119 -11 -47 -90 7 -74 179 -143 39 159 19 -113 -242 -27
2613 -27 -3 -210 -126 -37 178 56 -156 33 184 -38 -13 203 -58 -50 9 75 188 53 -252 -51 104 130 1
$$ packed form
2460d13P67L49p30k76K06L36K1n00J30J43k07J85K17k52l15j20N58M07o78l71
2480e43L77N24p1k88j79K92J21k2r3N9m0l46L27K28l94m34L81L30O6m45l82M61
2502g1J93j84j26J89j15J95l14M53l52O6n4J12J87r4j97L11K73k56m57L51KK11
2524C23l68j46L28l12j44L0J76n9j06J03L75k07l05K68L61N5k41k90M72P4k70
2545A17k8j71L4j44L0M9J0j56K24J05K04k54j33L17K66m97j31L6J4J96k61J79
2567FK1j79M8O3J60J36m14J81L97j17k56o0P1K13j88k41o3K08k14j47J9J52J4
2590a90k8N16o0j90J55k3J54j30k72n1J08l6m3R7q1K53l22J82J20j40j32j29K15
2613b7K4k07Q4Q9K15j22k12J89J51k22K5K16k61QN9O6J13j35l05K01J55K6j29
$$ plain form
2636 1 -70 68 229 138 57 -42 107 13 -4 27 -124 -367 -343 -295 -82 -165 -170 117 473 337 256 293 99 493 371
2661 371 123 173 -14 -217 -88 -137 -389 -451 -447 -15 -29 -58 77 103 219 582 155 250 298 129 266 163 -104
2684 -104 -290 -236 -48 -174 -239 -84 -52 229 405 53 129 343 29 583 165 -208 -160 -391 -342 -343 -557 -546 -203
2707 -203 -100 18 176 70 284 557 372 351 216 256 259 82 -25 -283 -204 -90 -209 -282 -288 -179 94 117 17
2730 17 209 -47 206 394 346 79 12 -8 49 -50 -49 -175 -188 -90 48 -110 -127 91 229 324 151 26 48 -87
2754 -87 3 -134 -74 -238 -182 -53 65 -272 -301 -2 19 -5 -35 -190 3 -61 51 48 -82 -43 11 197 112 -16 -226
2779 -226 -139 104 -48 -172 -197 -131 114 -59 -147 -66 72 227 247 -7 120 -98 210 284 68 98 33 -89 313
2802 313 -40 -89 -63 -58 -17 -14 -36 -4 -278 44 236 -30 13 -162 16 248 53 -193 -265 -110 81 -20 -117 161
$$ packed form
2636Ap1J38J61r1q1r9J49r4j7L1j51k43K4M8K13q3nK87L56j36q1L7j94L94j22
2661C71k48N0j87k03J29m9k52o2MM32j4k9J35K6J16L63m27R5M8j69J37j03k67
2684a04j86N4J88j26o5J55L2K81J76l52P6K14l14N54m18l73M8k31M9jk14J1L43
2707b03J03J18J58j06K14K73j85k1j35M0Lj77j07k58P9J14j19p3oJ09K73K3j00
2730A7J92k56K53J88m8k67o7k0N7r9Jj26j3R8J38j58j7K18J38R5j73j25K2j35
2754h7R0j37O0j64N6J29J18l37k9K99K1k4l0j55J93o4J12lj30L9N4J86q5j28k10
2779b26Q7K43j52j24k5O6K45j73q8Q1J38J55K0k54J27k18L08P4k16L0o5j22M02
2802C13l53m9K6NM1Lk2L2k74L22J92k66M3j75J78K32j95k46p2J55J91j01r7K78
$$ plain form
2826 161 -205 43 175 155 120 276 -25 215 182 -126 -201 -189 -120 -156 -441 -251 48 -44 -51 -23 80 92 19 53 180
2851 180 -51 67 31 -83 127 -57 -256 -94 90 -66 -1 -84 -21 105 -121 123 92 -174 -208 85 -51 29
2873 29 -271 -11 134 154 111 -160 -90 150 176 60 129 -129 18 194 83 -37 -119 -284 76 129 93 -275 -135
2896 -135 75 -16 -250 -78 -143 -21 47 127 105 161 -119 9 205 198 -85 -146 77 343 40 -46 -64 -4 192 -63
2920 -63 -114 59 -134 -31 82 -128 -117 -160 -86 419 -13 -162 -61 0 181 -131 -141 83 69 57 130 152 70 -178
2944 -178 -101 214 128 -180 -175 -137 163 -140 -288 -9 191 -169 -49 64 -64 35 88 171 95 7 -95 228 183 -13
2968 -13 -142 -85 178 -106 -238 -85 -11 -83 -18 -97 -165 -181 -154 -110 -73 -73 18 -190 117 73 64 21 61 205 -10 -100 -107
2995 -107 79 -32 13 38 -44 57 -196 -43 184 -27 -120 -27 15 54 -91 -51 59 72 -195 -60 164 258 45
$$ packed form
2826A61l66K48J32k0l5J56l01K40l3l08p5J2O9l6k85J90K99r2pK8J03J2p3L4J27
2851A80k31J18l6j14K10j84j99J62J84j56O5q3O3J26k26K44l1k66l4K93j36Q0
2873B9l00K60J45K0m3k71P0K40K6j16O9k58J47J76j11j20q2j65L60N3l6l68J40
2896a35K10r1k34J72o5J22O8Q0k2N6k80J28J96pk83o1K23K66l03q6j8O0J96k55
2920f3n1J73j93J03J13k10J1m3P4N05m32j49J01O1J81l12j0K24j4j2P3K2q2k48
2944a78P7L15q6l08NL8L00l03j48K79K00l60J20J13j28R9N3Q3p6q8j02L23m5j96
2968a3j29N7K63k84j32J53P4p2O5p9o8j6K7M4L7%R1k08L07m4rm3M0J44k15r0p
2995a07J86j11M5K5q2J01k53J53K27k11r3R3M2L9j45M0J10J3k67J35K24R4k13
$$ plain form
3018 45 -65 10 86 2 -19 -80 126 102 62 11 -14 61 -72 -100 -24 58 -128 -55 50 -78 -8 -156 -91 51 -56 -31
3044 -31 168 -57 -20 -184 81 245 -44 -42 255 96 72 3 -164 225 21 -206 71 -8 -178 -106 -33 282 -91
3067 -91 -287 170 216 60 17 -157 164 128 -52 54 7 19 34 -132 -79 40 13 124 115 112 54 -145 -148 107 13 -46
3093 -46 -10 -60 3 -93 -101 -38 -140 -87 33 109 28 65 248 180 344 49 151 2 -11 96 -89 -142 -192 -296 -13
3118 -13 -1 -159 -39 -34 158 76 71 178 91 170 238 8 -75 -184 -88 146 -45 -176 30 -31 32 153 -34 176 175
3143 175 18 295 121 -43 51 -37 -30 -201 -199 -170 -186 -64 10 -62 -73 -5 -73 11 -32 41 68 46 14 76 -44 -146 -134
3170 -134 -85 12 -282 -239 -109 86 -124 -22 -200 -55 17 134 6 -2 81 90 189 -84 15 -127 73 211 16 -56
3194 -56 64 -130 46 203 -62 151 -5 -24 66 -120 -103 -54 -151 196 22 -102 -168 61 90 -25 -145 133 113
$$ packed form
3018D5j10P5P6q4k1o1K06k4m0n1k5P5j33k8P6Q2j86P3J05j28P0j48O5J42j07K5
3044c1J99k25L7j64K65J64k89KK97j59k4o9j67L89k04k27K77p9j70P2P3L15l73
3067i1j96M57M6j56m3j74L21l6j80J06m7J2J5j66N3J19k7J11rln8j99lK55r4n9
3093d6L6n0O3r6qO3j02N3J20P6q1L7J83o8J64k95J02j49j3J07j85n3n0j04K83
3118a3J2j58J20NJ92q2nJ07q7P9O8k30q3j09R6K34j91j31K06o1O3J21j87K10j
3143A75j57K77j74j64R4q8Pj71KK9j6J22P4p2j1O8o8Q4m3P3K7k2l2O2j20j02J2
3170a34M9R7k94M3J30J95k10J02j78J45P2J17j28qQ3RR9k73R9j42K00J38j95p2
3194e6J20j94J76J57k65K13j56j9R0j86J7M9r7L47j74j24o6K29K9j15j20K78k0
$$ plain form
3217 113 68 116 65 -35 88 -6 179 70 -34 -11 -130 109 0 -145 -117 101 -128 -133 -259 -74 8 63 19 107
3241 107 -124 45 175 167 166 -37 59 146 6 -154 -122 15 -47 -27 -300 97 43 -82 -77 -44 -1 9 -26 94 101 33
3267 33 -210 190 201 71 -158 -7 108 33 40 -44 -1 106 234 79 63 -240 -103 -47 -220 64 -169 -211 58
3290 58 -23 -5 -107 2 84 169 -69 -10 125 125 52 -52 16 48 -91 216 71 93 -37 -67 149 -113 -99 70 -43
3315 -43 70 -91 -144 -13 -20 -63 64 272 -103 -1 -140 108 268 -21 -134 -101 -32 238 -70 -26 70 113 41 -51
3339 -51 -37 11 -72 -8 8 108 -112 75 105 21 80 -171 121 11 55 -50 -32 15 169 -150 5 182 21 240
3363 240 70 49 -79 -76 -103 -74 32 68 -14 -183 -117 -3 -11 -28 -90 -58 31 -83 83 13 -25 151 85 52 36 -64
3389 -64 154 7 -92 43 75 -22 -44 -192 -39 151 -314 -142 -19 -16 -23 -220 -34 80 -42 37 226 22 -55 49
$$ packed form
3217A13m5M8n1j00J23r4J85j09j04K3j19K39j09j45K8K18k29nj26J85Q2N5m4Q8
3241A07k31J69J30qjk03R6Q7j40j60L2J37o2K0k73L97n4j25NL3M3J0l5J20Po8
3267C3k43M00J1j30k29J51J15p5Pq4M3J07J28j55j6l03J37N6j73K84k33m2K69
3290E8q1J8j02J09Q2Q5k38N9J35%p3j04O8L2j39L07j45K2j30l0K16k62J4J69j13
3315d3J13j61n3J31pm3J27K08l75J02j39K48J60k89j13L3O9K70l08M4R6M3p2r2
3339e1J4M8q3O4J6J00k20J87L0q4N9k51K92j10M4j05J8M7J54l19J55J77j61K19
3363B40j70k1j28Lk7K9J06L6q2j69O6J14qj7o2L2Q9j14J66p0l8J76o6l3j6j00
3389f4K18j47r9J35L2r7k2j48J53J90m65J72J23Lpj97J86J14j22P9J89k04p7J04
$$ plain form
3413 49 -10 158 -63 -27 -132 66 131 -219 -203 111 107 -14 118 -303 120 35 -129 -58 -161 21 -65 68 144 71
3437 71 -147 85 116 -45 -55 58 60 222 129 2 -19 -48 87 25 -69 44 -163 -1 74 -92 2 -159 -34 -180
3461 -180 -30 -202 138 66 73 162 -69 120 130 5 174 125 33 -11 74 146 106 -112 -78 49 53 -10 -187 -60 14
3486 14 -144 -106 102 -37 134 -25 -41 102 -13 -78 191 -88 -77 -17 136 33 43 94 95 -17 14 -104 -201 83
3510 83 5 -80 -39 125 -47 -38 -21 17 186 14 -30 -180 1 55 -237 26 243 -6 10 -12 99 59 51 -38 52 108
3536 108 -49 24 -82 -135 -44 -64 -125 103 73 18 -32 122 88 -87 -43 -33 -40 20 64 124 170 82 -158 134 -121 33
3562 33 43 -60 25 -159 48 -129 -50 -43 38 -20 -100 -145 11 118 -53 179 136 145 199 101 -169 254 -108 5 93
3587 93 25 -58 63 -153 46 -25 -100 68 -45 104 -137 -143 -105 304 103 -52 -145 31 120 -38 -122 188 117 -36
$$ packed form
3413D9n9J68k21L6j05J98O5l50J6L14mj21J32m21M23q5j64P1j03J82q6J33P6p3
3437G1k18K32L1j61j0J13KJ62r3j27k1k9J35o2r4J13k07J62P5j66R4j61J25j46
3461a80J50j72L40p2PQ9k31J89J0j25J69m9r2m4Q5P2m0k18L4J27Mo3j77J27P4
3486A4j58L8K08j39J71j59j6J43j15o5K69k79J1O0J53j03J0N1Jj12L1j18r7K84
3510H3p8q5M1J64j72RJ7L8J69j72m4j50J81N4k92K63K17k49J6k2J11m0qq9R0N6
3536A08j57P3j06n3R1k0o1K28l0n5n0J54l4j75M4J0pO0M4O0M6q8k40K92k55J54
3562C3J0j03Q5j84K07j77P9PQ1n8q0m5J56J07j71K32m3RN4r8k70M23l62J13Q8
3587I3o8q3J21k16J99p1p5J68j13J49k41oL8M09k01j55r3J76Q9j58q4L10p1j53
$$ plain form
3611 -36 126 99 251 45 24 155 -208 32 -22 -164 -108 10 -88 -135 -209 -176 -85 -77 -31 -38 -6 116 32 153 35 -110
3637 -110 79 169 -75 18 43 -70 94 47 -141 106 -47 4 86 35 -137 34 51 -10 -3 -49 40 -121 97 74 97
3662 97 106 142 30 82 -42 128 196 114 3 52 118 -34 -30 -36 -56 -104 -188 4 108 76 -136 33 146 -68 -6 25
3688 25 -42 84 150 16 86 14 99 -7 8 96 212 -102 -40 176 -70 -275 -149 -8 61 -267 -33 -49 25 40
3712 40 21 -94 14 69 160 118 -61 -147 30 -37 163 125 107 140 168 91 20 -54 31 67 28 -21 -147 96 43 34 32 26
3740 26 -181 228 158 -166 -84 -65 112 70 72 91 122 -23 -5 -26 -31 3 -54 -57 49 28 -106 11 -33 100 -76 23 -37
3767 -37 -17 -86 25 92 39 20 -218 246 88 62 40 126 161 -74 -115 74 125 -105 138 49 46 117 -171 -104 22 74
3793 74 52 -59 8 59 25 -17 186 -40 26 -39 109 280 50 -8 -68 93 105 -14 -145 60 108 -21 -127 42
$$ packed form
3611c6J62k7J52k06k1J31l63K40n4j42N6J18r8m7p4L3R1QM6pL2J22q4J21j18j45
3637a10J89R0k44R3K5j13J64m7j88K47j53N1Q2n1j72J71J7o1Pm6Q9j61K18k3K3
3662I7RL6j12N2j24J70O8q2j11M9O6j52Mok0m8q4J92J04l2k12J69J13k14O2L1
3688B5o7J26O6j34P0p2Q5j06J5Q8J16l14O2K16k46k05J26J41O9l28K34j6P4J5
3712D0j9j15J08N5R1m2j79q6J77o7K00l8j8L3K8p7p1p4Q5L6l9m9j26K43n3rko
3740B6k07M09p0l24Q2J9J77m2KJ9L1j45J8k1nL4n7lJ06k1j34J17m4J33j76R9o0
3767c7K0o9J11O7n3j9k38M64j58k6k2Q6L5k35m1J89N1k30K43q9lP1k88O7J26N2
3793G4k2j11O7N1l4m2K03k26O6o5J48J71k30n8o0J61J2j19j31K05M8j29j06J69
$$ plain form
3817 42 115 -211 1 83 -111 75 -21 -72 257 -105 37 92 -121 217 137 124 136 3 -54 38 157 98 -46 -37 92
3842 92 133 -15 173 89 143 -121 -79 125 -106 -29 4 -16 84 117 -3 -69 85 -165 53 9 36 57 -89 -58 191
3867 191 81 -159 110 85 26 96 -78 91 116 -41 -3 -2 -27 5 45 21 -16 320 -11 -125 62 -19 111 -48
3891 -48 162 80 17 -198 -188 -14 47 -85 126 -137 69 -99 3 31 28 21 -22 -94 -113 83 -116 -30 130 -48 152
3916 152 21 -52 42 -141 33 -33 41 -17 -1 -237 8 61 -124 -123 -24 -139 -157 102 49 -112 -43 -86 61 -19 15
$$ packed form
3817D2P3l26K12Q2j94J86r6n1L29l62J42N5k13L38q0j3J2j33n7R2J19n9j44RJ29
3842I2M1j48J88q4N4k64M2K04k31P7L3k0J00L3j20o6J54k50K18m4K7K1j46L1K49
3867A91j10k40K69k5n9P0j74J69K5j57L8Jk5L2M0k4l7L36l31j14J87q1J30j59
3891d8K10q2o3k15J0J74O1j32K11k63K06j68J02K8lpm3p2j9J96j99Q6J60j78K00
3916A52j31p3R4j83J74o6P4n8J6k36K45N3j85JR9j15j8K59n3j61O9m3J47q0L4
$$ [...]
8191a4
##END NTUPLES=NMR FID
##END=
