##TITLE=1H_Pr Q-Fil
 CDCl3,8 sc, 
 23.9.2021
##JCAMPDX= 6.0         $$ Bruker NMR JCAMP-DX V2.0
##DATA TYPE= NMR FID
##DATA CLASS= NTUPLES
##ORIGIN= UXNMR, Bruker Analytische Messtechnik GmbH
##OWNER= root
$$ XWIN-NMR		Version 3.5
$$ Thu Sep 23 12:39:08 2021 Russian Standard Time (UT+4h)  she@DPX200
##.OBSERVE FREQUENCY= 200.1314
##.OBSERVE NUCLEUS= ^1H
##.DELAY= (6, 6)
##.ACQUISITION MODE= SIMULTANEOUS
##.ACQUISITION SCHEME= undefined
##.AVERAGES= 8
##.DIGITISER RES= 18
##SPECTROMETER/DATA SYSTEM= spect
##.PULSE SEQUENCE= zg30
##.SOLVENT NAME= CDCl3
##.SHIFT REFERENCE= (INTERNAL, CDCl3, 0, 15.7039)
##AUDIT TRAIL= $$ (NUMBER, WHEN, WHO, WHERE, WHAT)
$$ ##TITLE= Audit trail, XWIN-NMR		Version 3.5
$$ ##JCAMPDX= 5.01
$$ ##ORIGIN= Bruker BioSpin GmbH
$$ ##OWNER= she
$$ F:/spectra/data/she/nmr/H-F/1/audita.txt
$$ ##AUDIT TRAIL=  $$ (NUMBER, WHEN, WHO, WHERE, WHAT)
(   1,<2021-09-23 12:37:44.04 +0400>,<she>,<DPX200>,
      <created by zg, POWCHK disabled, PULCHK disabled
       configuration hash MD5:
       00 E9 B6 7A A2 85 ED C7 34 08 36 98 17 FE 4E 26
       data hash MD5: 16K
       E5 DB 2B 85 35 DF 11 C3 E7 E1 D2 49 5D F4 0F 14>)
$$ ##END=
$$ 
$$ hash MD5
$$ 9B B3 65 34 43 61 4E FD 7D 22 4E 43 B2 CD F9 38
##$RELAX= 
##$RELAX= 
##$RELAX= 
##$RELAX= 
##$RELAX= 
##$RELAX= 
$$ Bruker specific parameters
$$ --------------------------
##$DU= <F:/spectra>
##$EXPNO= 1
##$NAME= <H-F>
##$PROCNO= 1
##$TYPE= <nmr>
##$USER= <she>
##$AMP= (0..31)
100 100 100 100 100 100 100 100 100 100 100 100 100 100 100 100 100 100 
100 100 100 100 100 100 100 100 100 100 100 100 100 100 
##$AQSEQ= 0
##$AQ_mod= 1
##$AUNM= <au_zg>
##$AUTOPOS= <>
##$BF1= 200.13
##$BF2= 200.13
##$BF3= 200.13
##$BF4= 200.13
##$BF5= 200.13
##$BF6= 200.13
##$BF7= 200.13
##$BF8= 200.13
##$BYTORDA= 1
##$CFDGTYP= 0
##$CFRGTYP= 5
##$CHEMSTR= <none>
##$CNST= (0..31)
1 1 145 1 1 1 1 1 1 1 1 1 1 1 1 1 1 1 1 1 1 1 1 1 1 1 1 1 1 1 1 1 
##$CPDPRG= <>
##$CPDPRG1= <>
##$CPDPRG2= <>
##$CPDPRG3= <>
##$CPDPRG4= <mlev>
##$CPDPRG5= <mlev>
##$CPDPRG6= <mlev>
##$CPDPRG7= <mlev>
##$CPDPRG8= <mlev>
##$CPDPRGB= <>
##$CPDPRGT= <>
##$D= (0..31)
0 1.2 0 0 0 0 0 0 0 0.06 0 0.03 0 0 0 0 0.0002 0 0 0 0 0 0 0 0 0 0 0 0 
0 0 0 
##$DATE= 1632386263
##$DBL= (0..7)
120 120 120 120 120 120 120 120 
##$DBP= (0..7)
150 150 150 150 150 150 150 150 
##$DBP07= 0
##$DBPNAM0= <>
##$DBPNAM1= <>
##$DBPNAM2= <>
##$DBPNAM3= <>
##$DBPNAM4= <>
##$DBPNAM5= <>
##$DBPNAM6= <>
##$DBPNAM7= <>
##$DBPOAL= (0..7)
0.5 0.5 0.5 0.5 0.5 0.5 0.5 0.5 
##$DBPOFFS= (0..7)
0 0 0 0 0 0 0 0 
##$DE= 6
##$DECBNUC= <off>
##$DECIM= 32
##$DECNUC= <off>
##$DECSTAT= 4
##$DIGMOD= 1
##$DIGTYP= 9
##$DL= (0..7)
0 120 120 120 120 120 120 120 
##$DP= (0..7)
150 150 150 150 150 150 150 150 
##$DP07= 0
##$DPNAME0= <>
##$DPNAME1= <>
##$DPNAME2= <>
##$DPNAME3= <>
##$DPNAME4= <>
##$DPNAME5= <>
##$DPNAME6= <>
##$DPNAME7= <>
##$DPOAL= (0..7)
0.5 0.5 0.5 0.5 0.5 0.5 0.5 0.5 
##$DPOFFS= (0..7)
0 0 0 0 0 0 0 0 
##$DQDMODE= 0
##$DR= 18
##$DS= 0
##$DSLIST= <SSSSSSSSSSSSSSS>
$$ [...]
##$SUBNAM2= <"">
##$SUBNAM3= <"">
##$SUBNAM4= <"">
##$SUBNAM5= <"">
##$SUBNAM6= <"">
##$SUBNAM7= <"">
##$SUBNAM8= <"">
##$SUBNAM9= <"">
##$SW= 20.0188988654967
##$SWIBOX= (0..15)
0 0 2 0 0 0 0 0 0 0 0 0 0 0 0 0 
##$SW_h= 4006.41025641026
##$TD= 16384
##$TD0= 1
##$TE= 0
##$TE2= 300
##$TE3= 300
##$TEG= 300
##$TL= (0..7)
0 120 120 120 120 120 120 120 
##$TP= (0..7)
150 150 150 150 150 150 150 150 
##$TP07= 0
##$TPNAME0= <>
##$TPNAME1= <>
##$TPNAME2= <>
##$TPNAME3= <>
##$TPNAME4= <>
##$TPNAME5= <>
##$TPNAME6= <>
##$TPNAME7= <>
##$TPOAL= (0..7)
0.5 0.5 0.5 0.5 0.5 0.5 0.5 0.5 
##$TPOFFS= (0..7)
0 0 0 0 0 0 0 0 
##$TUNHIN= 0
##$TUNHOUT= 0
##$TUNXOUT= 0
##$USERA1= <user>
##$USERA2= <user>
##$USERA3= <user>
##$USERA4= <user>
##$USERA5= <user>
##$V9= 5
##$VALIST= <valist>
##$VCLIST= <CCCCCCCCCCCCCCC>
##$VD= 0
##$VDLIST= <DDDDDDDDDDDDDDD>
##$VPLIST= <PPPPPPPPPPPPPPP>
##$VTLIST= <TTTTTTTTTTTTTTT>
##$WBST= 1024
##$WBSW= 4
##$XGAIN= (0..3)
0 0 0 0 
##$XL= 0
##$YL= 0
##$YMAX_a= 25987
##$YMIN_a= -32805
##$ZGOPTNS= <>
##$ZL1= 120
##$ZL2= 120
##$ZL3= 120
##$ZL4= 120
##$ABSF1= 10
##$ABSF2= 0
##$ABSG= 5
##$ABSL= 3
##$ALPHA= 0
##$AQORDER= 0
##$ASSFAC= 0
##$ASSFACI= 0
##$ASSFACX= 0
##$ASSWID= 0
##$AUNMP= <proc_1d>
##$AZFE= 0.1
##$AZFW= 0.1
##$BCFW= 1
##$BC_mod= 2
##$BYTORDP= 1
##$COROFFS= 0
##$CY= 11.3945322036743
##$DATMOD= 1
##$DC= 2
##$DFILT= <>
##$DTYPP= 0
##$F1P= 2.36226072786647
##$F2P= -0.459571619588291
##$FCOR= 0.5
##$FTSIZE= 0
##$FT_mod= 4
##$GAMMA= 1
##$GB= 0.15
##$INTBC= 1
##$INTSCL= 1
##$ISEN= 128
##$LB= 0.24
##$LEV0= 0
##$LPBIN= 0
##$MAXI= 10000
##$MC2= 0
##$MEAN= 0
##$ME_mod= 0
##$MI= 1.114404
##$NCOEF= 0
##$NC_proc= 0
##$NLEV= 6
##$NOISF1= 3.799351
##$NOISF2= 2.8
##$NSP= 1
##$NTH_PI= 0
##$NZP= 0
##$OFFSET= 15.70392
##$PC= 1
##$PHC0= -14075.14
##$PHC1= 11.20088
##$PH_mod= 1
##$PKNL= yes
##$PPARMOD= 0
##$PSCAL= 0
##$PSIGN= 0
##$REVERSE= no
##$SF= 200.130013532006
##$SI= 16384
##$SIGF1= 3
##$SIGF2= 2
##$SINO= 400
##$SIOLD= 16384
##$SREGLST= <1H.CDCl3>
##$SSB= 0
##$STSI= 0
##$STSR= 0
##$SW_p= 3612.71676300578
##$SYMM= 0
##$S_DEV= 0
##$TDeff= 0
##$TDoff= 0
##$TI= <>
##$TILT= no
##$TM1= 0
##$TM2= 0
##$TOPLEV= 0
##$USERP1= <user>
##$USERP2= <user>
##$USERP3= <user>
##$USERP4= <user>
##$USERP5= <user>
##$WDW= 1
##$XDIM= 8192
##$YMAX_p= 0
##$YMIN_p= 0
$$ End of Bruker specific parameters
$$ ---------------------------------
##NTUPLES= NMR FID
##VAR_NAME=  TIME,          FID/REAL,        FID/IMAG
##SYMBOL=    X,             R,               I
##VAR_TYPE=  INDEPENDENT,   DEPENDENT,       DEPENDENT
##VAR_FORM=  AFFN,          ASDF,            ASDF
##VAR_DIM=   8192,          8192,            8192
##UNITS=     SECONDS,       ARBITRARY UNITS, ARBITRARY UNITS
##FACTOR=    0.0002496,     1,               1
##FIRST=     0,             0,               0
##LAST=      2.0444736,     0,               0
##MIN=       0,             -32805,          0
##MAX=       2.0444736,     25987,           0
$$ Real data points
##PAGE= N=1
##DATA TABLE= (X++(R..R)), XYDATA
0 0 0 0 0 0 0 0 0 0 0 0 0 0 0 0 0 0 0 0 -3 8 -8 8 -8 8 -9 16 -16 16 -24 24 -26 32 -34 40 -47 50 -57 64 -72 81
40 81 -89 100 -110 124 -135 150 -166 183 -201 223 -244 269 -297 328 -362 402 -443 494 -553 621
60 621 -704 803 -928 1091 -1311 1628 -2120 3011 -5151 25987 -459 -17736 22763 12452
74 12452 1380 -1342 9903 15380 -1896 -2462 25611 6026 -14983 11838 14896 -7415 -1182
87 -1182 3804 5500 -623 -9244 9470 10388 -18770 -4837 13769 -9071 -14114 610 -2218 -4669
101 -4669 -10045 -5243 7227 -11538 -18234 7618 -2556 -19113 -3685 -730 -7955 -4583 -5188 845
115 845 -2713 -14096 4073 7507 -17286 -4726 11983 -3809 -6235 2773 5035 4862 -5001 1192
129 1192 14919 -3554 -7057 16590 6009 -8000 8244 12829 5227 -301 473 15102 8427 -10891
143 -10891 7201 16635 -5153 -244 12315 4238 -87 -802 4835 9016 -8075 -5440 12961 -2350
157 -2350 -11770 7047 4271 -7541 -4969 -938 3222 -5481 -14951 3167 3634 -16156 -3901 6119
171 6119 -8522 -9111 -1765 -336 -2780 -12652 -5455 6868 -8049 -9858 6502 -2885 -8659 3677
185 3677 1727 -3420 -3732 -1910 7841 994 -9870 7356 9651 -6475 2578 10010 711 413 2634
200 2634 5723 7716 -3007 2587 14084 -311 -1738 12542 3792 -3133 4483 5342 4548 -1089 -3103
215 -3103 10286 4411 -8511 5198 7451 -6994 -1951 3709 -339 -2932 -6078 1467 4781 -10274
229 -10274 -5672 7023 -6084 -10236 1315 -1890 -6695 -5116 -3383 2114 -6046 -10848 4955 744
243 744 -12803 -1647 3162 -5445 -3732 -1639 1213 1001 -6569 726 7343 -6145 -3528 8689 -522
258 -522 -3108 3869 3697 3818 307 408 9898 2586 -4934 8944 7647 -3527 3791 6708 2701 3030
274 3030 801 5617 6322 -4462 2483 9799 -3966 -2541 7161 1161 -2040 86 835 3249 -3637
289 -3637 -5208 5870 -1603 -9685 2298 1964 -7025 -3144 -1277 -1453 -3078 -7628 -307 1301 -10251
304 -10251 -3864 4356 -6217 -6102 1051 -1836 -2593 -4314 -2516 3923 -4019 -6470 6035 1250 -6667
319 -6667 2407 3754 -598 15 -146 4307 3365 -4307 4069 8291 -3272 1138 8856 1579 731 3769
335 3769 3740 5228 -388 313 9024 1329 -3639 7184 4092 -2885 2251 2571 1358 216 -2856 3378
351 3378 3126 -6680 641 4723 -5652 -3196 2010 -2058 -2904 -3478 -2370 1550 -5549 -5716 3523 -3196
367 -3196 -7871 696 -1023 -5253 -2740 -2726 -385 -1907 -6310 1353 2392 -7183 -850 3793 -3282 -2248
383 -2248 1290 932 1267 -2037 655 6617 -1657 -2571 7162 2298 -1911 3857 3699 2011 1690 1128 5984
400 5984 3370 -2849 5073 6587 -2498 1722 5567 445 985 1220 2250 3791 -2491 -710 5991 -1989
416 -1989 -4067 3750 -61 -3269 -151 -1016 7 -2158 -4773 1639 -383 -7572 -518 1257 -5694
431 -5694 -2947 -861 -2550 -2035 -4656 -1719 1487 -5489 -3949 3042 -2921 -4460 1605 -251 -2123
446 -2123 -886 -779 2750 -413 -3712 4006 2805 -4019 2275 4422 -436 1086 2055 2736 3465 -1130
462 -1130 2401 6380 -1111 107 6326 1224 -247 3529 2171 2555 665 -831 4780 1364 -3305
477 -3305 3700 2682 -3560 912 1982 -958 -813 -2382 245 1708 -4836 -1985 2821 -3878 -3645 1180
493 1180 -2054 -3363 -2165 -2578 -25 -3139 -4886 1600 -1390 -5788 593 642 -4201 -1454 -462 -715
509 -715 -105 -3027 468 2808 -3412 -287 4130 -1730 -1572 2811 1025 1250 27 147 4744 1071
525 1071 -1325 5071 2659 -1463 3267 3383 694 2285 1108 2855 3243 -1522 2477 4459 -1932 90
541 90 4052 -98 -359 816 -19 1691 -1579 -1776 2932 -1507 -4324 2298 -167 -4374 -1320 -1072 -948
558 -948 -1429 -4185 -832 199 -5084 -1534 1119 -4633 -2544 449 -2128 -1732 -2030 -1799 1005 -2692
574 -2692 -2768 3110 -728 -3371 2120 932 -920 444 152 2004 1741 -1643 2747 3679 -2263 1297
590 1297 4405 496 1166 2305 1484 3048 707 933 4235 176 -172 4578 1187 -1174 2491 1575
606 1575 712 601 -759 2019 808 -3268 1374 2305 -3312 -1405 978 -1742 -1070 -1141 -1517 189 -3474
623 -3474 -2573 1812 -2355 -4186 511 -1329 -2553 -1177 -2342 -1040 -1305 -3322 520 -185 -4162 155
639 155 1472 -2443 -500 570 -580 621 -1000 86 2981 -1141 -654 3632 91 -676 2942 1326
655 1326 967 1853 617 3024 1670 -1291 3639 2907 -1161 1925 2476 81 1487 1458 1068 1562 -665
672 -665 973 3161 -1584 -1288 2773 -543 -1625 692 -556 148 -1048 -2448 983 -979 -3851 224
688 224 49 -3544 -1032 -884 -2202 -1066 -2135 -1423 191 -3490 -1889 1491 -2532 -2438 722 -1288 -1251
705 -1251 -238 -939 875 -743 -1863 2426 556 -2198 1642 1772 -477 1297 789 949 2136 -93
721 -93 1427 3103 -612 1209 3725 275 661 2473 1011 1655 1041 205 2866 586 -1033 2653 953
738 953 -1247 1289 662 -557 385 -768 118 550 -2707 -175 1146 -3085 -1460 800 -2009 -1611 -1046
755 -1046 -1881 -443 -1960 -2469 626 -1399 -3434 383 -615 -2603 -418 -973 -684 -252 -1872 196 969
772 969 -2320 93 1923 -1537 -217 1326 68 595 329 268 2491 250 -504 3220 1069 -419 2562
789 2562 1628 504 1646 725 1682 1970 -757 1588 2473 -980 1050 2133 -219 767 972 181 995
806 995 -363 -636 1804 -902 -1970 1369 -595 -1812 483 -1129 -1021 -587 -1841 -210 -281 -3171 -466
823 -466 187 -3228 -1230 101 -1722 -1032 -1321 -1209 230 -1904 -1458 1459 -938 -1934 1134 -194 -786
840 -786 589 -206 449 732 -1204 1670 1578 -1284 1484 2011 -338 1096 1610 715 1976 431 627 2713
858 2713 45 -47 2764 475 -122 1821 487 742 888 -81 1660 842 -1647 1217 929 -2005 317
875 317 592 -1249 -100 -594 -1236 64 -1980 -1131 693 -2155 -1966 435 -1716 -2004 -461 -1434 -824
892 -824 -954 -1916 226 -514 -2622 438 253 -1960 -6 299 -1027 296 -592 -37 1161 -1189 -158
909 -158 1847 -675 -22 1848 434 523 1147 74 1755 1080 -560 2570 1548 -742 1960 1510 33
926 33 1659 832 565 1377 -446 417 1768 -974 -278 1500 -710 -575 558 -871 85 -133 -1218 565
944 565 -617 -2131 499 -365 -2234 -174 -586 -1381 -624 -1333 -894 -96 -2099 -875 257 -2331 -1073
961 -1073 290 -1377 -582 -135 -1029 179 -515 -1323 1284 129 -1180 1443 477 -389 737 430 377 1098
979 1098 37 1120 1849 -519 679 2311 68 633 1341 388 1164 921 367 1881 662 -253 1840
996 1840 608 -677 1293 247 -340 358 -339 216 348 -1343 75 858 -1530 -342 396 -1428 -538
1013 -538 -575 -1249 -463 -1006 -1391 413 -1175 -2037 352 -951 -1549 185 -890 -769 -27 -1095 47 367
1031 367 -1617 53 709 -1255 86 724 -377 277 365 138 1508 27 -217 1825 256 131 1507
1048 1507 587 389 1434 436 1333 1281 -105 1364 1528 -445 1361 1285 -597 935 821 178 775 -310
1066 -310 -334 1150 -509 -618 1059 -643 -880 519 -791 -441 -218 -1518 -172 -216 -1866 -49 -331
1083 -331 -1775 -123 -315 -1567 -336 -731 -903 49 -1115 -735 649 -1159 -756 855 -563 -165 227
1100 227 -369 409 417 -874 961 691 -633 1317 916 -461 940 916 178 1270 362 361 1748 -6 372
1119 372 1682 142 130 1612 332 547 904 -221 948 437 -444 1004 358 -999 772 243 -736
1136 -736 116 -567 -485 40 -1061 -747 746 -1386 -591 360 -1175 -958 -218 -1307 -459 -429 -1511 251
1154 251 -676 -1468 275 -306 -1588 77 -63 -712 115 -717 -249 695 -517 198 1145 -410 112 998
1172 998 -84 597 752 -43 1334 674 -13 1701 532 77 1407 981 200 1067 310 527 1065 10
1190 10 500 890 -387 389 1311 -848 81 500 -475 627 129 -728 463 -157 -1311 627 -477 -987
1208 -987 200 -564 -743 -87 -806 -477 -397 -1427 -274 64 -1516 -701 -29 -1360 -480 -343 -1063 145
1226 145 -566 -578 781 -363 -748 704 -42 -796 797 -30 164 783 -119 734 873 -277 936 923 -246
1245 -246 921 781 191 803 461 0 969 360 241 1322 226 28 1053 50 70 913 -258 399
1263 399 479 -608 603 200 -945 129 182 -1046 -28 -250 -815 139 -677 -802 -345 -1127 -1029 55 -930
1282 -930 -838 -25 -805 -459 -159 -933 -162 -53 -1116 112 49 -886 201 166 -570 220 -83 -246 759 -252
1302 -252 -56 1101 -123 36 1295 108 268 897 253 810 860 -135 1103 758 -201 1050 729 -224
1320 -224 712 583 276 896 -52 -21 712 -409 151 868 -542 -275 342 -307 -432 -196 -1095 -38 -164
1339 -164 -1073 -62 -346 -1165 -114 -96 -790 -130 -843 -943 -47 -725 -543 170 -909 -471 533 -729 -287
1358 -287 147 -460 163 173 -615 797 63 -506 744 245 -477 602 109 13 996 275 371 679 -180 434
1378 434 976 52 364 1062 250 705 803 159 952 19 60 822 87 -374 706 315 -479 488 -180 -374
1398 -374 246 -606 -241 85 -718 -465 147 -859 -425 132 -893 -589 -281 -806 75 -592 -892 169 -607
1417 -607 -856 -154 -694 -700 151 -879 -222 472 -815 -51 469 -577 260 557 -404 421 393 -5 803 252
1437 252 -103 798 44 105 946 289 284 957 222 544 742 -47 939 653 -196 623 561 -317 501 554 -496
1458 -496 191 231 -239 379 -430 -330 366 -394 -509 263 -496 -518 276 -1082 -40 -17 -792 -416 -59 -1100
1478 -1100 -56 -153 -827 -374 -378 -669 -123 -674 -624 437 -831 -416 507 -563 -196 288 -253 262 181 -291
1498 -291 431 268 -27 714 693 -290 673 370 154 797 422 294 745 114 315 1182 52 -74 519 61
1518 61 346 742 -14 386 146 -481 288 273 -409 460 181 -547 250 -423 -415 377 -790 -562 14 -609 -521
1539 -521 31 -804 -467 -106 -920 -253 -215 -804 -307 -171 -558 121 -352 -713 300 -285 -581 298 -276 -294
1559 -294 488 -158 25 386 -482 268 552 -17 412 700 -39 629 328 -11 1132 333 -167 699 481 11
1579 11 872 289 180 734 -26 176 601 -74 199 530 -252 124 474 -243 17 -145 -404 -9 -97 -428 85
1600 85 -290 -844 80 -326 -453 82 -782 -347 -77 -599 -531 -67 -775 -558 79 -552 -38 148 -472 322 -158
1621 -158 -411 523 192 -234 464 107 -238 480 -2 -41 328 -208 76 883 -292 401 703 -191 514 487
1641 487 -99 327 486 121 665 490 6 547 207 -4 560 10 15 439 46 -188 385 -504 -67 173 -392
1662 -392 114 58 -468 16 -111 -592 -153 -372 -601 -62 -324 -517 105 -530 -743 35 -432 -674 18 -758
1682 -758 193 -68 -660 -223 26 -302 322 155 -314 137 -52 -218 313 54 131 508 83 343 418 148 224
1703 224 667 67 538 818 -202 610 517 51 524 234 -40 350 247 -27 642 58 -233 290 30 -8
1723 -8 316 -175 -99 204 -575 -429 -172 -333 -162 -34 -481 38 -450 -665 17 -424 -718 -261 -204 -324 -44
1744 -44 -371 -104 231 -474 -308 310 -509 -223 73 -261 -145 69 -225 214 379 -218 352 201 226 333 221
1765 221 92 432 179 102 233 240 217 422 -2 70 720 0 74 540 287 238 -3 -248 509 307 -79 235
1787 235 132 -248 132 -98 -228 2 -85 -85 -75 -529 -335 72 -506 -441 -47 -378 -174 -330 -755 -265 -339 -649
1809 -649 50 -182 -601 -240 -263 -306 74 -318 72 -16 -724 222 19 -352 -52 314 -44 433 532 15 297
1830 297 320 81 315 422 357 332 128 212 588 108 338 129 144 215 277 -250 345 434 -295 282 162 -223 -5
1853 -5 -15 -134 486 -175 -331 259 -228 -377 205 -306 -189 -95 -289 -217 -39 -485 20 -135 -646 -123 14 -600
1875 -600 -4 -178 -522 10 -194 -224 129 -175 -465 336 -134 -137 226 -109 50 227 -75 463 55 65 463
1896 463 65 36 357 400 -37 158 364 -15 399 -106 108 529 -138 29 470 -84 -60 257 151 -111 340
1917 340 20 122 208 -29 156 -185 -239 155 20 -505 -127 -194 -295 120 -263 -206 -243 -557 -205 -95 -597 -672
1939 -672 -278 -583 -49 -121 -410 113 -8 -293 76 -6 -210 393 27 -28 -47 -163 -74 95 -154 -50 415 -50
1961 -50 251 445 90 261 408 246 490 396 -28 385 435 -15 61 6 128 280 335 -223 501 -139 -77 420
1983 420 -220 -72 174 -182 141 -109 -467 -26 -202 -273 -81 61 -280 -87 -113 26 -84 -190 -371 -296 -156
2004 -156 -381 31 -492 -50 -53 -373 75 201 -205 -199 260 -68 108 -16 -104 72 149 -370 399 99 -178 136
2026 136 -13 117 715 36 87 453 -186 161 243 -161 605 274 -76 119 109 -63 231 300 -318 102 78 -86
2048 -86 133 -79 75 84 -308 -107 47 -353 -69 229 -305 -212 62 -351 -38 -341 -314 -62 -245 -516 -361 -367
2070 -367 -431 46 -181 -25 -53 -379 -1 145 -256 -3 130 -142 217 72 -139 235 125 17 391 55 147
2091 147 487 4 -98 542 109 -129 180 205 28 249 164 143 258 238 -12 271 71 330 228 -263 340
2112 340 29 -363 97 28 -265 77 -328 -116 162 -382 0 27 -135 -49 -115 -323 107 -205 -381 -21 -3 -305
2134 -305 -93 -215 -526 -71 -101 -274 117 -451 -81 180 -391 -88 261 -143 82 229 161 114 230 -163 347
2155 347 218 -358 254 61 -131 460 93 -94 179 72 512 573 118 -98 417 -176 188 63 139 159 143
2176 143 -453 -76 1 -270 146 -150 -145 138 -96 -152 19 -63 -137 -93 -93 -433 171 -408 -284 4 -609 -116 -229
2199 -229 -255 -337 218 -376 100 -98 -288 129 44 -488 11 -65 -55 191 -42 -43 288 -4 -16 366 -177 134 470
2222 470 296 20 564 133 138 356 -67 459 143 73 567 260 59 509 221 -21 269 -104 162 270 -229
2243 -229 64 330 -92 -180 33 -402 -15 -294 -112 186 -224 -84 162 -281 -208 -144 -297 -81 -375 -349 -35
2264 -35 -1 -213 -208 -25 -135 73 169 -44 132 104 -320 166 -97 61 125 -128 -100 225 9 97 252 -27 -14
2287 -14 450 168 128 112 -251 87 425 185 -37 -57 -33 228 228 -35 411 130 -94 175 -120 -124 262 -140 -164
2310 -164 91 -312 -53 307 -23 91 -99 -299 -103 5 -383 -61 -136 -260 -24 181 14 132 34 -181 -313
2331 -313 -204 -180 125 -80 -364 53 -350 85 -173 -388 183 127 -15 109 287 -35 169 39 -126 374 218
2352 218 158 84 333 173 352 52 290 117 -76 232 37 -188 115 47 180 138 62 -82 280 152 -206 162
2374 162 -1 36 125 -124 -391 -27 -103 -83 -67 -163 -132 -12 -140 -139 75 -46 -184 19 -514 46 37 -341 -311 -254
2398 -254 -407 124 -172 -371 189 -201 -136 278 -203 9 0 -278 -42 -132 -60 178 -21 37 349 164 -154 373
2420 373 85 -3 401 300 188 188 -237 -68 240 147 416 364 -74 16 88 70 225 -166 -218 96 -270 48 56 -147
2444 -147 -137 163 -159 -66 -184 -465 -95 -157 -142 0 36 -108 6 -121 -260 240 -221 -475 -52 -313 -165 396
2466 396 -187 -235 -91 -219 -15 85 86 68 156 -168 187 217 70 113 153 -110 145 -85 198 186 78 198 272
2489 272 28 -94 224 -22 -312 248 -234 -161 455 -171 -220 184 -63 -163 263 -168 122 79 4 -87 -493 74
2511 74 74 -215 -245 -102 -6 -229 -82 99 -454 101 -159 -8 80 -474 -178 83 -159 51 -9 -25 -153 -91 -357
2534 -357 -65 -223 -128 236 -19 -199 67 -60 -132 371 -176 -317 77 1 53 121 -64 250 196 58 365 149
2556 149 96 4 -207 62 56 24 -178 182 196 -308 164 121 163 -60 -37 5 117 -84 -150 0 -345 -299 -94 207
2580 207 91 -399 -61 35 -71 -108 -256 40 -135 135 -395 -53 64 -146 69 69 130 -37 -107 0 6 205 -35
2603 -35 283 62 -78 -141 -115 -115 126 -137 -67 191 -26 12 290 127 17 69 76 275 45 38 177 100 79 -11 13
2628 13 -71 32 -240 -111 -48 309 83 133 -101 -222 -210 -197 -215 42 36 102 110 -181 144 -114 -135 -9 -44 -123 88
2653 88 -151 -118 56 -198 19 424 -189 -201 -27 -176 62 45 -80 -122 185 -29 80 -142 -123 121 27 -293
2675 -293 -38 2 -49 96 95 117 120 70 409 243 -145 66 95 135 170 387 112 52 219 15 255 244 -59 13 86
2700 86 146 22 -35 -146 102 -156 36 25 -240 0 -210 -392 -142 -147 -1 104 190 -171 -289 -168 -162 29 -85
2723 -85 -116 272 -74 -170 -85 -16 -10 56 41 15 -90 -54 8 154 -92 66 273 -74 177 -164 -165 128 119 -71 -151 113
2749 113 221 17 -208 225 14 -339 -10 160 -134 197 186 -75 62 -24 50 255 2 -40 -38 -71 -67 -145 45
2772 45 -181 163 -171 -208 165 32 -81 -154 64 -61 -30 -145 -186 84 -240 89 109 -77 36 -75 101 -11
2794 -11 -96 -2 137 -190 161 121 -99 -186 323 -84 300 237 156 178 4 120 374 424 -40 -11 16 -128 -25 -122
2818 -122 265 305 -19 63 -178 -70 16 51 -108 35 -58 -53 149 -195 -17 18 -57 -144 60 -17 -212 9 14 28 142
2843 142 -250 -232 -168 135 34 109 -211 -258 -16 -282 -318 -69 10 26 -154 72 -30 -78 99 98 57 -47 44 35 25
2868 25 -41 318 41 -17 -27 -130 64 -131 118 114 130 72 206 -39 170 4 -286 -105 -85 -11 168 -64 -128 -30
2892 -30 -103 254 -36 -188 -262 132 -184 -97 207 -57 -44 145 -166 19 111 -187 23 -95 -170 91 287 -123
2914 -123 9 -23 -338 -264 -233 -106 -97 -203 -191 -340 -216 49 -167 -360 7 -227 -28 -212 229 210 227 -14 -28
2937 -28 -32 -75 -46 75 -109 392 317 38 262 162 -136 -71 0 34 65 -101 108 75 3 157 9 108 -92 -14 45
2962 45 -97 -43 -129 -17 -252 62 -190 17 58 58 -62 -257 -19 -134 125 76 238 46 -49 -164 22 236 2
2985 2 -50 109 -29 -137 130 -14 42 95 149 129 93 180 33 -80 37 191 132 -107 -181 -27 -33 104 236 139 143
3010 143 -322 65 -94 143 2 -340 96 143 31 -121 -87 137 -147 142 3 -4 96 -158 -118 -226 76 -261
3032 -261 -17 -298 -130 -385 -289 -203 113 -77 74 141 142 -172 90 46 134 -104 -100 -38 -36 -27 36 53 -236 -24 -341
3057 -341 3 -190 -216 -136 151 -105 -231 123 -21 -46 -50 -77 56 78 309 122 0 23 163 -49 43 -71 16
3080 16 -180 -59 102 -39 -161 -26 103 12 -178 146 25 9 -5 166 -86 14 -90 81 -59 -98 -145 141
3102 141 23 -457 137 -31 -37 -10 286 31 43 41 -194 -149 65 -90 -174 2 -331 -69 55 16 73 -359 -53
3125 -53 -126 195 -185 -57 50 -181 -31 124 314 -1 -68 -11 107 -19 265 53 209 67 -109 -75 39 -41
3147 -41 238 259 84 -15 -111 5 41 146 38 161 -112 -91 -234 -77 176 148 -126 -16 16 -146 160 23 174
3170 174 58 150 -55 59 -137 -210 -220 -147 -26 -206 -75 -129 -62 -239 160 30 151 151 -256 -51 -146 -39 102
3193 102 204 71 77 105 -48 207 262 184 162 -2 -191 10 27 100 -51 258 -35 13 -165 -9 87 -51 -178
3216 -178 -38 -30 133 -46 -74 -129 -147 30 19 163 -153 -124 -348 -60 -221 152 50 -316 -138 -198 71 -41 -148
3239 -148 -114 159 -287 73 61 -107 -115 -210 -88 196 -108 0 155 -42 -6 39 315 182 117 224 -1 231 7
3262 7 57 -196 -185 63 -84 134 139 -142 -45 138 333 128 408 81 357 -21 68 -144 -242 115 -175 -84 -59 150
3286 150 -311 -255 -43 -5 64 -74 15 -125 -83 -353 14 -13 40 -122 132 -327 -84 -158 -179 235 8 -45 15 -152
3310 -152 74 -29 -69 -129 -90 -142 -194 76 -137 163 -32 113 168 201 -174 -114 197 133 131 105 -119 192 186 57 -40
3335 -40 38 10 1 33 18 -146 41 -73 -309 -3 -106 -47 83 -32 -179 -85 -26 0 -105 -72 -246 -114 11 -103
3359 -103 93 -95 -156 111 -2 -75 -73 7 30 -454 79 113 17 -157 44 169 -659 254 -32 191 -124 21 -5
3382 -5 9 -335 -142 -12 -249 -18 48 -39 -128 -255 254 -41 29 225 96 492 342 -255 -713 -354 7 -165
3404 -165 454 122 467 -357 -592 526 -174 207 -260 -186 -348 58 -101 86 -185 -126 178 130 -281 -66 -222
3425 -222 -107 -214 -290 -216 113 67 -254 87 70 132 167 134 29 89 56 82 219 14 73 37 163 336 -74 -4
3449 -4 61 -84 16 -16 78 25 225 -243 -36 17 62 315 -58 104 -52 216 -15 25 295 -211 -75 -180 130
3472 130 195 -108 268 89 158 -12 -149 12 -96 -87 246 -123 86 52 -154 -74 -255 -123 16 -154 -103 -38 -86
3495 -86 8 -78 -172 -220 -124 59 -149 -99 -200 118 80 -29 54 148 18 138 -65 -171 47 -131 47 -124 -35 92
3519 92 305 29 206 -126 64 -273 -90 166 -59 -273 -69 -4 -152 -18 -137 63 -137 290 191 -191 16
3540 16 -59 26 -340 251 -253 -42 -300 -290 163 -221 230 193 -80 -325 -60 -104 -67 217 34 136 -170 -213 -36
3563 -36 -260 -133 29 -59 -54 -7 -362 -98 131 -7 -34 -92 -213 -36 -23 -85 266 -70 94 -171 -58 -70 97
3586 97 77 61 -36 -75 -155 -14 -111 -143 -111 171 -60 147 -99 3 -162 -216 163 9 40 210 16 -117 -49 -168
3610 -168 172 323 156 -240 -146 -479 33 -241 233 -6 14 40 -225 76 -152 114 -82 21 141 55 -123
3631 -123 -32 -119 131 -35 141 194 249 249 292 42 43 64 7 -53 20 74 -109 192 88 22 -75 62 146 -113 159 -182
3657 -182 161 25 -8 13 84 177 18 -129 21 393 0 -183 -56 -94 -9 118 -35 -25 -129 183 169 24 12
3680 12 246 -227 -98 -144 -226 287 235 81 154 39 58 -101 -171 -81 116 91 -195 309 9 -307 -16 14 47 -13
3704 -13 158 304 105 -505 57 188 -225 256 -55 -153 -141 -278 16 -14 208 58 103 -19 135 225 239 293 -152
3727 -152 -95 -229 7 27 196 72 24 118 307 -159 240 163 96 60 -170 -62 -46 -8 121 -223 -168 12 71 141
3751 141 34 88 172 -141 107 -112 136 11 -40 175 -261 196 -122 -156 72 -26 111 88 -66 144 59 -26 46
3774 46 -99 75 279 157 -141 69 13 123 -3 -58 -33 23 81 101 -96 136 174 -92 164 164 29 -77 -375
3797 -375 -316 -63 -19 55 -249 -75 278 -40 117 134 -108 -145 -53 -148 -198 263 40 -64 111 366 169 -84 240
3820 240 -182 127 -335 -89 -112 84 159 105 124 -4 21 -177 -32 151 -61 75 116 12 110 -122 102 161 -108
3843 -108 -71 203 -138 -251 47 100 123 -63 2 72 -151 -99 45 214 67 -170 32 300 44 548 212 188
3865 188 34 15 -72 -112 125 -92 126 331 -10 -26 -81 147 -44 45 -56 35 -1 159 -97 -251 134 -53 -130
3888 -130 -76 -58 -52 -42 -34 -20 -114 -8 0 -179 -267 -9 -147 76 12 -23 -208 -148 89 111 -232 -202 109 -307 109 -12
3914 -12 150 -78 69 -105 -178 174 -127 -135 97 242 73 97 19 182 -59 -226 -11 123 -173 -111 -172 111 -256
3937 -256 151 -49 -177 -25 -113 -87 -118 -74 -164 45 -83 -178 318 17 20 -73 217 -144 -177 -39 -112 -28 -5 25 251
3962 251 -68 84 51 -58 308 -19 75 -194 -169 -12 105 18 -115 -72 -78 32 -81 -124 -185 39 -2 65 260 -147
3986 -147 -195 -167 199 187 -138 -18 -177 131 118 -66 47 48 155 17 -10 156 96 130 -120 31 -98 -45 80
4009 80 112 -218 -125 -161 -92 179 -55 116 -184 2 23 85 1 -25 16 -113 89 441 135 -10 -222 144 134 -375
4033 -375 -56 20 -203 -15 -109 176 268 -20 -254 -10 -83 56 8 -346 -106 271 -178 187 54 -91 -39 386
4055 386 4 398 265 -114 96 20 25 16 -190 2 -111 96 -208 -37 263 35 1 -68 -228 228 -71 34
4077 34 -53 -182 436 -174 -63 113 -68 -27 -246 64 19 20 134 127 46 134 214 95 25 168 90 -233 338 -16
4101 -16 -127 -77 4 5 186 28 84 -92 110 34 66 -55 189 -231 -53 179 97 -34 -49 -33 14 45 -37 189 16
4126 16 -29 132 -117 55 -6 -451 -61 -299 -2 132 13 -11 -10 55 -16 -5 -20 -53 7 339 -164 257 -182 -193
4150 -193 -136 155 148 -223 99 -60 -33 55 -169 35 -71 -167 -115 193 -148 -95 -16 245 66 -223 -283 216 136 -128
4174 -128 -186 -76 -74 -134 70 -292 227 221 235 -67 118 89 94 63 124 -67 216 -150 29 -294 -106 -2 -167 30
4198 30 -47 -256 74 -124 -130 188 -229 105 90 -258 -225 44 -78 -234 -66 -192 29 -159 155 -45 -171 -134
4220 -134 -81 -108 -33 163 1 -69 30 -83 -122 -10 140 126 211 187 152 -163 80 111 -4 -100 -157 -237 -38 14 302
4245 302 -187 -61 160 -93 103 -160 45 207 -115 31 182 -83 3 179 13 -30 238 124 -241 55 -36
4266 -36 45 -160 -72 -124 -20 34 -139 104 -60 -173 -24 -137 211 -182 -4 -17 38 98 98 -139 276 175 200 96
4290 96 -11 -363 -101 -156 -67 324 33 114 128 37 -257 186 -69 -98 -119 -121 188 -38 131 127 384 -150 -7 199
4314 199 5 -249 75 -86 -130 -110 -146 -230 63 -175 -101 -49 -189 77 180 -159 54 -74 280 -144 130 66
4336 66 123 97 -105 -85 -219 251 -8 348 -18 129 -42 -175 22 -125 21 117 -178 -9 51 241 172 11
4358 11 109 232 -175 -67 -111 -110 100 58 8 197 -12 59 -90 -136 -46 32 340 -4 42 -21 -87 72 -5 60 223
4383 223 -26 154 168 99 225 -38 -315 212 -14 7 -22 -46 148 122 -199 41 -175 -227 -44 -56 -135 -124 -57 139
4407 139 -279 -34 -161 -105 65 -111 91 -21 -242 -108 33 -71 -6 -346 236 -184 -107 -121 176 -53 198
4428 198 124 37 139 -43 -7 -25 186 -75 184 13 21 78 127 0 47 47 36 246 99 14 -27 22 93 66 -250 -245
4454 -245 -93 -172 68 -85 -10 121 152 6 8 266 -19 -165 -216 -138 15 135 -33 -274 -66 -9 1 -53 -354
4477 -354 -9 -168 174 172 36 62 24 -70 12 -69 269 60 18 14 31 139 -109 -146 109 24 -75 -85 -263 -3 -13
4502 -13 44 92 -204 4 -89 -54 -101 212 225 -49 34 -131 -40 -12 102 200 56 35 100 133 259 -179 -132 20 -19
4527 -19 -46 157 231 8 -89 -17 -243 -26 -224 59 336 -34 20 -10 204 114 -211 -195 175 -81 140 77 -27
4550 -27 123 101 108 -118 17 96 -123 42 -113 79 414 -160 76 -257 -214 70 -73 55 -14 314 271 158 44
4573 44 53 93 280 -109 205 70 38 117 169 -68 306 -31 -66 -38 -129 -59 -186 -13 178 -29 -140 -132 -137 -316 -35
4598 -35 128 -127 173 129 140 113 131 -101 -135 -11 105 -12 -6 -6 190 -295 -300 297 42 62 381 184 62 -187
4622 -187 139 -40 74 -149 0 18 -243 62 -191 -84 -56 -96 -30 107 -59 10 307 -111 -20 134 -244 97
4644 97 137 57 320 61 -136 -60 -61 85 43 -160 54 20 44 210 276 -247 -85 -36 -41 46 -67 -169 -44 11 -122
4669 -122 -219 -50 -83 -28 -16 -125 72 -111 63 -64 -44 66 -73 111 -227 -17 -64 143 38 -29 -158 124
4691 124 4 -92 -36 5 -158 10 181 71 -1 -30 156 258 299 104 261 -23 -60 -19 -17 -65 86 41 -133 -137 -83
4716 -83 202 -123 -64 143 -12 -91 -199 -186 172 179 -349 0 -455 -60 -277 52 -52 -154 -159 33 -107 -117 -199
4739 -199 -33 149 -224 180 2 -13 -148 -92 -72 -118 15 45 64 -181 -233 138 16 -75 -30 51 35 -260 120 121
4763 121 95 -87 -31 41 -73 24 15 33 -391 -28 -108 30 31 10 109 40 177 -32 -118 -241 -10 -60 -145 -216 -114 -47
4789 -47 -47 73 -303 82 124 -61 -237 -166 152 -169 139 100 63 136 67 137 -77 -85 116 97 -72 231 32 -201
4813 -201 47 209 181 97 158 147 -52 -137 129 371 -77 251 -81 100 167 -104 115 -85 230 -88 -49 39 -65
4836 -65 -138 57 -106 335 98 52 136 -72 52 -18 0 -84 -148 -90 -117 138 -42 -133 -142 4 -12 -24 -13 222 -68
4861 -68 -311 -258 56 -263 156 -49 -92 16 230 -198 191 -97 -170 -40 144 364 -82 -7 -349 109 -65 51
4883 51 115 122 273 432 65 -8 -62 225 -37 227 49 158 -1 113 163 -53 90 -316 124 209 237 60 40
4906 40 108 -114 165 123 -54 -111 -144 -115 -59 -171 -173 -10 -177 23 258 -127 103 -230 -249 -5 18 -407 10 -81
4930 -81 -42 66 -287 20 -290 8 -1 -55 13 216 26 -101 -167 207 -27 43 -91 -193 311 -120 282 249 -120
4953 -120 -13 98 108 -50 56 82 -22 299 -129 189 -300 188 -21 62 -1 -23 96 -13 231 67 -285 -82
4975 -82 -18 -54 151 -101 13 5 -111 344 -4 -150 38 -14 130 -44 208 -127 107 -342 -178 17 103 86 77
4998 77 -26 -87 132 146 25 33 -151 -91 30 11 -151 -329 72 148 -43 17 22 123 -356 -60 -52 -536 -59 188
5022 188 293 219 -71 123 361 -68 342 73 -44 -73 140 -36 -121 -110 1 -168 -163 -7 142 -23 74 200
5044 200 223 4 -36 -46 -241 -31 -5 -31 -117 50 -33 189 -210 -192 36 -243 -6 -158 23 -16 -4 -110 -188 -35
5068 -35 70 261 -28 -21 -42 10 99 -82 110 40 115 4 159 158 26 181 144 205 17 -113 -217 -13 -119 -33
5092 -33 211 104 294 78 128 134 56 -96 75 97 -166 99 -2 -158 11 -13 -245 72 -169 -112 -79 137 -146
5115 -146 197 77 -13 -229 -88 83 146 116 -290 106 167 -34 76 24 -116 91 -72 85 88 330 147 187 113
5138 113 -104 -155 192 9 190 -25 159 46 49 -85 -275 167 -204 81 151 101 328 188 -71 -46 22 115 294
5161 294 -51 235 -126 -193 168 142 41 44 -236 30 32 72 142 -171 -59 221 -156 -220 -157 91 -185 -57 269
5184 269 143 -262 -64 -12 -20 339 -37 -163 -210 216 -157 -186 -88 131 79 -32 164 -170 -153 -159 -17 -77 137 23
5208 23 40 -180 -180 261 -10 182 -64 -115 127 53 14 -33 0 -257 209 179 -97 5 -55 -73 156 -130 125 196
5232 196 3 165 -21 -227 50 175 14 143 -15 155 -46 176 35 140 -17 247 131 -100 -109 -152 -314
5253 -314 49 -49 9 -114 -146 -73 131 -98 -1 339 385 162 -207 -123 -48 -88 133 220 120 -27 -144 -239 -1 -113
5277 -113 -149 -63 5 -97 -354 52 76 -234 -121 125 30 -67 5 125 -139 -68 63 124 154 -4 -15 -199 -13 135
5301 135 -82 73 65 65 -343 31 -192 -99 102 76 174 -87 140 -177 -109 -340 -315 11 -47 -136 -167 156 -198 -151
5325 -151 5 192 72 -25 39 -6 70 -195 366 -164 -191 -189 39 162 156 261 159 123 26 52 -135 89 111 -75
5349 -75 44 -133 107 -97 92 170 -42 -100 95 56 -107 1 -334 115 -104 -108 -41 -110 81 -33 -70 18 -24 -148
5373 -148 52 -275 -4 -170 191 -56 -97 -160 -106 56 -297 -14 106 -223 -37 -158 -91 -235 142 119 46 15
5395 15 -261 4 6 -23 -112 256 -66 87 198 -76 60 72 -255 -188 -3 -127 40 190 101 -121 -191 136 131 207
5419 207 -34 78 -81 120 -116 1 -111 260 -15 -92 17 232 217 21 -14 -68 109 34 195 -281 -13 -21
5441 -21 -381 84 148 -107 32 15 -321 203 -12 81 -116 -7 -4 -49 -125 -88 -125 -24 -121 25 -75 -182 62 -77
5465 -77 101 30 56 -178 298 248 -103 -52 -48 -43 99 -234 -107 102 -282 -242 24 -44 -108 2 63 -76 -41 -146 -120
5490 -120 -166 31 -247 19 6 -68 -13 4 -108 38 55 9 -413 -366 22 28 -179 16 139 -228 -192 427 128 40
5514 40 -51 148 30 -125 73 -111 -151 -188 -132 61 8 259 280 -105 55 61 -108 -176 -87 1 135 -122 254 38
5538 38 -135 -404 -4 195 3 142 129 235 117 -42 -78 45 136 165 148 14 -107 -23 68 -215 -50 172 -254
5561 -254 -80 4 -94 -25 -153 45 -101 -36 -126 7 -105 64 -130 -131 202 112 24 -73 58 -105 199 -289 1
5584 1 139 -206 -18 51 237 -13 58 14 84 180 -34 161 17 30 91 54 -94 18 -41 75 4 -59 25 254 77
5609 77 104 221 -158 296 -46 98 13 -48 193 -46 209 -154 -28 90 -104 29 119 -81 155 234 54 259
5631 259 -73 98 40 -222 -21 -44 -64 258 43 35 -246 -205 100 168 34 -3 -10 -293 207 -147 -387 56 -18 -148
5655 -148 10 -64 -12 -16 90 -186 258 67 17 -139 -79 7 108 -15 -67 132 -123 -23 58 237 10 66 -84
5678 -84 101 91 -102 -88 35 78 90 79 -19 -62 267 -94 89 163 84 98 272 171 125 -46 291 76 48 242
5702 242 31 -40 -108 -22 -43 282 26 -29 -159 241 -38 -46 88 13 -9 149 -274 -192 85 71 42 -66 140 28
5726 28 -201 -102 21 -197 44 -172 3 288 83 148 -170 53 -117 21 -212 122 80 130 -88 -168 222 -17
5748 -17 92 59 84 239 17 70 139 -289 81 83 -12 -86 -171 -51 149 -96 -95 -342 -31 233 -64 -64 -21 -85 -70 -123
5774 -123 -6 -44 31 -43 -286 -150 -182 156 185 201 119 -164 90 361 338 122 -145 77 109 -89 183 57 -99
5797 -99 128 73 -99 -173 -65 -138 131 -12 79 -106 183 -76 -204 20 44 27 84 15 7 158 -60 -44 -83 -70 -239
5822 -239 -40 184 177 -22 130 -117 39 -108 172 -117 -54 36 31 -23 -169 -83 -228 -120 150 -401 139 308 -71
5845 -71 1 -36 -83 -311 112 37 70 -119 73 -92 165 -28 170 -144 65 -80 135 31 146 -249 -61 -188
5867 -188 -242 -252 13 129 224 -65 1 -211 -50 128 -54 155 50 107 123 -126 269 238 -36 32 -65 -79 -5 93
5891 93 -173 47 -61 23 56 196 -115 48 0 -2 46 -27 -72 17 130 -105 188 -11 29 -136 234 -91 8 -49
5915 -49 -165 61 -83 113 -201 36 -174 -326 -88 107 4 125 76 -100 215 202 -307 -39 53 77 -38 168
5937 168 167 73 56 191 109 -24 -144 85 53 -2 -95 -413 -183 257 -115 210 51 -212 178 -104 94 170 -151
5960 -151 71 135 -91 285 216 16 -213 235 -188 -102 -134 -38 158 14 -157 -112 112 76 -170 27 67 160 325
5983 325 -403 -121 99 61 -140 94 103 -127 -57 -8 -203 27 -139 333 -53 221 123 236 68 41 -31 -55 -66
6006 -66 61 -211 71 91 86 64 -141 -158 -14 107 254 224 -21 81 -29 186 -8 143 267 -114 -313 258
6028 258 -209 -79 161 118 -170 109 185 -246 257 188 -139 103 -93 73 221 -10 246 -78 -134 -124 -86 -58
6050 -58 167 -278 -14 -26 -243 -89 10 -35 -208 -14 -117 80 -245 35 -35 -147 118 173 149 184 229 -148 75
6073 75 -144 60 -123 123 58 23 -157 311 118 -147 182 -230 -101 -40 -129 147 -264 285 143 329 -90 -86
6095 -86 36 73 149 -60 393 -166 -160 14 -204 170 37 212 -47 -33 77 137 3 -17 -51 -113 -109 31 -157 211
6119 211 16 -437 -125 5 239 24 -86 -22 232 321 -150 115 72 1 115 -38 -229 70 214 -213 -30
6140 -30 -65 323 3 267 -32 87 -24 143 91 -9 170 81 9 22 297 -179 370 12 -214 -296 120 -316
6162 -316 -266 148 -96 172 9 -104 94 -170 -81 119 -13 13 37 -22 47 0 -45 -31 86 -109 -223 -191 -232 137
6186 137 110 -31 44 -56 10 45 -137 -130 111 -125 152 210 -81 329 -104 -185 45 143 308 41 -145 69 91
6209 91 -144 -14 -211 150 66 78 -183 87 -124 56 206 -182 -275 63 14 -209 335 9 97 58 50 130 -150
6232 -150 96 257 200 -91 102 81 -160 201 -55 -121 -172 -29 -134 -193 167 -175 25 -15 -150 212 -17 70
6254 70 -179 111 295 -186 -105 175 210 334 -47 299 -18 95 118 152 -75 16 191 62 -119 12 50 -173
6276 -173 131 -98 55 202 -100 -65 -146 -11 -169 19 142 -119 34 -83 -225 1 5 -99 106 -24 -372
6297 -372 -194 188 -60 -139 -32 -60 62 125 -37 65 -164 -169 391 -107 285 -110 -60 -81 191 338 49 -23 52
6320 52 15 117 146 320 2 12 -11 270 -94 56 -131 -142 -163 311 4 -17 -33 75 -108 -44 228 95 181 182
6344 182 -39 74 -52 105 -124 43 237 -218 1 61 -130 -110 155 -45 -39 -61 -25 -142 -55 333 -3 -92 -187
6367 -187 32 137 -132 -83 -80 43 114 -40 59 -219 -180 125 49 54 -162 334 24 -145 -72 46 120 140 12 -166
6391 -166 -11 60 -112 59 -12 -144 -267 239 227 8 68 -53 -198 -136 -98 -44 328 -212 -144 108 -77 58 -164
6414 -164 47 87 -43 140 -151 121 -128 104 -232 -171 109 42 37 -248 -104 -219 -209 57 49 -14 -230 156 -55
6437 -55 -100 -202 -41 -26 -16 -57 50 -45 234 -86 -129 173 91 33 38 183 61 -93 171 0 -90 9 212 -212
6461 -212 -45 -17 -277 -34 -122 121 -240 122 122 17 -256 -226 206 -336 -16 -60 8 20 139 -4 129 -26 78
6484 78 -64 155 -133 -98 -142 -50 -46 -26 -93 -192 -65 -185 69 124 67 319 148 142 -213 123 126 -144 -348 -11 18
6509 18 14 20 298 -37 134 2 -79 62 5 45 38 -61 198 50 -321 23 -173 144 -176 276 279 51 -256 107
6533 107 70 68 37 -84 -22 -53 -117 -29 -170 391 0 52 -224 28 31 53 232 -142 33 74 300 23 -253 -260 -57
6558 -57 -14 -214 6 175 -235 -346 -156 -20 52 -3 -78 106 -30 209 -31 -23 352 1 31 -125 97 250 -52
6581 -52 15 83 -58 83 -249 -93 -202 1 166 -27 44 0 332 -8 259 -96 114 -218 2 265 32 32
6603 32 -127 190 11 -20 73 161 -104 268 62 55 -194 204 177 105 68 -27 -182 -148 -150 16 22 0 31 -63 -228 -89
6629 -89 -310 -71 -47 24 -147 -119 -34 125 19 -13 -2 -12 -4 150 -64 -294 130 60 86 -215 -81 176 260 266 -172
6654 -172 273 -143 89 -141 -179 -17 -22 -185 266 23 18 -218 -106 -67 -163 41 10 211 2 59 -153 101 6
6677 6 -115 301 -114 162 180 161 101 -48 41 85 91 306 88 -187 41 59 14 102 -31 -191 395 -183 -29 -70
6701 -70 201 -210 -34 -79 -124 -62 -304 393 60 148 -187 173 -58 -112 -35 -33 104 -192 56 -26 53 16 196 -34
6725 -34 -206 -282 -150 -282 -13 61 -124 -185 120 -55 11 -188 -110 6 -91 141 -54 177 302 155 -18 -71 -165
6748 -165 175 249 149 11 155 19 5 254 -9 -30 -91 99 -334 255 147 43 -211 155 29 54 221 108
6770 108 -202 -139 86 -13 -9 -80 -63 -44 -37 80 -20 -154 198 -234 -82 -92 60 147 -266 33 -95 39 -101 52
6794 52 202 176 175 48 104 -225 -15 84 139 153 -92 27 -70 -50 -38 29 105 256 -33 -56 296 79 -29 4 2 149
6820 149 9 -7 139 -89 145 -17 48 5 14 144 104 -3 41 286 -266 84 -3 -78 143 96 -126 82 110 7
6844 7 192 -12 -44 -175 -166 224 130 -41 46 49 121 136 313 -203 -147 115 -252 27 145 45 -99 -8 -143 -75 76
6869 76 -103 62 145 -224 143 23 103 -78 -279 -142 -295 91 27 -121 6 93 224 -156 -19 -223 24 -41
6891 -41 -31 -29 -43 -17 -87 -215 70 -10 -82 -82 257 167 54 -220 20 -145 146 247 36 -31 34 -70 56 -63 -238
6916 -238 82 -99 112 150 -218 -10 13 163 -111 53 48 45 196 -132 49 -27 -49 -136 60 -94 124 95 -26
6939 -26 -55 -117 161 -231 -39 -198 81 19 56 -368 -170 138 -98 -18 36 40 53 -66 251 198 -81 9 -223 97
6963 97 -214 124 186 -46 9 15 187 -53 173 131 -7 84 -146 -35 -81 119 135 -120 93 45 37 -20 71 -374 78
6988 78 -231 7 -251 30 -66 -27 -30 102 140 66 76 70 -83 49 26 -117 10 -117 34 5 -428 -173 -128 33
7012 33 37 -146 171 -204 71 -57 -103 -104 -21 -200 -60 152 95 -57 -219 462 184 173 -106 -137 -234 67 215 56
7036 56 -15 119 -148 -105 111 -103 179 67 176 156 -37 -206 201 56 126 -33 68 -199 -146 407 205 137
7058 137 -168 -134 4 -50 -39 112 -163 -113 -55 -112 -11 189 -27 -6 368 26 138 -60 46 -228 -162 66 149
7081 149 -135 261 -86 129 172 191 -26 54 5 -17 -151 -199 -320 74 -192 -61 -3 7 -47 321 126 92 101 -152
7105 -152 -288 54 -32 150 61 -60 168 57 -181 317 -127 103 430 141 17 -187 254 -245 -42 -58 87
7126 87 19 22 243 -77 -98 326 -51 128 198 -333 -90 -121 -46 -219 -23 -133 -179 -196 -21 -108 44 49 -35 -33 21 -47
7152 -47 152 112 10 266 -304 115 -91 -186 239 -116 12 61 -80 -59 -308 -121 -213 -82 -125 -17 170 163 -47
7175 -47 91 130 -83 227 -117 342 -3 -57 -129 0 -181 172 193 14 17 -38 131 11 -169 -139 295 87 -78
7198 -78 64 93 158 213 -160 -24 74 -287 15 -177 -10 -65 -403 -163 -19 -192 84 64 273 -12 -78 -78 -105 -70
7222 -70 -134 27 4 -209 -183 -380 94 -77 -227 -301 -232 180 143 -224 -119 -7 3 -311 18 150 172 -44 71
7245 71 -113 231 218 57 -42 49 110 48 -42 -88 -180 120 264 158 -75 -105 152 144 -107 -185 22 249 71 -82
7269 -82 130 -162 -70 -3 463 215 143 -90 -49 11 6 -162 41 0 -83 -116 -2 379 41 -27 -113 -10 149 144 -95
7294 -95 -122 321 109 -12 -167 75 52 147 -108 147 -201 134 36 5 -152 185 -176 -8 -2 -198 116 65 -94
7317 -94 59 -119 99 -24 110 157 232 274 -61 -34 -51 10 -229 0 -258 -78 -11 -144 -127 147 18 127 -213
7340 -213 107 -159 37 -114 64 -165 -188 14 -133 -251 -47 -32 -120 228 -4 130 140 75 -147 -29 -60 -66 -180
7363 -180 54 -83 -165 -88 -12 -39 33 134 116 166 170 247 -128 240 116 -149 -137 97 -108 -153 -45 -100 13 144
7387 144 -70 276 -116 137 63 -34 193 -78 -55 25 51 49 111 -179 -173 -102 -64 -35 180 81 -81 -81 -66 -147 -140 63 84
7414 84 194 -41 95 -111 4 73 120 11 -97 -95 325 135 37 -5 -37 -135 101 221 -81 78 64 -63 -307
7437 -307 -250 64 -220 -29 215 89 -61 19 356 -24 28 163 54 37 0 -248 -196 214 -26 241 196 -168
7459 -168 124 -30 85 -28 -15 40 119 97 -171 -185 84 54 186 -113 57 37 -36 38 134 -125 130 110 -294 -13
7483 -13 -100 182 -73 -102 -282 -148 -297 -150 33 76 56 -90 -79 165 -40 -120 -162 -114 125 -56 -206 32 12
7506 12 196 60 235 192 -118 -159 252 229 108 -21 -108 120 -87 -140 -48 40 -72 -57 -63 197 131 -177 -135 -7
7530 -7 136 23 -106 -71 218 -78 181 176 130 7 -93 -71 6 -39 45 -47 -272 130 -70 220 -128 -132 84 -79
7554 -79 220 -51 110 122 -189 -38 116 -32 189 197 -249 -197 -104 -147 21 -73 -88 -54 -153 379 -51 32 -28 211
7578 211 107 18 -139 29 -144 36 -223 -47 -28 -118 -24 -79 -113 12 101 -56 262 -24 -31 41 -5 158 29 -127
7602 -127 60 -50 -8 -82 -8 206 194 -162 -1 -39 0 -164 23 -222 -201 -18 -106 98 -79 194 79 191 -63
7625 -63 -205 -173 262 70 -180 -20 125 -189 -112 102 244 58 18 -67 -249 187 -203 -52 -48 148 16 -42 67
7648 67 34 -118 89 -199 59 -242 10 36 143 105 108 -281 33 -85 -1 42 122 -82 43 -30 215 96 -56
7671 -56 68 -136 193 -134 -4 -30 -77 -232 85 -86 -21 -107 -34 -280 0 28 -264 53 72 -184 -91 100 -184
7694 -184 -84 42 348 49 144 -182 1 72 114 119 -220 183 -74 32 -11 102 -270 -123 145 -16 -92 239
7716 239 -113 -225 95 -1 221 -146 159 -87 5 -51 -225 -75 176 -127 -215 72 77 17 92 -200 -23 -101 -52
7739 -52 -78 60 150 122 -64 210 -55 -135 146 18 -105 -148 -171 407 62 -186 55 182 -227 197 108 -63 -20
7762 -20 256 -31 0 262 118 123 118 172 18 -103 209 84 19 45 192 -159 222 175 -159 181 147 216 224 47 -68
7787 -68 -62 -175 -72 -3 -243 47 -31 306 -5 38 -159 -137 72 -301 -104 125 282 -235 -78 -177 12 111 61
7810 61 -90 44 -42 -61 26 22 1 -131 -41 8 57 -30 162 17 -62 -134 190 96 164 -39 97 -163 -2 117 -21
7835 -21 -146 149 -241 -2 133 45 61 -164 91 -52 -217 4 -106 224 -57 157 19 58 45 219 -46 -138
7857 -138 33 -20 -3 -68 -96 -90 3 -261 8 -28 105 67 -43 199 283 19 27 150 153 28 187 164 -54 67 164
7882 164 -100 -127 52 -104 96 -198 -20 66 50 -26 -140 52 -42 -175 -110 -109 -159 200 66 50 98 13 237 -14
7906 -14 235 109 101 183 32 74 -94 31 193 -78 -183 78 -27 14 -197 -89 40 -103 -63 -281 -41 -105 87
7929 87 -206 -78 56 41 -138 183 213 -174 107 -373 22 48 38 226 63 103 -63 -85 16 -49 -180 185 123
7952 123 -307 181 15 31 339 -31 57 -7 71 -125 -83 230 78 54 -190 182 -52 -135 -9 43 131 66 125 58
7976 58 37 59 178 126 226 -98 -58 -378 -79 352 -9 -42 -13 70 -70 -63 -269 -151 181 -243 -38 -8 214 -18
8000 -18 273 93 26 -27 -135 282 114 -38 -100 103 -59 -44 162 249 22 232 16 -168 -2 -217 24 -113
8022 -113 197 209 7 1 14 -108 -141 100 -25 143 192 175 -37 -70 -166 264 -63 -76 113 273 -51 54 141 26
8046 26 141 -30 -17 60 -73 111 114 5 -48 159 63 -6 -160 -117 -218 -109 42 203 42 -211 -80 -455 -140
8069 -140 103 77 -115 99 -7 -179 83 -139 -327 452 -45 110 -142 91 170 205 -20 59 368 -60 203
8090 203 -98 -55 -216 27 104 86 -32 -69 14 113 35 189 200 -218 -161 -21 75 -50 -24 105 33 -120 310 204
8114 204 -265 -100 220 68 75 8 -92 -97 -83 82 -162 22 -36 -234 -26 -5 -62 149 -119 -76 -44 -85 313 298
8138 298 -80 -212 -73 -145 287 -98 -126 46 -103 -18 -24 308 85 168 -164 -31 -104 150 -147 28 -120 -8
8160 -8 -111 24 -55 17 -102 -72 60 -181 -256 137 61 -228 -110 57 82 -278 60 113 26 142 41 -197 41
8183 41 -38 -42 63 151 123 -119 242 -39
8191c9
$$ Imaginary data points
##PAGE= N=2
##DATA TABLE= (X++(I..I)), XYDATA
0 0 0 0 0 0 0 0 0 0 0 0 0 0 0 0 0 0 0 0 0 0 0 -1 5 -8 8 -8 8 -8 8 -13 15 -16 17 -21 23 -25 29 -32 37 -40 45 -49 54
43 54 -61 66 -72 80 -88 98 -107 118 -132 145 -160 177 -194 216 -243 272 -307 348 -401 469 -558
64 -558 683 -870 1176 -1773 3347 -16517 -32805 12904 11291 -10882 -6398 5284 8921 -937
78 -937 -7295 18290 8868 -17894 8547 20371 -5411 -466 12127 9649 5512 125 10789 17622
92 17622 -7721 -2237 23913 2887 -8923 11496 9545 2436 1158 2349 11971 -594 -12546
105 -12546 10696 8396 -15111 -710 8171 -5151 -2990 -1358 -1620 -1878 -12768 -2295 6181 -17112
119 -17112 -12564 10234 -5798 -15287 -1076 -843 -4637 -9914 -8745 5197 -6773 -16802 7049
132 7049 3497 -16035 -575 8890 -4056 -6945 -3784 7260 5455 -13068 554 17050 -4360
145 -4360 -5448 13027 5218 -2134 2654 6178 10012 -1125 -3311 16229 7015 -7944 11061 12929
159 12929 -3230 1123 7314 7560 1845 -6412 6970 12975 -7969 -2041 13661 -2084 -7282 4026
173 4026 2816 -1822 -7436 -4502 7829 -3773 -12044 4405 73 -12319 89 454 -8896 -7075
187 -7075 -4507 1131 -2041 -13684 -1264 6491 -11514 -7353 5113 -5322 -7524 -1304 -257 1431
201 1431 -5235 -4028 8539 -1384 -8278 8035 3616 -7129 3050 5814 2542 924 -1350 9261
215 9261 8203 -6394 4314 12764 -2457 -423 9908 4452 1289 1603 5362 9684 -2139 -2745
229 -2745 12035 2032 -7469 6126 5340 -3390 -367 1702 3945 -1112 -7791 4070 4715 -11615
243 -11615 -3465 5885 -5603 -6097 -476 -1428 -1547 -7050 -4708 3672 -7665 -9913 4059 -2428 -10034
258 -10034 -638 -31 -3081 -3783 -5018 2529 -418 -9916 1945 5676 -7138 -1844 5770 -338 -554
273 -554 374 2122 4900 -3079 -104 10094 -394 -3483 9323 5061 -1229 3814 4222 4914 1654
288 1654 -1419 8298 5333 -5532 5155 9199 -2564 398 4928 1874 734 -2052 1455 5227
302 5227 -5259 -3153 7248 -2588 -6752 2813 -142 -4074 -3653 -3121 1234 -3283 -8729 1856 1124
317 1124 -10141 -2440 2160 -5345 -4814 -2905 -1164 -476 -6902 -2492 4567 -5940 -5367 4781 -1140
332 -1140 -5036 722 857 1033 -1239 -2238 6242 2013 -5186 5306 6087 -3347 1949 5413 1539 2013
348 2013 1101 4592 6205 -2122 1948 9442 -612 -1428 7132 2705 -256 1551 1775 4289 -111 -3091
364 -3091 5836 2121 -6150 2352 3301 -4377 -1302 -163 -545 -405 -5245 -444 2650 -7133 -4767 3478
380 3478 -4518 -5929 -452 -2067 -2530 -4094 -3663 1932 -3497 -7320 2371 155 -6914 -316 1536 -2257
396 -2257 -1457 -1386 1515 1738 -4463 1200 5845 -3360 -1083 6042 665 -253 2584 2327 3962 108 -7
413 -7 7296 2049 -2775 5958 4466 -1178 3125 3595 2250 2169 -754 3582 4143 -3688 1202 5606 -2327
430 -2327 -1651 3081 -18 -772 -1268 -1060 2668 -3117 -5106 3106 -1201 -6312 650 -74 -4447 -2079
446 -2079 -2187 -1138 -1970 -6273 -486 1316 -6828 -2606 2375 -3812 -3291 -374 -1100 -593 -3054 -1678
462 -1678 3589 -1920 -3494 4595 796 -3096 2281 1988 501 1005 -228 3636 3117 -2116 3463 5686
478 5686 -1673 1684 5239 1128 1017 1640 2707 4680 -251 84 6215 705 -2139 4256 1875 -1304
494 -1304 1200 526 1422 -160 -2883 2283 1487 -4885 253 1956 -4074 -2784 -109 -1437 -1420 -3517
510 -3517 -2273 1111 -4154 -4216 1897 -3049 -5234 454 -920 -2749 -2195 -2385 614 -701 -4524 1051
526 1051 1424 -4226 128 2374 -1842 -85 477 838 2331 -1220 349 4902 -572 -697 5219 1588
542 1588 -168 2892 1940 2857 1785 -83 4012 2541 -2203 3919 4217 -2020 1169 2962 1174 1263
558 1263 -739 671 2962 -1958 -998 3144 -2172 -2473 2039 -820 -2189 -846 -1793 -55 -2190 -3944
574 -3944 848 -804 -5569 -263 96 -3741 -1991 -1227 -1337 -782 -3472 -1239 1378 -4197 -2458 2705
590 2705 -1418 -2439 613 -281 407 -336 -1251 2151 495 -2084 3511 2027 -2088 2431 2699 356
606 356 1475 1036 2760 3072 -953 1976 5316 -622 215 4053 1054 679 1992 587 2161 90
622 90 -606 3551 416 -2651 2254 1373 -2008 89 -165 -1086 9 -1965 -231 678 -3853 -1405 1515
639 1515 -3178 -2687 77 -2138 -1687 -1740 -2388 215 -2828 -3747 1421 -947 -3946 312 -137 -2334 -490
656 -490 -942 210 429 -2396 781 2609 -2427 -282 2984 -591 698 2062 376 1837 629 713
672 713 3785 126 -726 4225 2203 -735 2493 1923 1402 1727 159 2243 2431 -1430 1747 3116 -1336
689 -1336 266 2030 -390 126 -230 -369 1292 -1622 -1571 1996 -1485 -3174 530 -816 -2394 -911
705 -911 -1729 -1066 -1291 -3168 244 166 -3955 -1185 723 -2783 -1667 -493 -1365 -358 -1498 -1050 1333
722 1333 -1763 -1705 2217 -469 -1799 1966 450 -75 957 -397 1979 1422 -1269 2285 2566 -977
738 -977 1973 2711 117 1324 1449 1429 2464 145 866 3527 -128 -80 2982 412 -570 1295 499 982
756 982 101 -1186 1589 433 -2453 679 827 -2371 -472 78 -1554 -739 -1832 -1432 386 -2854 -1901
773 -1901 966 -2337 -2537 303 -1412 -1879 -802 -1577 113 -1001 -2759 730 146 -2343 456 736
789 736 -1516 258 -140 146 1006 -950 219 2512 -716 356 2858 211 278 2022 717 1423 1140
806 1140 132 2687 1553 -681 2590 1874 -468 2026 1248 101 1020 382 371 1605 -1361 311 2149
823 2149 -1529 -853 1230 -764 -681 -315 -1046 78 -1007 -2602 861 -974 -3211 284 -415 -2644 -577
840 -577 -911 -1707 -756 -2021 -619 354 -2571 -1122 1260 -1671 -1103 375 -784 -307 -208 -753 1184 -268
858 -268 -1381 2104 588 -1207 1450 751 279 1276 567 1451 1777 -566 1380 2580 -793 697 2385
875 2385 308 940 1412 485 1667 618 -46 2113 338 -936 1868 389 -1127 825 189 -483 404
892 404 -1081 -172 230 -2211 -297 596 -2258 -1086 72 -1687 -732 -1242 -1402 -65 -1505 -1804 645
909 645 -1519 -2155 278 -973 -1593 -114 -855 -72 -1 -1740 382 932 -1676 384 1134 -1092 435
926 435 1122 53 1228 420 564 2111 167 -130 2523 781 6 2040 872 911 1548 70 1168
943 1168 1279 -753 1573 1586 -571 742 1301 -522 559 465 -301 1134 -744 -840 1146 -901 -953 862
961 862 -955 -1184 -19 -1167 -611 -482 -1951 -140 -284 -2363 -378 -58 -2047 -832 -297 -1209 -287
978 -287 -1195 -1022 650 -1271 -1124 951 -1067 -720 897 -157 -7 678 -93 1134 737 -767 1548
995 1548 1071 -699 1374 1473 75 1328 870 852 1657 141 1101 2350 221 94 1967 -174 301 1130
1013 1130 133 546 351 -532 943 320 -1190 884 469 -1304 128 -304 -1079 -172 -1047 -701 108 -1842
1031 -1842 -886 447 -1756 -1426 52 -1218 -886 -296 -1053 -66 -777 -1675 33 -459 -1746 393 17
1048 17 -1209 428 -230 -368 491 -502 372 952 -823 466 1670 -448 196 1557 202 837 584 3
1066 3 1628 937 -441 1526 838 -210 1599 834 14 922 73 569 1528 -394 386 1373 -743 37
1084 37 1011 -840 -229 286 -573 202 -623 -1090 365 -879 -1519 527 -848 -1325 -259 -1014 -1077 -252 -1315
1103 -1315 -441 45 -1871 -484 5 -1658 -610 250 -1325 -61 -422 -912 882 -394 -616 1244 -120
1120 -120 -600 1128 352 28 784 475 735 1034 -161 1183 1393 -192 900 1525 -93 710 981 309
1138 309 1274 476 62 1393 123 -518 1627 108 -340 864 -233 5 360 -687 171 88 -1405 344
1156 344 -39 -1586 -95 58 -1074 -391 -600 -1214 318 -1240 -1188 382 -910 -1187 379 -1081 -908
1173 -908 -65 -1147 -425 84 -773 155 398 -1347 572 473 -700 176 553 -186 669 454 86 1556 -198
1192 -198 132 1761 149 -78 1034 280 353 1111 80 1023 848 82 1451 991 -271 794 554 -307
1210 -307 646 -123 -1 687 -619 -238 660 -557 -440 751 -906 -406 116 -1022 -444 -329 -1186 -188
1228 -188 -465 -1556 -77 16 -1565 -164 -550 -1157 -75 -872 -598 205 -891 -402 538 -808 -621 352
1246 352 -673 -97 255 -453 479 327 -436 1022 585 -646 857 687 -35 952 562 114 939 132 527
1265 527 897 255 502 1299 81 497 937 -118 473 482 -287 748 43 -709 1016 196 -668 364 -228
1284 -228 -533 106 -653 -347 192 -1328 -374 342 -1195 -363 143 -776 -538 -630 -1101 -217 -591 -954 172
1303 172 -659 -1093 120 -524 -633 -43 -192 -284 200 -509 245 520 -797 349 840 -619 490 622 -182
1322 -182 497 397 307 1288 257 499 1160 471 -43 1429 395 135 937 267 666 859 -160 453 797
1341 797 -344 418 749 -516 -31 245 -327 410 -454 -501 499 -570 -911 183 -546 -922 16 -778 -524
1360 -524 -54 -1174 -314 -261 -1245 -165 19 -1144 -121 -216 -950 -31 -335 -381 323 -568 -547 584 -372 -275
1380 -275 530 -73 -69 719 19 355 556 -477 873 627 -334 802 919 20 897 635 192 1066 584 205
1400 205 885 -83 75 886 132 241 607 -247 61 729 -371 334 392 -838 343 -25 -706 278 -107
1419 -107 -556 101 -509 -572 47 -741 -572 119 -988 -649 -132 -689 -420 -17 -741 -256 -558 -910 98 -483
1439 -483 -838 172 -257 -496 278 -15 -261 453 19 -8 741 -324 324 995 -32 453 862 140 315
1458 315 530 -70 827 432 18 869 464 -181 829 260 -72 575 237 252 422 -414 9 273 -327 -142
1478 -142 388 -225 -184 -10 -547 -80 -168 -894 64 -309 -707 284 -818 -872 -246 -481 -580 -216 -542 -361 137
1499 137 -1047 -251 176 -946 -137 40 -687 -163 321 -471 361 145 -167 481 -445 -322 735 98 17
1518 17 822 44 202 935 -234 298 770 -26 373 647 -50 573 690 197 874 345 4 621 63 -56
1538 -56 1164 -134 -473 609 20 -386 283 -555 19 36 -860 -151 9 -659 -56 -167 -649 -441 -303 -652
1558 -652 -76 -702 -517 -170 -399 -654 179 -571 -391 205 -636 -534 -154 -496 -110 296 -450 258 95 -575
1578 -575 245 269 -437 616 298 190 816 178 -110 677 28 343 683 128 492 776 312 396 496 -321
1598 -321 389 639 52 549 46 -255 344 228 -105 261 -106 104 328 -401 -163 466 -301 -699 291 -497
1618 -497 -264 -39 -819 -185 -184 -1087 -119 -236 -679 -128 -206 -767 -56 -318 -258 191 -415 -354 343 -420 87 380
1640 380 -446 -68 133 227 -117 231 -111 586 367 -96 527 408 -116 516 404 279 617 434 283 640
1660 640 123 -112 883 -156 492 572 -61 528 263 -8 201 168 -147 354 197 -372 386 -142 -439 132
1680 132 -294 -375 308 -359 -296 -32 -471 -559 -80 -389 -558 -297 -220 -182 -201 -389 -23 -203 -547 386 -460 -282
1702 -282 311 -40 -289 418 -249 418 244 -293 116 449 -52 -106 456 -44 518 357 219 609 345 91
1722 91 627 181 128 527 453 220 691 131 326 454 -61 6 343 -359 85 90 -391 40 155 -288 105 -155
1744 -155 -233 195 -304 -365 188 -318 -338 229 -194 -486 7 -687 -464 -68 -639 65 6 -639 35 58 -783 48
1766 48 -80 -357 -17 -169 -314 316 -432 -230 379 14 -109 638 189 30 291 72 659 384 26 191
1786 191 483 -131 631 393 -180 594 378 -116 725 -323 119 370 -181 -11 428 115 155 -6 -209 125
1806 125 -37 -400 -178 -106 -605 12 -45 -338 -97 -205 -278 -187 -386 -440 41 -378 -361 106 -654 -525 -295 -444
1828 -444 -465 91 -278 -64 173 -356 -169 132 -254 306 260 87 252 -38 118 378 -84 -37 510 24 146
1849 146 318 159 172 609 85 561 547 -202 249 280 193 627 86 149 466 92 -115 65 95 183 437 -353
1871 -353 -121 361 -368 -154 136 -183 -161 -206 -463 -67 72 -319 -100 45 -600 -151 -51 -116 115 -397 -371
1892 -371 68 -331 -20 117 -243 60 321 -324 133 -130 -375 26 -284 -314 358 344 -101 231 70 183 337
1913 337 171 111 478 301 -3 659 140 303 208 -187 333 242 -108 152 376 185 401 -176 -211 390 49
1934 49 -275 227 -182 37 290 -528 -70 -234 -162 -136 -213 -546 -53 -22 -210 -139 -268 -422 -212 -184 -242 8 -251
1957 -251 -414 129 -412 -320 109 -382 -181 105 51 214 199 -127 206 430 6 99 313 123 412 245 66
1978 66 502 230 -45 360 252 207 730 -53 266 493 230 116 507 139 148 405 15 494 312 6 162
1999 162 54 -214 234 -21 -151 68 -243 -346 98 -70 -341 5 -255 -220 21 -445 -94 -22 -257 -280 -98
2020 -98 -416 -135 -449 -553 -60 -27 -350 25 -211 -47 110 -49 -177 68 40 274 -42 103 470 623 -126
2041 -126 91 80 -283 636 716 121 389 344 -30 484 11 225 349 158 -163 489 68 105 261 -168 -50
2062 -50 331 -96 -72 254 -158 -172 94 -348 47 -165 -307 320 -220 -229 427 -137 -399 186 -280 -263 107 -149
2084 -149 -390 245 -311 -110 -214 -154 -41 -46 -339 84 -24 -56 279 92 -142 304 -106 -128 418 38 50 305
2106 305 -61 254 454 -27 17 435 -187 321 87 31 361 51 4 175 95 12 338 34 64 378 45 267
2128 267 315 -326 -39 157 -157 -311 393 -422 -217 -13 -83 -53 -351 -220 -226 -112 -343 -116 -75 -403 9 -263
2150 -263 -397 45 -111 -120 -89 -320 -56 23 103 -7 -13 -154 303 70 -132 166 -6 -266 247 -87 -187 540
2172 540 127 -36 221 180 -86 604 166 197 137 99 450 326 133 353 300 1 148 119 -127 141 -78 -2
2194 -2 200 14 148 -29 -246 10 174 -269 -158 224 -211 94 -10 -204 101 -236 -286 -59 -222 -443 102
2215 102 -357 -280 84 -107 -59 301 -353 62 342 -319 -59 -82 -141 340 49 -179 42 269 -112 267 2
2236 2 91 162 -181 99 176 190 -115 299 144 138 436 -271 308 249 -379 -92 254 -101 181 199 -7 29 32 -125
2260 -125 241 -222 -114 -112 -109 32 -59 47 -154 142 -292 -308 -12 -262 185 124 -449 -186 -33 -240 -133 -48 -279
2283 -279 197 -121 -207 -223 -314 -145 105 -102 12 129 -193 74 118 -25 93 269 -55 -198 164 167 454 355
2305 355 284 100 191 -36 245 115 87 311 18 76 238 -161 160 121 -177 232 14 -92 149 -29 -63 -117
2327 -117 124 139 220 -237 -39 -16 46 -242 144 -22 -178 13 -365 -36 86 -400 -21 92 -229 70 246
2348 246 -131 -204 -280 5 59 -12 -271 84 -66 -89 186 -177 -120 47 -211 -86 379 95 249 148 99 433
2370 433 -43 -115 -12 123 -18 -32 32 -190 367 114 12 254 35 216 86 24 221 313 -123 83 73 -165
2392 -165 8 -52 170 22 -258 -288 190 48 -377 36 -120 -96 65 -183 -239 117 -193 -173 85 -64 -248 -158
2414 -158 -409 130 267 -150 -91 123 -101 122 -84 -2 -213 -101 -112 48 28 -114 88 -80 206 220 47 257
2436 257 418 47 241 -39 291 41 -18 -287 201 207 -37 8 -60 -25 -57 394 208 267 84 188 83 -14 -88
2459 -88 150 -217 -218 -153 -159 10 11 -299 10 298 -336 -191 -58 -87 -85 -289 98 121 -341 -130 151 -412 -119 -43
2483 -43 175 57 -180 7 16 126 -317 -4 171 -109 166 280 -101 224 102 230 287 -117 260 458 -98
2504 -98 229 239 -4 244 161 38 298 70 -96 110 96 -238 287 165 -6 322 -238 51 75 -77 174 191
2526 191 -383 153 93 -103 189 341 -41 -287 -128 -359 196 -30 2 -126 -242 102 189 -453 -2 57 -119
2547 -119 46 148 -230 -104 207 -52 90 -121 -116 105 45 -123 89 17 156 316 39 -38 288 72 287 158
2569 158 13 127 288 380 59 102 31 177 62 -11 45 200 -80 298 152 -14 76 61 -61 218 -120 -222
2591 -222 220 -230 -171 -31 -248 -90 97 -68 118 -88 -93 88 -51 -208 93 112 -120 -42 261 -100 259 -184
2613 -184 -168 208 -28 -237 26 -20 154 255 26 133 -195 -91 -38 -105 -35 163 203 -28 215 189 5 259
2635 259 213 -3 491 36 410 125 38 -72 32 -145 217 66 -211 -30 294 -182 121 109 -339 161 -114
2656 -114 -28 328 -65 -74 148 -255 20 -356 62 -125 -116 -253 -186 49 -239 -62 121 -6 -101 -59 -65 130 2
2679 2 -120 -43 -22 -197 142 -246 -62 82 -179 -156 430 -120 -119 332 22 282 33 -14 110 117 54 216 -208 1
2703 1 122 142 11 251 121 174 276 70 -95 180 85 -18 -6 107 52 -165 -4 42 105 104 72 103 -170 -26
2727 -26 -4 -65 199 -234 -156 61 -124 101 104 -56 93 193 -269 68 143 152 -73 -23 101 -33 34 92 -107 -115 25
2752 25 227 -102 50 235 28 5 9 131 180 3 -84 153 103 170 4 195 17 147 370 -221 118 -2 151
2775 151 109 61 132 -199 -180 -56 112 -72 110 159 98 215 154 -125 46 41 -389 -214 -95 25 22 119 123 -55 95
2800 95 215 71 -450 -218 131 -111 -261 -201 30 -24 -63 85 -72 212 238 255 227 103 -18 162 -20 42 26
2823 26 -35 9 81 57 217 68 -108 17 -76 -270 243 157 95 378 -396 24 -289 -229 15 173 -255 238 50
2846 50 25 116 210 229 -187 -94 -110 244 -206 -310 132 -30 -103 -140 -183 -321 -64 152 39 -237 9 218 -20
2869 -20 -159 -62 -212 -163 6 126 -136 67 -253 -178 166 58 123 -145 -143 88 72 -138 -85 91 -369 47 132
2892 132 -156 140 -175 -11 -132 202 -210 184 125 279 -200 -276 -12 105 33 -394 -5 -29 102 114 -221 -41
2914 -41 -42 -14 -112 -152 90 -162 234 6 -222 -117 -181 84 -184 -88 -91 135 -37 -236 -88 -80 7 -124 -159 -67 -121
2939 -121 -168 -265 -28 -109 -99 73 76 67 94 196 -43 76 106 10 44 261 -52 301 11 40 291 -67 -107 356 -83
2964 -83 32 -70 185 66 80 -8 -86 109 -36 -65 -106 -191 -259 183 -341 -9 39 -174 80 -48 27 -190 -27
2987 -27 -17 22 -216 83 -12 -96 -104 -69 -54 269 290 -5 -66 -26 65 -117 -71 -132 -92 191 -218 4 34 -179 422 132
3013 132 -140 60 245 -118 -3 60 -11 4 300 -382 -243 -18 128 6 -73 -20 80 -238 220 176 87 364
3035 364 34 186 51 131 37 30 -103 -74 -86 -11 -16 105 -56 181 81 45 -283 -73 -104 138 175 36 -121 -110
3059 -110 -6 160 45 41 -16 -108 -17 -206 -137 78 112 57 -21 35 -189 -148 74 -25 -173 30 -297 79 -140 -167
3083 -167 -152 92 17 90 -30 70 296 -117 79 -43 323 -2 -77 493 -128 -25 82 -47 -81 138 29 318
3105 318 -205 158 67 -185 -48 -58 32 -130 113 95 -446 -226 -237 -14 -33 132 70 -54 83 -11 -175 -77 116
3128 116 -167 -62 -42 -173 -73 37 132 -183 8 -140 341 -20 -11 -118 94 166 53 24 216 190 -75 31
3150 31 162 -38 70 131 265 -61 198 133 50 57 -1 79 -137 65 -13 -29 -135 267 -120 43 -128 13 11 201
3174 201 -31 -185 233 -48 -128 310 -365 128 -102 -51 300 41 -261 -33 -47 -189 -78 132 78 -221 -89
3195 -89 -119 9 -103 -3 12 32 231 58 -107 -15 62 -125 5 -69 -125 -165 -46 -173 211 -127 69 -70 117
3218 117 198 -126 -154 -76 -21 -12 93 -149 231 -68 -11 -267 210 166 4 -93 -49 -195 -123 -127 -89 -111 -339 236 -158
3243 -158 -196 -4 -76 -117 43 -112 165 21 -169 -239 -111 124 -367 -29 12 -136 71 -4 -100 42 0 173 -191
3266 -191 -82 -113 -126 -106 90 -215 -80 298 68 -173 -175 181 -66 -111 -40 -76 93 80 229 -82 -186 207 101
3289 101 2 -104 150 -71 80 146 121 13 43 173 -12 51 -206 109 153 -17 -127 -80 30 -93 -203 42
3311 42 89 0 -57 175 101 267 56 18 -24 -96 -43 -22 227 -13 -59 -47 -60 96 -400 133 -74 -236 -182 -3 -216
3336 -216 30 -377 -16 -167 -155 114 56 20 -73 37 -114 8 -14 9 133 152 211 -161 -38 414 190 2 125
3359 125 154 -5 33 48 -288 98 10 158 198 63 81 -81 -91 376 240 260 268 173 -136 -496 86 198 -369 -49
3383 -49 -40 37 -164 -305 105 -175 155 -315 -17 396 -135 -84 811 241 -237 -157 418 378 84 -361 -86 614
3405 614 388 -749 20 -61 580 -227 248 199 -239 95 -22 50 2 150 110 -192 -49 -10 33 -60 -28 2 22
3428 22 -17 84 -8 118 -41 -250 67 -9 -226 -5 -12 -67 270 76 -156 74 19 18 149 244 -86 -121 -24 208
3452 208 18 -18 -56 -22 -106 -25 -126 -269 177 -22 37 260 166 -108 222 60 -43 -335 133 -44 -79 -53 -203
3475 -203 -40 -88 -59 130 -51 -15 142 -203 208 -1 140 167 113 -213 16 -187 -129 -32 -281 195 254 -58 -469
3498 -469 -31 108 156 -44 -186 -6 121 -171 -34 203 -213 -19 -225 101 123 -67 -132 -92 -27 -28 -175 -31
3520 -31 14 -205 -49 -282 -113 -220 241 219 35 251 36 -55 30 132 -53 27 -7 -91 -42 -310 -25 -16 -285 -76
3544 -76 95 138 78 -205 84 -122 -97 110 -265 -141 -25 342 128 -84 177 -205 -13 43 11 -171 61 21
3566 21 -199 -1 62 46 -32 -88 362 46 214 -222 -193 -127 -218 -99 -21 -85 88 -94 96 -226 -154 -10 73 66 -107
3591 -107 -74 106 255 -163 48 192 120 -142 65 -86 -90 27 428 196 -169 262 28 41 -160 95 11 -30
3613 -30 287 -44 -15 83 -114 -144 160 215 -70 250 -71 82 240 -113 -46 -43 -257 -161 -102 -80 78 -278 -47 -96
3637 -96 -56 43 162 -29 -181 -124 -214 -9 -41 77 29 -14 202 333 -20 -103 141 216 -245 107 112 -55 111 16
3661 16 -87 -144 210 117 -46 -28 54 145 96 272 214 14 -13 -183 -207 30 -186 -58 -124 -187 56 -65 69 151
3685 151 256 68 -87 85 132 -102 221 152 174 -65 -221 49 -22 -14 -22 -229 -52 -188 -131 80 -289 -129 -199
3708 -199 118 64 -53 -74 -87 63 36 47 177 -68 -2 -5 -34 -1 260 22 3 -10 -68 -76 2 129 53 -100 -27 -25 101
3735 101 75 253 154 -77 85 -236 81 200 153 -272 347 144 -23 121 66 -232 28 -45 171 141 260 83
3757 83 -144 -21 8 -51 79 -15 -176 -16 283 65 101 -120 61 86 111 122 -252 276 104 -51 -77 -61 287
3780 287 -14 -287 181 -7 -190 -124 -114 99 7 -142 -120 -67 375 -93 105 152 -20 59 45 126 -25 -199 89
3803 89 6 119 -153 73 -153 44 -136 -114 275 -193 -142 -179 -296 161 -23 51 -130 -49 -111 30 17 -2 3 164
3827 164 -156 31 -226 -277 -80 -23 80 -22 37 -135 -173 27 10 45 112 -165 34 113 -185 2 -100 203 -16
3850 -16 -267 -307 -31 -375 170 157 54 -92 -173 124 237 123 -172 -210 68 -16 18 129 67 -83 43 109 220
3873 220 -53 -11 -45 -297 -50 37 47 292 78 -27 -36 -65 141 15 108 -131 -5 -11 -170 12 -216 -177 216 68
3897 68 -16 261 -369 -13 160 -151 265 -98 -8 -52 16 -221 45 -94 -18 -30 36 -125 -169 60 57 159 -112 69
3921 69 -46 120 -123 118 -54 -49 56 116 -27 -148 5 -97 -147 22 149 -3 -87 2 10 -194 320 70 56
3944 56 -28 -166 -9 31 -295 -51 -119 -239 134 108 135 -217 -14 52 266 -223 -164 -63 -64 -236 -49 49 224 82
3968 82 -13 89 -76 -152 -25 109 207 -77 -40 162 238 80 -266 87 55 151 165 85 -186 -38 81 235 44
3991 44 177 18 -176 76 -197 -15 -148 -112 108 95 73 81 -47 -86 65 -37 -129 -191 -258 -86 -76 -243 43 259
4015 259 -56 8 -52 -126 -127 -163 63 -184 -114 -13 103 235 10 55 -114 -192 11 -64 208 118 296 141 204 402
4039 402 -128 105 -153 -156 -39 -77 -16 194 107 223 -40 112 -115 86 236 33 -3 79 -364 147 106 -37 108
4062 108 8 133 26 -334 5 218 -180 -91 49 -172 -185 82 144 391 21 -205 -82 361 -67 -77 -46 -112
4084 -112 93 190 16 106 -175 -90 -91 347 -251 -77 210 -58 -239 -34 333 173 -72 78 -272 259 -81 138
4106 138 28 87 90 -120 -252 -50 -74 -31 101 -221 12 128 -265 234 219 -40 215 26 66 226 16 -201
4128 -201 254 9 -44 281 -124 90 123 -5 -60 -192 -263 167 -282 188 20 -262 4 31 172 -333 9 -262
4150 -262 176 150 -197 -60 0 -105 -77 21 127 -92 -49 97 -120 20 -222 309 115 -26 -75 -89 -155 -5 -251
4173 -251 -162 -77 -106 25 7 36 34 -155 82 -235 -121 141 253 -85 94 -5 -128 -13 -19 179 89 150 144 188 -49
4198 -49 48 -127 -178 44 65 -202 8 87 32 -297 280 -52 280 105 87 -71 -133 -44 -228 -222 74 114 -156 50
4222 50 78 -18 -396 158 287 -90 99 -69 -69 -161 219 -24 136 141 37 -84 -13 -71 60 7 82 66 -9 58 -51
4247 -51 102 181 44 -37 -14 -139 -93 -133 -166 -47 247 106 21 456 -14 -103 -224 -22 -170 12 -42 0 -155 0
4271 0 30 22 134 68 175 162 165 -91 -37 -73 -59 -117 19 40 114 -131 29 28 -203 28 46 116 -85 -77 -150 -340 241
4298 241 -61 -81 -12 61 21 211 9 -144 1 -12 252 59 68 246 6 2 29 103 49 12 -180 179 85 -42 36
4323 36 79 97 -89 239 51 190 -20 87 -137 52 -159 -77 -12 20 -40 17 25 112 124 85 110 -300 -104 22 -34
4348 -34 181 225 46 -109 -8 -113 14 75 -126 -207 34 38 -127 -227 -36 -120 -137 -147 98 131 -204 292 -87
4371 -87 93 -160 -131 16 186 101 100 192 255 7 -168 38 19 74 99 225 32 -188 -73 95 39 191 19 -63
4395 -63 -57 -18 -168 125 202 94 -94 66 -166 -257 -33 -71 181 181 -116 -13 -66 -80 -115 -167 236 -139 -68 246 83
4420 83 -123 71 179 197 490 -50 -12 -122 -49 -209 36 -142 86 250 -70 198 -123 -177 21 136 447 -81
4442 -81 101 -197 56 120 -13 238 204 -151 190 -125 163 -29 -82 121 -118 -208 -215 205 -268 -188 -85 79 32
4465 32 -67 -85 -6 27 157 10 -68 -203 -48 -260 -93 -131 -36 68 -74 -5 -141 -42 53 47 20 50 -174 -233 -115
4490 -115 31 40 -102 3 -79 -14 -237 120 240 -61 175 -128 17 -69 140 -172 148 290 -48 232 -124 96
4512 96 -74 -299 212 161 241 -197 44 -26 9 -154 139 172 -35 64 -193 -42 -269 330 -208 136 13 37 233
4535 233 -65 -48 -40 -173 -109 246 -103 -58 -89 19 -80 -65 -251 -67 -342 234 -47 115 282 238 -4 91 -136
4558 -136 12 -269 -151 -5 17 27 292 205 -134 -49 40 276 29 80 -181 -145 -98 75 11 14 119 21 -62 268
4582 268 -16 110 -43 -209 -24 85 -157 -350 188 66 -112 -105 -87 216 14 55 78 -54 -284 -181 -172 -185 14
4605 14 34 21 150 -38 178 -232 156 -156 137 20 -172 339 100 254 17 20 126 14 -2 42 199 -168
4627 -168 -119 78 -310 -193 133 -160 112 -213 -13 9 11 116 153 -18 -44 -247 97 -10 167 33 -182 80
4649 80 -123 153 -16 -71 152 -226 376 -72 -189 93 -171 168 -27 -40 -48 -123 89 -227 -2 39 35 -37 138
4672 138 22 152 346 -182 -26 -31 119 40 207 -27 -45 208 -334 -131 212 7 -149 -177 63 72 -7 -124 -19
4695 -19 57 -67 73 28 67 -56 -36 124 157 -115 32 186 -154 168 61 -94 -115 27 280 64 244 65
4717 65 64 -27 -200 -181 -24 39 41 69 247 -488 -68 315 -11 -145 -62 -64 69 131 -5 -464 -157 -18 71 -251 75
4742 75 39 -48 65 -49 103 -233 168 193 -62 -70 -81 211 191 -28 -102 1 -66 -26 -48 -254 -80 -109 94 -26
4766 -26 -181 82 -153 -2 -10 -17 -72 -13 -50 -83 183 180 -47 -73 76 29 -17 222 91 15 29 -24 -397 89 -102 -60
4792 -60 1 16 -55 -45 -148 129 -8 174 -36 85 -117 10 286 -146 225 -190 -93 24 236 50 -81 72
4814 72 -85 -305 -186 -2 -56 -82 -79 276 -117 49 110 86 -54 153 -166 -97 -16 177 70 -74 -217 256 76
4837 76 -117 -87 19 157 7 36 -68 -106 63 6 113 71 85 179 137 -76 176 -270 193 189 150 135 -265 -104
4861 -104 160 -57 -55 176 -279 -41 77 -54 3 44 -190 -130 28 -62 -340 219 164 -210 -27 -182 54 -54
4883 -54 -210 -55 82 145 -79 -72 -71 -60 -72 51 110 -202 152 21 -136 122 -49 -95 -216 237 -199 154 -232
4906 -232 78 -89 -156 15 -211 154 -144 150 -143 109 218 -88 -62 153 -73 132 135 332 236 41 -77 121
4928 121 213 39 348 96 -183 140 -112 71 42 -87 90 -62 22 -71 -108 1 222 77 -285 -116 108 -69
4950 -69 11 -210 59 -98 162 90 178 -261 130 4 -191 163 -34 -66 158 -21 260 182 -16 -91 12 163
4972 163 135 140 -219 75 53 -73 -192 94 49 -132 23 501 -32 193 -315 51 189 168 -85 -204 -34 -156
4994 -156 -152 -58 227 68 -13 39 77 37 30 -143 -17 87 -73 -16 109 270 -8 -130 -437 -48 5 11 -82 229 -20
5019 -20 -1 237 -35 -294 -43 45 138 -58 -265 -105 122 122 -113 90 312 178 -7 -116 -177 62 33 227 -143
5042 -143 -4 26 47 -113 83 -43 219 -188 88 -59 8 247 -62 -160 117 135 130 -73 14 -233 234 -131 -117
5065 -117 146 50 -23 10 -4 -152 -111 -11 233 -113 -112 24 -304 -199 -164 23 -147 165 -97 -16 132 -233 -196
5088 -196 237 -52 70 35 -29 58 -138 -46 -147 72 -255 -165 111 197 24 -139 -130 4 -127 76 81 -31 106
5111 106 -261 25 -33 95 21 177 282 154 189 23 -104 -164 75 142 -75 40 2 61 123 -72 -106 85 -105
5134 -105 -291 -73 276 70 -234 64 -235 -46 -76 -124 -216 -117 -120 -96 -50 233 -114 -156 311 -211 -249 -181 75 105
5158 105 -12 -62 25 29 -82 187 27 66 -30 -143 9 114 76 27 -169 -67 -70 41 -78 42 97 65 -69 -45
5182 -45 -300 -78 -39 98 116 -115 20 -1 -61 73 -94 -242 -35 259 -154 -199 63 -15 178 7 -159 337
5204 337 -85 -46 89 -133 125 145 -115 -208 -16 -100 5 283 -114 7 -103 84 -5 -50 51 -26 103 -68
5226 -68 69 -34 22 117 83 48 -81 -55 12 154 152 49 232 10 87 88 85 165 20 10 57 -273 -39 -220 -199 -8
5252 -8 110 190 -65 180 -25 33 127 59 -161 15 -34 -54 -162 180 -255 -115 -171 -25 228 -108 -162 11 -2 211
5276 211 75 -64 18 -20 9 -112 -150 52 -216 175 -202 -228 -52 39 253 -16 223 156 100 -150 133 -123 338
5299 338 -205 -256 77 -19 177 18 212 106 -138 89 28 -83 -114 35 267 -54 -40 -197 216 143 -50 128
5321 128 183 -141 -124 -128 -68 43 1 -75 -7 -236 26 -3 20 -118 -23 -136 -153 99 -161 -55 -29 -135 -89 87 -40
5346 -40 -117 -49 -38 -94 -292 -130 -12 50 297 115 -206 -17 -165 -20 134 116 108 186 -136 60 28 -11 61 14 -140
5371 -140 -154 145 18 -57 -292 -151 -159 -91 106 88 -351 86 68 111 84 -64 29 -11 -20 -105 -4 -217 -103 11 -20
5396 -20 149 79 -70 100 -17 -189 -249 -48 72 51 149 -171 129 320 113 -50 -53 34 9 51 59 -137 -110 -56 -356
5421 -356 174 -42 65 -91 47 -37 136 149 299 91 232 217 -13 -79 -52 -325 -246 146 -200 -18 -5 134
5443 134 7 -41 8 -161 -44 171 155 161 60 -63 -51 -56 -219 114 -145 59 58 -235 -91 329 101 -407 -43
5466 -43 -254 115 -89 41 215 145 174 24 237 -128 178 -58 -183 182 258 32 -122 -255 167 217 19 148
5488 148 -92 34 -63 -114 -254 -131 100 -16 -19 -108 101 103 -72 80 -33 79 -15 -9 256 134 4 -116 -16
5511 -16 71 -45 -7 106 -125 -84 101 -338 179 9 -27 -118 6 -101 3 -30 47 -96 -148 252 40 -58 -111 -238
5535 -238 -77 260 -37 -65 368 -119 -63 -48 -103 18 -177 235 -188 26 -285 -25 -188 -88 1 -192 -163 324
5557 324 -51 -264 160 -205 -2 -90 113 -7 82 -153 -161 88 -113 163 24 -18 -57 -116 225 199 95 317 -53
5580 -53 152 150 22 22 80 93 25 314 229 282 -72 -120 172 151 143 279 423 -6 45 -263 -228 -273 -247 4 69 -115
5606 -115 -41 182 36 -37 -237 145 -39 -224 -18 -146 104 -264 18 113 -146 121 -20 -165 181 129 114 100
5628 100 -106 5 97 165 -262 -189 -73 201 -47 -260 38 70 -44 -23 347 -50 -99 77 -5 123 -320 -231 -116
5651 -116 -156 -146 10 -92 -191 -331 -144 212 -115 52 102 -28 -169 -160 -38 -125 251 154 -16 -33 144 9 -209
5674 -209 -30 -97 -228 136 26 163 38 -40 -115 -251 -314 -51 -78 78 225 247 110 -47 -299 220 30 -165
5696 -165 74 -136 -89 -54 -188 -113 184 -104 -251 -280 248 -107 2 64 73 100 152 174 -33 -34 -61 19 -167 -9 -132
5721 -132 154 -157 -219 -178 -25 12 115 -177 -375 -93 138 -25 -48 -85 -19 165 206 13 -160 -241 -32 -155 5
5744 5 -53 -247 90 13 148 152 120 -39 3 -69 -19 -146 -230 -26 -245 -26 -123 -37 35 -80 38 96 148 176 17 196
5770 196 238 -134 -246 -39 -132 24 27 140 186 -158 109 -2 202 150 84 143 -32 11 118 -48 7 -205 -248 14
5794 14 -98 -8 -30 -351 97 125 -46 -209 142 -194 -154 35 52 113 -45 43 90 -7 96 11 -130 45 82 -168
5818 -168 36 30 -119 33 384 45 307 347 48 -58 184 -96 -101 403 83 74 92 106 42 66 -246 308 77 221
5842 221 194 -84 -37 85 287 120 -164 -97 -208 -134 -143 -45 77 -187 -224 110 -195 173 72 15 173 62 -263
5865 -263 -134 -13 -217 -4 33 -36 -92 -18 -26 -56 -19 11 75 144 0 210 -31 -230 -128 -103 -75 -11 -113 -125 66
5890 66 190 92 65 -13 214 -376 -10 -66 -125 -111 19 -31 108 154 -138 38 -161 -42 104 111 119 9 -185 -45
5914 -45 -127 186 101 206 -96 78 32 -72 85 179 143 99 -12 -113 159 -174 29 204 -79 -216 -60 -50 -240
5937 -240 136 -28 231 -46 179 77 238 -118 -212 -51 143 174 12 181 132 126 -18 -71 218 229 -147 294
5959 294 218 132 72 31 135 31 278 142 184 -148 79 62 215 151 60 -1 20 -13 69 -65 96 47 46 -121 -30
5984 -30 -56 115 7 -52 57 120 -66 -210 -15 -22 -196 177 -263 74 -231 28 160 -169 242 75 -8 250
6006 250 -164 136 61 -219 229 -101 164 -116 -91 40 64 15 172 7 -7 -209 131 321 96 103 -127 273
6028 273 401 -153 -189 -59 4 -155 300 112 -269 110 129 27 -2 -235 -144 72 -70 -190 238 -69 -48 18
6050 18 -50 77 28 -46 -112 -54 -76 205 159 140 -81 143 -17 5 -95 56 167 -81 -136 -95 37 -249 -27 -40
6074 -40 222 -219 84 62 105 -14 -63 173 -97 241 167 70 -40 64 185 7 -104 60 80 -115 73 85 59
6097 59 51 76 -308 204 139 26 -247 168 -239 153 -27 63 65 -102 -86 190 59 -59 45 -146 71 -64 -200
6120 -200 -26 19 -188 217 -76 -207 -63 146 -64 -131 208 -169 131 169 157 42 -33 -11 -84 110 -102 -70 -39
6143 -39 65 -168 246 -25 187 -151 15 -56 -97 182 221 24 -37 203 -212 246 -11 -48 14 -30 -2 96 -154
6166 -154 -68 104 -195 90 -44 23 -275 -30 270 9 65 -66 -59 -51 -85 29 191 64 338 111 -113 206 -243
6189 -243 -46 70 -334 -341 -115 86 -34 113 -121 -195 -55 -26 -99 58 -83 37 53 49 13 -117 0 115 -122
6212 -122 -136 -153 -140 -58 246 11 82 275 -167 -10 -108 -153 -89 -71 25 262 88 -76 59 132 -162 169 70 -27
6236 -27 -106 -208 -113 64 5 -171 119 53 126 -260 -3 99 61 244 41 145 -208 269 -25 -42 -255 -70 -47
6259 -47 -116 -56 -59 -92 -189 -159 -100 95 -180 161 24 -74 61 -96 147 136 195 9 24 153 105 14 127 38 72 -154
6285 -154 -36 -124 -135 205 -25 -48 -217 78 224 30 -168 -80 1 -200 109 101 88 -175 188 178 -129 117 -56
6308 -56 -189 -492 -58 66 -109 184 -126 2 -123 69 106 94 49 -195 -257 215 -5 75 58 -23 181 -40 198
6331 198 -157 228 -156 169 -68 -52 333 -77 178 296 -147 -34 -67 -9 98 9 17 -200 -24 -280 109 -55
6353 -55 -296 154 -154 33 -31 -148 65 213 121 -62 -193 -34 181 -8 80 50 105 -233 -26 1 -161 -31
6375 -31 -1 -37 -52 -244 262 32 -168 4 95 -179 -150 -93 -93 -19 40 -90 196 -91 -195 39 -149 162 -16 279
6399 279 5 190 48 -15 174 161 137 131 -48 -295 -115 -102 43 -78 344 -4 109 -248 -262 129 -159 17
6421 17 -140 141 -147 -266 133 27 -220 33 -109 -79 83 -25 93 40 -333 -259 -226 56 21 -37 101 187 -60
6444 -60 88 56 6 58 -21 14 5 -145 19 -137 173 -115 -191 -275 -18 -83 -1 144 -14 117 -89 -10 35 128 -28
6469 -28 -145 3 50 -143 -36 -30 178 -18 90 175 -156 -4 320 -145 -22 -170 -44 57 -222 -37 -38 10 132
6492 132 208 145 157 264 -88 94 125 5 -179 -176 -311 -139 -10 -327 -186 -79 48 20 47 15 126 122 -91 132
6516 132 -253 -4 -270 25 125 212 -88 66 -83 -10 218 -25 -26 -25 247 124 -111 -392 90 24 -28 -155 -45
6539 -45 120 -52 -135 13 -96 159 -100 -67 2 -7 -110 -193 -134 0 46 9 -7 110 -301 86 16 300 -88 -93 -194
6564 -194 -189 114 -41 14 19 -95 123 111 165 -391 -134 -22 110 -123 -52 -37 -94 74 131 79 95 -60 118 -48
6588 -48 9 3 -266 -27 -136 22 -168 -91 163 -114 107 151 212 -319 22 181 -30 -190 153 -138 131 -144
6610 -144 69 -144 -389 -12 70 -62 -198 -83 27 95 -249 235 -41 348 215 -170 -38 -6 -122 -36 423
6631 423 -224 3 -38 18 -42 -57 -9 -56 -9 -53 65 -89 -211 148 161 -7 40 -113 -117 100 -273 11 186 -107
6655 -107 42 44 -128 -264 118 -45 89 -134 41 0 255 52 29 14 -35 84 108 -204 -203 50 61 -171 -230 -102
6679 -102 -56 -163 18 1 -67 -171 16 98 -13 225 28 126 295 31 59 -299 -141 -131 78 121 -138 310 -22
6702 -22 64 55 10 30 140 23 -163 179 -108 177 -44 -295 231 227 -11 -243 -16 45 63 1 -13 15 -8 -169 -144
6727 -144 -96 189 -40 -23 274 5 -130 180 -261 -19 81 33 216 157 231 -85 56 -93 38 -53 -8 24 -72
6750 -72 -63 -105 -101 -170 -20 3 143 -203 -30 -152 -162 -77 -102 -206 3 -63 -21 -71 -226 281 16 -79 -150 42 -40 145
6776 145 150 -91 -54 85 -207 -179 -109 126 1 -80 -106 -37 29 20 -56 261 195 87 241 -13 -197 148 14 36 149
6801 149 -30 -112 193 -158 -112 132 -48 208 197 103 313 57 -149 136 -335 -73 137 -65 -215 38 -2 29
6823 29 -80 12 -263 -262 -25 112 167 -278 30 77 -39 106 162 49 -84 -23 279 -230 138 -131 -235 15 34
6846 34 39 24 -155 40 89 -5 -6 236 116 151 -87 284 216 72 -131 -100 -213 244 199 72 -7 -93 339 37 -32
6871 -32 129 67 -45 2 342 -173 17 -18 247 68 229 91 12 6 156 -97 -181 17 -111 283 -210 209 4
6894 4 -67 -16 -67 342 -2 -303 287 81 -6 -65 -151 -30 110 -93 -127 188 -116 163 -133 171 93 1 -57 114
6918 114 44 127 -67 148 -36 -168 20 -121 51 -80 79 79 -214 -94 237 -1 -213 119 -145 202 -45
6939 -45 -72 282 -126 -112 159 84 74 108 -182 35 25 -9 -5 -24 110 -33 179 217 62 129 158 259 -160 -213 -123
6964 -123 222 -238 58 84 -152 -80 -54 -31 122 79 201 -112 121 -75 -199 -26 -22 142 -154 -259 -234 -82 -65
6987 -65 129 -50 186 108 3 69 91 -7 334 -98 -18 -175 -105 -260 78 9 -50 -180 60 3 8 6 63 -21 -180
7012 -180 -163 -407 185 56 389 -157 131 -41 55 100 -155 -202 -28 -132 32 -89 -11 40 -184 -7 -76 -91 -58
7035 -58 9 -217 -111 -73 11 -272 69 -156 -74 -61 -269 -33 -4 -27 -50 -93 -157 87 358 -201 -301 -154 264 72
7059 72 -49 -89 73 95 34 -90 159 -132 -127 -166 -382 5 44 -72 151 127 -36 -146 -282 -30 -173 -335 -7
7082 -7 187 -61 249 -237 -5 -12 184 -143 -126 -73 29 -241 275 -20 11 90 -124 57 -233 -142 -252 135 -44
7105 -44 -65 -117 81 -87 -86 -134 4 -131 48 -148 -74 -135 291 16 -96 161 -112 49 -81 8 45 117 2 121
7129 121 54 10 -67 -30 -95 -40 -85 83 -63 -99 12 -143 228 -216 190 348 17 277 -39 -205 -149 98 -23
7152 -23 -151 128 8 -6 10 68 273 25 -166 -188 108 -58 5 -83 72 -89 -4 -154 -151 258 54 -147 -20
7175 -20 189 129 39 -17 -125 57 -26 132 115 121 79 -37 143 204 -32 25 148 91 262 98 64 -55 -303 78
7199 78 174 66 112 234 -104 25 89 -18 -142 49 62 57 -175 -208 86 -22 -395 58 81 85 147 117 103 74 -49
7224 -49 -15 -153 -235 -132 -199 146 -126 113 -60 -200 -137 -117 -9 109 -122 -93 -183 -5 -197 7 -60 -5 167
7247 167 -232 25 -232 -64 -21 143 -121 -58 -74 173 87 -96 -30 -78 -151 24 105 142 -275 208 -31 -200 -16
7270 -16 -158 54 -122 98 -78 -126 147 -93 -37 -165 -102 -119 -79 77 72 183 -133 -25 -84 -142 0 54 206 -153
7294 -153 -227 121 -26 -54 66 18 -13 -39 -54 113 160 79 -228 24 129 6 111 84 99 -312 -263 92 -112 48
7318 48 -34 -12 277 91 90 41 -51 23 -91 186 -106 -27 -29 -87 335 276 198 83 58 51 -49 15 -52 49 -53 48
7344 48 13 -81 -90 -17 -71 157 246 -132 68 -120 -37 -47 42 54 3 -35 134 11 290 70 -329 -50 -227 -35 -248
7369 -248 -157 156 -8 -85 293 -176 121 -92 1 -194 -43 38 31 42 44 53 -53 123 53 3 157 -138 15 110 47
7394 47 -114 -304 78 2 -57 -25 -85 52 -57 -223 0 344 -17 -115 -181 -1 45 -78 205 -23 -262 24 -49
7417 -49 -4 -58 -140 108 -40 -26 -126 316 -105 -208 -163 187 -210 82 -103 -25 -107 -53 262 -26 -2 -210 37
7440 37 147 -247 -39 -167 193 175 -77 -111 -219 290 243 -23 103 -5 122 30 -107 43 325 -156 -48 -54
7462 -54 -146 -72 81 243 23 160 -78 24 52 -18 -124 71 -49 159 -121 -238 133 81 165 -192 54 -159
7484 -159 56 -105 -207 185 125 38 277 129 12 -77 48 199 50 183 91 -207 -23 40 -7 -18 -29 -17 57
7507 57 30 -257 -106 -32 61 -59 1 151 57 54 126 -221 110 261 75 50 -64 -3 -104 -29 125 27 161 120 119
7532 119 110 -136 218 18 158 184 176 -240 -18 -1 71 131 169 189 -176 16 323 47 -11 89 -97 166 -143 88
7556 88 -8 -68 -33 -12 -262 -13 -321 -53 -273 -82 108 47 9 -216 93 25 -27 83 111 236 -117 68 86 24
7580 24 -127 -30 -17 -34 105 -257 -241 141 -39 -73 32 77 -137 -141 -197 257 -42 -10 -168 89 1 162 -79 13
7604 13 -121 102 -12 216 82 -28 -94 65 -44 -187 140 -269 5 -33 -142 16 -62 243 132 92 147 -184
7626 -184 51 -48 -323 -214 -33 -24 -83 71 141 106 296 98 -209 -28 -181 234 16 31 -86 -139 -79 95 62
7649 62 81 68 -96 51 257 246 5 224 197 46 222 132 37 210 -362 130 139 -43 17 -38 81 -236 -143 69
7673 69 221 -152 50 183 -179 -154 228 127 -38 -40 -205 -252 -65 70 -137 -144 105 -194 -196 284 -167 159 -111
7696 -111 43 -18 -176 126 -109 164 55 276 55 -52 123 -44 -56 -114 -33 -17 84 109 -78 54 209 -32
7718 -32 67 -163 -55 -208 73 -74 81 178 -241 67 34 22 122 2 -30 166 -79 13 -96 -50 132 -186 56
7741 56 -95 -75 53 -292 17 -190 0 152 8 -112 132 150 -24 51 48 23 24 230 -26 -157 -34 -2 -135
7764 -135 8 -22 -46 103 73 73 4 132 -93 164 -4 121 262 115 -91 397 -232 177 216 148 294 -15 88
7787 88 102 -135 -165 180 -215 296 20 -105 -13 138 200 -170 -68 25 -74 -37 158 -124 210 35 195 -68 71
7810 71 300 -112 145 -124 57 148 100 -120 -101 155 105 121 -5 167 61 226 -161 65 225 56 -8 -115
7832 -115 166 -86 210 22 76 56 -98 -127 37 -52 -2 -220 199 -43 182 -154 -145 12 -84 50 -68 -119 202
7855 202 104 77 -125 -90 248 92 51 93 -9 -66 -81 58 215 28 343 -158 -148 -74 -2 127 -44 -189 -78
7878 -78 89 -89 -44 43 -16 -31 185 -15 -42 -86 -200 -3 234 240 -93 -183 -110 -72 76 -98 62 321 -37 289
7902 289 -102 300 152 -113 240 162 -33 192 -169 -96 -60 -104 -71 89 75 -152 28 32 181 19 54 -167 -85
7925 -85 -139 88 331 67 78 47 87 -242 -80 2 148 -42 28 -35 -155 209 128 -37 219 -28 33 -63 135 369
7949 369 66 -418 -131 -19 61 -221 -51 39 95 55 -110 219 -33 88 131 222 90 -89 -121 142 -101 -200 209
7972 209 53 -172 105 -88 41 -233 -61 67 -79 -41 -147 123 194 -49 188 -106 194 -173 306 -26 -115
7993 -115 72 -86 55 -183 181 15 120 19 -48 -34 22 -171 -151 -142 27 67 140 397 79 -97 -81 26 -11
8016 -11 -205 151 73 -12 -188 215 -89 263 182 -204 92 -68 91 170 -113 167 -67 169 161 144 -106 -148 -9
8039 -9 137 -181 119 182 -119 13 103 166 -340 -13 3 50 -177 -35 7 -61 -173 87 41 -173 -107 98 -43 -104
8063 -104 -200 -81 180 -20 -63 -360 240 39 90 76 311 -118 31 -47 150 -98 -351 183 94 172 -129 13
8085 13 181 -35 -15 -38 -103 97 -23 135 48 123 -9 -19 -55 9 84 44 -224 -281 -35 -57 4 112 5 73 -200
8110 -200 -62 5 -119 -151 -128 123 -112 216 -179 35 99 -234 308 185 240 -136 254 121 165 -36 -41 89 147
8133 147 68 -275 -199 -119 -69 22 156 -198 -235 -5 96 81 -300 46 81 -111 -77 -24 232 14 -31 -142 -78 142
8157 142 -74 86 -140 210 -205 9 209 -67 153 55 113 -51 185 25 -29 35 180 158 104 10 32 -87 68
8180 68 -4 -159 55 -181 -48 213 112 -93 62 354 69
8191F9
##END NTUPLES=NMR FID
##END=
