##TITLE=1H_Pr Q-C6
 CDCl3,8 sc, 
 29.9.2021
##JCAMPDX= 6.0         $$ Bruker NMR JCAMP-DX V2.0
##DATA TYPE= NMR FID
##DATA CLASS= NTUPLES
##ORIGIN= UXNMR, Bruker Analytische Messtechnik GmbH
##OWNER= root
$$ XWIN-NMR		Version 3.5
$$ Wed Sep 29 13:29:14 2021 Russian Standard Time (UT+4h)  she@DPX200
##.OBSERVE FREQUENCY= 200.1313468511
##.OBSERVE NUCLEUS= ^1H
##.DELAY= (6, 6)
##.ACQUISITION MODE= SIMULTANEOUS
##.ACQUISITION SCHEME= undefined
##.AVERAGES= 8
##.DIGITISER RES= 18
##SPECTROMETER/DATA SYSTEM= spect
##.PULSE SEQUENCE= zg30
##.SOLVENT NAME= CDCl3
##.SHIFT REFERENCE= (INTERNAL, CDCl3, 0, 15.7039)
##AUDIT TRAIL= $$ (NUMBER, WHEN, WHO, WHERE, WHAT)
$$ ##TITLE= Audit trail, XWIN-NMR		Version 3.5
$$ ##JCAMPDX= 5.01
$$ ##ORIGIN= Bruker BioSpin GmbH
$$ ##OWNER= she
$$ F:/spectra/data/she/nmr/H-F/1/audita.txt
$$ ##AUDIT TRAIL=  $$ (NUMBER, WHEN, WHO, WHERE, WHAT)
(   1,<2021-09-29 13:28:16.67 +0400>,<she>,<DPX200>,
      <created by zg, POWCHK disabled, PULCHK disabled
       configuration hash MD5:
       00 E9 B6 7A A2 85 ED C7 34 08 36 98 17 FE 4E 26
       data hash MD5: 16K
       99 5A F3 2D 4E 53 A5 94 60 58 3F BF 9D 6D 5F 49>)
$$ ##END=
$$ 
$$ hash MD5
$$ BA 64 7F 57 64 9A B0 5F 57 D6 ED B5 1B 0D 28 BD
##$RELAX= 
##$RELAX= 
##$RELAX= 
##$RELAX= 
##$RELAX= 
##$RELAX= 
$$ Bruker specific parameters
$$ --------------------------
##$DU= <F:/spectra>
##$EXPNO= 1
##$NAME= <H-F>
##$PROCNO= 1
##$TYPE= <nmr>
##$USER= <she>
##$AMP= (0..31)
100 100 100 100 100 100 100 100 100 100 100 100 100 100 100 100 100 100 
100 100 100 100 100 100 100 100 100 100 100 100 100 100 
##$AQSEQ= 0
##$AQ_mod= 1
##$AUNM= <au_zg>
##$AUTOPOS= <>
##$BF1= 200.13
##$BF2= 200.13
##$BF3= 200.13
##$BF4= 200.13
##$BF5= 200.13
##$BF6= 200.13
##$BF7= 200.13
##$BF8= 200.13
##$BYTORDA= 1
##$CFDGTYP= 0
##$CFRGTYP= 5
##$CHEMSTR= <none>
##$CNST= (0..31)
1 1 145 1 1 1 1 1 1 1 1 1 1 1 1 1 1 1 1 1 1 1 1 1 1 1 1 1 1 1 1 1 
##$CPDPRG= <>
##$CPDPRG1= <>
##$CPDPRG2= <>
##$CPDPRG3= <>
##$CPDPRG4= <mlev>
##$CPDPRG5= <mlev>
##$CPDPRG6= <mlev>
##$CPDPRG7= <mlev>
##$CPDPRG8= <mlev>
##$CPDPRGB= <>
##$CPDPRGT= <>
##$D= (0..31)
0 1.2 0 0 0 0 0 0 0 0.06 0 0.03 0 0 0 0 0.0002 0 0 0 0 0 0 0 0 0 0 0 0 
0 0 0 
##$DATE= 1632907695
##$DBL= (0..7)
120 120 120 120 120 120 120 120 
##$DBP= (0..7)
150 150 150 150 150 150 150 150 
##$DBP07= 0
##$DBPNAM0= <>
##$DBPNAM1= <>
##$DBPNAM2= <>
##$DBPNAM3= <>
##$DBPNAM4= <>
##$DBPNAM5= <>
##$DBPNAM6= <>
##$DBPNAM7= <>
##$DBPOAL= (0..7)
0.5 0.5 0.5 0.5 0.5 0.5 0.5 0.5 
##$DBPOFFS= (0..7)
0 0 0 0 0 0 0 0 
##$DE= 6
##$DECBNUC= <off>
##$DECIM= 32
##$DECNUC= <off>
##$DECSTAT= 4
##$DIGMOD= 1
##$DIGTYP= 9
##$DL= (0..7)
0 120 120 120 120 120 120 120 
##$DP= (0..7)
150 150 150 150 150 150 150 150 
##$DP07= 0
##$DPNAME0= <>
##$DPNAME1= <>
##$DPNAME2= <>
##$DPNAME3= <>
##$DPNAME4= <>
##$DPNAME5= <>
##$DPNAME6= <>
##$DPNAME7= <>
##$DPOAL= (0..7)
0.5 0.5 0.5 0.5 0.5 0.5 0.5 0.5 
##$DPOFFS= (0..7)
0 0 0 0 0 0 0 0 
##$DQDMODE= 0
##$DR= 18
##$DS= 0
##$DSLIST= <SSSSSSSSSSSSSSS>
$$ [...]
##$SUBNAM2= <"">
##$SUBNAM3= <"">
##$SUBNAM4= <"">
##$SUBNAM5= <"">
##$SUBNAM6= <"">
##$SUBNAM7= <"">
##$SUBNAM8= <"">
##$SUBNAM9= <"">
##$SW= 18.0517286264689
##$SWIBOX= (0..15)
0 0 2 0 0 0 0 0 0 0 0 0 0 0 0 0 
##$SW_h= 3612.71676300578
##$TD= 16384
##$TD0= 1
##$TE= 0
##$TE2= 300
##$TE3= 300
##$TEG= 300
##$TL= (0..7)
0 120 120 120 120 120 120 120 
##$TP= (0..7)
150 150 150 150 150 150 150 150 
##$TP07= 0
##$TPNAME0= <>
##$TPNAME1= <>
##$TPNAME2= <>
##$TPNAME3= <>
##$TPNAME4= <>
##$TPNAME5= <>
##$TPNAME6= <>
##$TPNAME7= <>
##$TPOAL= (0..7)
0.5 0.5 0.5 0.5 0.5 0.5 0.5 0.5 
##$TPOFFS= (0..7)
0 0 0 0 0 0 0 0 
##$TUNHIN= 0
##$TUNHOUT= 0
##$TUNXOUT= 0
##$USERA1= <user>
##$USERA2= <user>
##$USERA3= <user>
##$USERA4= <user>
##$USERA5= <user>
##$V9= 5
##$VALIST= <valist>
##$VCLIST= <CCCCCCCCCCCCCCC>
##$VD= 0
##$VDLIST= <DDDDDDDDDDDDDDD>
##$VPLIST= <PPPPPPPPPPPPPPP>
##$VTLIST= <TTTTTTTTTTTTTTT>
##$WBST= 1024
##$WBSW= 4
##$XGAIN= (0..3)
0 0 0 0 
##$XL= 0
##$YL= 0
##$YMAX_a= 219392
##$YMIN_a= -305143
##$ZGOPTNS= <>
##$ZL1= 120
##$ZL2= 120
##$ZL3= 120
##$ZL4= 120
##$ABSF1= 10
##$ABSF2= 0
##$ABSG= 5
##$ABSL= 3
##$ALPHA= 0
##$AQORDER= 0
##$ASSFAC= 0
##$ASSFACI= 0
##$ASSFACX= 0
##$ASSWID= 0
##$AUNMP= <proc_1d>
##$AZFE= 0.1
##$AZFW= 0.1
##$BCFW= 1
##$BC_mod= 2
##$BYTORDP= 1
##$COROFFS= 0
##$CY= 11.3945322036743
##$DATMOD= 1
##$DC= 2
##$DFILT= <>
##$DTYPP= 0
##$F1P= 2.36226072786647
##$F2P= -0.459571619588291
##$FCOR= 0.5
##$FTSIZE= 0
##$FT_mod= 4
##$GAMMA= 1
##$GB= 0.15
##$INTBC= 1
##$INTSCL= 1
##$ISEN= 128
##$LB= 0.24
##$LEV0= 0
##$LPBIN= 0
##$MAXI= 10000
##$MC2= 0
##$MEAN= 0
##$ME_mod= 0
##$MI= 1.114404
##$NCOEF= 0
##$NC_proc= 0
##$NLEV= 6
##$NOISF1= 3.799351
##$NOISF2= 2.8
##$NSP= 1
##$NTH_PI= 0
##$NZP= 0
##$OFFSET= 15.70392
##$PC= 1
##$PHC0= -13713.23
##$PHC1= 10.40085
##$PH_mod= 1
##$PKNL= yes
##$PPARMOD= 0
##$PSCAL= 0
##$PSIGN= 0
##$REVERSE= no
##$SF= 200.130013532006
##$SI= 16384
##$SIGF1= 3
##$SIGF2= 2
##$SINO= 400
##$SIOLD= 16384
##$SREGLST= <1H.CDCl3>
##$SSB= 0
##$STSI= 0
##$STSR= 0
##$SW_p= 3612.71676300578
##$SYMM= 0
##$S_DEV= 0
##$TDeff= 0
##$TDoff= 0
##$TI= <>
##$TILT= no
##$TM1= 0
##$TM2= 0
##$TOPLEV= 0
##$USERP1= <user>
##$USERP2= <user>
##$USERP3= <user>
##$USERP4= <user>
##$USERP5= <user>
##$WDW= 1
##$XDIM= 8192
##$YMAX_p= 0
##$YMIN_p= 0
$$ End of Bruker specific parameters
$$ ---------------------------------
##NTUPLES= NMR FID
##VAR_NAME=  TIME,          FID/REAL,        FID/IMAG
##SYMBOL=    X,             R,               I
##VAR_TYPE=  INDEPENDENT,   DEPENDENT,       DEPENDENT
##VAR_FORM=  AFFN,          ASDF,            ASDF
##VAR_DIM=   8192,          8192,            8192
##UNITS=     SECONDS,       ARBITRARY UNITS, ARBITRARY UNITS
##FACTOR=    0.0002768,     1,               1
##FIRST=     0,             0,               0
##LAST=      2.2672688,     0,               0
##MIN=       0,             -305143,         0
##MAX=       2.2672688,     219392,          0
$$ Real data points
##PAGE= N=1
##DATA TABLE= (X++(R..R)), XYDATA
0 0 0 0 0 0 0 0 0 0 0 0 0 8 -8 8 -8 16 -16 22 -24 32 -32 40 -48 56 -72 80 -96 110 -128 144 -166 188 -215
33 -215 242 -274 308 -347 388 -435 484 -540 600 -666 738 -816 901 -993 1096 -1208 1333
50 1333 -1467 1617 -1782 1965 -2172 2403 -2667 2966 -3318 3729 -4222 4824 -5578 6555 -7877
65 -7877 9779 -12758 18115 -30775 128612 -37718 -263141 78533 181104 8204 -92315
76 -92315 -10752 -22779 -8184 55452 -5575 -122214 -9672 103005 14410 -104946 -39218
87 -39218 92263 75247 -65214 -84379 18276 86703 26596 -62913 -49194 15978 39792 44042
99 44042 -11876 -62996 2180 70341 21217 -39160 -11135 24018 -13008 -10840 28765 -19090
111 -19090 -44068 31482 33763 -44051 -35740 53403 54525 -45745 -54993 36285 48035 -12843 -34623
124 -34623 -9976 1492 -13006 12516 30285 -40748 -55192 44478 66628 -31041 -56228 41902
136 41902 57583 -42074 -26903 59703 15116 -47683 949 36396 -6503 -20558 20705 6601
148 6601 -37111 1201 30165 -13916 -25343 488 -2122 -14373 -3099 13595 -7132 -27040
160 -27040 2417 23048 11802 -497 -8550 4875 21216 14700 6162 -4324 -6001 12177 12026
173 12026 -5825 -15227 -1590 15801 -9887 -29035 6519 17694 -13886 -21229 -878 7658 -6480
186 -6480 -4424 8731 -11531 -16438 17920 20312 -6298 -14209 6146 22621 6420 -4382 5487
199 5487 1120 392 9307 3714 -6684 -10499 4257 12782 -14047 -18984 9550 11895 -10437 -19309
213 -19309 -29 14277 -1356 -8477 -4442 -7761 7940 15943 -8744 -17478 4003 20702 4045
226 4045 -16704 1531 15650 2565 -1260 -600 1405 8508 1400 -4356 -2043 1009 6411 -2340
240 -2340 -9555 -1796 352 2312 -2993 -11784 928 4558 -8269 -5005 3204 651 -6036 -3832 9601
255 9601 2183 -6947 5399 4456 -565 7030 3726 -825 1756 6274 6114 -4882 -2006 8933 -804
270 -804 -5914 -2522 -2203 2138 -4176 -9810 -1003 -232 -3135 -3861 -4780 471 -798 -1072 3515 -3978 -316
287 -316 9397 290 -2259 5519 6516 3158 -1901 3930 7384 -2049 876 3588 -3214 1150 193 -4720
303 -4720 -1780 -3044 -1846 -2641 -6663 -715 -1244 -4151 -734 -3729 324 3076 -4660 723 4299 183
319 183 2215 1920 3040 3565 182 5015 2779 -1917 5592 2421 -2195 1552 -242 116 -1115 -4463
335 -4463 65 -2446 -4278 -1123 -4583 -2505 -194 -3915 -359 -940 -2684 2819 -60 -830 1829 1003
351 1003 3909 1616 -447 5288 2635 1795 4192 -666 2107 3952 -639 -111 -1751 -495 1952 -4361
367 -4361 -3363 -1580 -3638 97 -3417 -5270 161 -1520 -1461 89 -3123 1092 1559 671 2155 -1081
383 -1081 2519 5284 515 2009 2346 950 5061 1832 -685 1055 -264 2451 179 -4352 -1140
398 -1140 -1445 -1281 -251 -6679 -3885 1077 -1094 -1385 -4301 -2935 3391 1587 -788 -2191 -918 7019
414 7019 3684 -2765 914 3015 5365 4726 -2578 -611 3766 4306 2435 -5011 -3279 3901 1493 -2343
430 -2343 -6610 -5237 4296 1132 -6918 -6108 -1347 4535 553 -6671 -2173 2008 3782 3297 -4218 -1459
446 -1459 5416 5194 3441 -2141 -1479 6802 5715 203 -3178 -1568 6688 2832 -6008 -3100 -245 2004
462 2004 -345 -6726 -3652 129 -701 -79 -3468 -3758 -560 1316 4216 -2183 -7083 4451 8106 244
478 244 -2648 308 6597 3926 -1562 2319 1788 -38 3435 793 -993 -1944 -1682 3617 -526 -8140
494 -8140 -3068 2734 1713 -5440 -8350 1775 3759 -2937 -1913 -2132 -444 3247 1228 1777 -339
509 -339 -1951 5168 6468 1378 -2686 -1457 9058 6332 -6635 -3306 5453 4693 -2570 -7499 -930
524 -930 3666 -1555 -2958 -4585 -4372 1520 1731 -550 -5952 -8008 6145 10299 -5045 -10500 1695
539 1695 13418 3902 -10792 170 10646 3260 -1522 -1076 1782 4049 1800 525 -2961 -4545
553 -4545 4591 4514 -4480 -8612 -3775 7002 3938 -10872 -8184 3225 5330 -683 -8052 -1702 5541
568 5541 915 -25 -224 74 3628 2151 1758 1494 -2284 3547 7124 -994 -5072 -1086 7763 5130
584 5130 -9573 -6851 5184 3934 -2913 -7538 -2683 3200 -1116 -2460 -806 -3366 -744 1912 682
599 682 -1302 -3357 4033 6409 -3838 -2933 6053 7010 -69 -5471 2103 8008 -79 -2802 -44 335
615 335 1800 -1033 -1559 -266 -3443 -1422 -128 -2789 -1062 -1892 -2559 -626 -1515 319 1412 -1355
631 -1355 -546 245 2390 3695 -1087 -883 4480 2466 277 401 2251 3806 -2250 -2002 3568 1273
647 1273 -1430 -2855 -2420 1310 -761 -2706 -1374 -3328 -1609 424 -874 -1090 -3232 -482 3219 -913
663 -913 -1222 2196 1454 1437 577 1146 3605 1091 650 1784 -259 1766 1642 -682 -182 -1957 -521 1814
681 1814 -1916 -2394 -2333 -1537 1086 -2100 -3225 -924 -1223 453 89 -2335 905 1190 60 1069 486
698 486 2690 2549 -148 1851 1090 945 3188 -138 -1026 1362 412 471 -1236 -1801 215 -1297 -1216 -701
716 -701 -2797 -992 -1037 -2411 8 -993 -1401 294 -600 713 705 49 2219 1067 825 2617 561 1328
734 1328 2742 -156 676 974 925 1312 -1689 -504 662 -1464 -248 -1996 -2435 569 -1524 -2676 -1268
751 -1268 -1781 -21 -784 -1679 427 -49 607 1310 -733 1770 2605 358 1534 1501 1593 2196 -385 598
769 598 1142 -411 787 -1158 -1563 986 -1475 -1445 -718 -2025 -624 -1306 -2048 -166 -1249 -779 42 -1444
787 -1444 1024 822 -853 1454 842 1009 2333 204 1235 1723 457 1724 251 55 1756 -732
803 -732 -60 46 -1460 206 -1282 -2386 -125 -1378 -1474 -1145 -2134 254 -582 -1300 492 -612 -54 1433
821 1433 -283 1050 1410 401 2184 790 840 2333 125 775 1124 -491 1274 121 -1036 515
837 515 -1205 -682 0 -2092 -876 -1332 -1850 79 -1937 -861 -169 -1498 202 570 -602 1385 580
854 580 842 1655 -73 1872 1676 184 1704 549 478 1721 -786 311 588 -1537 80 -705 -1657
871 -1657 -688 -1423 -486 -864 -2459 -57 -531 -1516 625 -768 -355 827 36 1058 414 227 2039 570
889 570 830 1751 386 1606 1234 -126 1008 3 -49 752 -1357 -996 -476 -1052 -283 -2167 -1985 351
907 351 -1428 -1333 -123 -1365 166 130 121 693 -649 1342 2702 -275 931 1207 1071 1901 -63 217
925 217 1398 216 841 -76 -1032 631 -220 -617 -893 -2241 -254 49 -1905 -979 -1143 -596 177 -987
943 -987 -319 -339 104 2797 -98 -1342 2257 2214 823 19 152 2436 1129 -295 1019 -160 32 846
961 846 -572 -73 -1422 -1375 1282 -1385 -3145 -787 316 -174 -2294 -2079 1260 -52 -1217 702 -319
978 -319 671 1397 335 1413 272 817 2095 378 455 583 307 2023 127 -1498 654 132 -67 -999
996 -999 -2130 125 -218 -1778 -841 -1321 -480 -402 -1673 646 42 -1872 1011 1631 -276 -598 622 3088
1014 3088 1062 -1484 1699 2091 126 525 267 1148 129 -1006 1539 -118 -2320 -490 253 -255
1030 -255 -2258 -2486 1238 178 -2598 -701 -8 121 -114 -779 812 565 154 1864 430 -161 1178
1047 1178 842 1792 510 -1083 1414 1230 184 -248 -1580 757 1110 -2205 -1565 -513 -246 -381 -2302
1064 -2302 -626 281 -1533 42 91 -1191 -88 60 1462 593 -1728 1322 2870 59 -125 458 2086
1081 2086 1644 -1096 464 1429 -696 -62 155 -703 -888 -1484 540 -210 -2844 -257 281 -1092 -981
1098 -981 -1027 313 483 -1260 178 424 -232 1496 365 211 1335 370 1667 843 -230 1223 426
1115 426 196 584 -468 -351 179 -785 89 -1524 -1240 481 -1461 -1502 -317 -623 -456 -1193 -152 863
1133 863 -1175 225 1690 -143 289 926 1144 1249 -270 665 1698 -186 477 787 95 79 -606 231
1151 231 567 -1575 -565 407 -1328 -972 -817 -449 -510 -1472 172 101 -1394 246 520 -197 283 334 1221
1170 1221 664 -371 1612 996 -86 1208 542 523 461 -479 634 -301 -995 323 -280 -1335 -714 -467
1188 -467 -61 -1393 -1333 540 -808 -1253 285 -503 -460 192 418 723 -302 431 1610 320 545 1511
1206 1511 279 606 178 422 966 -691 24 652 -663 -875 -459 -685 -63 -1897 -510 81 -1488 -524
1224 -524 195 -821 -346 -164 569 427 -776 1009 1227 -262 745 1075 702 598 -205 1115 914 -618
1242 -618 739 492 -542 -132 -494 -64 -386 -1540 28 -517 -1579 -154 -730 -813 -287 -218 526 -191 -143
1261 -143 1071 5 72 1034 457 659 630 380 1386 378 -130 1060 -151 11 -53 -233 100 -741 -725
1280 -725 209 -1179 -1286 -107 -876 -608 -794 -438 320 -658 -120 843 -566 386 908 307 1053 110 749
1299 749 1417 -285 417 980 97 325 37 63 299 -901 -117 227 -1299 -201 -544 -1026 -530 -1112 -365
1318 -365 -244 -1140 165 57 -431 583 50 174 894 111 895 915 -8 1176 534 511 570 61 407 246
1338 246 -438 378 -218 -899 -43 -983 -751 -458 -1151 -36 -687 -906 159 -470 -408 195 -440 610 302
1357 302 236 1192 169 305 1299 414 1119 314 13 908 106 -41 656 -394 77 19 -789 -59 -938 -1053
1377 -1053 -360 -1374 -662 -128 -774 139 -228 -343 316 99 367 528 -423 920 767 74 731 59 779
1396 779 931 -207 431 378 -472 414 -276 -393 -92 -944 -270 -228 -1175 -320 -659 -489 -338 -798 -176 -104 -297
1417 -297 514 -84 155 1009 40 445 942 214 898 612 233 757 30 266 252 -492 275 -174 -306 86
1437 86 -891 -403 42 -860 -1002 -420 -586 -31 -459 -297 306 -473 -12 549 -338 484 487 594 807 -27 423
1458 423 1095 436 504 -46 68 667 -472 -123 71 -522 -558 -440 -419 -42 -1075 -619 -205 -1001 -220 -328
1478 -328 -51 346 -441 -137 1090 201 182 474 200 814 315 459 932 -58 371 527 -433 108 -202 -19
1498 -19 599 -692 -625 -393 -544 -19 -887 -616 282 -601 -400 -44 -484 212 149 -14 764 -60 49 1025 486
1519 486 475 181 70 1253 36 -303 687 -23 -164 -209 -489 212 -498 -942 -23 -754 -774 -405 -591 241
1539 241 -835 -747 360 -231 -389 280 101 690 281 -55 1121 427 149 761 -186 562 300 225 530 -99
1559 -99 -403 -111 -366 -148 -542 -1031 210 -608 -816 -108 -617 -315 -199 -549 244 201 -179 302 36 377
1579 377 656 -26 932 675 -135 649 335 324 346 -352 320 155 -616 27 -535 -587 -62 -605 -370 -641 -936
1600 -936 6 -420 -573 82 -90 351 150 -240 719 617 -154 500 310 141 840 382 378 291 78 635 -223
1621 -223 -364 128 -520 -61 -38 -639 -295 -735 -392 -366 -749 -402 -198 -416 -192 -381 44 447 -67 345 676
1642 676 125 465 845 228 523 8 710 409 -359 312 495 -411 -101 -213 -400 -363 -605 -100 -264 -709
1662 -709 -164 -283 -466 -229 -426 283 183 -557 814 323 200 409 544 365 225 -9 666 441 -273 678
1682 678 -73 61 195 -289 -21 -180 -388 113 -585 -285 -476 -644 -432 -319 -670 112 -293 -105 212 -251
1702 -251 47 327 291 353 37 498 729 -275 382 491 -120 266 -83 -198 51 -473 -57 31 -529 -260 -234
1723 -234 -383 -370 -743 -286 -85 -624 -203 199 -299 99 74 436 346 63 599 222 -84 682 138 220 609
1744 609 34 392 115 -465 12 -71 -424 -224 -591 -298 -243 -550 -205 -384 -637 106 -496 -243 -22 -278 179
1765 179 247 136 551 280 -4 913 386 348 562 -13 343 -445 -125 552 -329 -269 137 -437 -287 -325 -346 -21
1787 -21 -450 -350 26 -469 -407 -76 -417 197 -451 324 528 -119 635 399 183 485 355 244 289 6 266
1808 266 464 -44 9 -57 -128 47 -673 -442 -147 -878 -300 -471 -634 -49 -544 -129 -198 -368 241 263 -173 576
1830 576 201 373 673 191 677 268 13 458 246 225 418 65 -81 -20 -146 48 -639 -498 -37 -578 -488
1851 -488 -397 -330 -135 -403 -322 464 -292 9 485 -44 379 419 187 667 138 268 734 -136 158 209 283 205
1873 205 -161 171 132 -400 -80 -202 -616 -128 -607 -579 -45 -548 -9 198 -419 249 -101 45 578 -83 353
1894 353 527 -7 463 333 -46 511 268 27 109 -209 340 287 -557 -15 -561 -98 -94 -711 -17 -114 -417 178
1916 178 -259 -490 233 -88 167 287 87 583 402 191 591 187 413 319 287 438 210 18 307 -142 70
1937 70 76 -615 16 -111 -517 -262 -472 -283 -133 -415 -16 -112 -411 -52 -83 236 607 -120 231 321 286 416
1959 416 154 317 672 48 235 460 160 424 125 34 88 -317 -229 64 -380 -244 -243 -226 -139 -221 -176 64 -528
1982 -528 -116 416 -256 188 6 148 331 47 234 466 289 496 -104 7 395 -92 10 220 -385 113
2002 113 11 -494 -149 -313 -155 -193 -647 -178 -134 -269 -99 -422 -199 80 -155 30 278 119 535 44 214
2023 214 457 -102 209 277 -148 398 -384 0 -74 -162 -204 -113 -290 -292 -337 -318 -37 -624 -416 245 -394 77 130
2046 130 -118 378 -114 100 386 -11 429 377 -91 545 181 317 470 -186 206 85 64 227 -100 -264 93
2067 93 -212 -209 50 -514 -246 -408 -355 151 -378 -97 292 -410 297 -42 79 599 129 33 495 -19 325 33
2089 33 -188 514 214 -291 175 -336 -8 -330 -428 104 -228 -654 31 -108 -96 -244 -428 118 -376 -35 378
2110 378 299 -66 191 72 399 265 -121 749 112 -106 115 328 -6 -71 43 184 -261 -306 306 -496 -188
2131 -188 160 -568 -146 -239 -401 312 -227 -249 324 -133 127 -77 124 229 32 232 521 -161 349 297 142
2152 142 195 -92 373 264 -16 105 49 -376 -199 -88 -179 -140 -502 -197 -94 -474 105 17 -194 355 233 204
2174 204 106 -107 564 194 18 629 194 226 77 83 204 8 -82 324 -172 -246 -21 -362 -8 -58 -370 -53
2196 -53 -278 -166 -8 -119 20 18 -85 208 -16 -15 473 173 300 573 -8 44 255 154 42 -81 46 238
2218 238 -411 208 -120 -71 -190 -317 -290 -146 -589 -223 -117 -391 86 -270 40 8 -244 216 147 -184 299
2239 299 -56 170 167 211 417 98 -87 316 351 105 347 -122 105 -54 -294 -57 -407 -276 172 -402 -156
2260 -156 -113 -304 -5 -79 -136 198 -365 -36 184 69 213 225 283 205 167 -30 268 54 119 -42 -42 40 -184 17
2284 17 351 -456 -30 -67 -462 -99 -83 -124 -58 -354 -82 168 -126 258 109 -301 193 77 553 279 46 87
2306 87 232 -152 203 75 249 171 -185 220 -196 -334 122 -342 -107 -143 -341 -285 -298 -175 -234 -94 -510 167
2328 167 -170 200 193 -223 391 52 234 113 -106 258 33 -223 235 -22 -82 281 -178 -208 201 -448 -139
2349 -139 -122 -261 -21 -329 -127 60 -302 -414 209 -94 -106 190 25 183 48 222 509 60 174 202 139
2370 139 114 4 22 409 -95 -180 -187 -231 -39 -452 -333 -164 -351 -76 21 -449 -176 -211 -243 161 -184 212 -19
2393 -19 -3 184 -49 -56 347 290 122 207 130 306 -33 -408 387 19 -178 -32 -180 29 -191 -373 -117 -159 -108
2416 -108 24 -365 -139 -375 -350 76 42 14 221 -270 209 301 140 245 -12 147 364 75 158 224 -146 299
2438 299 162 -97 -98 -243 -176 -14 -352 129 -164 -182 31 -330 -72 -176 -109 134 48 -63 216 6 -88 212
2460 212 83 260 262 122 52 82 -16 258 79 20 27 -315 -94 1 -491 -316 -78 -257 -111 -518 -30 -200 -156
2483 -156 -156 -125 145 2 -360 287 272 59 447 -70 119 404 70 334 361 -284 86 216 -36 -77 -263 -14
2505 -14 -129 -323 -172 -164 -273 -381 -469 -145 174 -246 -98 -136 -59 102 -144 -69 196 250 124 241 198 218 207 -65
2529 -65 330 20 115 8 -193 256 -242 -68 188 -215 -251 -114 -450 -165 -137 -424 219 -231 -191 338 -94 161
2551 161 -111 -285 117 -35 221 229 24 438 151 -86 52 39 51 147 -266 -177 -55 -302 -280 -24 -124 27
2573 27 -290 -136 209 -267 -59 60 -7 72 112 55 238 111 354 221 74 220 281 268 -115 -20 272 -57 -124
2596 -124 95 101 -167 -248 -297 -70 -4 -415 -8 -166 -90 82 184 24 -155 101 244 106 -8 232 103 222
2618 222 317 -146 422 349 249 321 166 -183 -82 -104 -191 112 -300 -138 -362 -442 67 -309 245 -136 -91 -104 -16
2641 -16 -68 120 118 168 167 36 321 -6 -2 109 357 229 104 -132 108 -95 -196 63 42 -268 37 -370 20
2664 20 -39 -124 42 -355 -163 -181 -144 -9 -115 -71 243 58 -22 -45 139 324 367 45 152 154 253 259 222 62 271
2689 271 176 165 184 -28 -53 29 -191 -403 -92 -288 -61 35 -79 -373 55 -52 -10 -340 216 -179 -49 62
2711 62 169 207 -163 66 249 -16 311 78 127 64 -255 52 -266 -185 -187 -197 -155 58 -294 -235 -10 -5 -31 46 -61
2736 -61 -183 -40 100 -26 51 445 185 125 313 -74 -86 257 40 153 147 -328 129 -21 -307 168 -390 -296
2758 -296 -192 -270 -103 -334 -295 -70 -268 -270 -64 -59 175 -106 213 107 85 -30 517 81 7 382 -162 249 111
2781 111 255 297 111 -19 -98 -123 82 -22 -297 305 -298 -94 0 -97 -1 0 -314 128 -147 -118 57 -238 316
2804 316 337 20 311 -7 85 214 78 386 -193 -123 196 98 -93 185 -306 104 -62 -397 -54 -328 -232 -51
2826 -51 -188 92 30 7 100 107 -14 76 -148 186 -65 -18 310 162 343 2 -275 -474 635 -143 262 30
2848 30 289 99 -204 27 346 -231 -112 4 -204 79 -380 -79 205 -319 63 -129 -16 -173 -126 112 198
2869 198 -436 -58 59 11 50 76 -158 33 2 279 147 -117 187 250 -11 -48 -325 -540 236 151 -348 -103
2891 -103 -43 -65 178 -392 323 152 73 232 -59 127 6 -11 235 -197 396 -174 224 292 -505 -27 228 -342
2913 -342 -300 -136 -347 185 -293 -71 269 -25 -213 205 99 20 -252 -220 129 -272 211 275 -382 -40 -15 -185
2935 -185 -64 662 360 412 -133 141 280 -338 396 378 -193 -7 -126 -94 -552 -661 -181 -543 -277 124 343
2956 343 -239 -246 -271 -221 361 -156 -55 31 454 400 -306 401 513 -373 20 99 -295 -391 -325 -231 307 -192 5
2979 5 -93 -119 208 -123 126 123 -343 17 148 -311 71 -444 -80 47 80 202 129 690 350 272 86 416 -56
3002 -56 -7 337 134 151 389 -429 34 -375 -77 54 -602 -46 -478 -217 -226 -682 75 64 -253 -341 -5 302
3024 302 570 592 -227 65 -239 211 371 -190 -138 62 -52 106 326 220 301 -436 -180 -360 112 -651 -127
3045 -127 122 -68 -431 5 69 -345 178 -237 -112 109 348 52 259 191 10 -314 253 471 26 -9 301
3066 301 42 159 -197 107 26 -25 -341 -272 50 200 -56 -335 -267 -155 -138 -285 -97 -3 237 -167 450 152
3088 152 160 174 -263 100 331 148 241 -142 -75 102 109 -24 -193 -377 177 -105 -138 19 -350 -233 -219 -86 111
3111 111 182 545 120 -309 260 -463 -417 314 -211 -90 470 -17 -103 -268 -260 -216 -346 -644 -423 -416 -17 73 -581
3134 -581 -301 428 -321 -69 -136 -666 201 -447 137 500 260 447 -73 178 311 -163 13 278 176 681
3154 681 304 -20 46 340 -409 125 248 649 -404 -166 -379 -480 -463 -40 -226 276 387 -508 438 -226
3174 -226 -265 394 -740 9 325 0 804 -3 140 403 33 256 -179 -400 110 -263 -337 92 -129 59
3194 59 256 -275 -553 124 -147 312 -352 -816 -121 -119 234 166 -770 123 -245 264 269 -468 -676 54 270 197
3216 197 -434 -72 -568 -310 621 734 599 -413 -989 378 -182 87 -330 -117 -400 521 194 -660 -155
3235 -155 -89 641 -226 -301 -462 522 -416 67 828 75 60 108 212 476 689 -155 289 -159 -502 -201 -333
3256 -333 223 367 238 -302 -639 -410 2 -81 12 -1204 -557 217 -169 -254 -530 -433 93 -699 -4 -345 413
3277 413 632 51 -565 -444 404 226 -257 -435 147 727 -127 97 -819 396 190 138 -373 766 -488
3296 -488 -545 -235 566 -180 -482 341 302 24 -582 496 175 461 125 594 -230 -212 507 -469 40 504 -392
3317 -392 69 401 174 -509 820 -534 72 10 -255 462 -80 615 102 -547 -578 -278 -272 -612 452 79
3337 79 329 -213 252 -209 201 155 -197 -187 321 156 55 408 -547 674 489 -642 -193 -897 351 262
3357 262 -518 1064 -673 234 386 245 -405 74 -408 -786 208 -216 -206 28 77 201 151 -179 -74 -641
3377 -641 -462 -187 -177 75 -167 -264 136 -314 717 -387 -668 -335 -606 -110 280 -199 290 330 343 611 611
3398 611 90 -14 -372 -220 173 93 13 -157 -332 -495 -44 -615 -109 -12 -37 -544 -674 -511 245 259 111 -182
3420 -182 -141 528 -89 -214 -321 -127 54 352 471 34 27 -165 -26 116 -82 21 323 185 96 417 120
3441 120 -110 63 -239 102 -235 177 -124 -310 -339 50 18 -343 292 19 -53 -134 -272 -19 -59 45 118 58
3463 58 276 285 29 243 220 -41 39 375 -39 360 -152 101 -262 -66 116 -238 162 -303 -264 -330 -174 -291
3485 -291 -278 -259 32 -112 74 218 -20 249 82 43 423 55 -146 218 179 209 58 -4 107 -49 -163 24
3507 24 -66 -166 -6 12 124 -90 -294 62 38 -2 -104 -235 -30 48 148 37 161 -73 143 63 77 140 -38
3530 -38 242 -193 97 285 80 23 178 -188 115 -277 -101 1 -316 -280 -247 -100 -24 -50 -81 245 -131 71
3552 71 0 -308 205 106 -145 -31 -110 164 87 131 480 152 -14 261 174 133 124 -115 70 -301 0 134 54 -151
3576 -151 -69 -428 156 -89 -476 146 3 -428 94 -119 58 187 -17 248 -237 -40 116 173 13 146 81
3597 81 485 95 -419 -246 -144 44 138 -273 -638 -54 -80 -99 46 -640 273 -192 212 259 -2 165 -20 32
3619 32 -31 -160 182 205 -41 90 235 267 -193 -74 -14 20 -51 -160 55 -549 4 -44 -335 -144 -451 -279 163
3642 163 -212 -305 -110 223 -18 77 397 -69 -96 -172 293 340 111 55 410 106 312 267 235 35 292 17 218
3665 218 -94 -440 -271 -48 -33 225 -51 1 -9 -109 112 -56 -365 -106 -103 -59 -136 226 97 37 165 -347 -35
3688 -35 -35 24 -282 -68 72 -230 -108 -30 -330 135 -173 180 252 -104 -371 -198 -56 113 -305 -463 -19 -214
3710 -214 -85 396 -482 6 -225 38 140 11 -128 -163 91 -11 176 -65 33 412 -22 149 -75 -54 118
3731 118 -105 -326 -424 -20 -207 -134 -206 -185 -139 151 -383 211 -87 -223 315 -184 -94 306 -13 -10 234 -97 147
3754 147 138 -24 213 70 125 42 140 77 -36 -157 76 -118 -211 -169 -14 -6 -147 -145 -22 4 50 127 12 -114 230
3779 230 78 212 -14 117 234 260 149 -139 60 40 280 -150 -218 19 -20 152 -222 -135 -155 -239 108 48 -347
3802 -347 -137 -49 -93 119 -48 100 98 -72 219 10 116 183 39 62 172 38 402 81 -256 148 -157 6
3824 6 153 62 -149 49 -200 108 -307 -162 168 -270 -136 -272 -118 72 -136 45 223 127 40 -148 62 254
3846 254 -149 37 399 -221 154 -124 63 128 -338 -4 5 -139 -9 -80 -161 -191 -271 -133 35 -440 39 60 -27
3869 -27 24 -147 223 22 56 74 284 -35 222 51 167 180 107 256 -54 -164 91 216 -309 -8 -1 -210 29
3892 29 -214 36 -45 -160 80 -214 -77 59 -156 -137 180 25 -10 177 50 73 -280 67 74 9 392 30 286
3915 286 26 -87 139 -19 -63 -58 126 -214 70 -174 -122 -2 -29 -109 -46 -248 188 -6 -209 166 -83 167
3937 167 7 215 366 -67 183 195 -182 170 -127 -36 -216 32 -11 62 -267 -458 37 -194 -141 -231 -289 -207 -166
3960 -166 -227 181 -359 99 110 11 327 -25 66 15 338 -7 172 -8 270 215 -154 219 -16 -49 185 -236
3982 -236 290 -76 -105 -50 -141 -15 -384 -155 30 -39 -89 282 -57 146 -28 -200 364 60 -22 50 -38 71 -31
4005 -31 13 75 178 230 -88 -208 112 -94 -43 67 106 -83 -76 -3 95 -63 -386 32 -72 39 127 85 -290 236
4029 236 34 108 -4 63 178 -118 72 50 -95 -2 0 -42 184 194 -247 -156 99 -139 -90 -237 -198 -207 -136 -88 -153
4054 -153 -19 120 -225 -110 41 -72 118 102 -218 228 -140 21 207 85 -57 -210 -28 102 -116 -126 -55
4075 -55 -132 199 23 -251 -71 -101 -201 136 138 -31 42 -243 -207 -69 173 410 -153 226 159 -69 45 84 133
4098 133 141 -70 97 166 -1 159 181 -22 14 -21 -355 -82 -404 221 -289 -316 -78 -129 -134 -81 -20 81 -49 -160
4122 -160 -202 54 -173 84 -93 91 127 -41 250 -21 148 96 -165 -63 324 46 71 73 -220 -196 -227 -122 -41
4145 -41 -373 114 -264 -202 -70 -77 -65 151 -21 -1 233 -45 -8 -69 159 137 198 141 63 -42 222 119 -271 -46
4169 -46 109 -23 13 -61 -76 -152 -169 -247 -118 -54 35 -323 64 -105 -182 43 -178 -30 322 126 80 194 71 119
4193 119 -83 108 267 31 216 314 43 72 -202 54 127 -186 -96 84 -348 81 -211 -31 129 59 -1 60
4215 60 110 204 -87 109 -37 155 251 59 158 403 211 237 126 19 114 46 295 132 -20 -56 -27 110 80 -62
4239 -62 -72 11 -92 -181 90 63 -32 203 -61 23 102 -39 121 -23 -144 37 313 -50 185 -26 236 235 -154
4262 -154 249 -42 -4 276 -156 -148 -161 -185 119 7 -77 100 -37 18 186 -196 -65 -186 -156 216 93 272 234
4285 234 -181 104 153 13 242 176 3 273 -297 -30 -228 -180 152 -195 46 -31 -185 136 -183 -86 -183 36
4307 36 -73 76 25 53 -71 42 9 -201 104 100 134 260 38 121 165 131 -99 -74 -243 130 69 -417 -5 -199
4331 -199 -200 -133 -178 95 60 -253 -220 -16 47 -18 -2 -3 35 86 108 59 68 86 -78 215 113 130 80 130 21 59 41 -63
4359 -63 -98 -214 -43 -266 -245 9 119 -319 103 55 -10 -79 -230 -62 128 218 288 -152 25 152 57 -33 -8 -37
4383 -37 161 299 137 87 -73 220 416 -31 -76 76 -234 -46 -209 -221 -322 -225 -110 -86 -127 191 -61 -132 7
4406 7 -80 -179 -16 32 67 189 -157 67 153 312 -19 92 58 267 -167 412 -143 -219 113 -168 68 -187 76
4429 76 8 -6 -186 10 -274 -171 -113 -264 -73 -247 173 62 90 262 223 -37 -41 38 -201 392 -145 -229 -39
4452 -39 -246 27 -110 -33 52 -87 -32 -387 -191 -17 -43 -3 -221 -313 -115 125 -197 21 -160 -119 144 -66 21
4475 21 164 10 -171 128 -14 13 -55 -297 160 101 8 -5 -91 -21 -498 -245 100 -6 -391 -153 -278 317 -13
4498 -13 -104 -4 59 -112 -45 -208 15 123 177 136 -61 211 144 -79 185 -134 111 188 -45 89 207 -54 -80
4521 -80 -182 -90 -134 -4 28 -142 -237 -142 -156 -257 -155 101 -166 -5 0 77 65 156 235 130 75 6 26 -184 83
4546 83 -69 -144 125 -186 -41 -128 -88 13 -107 -50 -281 -105 70 18 -76 -30 -42 -228 195 -88 44 98 5 154
4570 154 225 183 -16 -111 62 -166 -93 -79 -136 70 -59 -91 55 41 -207 -91 -226 51 -72 107 -138 -75 63
4593 63 -60 -320 -81 -3 -6 41 172 -171 202 28 -4 183 -158 68 -256 144 -38 113 33 37 -127 -168 -166 -67
4617 -67 -113 -269 -299 6 23 -62 -124 -261 -143 176 -58 229 -33 -93 157 37 138 142 -23 135 166 210 83 271
4641 271 31 -146 0 225 -120 -180 17 -135 -94 -254 -317 57 -83 -230 50 7 -195 33 106 140 37 -201
4663 -201 124 -59 155 -43 -88 3 4 -94 -114 69 111 1 -97 -187 -93 224 38 -119 -79 17 -14 -84 55 -314 -142
4688 -142 -99 -129 158 -21 158 -1 122 109 17 26 81 -32 161 164 -62 -32 253 108 -232 -72 -203 -12 -256
4711 -256 -242 -156 -168 136 -158 80 -79 -329 29 159 34 196 -137 266 1 13 188 183 6 -162 126 -71
4733 -71 290 93 224 -260 -204 127 -234 143 -223 -79 -165 -197 -162 -50 -56 -273 64 39 -181 -130 -218 71 178
4756 178 51 93 117 148 165 62 169 -95 13 113 -51 103 -43 -243 -217 24 -263 -152 15 -73 124 146
4778 146 -180 -58 -240 -64 -145 -5 175 -153 40 -193 217 58 -204 -50 -56 98 391 -153 57 12 35 30
4800 30 401 -30 48 -34 68 -72 -239 -251 14 -140 23 251 -54 214 5 47 42 12 386 121 -189 -12 191
4823 191 136 218 62 -92 -63 -61 -43 156 -77 -182 29 102 4 50 -406 -59 -343 137 -50 16 96 -333 -391 141
4847 141 -175 76 -109 -92 185 -113 145 159 60 267 178 257 -174 115 -207 139 -164 207 78 -46 -88 -450
4869 -450 -209 -166 -90 140 -89 -386 -115 -154 -92 184 182 -212 117 -124 32 224 -72 27 -39 -132 198 -102 -73
4892 -73 -28 186 50 -212 -89 27 -145 -68 120 -252 -3 -219 -175 99 -1 -108 32 -87 -66 21 -77 -61 28
4915 28 -10 118 0 132 39 27 89 309 -34 186 -23 9 314 70 67 -206 -47 -98 124 -164 -285 -171 110
4938 110 -61 -94 -16 94 191 154 -198 -73 63 24 281 -71 -173 350 188 241 141 107 22 24 -151 -210 -234 -52
4962 -52 -255 -93 52 -38 -214 -65 -146 192 -17 -252 187 -191 84 47 79 -55 -48 -104 39 17 -197 225 -46
4985 -46 59 236 -21 -37 104 -52 -9 -62 -242 31 -171 -296 -17 -191 60 160 133 6 -77 164 -54 -187
5007 -187 168 -43 -121 -170 -49 23 -4 -39 4 77 -73 81 -121 -161 -93 -57 20 122 -268 133 28 -202 9 -165
5031 -165 47 -224 70 58 87 66 85 -118 65 165 319 268 110 -186 53 -23 183 -44 -95 134 208 61 -31
5054 -31 142 40 48 -57 -1 9 36 -36 129 -136 -210 157 340 35 -133 133 -241 102 50 245 29 4 167
5077 167 253 -39 171 139 359 25 81 80 -57 -75 -260 130 -2 -82 73 22 -21 -45 -127 140 -86 -119 137 -37
5101 -37 6 106 85 -10 27 61 124 -216 -71 201 48 68 -195 46 21 -278 166 -311 -153 -66 120 -57 -169
5124 -169 -259 57 200 -368 -276 -222 35 -17 190 -47 -285 -47 253 202 111 280 164 -49 75 34 4 64 -206
5147 -206 -137 -127 -103 14 -48 171 -79 -16 -56 77 -118 141 -144 168 -3 -136 168 -22 -71 203 84 49 89
5170 89 86 -49 1 -60 -58 -37 35 -27 82 -106 58 45 -287 -106 18 110 -166 -29 -178 -77 -12 -213 -189 -134 -173
5195 -173 -11 61 -68 -80 -24 37 102 -78 -13 39 45 58 129 -121 -85 -151 39 -86 82 -102 -15 -242 96 -58 17
5220 17 222 -32 248 53 -144 -89 87 -30 -237 -53 75 1 -1 43 97 -30 134 289 -232 -152 59 -116 -131
5243 -131 -191 -80 8 -231 -63 -59 -30 -127 -152 -52 -489 -186 -16 -122 21 -53 -215 195 -107 61 106 37 27 149
5267 149 39 -46 -125 45 15 171 37 -101 35 -165 146 215 -127 -152 15 -117 -155 -133 124 183 -42 -16 132
5290 132 11 23 79 15 5 44 -85 144 43 -4 150 44 -47 -38 -104 -25 -156 -85 83 18 -81 16 -164 -167 65 56
5316 56 61 155 -175 98 21 -133 123 10 60 178 261 233 -43 18 188 -25 197 -36 -147 106 336 -82 -45
5339 -45 160 -211 -187 135 -76 137 -63 -90 -309 -362 151 -196 133 91 -204 -356 194 73 89 117 -52 161
5361 161 -48 -25 100 -183 249 58 -165 141 -39 26 -56 -129 -112 267 149 153 -129 48 -301 47 -125 -62 156
5384 156 -268 120 -137 -13 -205 -144 -51 -81 -16 -1 321 249 131 -51 -31 29 165 -140 11 91 -95 -170 -3
5407 -3 -174 -322 35 -215 144 83 -65 72 188 -322 42 -66 56 93 76 9 21 -135 30 110 141 1 -143
5430 -143 -284 -157 -398 -61 -117 101 -280 -48 -32 -302 -131 -100 -58 119 -231 -344 231 -332 -50 31 137 22
5452 22 57 27 103 -153 235 206 -80 277 -45 172 65 208 -220 62 -55 -178 191 15 110 -281 -133 259
5474 259 -182 15 17 -90 172 -56 -153 110 -169 -26 68 -61 323 38 -101 35 59 96 -100 -27 37 21 -283
5497 -283 17 17 -102 -109 84 -142 83 123 -93 -109 -12 133 -79 -2 -346 -136 97 149 -81 -18 -47 -5 185 -223
5521 -223 3 118 62 164 -59 33 -237 37 -160 53 101 25 -423 -271 154 -115 -44 334 -199 -38 -153 -130
5543 -130 188 -14 104 89 48 -59 315 190 137 -122 -282 -2 -99 55 177 50 -86 -195 86 68 162 120
5565 120 -75 12 -109 -18 -90 -206 -201 -64 -215 162 100 -132 -88 163 61 221 -217 31 600 67 -159 -81 -317
5588 -317 228 -138 -157 -169 28 -4 -33 144 -43 -139 72 42 -57 -168 99 -10 -84 -44 131 237 -169 -324 91
5611 91 129 -2 83 50 8 -91 -78 25 -210 110 178 182 134 159 71 -105 54 -97 65 -68 -78 227 -156 30 18
5636 18 -95 214 64 -284 206 -21 7 60 72 20 -242 248 -64 -96 -150 29 296 66 -42 23 118 -33 29
5659 29 -307 -8 57 109 -56 -104 -9 -245 6 -86 87 191 194 107 130 53 -16 170 189 299 -72 27 -273 -77 63
5684 63 93 -56 10 233 0 133 5 51 -163 -190 131 326 34 128 85 288 54 -110 -47 -93 417 42 215
5707 215 143 -45 -61 -26 -38 108 124 -27 27 -271 -145 -92 149 66 122 138 -28 6 269 -295 -35 -291 48 -28
5731 -28 -107 117 -12 -339 233 -221 110 264 -33 -47 -57 159 -37 136 68 -14 458 -25 270 222 -173 -289
5753 -289 99 -74 12 -123 -96 47 -177 -67 -29 -88 243 78 -107 -73 -38 -29 30 -197 185 -131 -117 -87 41 107
5777 107 85 -130 -220 18 -97 184 -132 9 -219 -271 -149 -8 -68 -74 -24 -213 13 235 -19 -159 45 -1 -66
5800 -66 -298 -55 67 83 229 12 98 165 -53 -43 -12 -176 137 -78 144 -4 -73 -15 112 3 93 -286 -185
5823 -185 -5 -115 38 5 110 -5 129 33 29 13 160 151 -70 204 82 53 47 -361 23 108 -158 117 -252 -9
5847 -9 79 -98 -97 121 -88 -341 -102 -120 147 16 -44 189 -177 -211 183 24 151 79 239 106 202 93 -8
5870 -8 -78 -80 202 177 -91 -108 62 -306 -173 -79 -45 82 -20 9 164 9 -35 272 -3 -211 31 -30 -16 63 48
5895 48 43 197 0 44 69 67 -71 -82 130 96 -165 184 78 -114 -177 -132 -112 141 -110 -58 35 -96 107 114 -15
5920 -15 79 -54 45 -187 91 144 215 -66 42 86 294 -124 8 77 -116 -9 46 -160 158 62 -51 76 347
5943 347 21 -18 -259 -128 37 84 -91 -14 -28 -32 153 328 125 -168 175 -258 -47 -93 42 -17 47 -87 -12
5966 -12 -41 -13 22 -107 106 -204 -106 -107 4 -75 -74 -4 -239 -122 -156 176 5 -364 183 134 -107 204 -167 -283
5990 -283 -34 -164 -134 -352 -221 81 158 -148 275 -18 -13 -38 -162 44 91 142 -271 109 -1 17 -132 147 160
6013 160 -117 264 54 93 218 179 -255 14 76 26 160 -99 7 -172 8 -97 -222 -58 -5 -249 162 11
6035 11 -61 -111 -268 57 -244 131 168 44 300 22 -126 29 174 72 85 3 -42 -189 34 -105 160 182 -48
6058 -48 241 86 -121 -37 62 -76 -95 138 -205 -291 102 -147 8 28 2 -277 119 -146 133 -141 62 178
6080 178 54 161 70 294 -25 -124 11 121 137 24 -75 6 253 119 -98 -21 8 -20 108 64 13 133 -107
6103 -107 -214 -28 40 29 4 18 87 -117 -75 75 66 54 91 51 231 233 12 194 33 183 80 72 -359 -157 171
6128 171 -74 -225 -44 -66 25 -84 -220 126 8 -249 -124 137 112 165 219 -11 216 207 204 141 -92 68 96 280
6152 280 9 129 5 -48 95 141 -125 154 118 -54 47 73 71 -29 -226 98 -69 67 229 121 -89 18
6174 18 64 218 -53 127 168 -111 -37 169 -78 93 27 65 -126 -176 89 83 121 140 25 110 131 -137 54 44 -317
6199 -317 53 -50 55 6 204 200 -132 -202 -212 77 -40 185 -169 240 -74 211 37 63 -78 -61 -107 -31 104
6222 104 91 3 255 -81 -4 -4 108 145 -51 12 91 19 122 214 -96 -119 -36 -14 82 -362 -5 -119 -175 -26 -24 -54
6248 -54 211 276 284 121 -16 58 243 -12 -37 176 -16 -35 -155 -109 42 -114 -156 -120 29 31 66 -157 132 35 239
6273 239 94 -118 62 58 -40 239 -98 142 -26 8 152 14 102 -161 -6 -190 24 143 -40 -162 -170 -12
6295 -12 -187 75 67 159 -31 -41 -214 102 16 -14 67 -125 -6 -45 173 89 -3 230 -147 -93 -103 -89 75 217 84
6320 84 30 45 123 152 -56 -178 -186 -26 -103 -159 2 107 -86 -105 -11 36 28 -92 -251 -132 172 135 49 -97 -84 -78
6346 -78 -61 -135 81 -68 -61 -73 -87 -85 -95 184 80 -62 116 62 -45 -55 127 156 -100 -263 189 -110 -94 40 -204
6371 -204 -161 4 29 -80 297 -59 41 -213 -102 139 -290 -46 -72 145 193 277 21 -46 -104 -183 -157 304 -28
6394 -28 -8 -188 -78 47 -26 -132 12 201 187 -158 170 39 -139 45 -75 -141 -115 4 28 14 -15 69 41 138
6418 138 22 -18 18 -61 -221 -60 -140 17 86 -54 268 0 88 -120 6 -62 38 -60 -259 -53 66 74 35 95
6442 95 -371 -13 48 78 161 172 42 32 -32 -51 -16 -7 -286 156 -169 -112 -88 -116 112 158 301 155 190 -83 -182 167
6468 167 107 481 -212 -1 38 -259 47 82 107 162 1 38 -265 10 -269 -9 -82 -89 165 195 110 -186 -200 -95
6492 -95 -8 48 34 -164 172 69 -223 -230 138 -130 103 -118 38 15 -39 84 -287 -130 -223 -16 -12 -53 -248 54
6516 54 -227 38 7 -74 -68 49 43 24 60 33 45 -85 -49 -70 -87 244 172 -66 -143 64 83 -69 41 -104 -19 103
6542 103 152 -30 -31 -203 -61 16 -63 9 217 -35 -196 -43 170 51 33 -31 -80 -280 -89 74 169 -63 222
6565 222 34 -36 -103 92 -115 107 -202 -5 141 -232 -6 45 -22 103 162 -136 79 -27 -179 -112 46 -134
6587 -134 -157 -68 -15 52 -51 -73 95 -29 -77 -54 -136 28 -184 51 108 -239 -189 -158 -89 46 -168 0 -309 -84
6611 -84 -169 -63 114 210 130 36 -172 -40 -209 -31 77 -223 117 -144 141 -215 183 21 -39 48 143 170 38
6634 38 -83 150 144 -65 205 -37 210 -98 127 -103 -252 -120 113 -142 -145 118 66 90 87 -96 -199 -141 185
6657 185 8 -194 51 180 -71 128 -43 53 -84 -92 -45 -104 -16 -71 239 -100 51 -26 28 -92 -116 -141 5 -53
6681 -53 141 -64 -102 97 -94 -103 -88 338 -218 152 83 73 -313 306 -174 5 30 149 -14 43 -304 -119 -95
6704 -95 302 118 -68 115 127 108 29 -31 -51 39 224 218 130 115 -59 -58 -50 189 -100 -155 73 239 -167 -77 -89 -60
6730 -60 -137 -60 172 -175 -114 115 7 94 -49 29 90 96 -100 54 79 103 179 380 143 -121 217 104 -193 -361
6754 -361 47 33 -137 249 -129 -271 91 152 -124 -219 5 -55 -126 -350 -121 13 16 25 153 -166 166 131 179 32
6778 32 61 144 12 226 273 21 13 -164 -50 -102 200 -179 13 -126 -103 -34 -32 4 -57 188 -55 -18 -57 222 73
6803 73 153 -123 -99 -59 142 -22 45 -7 20 -90 -103 -42 -15 -79 -72 238 -57 -94 52 59 -136 182 269 -81 -84 202
6829 202 52 43 -110 -59 82 122 -64 -238 6 144 32 -67 -46 -26 152 -60 -119 55 -57 0 -3 11 -20 -55 110
6854 110 141 -90 22 -46 -39 -69 -91 -183 -225 -23 -54 -97 -8 23 198 272 -8 -46 57 -16 -23 -73 -199 101 43 -45 109
6881 109 -266 -172 -192 -41 -126 -8 -45 -105 40 210 31 -98 64 165 -185 172 84 -139 90 75 -36 -200
6903 -200 -196 104 111 225 75 92 -52 112 -84 159 126 251 157 -90 -234 68 -222 -212 -268 -177 -106 -191 -103 -226
6927 -226 109 -34 109 11 70 216 103 167 307 32 -28 9 -25 80 19 7 51 129 -116 -184 -74 121 52 -155
6951 -155 -4 76 -131 -287 -17 -176 152 183 93 112 -161 13 136 -19 -48 -69 -30 -13 -175 -46 205 233 87
6974 87 68 -132 -79 148 201 -233 63 -105 88 -15 57 -226 -138 -215 41 37 -203 119 159 -176 -55 118 110 -59
6998 -59 193 80 28 -19 -14 -38 134 -47 176 123 131 -79 43 82 185 -76 65 -62 116 -62 -236 -8 -206
7021 -206 -33 -103 79 76 -34 -88 -247 58 54 230 211 48 64 125 138 69 -109 5 -194 -91 147 92 116 186 -54
7046 -54 -56 69 -42 149 42 -40 -121 -166 -111 83 -128 -229 15 -4 -110 -108 179 70 -99 -99 -275 194 257 -37
7070 -37 -166 10 35 -38 -82 -169 47 202 -193 -155 -164 12 62 35 30 -27 -64 196 31 34 49 -29 268 149 -54 230
7096 230 -32 41 2 -95 -94 159 -92 -244 -23 34 140 147 -125 143 -47 28 -81 21 -135 154 -148 -40 -182
7119 -182 -254 207 -92 18 -213 18 206 -204 -178 166 19 104 -49 -39 -307 57 5 -64 -6 157 -152 -21
7141 -21 -247 43 -9 23 -119 106 -161 -79 92 140 25 46 -193 147 216 -196 178 224 -35 16 -58 -83 -353 -139
7165 -139 24 46 130 91 8 -109 52 148 61 -149 243 121 21 52 122 -84 -70 137 -189 60 348 107 -67
7188 -67 -105 218 -225 31 103 -87 -28 283 -141 23 -211 36 -99 -114 144 50 -290 85 81 180 108 84 -110 185
7212 185 266 18 57 -26 69 -91 23 -14 30 -107 -218 123 74 -164 90 -113 22 -217 319 -204 -130 155 -11
7235 -11 -75 83 -190 -13 -90 120 -90 -82 87 -150 65 -33 252 22 38 -167 193 -192 -22 12 -104 -26 230
7258 230 -10 -149 -63 -71 -394 -87 -183 139 -101 -100 -301 138 23 -136 23 328 -30 114 -19 -37 265 -13
7280 -13 93 -82 158 -178 -220 -24 -4 42 60 -11 -21 -75 48 -243 -53 236 -53 66 -164 17 -72 -50 20 -33
7304 -33 -87 141 -210 10 -173 -60 -99 39 -152 70 -164 17 -148 -45 174 75 261 31 -103 148 -28
7325 -28 -128 15 269 78 -37 -91 86 -111 136 -87 95 -76 341 -115 158 22 40 -142 -179 16 49 -140
7347 -140 -146 150 178 57 62 215 -118 -199 200 -65 -70 -57 53 -23 -277 73 69 -247 212 -146 -152 -145 -46 80 -90 -13
7373 -13 239 106 112 -86 -40 173 -39 298 -1 62 -34 270 23 -141 -72 131 152 137 -315 -250 42 -118 -80 -231
7397 -231 257 35 -28 91 -13 126 -28 -246 93 166 -112 274 122 35 -117 -292 164 77 -173 -17 77 52
7419 52 70 -53 -50 -1 208 21 -177 154 -66 47 12 15 9 185 167 -361 103 21 -17 95 8 -204 256 -40 22
7444 22 129 17 -173 104 3 -44 -93 185 -29 -71 6 -46 -1 -12 37 107 -30 82 1 198 -114 -133 149 -188
7468 -188 -200 -29 41 -31 -93 71 -44 34 40 -45 -5 -136 -86 11 -29 73 8 390 34 -32 104 30 -174 -72 17
7493 17 -276 106 192 -26 85 -94 -35 -53 47 -61 -7 169 4 82 -253 -156 62 3 86 -11 76 -85 -53 -61 -201
7518 -201 -210 63 112 -41 -103 -55 -150 42 65 -123 -316 -185 -164 110 -49 196 -194 45 31 -10 -65 -7 248 173
7542 173 -75 -32 -50 -210 -207 -55 39 147 144 -374 -193 -3 -131 94 143 -23 -364 103 -177 -129 -62 -128 -108 172
7566 172 20 110 94 133 19 45 70 3 -96 165 -54 69 -137 81 99 -14 176 -39 65 27 53 288 -70
7589 -70 -231 33 -180 41 -41 321 -142 -244 71 109 255 9 -6 32 -280 -18 -76 -121 361 -86 -113 -13 -76
7612 -76 -30 -123 -74 118 -227 -118 -28 123 -94 25 60 86 127 -221 101 165 94 -41 114 -292 82 -87 124
7635 124 264 23 -27 -47 65 -134 50 -57 -111 -131 -417 -154 19 -362 -140 -99 -205 104 213 -83 -6 -82
7657 -82 -103 93 -94 -264 168 -191 -6 159 151 243 -46 89 -125 -44 101 272 -47 -249 -29 -59 40 -73 11
7680 11 -46 -25 60 -34 81 9 62 12 -71 -27 -101 109 -87 169 -67 28 -115 -261 -162 -89 -95 14 -107 -92 135 -128
7706 -128 -141 -127 -95 79 -47 -238 -197 -16 227 194 -112 177 4 -26 138 71 56 -43 272 145 -71 -37 12 -246
7730 -246 -16 92 96 63 53 -105 -163 -106 21 218 -55 -157 172 40 -113 210 -73 -30 5 -67 58 116 -251
7753 -251 -8 109 -62 -25 -227 -23 -376 -118 76 118 -27 35 186 89 154 -284 -125 52 -95 -42 -133 221
7775 221 1 -100 178 124 -125 -308 -195 126 -74 -185 99 -135 48 16 76 27 -12 -183 -28 -169 88 179
7797 179 -31 205 -13 126 -3 115 94 166 -60 8 -3 114 -70 39 200 -42 154 116 -274 8 39 92
7819 92 -88 -267 -71 -82 -49 -47 -147 70 -38 150 83 -164 -23 -113 -158 -121 115 -120 -194 -25 -146 -161 -65 35
7843 35 -164 -73 -61 72 -99 62 102 61 -9 -140 69 150 -232 64 144 -1 -27 160 61 173 166 75 196 -256
7867 -256 87 -16 127 -76 119 69 10 -136 -320 -256 -20 43 34 82 243 -39 181 63 -47 -79 -217 153 83
7890 83 233 -181 -45 -149 -317 1 -24 -190 59 197 -21 197 41 -118 203 -78 -134 -180 164 92 54 286
7912 286 249 -189 -31 -240 5 132 196 -29 -25 55 91 249 361 40 -14 -22 -92 79 89 145 -15 111 -290 160
7936 160 157 -159 -72 3 -120 -69 48 262 42 126 158 -30 -21 -160 -35 166 24 79 147 110 -31 58 -170 -51
7960 -51 123 -2 151 3 -49 188 126 -88 -14 -91 90 -73 253 56 270 -245 152 -40 246 25 140 183
7982 183 15 143 -65 -18 21 2 10 -41 -17 -67 165 19 -84 -43 146 -138 -101 -23 189 -45 -94 -289 -110 5
8006 5 -57 -36 -40 60 -78 -36 -38 45 235 183 110 130 11 9 163 -236 -20 12 17 -78 272 -56 81 -105 -154 -13 -53
8033 -53 87 108 54 -144 161 -9 64 24 104 137 89 286 -179 126 31 -36 -113 228 -62 -276 -261 -171 -164 -49 20
8058 20 54 195 50 -185 27 -93 -18 -86 86 113 149 182 -183 230 18 -160 21 -119 -133 -58 -52 50 103 -133
8082 -133 -235 -410 -217 94 -217 26 -7 155 -11 208 31 -170 -173 51 95 -53 100 59 210 64 298 -23
8104 -23 -115 42 -58 -77 67 -5 -58 118 -76 -23 141 -81 52 86 147 82 -277 -147 -141 37 68 -227 17 -229
8128 -229 -36 56 422 -126 -179 -102 68 -136 -140 55 6 27 -31 178 -6 -97 -167 41 -35 -127 69 43 -44 322 -53
8153 -53 -148 149 61 69 -82 -169 -63 -88 304 48 -20 -29 22 -118 68 5 -145 258 -39 -168 56 -49 -21 -78 -213
8178 -213 75 -131 8 199 -134 -95 -176 45 -65 -52 -93 173 -7
8191g
$$ Imaginary data points
##PAGE= N=2
##DATA TABLE= (X++(I..I)), XYDATA
0 0 0 0 0 0 0 0 0 0 0 0 0 0 0 -8 8 -8 8 -8 13 -16 16 -24 24 -32 32 -40 48 -56 62 -70 80 -92 102 -117 132
35 132 -148 165 -186 206 -230 256 -283 314 -349 383 -423 467 -514 568 -624 688 -757 837 -923
54 -923 1023 -1134 1263 -1412 1585 -1794 2046 -2363 2770 -3316 4083 -5250 7209 -11107 21752
69 21752 -110095 -305143 73908 219392 -19795 -132554 -26 38835 12556 45622 7410
80 7410 -93455 -379 113580 11111 -103854 -20712 104200 65820 -74766 -73284 49497
91 49497 92718 6103 -81417 -50118 30282 31356 -1408 -43943 -73541 -7143 61318 6410
103 6410 -54453 -13852 39933 11972 -5012 35093 8526 -28332 34557 44813 -34782 -30783
115 -30783 50382 44520 -50667 -56717 42254 51865 -26965 -44592 -5272 13104 -4961 -2573 11589
128 11589 -37509 -53586 36670 56519 -41953 -63221 36893 63332 -33575 -33967 62289 30145
140 30145 -46753 1357 47648 78 -27282 12134 11807 -32238 -4834 33173 -11536 -30661
152 -30661 6166 9449 -7460 -1013 11068 -5413 -25217 1039 22169 -550 -16072 -14130 -72
165 -72 16152 6205 -5815 -6218 -2926 13708 15009 -5233 -9523 4283 17265 -1497 -22272 8973
179 8973 24593 -10810 -19536 6795 15206 -1425 -6858 6618 -5201 -15170 13100 14273 -18315
192 -18315 -22588 270 14204 -2964 -17569 -2088 2661 -1525 7767 5360 -3905 -1846 10249
205 10249 16891 -4725 -12521 15763 18042 -8716 -14065 5703 17805 -759 -13707 -2437 -1819
218 -1819 3483 9341 -13395 -22114 1952 13928 -4201 -23496 -5402 14638 -830 -8214 240
231 240 3323 9036 4588 -1928 3796 7521 9467 3017 -5248 3392 6610 2252 -884 -8221 626
246 626 7299 -7379 -6781 3175 -1360 -7720 -6168 3904 -95 -12732 -1213 3774 -5625 1036 2333
261 2333 -3356 1553 6115 5642 -1287 -696 11605 4380 -4439 3018 3524 3880 572 -6185 1781 4349
277 4349 -2484 -2844 -2920 -266 -210 -4441 -667 -4719 -5978 4128 -2965 -8925 1540 2780 -1697 -3606
293 -3606 1213 7083 -1091 -304 6973 779 2382 5706 -320 2139 3106 1150 1614 -2358 924 2664
309 2664 -3123 -1097 -2128 -2436 1539 -5949 -4923 1732 -4176 -4180 -1469 -2368 -148 -2113 646 2410
325 2410 -2525 3797 5575 -1484 3127 4479 2116 3280 532 2936 3264 -821 2057 -183 -1517
340 -1517 2066 -2601 -2197 -333 -4631 -779 -1536 -5812 -2193 -2321 -1673 -1124 -4483 1043 1418 -1998 2567
357 2567 431 853 5608 1242 1256 2986 2364 5227 524 -576 3400 819 1702 214 -3957 1298
373 1298 137 -3239 -1107 -4003 -2691 -22 -3614 -2823 -3497 -2382 2230 -2665 -2293 1627 -422 2424
389 2424 2650 -935 2549 2970 3533 3462 -1136 2090 4073 1356 2280 -2000 -1896 4091 195 -2600 -3183
406 -3183 -3214 1620 -438 -5498 -4043 -3072 2381 589 -7138 -2665 2219 2001 1894 -3606 -1524 5473
422 5473 4475 1990 -2113 -516 7837 4697 -979 -1712 -295 6909 4188 -6134 -3724 1817 3904
437 3904 -447 -8493 -4072 2230 322 -2090 -6864 -5303 3517 1593 -1755 -3829 -2798 5246 5004
452 5004 -2202 -1934 1267 7506 5079 -4137 -56 5279 4235 2052 -3198 -1010 4090 1038 -487
467 -487 -2624 -4299 -112 357 -522 -4272 -8700 734 5459 -4456 -6975 -1352 3854 2537 -3773 35
483 35 3206 315 3158 2751 -60 1622 2107 5065 2805 -4777 638 6563 2371 -3660 -5908 2518
499 2518 5207 -4439 -5043 -1831 -2040 658 -1572 -3074 -2623 -3697 1984 3658 -2796 -3785 -1028 6938
515 6938 5808 -6661 -2818 8845 6091 -1366 -4004 2480 7998 815 -2446 -980 -1026 3393 2563
530 2563 -2693 -5011 -5948 3950 7242 -8141 -12691 1037 10023 -56 -13755 -3364 10654 1281
544 1281 -5524 -1528 2024 4586 1957 208 142 -597 6421 7093 -3422 -4810 1648 8714 4996 -9288
560 -9288 -7289 6574 5665 -3325 -8881 -3377 4684 -532 -5093 -2757 -2236 917 43 -2106 -398 -2154
576 -2154 1571 6215 -1072 -4500 2071 8233 5428 -6757 -3962 9863 6876 -2797 -4615 336 5854
591 5854 704 -3620 -901 -2322 -1505 987 -1754 -3573 -4221 555 3492 -5824 -6030 4684 4262 -3049
607 -3049 -5636 1790 8513 246 -3775 1997 3343 3047 1707 -20 2367 501 339 2978 -633 -542
623 -542 202 -2211 -132 -974 -1662 -12 -3290 -2777 -559 -832 335 -2894 -3794 2619 1579 -1767 -197
640 -197 1551 3323 -862 -1424 4973 3727 -762 0 1129 3602 2251 -1650 195 -332 -400 1670 -717
657 -717 -1952 -2346 -1915 1567 -2208 -4661 132 -766 -1616 -1188 -1097 1369 -269 -993 1396 367 1571
674 1571 2891 166 1179 1400 1529 4083 675 -874 756 949 2107 -502 -2937 200 -279 -793
690 -793 -299 -3359 -1477 543 -2259 -1737 -1319 -558 612 -2007 -321 812 -74 2135 402 -1105 2518
707 2518 2704 1594 1143 -48 2442 1562 396 1564 -575 -224 782 -1570 -553 -545 -2643 -956 -1598
724 -1598 -1732 -1121 -2282 -843 -649 -1813 499 -515 -745 1662 -316 92 1753 1220 2064 269 577
741 577 2872 1106 1220 947 -701 1972 882 -1796 -104 -341 -918 -541 -2460 -806 -869 -1679 -612
758 -612 -2432 -1281 708 -1654 -579 382 -338 1471 -90 159 2326 730 1317 1364 225 2573 1205
775 1205 -357 1359 128 533 619 -1588 -128 -657 -1659 -560 -2047 -1414 -201 -2746 -740 -454 -1408
792 -1408 174 -981 -893 985 -244 863 930 -244 2349 1046 518 2510 664 1383 1577 -642 1538
809 1538 700 -908 182 -1231 -318 131 -2237 -666 -1053 -2139 -351 -1752 -1813 -168 -1645 -279 -242
826 -242 -860 1180 64 100 1890 266 1794 1742 14 1828 802 270 1900 192 405 613 -759
843 -759 554 -815 -1318 342 -1622 -1256 -134 -2400 -824 -777 -1494 -190 -1336 -280 1011 -1194 546
860 546 1024 -5 1943 883 667 2305 443 1455 1442 -130 1212 374 129 826 -1207 31 295
877 295 -1851 -615 -755 -1782 -593 -1242 -1258 -604 -1529 429 -24 -1354 840 -290 208 1518 208
894 208 1159 1254 868 1946 406 79 1866 802 712 -272 -784 1573 -184 -1635 6 -1049 -889 -303
912 -303 -1620 -926 -1762 -1048 664 -1766 -1256 419 -5 576 -606 -280 1958 882 772 1186 309 1763
930 1763 1656 383 996 -229 815 1779 -1025 -770 323 -828 -50 -1025 -1722 -948 -1032 334 -1137 -2951
948 -2951 278 899 -1142 -838 -467 1177 1066 -719 1005 1107 694 1870 872 340 1090 502 2426 766
966 766 -2197 551 1602 -187 -1816 -1761 974 -205 -2393 -687 -1030 -1536 152 -1172 -938 -711 -660
983 -660 1140 -222 -758 929 426 1680 1327 -710 1354 1912 587 588 -266 1079 1555 -719 -295 149
1001 149 -444 -161 -1427 -464 -515 -2690 -587 548 -1896 -1907 -746 986 -10 -2754 678 2042 -777
1018 -777 62 1038 1345 1299 -221 1834 1732 -1067 1058 2298 432 -519 -1311 1642 1171 -2686 -1067
1035 -1067 539 -597 -901 -1802 -637 -204 -1587 -21 -497 -1598 93 126 624 381 -1192 1234 2069
1052 2069 230 678 137 1319 2645 -714 -371 1416 822 522 -993 -524 972 -1107 -862 203 -1394
1069 -1394 -1063 -604 -408 -515 -2579 -578 1876 -1176 -1847 189 1102 1054 -1186 247 2403 186 354
1086 354 1771 568 493 747 1544 1142 -1540 60 1704 -709 -1182 -688 -525 -59 -1886 -892 -165 -1340
1104 -1340 -396 -659 -1337 117 -404 174 656 -1082 792 1299 62 1376 369 522 1615 551 638
1121 638 286 -9 1621 310 -1232 459 -68 -581 -787 -1098 302 -1005 -1547 615 -1449 -1244 210
1138 210 -147 -213 -747 -164 1253 -38 -571 1413 661 430 497 738 1587 -163 113 1751 -48 -430 680
1157 680 153 -114 -1310 -558 450 -1891 -979 266 -1566 -1026 -530 -504 -29 -1434 282 642 -859 421
1175 421 771 -78 947 94 1048 1271 -86 1430 1079 -218 678 632 217 -36 -1029 146 -135 -1444
1193 -1444 -39 -590 -1600 -556 -764 -334 -947 -905 491 -262 -1202 608 29 -168 535 621 1222 249 512
1212 512 2028 400 -64 744 682 686 -272 -328 1174 -1012 -795 663 -625 -950 -654 -560 -171 -1492 -732
1231 -732 684 -1325 -629 325 -148 -25 -149 354 1228 -302 854 1515 165 835 914 762 709 -415 462
1250 462 782 -1198 13 321 -798 -408 -674 -488 -611 -1325 122 -189 -1587 184 16 -343 -239 -257
1268 -257 367 281 -188 1189 612 -44 1287 675 614 264 22 1338 113 -563 720 -95 -460 -204 -577
1287 -577 -27 -670 -1226 240 -1226 -1110 179 -728 -241 -473 -250 748 -212 -153 990 -1 276 741 532
1306 532 1288 109 414 1320 -225 373 678 -396 191 59 -554 68 -1068 -209 114 -1368 -286 -426
1324 -426 -736 -300 -1021 -216 137 -833 142 495 -22 1160 152 226 1061 230 979 744 -14 923 361 53
1344 53 452 -200 238 -241 -1066 -25 -516 -1029 -107 -631 -768 -272 -904 280 -218 -1004 435 -15 148
1363 148 457 -44 776 755 -143 958 315 324 1090 144 615 393 -332 711 -255 -440 195 -693 -519 -190
1383 -190 -1002 -207 -393 -730 -451 -928 -463 290 -719 -46 -413 -239 808 -110 284 850 614 740 754 358
1403 358 926 222 62 770 -346 140 169 -407 101 -586 -467 32 -1059 -846 -492 -630 -13 -582 -771 148
1423 148 -508 154 503 -113 386 392 498 636 179 474 883 162 341 413 123 878 -51 -163 354 -160 -342
1444 -342 -404 -597 13 -698 -381 -26 -1058 -793 -104 -314 37 -375 -460 780 308 357 258 290 1299 436 186
1465 186 1049 339 445 496 -130 401 -59 -271 212 -633 -757 -88 -356 -189 -855 -959 49 -336 -888 -196
1485 -196 -297 256 -222 -327 632 2 79 1057 595 474 451 543 815 480 -9 691 437 -105 -151 -482 512
1506 512 -185 -795 36 -395 -340 -400 -928 -85 -314 -943 -108 -449 -281 99 -287 913 240 -393 487 934
1526 934 235 406 381 936 596 -216 561 391 -134 247 -95 -68 -387 -806 325 -357 -1191 -509 -468 -199 -455
1547 -455 -818 12 12 -520 314 -115 159 655 305 733 424 -130 782 616 268 490 -25 591 345 -429 -156
1568 -156 -118 -200 72 -694 -462 -100 -522 -53 -386 -582 -141 -574 -118 410 -520 420 830 53 91 121 646
1589 646 748 -14 498 875 133 434 -96 76 388 -384 -49 -13 -840 -241 -228 -486 -445 -714 -40 -1 -1015
1610 -1015 113 -117 -332 340 -104 207 474 -19 622 508 -20 981 280 234 522 293 296 182 -57 314
1630 314 25 -357 0 -453 -580 -567 -750 -98 -578 -628 -31 -416 -394 108 -176 213 170 30 668 -52 401
1651 401 886 5 213 544 276 905 16 136 539 -404 34 191 -561 -147 -317 -429 -323 -829 -236 30
1671 30 -450 -145 -185 -120 109 -513 314 419 -173 649 479 225 501 136 569 634 309 281 266 -5 441 -205
1693 -205 -448 -270 -648 -151 -439 -753 -594 -358 -786 -185 -437 -134 -301 -195 406 -32 -309 557 -60 159
1713 159 360 290 810 266 166 960 190 -22 618 -92 -43 54 -230 93 -761 -482 140 -632 -418 -144 -618
1734 -618 -92 -435 -233 46 -666 236 213 -94 415 166 256 777 -267 646 909 -89 422 515 102 185 -218
1755 -218 116 85 -615 -96 -271 -525 -225 -431 -232 -451 -723 140 -169 -521 74 129 -153 201 142 306 508
1776 508 393 891 133 226 876 91 208 467 81 383 -120 -246 270 -355 -385 -283 -354 -362 -440 -428 284 -910
1798 -910 -593 181 -506 -20 176 -139 299 -255 301 742 19 543 465 170 724 163 203 511 -347 99 127
1819 127 -496 -9 -218 -332 -275 -575 40 -14 -590 -312 -121 -204 54 -265 -109 52 -156 363 56 -200 608
1840 608 177 98 603 -102 421 340 -294 474 42 -257 144 -289 -213 -75 -354 -102 -380 -622 56 -456 -315
1861 -315 -146 -329 -4 -83 -28 256 114 219 612 36 272 390 37 619 156 145 472 -113 249 -59 82
1882 82 -13 -286 -243 121 -652 -275 -114 -805 -196 -487 -370 -118 -361 81 186 -305 394 320 -52 427 150
1903 150 492 721 7 376 581 138 540 -105 -90 150 -442 -221 36 -522 -265 -386 -87 -103 -435 -378 -189
1924 -189 -318 -15 -24 -9 342 38 288 432 124 328 87 235 517 190 219 369 -92 483 224 3 255
1945 255 -273 -431 -42 -405 -242 -426 -542 -95 -518 -322 5 -430 -159 64 -21 46 121 252 461 64 346
1966 346 549 290 439 263 132 611 18 -143 -12 -178 66 41 -377 52 -339 -335 -209 -293 -253 -243 -389 79
1988 79 -399 -321 296 118 109 195 278 450 232 -23 538 165 296 128 -48 310 51 104 110 -237 -542 -196 -383
2011 -383 -349 -311 -450 -134 -353 -399 -49 -470 -164 -141 -286 49 1 164 581 147 -23 107 -81 776 356 -20
2033 -20 276 105 151 243 -94 387 -160 -436 -191 -499 -306 -95 -502 -29 -568 -572 -233 -185 -287 -66 34 361
2055 361 105 85 547 198 29 280 214 444 320 -77 369 92 -182 245 -332 -179 -54 -78 272 -159 -505
2076 -505 -102 -482 -216 -1 -715 -5 66 -74 3 -173 196 363 -156 391 101 -64 490 -79 241 468 -88
2097 -88 199 415 -218 188 107 97 93 -394 8 -185 -619 131 34 -553 -152 -205 -129 79 -363 372 359 -139 378
2120 378 182 119 288 183 581 332 69 514 69 9 274 -13 -38 135 -384 94 -344 -348 -47 -190 -342 -117
2142 -117 -147 48 -201 -257 310 -249 -41 83 -125 340 583 124 106 37 425 423 247 87 192 75 65 -167
2164 -167 -66 -152 -427 -229 -113 -541 -299 -332 -400 -202 -165 118 -31 -449 164 -68 -79 63 69 518 342 -148
2186 -148 481 341 -193 350 231 186 249 -50 80 98 -80 152 -215 -322 -66 -326 -408 -138 -373 -68 -359
2207 -359 -208 200 -314 34 59 -32 352 -137 -79 422 -21 203 312 274 148 92 54 299 -247 -27 39 -410
2229 -410 -97 141 -87 -394 -268 -188 99 -516 -49 38 -309 -109 -103 5 374 -299 232 223 49 206 344 41
2251 41 257 -101 353 375 106 149 53 -97 -21 -232 -523 -213 -425 -88 9 -232 166 -356 -233 170 -178 122
2273 122 -24 -119 343 46 352 554 328 313 79 185 545 -90 85 305 -265 -39 122 -28 82 -202 -178
2294 -178 88 -334 -210 -138 -108 -151 -232 -337 -176 -545 -59 121 -187 91 100 145 483 0 119 523 115 208 235
2317 235 143 -116 2 217 46 -258 146 55 -260 -207 -223 -351 -274 -509 -183 119 -225 159 -225 -168 95 206
2339 206 -114 427 423 294 130 174 279 148 -147 38 41 74 -15 -204 208 -282 -135 105 23 -71 -121 -350 -299 -163
2363 -163 -202 62 -61 -166 308 -301 111 -32 70 659 199 202 151 -54 212 53 -73 250 79 14 222 -473
2385 -473 -36 -35 -555 116 -113 -397 148 -284 1 -106 -213 -78 79 -116 -84 174 301 377 -96 143 334
2406 334 -37 99 104 139 137 -233 -14 266 -272 -125 14 -202 -214 -179 -237 125 -210 -185 -196 -276 -124 -74 162 78
2430 78 -16 330 -157 40 356 52 522 99 61 108 311 258 257 -6 227 534 -19 57 126 -367 58 -70 -231
2453 -231 35 -340 -201 -22 -365 22 -240 127 77 -191 -93 304 -161 213 55 98 229 173 397 266 -13
2474 -13 308 180 -8 200 -318 -119 56 -313 -124 -94 -86 58 -232 -295 65 -142 -45 75 -163 19 -178 293
2496 293 460 -72 107 217 -5 250 -97 -24 326 -66 111 174 -302 89 107 -274 21 -52 -329 -41 -376
2517 -376 -269 -182 -154 -4 -53 -77 -173 -132 -30 185 80 228 253 56 582 162 241 118 157 251 249 -144 325 -107
2541 -107 -212 -140 -301 8 -150 -379 -79 -180 -483 -125 -554 -97 53 -100 91 -33 40 193 22 111 38
2562 38 214 100 -49 -60 327 209 193 -62 -165 -57 38 -332 -27 -198 -103 16 -287 8 -126 -142 40 -27
2584 -27 -113 -3 -276 125 181 16 29 -103 111 158 117 416 352 -144 266 134 -145 152 -190 -138 -118 -268 45
2607 45 142 -321 -183 -452 86 10 -352 63 100 -115 194 208 -109 118 55 -117 223 83 345 286 -6 429
2629 429 -60 -79 56 -253 -64 -79 -221 -39 -172 -215 -81 -244 -163 -337 -109 -198 -269 -225 159 -148 -150 -188 -90 -15
2653 -15 9 40 261 -274 -31 95 -171 146 73 130 294 28 74 103 -62 -64 -104 -64 -76 -175 -73 94 -394 148
2677 148 144 -336 -106 112 197 6 -191 198 244 113 171 390 105 159 70 240 419 -154 115 -148 91 145 -225
2700 -225 -69 -305 -178 74 -96 -208 195 -147 -113 -113 -115 190 -159 -18 340 134 -62 223 146 321 159 248
2722 248 400 -21 105 257 16 60 -92 -87 -58 -92 -59 124 -52 -80 -56 -243 -32 -186 -159 -141 -355 -204 171
2745 171 -88 221 55 45 498 33 353 324 170 219 228 52 -45 206 190 87 -295 -108 -50 -371 -281 -17 -111
2768 -111 -248 32 91 -145 -243 -5 -220 48 118 -94 167 254 13 418 -43 -216 161 -118 148 343 -114
2789 -114 288 260 -11 145 -276 -31 164 -2 -64 -45 -388 -219 -381 -108 64 -217 -15 -128 -67 141 -245
2810 -245 -107 104 -56 50 66 -172 286 58 21 326 -190 359 72 -228 148 298 -112 -87 -159 43 -39 -198
2832 -198 -183 -41 -229 69 -146 -185 120 156 261 117 72 328 9 43 217 285 309 400 -37 425 413 -117 29
2855 29 -104 -176 4 -334 73 -260 -315 -157 96 -205 -268 -37 156 -67 -102 -39 -347 229 607 -17 52 507
2877 507 468 505 103 -36 410 148 -285 -258 -102 -213 -278 -137 293 96 -11 -225 -215 -112 35 -332 -269 -107
2899 -107 -195 -184 -346 399 -415 214 269 217 343 336 -78 195 183 53 200 322 -78 430 38 300 18 -92
2921 -92 -547 -375 -130 -233 -18 -236 -181 -227 -141 -180 -89 -74 206 90 200 -162 517 115 326 97 -359 160
2943 160 -63 -15 17 365 -285 406 -195 -279 -31 -138 -150 269 -74 -50 91 -62 -66 -308 27 128 -114 -31 -584
2966 -584 129 -87 100 175 -44 57 427 219 125 40 -206 -49 54 -207 -4 -126 -230 -243 -586 -276 40
2987 40 -296 -1 -127 -56 -43 67 107 28 -11 24 363 -147 121 -44 230 540 -40 160 141 -318 115 122 54 202
3011 202 -281 -631 213 -41 -167 208 -237 -233 -371 -38 33 -38 -120 243 -72 -210 -276 -128 396 -171 -166 109 478
3034 478 181 -88 274 86 108 -69 71 -142 103 -76 -145 -225 -330 152 -390 400 -23 -126 -410 -241 -37
3055 -37 -541 -24 -189 107 -430 -308 -144 -1 206 470 64 133 -122 -112 -323 156 102 -139 -308 -251 -183 -238
3077 -238 7 -116 -107 -414 378 11 176 -244 195 -245 78 368 -124 90 205 -139 406 -115 -547 184 400
3098 400 -112 -270 -276 71 487 -31 -153 226 -67 287 -9 294 12 -657 257 -349 -409 -215 70 -333 242
3119 242 104 -338 -23 -283 -449 -171 239 374 -239 66 410 70 294 624 -41 31 -218 -9 335 218
3139 218 579 -66 -26 -290 -335 45 -144 -596 -578 -83 -170 -593 -270 -266 129 -144 -318 220 -290 523 766 -166
3161 -166 21 -306 382 431 -36 945 200 133 -170 -530 -39 -130 -294 777 -156 203 196 -517 571 183 -91
3182 -91 -66 233 150 -207 1 303 91 -210 -1 204 -70 707 445 -186 386 -123 346 -25 -435 173 47
3203 47 -507 363 -16 -646 -116 -801 -720 266 32 207 -814 -105 330 412 122 659 129 32 -494 -795 -401
3224 -401 -80 -31 -739 522 -211 242 199 -32 -941 -470 -117 -369 166 -694 -468 87 -725 -928 588 -344
3244 -344 -157 -303 -123 -406 238 1310 -145 493 310 -21 150 -1036 528 -160 448 -955 403 36
3262 36 -528 119 -373 -410 80 -706 -239 443 188 924 -617 -641 -203 -1102 356 -641 -325 -979 -192 387
3282 387 330 255 47 62 441 685 169 -168 -150 -649 -1104 564 -211 54 -367 -236 -63 57 -1012 -207 256
3303 256 206 -385 126 458 -300 186 -198 -346 -274 -288 259 -439 -356 -375 -710 -424 -969 -353 -341 29 -140 -189
3325 -189 -7 -90 133 -358 113 110 441 -477 -56 -530 -645 195 77 -345 -220 106 252 -227 -172 -282 -421
3346 -421 417 156 -531 -247 3 538 831 -529 749 275 282 49 -357 91 1 -325 43 -211 -404 669
3366 669 -705 -84 -135 -660 221 -153 -336 -518 14 137 495 101 137 21 553 -225 319 538 -99 289
3386 289 -13 634 -214 -517 135 -634 -691 419 -270 -70 -285 213 458 -563 -4 538 -20 31 124 -777
3406 -777 -227 -385 -263 -497 51 940 849 -658 554 308 -242 415 -748 580 520 -340 -130 -265 379
3425 379 -143 -123 -225 -325 88 -115 15 -313 -209 -92 -111 25 138 564 -19 -4 198 217 17 277 15
3446 15 233 83 -47 286 80 -42 -218 67 187 162 -329 143 -15 422 -107 -319 3 -240 -24 -68 47
3467 47 14 264 -150 -8 -297 385 250 -114 2 87 28 81 49 -29 347 -139 -64 -57 77 73 210 -116 5 -18
3491 -18 -460 -60 -98 -195 -41 -167 58 -90 -102 141 97 185 141 -21 218 115 262 300 -56 -49 208 -175 13
3514 13 -9 -74 38 -80 -332 -133 -46 17 -23 138 -7 -312 -108 -55 -65 -254 -175 -177 416 3 -166 273 153 232
3538 232 71 295 439 158 83 -129 48 -12 49 -161 130 59 -196 -53 -129 110 -50 -325 252 -166 29 243
3560 243 -6 50 -91 287 -54 -306 97 231 31 9 97 -15 354 198 -1 235 90 91 -119 -151 -175 -43
3582 -43 -159 3 115 -36 -128 -326 150 -107 -263 -108 -253 -257 65 -129 -47 248 134 106 276 442 -83 63
3604 63 31 210 -294 191 -65 2 121 -177 -155 9 -146 -192 -185 -31 120 -452 -98 280 6 -269 -14 180
3626 180 133 390 -87 102 37 255 137 -36 122 -52 359 125 -136 294 166 133 32 -311 16 -126 -294
3647 -294 -109 -5 -301 378 -323 -328 200 -67 -94 34 -54 27 24 -6 165 74 185 -10 177 120 106 -25 274 -32
3671 -32 -208 163 283 -208 168 -107 -222 -85 -381 430 -329 -263 77 -383 68 -207 -61 361 28 212 314
3692 314 -33 -78 -235 309 -88 261 274 290 -348 543 -333 -170 473 -263 -63 123 -407 -379 -49 -583 -180
3713 -180 168 -243 169 -369 164 694 68 143 210 125 88 -72 -26 376 -28 499 165 -51 -47 154 67 408 143
3736 143 -211 46 166 -23 24 -495 -193 -45 -283 -292 -129 43 -229 -48 165 166 257 136 123 298 317 81 135
3759 135 -130 153 306 57 254 -79 75 285 106 -61 85 -57 108 137 -107 137 -134 -123 -119 -83 -220 129
3781 129 -102 47 -274 -113 -25 -181 53 314 125 211 354 162 283 -177 47 27 -278 297 109 -114 -156
3802 -156 -212 173 -4 -186 -197 -107 -146 88 196 -93 35 126 -223 126 -370 68 70 15 150 35 68 217 3
3825 3 48 -56 56 21 174 81 27 -138 -115 -261 -175 114 -490 -94 56 -26 -38 -29 -263 -55 -10 21 113 58 231
3850 231 25 -112 23 369 88 -306 101 293 156 -201 88 72 -277 -89 -71 -127 -30 34 114 -223 -83 8
3872 8 -32 -88 103 -193 -48 87 -39 278 -80 -195 206 89 226 171 -186 163 -6 -83 290 44 52 42 -217
3895 -217 282 88 71 -116 -314 -211 -25 -49 67 -129 -273 103 -220 -72 228 -16 231 254 -3 118 111 51
3917 51 389 7 9 166 5 -1 -178 -263 308 -94 -256 -89 -55 2 -98 -255 47 -186 -63 157 -172 210 -22
3940 -22 143 -51 -132 395 226 179 -61 190 197 211 -19 217 -70 -101 -111 58 12 71 33 -51 67 -72 -45 -18 -63
3965 -63 155 -98 -32 29 114 -127 86 -97 -15 -15 -221 173 254 89 263 -27 109 431 205 230 96 -61 99
3988 99 8 -36 -73 -106 -16 -168 -53 -313 -347 -207 75 -298 143 -186 -89 201 0 -75 148 -49 131 144 -117
4011 -117 169 -55 275 203 -111 67 59 -5 357 68 29 -15 -49 -246 -131 -361 -20 90 -110 -182 -38 175 221
4034 221 -208 -84 124 131 253 -109 117 189 159 -48 61 81 221 95 249 357 13 -226 -187 -5 -147 -18
4056 -18 -452 -198 -67 -148 85 -317 -37 -113 -395 3 -65 16 -32 -7 32 353 156 129 369 62 -15 26 180 -89
4080 -89 -95 152 -125 -10 295 -2 -37 -206 -134 9 43 -108 35 -214 -1 -143 -6 122 -164 68 110 154 -1
4103 -1 125 -89 134 -8 28 185 -19 164 57 101 171 -29 -61 -18 -208 139 -58 -187 108 92 -115 -60 49
4126 49 -337 78 -184 -8 -15 -7 117 -6 -67 386 96 144 81 110 63 33 145 138 162 -59 261 -12 19 -193 -216
4151 -216 -194 -84 -148 62 -205 -195 -16 -91 -52 -110 -168 106 -73 244 169 266 350 -182 186 255 241 94 128 37 94
4176 94 68 54 -119 46 6 124 -6 -366 -137 -225 -9 10 -189 48 -38 7 -152 2 206 116 -244 -108 -90
4199 -90 77 114 -225 338 -71 89 172 -179 349 110 -20 -99 112 -288 127 52 23 -150 -109 -129 -58 -90 -18 39
4223 39 53 88 -169 77 -241 -144 109 87 193 53 -44 82 160 -30 59 130 35 -46 -197 226 -91 -133 40 -198
4247 -198 68 279 -81 -36 37 -146 143 -130 -178 93 155 -11 141 35 42 13 149 134 -40 132 -71 56 -156
4270 -156 -130 -278 -159 -106 107 41 -283 -202 184 -121 214 -17 -133 88 -170 -326 -105 93 14 -38 147 104
4292 104 -15 154 244 31 252 69 -80 162 -51 60 -201 -395 -32 -73 -67 126 -189 33 -60 -150 93 -179
4314 -179 -189 -228 -41 -302 3 -66 -16 120 113 -185 125 18 335 90 98 16 81 303 67 -42 -80 -257 -296 41
4338 41 -381 4 -172 -30 124 123 -461 36 18 0 -84 -326 87 92 93 -60 156 127 228 -159 64 64 365 -1
4362 -1 94 2 -290 32 200 167 -121 -10 -11 78 22 -148 -162 -24 -99 -1 -41 -82 239 -114 178 -170 -19 305 209
4387 209 181 128 141 171 176 52 168 114 141 0 -37 25 -121 -201 -20 18 -153 152 -130 -305 1 -200 81 29
4411 29 12 -9 -317 -52 110 93 50 -85 -34 394 228 109 223 -217 -68 47 -124 137 85 -2 13 1 18 -214
4435 -214 -66 -129 -63 -295 45 -177 -251 22 -21 16 38 -92 469 -176 -154 129 107 -5 150 -126 345 47 191
4458 191 105 258 13 173 -245 12 182 -48 -34 -295 -29 -103 -267 -227 -83 52 16 148 -125 -275 142 -72
4480 -72 96 4 142 -197 213 -33 -25 59 109 -9 131 127 -180 125 -74 116 -125 -79 234 -98 -165 77 44 -320
4504 -320 122 -12 -2 -213 -40 231 -126 -168 212 158 -185 -38 -51 474 224 246 192 -71 -87 168 30 38 -42
4527 -42 -136 138 -66 216 -10 -211 45 -1 101 57 -19 -162 117 -189 128 225 -184 -158 -218 63 36 -150 111
4550 111 -1 69 201 125 93 99 -150 -222 115 -225 73 -235 -221 -158 -252 -8 41 -165 171 -80 -188 50 -134
4573 -134 -22 3 21 -111 129 113 216 65 96 205 -182 -176 -28 -10 247 -154 -153 -78 114 5 -24 -130 -157 -172
4597 -172 45 149 -70 -155 -142 -5 -45 -257 -162 111 -133 104 12 60 55 136 30 299 36 107 -11 -18 36 22 -29
4622 -29 12 -100 -153 158 -37 -139 -123 -277 13 81 95 -31 -179 130 86 -286 116 46 236 -36 65 252 219
4645 219 -168 311 94 49 -65 40 -107 -11 -152 -254 4 -230 -77 -257 14 108 156 -176 -104 88 -94 78
4667 78 -144 29 -38 276 163 26 106 -34 247 98 24 -40 -17 -136 52 -264 -189 98 -20 -53 -72 -383 16
4690 16 -107 -154 -114 -95 -134 31 -234 -78 -177 -6 -56 -94 -58 194 157 55 327 -4 177 38 250 274 -129 320
4714 320 30 -82 -156 151 -175 59 -271 -84 201 241 -134 -142 -116 73 -108 -88 -88 -140 52 -32 29 -105 168 41
4738 41 122 -13 -12 -22 -202 201 -360 -68 -123 20 217 126 -344 -50 -98 -109 -22 -218 95 -231 72 91 -182 12
4762 12 -9 -24 73 -63 -17 258 -263 251 276 -93 272 176 43 127 -250 -174 129 -119 -219 -42 -101 -63 -29 -162
4786 -162 -9 -177 -272 225 -191 -67 16 66 178 -50 33 247 154 64 3 -53 78 144 -12 32 -286 35 -256
4809 -256 -23 -63 92 -292 94 -316 -175 -186 -23 2 -73 -99 -44 -75 -168 257 125 6 136 124 155 56 54 136 145
4834 145 288 93 -6 -203 -125 23 -77 -5 245 -4 -122 135 -44 -142 258 -146 -182 -9 -177 -68 -58 60
4856 60 185 -121 -190 24 101 -89 243 76 6 -124 307 162 -106 -43 -47 -149 37 -172 -251 33 -231 -108 137
4879 137 -252 -23 -206 -252 94 -139 -219 -46 -197 245 -44 -63 -116 109 42 -48 108 163 92 -264 208 267 -119
4902 -119 -19 -192 124 -48 -48 97 -117 -72 -12 -242 -35 -170 -54 231 50 30 -87 -99 108 -138 113 74
4924 74 241 -12 -3 99 4 38 -59 6 -16 104 107 -17 117 -28 -56 -108 -116 215 -23 -268 -259 28 -115 42 -177
4949 -177 -69 120 -34 -126 170 -116 107 108 -15 -37 -2 22 260 -49 9 109 -235 45 -23 -43 -56 -167 -220 -86
4973 -86 -74 -62 37 7 -109 -23 -155 295 21 142 29 -118 44 -45 63 200 -136 194 134 58 55 170 -41 -31
4997 -31 -145 -100 209 -11 234 79 -23 22 -350 -252 -58 -181 -97 52 -109 19 105 9 -35 -121 316 116 9
5020 9 145 154 -151 317 -111 -14 47 -44 -183 134 245 72 -100 185 -69 -66 -63 292 -141 107 43 -129 166 -69
5044 -69 172 58 -179 -65 -1 -68 212 -132 202 198 -144 250 156 -63 -59 -12 -117 392 -242 -35 -28 28 144 -14
5068 -14 130 -40 -90 -207 69 5 39 -154 145 9 199 227 -133 63 87 105 -1 -37 67 137 106 31 -219 17
5092 17 28 -103 -56 64 -59 -42 101 -216 -5 96 -149 166 47 -292 -82 -62 -189 131 83 6 -97 -143 -16
5115 -16 -172 -176 312 103 2 82 -150 104 109 -57 50 80 -349 233 -62 123 52 -114 -235 -190 -101 -81 13 77
5139 77 -39 1 -33 -59 -226 -50 -69 175 -189 93 70 27 -82 115 -318 27 211 -90 330 -156 -45 -30 -157
5162 -157 21 32 -110 -232 -120 -108 52 -59 -55 97 -122 311 231 127 178 20 65 59 -13 97 -4 110 274
5185 274 -192 -200 47 -177 -65 116 49 85 102 51 -4 -20 -148 -4 61 10 182 -135 3 -7 -155 61 139 -71
5209 -71 -97 194 84 395 334 252 20 -119 91 -134 201 163 20 -35 -211 28 2 -58 93 -215 -81 103 -63
5232 -63 137 159 101 28 -64 -25 -16 75 140 70 75 6 -75 218 155 185 167 206 -314 21 356 -125 26 -44 -234 -10 -208
5259 -208 -3 42 -201 124 -319 -162 -106 -133 200 -36 91 336 -99 -24 96 -101 297 334 72 233 132 124
5281 124 160 -99 -134 -58 172 -266 9 -257 -16 -112 -33 -70 -134 -175 -206 130 100 -102 -4 65 105 119 30 3 219
5306 219 168 -138 92 -22 100 99 69 -376 111 -69 61 -6 -311 -234 -37 163 -233 -89 65 -143 -199 102
5328 102 -90 99 58 40 -62 231 49 55 -111 3 108 -83 146 -40 -103 -107 21 91 -128 -94 7 -64 -109 74
5352 74 -101 118 15 8 -248 208 159 78 -46 219 -18 61 258 200 -55 238 -57 173 -104 -5 -31 -126 -89 90
5376 90 -130 -31 287 -280 135 -27 -37 -84 -65 -107 -52 -29 -31 -149 16 16 124 -77 187 156 -114 -275 93 60 -80
5401 -80 -81 -164 186 76 250 -25 -61 194 -23 3 -22 235 235 161 -5 -103 14 -63 109 17 77 -86 96 -246 355
5426 355 -89 142 162 23 329 79 17 75 38 125 -68 88 167 120 -173 68 25 102 106 -40 -67 -47 2 -107 -75
5451 -75 -130 -232 -66 186 -253 116 50 215 171 -43 163 215 -108 372 4 107 -54 -90 -104 343 -84 43
5473 43 -183 -263 29 -262 -248 -150 -204 158 -128 -259 21 -135 -31 173 -235 76 404 -25 -101 -183 238 60
5495 60 -147 -183 28 -59 -40 150 -72 35 67 -5 -106 20 -173 -140 -142 -35 -67 -55 -215 -158 -37 136 142 149 175 202
5521 202 375 -52 233 -176 80 138 25 40 -132 -170 -116 -19 -49 169 -77 -119 -211 148 -78 78 -195 -6 -217
5544 -217 23 138 -151 45 -58 140 49 22 -33 -124 -54 -174 -17 -18 133 201 -163 91 -158 27 -218 -38 -163
5567 -163 48 -60 -71 -109 -140 74 -49 -194 -8 -92 -46 133 77 -109 -184 -90 -80 64 106 82 77 395 164 220 -4
5592 -4 -63 -153 -120 -13 -42 -140 210 -58 -44 -100 -6 -94 16 -310 -84 -51 19 -68 -164 -17 34 -84 62 -31 -156 270
5618 270 -47 -149 249 52 150 189 -120 11 -210 80 103 -171 17 72 8 267 -120 -298 42 -11 47 35 20
5641 20 -88 -3 143 97 187 -69 36 18 260 -102 154 108 109 36 -28 -68 137 -7 74 421 20 -27 82 -220
5665 -220 -77 95 -38 91 -19 252 -121 12 -86 47 -75 -115 212 75 188 -123 84 -210 -110 -21 69
5686 69 -152 61 -42 15 171 -274 -98 -45 -30 39 75 -140 69 -370 -34 123 -108 97 -160 -63 78 -54
5708 -54 76 -104 -27 79 -124 40 2 -127 -60 196 224 -38 202 116 143 104 6 91 -160 37 91 -125 -61 -40
5732 -40 6 -208 33 -162 -30 0 50 -127 -193 45 103 -8 115 -2 -174 237 154 -53 70 67 21 -50 9 33
5756 33 150 47 -290 -106 -38 -266 48 246 -163 61 168 118 94 -44 -60 19 -25 331 -11 119 205 222 41
5779 41 -124 25 90 -79 86 272 13 -80 232 0 -63 -18 64 -23 212 -213 169 -181 159 -66 -123 -161 74
5802 74 -233 -219 388 288 347 -31 56 135 -77 32 189 25 152 29 -56 41 -114 -49 117 -156 -99 49 -73
5825 -73 -213 -239 -88 69 -185 162 -202 291 67 -66 -28 -8 36 104 -52 12 80 146 216 162 -123 152 8 43
5849 43 -162 -165 -19 70 6 152 -7 -202 192 -118 -74 142 228 -154 89 -13 -162 5 1 -5 -148 -70 -104 -171 -20
5874 -20 -73 180 -90 55 -97 215 -89 164 -339 112 -26 -160 -346 14 -26 -1 -197 100 -8 -103 22 -141
5896 -141 116 239 -122 -194 -29 324 86 -49 164 -153 -55 61 -89 -144 -106 253 -31 -8 247 -225 50 -59
5918 -59 -91 41 80 -65 134 29 -140 -219 76 -66 30 -139 -24 214 151 116 -271 -69 -60 5 -179 -26 163
5941 163 -125 -163 112 -247 -29 60 267 -24 -94 -166 101 -119 228 110 -89 287 -128 20 40 -74 -149 -151 55
5964 55 57 157 7 -33 128 -11 154 -67 171 73 154 132 -11 98 -3 25 22 -7 -29 99 55 -54 91 -140
5988 -140 49 -66 74 11 -84 -130 68 -97 -175 -132 -202 59 120 63 33 115 60 140 -99 -58 -58 214 -37 61 13 -171
6014 -171 -50 -306 -10 -51 16 -12 27 -128 -130 -327 -375 145 3 73 -71 198 41 -87 7 92 -44 -6 -54 101
6038 101 -159 41 -43 -6 108 86 5 36 247 -185 -277 84 -11 28 -10 -193 -149 102 -55 -120 -15 143 -146 -100
6062 -100 50 -9 -39 23 -26 -63 -97 -10 69 18 -21 151 -105 -12 -157 52 84 117 -56 143 -138 -118 -61 -190 117
6087 117 73 153 -192 -128 100 -56 -31 -46 -120 -257 -108 144 100 -8 -314 121 9 -97 -53 -143 83 -170 -121
6110 -121 211 58 15 -31 24 -88 -20 124 -89 -108 62 247 117 -75 149 9 114 410 -98 -136 213 36
6132 36 26 19 -82 2 -8 10 48 -30 26 174 -152 -70 -145 54 -108 -150 147 16 99 123 9 -63 8 66 56 186
6158 186 150 -48 89 -80 -94 -73 14 6 121 82 -35 17 47 -197 38 196 86 -34 -100 68 114 -3 -69 -211
6182 -211 -75 -47 27 -31 127 134 -56 -131 90 134 -10 74 195 163 206 70 -119 236 -142 109 73 -206 -126 -169
6206 -169 -58 242 158 125 -30 204 26 -42 -140 69 101 154 42 24 -44 164 -151 117 -202 -26 94 334 19
6229 19 -12 -30 -163 35 -91 74 -51 -65 11 -216 -14 -134 -116 74 -99 47 -37 -122 112 175 68 -8 5 -56
6253 -56 178 69 7 -250 28 -198 -128 -91 56 82 -96 -92 -57 103 -83 141 -37 102 71 282 -19 -110 150
6276 150 -42 -85 -134 241 -79 10 177 21 -149 162 183 57 -87 24 -12 -82 -52 208 9 53 69 -21 58 -43
6300 -43 -55 -242 -188 90 201 -55 7 58 116 102 -204 -123 -144 3 170 -91 251 -160 193 -52 26 261 183 -41
6324 -41 -84 91 142 -41 91 -67 -41 267 -39 86 54 40 128 13 13 49 74 -82 201 77 42 -76 32 143
6348 143 74 283 43 -120 219 -12 101 102 -33 75 97 -25 -57 102 -191 -86 38 50 71 55 84 31 -214
6371 -214 -227 149 -8 -12 42 172 258 91 256 -102 113 354 -46 163 105 -134 49 74 -134 -5 161 -50
6393 -50 -55 -6 95 -96 -51 -80 -184 15 -21 -71 44 70 -164 90 -110 41 144 -81 121 -64 -328 -185 47
6416 47 343 -60 -20 181 395 -106 3 70 67 -18 -200 -171 -236 -57 72 177 -138 40 117 -124 -32 -174 42
6439 42 -13 14 -163 128 160 156 -159 -70 14 92 24 -260 -38 -283 -65 -132 144 1 82 132 -17 35 5 3 -261 -87
6465 -87 138 18 -12 148 -199 -81 253 -47 -34 107 -68 30 66 -74 -31 -56 300 -148 54 66 -106 -125 354
6488 354 9 -111 -125 87 -30 -159 76 -167 -104 -196 -234 201 94 385 -137 177 -82 108 165 -102 17 -151
6510 -151 6 29 -137 -130 34 -214 81 -63 -105 -90 109 18 -55 -151 39 102 -234 -236 28 -195 234 121 81 224
6534 224 135 -310 -12 -173 125 132 -127 -35 18 62 56 95 57 81 102 94 -190 0 146 40 5 19 54 -164 -156 -139 -75
6561 -75 147 -16 111 -91 198 -18 140 32 -75 120 2 -135 25 42 40 62 -45 -122 -77 -59 -136 -86 -56 47
6585 47 -192 -16 151 70 -63 -150 54 81 -179 46 86 131 -170 -146 -89 -15 86 54 47 -206 104 29 -36 -235 15
6610 15 -79 -6 -159 -93 -91 -79 -209 -162 -59 131 181 81 41 -180 -67 -97 121 173 -15 77 252 -19 249 108
6634 108 33 -7 -146 67 -133 104 -6 -26 203 14 -258 -9 67 9 -50 100 182 -30 -308 -51 -212 -28
6656 -28 -83 -94 -371 146 -81 133 87 -76 101 119 -19 69 -110 230 -37 -42 198 233 -150 155 61 249 -231
6679 -231 -10 102 -76 -221 -45 261 -122 134 -1 53 143 262 0 -229 263 134 -173 1 127 -57 29
6700 29 -97 -75 -29 -98 132 45 81 53 28 141 60 -243 221 25 -249 220 -70 175 -155 -17 103 33 29 -28
6724 -28 253 86 16 232 136 -73 110 -173 -106 -72 137 194 172 116 144 52 -145 8 -8 15 -220 -7 54 31 56
6749 56 -192 -207 118 163 -47 -1 51 -119 56 272 116 175 -19 1 -96 123 -67 -411 148 149 312 -168 -27
6772 -27 -273 219 49 217 -227 -291 -176 367 85 38 326 -110 -129 264 132 -110 -37 -6 -38 39 -12 -12 -178 -59
6796 -59 8 -270 -45 -94 -29 42 -116 -137 -95 58 -262 -36 -119 -37 29 21 191 57 9 95 -74 145 102 -101 111
6821 111 -14 15 229 131 287 135 -258 59 -73 -83 -262 61 158 -64 30 -110 -137 -9 -131 -223 -32 151
6843 151 -31 -18 107 53 108 117 -44 218 -165 20 282 -22 -105 83 104 -25 -123 178 -150 64 48 -161 -138
6866 -138 -261 -109 44 40 -65 156 135 17 2 137 195 -100 55 -99 -26 139 69 10 -199 109 228 -47 -115
6889 -115 -53 -45 171 -196 19 40 -156 44 -265 -180 -47 86 69 42 130 126 -39 122 -108 -105 212 -16 112 377
6913 377 30 174 -76 170 -180 147 0 -31 58 161 -8 110 254 -63 -242 -52 -141 7 -4 46 78 49
6935 49 29 -72 -176 -59 -120 79 15 82 221 -116 134 83 83 5 53 75 -128 -91 89 -63 59 351 71 -83
6959 -83 76 383 115 7 -112 37 127 -208 -58 50 131 -88 126 56 43 -13 142 23 -61 -20 36 -28 -54 17
6983 17 -166 -43 31 14 -113 -27 167 31 -112 -135 65 -30 -196 -44 -89 85 56 -130 -190 183 -85 -290 161
7006 161 200 233 163 -165 -140 105 215 35 52 -7 399 -72 -211 -78 282 133 -87 -247 -57 -131 32 90 109
7029 109 -137 88 78 233 -23 -61 246 53 29 194 -113 229 -55 21 25 -72 -36 62 267 -43 -109 -108 -99 39 -184
7054 -184 -282 4 -184 170 -48 23 13 -33 224 99 -73 73 -81 184 -87 -42 134 46 250 -146 -11 84
7076 84 -37 -179 -16 143 -230 274 -56 4 -84 238 -53 122 -77 -117 109 -266 -43 65 149 34 -162 106
7098 106 25 -272 -219 -16 -7 -82 -88 19 207 -15 -205 85 129 145 62 -146 52 29 -125 305 70 -187 174 -212
7122 -212 14 165 -200 -165 -220 -104 -62 -30 24 93 87 7 84 181 -1 246 -245 -211 -69 -156 95 -164 20 116 128
7147 128 133 -119 -40 -108 143 -11 51 37 52 -83 43 -46 -70 43 25 -36 -43 174 22 -211 -377 6 3 136 24
7172 24 181 12 124 171 -5 -31 123 51 -170 -222 -71 -7 -45 -60 120 -194 -248 16 -19 87 -272 43 -63
7195 -63 -72 -81 -119 113 289 159 17 127 207 29 -124 186 13 128 -11 -13 193 -69 -162 -2 -111 43 67 326
7219 326 -155 113 66 -14 -10 -208 162 118 -89 323 27 144 123 103 26 -91 -23 -135 156 192 -113 -83 -100 68
7243 68 52 235 41 -150 55 -66 39 -46 -127 -47 -51 23 -96 -41 -115 -88 67 16 136 27 236 219 -198 -31
7267 -31 10 -10 -104 115 -49 -135 33 17 338 -57 37 -190 -16 -191 -190 -244 71 -27 -43 147 39 81 -78 71
7291 71 -207 50 39 201 80 -108 160 220 -69 -86 -111 172 132 -192 246 -61 150 -79 -168 -6 -106 25
7313 25 60 260 136 170 -80 -70 -23 241 -90 257 -176 48 14 -145 241 -38 -216 93 116 151 -64 60 -21
7336 -21 33 -75 135 -180 -192 142 182 37 62 -5 -195 130 -91 67 -9 89 -54 -58 -13 246 -12 160 122 15
7360 15 -105 45 83 -46 -102 -166 56 7 -89 0 -1 -82 144 -186 192 0 -169 5 -121 -102 161 -78 192 33
7384 33 -21 128 92 8 64 362 -72 45 168 113 -143 73 -111 -14 -92 0 212 247 35 -183 91 88 -284 -100
7408 -100 77 104 -126 -294 -130 -170 86 -85 76 -73 -38 96 13 67 124 51 -136 25 55 99 -66 8 -81 -59
7432 -59 32 104 71 -8 -133 180 101 -178 -251 309 -19 151 193 -77 -96 -56 156 -9 28 -39 -5 1 -45 10 192 -61
7458 -61 -77 151 -120 -8 170 87 54 -188 -21 108 -45 -258 -157 141 46 -195 158 -18 -56 -54 -80 -211 230
7481 230 -50 228 163 -240 190 -62 -131 -16 -238 110 -42 24 234 19 -227 -121 -27 170 13 5 34 45 7
7504 7 33 -104 64 -109 -270 87 -223 41 263 -295 27 -2 -79 219 9 375 68 -198 81 -52 -53 -100 -183
7527 -183 36 -66 -200 -264 -118 95 52 48 -62 -8 72 -31 -32 -236 -176 153 45 186 12 -7 79 115 -61 -207
7551 -207 214 -100 -71 25 87 -17 -12 -2 47 103 92 -32 -133 110 70 7 -141 -70 -16 -107 -131 59 -94 86 77 -11
7577 -11 303 -65 30 -53 64 48 194 -79 95 222 48 114 -187 -190 74 -91 -154 114 181 -72 20 -15 35 97
7601 97 -182 -87 87 37 -90 69 -74 -62 423 135 293 107 14 -290 66 23 -59 99 20 48 -115 43 50 -1
7625 -1 36 -41 -32 181 0 39 -23 70 -3 218 59 7 -6 -125 361 298 -159 112 -188 -39 63 182 -64 -47 34
7650 34 -301 203 51 131 -8 132 -37 -57 246 163 94 -122 8 -158 -1 -29 -29 46 -12 -43 72 201 3 -45
7674 -45 -117 66 -260 102 -137 -66 100 -75 -15 -47 -106 -216 258 256 -351 64 157 -119 -103 142 161 67 -104 111
7698 111 115 -104 -20 125 -3 -35 54 -62 -45 -78 178 -130 84 215 -2 19 121 -19 -55 80 -65 -190 -14
7721 -14 40 191 -108 83 111 -292 -35 16 -4 49 101 -90 -115 -7 284 -5 -22 129 -159 42 85 -104 -318
7744 -318 -74 -63 -175 -189 -19 -26 214 -45 238 -223 214 189 -25 -47 141 -183 38 111 -119 -21 165 291 -95
7767 -95 77 -299 183 59 13 83 -69 76 199 -117 -200 139 -73 -97 -268 -100 -147 -292 27 53 9 35 117
7790 117 -15 123 -34 28 222 -64 -83 31 103 56 -311 -37 106 -122 -138 68 -33 -74 32 164 -105 151
7812 151 118 145 106 -210 -45 -266 -18 119 -73 42 -82 126 -9 243 157 295 44 119 211 -35 131 22
7834 22 -150 -209 212 -49 295 38 13 -139 138 206 -231 -293 -156 30 57 -19 141 31 -281 115 -71 221
7856 221 -36 75 -320 -202 30 226 -23 -37 50 -208 83 56 -82 98 -330 59 48 -87 -100 116 156 122
7878 122 -80 174 -65 158 32 71 135 62 -36 -166 -132 -64 238 -237 81 111 -342 -39 190 -65 -120 -28 148
7901 148 -98 2 -77 -235 -121 -152 -14 41 -143 -36 -68 -106 346 -36 25 -16 -66 108 -118 76 37 59 175
7924 175 14 158 34 20 110 -91 87 291 -22 27 99 138 52 -261 -43 28 97 4 77 -162 -16 -197 272
7947 272 -153 -158 -49 76 153 33 137 -18 -12 -13 240 -189 39 -16 246 -194 -302 125 -61 -18 166 168 168 -185
7971 -185 -313 144 266 -82 394 -71 -86 -127 69 67 -109 -7 107 43 292 64 -8 -18 -204 -59 -167 -200 -59
7994 -59 54 -284 97 142 52 -222 -188 56 -194 -90 -150 62 62 80 340 56 -60 0 -100 179 -13 61 -33 124
8018 124 110 25 -17 170 -3 -324 87 18 122 27 -34 -182 -101 -178 -22 -71 352 194 -183 67 75 -77 -142 -178
8042 -178 303 -178 -229 -21 -188 126 83 -51 113 142 65 -153 7 -49 166 130 -49 -215 12 -189 -128 -25
8064 -25 29 32 52 209 -186 -19 12 -239 -80 -29 327 131 47 -47 -39 142 35 30 88 29 107 -104 -1 79 -128 -87
8090 -87 -121 -198 -64 91 -286 -277 -135 -273 115 -56 -132 68 -366 -168 104 -140 50 -135 72 61 30 -53 -179
8113 -179 171 42 194 99 209 22 59 -294 306 13 -185 -116 -70 52 -148 33 1 4 240 57 -42 74 -151
8136 -151 18 -21 13 205 -204 26 -7 76 216 -16 35 -72 220 24 -207 -347 -114 -72 -147 293 158 73 141
8159 141 2 70 -136 75 55 246 223 54 -104 -82 8 -13 110 -39 -357 169 1 1 -162 107 19 269 -28
8182 -28 -134 -10 -293 13 -96 143 -30 138 -126
8191a26
##END NTUPLES=NMR FID
##END=
