##TITLE=1H_Pr Q-C4
 CDCl3,8 sc, 
 23.9.2021
##JCAMPDX= 6.0         $$ Bruker NMR JCAMP-DX V2.0
##DATA TYPE= NMR FID
##DATA CLASS= NTUPLES
##ORIGIN= UXNMR, Bruker Analytische Messtechnik GmbH
##OWNER= root
$$ XWIN-NMR		Version 3.5
$$ Thu Sep 23 13:31:32 2021 Russian Standard Time (UT+4h)  she@DPX200
##.OBSERVE FREQUENCY= 200.1314
##.OBSERVE NUCLEUS= ^1H
##.DELAY= (6, 6)
##.ACQUISITION MODE= SIMULTANEOUS
##.ACQUISITION SCHEME= undefined
##.AVERAGES= 8
##.DIGITISER RES= 18
##SPECTROMETER/DATA SYSTEM= spect
##.PULSE SEQUENCE= zg30
##.SOLVENT NAME= CDCl3
##.SHIFT REFERENCE= (INTERNAL, CDCl3, 0, 15.7039)
##AUDIT TRAIL= $$ (NUMBER, WHEN, WHO, WHERE, WHAT)
$$ ##TITLE= Audit trail, XWIN-NMR		Version 3.5
$$ ##JCAMPDX= 5.01
$$ ##ORIGIN= Bruker BioSpin GmbH
$$ ##OWNER= she
$$ F:/spectra/data/she/nmr/H-F/1/audita.txt
$$ ##AUDIT TRAIL=  $$ (NUMBER, WHEN, WHO, WHERE, WHAT)
(   1,<2021-09-23 13:30:01.40 +0400>,<she>,<DPX200>,
      <created by zg, POWCHK disabled, PULCHK disabled
       configuration hash MD5:
       00 E9 B6 7A A2 85 ED C7 34 08 36 98 17 FE 4E 26
       data hash MD5: 16K
       CF 17 15 26 48 F3 08 F0 87 AB 11 81 0B D0 54 19>)
$$ ##END=
$$ 
$$ hash MD5
$$ B8 AA C8 66 50 A8 15 8E 8D 95 74 23 09 2C C6 31
##$RELAX= 
##$RELAX= 
##$RELAX= 
##$RELAX= 
##$RELAX= 
##$RELAX= 
$$ Bruker specific parameters
$$ --------------------------
##$DU= <F:/spectra>
##$EXPNO= 1
##$NAME= <H-F>
##$PROCNO= 1
##$TYPE= <nmr>
##$USER= <she>
##$AMP= (0..31)
100 100 100 100 100 100 100 100 100 100 100 100 100 100 100 100 100 100 
100 100 100 100 100 100 100 100 100 100 100 100 100 100 
##$AQSEQ= 0
##$AQ_mod= 1
##$AUNM= <au_zg>
##$AUTOPOS= <>
##$BF1= 200.13
##$BF2= 200.13
##$BF3= 200.13
##$BF4= 200.13
##$BF5= 200.13
##$BF6= 200.13
##$BF7= 200.13
##$BF8= 200.13
##$BYTORDA= 1
##$CFDGTYP= 0
##$CFRGTYP= 5
##$CHEMSTR= <none>
##$CNST= (0..31)
1 1 145 1 1 1 1 1 1 1 1 1 1 1 1 1 1 1 1 1 1 1 1 1 1 1 1 1 1 1 1 1 
##$CPDPRG= <>
##$CPDPRG1= <>
##$CPDPRG2= <>
##$CPDPRG3= <>
##$CPDPRG4= <mlev>
##$CPDPRG5= <mlev>
##$CPDPRG6= <mlev>
##$CPDPRG7= <mlev>
##$CPDPRG8= <mlev>
##$CPDPRGB= <>
##$CPDPRGT= <>
##$D= (0..31)
0 1.2 0 0 0 0 0 0 0 0.06 0 0.03 0 0 0 0 0.0002 0 0 0 0 0 0 0 0 0 0 0 0 
0 0 0 
##$DATE= 1632389400
##$DBL= (0..7)
120 120 120 120 120 120 120 120 
##$DBP= (0..7)
150 150 150 150 150 150 150 150 
##$DBP07= 0
##$DBPNAM0= <>
##$DBPNAM1= <>
##$DBPNAM2= <>
##$DBPNAM3= <>
##$DBPNAM4= <>
##$DBPNAM5= <>
##$DBPNAM6= <>
##$DBPNAM7= <>
##$DBPOAL= (0..7)
0.5 0.5 0.5 0.5 0.5 0.5 0.5 0.5 
##$DBPOFFS= (0..7)
0 0 0 0 0 0 0 0 
##$DE= 6
##$DECBNUC= <off>
##$DECIM= 32
##$DECNUC= <off>
##$DECSTAT= 4
##$DIGMOD= 1
##$DIGTYP= 9
##$DL= (0..7)
0 120 120 120 120 120 120 120 
##$DP= (0..7)
150 150 150 150 150 150 150 150 
##$DP07= 0
##$DPNAME0= <>
##$DPNAME1= <>
##$DPNAME2= <>
##$DPNAME3= <>
##$DPNAME4= <>
##$DPNAME5= <>
##$DPNAME6= <>
##$DPNAME7= <>
##$DPOAL= (0..7)
0.5 0.5 0.5 0.5 0.5 0.5 0.5 0.5 
##$DPOFFS= (0..7)
0 0 0 0 0 0 0 0 
##$DQDMODE= 0
##$DR= 18
##$DS= 0
##$DSLIST= <SSSSSSSSSSSSSSS>
$$ [...]
##$SUBNAM2= <"">
##$SUBNAM3= <"">
##$SUBNAM4= <"">
##$SUBNAM5= <"">
##$SUBNAM6= <"">
##$SUBNAM7= <"">
##$SUBNAM8= <"">
##$SUBNAM9= <"">
##$SW= 20.0188988654967
##$SWIBOX= (0..15)
0 0 2 0 0 0 0 0 0 0 0 0 0 0 0 0 
##$SW_h= 4006.41025641026
##$TD= 16384
##$TD0= 1
##$TE= 0
##$TE2= 300
##$TE3= 300
##$TEG= 300
##$TL= (0..7)
0 120 120 120 120 120 120 120 
##$TP= (0..7)
150 150 150 150 150 150 150 150 
##$TP07= 0
##$TPNAME0= <>
##$TPNAME1= <>
##$TPNAME2= <>
##$TPNAME3= <>
##$TPNAME4= <>
##$TPNAME5= <>
##$TPNAME6= <>
##$TPNAME7= <>
##$TPOAL= (0..7)
0.5 0.5 0.5 0.5 0.5 0.5 0.5 0.5 
##$TPOFFS= (0..7)
0 0 0 0 0 0 0 0 
##$TUNHIN= 0
##$TUNHOUT= 0
##$TUNXOUT= 0
##$USERA1= <user>
##$USERA2= <user>
##$USERA3= <user>
##$USERA4= <user>
##$USERA5= <user>
##$V9= 5
##$VALIST= <valist>
##$VCLIST= <CCCCCCCCCCCCCCC>
##$VD= 0
##$VDLIST= <DDDDDDDDDDDDDDD>
##$VPLIST= <PPPPPPPPPPPPPPP>
##$VTLIST= <TTTTTTTTTTTTTTT>
##$WBST= 1024
##$WBSW= 4
##$XGAIN= (0..3)
0 0 0 0 
##$XL= 0
##$YL= 0
##$YMAX_a= 72450
##$YMIN_a= -116054
##$ZGOPTNS= <>
##$ZL1= 120
##$ZL2= 120
##$ZL3= 120
##$ZL4= 120
##$ABSF1= 10
##$ABSF2= 0
##$ABSG= 5
##$ABSL= 3
##$ALPHA= 0
##$AQORDER= 0
##$ASSFAC= 0
##$ASSFACI= 0
##$ASSFACX= 0
##$ASSWID= 0
##$AUNMP= <proc_1d>
##$AZFE= 0.1
##$AZFW= 0.1
##$BCFW= 1
##$BC_mod= 2
##$BYTORDP= 1
##$COROFFS= 0
##$CY= 11.3945322036743
##$DATMOD= 1
##$DC= 2
##$DFILT= <>
##$DTYPP= 0
##$F1P= 2.36226072786647
##$F2P= -0.459571619588291
##$FCOR= 0.5
##$FTSIZE= 0
##$FT_mod= 4
##$GAMMA= 1
##$GB= 0.15
##$INTBC= 1
##$INTSCL= 1
##$ISEN= 128
##$LB= 0.24
##$LEV0= 0
##$LPBIN= 0
##$MAXI= 10000
##$MC2= 0
##$MEAN= 0
##$ME_mod= 0
##$MI= 1.114404
##$NCOEF= 0
##$NC_proc= 0
##$NLEV= 6
##$NOISF1= 3.799351
##$NOISF2= 2.8
##$NSP= 1
##$NTH_PI= 0
##$NZP= 0
##$OFFSET= 15.70392
##$PC= 1
##$PHC0= -14074.3
##$PHC1= 10.60088
##$PH_mod= 1
##$PKNL= yes
##$PPARMOD= 0
##$PSCAL= 0
##$PSIGN= 0
##$REVERSE= no
##$SF= 200.130013532006
##$SI= 16384
##$SIGF1= 3
##$SIGF2= 2
##$SINO= 400
##$SIOLD= 16384
##$SREGLST= <1H.CDCl3>
##$SSB= 0
##$STSI= 0
##$STSR= 0
##$SW_p= 3612.71676300578
##$SYMM= 0
##$S_DEV= 0
##$TDeff= 0
##$TDoff= 0
##$TI= <>
##$TILT= no
##$TM1= 0
##$TM2= 0
##$TOPLEV= 0
##$USERP1= <user>
##$USERP2= <user>
##$USERP3= <user>
##$USERP4= <user>
##$USERP5= <user>
##$WDW= 1
##$XDIM= 8192
##$YMAX_p= 0
##$YMIN_p= 0
$$ End of Bruker specific parameters
$$ ---------------------------------
##NTUPLES= NMR FID
##VAR_NAME=  TIME,          FID/REAL,        FID/IMAG
##SYMBOL=    X,             R,               I
##VAR_TYPE=  INDEPENDENT,   DEPENDENT,       DEPENDENT
##VAR_FORM=  AFFN,          ASDF,            ASDF
##VAR_DIM=   8192,          8192,            8192
##UNITS=     SECONDS,       ARBITRARY UNITS, ARBITRARY UNITS
##FACTOR=    0.0002496,     1,               1
##FIRST=     0,             0,               0
##LAST=      2.0444736,     0,               0
##MIN=       0,             -116054,         0
##MAX=       2.0444736,     72450,           0
$$ Real data points
##PAGE= N=1
##DATA TABLE= (X++(R..R)), XYDATA
$$ [...]
$$ plain form
1920 -359 -123 84 -623 302 -61 -586 96 -247 -606 130 -254 -201 -42 -579 -262 -25 -309 51 200 -481
1940 -481 -12 14 -527 61 186 -377 240 189 -510 259 -103 -244 452 148 -16 607 -18 -36 708 -174 209
1961 209 570 -236 283 316 -89 613 419 -187 519 194 -245 750 42 -353 710 -300 -521 296 -75 -480
1981 -480 428 -409 -47 99 -657 -69 31 -583 -336 -105 -806 94 -537 -507 68 -445 -454 -17 -384 -369 -26
2002 -26 -275 -187 195 -146 94 56 -264 11 616 -404 144 160 -375 712 -197 -283 211 71 -303 554 267
2023 267 -59 717 188 124 867 -124 138 443 104 402 538 -46 314 397 -125 391 -46 -357 490 -160 -122
2044 -122 181 -324 -238 25 -483 -279 287 -413 -134 406 -440 -145 -152 -492 -245 -156 -641 386 -140 -600 145
2065 145 -211 -426 334 -232 -338 128 -391 -188 408 -208 146 351 -476 13 72 -351 244 335 56 742 279
$$ packed form
1920c59K36K07p07R25l63n25O82l43l59P36l84N3J59n37L17K37k84L60J49o81
1940d81M69K6n41N88J25n63O17n1o99P69l62j41O96l04j64O23o25j8P44q82L83
1961B09L61q06N19L3m05P02j94o06P06l25m39R95p08l95J063j010k21Q17l71m05
1981d80R08q37L62J46p56N88J00o14K47K31p01R00o31L0N75n13rM37l67J5L43
2002b6k49Q8L82l41K40l8l20K75O05j020N48J6n35J087r09q6M94j40l74Q57k87
2023B67l26P76n29o4P43r91K62L05l39K98J36n84L60Q3n22N16m37l11Q47o50L8
2044a22L03n05Q6K63n08K04N66p00K79N40q46K95pl40K47Q9m85J027n26m60P45
2065A45l56k15P60n66j06M66n19K03N96o16L54K05q27M89N9m23N95R1k79O86m63
$$ plain form
2086 279 -169 400 406 -58 473 104 242 454 11 177 668 -226 221 575 -100 210 409 -432 170 242 -343
2107 -343 446 99 -267 362 39 -110 67 -111 -154 60 -107 -234 99 -552 -261 -71 -634 -313 -140 -577
2127 -577 -85 87 -170 -185 -246 -249 -67 -147 -366 244 -283 -364 234 -228 -283 199 -130 -258 510 -234 356 321 -78
2150 -78 259 266 -440 326 244 47 610 344 29 429 391 -225 194 -186 197 621 -158 103 708 -271 291 233
2172 233 -129 200 80 -350 342 -95 -342 120 -278 -437 -190 -196 -265 223 -299 -99 14 -490 -412 -231 -459
2193 -459 -294 48 -502 238 170 -506 34 -1 -631 304 -150 -213 179 -127 -243 267 -224 25 482 -373 158
2214 158 580 -230 227 678 -369 667 279 -353 512 275 -32 435 329 -83 433 95 -186 420 -417
2233 -417 37 312 -309 -14 516 -486 70 374 -402 257 -68 -555 -92 105 -234 125 -319 -215 246 -16
$$ packed form
2086B79m48N69Om64N31l69J38K12m43J66M91q94M47L54o75L10J99q41O02P2n85
2107c43P89l47l66O29l23j49J77j78m3K14j67j27L33o51K91J90n63L21J73m37
2127e77M92J72k57j5o1lJ82q0k19O10n27q1N98m62n5M82l29j28P68p44N90l5l99
2150g8L37Pp06P66q2j97N63k66l15M00l8o16M19l80L83M24p79K61O05r79N62n8
2172B33l62L29j20m30O92m37k47M62l98j59K47oo9M88n22K00J13n04P8J81k28
2193d59J65L42n50P40o8o76N40l5o30R35m54o3L92l06j16N10m91K49M57q55N31
2214A58M22q10M57M51j047J036l88o32Q65k37l07M67j06m12N16l38k81O06q37
2233d17M54K75o21K95N30j002N56L04p76O59l25m87M63J97l39L59m44J04M61k62
$$ plain form
2253 -16 -366 195 -474 -606 48 -644 -177 -171 -243 -59 -30 -283 389 7 -332 30 -135 -203 567 -159 -86 78
2275 78 -254 42 129 -147 -216 200 -104 192 257 56 180 -10 -165 279 430 -226 259 283 -3 397 88 -452
2297 -452 268 124 -36 273 -50 -285 391 -360 4 234 -311 -117 89 -518 -47 -42 -342 -23 -142 -365 104
2318 104 -144 -346 292 -345 -202 109 -320 -302 196 -93 -206 -205 -285 -36 -203 -197 -8 121 -410 187 176 -421
2340 -421 275 -97 58 614 293 35 500 -196 -80 329 101 -33 229 -129 195 198 -213 278 239 -78 284
2361 284 53 -76 509 217 -274 191 99 -444 249 -248 -41 57 -149 17 -15 -211 -142 93 -376 156 -36
2382 -36 -387 4 81 -530 372 -142 -263 348 -174 -314 135 -179 -123 95 -312 -32 111 -157 10 67 -474
2403 -474 182 102 -319 181 245 -223 165 263 -187 482 47 87 458 -27 345 262 -214 53 454 -187 449 409
$$ packed form
2253a6l50N61o69j32O54o92M67Op2J84K9k53O72l82l39L62j65o8P70p26P3J64
2275G8l32K96Q7k76o9M16l04K96O5k01J24j90j55M44J51o56M85K4k86M00l09n40
2297d52P20j44j60L09l23k35O76p51L64K30n45J94K06o07M71Nl00L19j19k23M69
2318A04k48k02O38o37J43L11m29J8M98k89j13Jq0K49j67OJ89J29n31N97j1n97
2340d21O96l72J55N56l21k58M65o96J16M09k28j34K62l58L24Lm11M91l9l17L62
2361B84k31j29N85k92m91M65r2n43O93m97K07R8k06J66l2j96O9K35m69N32j92
2382c6l51L91P7o11R02n14j21O11n22j40M49l14N6K18m07K80J43k68J67N7n41
2403d74O56q0m21N00O4m68L88R8m50O69m35M0L71m85L72q3m76K67M01o41O36m0
$$ plain form
2425 409 110 232 263 -106 187 93 -185 261 -118 -71 322 -156 -275 105 -222 -374 309 -21 -122 24 -364
2446 -364 -61 -30 -127 76 -262 -507 -196 -145 -359 54 92 -481 276 -133 111 288 -365 -111 300 -243 19
2467 19 468 -332 -286 384 -268 208 78 -155 253 276 -290 569 96 235 309 -2 -75 242 -312 -37 253 -101
2489 -101 -52 428 62 92 142 -14 102 125 -302 209 286 -91 126 -14 -385 167 35 -193 152 -142 -305 144
2511 144 -396 -56 84 -261 25 22 -338 99 -1 -439 180 15 -249 102 -320 -436 8 -78 -191 53 -30
2532 -30 -72 248 -119 72 321 -108 233 9 -70 -156 296 25 327 425 -48 581 -123 21 721 150 44 65
2554 65 -119 78 508 -52 86 228 -207 -30 118 -322 224 47 -308 93 -134 -280 -54 -180 -191 -42 -206
2575 -206 -246 274 -302 -144 345 -58 -201 395 -388 -125 90 -559 75 -7 -701 196 168 -222 120 50 -280
$$ packed form
2425D09k99J22L1l69K93r4k78M46l79M7L93m78j19L80l27j52O83l30j01J46l88
2446c64L03L1r7K03l38k45L11N1k14M13L8n73P57m09K44J77o53K54M11n43K62
2467A9M49q00M6O70o52M76j30k33M08K3n66Q59m73J39P4l11p3L17n54K75K90l54
2489a01M9M80l66L0N0j56J16K3m27N11P7l77K17j40l71N52j32k28L45k94j63M49
2511A44n40L40J40l45K86ll60M37j00m38O19j65k64L51m22j16M44q6j13K44q3
2532c0m2L20l67J91K49m29L41k24p9q6M52k71L02R8m73O29p04J44P00n71j06K1
2554F5j84J97M30n60J38J42m35J77J48m40N46j77l55M01k27j46K26j26j1J49j64
2575b06m0N20n76J58M89m03j43N96p83K63K15o49O34q2o94Q97k8l90L42p0l30
$$ plain form
2596 -280 108 -324 -308 260 -261 -83 269 -91 34 222 -252 245 261 -378 -100 169 -460 256 -108 -75 513
2617 513 367 -36 524 40 80 491 -46 62 499 8 42 115 -249 -139 427 -334 -35 93 -508 96 -32
2638 -32 -215 -36 -19 -322 306 -190 -137 119 108 -330 69 -286 -97 524 -275 -83 28 -274 -86 102 37 227
2660 227 -30 -409 79 -116 22 364 -141 136 114 -233 24 211 -12 301 266 -83 316 113 -98 60 214
2681 214 -94 272 213 -27 158 185 -27 226 -159 -54 211 99 -33 398 -355 -181 296 -320 42 -69 -104
2702 -104 -202 -91 -460 65 -147 -304 -109 -35 -450 235 -112 -269 -100 -140 -82 -109 -230 -105 215 -180 -20 97
2724 97 -109 87 434 -56 244 306 -167 299 -284 -96 306 199 144 155 122 354 417 -166 404 338 91 23 582
2747 582 -94 230 410 -117 95 108 -218 370 82 -347 439 -62 -27 -76 91 193 290 -182 -176 -4 -323 65
$$ packed form
2596b80L88m32J6N68n21J78L52l60J25J88m74M97J6o39K78K69o29P16l64L3N88
2617E13j46m03N60m84M0M11n37J08M37m91L4P3l64J10N66p61K99J28o01O04j28
2638c2j83J79J7l03O28m96N3K56j1m38L99l55J89O21p99J92J11l02J88J88o5J90
2660B27k57l79M88j95J38L42n05K77k2l47K57J87k23L13l5l49L99k03k11J58J54
2681B14l08L66n9k40J85K7k12K53l85J05K65j12j32M31p53J74M77o16L62j11l5
2702a04r8J11l69N25k12j57J95P4m15O85l47j57J69m0N8k7j21J25L20l95J60J17
2724I7k06J96L47m90L00O2m73M66n83J88M02j07n5J1l3K32O3n83N70o6k47o8N59
2747E82o76L24J80n27K12J3l26N88k88m29P86n01L5m9J67J02R7m72OJ72l19L88
$$ plain form
2769 65 50 -251 -268 -19 -305 5 -135 -460 31 38 9 97 -98 -283 208 -68 -212 -92 -331 -173 121 -219
2791 -219 136 189 -316 146 97 -137 164 148 -217 318 126 -399 405 256 -148 333 109 -179 345 -105 126
2812 126 125 -218 217 380 -279 156 6 84 -71 217 -90 -18 -156 -159 131 -6 -225 22 33 -148 145 -125
2834 -125 -3 3 -356 -145 291 -576 -11 -9 -288 126 -228 -257 519 32 -150 159 -110 -85 99 -203 -142 221
2856 221 -153 -221 1 -192 24 305 -130 174 177 -60 304 280 -245 -40 332 -180 49 369 -160 497 104
2877 104 184 299 -354 264 29 -122 114 231 -111 49 -53 -267 136 10 -399 -77 -69 40 282 -106 -353
2898 -353 225 -317 -99 11 -89 -261 183 -237 -51 -122 -234 -288 14 -589 -7 96 -207 177 -238 -217 240
2919 240 177 -47 -38 -54 -348 154 -107 132 232 -196 168 440 -65 -97 -12 -80 243 95 -108 354 48 -21 661
$$ packed form
2769F5j5l01j7K49k86L10j40l25M91Pk9Q8j95j85M91k76j44J20k39J58K94l40
2791b19L55N3n05M62m9k34L01j6l65N35j92n25Q04j49m04M81k24k88N24m50K31
2812A26jl43M35J63o59M35j50P8j55K88l07P2j38lK90j37k19K47J1j81K93k70
2834a25J22Ol59K11M36q67N65Kk79M14l54k9P76m87j82L09k69K5J84l02O1L63
2856B21l74o8K22j93K16K81m35L04Lk37L64k4n25K05L72n12K29L20n29O57l93
2877A04Q0J15o53O18k35j51K36J17l42J60j02k14M03j26m09L22QJ09K42l88k47
2898c53N78n42K18J10j00j72M44m20J86p1j12n4L02o03N82J03l03L84m15K1M57
2919B40o3k24Rj6k94N02k61K39J00m28L64K72n05l2Q5o8L23j48k03M62l06o9O82
$$ plain form
2942 661 53 15 -64 -112 189 308 -8 30 216 -4 -319 157 -147 225 97 -186 146 32 -136 96 105 -122
2964 -122 116 -224 -422 201 -191 -22 63 -179 44 -72 -383 -23 146 -256 -154 296 -538 83 133 -307 -105
2985 -105 16 25 83 -24 -23 152 152 227 162 -169 103 312 110 23 -17 25 -13 -63 -9 271 -47 81 142 -189 -24
3010 -24 -30 -100 -265 85 -179 163 -11 69 14 259 -51 -29 89 -126 286 70 -446 -163 113 -106 13 -239
3032 -239 -303 120 -128 -148 -142 -261 -112 6 55 -153 245 -125 177 140 -269 -33 139 105 -34 115 -396 -34
3054 -34 -11 -301 388 -10 -343 177 -93 -108 455 -35 -12 305 -98 258 305 -134 245 158 8 85 501 -6
3076 -6 274 36 -84 177 47 -84 76 62 -266 145 -40 -120 311 -268 44 23 -216 120 390 -152 28 266
3098 266 -260 245 -137 62 62 40 -116 88 -70 -283 -9 -28 -152 150 44 213 141 -454 162 80 -160 -67
$$ packed form
2942F61o08l8p9m8L01J19l16L8J86k20l15M76l04L72j28k83L32j14j68K32Rk27
2964a22K38l40j98O23l92J69Q5k42K23j16l11L60J69m02J02M50q34O21N0m40K02
2985a05J21RN8j07JJ75%P5o5l31K72K09k02q7m0M2l8n0N4K80l18J28O1l31J65
3010b4op0j65L50k64L42j74Q0n5K45l10K2J18k15M12k16n16K83K76k19J19k52
3032b39o4M23k48k0Oj19J49J18M9k08L98l70L02l7m09K36J72l4j39J49n11L62
3054c4K3k90O89l98l33N20k70j5N63m90K3L17m03L56M7m39L79q7j50P7M16n07
3076fK80k38j20K61j30j31J60j4l28M11j85q0M31n79L12k1k39L36K70n42J80K38
3098B66n26N05l82J99%k2j56K04j58k13K74j9j24L02j06J69p2n95O16q2k40R3
$$ plain form
3120 -67 87 -21 136 128 86 364 245 114 245 -187 212 461 90 183 443 -20 -155 353 -368 -40 158 -105
3142 -105 150 153 -26 245 221 -83 340 20 -67 133 -15 -133 291 -220 -23 14 -43 50 62 132 -376 -107 -122
3165 -122 110 -385 -67 -155 -314 -266 322 -91 -335 206 -92 205 270 -111 160 74 -276 -222 91 -250 -58 143
3187 143 -1 42 -127 -5 397 155 -311 145 -154 -79 338 337 46 242 143 238 174 -287 57 354 -119 -150 60
3210 60 225 344 -27 -157 7 124 -253 182 2 -284 39 -235 -164 151 -180 -63 120 -353 -116 210 -138
3231 -138 -113 -60 -178 -118 -130 -228 92 -14 62 -165 -103 -190 -10 -253 -228 110 -285 -237 218 -156 97 75 -265 136
3255 136 79 -234 121 254 137 239 33 72 357 39 -39 273 -54 -11 28 55 238 209 -236 -71 337 -190
3277 -190 -85 27 -113 197 -55 72 341 132 -91 370 -46 -137 294 -163 -325 58 -105 -14 -40 -77 -87 -15
$$ packed form
3120f7J54j08J57qm2K78j19j31J31m32L99K49l71R3K60m63j35N08p21L28J98k63
3142a05K55Lj79K71k4l04M23l20q7K00j48j18M24n11J97L7n7R3J2P0n08K69j5
3165a22K32m95L18q8j59M8N88m13k44N41k98K97O5l81K71q6l50N4L13l41J92K01
3187A43j44M3j69J22M02k42m66M56k99P5M17jk91J96r9R5o4m61L44K97m73l1K10
3210F0J65J19l71j30J64J17l77M35j80k86L23k74P1L15l31J17J83m73K37L26l48
3231a38K5N3j18O0j2r8L20j06P6k27O2q7J80k43K5L38l95M8M55l74K53k2l40M01
3255A36n7l13L55J33j17J02k06L9K85l18p8L12l27M3L9K7J83k9m45J65M08n27
3277a90J05J12j40L10k52J27K69k09k23M61m16r1M31m57j62L83j63R1k6l7j0P2
$$ plain form
3299 -15 -33 -48 198 -113 -227 158 -456 -26 12 -9 83 -303 -194 247 -132 -184 -79 -142 292 121 70 -13 0 -273
3323 -273 115 219 -31 245 222 133 116 -32 372 41 93 1 156 -177 -54 -25 127 3 269 58 -64 72
3345 72 -50 -19 -38 -125 -97 25 -61 -57 25 -175 -114 -358 -92 -99 -49 -96 -98 -155 -85 100 -151 174 30 -344 -62 -222
3371 -222 -57 81 86 -100 43 45 -107 173 50 259 63 -148 54 438 -155 -176 397 257 191 66 -267 167
3393 167 173 -12 299 -15 -68 181 199 101 332 -70 256 2 -161 7 228 -306 16 335 -26 37 -117 -169
3415 -169 89 141 -111 -136 135 -361 65 -153 -232 202 4 -305 125 -320 -168 214 -265 -172 32 -259 6
3436 6 125 84 158 -286 -238 307 42 -77 159 94 22 -230 -13 -302 360 118 73 264 -86 178 233 -61 79
3459 79 8 -86 43 117 -19 95 118 -142 32 -185 -310 197 -104 -145 223 -132 -295 223 -139 -33 23 -248
$$ packed form
3299a5j8j5K46l11j14L85o14M30L8k1R2l86J09M41l79n2J05o3M34j71n1q3J3k73
3323b73L88J04k50K76k3q9j7j48M04l31N2r2J55l33J23K9J52j24K66k11j22J36
3345G2j22L1j9q7K8J22q6MQ2k00O1k44K66pN0m7kn7P0J85k51L25j44l74K82j60
3371b22J65J38Nj86J43Kj52K80j23K09j96k11K02L84n93k1N73j40o6j25l33M34
3393A67Oj85L11l14n3K49J8r8K31m02L26k54j63J68K21n34L22L19l61O3j54n2
3415a69K58N2k52k5K71m96M26k18p9M34j98l09M30m45J52L82m79R3K04k91K65
3436FJ19m1P4m44M8N45k65j19K36o5p2k52K17k89O62k42m5J91l50K64N5k94J40
3459G9p1r4J29P4j36J14K3k60J74k17j25N07l01m1L68l55j63N18l62J06N6k71
$$ plain form
3481 -248 150 23 -277 -185 67 -37 130 192 -353 -84 27 -78 101 29 -260 -16 -166 -237 76 -11 -187 -199
3503 -199 101 -76 -214 -38 396 79 -234 -16 186 -34 187 6 43 302 377 11 80 40 207 216 -211 -148
3525 -148 -117 91 215 113 -53 52 117 -82 218 203 77 201 -211 -103 -76 -108 -202 -79 -89 -231 23 -377
3547 -377 -233 -117 127 -252 114 -60 -102 -17 -300 53 195 -197 158 189 -320 103 127 45 181 173 -72 122
3569 122 -396 103 230 -296 -58 123 130 301 142 -198 6 121 -98 192 227 -200 61 44 -215 387 221
3590 221 65 152 166 112 136 -85 33 15 -115 -98 139 -48 249 98 -145 80 252 -216 -30 -113 -377 90
3612 90 -167 -43 147 17 -134 278 -318 -205 36 -153 -174 -230 -220 182 -2 39 227 34 -34 -31 140 78 224
3635 224 -35 -233 324 -77 129 -186 -73 166 14 40 -70 99 -102 272 101 59 136 192 -24 158 -64
$$ packed form
3481b48L98j27l00R2K52j04J67O2n45K69J11j05J79p2k89K44j50p1L13q7j76j2
3503a99L00j77j38J76M34l17l13K18K02k20K21j81L7K59P5l66O9m0J67Rm27O3
3525a48L1K08J24j02j66J05O5j99L00j5j26J24m12J08K7l2r4J23j0j42K54m00
3547c77J44J16K44l79L66j74m2Q5k83L53J42l92L55L1n09M23K4q2J36qk45J94
3569A22n18M99J27n26K38J81PJ71j59l40K04J15k19K90L5m27K61j7k59O02j66
3590B21j56Q7J4n4K4k21J18j8j30J7K37j87K97j51k43K25J72m68J86q3k64M67
3612I0k57J24J90j30j51M12n96J13K41j89k1n6J0M02j84M1J88j93o8LJ71o2J46
3635B24k59j98N57m01K06l15J13K39j52K6j10J69k01L74j71m2P7N6k16J82k22
$$ plain form
3656 -64 -286 -34 -89 214 513 52 -198 309 -85 -73 111 -98 187 -252 -110 3 -110 -221 -43 -171 -166 114
3678 114 2 -182 -99 -200 -186 27 -79 -134 -47 -216 -232 9 -333 -132 -115 -187 -53 36 -278 -185 43 -212 292
3701 292 157 -184 361 -41 114 217 315 415 -15 35 -244 76 -217 58 214 44 55 213 -143 57 385
3722 385 -60 115 178 34 323 -49 161 185 -179 -231 77 116 -24 92 -98 -46 -64 -101 -23 232 -182 -72 -249
3745 -249 -342 -62 14 -296 25 254 -101 -51 11 -152 137 -60 10 243 16 80 248 -4 235 90 -146 -310
3767 -310 114 -150 45 -86 -63 149 -56 -57 196 297 58 283 -195 56 253 -9 -232 152 188 -160 -136 -35
3789 -35 139 231 -59 31 -41 -240 123 -104 -92 338 -75 -25 244 -56 -354 194 -173 -43 2 -346 -102 -44 -172
3812 -172 -31 125 -111 165 81 -202 -105 -82 -202 32 -187 -114 208 -244 -22 185 -255 31 -26 -180 -106 78
$$ packed form
3656f4k22K52n5L03K99m61k50N07l94J2J84k09K85m39J42J13j13j11J78j28NK80
3678A14j12j84Q3j01J4K13j06n5Q7j69j6K41l42K01J7p2J34Q9l14R3K28k55N04
3701B92j35l41N45m02J55J03R8J00m30N0k79L20k93K75J56j70J1J58l56K00L28
3722C85m45J75O3j44K89l72K10K4l64n2L08L9j40J16j90N2j8l7P8K55m14J10j77
3745b49r3K80P6l10L21K29l55N0O2j63K89j97P0K33k27O4J68k52K39j45k36j64
3767c10M24k64J95j31K3K12k05jK53J01k39K25m78K51J97k62k23L84L6l48K4J01
3789c5J74R2k90R0p2j99L63k27J2M30m13N0K69l00k98N48l67J30M5l48K44N8j28
3812a72J41J56k36K76q4k83R7K3j20K34k19P3L22m52K22K07m40K86n7j54P4J84
$$ plain form
3834 78 126 -15 99 99 -115 -5 -68 -209 127 -31 287 62 89 265 -77 59 170 -232 169 97 130 -44 209
3857 209 -168 202 -136 -215 376 44 66 -1 -11 -84 16 62 99 -23 -21 -130 -217 -392 -150 -48 -144 -104 177 -414
3881 -414 -18 76 -69 35 -45 -407 -35 -163 -131 268 -308 -64 136 -89 167 137 -354 46 181 -126 -102 13
3903 13 -79 197 -40 -86 279 -62 7 112 72 -15 131 280 181 12 99 -272 141 108 86 67 -76 212 -44 10
3927 10 193 401 50 -4 -367 49 96 -98 -52 139 -255 -130 -121 -35 -108 -89 -286 8 -117 -32 -122 58 -107 90
3951 90 -159 -15 213 -328 -21 4 71 -150 43 101 75 192 2 115 189 -343 206 165 -201 123 50 -144 11
3974 11 218 -173 152 -130 -129 120 113 -16 171 44 -206 429 -187 23 -163 -1 -127 297 -131 -121 -110 4
3996 4 67 -143 -208 7 55 -58 83 -74 -171 -139 -55 -1 -131 -112 -110 -95 -306 76 91 -304 -12 -128 -191 34 197
$$ packed form
3834G8M8j41J14%k14J10o3j41L36j58L18k25K7J76l42J36J11m02M01p2L3j74K53
3857B09l77L70l38p9N91l32K2o7j0p3J00M6L7j22Kj09q7j75K42J02r6M0K81n91
3881d14L96R4j45J04q0l62L72j28L2L99n76K44K00k25K56l0m91M00J35l07K4J15
3903A3r2K76k37m6L65l41O9J05m0q7J46J49r9j69Q7l71M13l3k2j9j43K88k56N4
3927A0J83K08l51n4l63M16M7j94M6J91l94J25RQ6p3J9j97K94j25Q5r0J80j65J97
3951I0k49J44K28n41L07K5O7k21J93N8k6J17j90J13P4n32N49m1l66L24p3j94J55
3974A1K07l91L25k82JK49pj29J87j27k50O35o16K10j86J62j26M24m28J0J1J14
3996DO3k10o5K15M8j13J41j57r7L2Q4N4j30J9KJ5k11L82J5l95K92j16o3K25J63
$$ plain form
4021 197 -327 -94 71 -69 -17 34 -9 136 8 166 42 -5 33 20 -2 -1 -64 136 -6 59 -6 97 45 -10 171
4046 171 73 -277 -51 -59 269 83 -83 -194 231 39 -165 10 -185 -187 -132 -125 -55 -93 -197 -56 -143 -158 124 -25
4070 -25 38 205 144 -296 154 -328 -119 47 -40 -113 -36 -284 -41 119 -237 6 304 -13 163 -38 -379 -138
4092 -138 25 -7 88 6 88 24 -82 70 98 272 215 -148 -319 3 62 161 251 -5 173 290 -70 -41 249 38
4116 38 64 244 -109 -97 136 13 -223 290 -128 -124 212 -40 -90 -1 -152 67 67 -196 13 65 -374 -257 -124
4139 -124 -186 -81 -124 -338 -57 -92 -204 259 -50 322 -159 109 -70 -7 -38 171 165 -203 119 -233 -242 -3 55
4162 55 -2 51 -16 54 184 120 145 7 -46 140 118 156 -84 287 -88 -28 1 165 46 115 20 -108 79 145 -106
4187 -106 37 -100 -198 25 -97 130 -193 136 193 -190 -213 187 -229 1 19 -64 -135 -186 -219 44 -27 -48 -76 187
$$ packed form
4021A97n24K33J65j40N2N1m3J45j28J58j24m7L8j3k2Jo3K00j42O5o5J03n2n5J81
4046A71r8l50K26qL28j86j66j11M25j92k04J75j95kN5PP0l8j04J41q7j5K82j49
4070b5O3J67o1m40M50m82K09J66q7p3P7k48K43J60l56K43K98l17J76k01l41K41
4092a38J63l2R5q2Q2o4j06J52K8J74n7l63j71L22N9R9R0k56J78J17l60K9K90k11
4116C8K6J80l53J2K33j23k36N13m18ML36k52n0Q9j51K19%k63K09N2m39J17J33
4139a24o2J05m3k14K81l5j12M63l09L72m81K68j79O3l1K09ol68L22l52rK39N8
4162E5n7N3o7P0J30o4K5j38n3J86k2L8k40L71l75O0K9J64j19O9r5j28J87O6k51
4187a06J43j37r8K23j22K27l23L29N7l83k3M00m16K30J8q3p1n1l3K63p1k1k8K63
$$ plain form
4211 187 109 -4 -404 -156 61 8 -58 -19 -136 201 -18 -391 16 75 62 133 298 144 52 66 -200 123 168
4234 168 -29 -4 265 -3 -73 319 36 -69 -14 25 298 -132 124 312 77 94 258 95 -131 -114 123 -32
4256 -32 -358 -150 193 13 -96 165 -48 -441 -8 -232 -244 -87 12 172 148 -148 -88 8 -109 235 20 -20
4278 -20 -197 4 -309 116 -233 109 5 -83 -67 271 -114 5 153 248 25 179 -160 -276 171 -106 65
4299 65 120 119 -138 330 -111 154 349 -257 62 242 151 35 173 121 128 -92 -194 93 -231 -30 89 -248 -128
4322 -128 -178 143 100 150 -296 -55 172 -269 -23 58 -191 -107 -95 -344 -81 -280 -140 -91 -30 9 -89 -241 -36
4345 -36 31 57 -26 -100 140 48 -259 -106 51 9 124 3 126 -134 315 11 156 243 -192 -112 -105 -180 37 151
4369 151 113 -57 -100 -107 -12 24 -29 217 -120 -86 92 57 -125 145 20 140 -39 -68 -78 -234 68 133 144 -68
$$ packed form
4211A87p8j13m00K48K17n3o6L9j17L37k19l73M07N9j3P1J65j54r2J4k66L23M5
4234A68j97K5K69k68p0L92k83j05N5L9K73m30K56J88k35J7J64j63k26J7K37j55
4256c2l26K08L43j80j09K61k13l93M33k24j2J57R9J60k4k96O0R6j17L44k15m0
4278b0j77K01l13M25l49L42j04q8J6L38l85J19J48R5k23J54l39j16M47k77J71
4299F5N5jk57M68m41K65J95o06L19J80r1j16J38n2Pk20j02K87l24K01J19l37J20
4322a28n0L21m3N0m46K41K27m41K46Q1k49Q4J2k49K63j99J40M9O1L9r8j52K05
4345c6O7K6q3p4K40r2l07J53J57m2J15j21J23k60M49l04J45Q7m35Q0Pp5K17J14
4369A51l8j70m3pR5L6n3K46l37L4J78l5j82K70j25J20j79k9j0j56L02O5J1k12
$$ plain form
4393 -68 121 59 -253 4 48 -166 225 132 -187 59 -256 89 147 83 79 -81 -133 -186 172 73 -282 -157 197 157
4417 157 95 -24 -62 73 -9 211 53 -55 31 -97 59 110 -111 -4 277 -378 105 98 -154 95 78 -115 209
4440 209 322 -109 -9 86 71 -7 138 -38 243 131 -127 -166 -182 -42 -17 -205 29 -40 -145 181 155 -133 -27
4463 -27 168 -380 120 187 86 287 -232 -137 166 78 -280 117 222 17 178 -345 22 41 89 106 251 61
4485 61 109 10 -19 189 -183 53 128 -187 228 294 -76 60 38 -195 92 138 -33 176 245 -86 135 130 23 134
4509 134 -119 -208 -12 143 -5 150 -43 -176 91 -213 40 -52 -193 34 93 -314 -82 189 -164 62 -114
4530 -114 45 247 174 -113 129 -315 -65 163 -44 -18 38 -244 25 -184 218 -41 -28 8 55 33 -39 -229 104
4553 104 -147 72 32 -10 332 25 97 -238 78 -12 301 198 -14 -2 -155 121 -17 -140 185 64 33 227
$$ packed form
4393f8J89o2l12K57M4k14L91r3l19K46l15L45N8o4mj60n2n3L58r9l55J25L54m0
4417A57o2j19l8J35q2K20j58j08Q6j28J56N1k21J07K81o55M83pk52K49j7j93L24
4440B09J13m31J00R5j5p8J45j76K81j12k58l9j6J40K5j88K34o9j05L26k6k88J06
4463b7J95n48N00O7j01K01n19R5L03q8l58L97J05k05J61n23L67J9M8J7J45j90
4485F1M8r9k9K08l72K36P5l15M15O6l70J36k2k33K87M6j71K09O9l31K21nj07J11
4509A34k53q9J96J55j48J55j93j33K67l04K53r2j41K27N9m07K32K71l53K26j76
4530a14J59K02p3k87K42m44K50K28k07K6N6k82K69k09M02k59J3L6M7k2p2j90L33
4553A04k51K19m0m2L42l07P2l35L16r0L13j03k12J2j53K76j38j23L25j21l1J94
$$ plain form
4575 227 58 -122 79 197 166 3 -254 -304 -326 65 143 183 76 -125 -36 -334 -215 208 47 -119 -330 -179
4597 -179 -128 58 -163 -298 -68 243 115 -286 -84 258 -268 -96 181 -58 -20 304 -224 -170 -158 -7 251
4618 251 239 15 78 119 -79 188 77 211 155 89 250 150 -164 143 307 27 97 110 -108 -23 112 -44 -138
4641 -138 -93 -99 -265 0 -140 -81 -10 33 2 -58 62 87 -63 -194 -162 -141 199 210 -342 -159 -130 -152 -12 -76 -178
4666 -178 135 42 -80 194 -101 -360 14 -81 -107 -180 142 -203 32 79 32 317 -70 242 -18 137 295 200
4688 200 183 -17 176 -85 -56 260 -197 133 -235 287 6 72 103 305 -140 86 103 17 -169 -213 -204 -210 69 -206
4712 -206 481 298 15 -242 73 -48 26 25 -108 -171 -119 -10 201 -66 -175 221 -226 -53 121 184 -15 197
4734 197 -251 -115 9 263 233 49 -205 119 -244 -144 245 -210 -28 218 -93 140 34 190 -56 107
$$ packed form
4575B27j69j80K01J18l1j63k57n0k2L91P8M0j07k01Q9k98J19M23j61j66k11J51
4597a79N1J86k21j35K30L11j28m01K02L42n26J72K77k39L8L24n28N4J2J51K58
4618B51j2k24O3M1j98K67j11J34n6o6J61j00l14L07J64k80P0J3k18Q5J35j56r4
4641a38M5oj66K65j40N9P1M3l1o0J20K5j50j31L2K1L40J1n52J83K9k2J40o4j02
4666a78L13r3j22K74k95k59L74r5k6p3L22l45K35M7m7K85l87L12k60J55J58r5
4688B00j7k00J93k61K9L16m57L30l68N22k81O6L1K02m45K26J7q6j86m4RoK79k75
4712b06O87j83k83k57L15j21P4jj33o3N2J09K11k67j09L96m47J73J74O3j99K12
4734A97m48J36J24K54l0j84k54L24l63J00L89m55J82K46l11K33j06J56k46J63
$$ plain form
4754 107 -40 -83 30 36 155 -29 -70 298 363 -39 174 118 -18 122 -21 -87 273 149 -73 298 -171 -200 220
4777 220 -219 -7 63 173 186 158 -361 101 -191 -7 -152 -89 -2 156 -101 -199 -85 -66 -333 -13 -34 50 83
4800 83 -147 -9 -190 -163 149 -119 -98 246 -144 -180 37 59 -239 80 177 -7 249 108 93 108 163 -13 82
4823 82 -147 204 -62 156 176 372 -68 -58 4 -280 -140 -32 249 -35 -103 -63 -159 -146 53 443 44 -154 4
4846 4 -69 18 -150 -100 264 -100 -158 52 83 -276 -28 -22 57 -89 117 -41 12 -191 -20 87 -38 -55 -61 -177 155
4871 155 202 -110 195 96 -140 175 387 81 153 195 54 145 17 159 -4 -4 238 -70 208 -254 -15 -126
4893 -126 243 15 -126 148 20 14 109 89 -36 248 211 -68 150 -86 -116 -21 -10 98 -140 -154 -79 -18 -85 -61
4917 -61 101 -20 50 300 -261 43 -79 -125 50 -92 -120 -156 -113 146 -142 -79 -33 474 -155 68 24 -166 -89
$$ packed form
4754A07j47m3J13OJ19j84m1L68O5m02K13n6j36J40j43o6L60j24k22L71m69k9M20
4777B20m39K12P0J10J3k8n19M62k92J84j45O3Q7J58k57r8J14J9k67L20k1Q4L3
4800H3k30J38j81K7L12k68K1L44l90l6K17K2k98L19R7j84K56j41j5J5N5j76R5
4823H2k29L51k66K18K0J96m40J0O2k84J40J08K81k84o8M0r6J3J99L90l99j98J58
4846Dp3Q7j68N0L64l64n8K10L1l59K48OP9j46K06j58N3k03J71J07j25j7oj16L32
4871A55M7l12L05r9k36L15K12l06P2M2j41R1j28J42j63%K42l08K78m62K39j11
4893a26L69k28j41K74j28oR5k0j25K84l7k79K18k36l0R5J1J08k38j4P5O1o7K4
4917f1J62j21P0K50n61L04j22m6J75j42k8l6M3K59k88O3M6N07o29K23m4j90P7
$$ plain form
4940 -89 -246 15 253 -206 -279 -178 -75 -7 -56 212 -277 426 24 -125 -94 14 -108 285 199 83 -35 135
4962 135 -45 -48 167 -91 56 -118 39 -207 -58 77 2 -307 0 -216 -120 -157 -11 -47 364 -97 132 94
4984 94 -360 -94 -64 -57 -73 12 -161 -283 48 -126 312 76 44 329 -137 -192 -31 -32 93 193 -115 -2 -121
5007 -121 -146 -15 -49 -108 38 -83 -83 112 -67 15 95 195 -221 122 48 -32 90 56 233 240 -129 -168 263 -162
5031 -162 17 9 -66 110 -244 -92 200 174 -34 -44 36 -5 3 -92 -84 121 40 -243 228 78 -69 -95 -20 21 -9 -162
5057 -162 64 -71 8 -55 59 -84 1 73 -86 85 72 36 -95 15 -145 -134 -216 117 87 -231 297 38 -140
5080 -140 138 219 60 210 -133 -239 -155 78 -3 -19 -109 118 224 -199 -59 147 78 57 61 -150 -137 103 11 -75
5104 -75 121 -218 101 -1 -181 129 139 -75 -173 -277 -38 126 -80 -87 43 -159 -72 -97 -132 -70 117 -117 155
$$ packed form
4940h9j57K61K38m59p3J01J03O8m9K68m89P03m02j49L1J08j22L93q6j16j18J70
4962A35j80lK15k58J47j74J57k46J49J35p5l09L07k16R6l7J46l6M11m61K29l8
4984I4m54K66L0Pj6Q5j73j22L31j74M38k36l2K85m66n5J61jJ25J00l08J13j19
5007a21k5J31l4n9J46j21%J95j79Q2Q0J00m16L43p4q0J22l4J77Pl69l9M31m25
5031a62J79qp5J76l54J52K92k6k08j0Q0m1Qr5QK05q1k83M71j50j47k6P5M1l0j53
5057a62K26j35P9o3J14j43Q5P2j59J71j3l6j31J10j60J1q2L33l0l18N28k59j78
5080a40K78Q1j59J50l43j06Q4K33q1j6r0K27J06m23J40K06o9k1Mk11J3K40r2q6
5104g5J96l39L19j02j80L10J0k14r8j04K39J64k06pJ30k02Q7k5l5O2J87k34K72
$$ plain form
5127 155 104 8 -8 -246 -139 -88 88 -184 280 -93 -130 367 274 134 -235 -18 35 117 -129 1 323 10 122
5150 122 159 -93 89 -188 222 -10 225 -188 156 -357 117 116 -63 93 -160 -50 190 -78 -53 162 -74
5171 -74 20 23 -3 -185 -56 60 -383 26 -211 103 195 -149 -2 -58 -186 -27 310 12 126 -14 223 -80
5193 -80 88 -164 -67 109 -192 192 151 151 140 -445 -138 -137 -166 -19 428 293 -87 4 -151 218 -84 21 -236
5216 -236 -57 -57 321 56 -181 -220 -164 23 243 140 -210 54 -105 51 -88 -165 -111 -5 51 59 -51 -213 50
5239 50 84 -177 -58 103 -306 47 79 -180 21 -206 -33 -141 162 92 -104 -192 -220 110 -98 -141 58 -280
5261 -280 10 29 -196 -118 118 -185 42 100 -178 146 -16 -116 78 55 97 424 109 -45 -143 43 1 296
5283 296 -25 107 93 77 56 135 72 -8 52 117 -65 249 27 -89 -40 -359 3 -284 115 -137 33 111 53 -257
$$ packed form
5127A55n1r6j6k38J07N1J76k72M64l73l7M97r3j40l69K17N3Q2k46J30L22l13J12
5150A22L7k52J82k77M10k32K35m13L44n13M74jj79J56k53J10K40k68K5K15k36
5171g4R4Lk6j82J29J16m43M09k37L14R2l44J47n6j28J59L37k98J14j40K37l03
5193h0J68k52R7J76l01L84m1%j1n85L07Jk9J47M47j35l80R1j55L69l02J05k57
5216b36J79%L78k65k37l9N6J87K20j03l50K64j59J56j39p7N4J06N6Qj10j62K63
5239E0L4k61J19J61m09L53L2k59K01k27J73j08L03p0j96q8k8L30k08m3J99l38
5261b80K90J9k25P8K36l03K27N8k78L24j62j00J94k3M2L27l15j54r8J86m2K95
5283B96l21J32j4j6k1P9o3q0O0O5j82L14k22j16M9l19L62k87L99k52J70P8n8l10
$$ plain form
5307 -257 28 -59 -112 60 -147 -243 -7 -117 -249 47 -48 -315 102 -36 -140 170 -68 -5 45 -20 21 134 9
5330 9 24 -35 -69 -186 233 31 78 -15 -310 73 73 78 -51 -16 -296 49 -67 80 -144 212 73 -72 -118 -108 -18
5355 -18 14 248 -98 -59 -243 241 45 -185 -37 -239 175 -203 -341 141 -276 -177 2 -159 6 309 -277
5376 -277 -8 -226 -179 -30 196 57 -151 125 -85 26 73 16 90 -392 -144 -25 150 -83 9 -124 -11 250
5398 250 -40 90 -164 -35 25 -395 153 114 38 -13 -13 88 163 52 -48 46 -32 -135 81 15 73 136 -60 -87
5422 -87 -68 76 -81 5 290 -206 264 -115 -5 -179 24 -175 -25 -180 6 69 -252 -164 19 -292 -260 -88
5444 -88 21 173 -96 23 80 -66 185 97 -271 58 310 30 -105 149 -15 35 176 94 170 256 249 96 336
5467 336 -44 42 -280 -11 66 -61 -89 195 149 94 88 -23 35 179 125 -36 -38 -219 -231 277 -106 -193 -27 -391
$$ packed form
5307b57K85q7n3J72k07r6K36j10j32K96r5k67M17j38j04L10k38O3N0o5M1J13j25
5330IJ5n9l4j17M19k02M7r3k95L83%Nj29L5k80L45j16J47k24L56j39j45m6J0R0
5355a8L2K34l46L9j84M84j96k30J48k02M14l78j38M82m17R9J79j61J65L03n86
5376b77K69k18M7J49K26j39k08K76k10J11M7n7P4m82K48J19J75k33R2j33J13K61
5398B50k90J30k54J29O0m20N48l9p6n1%J01P5j11j00R4p8j03K16o6N8O3j96k7
5422h7J9J44j57Q6K85m96M70l79J10j74K03j99J50j55J86O3l21Q8J83l11L2J72
5444h8J09J52k69J19N7j46K51q8l68L29K52k80j35K54j64N0J41q2P6Q6pj53K40
5467C36l80Q6l22K69P7j27k8K84m6n5oj11N8J44n4j61kj81j2N08l83q7J66l64
$$ plain form
5491 -391 -192 -123 25 9 225 57 -170 -213 -59 56 -49 43 -9 167 93 -35 -50 -188 255 -233 140 -224
5513 -224 6 161 187 -51 -32 85 -43 221 -242 -77 78 -77 39 95 103 84 220 -82 -188 -98 -106 -59 -172
5536 -172 -47 162 211 -88 124 69 -40 220 124 9 -81 -18 72 -62 -97 -397 18 -57 -83 -95 99 -30 85
5559 85 -135 68 42 145 -27 -102 -112 -20 -62 -134 156 -300 -164 132 -45 27 -3 -279 100 78 -46 -130 90 28
5583 28 140 -249 -353 33 -165 46 210 -98 -159 -52 -114 -136 272 -9 -60 130 -158 -11 19 -159 124 76
5605 76 -212 16 -13 75 17 -176 -42 91 69 -153 27 116 290 -159 63 -65 -24 150 72 243 -75 67 65
5628 65 151 26 161 -8 -24 -148 44 -76 7 -4 -322 -171 183 -90 -270 -135 171 -106 -40 110 -165 -58
5650 -58 -124 -385 33 139 91 80 -27 13 -6 126 -147 147 -22 75 -264 -97 -63 112 30 -250 -106 -54 100
$$ packed form
5491c91J99O9J48j6K16j68k27m3J54J15j05R2n2J76p4j28j5j38M43m88L73l64
5513b24K30J55K6k38J9J17j28K64m63J65J55j55J16N6Qj9J36l02j06R0qM7j13
5536a72J25K09M9k99K12n5j09K60r6j15r0O3R0j34l5l00M15p5k6j2J94j29J15
5559H5k20K03k6J03j72p5j0R2m2p2K90m56J36K96j77P2l0k76L79k2j24q4K20o2
5583B8J12l89j04L86j98K11J64l08o1J07o2k2M08k81n1J90k88J47L0j78K83m8
5605G6k88K28k9Q8n8j93J34J33k2k22J80Q9J74m49K22j28M1J74p8J71l18J42k
5628F5Q6j25J35j69j6j24J92j20Q3j1l18J51L54k73j80J35L06k77O6J50k75J07
5650e8o6k61M18J06m8j1j07M0j9J32k73K94j69R7l39J67L4J75q2k80J44N2J54
$$ plain form
5673 100 68 47 -278 -302 -37 167 196 339 18 55 -16 -109 119 -173 108 -25 -25 106 171 -317 92 -312 -230 92
5697 92 -119 181 -221 149 82 280 -148 -58 -116 -64 -93 200 175 -140 -26 -52 155 -151 -27 149 -242 141 10
5720 10 -151 93 42 -117 27 112 -92 35 277 54 26 15 151 233 -233 10 93 136 77 376 -78 -355 162
5743 162 196 -79 11 -152 185 -204 -300 20 -13 -149 47 -96 -61 -149 -56 358 26 -7 -418 -106 -77 -7 34 -216
5767 -216 76 -57 44 -97 55 -369 40 -73 0 -149 177 1 49 -244 -364 127 38 172 -155 265 -130
5788 -130 -1 -256 67 67 -187 -270 234 225 14 269 124 26 19 -92 -42 164 -186 93 -45 -275 80 1 -156
5811 -156 236 27 92 -68 112 -51 343 -130 309 54 -120 38 79 -74 -55 -243 -122 93 -259 -67 -51
5832 -51 21 -52 323 -82 -95 -143 -62 115 -58 56 -19 254 -14 -39 -4 42 -11 143 14 317 180 263 86 130
$$ packed form
5673A00l2k1l25k4K65K04K9J43l21L7p1r3K28k92K81j33%J31O5m88M09m04Q2L22
5697I2k11L00m02L70o7J98m28R0n8N2k9K93k5l15J14k6K07l06J24J76l91L83j31
5720A0j61K44n1j59J44Q5k04J27K42k23k8j1J36Q2m66K43Q3M3n9K99m54k77N17
5743A62L4k75R0j63L37l89r6L20l3j36J96j43L5q8R3M14l32l3m11L12K9P0M1k50
5767b16K92j33J01j41J52m24M09j13P3j49L26j76M8k93j20M91q9J34l27M20l95
5788a30J29k55L23%k54q3N04rk11K55j45r8pj11N0K06l50K79j38k30L55p9j57
5811a56L92k09O5j60J80j63L94m73M39k55j74J58M1j53J9j88J21K15l52J92J6
5832e1P2p3L75m05j3m8Q1J77j73J14p5K73k68k5L5M6n3J54j29L03j37Q3j77M4
$$ plain form
5856 130 61 -37 -3 48 211 -4 24 -1 -104 118 156 51 86 345 -56 321 26 -23 -101 -5 -105 224 -22 -173
5880 -173 -121 105 184 -71 -36 118 93 -108 -202 -14 -44 126 207 16 59 370 -294 -203 -305 -53 42 -295 -33
5903 -33 157 270 175 17 -107 -38 72 -1 131 125 -89 80 -33 -15 -188 -102 -118 92 -220 -21 220 -66 -336
5926 -336 168 -47 -74 36 333 398 256 -6 -9 44 204 -36 282 109 -59 -121 -44 354 102 93 109 49 -73 227
5950 227 -188 -43 -313 -223 -44 147 -246 101 -53 -49 102 -461 -133 71 -51 -176 -43 -80 -162 -13 -209 70
5972 70 17 113 50 66 54 -223 274 170 -89 97 64 -68 98 -141 -105 180 -20 169 -16 -7 -82 -81 245 -49
5996 -49 -119 90 -162 267 -25 -58 77 283 318 41 22 -189 107 250 75 -196 -48 -12 156 66 -62 -186
6018 -186 -49 281 -55 -86 -326 189 -216 -47 -19 -52 -178 162 -192 -70 -120 37 16 -312 -110 -219 -10 -132
$$ packed form
5856A30o9r8L4N1J63k15K8k5j03K22L8j05L5K59m01L77k95m9p8R6j00L29k46j51
5880a73N2K26P9k55L5J54k5k01r4J88l0J70Q1j91M3L11o64R1j02K52R5l37K62
5903c3J90J13r5j58j24O9J10p3J32ok14J69j13J8j73Q6j6K10l12J99K41k86k70
5926c36N04k15k7J10K97O5j42k62lN3J60k40L18j73j68o2P7L98k52rJ6o0j22L00
5950B27m15J45k70R0J79J91l93L47j54MJ51n63L28K04j22j25J33l7q2J49j96K79
5972G0n3R6o3J6j2k77M97j04k59J86l3j32J66k39L6K85k00J89j85Rp5JL26k94
5996d9p0K09k52M29k92l3J35K06L5k77j9k11K96J43j75k71J48L6J68r0j28j24
6018a86J37L30l36l1k40N15m05J69K8l3j26L40l54J22n0J57k1l28K02j09K09j22
$$ plain form
6040 -132 59 132 -178 -53 -8 5 115 -6 108 33 -158 92 128 77 413 57 149 1 -22 146 14 49 -23
6063 -23 132 2 -6 185 214 -1 -35 -78 -193 -81 -79 62 252 -200 118 -384 -129 326 -56 -123 -173 46 -25 14
6087 14 327 -260 -31 -93 -68 67 -273 -37 -41 -352 16 19 52 -85 -211 -119 31 -212 -69 36 297 87 248
6110 248 -205 -55 -423 -147 -229 -15 79 -90 219 -74 13 22 36 -178 221 69 248 179 154 145 295 -171 -92 -212
6134 -212 118 1 -140 63 134 60 -179 182 130 -229 179 94 -4 -118 182 -213 68 -4 46 197 51 337
6156 337 49 -32 -149 10 -226 -205 301 11 -123 -57 -207 -7 52 -10 -31 -113 83 154 61 -112 138 260 -161
6179 -161 129 -88 55 -70 206 131 210 14 -185 -66 -28 -200 -25 65 112 -19 -68 103 -34 127 60 -149
6201 -149 -5 18 89 166 50 19 154 78 -6 108 308 98 -101 37 20 -119 226 -322 -30 -25 213 48 -70
$$ packed form
6040a32J91P3l10J25M5J3J10j21J14p5j91K50L6n1L36l56R2j48k3J68j32L5p2
6063b3J55j30qJ91K9k15l4m3j15J12KJ41J90m52L18n02K55M55l82o7n0K19p1L9
6087A4L13n87K29o2K5J35l40K36ml11L68LL3j37j26R2J50k43J43J05K61k10J61
6110B48m53J50l68K76q2K14R4j69L09k93Q7RJ4k14L99j52J79o9k5rJ50m66P9j20
6134b12L30j17j41K03P1p4k39L61n2l59M08q5r8j14L00l95K81p2N0J51j46K86
6156C37k88q1j17J59k36K1N06k90j34O6j50K00N9o2k1q2J96P1r3j73K50J22m21
6179a61K90k17J43j25K76p5P9j96j99J19L8j72J75R0M7j31m9J71j37J61o7k09
6201a49J44K3P1P7j16l1J35p6q4J14K00k10j99J38j7j39L45n48K92NK38j65j18
$$ plain form
6224 -70 -54 132 20 -183 124 119 19 -93 -62 -149 -88 -162 136 235 86 -121 -56 -163 -192 -144 107 -133 -263 -303
6248 -303 1 -121 53 163 -42 -86 42 -49 101 189 -227 1 -83 -121 -201 277 92 288 -40 -26 8 -37 96
6271 96 -125 -65 -92 -25 -147 -244 178 -72 -2 68 -110 71 -11 -155 -100 0 108 217 -35 -310 26 7 -237
6294 -237 304 29 -32 308 -322 127 55 -33 -84 -112 -292 226 130 7 -140 -136 98 154 13 -161 167 11 -65
6317 -65 -161 -252 110 74 201 -110 110 94 126 52 -216 50 281 -177 138 194 30 188 184 2 -96 143 181 48
6341 48 -111 118 -94 -6 -184 -76 -117 180 57 -60 -126 -145 -151 -108 -347 -108 -65 -159 18 141 63 -46 248 13
6365 13 -46 116 -95 123 438 -288 299 -20 -100 -174 -348 -40 171 -26 -91 -159 -298 -53 419 -113 -63 128
6387 128 -252 -124 -72 72 143 183 -36 22 5 -109 191 -50 -96 -21 -217 -166 117 -63 111 106 -79 -80 -82 37 258
$$ packed form
6224g0J6J86j12k03L07nj00j12L1q7O1p4K98R9j49k07O5j07k9M8K51k40j30m0
6248c03L04j22J74J10k05m4J28r1J50Q8m16K28q4l8q0M78j85J96l28J4L4m5J33
6271I6k21O0k7O7j22r7M22k50P0P0j78J81q2j44N5J00J08J09k52k75L36j9k44
6294b37N41k75o1L40o30M49p2q8n1k8j80N18r6j23j47MK34N6j41j74L28j56p6
6317f5r6r1L62l6J27l11K20j6L2p4k68K66K31m58L15N6j64J58mj82r8K39L8j33
6341D8j59K29k12Q8j78J08m1K97j23j17o6j9oM3k39K39M3r4J77J23p8j09K94k35
6365A3n9J62k11K18L15p26N87l19q0p4j74L08K11j97o5o8j39K45M72n32N0J91
6387A28l80J28N2J44P1M0k19N8j7j14L00k41m6P5j96N1K83j80J74nj85jkJ19K21
$$ plain form
6412 258 -415 -61 11 157 2 -141 35 28 5 180 69 170 203 44 -85 41 -7 -26 -70 155 32 -69 -40
6435 -40 153 45 78 46 44 111 -175 94 -210 306 -140 -394 -7 -101 -7 -34 192 250 -36 -42 528 13 125 127 133
6460 133 100 338 205 -272 290 -146 35 -161 -189 144 -143 298 -63 -243 10 162 -172 -130 45 -57 -44
6481 -44 62 66 274 155 -110 -153 -49 113 4 -174 193 78 -74 104 272 -166 74 124 -130 24 18 227
6503 227 83 51 -47 -137 276 63 -122 -116 163 -80 -108 -59 33 -89 85 49 19 -46 72 -144 -70 -192 -175 116
6527 116 81 -17 -123 -184 -30 114 -24 -134 -31 -281 -25 301 -78 187 11 -51 119 -66 -14 -62 -37 272
6549 272 -36 143 67 -143 161 43 108 -25 -118 -63 122 29 -28 -28 24 123 274 161 -230 40 114 18 -100 -137
6573 -137 139 -117 67 252 -95 -23 -248 138 -4 -5 -37 -76 17 108 288 -3 -54 -82 -53 -11 99 -23 62 216
$$ packed form
6412B58o73L54P2J46j55j43J76pk3J75j11J01L3j59j29J26m8j9m4K25j23j01K9
6435d0J93j08L3l2kO7k86K69l04N16m46k54L87r4R4k7K26N8k86oN70n15J12KO
6460A33l3K38j33m77N62m36J81j96k8L33k87M41l61j80K53J52l34M2J75j02J3
6481d4J06MK08j19k65m3J04J62j09j78L67j15j52J78J68m38K40N0k54J54oK09
6503B27j44l2r8r0M13k13j85OK79k43k8M9R2j22J74l6l0o5J18k16P4j22J7K91
6527A16l5r8j06o1J54J44j38j10J03k50K56L26l79K65j76o2J70j85N2m8K5L09
6549B72l08J79p6k10L04j18O5j33r3N5J85r3n7%N2R9J51j13l91K70P4r6j18l7
6573a37K76k56J84J85l47P2k25L86j42jl2l9R3R1J80k91n1k8K9M2J10j22Q5J54
$$ plain form
6597 216 -29 27 42 58 -9 120 33 150 -138 7 -169 109 5 97 105 56 -31 -205 -236 19 99 172 -68 -56 -215
6622 -215 -72 106 -233 195 -56 377 5 -122 69 -92 14 41 41 -176 -84 18 -13 74 191 -237 -238 104 -45
6645 -45 36 51 28 5 -54 176 102 162 -16 43 110 73 215 -95 -166 -92 75 222 -109 51 -32 -215 76 -155 -83
6670 -83 -92 -139 -58 106 79 57 2 46 -30 54 -9 31 -34 117 -121 -52 -75 -70 -88 -32 18 125 -112 -42 65 -146 -105 5
6698 5 -171 53 -457 -21 -142 -304 44 105 -2 265 139 79 138 193 -108 69 -45 102 -112 280 56 -166
6720 -166 50 -26 -106 -114 -165 107 -159 -270 -19 55 -339 30 -36 -24 55 -272 -101 -66 -195 72 252 -160 -63 -255
6744 -255 171 -14 51 117 -30 -102 14 -131 -149 -70 -151 -60 -26 36 125 -5 -166 -271 37 152 -182 193 -13
6767 -13 -303 -45 -167 145 155 16 -131 253 64 -56 186 -161 56 -162 49 28 -106 -168 76 -257 212
$$ packed form
6597B16k45N6J5J6o7J29q7J17k88J45j76K78j04R2Qm9q7j74l1K55Q0P3k40J2j59
6622b15J43J78l39M28k51M33l72j27J91j61J06K7%k17R2J02l1Q7J17m28jL42j49
6645d5Q1J5k3k3n9K30p4O0j78N9O7l7J42l10p1P4J67J47l31J60q3j83K91k31P2
6670h3rm7Q1J64k7k2n5M4p6Q4o3M0o5J51k38O9k3Nj8N6N0J07k37P0J07k11M1J10
6698Ej76K24n10M36j21j62L48O1j07K67j26o0N9N5l01J77j14J47k14L92k24k22
6720a66K16p6q0qn1K72k66j11K51P4l94L69o6J2P9l27J71L5j29K67J80m12R7j92
6744b55M26j85O5O6j47p2J16j45j8P9q1R1L4O2Q9j30j61j05L08J15l34L75k06
6767a3k90K58j22L12J0j39j47L84j89j20K42l47K17k18K11k1j34o2K44l33M69
$$ plain form
6788 212 233 -102 165 110 -49 -120 -72 -204 43 172 -206 59 328 62 -52 326 -276 -33 -2 132 233 -53
6810 -53 132 -25 45 296 -222 -28 -159 -19 -237 -106 50 -310 -117 82 7 -55 -51 103 106 -148 -192 -30 -113
6833 -113 -54 -93 -212 183 187 55 135 99 -82 122 -10 -105 70 143 -36 97 -36 -227 28 -122 -135 69 -109
6856 -109 82 11 -46 156 15 39 -179 -36 -203 26 172 -150 -119 -60 13 254 40 90 -125 -258 -23 -66 61
6879 61 -205 240 -10 3 -139 38 -305 -315 -166 207 19 16 -47 27 -196 49 -97 201 -147 -110 224 178 176 -169
6903 -169 129 112 31 155 192 10 -1 -157 -142 139 125 136 -18 -67 226 -172 6 -125 93 -101 -212 163 70
6926 70 72 65 15 -31 -14 -186 227 153 -73 110 -120 112 364 44 258 -182 -387 11 -189 -23 -158 182 62
6949 62 11 78 -257 120 43 -119 -137 53 168 65 130 -138 19 153 148 204 9 154 -14 -38 -221 -93 17
$$ packed form
6788B12K1l35K67n5j59p1M8j32K47J29l78K65K69k66j14L78o02K43L1J34J01k86
6810e3J85j57P0K51n18J94j31J40k18J31J56l60J93J99p5o2MJ54Lk54m4J62q3
6833a13N9l9j19L95Mj32Q0l6j81K04j32r5J75P3j79J33j33j91K55j50j3K04j78
6856a09J91p1n7K02j41K4k18J43j67K29J46l22L1N9P3K41k14N0k15j33K35m3J27
6879F1k66M45k50J3j42J77l43j0J49L73j88lo3P4k23K45j46K98l48L7L34m6kl45
6903a69K98j7q1J24L7j82j1j56J5K81j4J1j54m9K93l98J78j31K18j94j11L75r3
6926G0Kpn0m6J7j72M13p4k26J83k30K32K52l20K14m40k05L98k00J66j35L40j20
6949F2n1O7l35L77p7j62j8J90J15j03O5k68J57J34nN6j95J45j68k4j83J28J10
$$ plain form
6972 17 -27 111 -409 -71 185 -30 19 -278 152 54 142 -90 79 119 -80 73 80 332 -30 -133 163 51 272
6995 272 -374 206 79 -345 280 -263 -197 -295 -83 -453 145 8 -87 125 51 96 -151 -251 88 11 172 52
7017 52 152 -111 233 -345 -124 -49 185 -63 53 -145 -64 -24 -26 61 -291 -133 -45 -128 -132 261 -98 415 -194 45
7041 45 244 -79 84 178 225 55 -89 -201 176 0 -164 -104 -137 -54 -257 -249 -136 9 -218 -107 183 63 -132
7064 -132 134 0 -8 32 -140 55 28 -5 6 42 56 -186 -77 -8 70 -305 154 -57 -112 -108 0 28 -48 -179 -185 169
7090 169 167 -28 122 15 -247 247 -69 -150 23 69 -59 -61 -271 -19 55 -50 -121 -18 69 -112 221 187 -42
7113 -42 -43 36 -238 -40 -71 14 180 -81 -79 16 -91 36 -100 -13 -3 -55 -93 40 18 36 3 254 -44 12 62 -32
7139 -32 87 -114 -90 157 116 37 -183 -120 -44 -69 297 102 -157 119 290 95 -1 9 253 -123 -49 105 -44
$$ packed form
6972A7m4J38n20L38K56k15M9k97M30r8Q8k32J69M0j99J53PK52l62j03K96j12K21
6995B72o46N80j27m24O25n43O6r8K12l70N98j37r5K12p4M5k47j00L39p7J61j20
7017E2J00k63L44n78K21P5K34k48J16j98Q1M0kQ7l52J58Q8q3mL93l59N13o09K39
7041D5J99l23J63R4M7j70j44j12L77j76j64O0l3Q3k03QJ13J45k27J11K90j20j95
7064a32K66j34qM0j72J95k7l3J1L6J4k42J09O9P8l75M59k11n5MJ08K8p6j31oL54
7090A69kj95J50j07k62M94l16q1J73M6j28kk10K52P4j05p1J03Q7j81L33l4k29
7113d2jP9k74J98l1Q5J66k61KR5j07J27j36Q7J0n2l8J33k2J8l3K51k98N6N0r4
7139c2J19k01K4K47m1p9k20O3P6k5L66j95k59K76J71j95r6J0K44l76P4J54j49
$$ plain form
7162 -44 -31 159 159 -73 280 49 86 -15 -6 22 149 -20 221 172 -121 -28 -84 63 -85 14 206 320 10 0
7186 0 -274 35 63 -30 -10 21 3 17 -77 8 90 291 -47 -234 -27 -118 8 -351 102 -59 -10 13 302 11 -252
7211 -252 28 -116 -118 -115 -178 114 -6 -21 143 -136 -106 76 248 -1 279 140 40 164 254 49 -21 -49 -152
7234 -152 132 -137 223 -85 -5 -20 -13 -77 60 133 100 12 -235 -282 90 -37 -164 -235 -85 -38 -9 -77 -322 39
7258 39 -117 -356 -102 -138 378 280 -254 19 -233 111 71 -116 -224 -12 276 -123 96 21 -126 -40 -5 -288
7280 -288 -30 -144 -22 -193 2 144 195 -123 -60 12 113 53 -34 168 -117 -136 92 41 -30 68 257 -39 123
7303 123 -126 -82 103 -81 64 -146 -42 -25 103 248 35 -90 -192 -30 -77 191 -101 0 -61 81 47 -353
7325 -353 -248 136 109 63 93 9 -268 -263 112 162 59 -94 -2 -48 28 -198 -279 5 192 121 -93 -162 -84 -74 327
$$ packed form
7162d4J3J90%k32L53k31L7j01RK8J27j69K41m9k93R3n6J47j48R9J92J14l10j0
7186@k74L09K8r3K0L1j8J4r4Q5Q2K01l38j87K07r1J26l59M53j61M9K3K89k91k63
7211b52K80j44kLo3K92j20j5J64k79L0J82J72k49K80j39j00J24R0k05p0k8j03
7234a52K84k69L60l08Q0j5Po4J37P3l3q8k47m7L72j27j27p1J50M7K9o8k45L61
7258C9j56k39K54l6N16r8n34K73k52L44m0j87j08K12K88l99K19p5j47Q6L5k83
7280b88K58j14J22j71J95J42N1l18O3P2J01o0q7K02k85j9K28n1p1R8J89k96J62
7303A23k49M4J85j84J45k10J04J7J28J45k13j25j02J62m7K68k92J01o1J42l4m00
7325c53J05L84k7m6L0q4k77NL75N0j03j53R2m6P6k26q1K84J87p1k14o9P8J0M01
$$ plain form
7350 327 -174 -121 116 154 -149 -119 46 166 -109 -255 158 -160 -72 225 51 -35 112 -29 -136 -25 290 -206
7372 -206 -14 148 -21 167 -378 37 52 64 106 61 29 59 -47 117 66 149 23 90 53 225 -48 -248 50
7395 50 206 -18 242 -55 -18 -214 37 110 -41 -139 -81 168 32 67 -48 215 -6 109 -77 115 106 -81 -101
7418 -101 -176 122 -236 -65 -115 186 78 -407 -91 14 15 -81 113 -25 34 21 127 -28 30 160 179 46 -119
7441 -119 10 -12 22 -136 -73 32 -75 88 104 -287 -70 139 235 -4 -121 97 84 -55 -25 -93 -114 -168 139
7464 139 333 -189 -156 74 -48 -85 -31 189 159 234 223 -44 -23 40 -112 134 57 -29 172 -68 48 19 123 -71
7488 -71 47 -57 -36 50 -38 -31 -172 21 -186 53 -128 93 21 184 -38 72 174 248 -72 -151 292 -42 20
7511 20 88 100 -68 -84 -353 -7 -62 89 -157 0 179 3 -81 120 141 -40 -22 53 -20 -12 41 78 190 -104 -9
$$ packed form
7350C27n01N3K37L8l03L0J65J20k75j46M13l18Q8K97j74q6J47j41j07J11L15m96
7372b06J92J62j69J88n45M15J5J2M2m5l2L0j06J64n1Q3j26O7l7J72k73k00K98
7395E0J56k24K60k97L7j96K51P3j51r8N8K49j36L5j15K63k21J15j86J92rj87k0
7418a01p5K98l58J71n0L01j08m85L16J05Jr6J94j38N9j3J06j55N8J30J9j33j65
7441a19J29k2L4j58O3J05j07J63J6l91K17K09R6k39j17K18j3j39L0o8k1n4L07
7464A39J94n22L3K30j22l7N4K20l0P5j1k67K1O3j52K46p7q6K01k40J16k9J04j94
7488g1J18j04K1Q6q8Pj41J93k07K39j81K21p2J63k22J10J02P4l20p9M43l34O2
7511B0O8J2j68j6k69L46n5J51k46J57J79j76q4K01K1j81J8P5p3QN3L7J12k94R5
$$ plain form
7536 -9 71 245 110 -256 78 -195 -283 -76 -62 61 16 175 55 78 -82 130 -39 -11 24 -61 -65 -306 -247 -144
7560 -144 -112 229 -161 96 -73 63 89 406 -75 84 -115 0 -105 224 88 146 -82 2 141 219 108 -68
7582 -68 225 -36 -31 28 -21 156 -92 -126 -182 64 -342 204 -390 -42 -20 -143 20 -128 -123 31 -114 145 -9
7605 -9 -96 155 36 179 144 -43 -17 286 55 -164 393 192 -184 48 63 274 -7 126 189 23 -100 -252
7627 -252 -321 343 407 10 -25 -82 -30 69 -135 63 -269 106 -79 -81 119 -42 -249 -239 185 -273 -54 -71 176
7650 176 -60 -183 -94 -116 242 -124 18 -82 -151 296 -193 -200 -86 -210 127 -17 -35 2 5 33 -146 -72 76 -296
7674 -296 112 38 23 187 -120 -84 -125 71 -14 359 211 -30 -144 -16 94 72 -170 -93 68 279 -53 78
7696 78 153 -128 192 -20 -203 204 72 -21 18 -117 305 251 -42 295 64 72 -79 140 103 174 178 -70 113 288
$$ packed form
7536iQ0J74j35l66L34k73q8K07J4J23m5J59j20K3j60K12j69K8L5q5mk41N9J03
7560a44L2L41l90K57j69J36K6L17m81J59j99J15j05L29j36N8k28Q4J39P8j11j76
7582f8K93k61NN9m9J77k48l4n6K46m06N46n94L48K2j23J63j48NJ54j45K59j54
7605iq7K51j19J43l5j87K6L03k31k19N57k01l76K32J5K11k81J33O3j66j23j52
7627b52o9O64O4l97l5n7N2R9k04J98l32L75j85kK00j61k07J0M24m58K19j7K47
7650A76k36j23Q9k2L58l66J42j00o9M47m89pJ14j24L37j44j8L7LK8j79P4J48l72
7674b96M08p4j5J64l07L6m1J96q5L73j48k41j14J28J10k2k42P7J61K11l32J31
7696G8P5k81L20k12j83M07j32r3L9j35M22n4k93L37k31Qj51K19l7P1Mk48J83J75
$$ plain form
7720 288 167 -14 -35 -74 241 -124 -97 -142 247 42 96 -37 135 129 3 162 -282 8 13 -116 197 240 -212
7743 -212 -250 -102 -20 254 -258 33 47 172 -49 -263 56 -155 71 -84 -80 89 -108 -188 -17 72 -134 69
7765 69 58 -71 -132 103 247 253 -130 -282 294 56 -56 -182 -65 103 13 169 -216 -119 -148 -43 169 21 -294
7788 -294 -67 1 -223 17 -176 -225 -17 -66 -191 151 160 28 52 -135 78 -21 -28 -87 -34 59 66 -63 174 82 133
7813 133 -55 -194 -66 97 164 38 -128 80 237 -34 -223 102 -105 -177 149 132 127 45 -92 -71 18 110 19
7836 19 69 -14 51 271 -31 61 -219 74 -184 3 253 127 -24 94 96 111 -122 -54 -139 258 55 105 81 -55
7860 -55 163 33 -111 -185 39 49 -37 120 -149 141 185 108 124 -36 -127 -35 46 161 -69 -140 33 6 -53 -188
7884 -188 108 -4 158 -88 71 111 -181 75 48 -63 21 324 99 26 88 193 -61 -101 48 -34 51 -195 213
$$ packed form
7720B88j21j81k1l9L15l65K7m5L89k05N4j33J72oj26J59m44K90Nj29L13M3m52
7743b12l8J48Q2K74n12K91J4J25k21k14L19k11K26j55MJ69j97q0J71Q9k06K03
7765F9j1j29o1K35J44Ol83j52N76k38j12j26J17J68r0J56l85R7k9J05K12j48l15
7788b94K27O8k24K40j93m9K08m9j25L42Rj32K4j87K13r9pn9N3R3Pj29K37r2N1
7813A33j88j39J28J63O7j26j66K08J57k71j89L25k07p2L26j7nq2j37K1Q9R2r1
7836A9N0q3O5K20l02R2k80K93k58J87K50j26j51J18KJ5k33O8q5L97k03N0k4j36
7860e5K18j30j44p4K24J0q6J57k69K90M4p7J6j60r1R2Q1J15k30p1J73k7n9j35
7884a88K96j12J62k46J59M0k92K56k7j11Q4L03k25p3O2J05k54m0J49q2Q5k46M08
$$ plain form
7907 213 -88 44 -101 28 -24 -22 129 142 61 -26 46 159 -364 -145 -38 11 133 -129 -343 -112 -18 -126 -174
7930 -174 -194 -34 -95 42 115 -191 -61 233 54 -16 164 183 -134 5 -4 212 116 -21 30 -125 115 -34 107
7953 107 -78 34 254 74 204 -164 82 -79 -67 97 33 -145 46 180 -97 43 70 -120 -289 231 9
7974 9 276 -18 -96 -54 -151 44 -7 120 -36 139 168 62 69 20 211 252 34 -165 113 29 -17 -87 -174 15 -93
7999 -93 -119 -284 216 -177 -46 133 100 142 -182 41 13 -280 20 74 -150 56 -83 -8 224 86 -180 -185 316
8022 316 -166 -50 283 141 219 -22 -140 337 -171 34 160 53 185 149 -218 -141 141 -115 -81 38 182
8043 182 266 305 204 -302 263 -154 -155 -63 -136 45 -184 -218 15 200 -270 -110 107 67 -90 68 -80 62 92
8066 92 -19 189 -109 122 -126 26 -76 -41 -187 74 47 -72 -33 46 48 -154 12 139 63 1 -89 58 90 -98
$$ packed form
7907B13l01J32j45J29n2KJ51J3q1q7P2J13n23K19J07M9J22k62k14K31R4j08m8
7930a74k0J60o1J37P3l06J30K94j79p0J80J9l17J39rK16r6j37N1j55K40j49J41
7953A07j85J12K20j80J30l68K46j61J2J64o4j78J91J34k77J40K7j90j69N20k22
7974IK67k94p8M2r7J95n1J27j56J75K9j06Pm9J91M1k18j99K78q4m6p0q7J89j08
7999i3k6j65N00l93J31J79l3M2l24K23k8k93L00N4k24K06j39P5K32j38k66nN01
8022C16m82J16L33j42P8k41j18M77n08K05J26j07J32l6l67P7K82k56L4J19J44
8043A82Q4L9j01n06N65m17jR2p3J81k29l4K33J85m70J60K17m0j57J58j48J42L0
8066I2j11K08k98K31k48J52j02L5j46K61k7j19L9P9Kk02J66J27p6o2r0J47L2j88
$$ plain form
8090 -98 -128 222 8 -159 196 -167 92 -13 103 207 -123 -70 29 202 21 156 -212 12 -32 181 57 -148
8112 -148 -127 -207 56 -88 184 161 -113 24 12 -9 41 190 209 83 0 -88 -23 99 -160 398 157 -12 -29 -1
8136 -1 -87 -10 185 -242 98 16 -68 -188 151 -18 72 -201 -160 180 -38 277 -8 -41 -75 -36 -31 -235 -154 37 -212
8161 -212 -61 23 237 82 -144 105 142 -3 175 87 -32 -110 178 -374 324 -65 119 -165 32 35 -34 1 -121
8184 -121 -247 -128 -465 250 13 126 -187
$$ packed form
8090i8l0L50k14j67L55l63K59j05J16J04l30N3R9J73j81J35l68K24m4K13j24k05
8112a48K1q0K63j44K72k3k74J37j2k1N0J49J9j26q3q8O5J22k59N58k41j69j7K8
8136aq6P7J95m27L40q2q4j20L39j69R0k73M1L40k18L15k85l3l4L9Nk04Q1J91k49
8161b12J51Q4K14j55k26K49L7j45J78q8j19p8K88n52O98l89J84k84J97Lo9L5j22
8184a21j26J19l37P15k37J13l13
8191a87
$$ Imaginary data points
##PAGE= N=2
##DATA TABLE= (X++(I..I)), XYDATA
$$ plain form
0 0 0 0 0 0 0 0 0 0 0 0 0 0 0 0 0 0 0 -5 8 -8 8 -8 8 -12 16 -16 17 -24 24 -30 32 -38 41 -48 54 -59 66 -74 83
39 83 -95 104 -114 127 -141 155 -171 190 -209 232 -254 281 -306 340 -374 414 -461 512 -572 642
59 642 -726 827 -954 1116 -1334 1639 -2100 2866 -4387 8500 -41913 -116054 15147 72450
73 72450 1704 -52023 -12950 27656 7760 -10936 24242 14586 -21091 12317 42833 2250
85 2250 -20265 9105 42279 16939 -41927 -24484 42936 29922 -19537 -19933 -733 12862 13792
98 13792 2911 3422 -8412 -16912 16424 25290 -10956 -15347 -1393 -3945 -2999 -5067 -6262 -4018
112 -4018 -13359 -5864 8413 -9009 -10924 11391 4258 -9116 -8249 -1722 19600 15658 -20674 -20473
126 -20473 8267 13674 1794 -14308 -9498 8060 -3925 -6525 16668 3443 -18789 1049 15692
$$ packed form
0@%%%%%%%%%%%%%%%%%nJ3j6J6j6J6k0K8l2L3m1M8n4O2p0P9q9J02j13J25j40J57
39H3j78J99k18K41k68K96l26L61l99M41m86N35n87O46p14P88q75R73j084J214
59F42j368J553j781K070k450K973l739M966p253J2887n0413p4141J31201N7303
73G2450p0746n3727L9073M0606j9896j8696L5178r656l5677L3408L0516m0583
85B250k2515K9370L3174k5340n8866J7443O7420j3014m9459l96J9200J3595R30
98A3792j0881N11j1834q500L3336Q866l6246m391J3954k552R46k068j195K244
112d018r341P495J4277j7422j915K2315p133j3374Q67O527K1322l942l6332K01
126b0473K8740N407j1880j6102M810J7558j1985k600K3193j3225k2232J9838J4643
$$ plain form
139 15692 4197 -5826 -1512 13963 2170 -22775 588 22959 -5186 -20072 -2489 9749
151 9749 6190 -9637 -5204 17185 2977 -16641 4892 18255 6910 -2372 -6647 2171 9962
164 9962 1539 3343 1209 -13937 1843 19595 140 -10022 587 6796 5505 -3884 -3347 10703
178 10703 3327 -7006 413 -4266 -4386 9226 -2095 -17517 -7676 2744 5306 -4047 -16791 -3192
192 -3192 6619 -6261 -4893 1062 -3285 127 -1833 -7133 3110 2700 -5187 -1880 -5125 -2284 9315
207 9315 1533 -5904 635 1000 5654 7172 -2433 3317 8221 -668 3914 7559 -843 3261 5006
222 5006 -1608 1443 2766 3435 6330 -3682 -4006 8102 2056 -2373 5075 -1048 -3786 2800 983
237 983 1336 -1564 -8072 -513 2409 -4932 -857 -2705 -7617 2520 1242 -8225 -2335 641 31 215
$$ packed form
139A5692j1495j0023M314J5475j1793k4945K3363K2371k8145j4886J7583J2238
151I749l559j5827M433K2389j4208j9618K1533J3363j1345r282m275Q818P791
164I962q423J804k134j5146J5780J7752j9455j0162J0609O209j291r389N37J4050
178A0703p376j0333P419m679j20J3612j1321j5422R841J0420K562r353j2744J3599
192c192R811j2880J368N955m347L412j960n300J0243m10p887L307l245K841J1599
207I315p782p437O539L65M654J518r605N750M904q889M582L645q402M104J745
222E006o614L051J323O69K895j0012l24J2108o046m429P448o123k738O586j817
237I83L53k900o508P559K922p341M075j848m912J0137j278r467N890K976o10J84
$$ plain form
253 215 -6740 -2941 6130 -1620 -4537 -975 -4875 1085 5626 -4210 -4244 -378 -336 5323 368 -8001
269 -8001 2433 6425 -655 -436 -1416 1795 5930 -3159 -2769 5869 -610 -903 5257 -1638 -2312 4402
285 4402 1964 2344 -228 -2455 6416 3706 -3982 4457 3524 -3287 2116 2364 -284 2832 -1361 -855
301 -855 4625 -1220 -1251 2585 -2286 360 2638 -3993 104 2349 -3968 -410 -39 -5188 311 256 -4210
318 -4210 -1371 -3440 -2366 2239 -4528 -5319 2263 -2525 -2788 1200 -3929 -1362 2126 -3591 -900 1456
334 1456 -2435 1173 820 -2456 2828 1158 -1427 4535 520 -2287 5580 2487 -993 3839 2250
349 2250 1647 2970 -246 3711 4148 -2758 2504 5444 -1720 1528 3052 -1401 2226 1264 -1481 2610
365 2610 -220 -2391 2363 -1222 -2559 1834 -2262 -1810 1040 -4281 -1433 2558 -4133 -2373 252
$$ packed form
253B15o955L799R071p750k917L562l900N960M541r836l4L866M2N659m955q369
269h001J0434L992p080K19r80L211M135r089L90Q638o479k93O160o895o74O714
285D402k438L80k572k227Q871k710p688Q439r33o811N403K48k648L116m193N06
301h55N480n845l1L836m871K646K278o631M097K245o317L558L71n149N499n5m466
318d210K839k069J074M605o767p91P582m788k63L988n129K567L488n717K691K356
334A456l891L608l53l276N284j670k585N962m015k807P867l093l480M832j589
349B250o03J323l216L957M37o906N262K940p164L248J524m453L627r62k745M091
365B610k830k171M754l585j337M393m096M52K850n321K848L991o691J760K625
$$ plain form
380 252 -3342 -1197 -735 -3587 220 -1657 -3834 2064 -1659 -4287 1910 -629 -2950 1895 -1188 -1331
396 -1331 2126 -1259 -33 1592 -2052 1754 2595 -2460 1843 2583 -2036 2861 2149 -2082 2769 2040
412 2040 -389 2738 -44 567 4248 -595 -14 3848 -1133 456 4220 -1451 289 3127 -1334 1148
428 1148 1599 -1928 1682 624 -2226 1950 -326 -2585 1903 -1569 -2219 2388 -2074 -3482 1328 -1251
444 -1251 -1731 -485 -3504 -355 798 -3686 -799 -829 -3828 1523 71 -5028 -291 411 -1902 621
460 621 -2259 -2554 2083 -207 -310 1003 -3235 836 4838 -1909 -1449 2436 309 2754 1787 -2417
476 -2417 2075 3171 674 2854 -72 -468 5095 1509 -189 2728 -261 620 4937 -471 -1595 2000
492 2000 32 1861 1030 -3152 849 1698 -1852 872 -957 -3109 2142 -268 -4066 659 -390 -2928
$$ packed form
380B52l594K145M62k852L807j877k177N898l723k628O197k539k321M845l083j43
396a331L457l385J226J625l644L806Q41n055M303P40m619M897p12m231M851p29
412B040k429L127k782O11L681m843N81L862m981J589L764n671J740K838m461K482
428A148M51l527L610j058k850M176k276k259M488l472o50M607m462j408M810k579
444a251m80J246l019L149J153m484K887l0k999N351j452n099M737P02k313K523
460F21k880k95M637k290j03J313m238M071M002o747M60L885k127K445r67m204
476b417M492J096k497K180k926l96N563l586j698K917k989Q81M317n408j124L595
492B000j968J829q31m182M001Q49l550K724j829k152N251k410l798M725j049k538
$$ plain form
508 -2928 26 -1174 -1597 -791 -3611 282 1812 -5224 -2315 1844 -1938 -979 -322 -2793 713 266
524 266 -1928 1341 -764 -2676 1606 954 -92 1681 -2810 118 5032 -43 -1514 2199 359 2000
540 2000 2150 -1420 1426 2441 -109 2367 353 -1770 3384 2183 -462 1674 -1214 -911 5291 1617
556 1617 -2813 -1273 696 4171 1890 -5264 -1639 3562 -84 222 -1082 -3933 1697 2073 -3119 -1303
572 -1303 -1201 -1130 1744 -1562 -3261 -499 -1283 1105 1335 -6124 -3527 3843 747 -2952 -3057 -1889 3183
589 3183 1232 -4481 -475 1422 -616 1184 -400 -1125 2288 -856 -200 3432 -1152 -1737 3432 1570
605 1570 -480 216 71 3248 2160 -2133 1714 2952 -623 2644 1892 -1460 2178 1237 -858 1923
621 1923 741 -403 861 -1151 589 2359 -2203 -790 2611 -1856 -1314 777 -1509 167 -945
$$ packed form
508b928K954j200m23Q06k820L893J530p036K909M159l782R59O57k471L506m47
524B66k194L269k105j912M282o52j046J773m491K928M914n075j471L713j840J641
540B000J50l570K846J015k550K476k014k123N154j201k645K136k888L03O202l674
556A617m430J540J969L475k281p154L625N201l646L06j304k851N630L76n192J816
572a303J02P1K874l306j699K762p84K388K30p459K597P370l096l699j05J168N072
589C183j951n713M006J897k038J800j584p25L413l144O56L632m584n85N169j862
605A570k050O96j45L177j088m293L847J238l575L267p52l352L638r41k095K781
621A923j182j144J264k012J740J770m562J413L401m467N42K091k286J676j112
$$ plain form
636 -945 -3084 530 461 -3263 -730 -710 -1446 -381 -2630 -1220 2494 -3100 -3923 1276 453 -669 -155
653 -155 -2534 -389 1191 -1196 707 -41 -2700 1438 1917 -828 966 -579 -543 3604 574 -2188
669 -2188 2035 2291 1266 260 -1355 2582 4127 -1409 -436 2175 81 1906 2131 -1609 686 1451
685 1451 203 1956 303 -1260 1663 -219 -680 1897 -901 -1214 1388 -1529 -979 974 -1635 -722
701 -722 28 -2325 67 573 -2472 -118 -166 -2094 75 -1570 -1842 2196 -1469 -3500 878 511 -983
718 -983 -460 -2009 53 1595 -1539 -77 1182 -1746 752 1973 -865 333 1229 -267 2178 287
734 287 -971 2353 1177 108 1963 -803 390 3014 -5 92 1843 -592 1172 2731 -682 143
750 143 940 -839 1839 805 -1850 805 671 -750 1422 -901 -1676 1663 -478 -1659 -282 -1390
$$ packed form
636i45k139L614o9l724K533K0p36J065k249J410L714n594q23N199q23j122N14
653a55k379K145J580k387J903p48k659M138M79k745J794j545L6M147l030k762
669b188M223K56j025j006j615L937J545n536R73K611k094J825K25l740K295P65
685A451j248J753j653j563K923j882m61K577k798l13K602k917N50J953k609R13
701g22P50k353K392N06l045K354m8j928K169j645k72M038l665k031M378l67j494
718i83N23j549K062J542l134J462J259k928K498J221k838J198Q96j496K445j891
734B87j258L324j176j069J855k766J193K624l019R7J751k435J764J559l413Q25
750A43P97j779K678j034k655K655j34j421K172k323p75L339k141j181J377j108
$$ plain form
766 -1390 -24 1084 -2546 -1764 152 -1067 -200 -941 -3559 238 791 -1906 -358 -1059 -1521 863 -472
783 -472 -1608 438 -752 -355 1026 -1514 -592 2264 -806 -464 907 -820 1241 1437 -860 1112
799 1112 907 -204 2097 934 -571 2321 715 -82 2282 201 -261 1857 -125 366 1676 -667
815 -667 595 1408 -799 862 886 -1391 1110 301 -1558 856 297 -1039 453 -807 -1667 564 -431
832 -431 -900 318 -2315 -976 1065 -2257 -910 418 -1824 -543 -110 -2107 -244 -25 -1562 351
848 351 -523 -1304 1432 -224 -1460 1152 -367 -512 1276 -882 16 1865 -325 589 1454 -341 858
865 858 1411 -886 1692 1204 -725 1730 1087 -464 1897 898 -342 1795 97 41 1406 -426 430
882 430 1587 -1100 173 1474 -1270 -107 888 -1384 469 555 -1682 -19 -524 -1356 645 -893 -1600
$$ packed form
766a390J366J108l630P82J916j219Q67p41k618L797N53k697J548p01m62K384j335
783d72j136K046j190L97J381k540R22K856l070L42J371j727K061J96k297J972
799A112k05j111K301j163j505K892j606p97K364k081m62K118j982M91J310k343
815f67J262Q13k207J661K4k277K501q09j859K414n59j336J492j260q60K231r95
832d31m69J218k633J339K041l322J347J328k242J281M33j997J863K19j537J913
848C51q74p81K736j656j236K612j519j45J788k158Q98J849k190R14Q65j795J199
865H58N53k297K578m88j929K455o43j551K361r99j240K137j698n6J365j832Q56
882D30J157k687J273J301k744J163R95k272J853Q6k237J663n05q32K001j538p07
$$ plain form
899 -1600 684 -1277 -1706 570 -1433 -1190 700 -1559 -1202 152 -1741 -72 167 -1876 189 443
915 443 -1523 618 -57 -1115 1165 27 -963 1270 66 -199 1286 -587 510 1683 -366 759
931 759 1652 -721 1284 1808 -609 1264 1432 -220 1359 816 -628 1639 397 -103 1524 -523 -503
948 -503 1851 -536 -133 1475 -1072 58 791 -997 -70 140 -1384 533 -13 -1941 328 -638 -1403
965 -1403 364 -1045 -1717 541 -1064 -1283 185 -1254 -1098 726 -1315 -521 98 -1454 397 795 -1647
982 -1647 273 642 -1282 728 190 -1199 1242 441 -270 1049 -254 322 1854 -453 31 1904 -584
999 -584 597 1674 -284 403 1417 41 1047 569 -584 1534 660 -576 1346 90 -727 1329
1015 1329 -180 -832 892 -624 -664 699 -786 -252 238 -1568 224 444 -1883 -290 51 -1482 -256
$$ packed form
899a600K284j961m29K276k003K43J890k259L57J354j893J669K39k043K065K54
915D43j966K141o75j058K280j138r90K233j204k65J485j873J097J173k049J125
931G59Q93k373K005N24k417J873J68j652J579n43j444K267j242n00J627k047K0
948e03K354k387M03J608k547J130P33j788R27K10j524J917n46j928K269r66p65
965a403J767j409o72K258j605k19J468j439J56J824k041P94O19j552J851L98k442
982a647J920L69j924K010n38j389K441q01p11J319j303N76J532k307M84J873k488
999e84J181J077j958O87J014j376J006m78j153K118q74j236J922j256q17K056
1015A329j509o52J724j516m0J363j485N34M90j806J792K20k327J593L41j533J226
$$ plain form
1032 -256 -470 -1577 410 -868 -1511 297 -1145 -1257 589 -865 -363 420 -1545 102 1111 -1532
1048 -1532 -403 1026 -371 461 142 -967 641 530 -348 1330 -81 -216 1625 67 -174 1650
1064 1650 128 320 1638 -293 231 1024 160 1455 857 -1076 1236 1247 -728 506 412 -381 1296
1081 1296 -123 -905 1118 -446 -566 773 -874 -489 54 -1351 -37 100 -1913 -362 451 -1527
1097 -1527 -554 -264 -1268 399 -395 -1759 251 -603 -890 349 -1179 -667 775 -1056 -768 1100 -961
1114 -961 -379 811 -446 466 28 -516 1140 464 -849 936 525 -351 1265 317 -506 1334 37
1131 37 68 1696 151 -218 1214 -276 999 925 -812 552 1179 -459 416 408 -993 1039 558 -1092
1149 -1092 589 -96 -714 539 -424 -509 236 -1198 -56 944 -1673 -736 1166 -1054 -842 -376 -1297
$$ packed form
1032b56k14j107J987j278o43J808j442j12J846j454N02P83j965J647J009k643
1048a532J129J429j397Q32l19j109J608j11q78J678j411j35J841j558k41J824
1064A650j522J92J318j931N24P93q64J295n98j933K312J1j975J234r4p93J677
1081A296j419p82K023j564j20J339j647L85N43j405J314J37k013J551Q13j978
1097a527R73K90j004J667p94j364K010q54k87J239j528N12J442j831K88J868k061
1114i61N82J190j257R12m38n44J656o76j313J785m11q76J616r48q23J840j297
1131C7L1J628j545l69J432j490J275p4j737J364O27j638Q75qj401K032m81j650
1149a092J681o85o18J253r63q5P45j434J142J000k617R37J902k220K12M66r21
$$ plain form
1166 -1297 682 -276 -1679 -73 -352 -1399 704 -302 -1408 528 -439 -676 951 -920 -555 1036
1182 1036 -299 162 713 -500 659 966 -1040 974 866 -345 836 368 -517 1407 549 -184 1413
1199 1413 226 193 1294 129 403 1223 -496 460 1136 -915 462 841 -647 434 317 -919 463
1216 463 30 -935 483 -642 -1028 515 -1035 -872 481 -1264 -740 597 -957 -536 -92 -1375 57
1233 57 358 -1280 -100 -175 -1418 193 -150 -817 668 -422 -737 909 -485 -537 990 -387 -372 932
1251 932 -433 263 764 -733 359 956 -388 795 937 -584 1339 770 -505 1157 107 -87 1296
1268 1296 205 -21 1328 -264 -63 1007 -698 23 854 -750 267 271 -864 563 321 -1337 349
1285 349 -257 -1013 502 -528 -911 332 -895 -688 421 -1203 -856 462 -1047 -381 338 -1159 -482
$$ packed form
1166a297J979r58j403J606k79j047K103j006j106J936r67k37J627j871L65J591
1182A036j335M61N51j213J159L07k006K014j08j211J181m68q85J924q58p33J597
1199A413j187l3J101j165K74Q20j719R56O76k051J377L79j488J081j17j236J382
1216D63m33r65J418j125l86J543j550J63J353j745N24J337j554M21M44j283J432
1233E7L01j638J180p5j243J611l43o67J485j090l15J646j394n2J527j377J5J304
1251I32j365O96N01j497J092N97j344J183J42j521J923n69j275J662j050j94J383
1268A296j091k26J349j592K01J070j705P21Q31j604J017Mj135J427k42j658J686
1285C49o06p56J515j030l83J243j227K07J109j624L47J318j509O66P19j497O77
$$ plain form
1302 -482 -1 -974 -17 80 -1123 489 201 -953 559 53 -406 556 -154 -85 1148 -415 14 1290
1320 1290 -335 53 982 -174 451 682 -342 1057 827 -365 810 426 -137 885 173 -243 876
1337 876 -100 -349 890 -585 92 858 -779 6 523 -856 -51 360 -1105 160 -107 -1010 116 -395
1355 -395 -919 281 -535 -948 184 -674 -909 388 -799 -533 482 -903 -394 344 -889 251 268 -721
1373 -721 1 15 -415 487 65 -590 550 -28 -651 1146 -11 -160 1099 134 55 1006 79 826 864 -336
1393 -336 656 797 -190 599 678 -406 827 417 -345 950 55 -398 705 -232 -566 579 -374 -267 607
1412 607 -646 -106 249 -952 -248 221 -1134 65 -4 -738 46 -347 -733 393 -292 -1228 296 -610
1430 -610 -710 386 -768 -400 637 -904 -212 601 -782 216 542 -602 329 370 -639 719 290 -634
$$ packed form
1302d82M81r73R57R7j203J612k88j154J512n06m59R62p10O9J233j563M29J276
1320A290j625L88R29j156O25K31j024J399k30j192J175l84n63J022p12m16J119
1337H76r76k49J239j475O77P66j637P85N17j379Q05M11j465J265k67r03J126n11
1355c95n24J200q16m13J132q58k35J297j187K66J015j385N09P38j233J140J7r89
1373g21P22J4m30R02m22o55J140n78o23J797j157j49J259r65p9R51r27P47L8j200
1393c36R92J41r87P89P9j084J233m10p62J295q95m53J103r37l34J145r53J07Q74
1412F07j253N40L55j201P04M69j355J199o9p34P84l93l86J126o85r36J524r06
1430f10j00J096j154L68J037j541O92Q13j383R98L26j144R31M1j009J358m29r24
$$ plain form
1448 -634 899 380 -131 836 151 -122 992 -180 309 1322 -150 420 695 -466 500 806 -181 655
1466 655 584 -554 529 172 -597 659 -278 -453 712 -504 -633 588 -636 -471 362 -1082 -350 125
1484 125 -906 -287 -38 -945 -79 -234 -915 -61 51 -797 364 -458 -647 266 -477 -538 262 -519 -221 309
1504 309 -729 58 710 -576 329 703 -357 634 461 -398 705 306 -492 1169 303 -152 1196 -39
1522 -39 147 1049 -74 -114 1014 -398 97 702 -432 443 650 -3 465 579 -368 484 -240 -722 630
1541 630 -292 -654 320 -372 -560 363 -356 -526 125 -1140 -237 98 -941 -125 -127 -1095 -16 -173 -1092 -47
1561 -47 -198 -721 109 -158 -689 428 -397 -403 647 -586 -360 540 -442 113 757 -614 266 533 -582
1580 -582 577 508 -159 589 341 -212 1025 232 -182 1056 166 -145 1045 -65 -151 673 -255 226 664
$$ packed form
1448f34J533n19n11R67o85k73J114j172M89J013j472N70K75j161R66L06r87Q36
1466F55p1j138J083l57p69J256r37j75J165j216j29J221j224J65Q33j444P32M75
1484A25j031O19K49r07Q66j55o81Q54J12q48J161q22j89R13p43o1Q00p81K98N30
1504C09j038P87O52j286R05L74j060R91j73q59J103l99p98J661q66m55J348j235
1522c9J86R02j123m0J128j412M95O05j134Q75K07o53M68J14r47Q52p24m82J352
1541F30r22l62R74o92j88R23p19j70O51j265R03L35j039Q16kr68J079j57r19J045
1561d7j51n23Q30k67n31J117q25oJ050j233K26R00r82N55O44j371Q80K67j115
1580e82J159o9o67P48k48n53J237p93m14J238q90l11J190j110q6Q24r28M81M38
$$ plain form
1599 664 -190 303 463 -346 372 203 -471 52 129 -726 539 -62 -453 491 -196 -688 270 -497 -499 232 -842
1620 -842 -486 62 -546 -219 101 -922 -219 -39 -677 -97 -170 -665 455 -231 -425 547 -130 -363 516 -520
1640 -520 -17 693 -255 -157 895 -83 433 687 -107 738 211 -135 658 236 -237 818 656 -57 650 -63
1660 -63 -138 824 -356 74 675 -133 -22 436 -431 337 638 -622 150 46 -742 310 -194 -521 226 -291
1680 -291 -745 411 -520 -253 151 -762 -294 144 -713 -234 23 -690 20 -136 -772 -168 -157 -549 514 -201
1700 -201 -596 540 100 -499 620 37 -250 686 -201 -366 812 -138 106 390 -68 653 311 -53 927
1719 927 265 -222 1148 348 -460 633 145 30 730 -193 -371 780 -64 34 340 -254 161 192 -942
1738 -942 5 409 -1051 75 -17 -776 38 -194 -659 161 -420 -391 224 -395 -453 422 -448 -521 32 -621 -236
$$ packed form
1599F64q54M93J60q09P18j69o74N23P7q55J265o01l91R44o87m92R58p67kP31j074
1620h42L56N48o08L27L20j023P03J80o38N80p3m95J120o86j94R72o77k33Q79j036
1640e20N03P10r48R8J052r78N16K54p94Q45n27l46P93m22m73J055j62p13P07p13
1660f3p5R62j180M30O01q08J11M58q67P68L01j260P72j04p88J052n04l27P47n17
1680b91m54J156r31K67M04r13M68M38q57M79K57p13P10j56o36O04J1l92J063p15
1700b01l95J136m40n99J119n83k87R36q87j65J178r50K44K84m58P21l42l64R80
1719I27o62m87J370q00q08J093m88j15P00r23j78J151q44R8L06n94M15L1j134
1738i42R47M04j460J126r2p59Q14k32m65Q20n81K9O15o19n8Q75q70p3N53o53L85
$$ plain form
1759 -236 294 -388 -56 528 -510 158 136 -380 369 206 -274 223 190 -94 638 175 177 671 136 46 657
1780 657 -201 384 603 -319 352 622 -256 536 558 -106 531 345 -375 585 164 -220 579 -132 -188 397 -358
1801 -358 -198 464 -575 -186 439 -476 -88 -119 -849 74 44 -865 62 -236 -817 74 -368 -860 24 -192
1821 -192 -659 140 -550 -321 294 -474 -4 247 -387 -168 433 -377 76 336 -399 250 20 -247 690 219
1841 219 -197 442 113 -192 651 94 47 650 91 296 825 -663 219 751 -194 487 417 -147 439 195
1861 195 -193 320 -159 -291 363 -55 -322 551 -455 -142 147 -773 -320 -115 -555 -163 -71 -590 -70 -116
1881 -116 -754 -124 -233 -435 222 -314 -729 433 -373 -448 210 -388 -151 212 -346 -252 568 -430 129 298
1901 298 -616 267 213 -364 401 492 -395 596 210 5 576 -46 -167 822 223 138 678 -204 154 333 -353
$$ packed form
1759b36N30o82L32N84j038O68k2n16P49j63m80M97l3k84P32m63KM94n35r0O11
1780F57q58N85K19r22O71K70q78P92K2o64O37j86p20R60m21l84P99p11n6N85p55
1801c58J60O62j039L89O25r15L88l1p30R23l0r09R27k98n81Q91m42m92Q84k16
1821a92m67P99o90K29O15p68M70K51o34K19O01q10M53K60p35O49k30k67R37m71
1841B19m16O39l29l05Q43n57m7O03n59K05N29j488Q82N32r45O81p0n64N86k44
1861A95l88N13m79j32O54m18k67Q73j006L13K89r20M53K05m40L92R2n19N20m6
1881a16o38O30j09k02O57n36m15J162q06p5O58n98K37L63n58R4Q20r98N59J69
1901B98r14Q83n4n77P65R1q87R91l86k05N71o22j21R89n99q5N40q82L58J79o86
$$ plain form
1922 -353 339 227 -424 239 287 -296 515 -11 -479 224 -109 -140 519 -369 -451 81 -485 -629 -66 -371 -278
1943 -278 152 -689 -208 -292 -685 -83 145 -623 -1 -78 -337 331 -265 -520 431 -209 -143 275 -180 -81 384
1964 384 -296 248 567 -285 284 504 1 410 197 -104 554 456 -125 572 152 -227 633 15 -94 743
1984 743 42 228 667 -19 172 654 -477 87 265 -264 71 146 -250 312 -98 -549 -9 -157 -351 124
2004 124 -593 -729 67 -281 -305 294 -455 -224 -23 -274 -241 -32 -529 -82 14 -466 90 -161 -659 312 -237
2025 -237 -210 267 -177 -282 596 14 -101 434 -269 84 466 -259 194 471 -210 261 251 74 356 219 -36
2046 -36 630 -19 -36 600 154 214 744 -107 94 315 -84 113 326 -411 -103 321 -402 99 131 -272 484
2067 484 59 -480 283 -163 -504 122 -301 -243 -122 -267 -221 107 -553 -214 223 -756 -60 -36 -690 99 -125
$$ packed form
1922c53O92j12o51O63M8n83Q11n26m68P03l33l1O59q88q2N32n66j44N63l05R3
1943b78M30q41M81q4l93O02K28p68O22p7k59O68n96k55R51o40O6M18m55R9M65
1964C84o80N44L19q52N69K20n03M09k13l01O58r8n81O97m20l79Q60o18j09Q37
1984G43p01J86M39o86J91M82j131N64J78n29L35P5l96N62m10m51N40j48j94M75
2004A24p17j36P96l48k4N99p49K31K01k51L3K09m97M47R6m80N56k51m98R71n49
2025b37K7M77m44j05Q78n82j15N35p03L53L82p25M53K77o81M71j0j77K82j37k55
2046c6O66o49j7O36m46O0N30q51K01K21l99J97K13p37L08M24p23N01L2m03P56
2067D84m25n39P63m46l41O26m23N8J21j45M6L28o60L39M37r79O96K4o54P89k24
$$ plain form
2088 -125 -279 316 -107 -287 209 72 -249 470 -48 37 496 -264 260 719 -113 236 492 -119 436 460 210
2109 210 327 208 -121 396 14 -357 400 148 -306 320 347 122 488 -270 -63 169 -145 -189 108 -337 144
2130 144 290 -735 229 106 -700 79 -215 -613 8 -239 -627 98 -193 -565 -112 -213 -546 259 -599 -177
2150 -177 203 -271 -26 424 -394 174 201 -178 129 292 -360 506 -166 -107 522 -177 -245 406 -6 -75 524
2171 524 105 24 489 -50 202 596 -216 145 195 -140 490 132 -280 387 109 -73 303 283 -272 420 -237
2192 -237 -303 234 -229 -95 104 -420 -167 80 -196 -105 254 -340 36 -238 -580 117 -236 -53 -34 -357 -241
2213 -241 185 -343 -290 86 -77 -140 159 -302 219 245 -64 41 273 50 366 563 -201 348 46 138 409
2234 409 181 -346 361 -233 65 458 -125 318 432 -153 54 277 -325 291 174 -266 446 199 -299 287
$$ packed form
2088a25j54N95m23j80M96j37l21P19n18Q5M59p60N24M59q32L49K56o11N55K4k50
2109B10J17j19l29N17l82l71P57k52m54O26K7k25L66p58K07K32l14m4K97m45M81
2130A44J46j025R64j23q06P79k94l98O21k47l88P25k91l72M53j01l33Q05q58M22
2150a77L80m74K45M50q18N68K7l79L07J63o52Q66o72N9O29o99o8O51m12o9N99
2171E24m19q1M65n39K52L94q12L61N0l35O30l58m12O67k78j82L76k0n55O92o57
2192b37o6N37m63J34J99n24K53K47k76R1L59n94L76k74l42O97l53J83J9l23J16
2213b41M26n28N3L76j63o3K99m61N21K6l09J05K32k23L16J97p64N49l02R2K71
2234D09k28n27P07n94K98L93n83M43J14n85K07K23o02O16j17m40P12k47m98N86
$$ plain form
2254 287 -125 -427 234 -181 -15 376 36 -152 188 -407 -223 194 -452 -227 -151 -422 -72 -30 -347 -133 27
2275 27 -320 -95 117 -437 303 -108 -143 89 -118 -65 411 -174 3 283 -98 130 125 -146 177 175 -169 287
2297 287 181 -83 291 137 -135 321 37 181 235 -67 175 228 54 337 342 -340 157 303 -30 446 154
2318 154 -295 303 272 -86 251 -52 -462 167 106 -282 141 -393 -97 65 -283 45 164 -595 269 206 -658
2339 -658 -52 88 -656 98 179 -322 163 -280 -295 13 -85 -409 392 -166 -18 552 -280 -115 290 -196 -54
2360 -54 161 -109 185 578 -239 545 201 -102 279 44 207 555 147 -168 663 88 53 357 78 281 444
2381 444 -123 117 -142 -509 329 257 -326 207 176 -213 186 -185 -326 -137 -177 -359 147 -325 -189 -101 -478
2402 -478 -12 167 -424 -45 421 -383 -19 -41 -277 -55 58 -146 296 -98 -117 348 86 -203 245 -150 -192
$$ packed form
2254B87m12l02O61m15J66L91l40j88L40n95J84M17o46K25P6k71L50M2l17K14J60
2275B7l47K25K12n54P40m11l5K32k07N3M76n85J77K80l81K28nk71L23kl44M56
2297B87j06k64L74j54k72M56k84J44N4l02K42N3j74K83No82M97J46l33M76k92
2318A54m49N98l1l58L37l03m10O29o1l88M23n34K96J62l48L28J19p59Q64o3q64
2339f58O06J40p44P54Q1n01M85m43j5L08r8l24Q01n58J48N70q32J65M05m86J42
2360e4K15k70K94L93q17P84l44l03L81k35J63L48m08l15Q31n75l5L04k79K03J63
2381D44n67K40k59l67Q38p2n83N33l1l89L99l71j41J89m0j82N06m72J36Q8l77
2402d78M66J79n91L79M66q04L64k2k36K22J13k04M42l94j9M65k62k89M48l95m2
$$ plain form
2423 -192 242 -359 202 319 102 245 474 -64 290 379 -167 237 366 -15 345 257 -211 240 116 77 191
2444 191 207 -17 359 -278 325 221 -349 -123 296 -260 124 149 -603 155 117 -367 -109 -381 -621 30 -83
2465 -83 -305 207 -306 -268 132 -412 -87 34 -323 -42 54 -194 153 23 -349 182 149 -231 484 115 -132
2486 -132 455 126 -397 299 122 172 327 -46 112 618 -52 374 530 -42 442 38 -112 411 122 -132
2506 -132 324 197 -346 79 -121 50 158 -171 101 209 -101 -46 271 -283 -244 -81 -192 312 128 -667 41
2527 41 -191 -243 194 -250 -419 -85 -180 -302 337 -4 -110 277 -185 -285 176 -459 -123 314 -432 -176 86
2548 86 -278 101 230 -172 358 -31 -265 579 187 -179 406 21 -165 297 41 -56 338 -270 116 454 222
2569 222 11 385 -123 467 24 64 302 119 -200 280 186 -195 377 -210 -51 142 -202 -48 72 -175 -310
$$ packed form
2423a92M34o01N61J17k17J43K29n38L54Q9n46M04J29l81L60q8m68M51j24l9J14
2444A91J6k24L76o37O03j04n70K26M19n56L84K5p52P58l8m84K58k72k40O51j13
2465h3k22N12n13L8M00n44L25J21l57K81R6k48L47j30l72N31l3l80P15l69k47
2486a32N87l29n23O96j77N0J55l73J58N06o70M26J56n72M84m04j50N23k89k54
2506a32M56j27n43M25k00J71J08l29K72J08l10N5L17n54L9J63j11N04j84p95P08
2527D1k32n2M37m44j69L34r5j22O39l41j06L87m62j00M61o35L36M37p46K56K62
2548H6l64L79J29m02N30l89k34Q44l92l66N85l85j86M62k56r7L94o08L86L38k32
2569B22k11L74n08N90m43M0K38j83l19M80r4l81N72n87J59J93l44J54J20k47j35
$$ plain form
2590 -310 392 -78 -90 2 -500 36 -103 -316 3 -167 -242 321 -235 -238 39 45 -215 282 -65 -212 -49 -284
2612 -284 -198 65 -481 180 346 -253 202 -50 -149 351 121 -113 366 220 72 322 -98 22 211 9 58
2633 58 433 38 -17 270 -306 373 23 -150 243 126 86 300 294 -70 112 -47 -232 254 43 -256 220 -296
2655 -296 -129 38 -357 -18 166 -199 -3 -176 -225 -128 225 -358 -16 -51 -394 35 -299 -120 244 -87 -90 470
2677 470 -115 -124 68 -282 29 103 -82 346 -50 -161 281 295 -16 442 149 -166 419 392 38 290 29 122
2699 122 444 -530 78 139 -23 65 120 -345 -82 392 -194 -21 35 -74 174 49 98 116 -96 -431 48 -116
2721 -116 -101 91 -187 -186 391 -277 -166 -19 -385 -57 13 -547 186 33 -190 145 167 -196 178 95 -207 70
2743 70 -319 -112 102 114 -68 328 -399 114 265 -282 82 258 -23 464 -2 60 284 257 -37 396 213
$$ packed form
2590c10P02m70j2R2n02N36j39k13L19j70p5N63n56lK77Ok60M97l47j47J63k35
2612b84Q6K63n46O61J66n99M55k52r9N00k30k34M79j46j48K50m20J20J89k02M9
2633E8L75l95n5K87n76O79l50j73L93j17m0K14ol64J82j59j85M86k11k99M76n16
2655b96J67J67l95L39J84l65J96j73m9R7L53n83L42l5l43M29l34J79L64l31lN60
2677D70n85rJ92l50L11P4j85M28l96j11M42J4l11M58k93l15N85k7l54K52k61R3
2699A22L22r74O08O1j62Q8N5m65K63M74n86J73N6j09K48j25M9J8k12l35M79j64
2721a16J5J92k78JN77o68J11J47l66L28P0n60P33j53k23L35K2l63L74q3l02K77
2743G0l89K07K14J2j82L96p27N13J51n47L64J76k81M87m66O2K24k7k94M33j83
$$ plain form
2764 213 -22 461 29 132 528 -188 -281 56 -184 45 101 -258 27 268 -77 460 35 -344 -118 -48 -316
2785 -316 157 -87 -352 -96 -296 -263 17 -41 -162 -112 -432 -92 237 -170 -6 115 -292 104 218 -682 -118
2806 -118 204 -77 109 177 -199 37 239 75 181 -66 192 21 -142 2 168 -106 131 136 -226 567 133
2827 133 79 74 8 -266 338 132 -5 438 109 -252 375 172 220 12 -372 -125 190 -129 -168 -144 -255 194
2849 194 -151 -348 117 102 -372 111 -152 -316 110 -87 -447 384 -157 8 75 -459 -17 112 -407 145 -38
2870 -38 -81 17 -41 -319 -74 -10 -438 222 22 -42 405 62 -35 416 -91 -90 216 -45 21 224 145 211 308 -186
2894 -186 221 -180 -98 142 -92 -48 321 123 71 308 -101 -6 409 -187 -61 303 -290 -302 4 -132 -28 89
2916 89 -185 -32 -68 -86 144 -307 -223 -54 -169 -449 -100 -447 -327 33 -282 -106 141 -216 -191 467 -217 38
$$ packed form
2764B13k35M83m32J03L96p16r3L37k40K29N6l59K85K41l45N37m25l79K26P0k68
2785c16M73k44k65K56k00L3K80n8j21N0l20L40L29m07J64J21m07L96J14r00N64
2806a18L22k81J86O8l76K36K02j64J06k47K58j71j63J44J66k74K37Nl62P93m34
2827A33n4no6k74O04k06j37M43l29l61O27k03M8k08l84K47L15l19l9K4j11M49
2849A94l45j97M65j5m74M83k63j64M26j97l60Q31n41J65O7n34M42J29n19N52j83
2870c8m3R8n8k78K45O4m28O60k00o4M47l43r7M51n07JL06k61O6K03p9O6R7m94
2894a86M07m01Q2K40k34M4L69j98n2K37m09R5M15n96J26L64n93j2L06j36J04J17
2916H9k74J53l6j8K30m51Q4J69j15k80L49l47J20L60l15J76K47l57K5O58o84K55
$$ plain form
2938 38 30 -313 -69 -64 -185 463 246 -169 456 159 -197 378 35 -254 -88 -55 70 419 166 171 66 -264 3
2961 3 226 -192 351 76 -148 191 107 -203 246 -240 -374 152 -201 -60 10 -331 128 207 -442 216 212 -69
2983 -69 -95 278 -99 -140 -91 -181 -163 -42 -361 -170 -271 -297 79 -250 -57 95 132 -154 115 -45 -118 231 -94
3006 -94 147 298 -51 384 349 1 295 97 -13 171 286 -201 268 -166 97 610 74 -119 232 -199 -20
3027 -20 415 -265 190 326 -220 -19 81 -227 192 179 -280 129 97 -199 -21 -291 -131 106 36 -108 174
3048 174 -292 -229 132 -218 137 -72 125 -206 -98 -186 31 -24 -6 165 -118 -8 365 -127 -130 50 -17 118
3070 118 72 -389 -4 8 -462 228 82 121 439 132 -114 530 313 135 210 -6 -200 -24 39 -103 17 34
3092 34 -81 99 -131 236 233 -233 -16 265 -230 80 -76 -107 102 163 -156 38 285 -187 93 -72 -141 112
$$ packed form
2938C8ql43K44Nj21O48k17m15O25k97l56N75l43k89J66L3J25L49k53Nj05l30K67
2961CK23m18N43k75k24L39q4l10M49m86j34N26l53J41P0l41M59P9o49O58mk81
2983f9k6L73l77m1M9r0J8J21l19J91j01k6L76l29J93J52L7k86K69j60p3L49l25
3006i4K41J51l49M35l5l48K94j98j10J84J15m87M69m34K63N13n36j93L51m31J79
3027b0M35o80M55J36n46K01J00l08M19j3m59M09l2k96J78k70J60K37p0j44K82
3048A74m66O3L61l50L55k09J97l31J08q8K17n5J8J71k83J10L73m92lJ80o7J35
3070A18m6m61L85J2m70O90j46L9L18l07k46O44k17j78P5k16j94J76O3j42J20J7
3092C4j15J80k30L67lm66K17K81m95L10j56l1K09O1l19J94K47m72K80j65o9K53
$$ plain form
3114 112 -152 -134 152 -199 -276 91 -159 -29 138 -180 62 131 -217 -105 51 -202 32 -238 -79 -44 136
3135 136 -101 89 -84 -54 245 173 -226 360 -170 95 58 -132 374 303 -77 372 145 -53 212 -90 -87 250
3157 250 -80 18 252 13 -96 216 169 -315 70 19 75 59 -269 -6 88 -246 123 165 -199 70 -81 36
3179 36 -185 -297 -464 255 74 -147 -186 -392 97 212 -90 -84 -116 -381 66 -14 -287 233 151 11 -23 -216 -92
3202 -92 -22 -110 -71 222 -254 -14 148 148 149 179 -78 -61 395 -27 13 -34 -93 25 -78 -72 228 -65 168 375 -128
3227 -128 -194 274 42 -206 234 -249 102 123 -169 -114 -25 -299 297 -75 -376 80 -64 -47 93 43 -69 -65 -11
3250 -11 -87 53 -302 -2 258 -307 -44 34 49 -46 -25 -138 -44 -41 21 247 2 -41 97 188 148 70 -120 8 37
3275 37 427 150 -33 -89 143 107 -99 388 148 54 140 -232 -123 91 -25 -137 173 -139 -140 289 -86 -129 72
$$ packed form
3114A12k64J8K86l51p7L67k50J30J67l18K42O9l48J12J56k53K34k70J59L5J80
3135A36k37J90j73L0K99p2l99N86n30K65l7j90N06p1l80M49k27j98K65l02LL37
3157B50l30R8K34k39j09L12m7m84L85n1N6j6l28K63R4l34L69M2l64K69j51J17
3179C6k21j12j67P19j81k21l9k06M89J15l02Ol2k65M47q0k73N20q2j40l4j93J24
3202i2P0q8L9K93m76K40J62%JL0k57J7M56m22M0m7n9J18j03OL00k93K33K07n03
3227a28o6M68k32k48M40m83L51K1k92N5Q9k74N96l72l01M56j44J7J40n0j12MN4
3250a1p6J40l55L00K60n65K63P8J5r5K1j13R4LO2K26k45m3J38R1m0p8j90J28K9
3275C7L90k77j83n6K32l6k06M87k40r4Q6l72J09K14j16j12L10l12jM29l75m3K01
$$ plain form
3298 72 -90 20 196 -185 146 -25 -135 -80 136 -175 61 51 -152 212 46 -285 98 -50 -104 87 71 -256
3320 -256 -69 -434 -30 314 -248 -46 336 56 168 117 -239 319 -104 158 -59 211 -54 -79 -192 48 291
3341 291 -137 -291 239 -191 227 323 -244 201 472 134 69 255 -100 332 -55 -294 185 240 -34 104 85
3362 85 66 132 -126 -69 -113 -254 93 37 -258 -222 -22 -38 -31 -133 -315 -175 -3 -191 13 -183 -141 9 -71 -423
3386 -423 223 163 -17 18 -91 66 -9 -18 160 98 -296 204 142 -210 148 217 -159 202 -153 99 234 342 34
3409 34 298 343 193 142 101 105 289 170 181 261 -104 214 29 -70 220 132 -357 -45 222 -295 -31 49 -308 319
3433 319 155 -163 252 3 -7 -88 -101 -90 144 -169 -123 51 -42 -13 -39 -65 -45 -135 -281 -64 132 -27 -72 -26
3457 -26 -133 102 -313 -182 -110 -28 -43 201 28 74 101 216 317 280 -80 210 -74 -63 302 25 154 207 -37
$$ packed form
3298G2j62J10J76l81L31j71j10N5K16l11K36j0k03L64j66l31L83j48n4J91j6l27
3320b56J87l65M04L44n62K02L82k80J12n1l56N58m23K62k17K70k65k5j13K40K43
3341B91m28j54N30m30M18R6n67M45K71l38o5J86l55M32l87k39M79N5k74J38j9
3362H5j9O6k58N7m4j41L47n6k95L6K00j6Pj02j82J40J72j88K04j96M2J50q0l52
3386d23O46o0j80L5j09J57p5rJ78o2l94N00o2l52L58O9l76L61l55K52J35J08l08
3409C4K64M5j50n1m1MJ84j19J1Q0l65L18j85r9K90q8m89L12K67n17K64Q0l57O27
3433C19j64l18M15k49j0q1j3J1K34l13M6J74r3K9k6k6K0r0j46K17J96j59m5M6
3457b6j07K35m15J31P2Q2j5K44j73M6K7J15J01l7l60K90k84J1L65k77J29N3k44
$$ plain form
3480 -37 -102 287 -115 -111 232 21 51 130 -312 201 213 -303 86 129 152 -155 -150 -24 171 -163 -148 135 -14 40
3504 40 70 -178 -328 73 -119 -107 220 -193 -45 11 -88 27 -47 -135 203 -10 -147 328 -46 40 178 112 159
3527 159 -53 35 -322 261 -50 84 240 48 58 176 -167 -175 97 265 -90 176 -8 87 -54 -56 356 118
3549 118 -177 79 -123 89 105 123 45 159 -95 340 105 -218 19 58 -146 -36 52 -176 224 -158 -155 358
3571 358 -100 189 163 -277 -169 67 -41 -184 281 19 -154 56 -117 -47 41 -136 58 -37 -6 -45 -170 -162 237
3594 237 274 54 13 405 77 64 273 107 250 -187 304 -176 -105 -68 97 -33 -84 -11 -144 185 269 -132 240
3617 240 301 -270 308 -27 -238 180 -37 231 116 -156 85 -107 -105 -270 188 -167 176 -146 -83 144 -235
3638 -235 -235 62 69 178 172 -78 21 296 -90 -169 -247 -25 -40 106 -2 44 420 -148 139 189 -197 39 -102 -20
$$ packed form
3480c7o5L89m02ML43k11L0P9m42N13J2n16L89M3K3l07NJ26J95l34J5K83j49N4
3504D0L0k48j50M01j92J2L27m13J48N6r9J15p4q8L38k13j37M75l74Q6J38o6M7
3527A59k12Q8l57N83l11J34J56j92J0J18l43qK72J68l55K66j84R5j41kM12k38
3549A18k95K56k02K12J6J8p8J14k54M35k35l23K37L9k04J10Q8k28M00l82LN13
3571C58m58K89k6m40J08K36j08j43M65k62j73K10j73P0Q8j77J94r5L1l9j25QL99
3594B37L7k20m1L92l28j3K09j66J43m37M91m80P1L7J65j30n1P3j33L29Q4m01L72
3617B40O1n71N78l35k11M18k17K68j15k72K41j92Kj65M58l55L43l22O3K27l79
3638b35%K97PJ09ok50R9K75l86p9p8K22j5J46j08M6L76n68K87N0l86K36j41Q2
$$ plain form
3662 -20 -24 -148 75 45 -149 -188 143 -120 -9 -14 -15 147 172 -65 21 190 130 233 117 -38 208 55 108 380
3686 380 -132 -167 -71 -125 29 -167 -166 -208 -20 -51 6 49 -276 31 -52 306 19 -75 -225 8 -40 -161 130 -161
3710 -161 -205 -64 -153 -246 30 32 28 -28 -18 -352 83 -76 7 186 -297 183 88 -56 62 76 -178 148 95 46 284
3735 284 -100 9 37 -77 -36 291 -221 79 72 18 198 11 102 361 -78 -14 -10 -110 -152 -140 -34 112 -89 94
3759 94 -135 6 -131 -308 184 107 201 -7 -219 291 -118 -26 14 -56 -369 -9 -255 -129 209 208 -151 188 -146
3782 -146 -148 25 16 52 -81 -234 77 201 -174 -86 136 -36 -65 428 123 301 20 79 443 41 -218 197 -112
3805 -112 28 89 -99 -105 309 -156 158 165 -230 -20 -117 -244 256 -8 -221 -185 70 -504 309 29 -175 -115 -77
3828 -77 12 34 -82 -239 -116 -222 -41 6 -129 -1 -144 -374 95 59 -254 177 199 -16 -150 -98 8 165
$$ packed form
3662b0mj24K23l0j94l9L31k63J11njJ62K5k37Q6J69o0J03j16j55K46j53N3K72
3686C80n12l5R6n4J54j96Jm2J88l1N7M3l25L07q3L58k87r4j50K33m8j21K91k91
3710a61m4J41q9r3K76Kmn6J0l34M35j59Q3J79m83M80r5j44J18J4k54L26n3m9K38
3735B84l84J09K8j14M1L27n12L00pn4J80j87R1K59m39O4Mj00m2J2J06J46k01J83
3759I4k29J41j37j77M92p7R4k08k12N10m09R2M0p0l13L60k46J26L38jl59L39l34
3782a46kJ73rL6j33j53L11J24l75Q8K22j72k9M93l05J78k81N9L64m02k59M15l09
3805a12J40O1j88oM14m65L14Pl95K10r7j27N00k64k13L6K55n74Q13k80k04O0L8
3828g7Q9K2j16j57J23j06J81M7j35J28j43k30M69l6l13M31K2k15j34N2J06J57
$$ plain form
3850 165 -102 -23 196 -105 72 -14 -136 -97 63 -187 209 50 10 224 67 13 174 -111 -142 355 -302 -121
3872 -121 205 -78 -39 40 -166 64 239 -40 -46 -73 -400 -71 -18 -247 -13 -3 -122 -132 -27 -243 -23 -25 -308
3895 -308 11 167 -202 32 -54 -194 181 -177 -107 47 49 -245 60 20 251 147 -235 191 266 -138 -15 -79
3917 -79 -211 96 -122 246 265 -127 -34 -60 51 -17 243 -120 -243 162 -204 165 -256 -39 72 193 -69 20
3939 20 -54 177 346 178 -186 343 -69 82 -47 -230 40 -55 106 30 -30 30 220 -125 106 -124 -76 -70 188
3962 188 -373 7 142 -20 -49 105 -123 13 17 -364 -86 -115 -151 -99 325 -116 210 -15 -114 -222 3 70 46
3985 46 -89 -61 114 80 40 173 -76 27 241 133 -66 384 -149 190 143 -167 -66 66 -143 170 221 -392
4007 -392 432 51 39 209 4 148 172 -10 280 367 -308 11 22 -32 329 37 -120 -111 17 -116 89 8 -4
$$ packed form
3850A65k67P9K19l01J77q6j22L9J60k50L96j59m0K14j57n4J61k85l1M97o57J81
3872a21L26k83L9P9k06K30J75k79ok7l27L29N3k29K34J0j19j0J05k16K20kk83
3895c08L19J56l69K34q6j40L75l58P0J54Kk94L05m0K31j04l82M26P5m04J23o4
3917g9j32L07k18L68J9l92R3k6J11o8K60l63j23M05l66L69m21K17J11J21k62Q9
3939B0p4K31J69j68l64N29m12J51j29j83K70r5J61p6o0O0J90l45K31k30M8OK58
3962A88n61L80J35j62k9J54k28J36Ml81K78k9l6N2M24m41L26k25r9j08K25O7k4
3985D6j35K8J75l4m0J33k49J03K14j08j99M50n33L39m7l10J01J32k09L13N1o13
4007c92Q24l81j2J70k05J44K4j82K90Q7o75L19J1n4L61k92j57RJ28j33K05q1j2
$$ plain form
4030 -4 -57 -271 -225 68 -256 -291 32 -61 -224 -146 155 56 65 -87 188 -3 -69 65 301 -102 4 -155 12 -175
4054 -175 16 118 119 -15 -54 451 -115 211 139 -119 -63 102 -200 15 115 -71 136 22 190 27 -30 -60
4076 -60 245 -269 -141 88 -70 -109 110 -48 -214 37 -27 182 -137 -559 9 98 -141 1 -12 -28 88 -80
4098 -80 -95 -89 126 -297 -233 108 -85 -56 -104 -16 120 236 -12 383 209 136 17 -124 -40 271 -143 111 119 -177
4122 -177 280 165 -55 137 -179 16 115 219 34 280 -143 154 102 -81 -78 6 -156 -46 5 -41 144 139 -169
4145 -169 82 -196 -124 -97 -165 -212 -73 -112 286 166 -166 -159 278 -120 -105 147 -134 7 -49 -174 51 -102 -188
4168 -188 338 -55 -458 266 104 50 63 28 -57 146 168 114 188 -258 91 322 239 303 67 -73 20 -148 65
4191 65 108 253 -154 256 70 138 243 -42 2 45 -6 -22 214 -151 68 20 -17 54 2 -98 170 -69 -118 -40
$$ packed form
4030dn3k14M6K93l24l5L23r3j63P8L01r9Rj52K75j91o6J34K36m03J06j59J67j87
4054a75J91J02Jj34l9N05n66L26p2k58N6J65l02K15J00j86K07j14J68j63n7l0
4076f0L05n14J28K29j58l9K19j58j66K51o4K09l19m22N68Q9k39J42j3j6J16j68
4098h0j5OK15m23O4L41j93K9m8Q8J36J16k48L95j74p3j19j41Q4L11m14K54Qk96
4122a77M57j15k20J92l16J95R9J04j85K46m23K97n2j83LQ4j62J10N1m6J85nl08
4145a69K51k78P2K7o8m7J39l9L98j20l32PM37l98J5K52k81J41n6j25K25j53q6
4168a88N26l93m03P24j62n4J3l5q5K03K2n4P4m46L49K31q3O4k36j40R3j68K13
4191F5M3J45m07M10j86O8J05k85M4M3n1j6K36l65K19m8l7P1n2j00K68k39m9P8
$$ plain form
4215 -40 124 -14 433 13 -28 -144 121 -214 -176 -323 50 -83 -275 -59 111 -311 169 41 232 119 32
4236 32 -47 45 -20 -252 5 139 96 -67 -310 56 30 -262 76 144 147 67 211 -49 173 -58 -35 266 -80 -140
4260 -140 309 -12 -114 122 -69 39 256 -139 87 -279 -209 331 0 -16 143 296 -201 -455 64 -444 232
4281 232 95 -214 57 -100 -169 71 128 -108 -166 -148 -132 -16 -91 -157 95 -240 -220 106 -255 -270 137 -255 111
4304 111 246 -385 -10 163 135 15 -49 -175 12 193 178 168 11 -117 98 -28 170 156 -77 219 49 -82
4326 -82 245 1 43 104 -6 -92 -82 -268 -103 51 -123 149 -77 73 194 96 -130 -201 174 -36 -111 101 17
4349 17 -26 12 -186 -77 -22 -224 -60 5 -265 -17 -35 -222 191 -130 -44 248 -38 -94 110 -205 -128 145 -5
4372 -5 232 -169 167 -133 -201 284 66 -23 159 104 179 43 264 -320 113 259 -223 223 16 -120 90 -8
$$ packed form
4215d0J64j38M47m20m1j16K65l35L8j47L73j33j92K16J70m22M80j28J91j13q7
4236C2p9R2o5k32K57J34m3j63k43L66k6k92L38O8Lq0J44k60K22k31K3L01l46o0
4260a40M49l21j02K36j91J08K17l95K26l66P0N40l31j6J59J53m97k54N19n08O76
4281B32j37l09K71j57o9K40N7k36n8J8J6J16p5o6K52l35K0L26l61j5M07l92L66
4304A11J35o31L75J73k8j20o4j26J87J81j5j0j57j28K15j26J98j4k33K96j70j31
4326h2L27k44M2O1j10q6J0j86J65J54j74K72k26J50J21r8k26p1L75k10p5K12q4
4349A7m3L8j98J09N5k02J64O5k70K48j8j87M13l21Q6K92k86n6K04l15P7K73j50
4372eK37m01L36l00o8M85k18q9J82n5P5j36K21n84M33J46m82M46k07j36K10r8
$$ plain form
4394 -8 84 111 -16 -75 46 -178 156 7 208 61 -130 -299 -241 177 -97 -283 146 -174 -38 46 -250 -235 187
4417 187 -173 -67 75 -158 -139 -97 -181 149 60 -218 365 -68 95 237 18 104 -200 113 -35 147 68 89
4439 89 -202 -183 22 -156 -1 222 57 221 431 126 -6 143 98 145 170 -131 -62 280 -10 -224 175 -3
4461 -3 108 -70 151 35 50 -55 -4 15 -135 -30 -19 -185 -113 15 -116 57 -192 156 -95 -313 -78 -85 -45
4484 -45 73 8 -86 -102 -75 -150 -193 132 -89 112 61 -43 60 116 -10 259 -35 104 29 -267 -158 55 -189
4507 -189 77 -3 69 281 -188 -11 89 171 -62 156 -101 -9 38 -304 23 30 103 137 14 68 53 -58 -14 -8 16
4532 16 -208 34 71 -318 53 -163 53 248 -306 44 251 -118 -57 -124 -330 78 -33 -76 120 -240 -24 149
4554 149 200 118 -338 -120 -13 112 71 -160 -154 32 -121 -37 -109 143 -34 -70 212 -216 -17 258 36 78 81 151
$$ packed form
4394hR2K7j27n9J21k24L34j49K01j47j91j69N8M18k74j86M29l20J36Q4k96J5M22
4417A87l60J06J42k33J9M2q4L30q9k78N83m33J63J42k19Q6l04L13j48J82p9K1
4439H9k91J9K05j78J55K23j65J64K10l05j32J49m5M7K5l01O9L42k90k14L99j78
4461cJ11j78K21j16J5j05N1J9j50J05J1j66P2J28j31J73k49L48k51k18K35pM0
4484d5J18o5r4j6K7p5m3L25k21K01n1j04J03N6j26K69k94J39p5k96J09K13k44
4507a89K66q0P2K12m69J77J00Q2k33K18k57R2M7l42L27PP3L4j23N4j5j11M4OK4
4532A6k24K42L7l89L71k16K16J95n54L50K07l69O1o7k06M08j11m3J96l60K16J73
4554A49N1q2m56K18J07J25m1k31OJ86j53Q4p2K52j77l6K82m28J99K75k22M2LP0
$$ plain form
4578 151 -71 166 57 -79 134 34 -163 189 -128 -198 209 -56 355 148 92 -249 62 -314 11 -17 -144
4599 -144 -23 -107 -126 16 197 -118 7 1 -431 328 -75 -208 123 -108 110 -22 -96 174 137 -167 62 140
4621 140 -12 39 156 38 -66 -24 38 -2 -217 61 286 -69 57 -4 -133 -166 103 -4 -103 249 6 383
4643 383 216 79 194 93 -84 183 -93 40 26 158 77 28 224 55 120 -360 -163 -56 -19 -67 -53 -25 -96
4666 -96 28 82 17 -304 -245 42 5 -209 130 94 -361 392 -304 -192 -100 44 -160 -94 -30 -249 49 -163 9
4689 9 9 -250 176 75 -97 197 305 -175 4 220 -49 98 -70 -69 262 103 -66 175 -36 -152 68 -113
4711 -113 277 -31 -167 -259 -241 33 113 64 -16 -38 62 -377 198 224 -388 -2 20 -128 179 243 -9 -92 -99 115
4735 115 184 -23 80 81 -188 -91 227 -264 -58 138 -233 190 -77 -67 -25 32 147 83 -320 -87 91 -128 -145
$$ packed form
4578A51k22K37j09j36K13j00j97L52l17p0M07k65M11k07n6l41L11l76L25k8j27
4599a44J21q4j9J42J81l15J25om32P59m03j33L31k31K18j32p4K70l7l04K29P8
4621A40j52N1J17j18j04M2O2m0k15K78K25l55J26o1j29l3K69j07r9L52k43L77
4643C83j67j37J15j01j77K67k76J33j4J32q1m9J96j69O5m80J97J07L7m8J4K8p1
4666i6J24N4o5l21N9K87l7k14L39l6m55P53o96J12R2J44k04O6O4k19K98k12J72
4689I%k59M26j01j72K94J08m80J79K16k69J47j68JL31j59j69K41k11j16K20j81
4711a13L90l08j36r2J8K74Q0m9q0k2J00m39N75K6o12L86K2j48L07O4k52q3pK14
4735A15O9k07J03Jk69R7L18m91K06J96l71M23k67J0M2N7J15o4m03K33J78k19j7
$$ plain form
4758 -145 314 -132 346 125 -135 61 380 -162 87 246 -31 136 129 -64 324 115 268 276 153 132 -97 7
4780 7 250 25 54 38 233 -173 266 43 -35 241 -208 55 149 -135 -160 37 -152 -182 175 -127 -197 58 131
4803 131 7 47 65 -128 -148 206 104 71 -214 -130 -365 -26 -35 -243 -363 149 33 -97 59 8 51 -54 -128
4826 -128 211 111 134 165 362 -21 -23 -99 -45 14 -22 -7 150 119 128 186 -221 -220 77 74 -158 295 56 177 337 -13
4852 -13 234 149 0 155 221 -212 159 -169 -75 82 174 -117 -207 -136 6 -46 -252 45 75 47 123 66 -155 -16
4876 -16 40 -31 141 49 -15 206 6 -191 74 -97 -69 37 -70 271 7 -161 -217 136 -3 5 88 48 -205 -218
4900 -218 -16 22 291 294 228 119 86 109 -130 -347 85 -87 114 106 230 -67 272 28 -81 234 -142 -29 194
4923 194 -211 -67 -30 -116 253 -111 -109 4 -98 -78 -276 -161 -156 202 -314 -80 -56 -298 -37 228 -136 184 5
$$ packed form
4758a45M59m46M78k21k60J96L19n42K49J59k77J67pj93L88k09J53Qj23k1k29J04
4780GK43k25K9j6J95m06M39k23p8K76m49K63R4k84k5J97j89l0L57l02p0K55P3
4803A31j24M0J8j93k0L54j02l3k85Q4k35L39rk08j20N12j16j30J56n1M3j05p4
4826a28L39j00K3L1J97l83kp6N4N9l6J5J57l1RN8m07JK97lk32M53k39J21J60l50
4852a3K47q5j49J55O6m33L71l28R4J57R2k91r0P1J42n2k06K97L0k8P6n7k21J39
4876a6N6p1J72r2o4K21k00j97K65j71K8J06j07L41k64j68n6L53j39QQ3m0k53j3
4900b18K02L8K69Lo6j09l3K3k39k17M32j72K01qJ24k97L39k44j09L15l76J13K23
4923A94m05J44L7q6L69l64KJ13j02K0j98J15NL58n16K34K4k42K61K65l64L20j79
$$ plain form
4946 5 -295 -134 -124 -167 235 287 -357 -25 -222 -354 85 74 -99 -30 59 -128 246 -449 -24 -60 -198 268 225
4969 225 55 -142 222 -278 222 166 -47 245 292 176 281 26 -151 75 50 72 2 -190 -160 90 -211 105
4991 105 33 -210 -124 106 -222 -138 27 -108 189 -151 -41 75 -336 -159 33 82 -273 60 -106 -136 99 -10
5013 -10 149 -20 -113 306 112 137 81 81 126 281 179 -61 5 97 70 72 137 -10 112 162 30 -41 -48 90 -166 -178
5039 -178 180 51 -34 98 296 -196 -57 126 -40 72 107 81 -33 -328 -26 189 -47 162 93 -200 29
5060 29 -25 -163 121 121 35 32 -39 -356 153 112 152 162 71 -183 84 -135 -147 -59 -248 29 -159 -124 38 -156 -108
5085 -108 2 -38 -43 26 55 -78 123 285 1 -10 -181 185 170 3 -232 219 360 22 30 25 150 -30 -266 -90
5109 -90 49 -142 -112 -4 -178 -273 143 -209 148 27 78 43 259 -145 -119 -190 181 133 -114 -25 -123 -251 101
$$ packed form
4946El00J61J0m3M02N2o44L32j97j32M39j1j73O9Q9j87L74o95M25l6j38M66m3
4969B25j70j97L64n00N00n6k13K92M7j16J05k55j77K26k5K2p0j92L0K50l01L16
4991A05p2k43Q6K30l28Q4J65j35K97l40J10J16m11J77J92M9l55L33j66l0K35j09
5013a0J59j69r3M19j94K5n6%M5J55j02k40O6R2k7KO5j47J22N0j32p1pJ38k56j2
5039a78L58j29q5J32J98m92J39J83j66J12L5k6j14k95L02K15k36K09o9k93K29
5060B9n4j38K84%q6lp1l17N09m1M0J0r1k54K67k19j2Q8j89K77j88L5J62j94M8
5085a08J10m0nO9K9j33K01J62k84j1j71L66j5j67k35M51J41l38QnJ25j80k36J76
5109i0J39j91L0J08j74r5M16l52L57j21N1l5K16m04K6p1L71m8k47Q9r8j28L52
$$ plain form
5132 101 90 -190 -116 -3 56 -107 -6 -123 61 -54 -97 132 -9 -100 288 61 -155 83 2 85 -21 158
5154 158 58 34 169 92 136 77 130 272 -68 262 -60 -138 220 -155 -25 93 92 78 -27 -134 -212 203 -90
5177 -90 62 106 -99 -66 62 -81 168 -195 77 137 131 -238 -94 45 -41 246 -162 -45 -25 192 -8 88 -174
5200 -174 7 -29 -50 -108 -110 243 82 5 -2 102 -45 -64 129 -191 -50 -94 -36 -144 204 42 -4 191 -132 67
5224 67 160 88 26 324 -224 189 -56 57 82 -117 -42 266 -101 -15 26 248 175 -115 -31 -114 187 -108 -17 192
5248 192 -211 -74 -323 -37 39 -22 -256 120 -287 174 -33 -358 -141 -174 207 118 -136 -76 -47 -200 54 -187
5270 -187 -49 -163 52 -70 14 -96 30 -42 1 70 -107 385 -14 -174 -113 55 105 166 -110 53 75 71 -28 108
5294 108 -159 88 152 -26 248 -72 215 90 -56 166 193 -17 -70 -118 392 154 12 162 -70 -121 -47 -128
$$ packed form
5132A01j1k80P4J13N9j63J01j17J84j15m3K29j41r1L88k27k16K38q1Q3j06J79
5154A58j00k4J35p7M4n9N3J42l40L30l22p8L58l75J30J18jj4j05j07p8M15k93
5177i0J52M4k05L3J28j43K49l63K72O0ol69J44J39q6K87m08J17K0K17k00R6k62
5200a74J81l6k1n8kL53j61p7pJ04j47j9J93l20J41m4N8j08L48j62m6J95l23J99
5224F7R3p2o2K98n48M13k45J13K5j99P5L08l67Q6M1K22p3k90Q4q3L01k95R1K09
5248A92m03J37k49K86P6o1k34L76m07M61k07l25K17l3L81q9k54O0K9j53K54k41
5270a87J38j14K15j22Q4j10J26p2M3O9j77M92l99j60O1J68N0O1k76J63K2mr9J36
5294A08k67K47O4j78K74l20K87j25j46K22K7k10n3m8N10k38j42J50k32n1P4q1
$$ plain form
5316 -128 6 -191 -205 -74 -157 -69 -266 -158 86 18 -162 105 133 -196 75 -101 -190 9 -108 185 -17 -195
5338 -195 -73 47 -33 63 255 -163 140 79 -88 393 57 -6 184 -334 152 -82 -65 -97 -154 -198 6 87 58
5361 58 181 107 97 121 -189 -128 -26 -228 -12 185 -68 -3 -167 37 -46 158 -307 -39 196 -182 -236 -3 120
5384 120 -134 -128 17 -95 25 -80 -74 -82 -238 2 83 100 51 -311 -186 -252 102 339 -80 -77 9 91 -44 48 40 -19
5410 -19 77 37 86 167 5 -201 391 102 -146 277 -100 135 36 45 47 115 128 87 69 -145 101 2 -401 145 -25
5435 -25 -112 -7 -85 12 102 -23 44 19 209 40 126 214 56 149 -333 -338 17 -104 -90 31 -34 151 76 -326 -16
5460 -16 -235 -197 -228 -222 -203 -113 -136 -157 171 -79 43 250 19 145 45 -39 112 20 -114 253 -8 -176 358 42
5484 42 -36 289 -116 -163 95 5 -142 43 150 -144 170 -228 -56 67 -182 -56 231 29 -97 -28 -45 9
$$ packed form
5316a28J34j97j4J31q3Q8j97J08K44o8j80K67K8l29K71j76q9J99j17K93k02j78
5338a95J22J20q0R6J92m18L03o1j67M81l36o3J90n18M86k34J7l2n7m4K04Q1k9
5361E8J23p4j0K4l10O1J02k02K16J97k53O5j64K04q3K04m65K68K35l78n4K33J23
5384A20k54OJ45j12J20j05Oqj56K40Q1J7m9l62J25o6L54K37m19LQ6Q2j35R2qn9
5410a9R6m0M9Q1j62k06N92k89k48M23l77K35r9RKO8J3m1j8k14K46r9m03N46j70
5435b5q7J05p8R7R0j25O7k5J90j69Q6Q8j58R3m82nL55j21J4J21o5J85p5m02L10
5460a6k19L8l1OJ9R0k3k1L28k50J22K07k31J26j00q4J51r2j34L67k61j68N34l16
5484D2p8L25m05m7K58r0j47J85J07k94L14l98J72J23k49J26K87k02j26O9j7N4
$$ plain form
5506 9 -28 -61 166 -114 -170 170 255 155 145 13 -172 -161 -26 -13 -12 -452 -96 322 242 132 87 -32 181 -101
5530 -101 78 192 -137 -166 120 27 -6 -3 -118 57 107 -46 -47 -113 -61 -21 328 196 -69 -246 244 -280 -145 -90
5554 -90 111 -7 -80 -137 -168 -5 -44 -112 -47 129 -10 -107 -157 322 128 -30 144 -165 259 41 12 -114 -43 186
5578 186 231 55 -17 -213 -173 -84 -173 -51 -107 88 108 -17 -108 -203 -179 -164 59 81 -192 215 -100 -69 262 167 6
5603 6 189 99 -218 -168 -128 101 -135 46 -54 318 -161 -61 81 10 16 -146 72 -79 6 -5 -91 170 -100 42
5627 42 -142 89 71 2 37 -40 35 28 292 30 -94 106 -95 -319 199 39 39 18 -6 34 -372 -78 -107 111 -214
5652 -214 -94 -146 -326 -206 -289 -36 163 -141 -130 13 150 124 55 -168 -126 34 133 48 165 -115 99 -77 38
5675 38 198 -78 121 -25 -25 112 93 -163 15 -97 -77 -67 -18 140 246 68 -47 221 -19 10 -26 -127 12
$$ packed form
5506Il7l3K27k80n6L40Q5j00j0j32j85J1J35J3Jm40L56M18q0j10m5j19K13k82
5530a01J79J14l29k9K86r3l3Lj15J75N0j53jo6N2M0L49j32k65j77M90n24J35N5
5554i0K01j18p3n7l1J63l9o8O5J76j39r7n0M79j94j58J74l09M24k18k9j26P1K29
5578A86M5j76p2j96M0Q9q9J22n6J95K0j25r1r5K4J5K23K2k73M07l15L1L31r5j61
5603FJ83r0l17N0M0K29k36J81j00L72m79J00J42p1Oj62K18j51Q5j1q6K61k70J42
5627D2j84K31j8o9L5p7P5pK64k62j24K00k01k24N18j60%k1k4M0m06K94k9K18l25
5652b14J20n2j80J20q3K53J99l04J1J43J37k6o9k23M2J60R9q5J17k80K14j76J15
5675C8J60k76J99j46%J37j9k56J78j12K0J0M9J58J06j78j15K68k40K9l6j01J39
$$ plain form
5698 12 -65 -144 -43 -206 -280 -3 16 -102 24 26 -1 110 133 -75 -117 -153 -175 -187 198 -98 -21 -138 -3 35 -89
5723 -89 113 33 -98 2 188 -37 -227 98 92 -31 132 -420 80 -67 -128 -27 114 32 157 41 391 382 -77
5746 -77 26 -13 -133 165 10 -109 147 -32 -343 225 52 -260 140 -60 -13 -251 40 8 238 -203 -19
5767 -19 163 -77 -312 32 -155 -46 -164 -76 33 85 -126 110 -2 -303 -219 -249 -62 325 68 37 -57 -235
5789 -235 -60 -41 -59 -52 -19 -206 -1 27 -95 -5 194 -251 -16 -66 -133 -220 34 -119 -8 -10 -22 326 -237 93
5813 93 -59 26 -179 -94 136 -155 142 -15 38 248 -3 -47 -13 233 336 346 -105 126 -69 22 -4 -109 -130
5836 -130 -51 133 31 74 -377 -127 22 -60 32 57 11 -50 110 -278 -32 -14 -172 121 -535 -102 80 60 59 -220
5860 -220 315 -109 -15 -60 3 -19 -108 291 -37 -119 -55 -115 221 38 -179 -110 139 27 -49 263 267 -140 43 -53
$$ packed form
5698A2p7p9J01j63p4K77J9j18J26Kk7J11K3k08m2l6k2j2L85k96P7j17J35L8j24
5723h9K02q0j31J00J86k25j90L25oj23J63n52N00j47o1J01J41q2J25j16L50rm59
5746g7J03l9j20K98j55j19K56j79l11N68j73l12M00k00M7k38K91l2K30m41J84
5767a9J82k40k35L44j87J09j18Q8J09N2k11K36j12l01Q4l0J87L87k57l1r4j78
5789b35J75J9j8PL3j87K05K8j22R0J99m45K35n0o7q7K54j53J11kj2L48n63L30
5813I3j52Q5k05Q5K30k91K97j57N3K10k51m4L4K46J03J0m51K31j95R1k6j05k1
5836a30P9J84j02M3m51K50J49q2R2K5m6o1J60l88K46J8j58K93o56M33J82k0jk79
5860b20N35m24R4m5O3k2q9L99l28q2O4o0L36j83k17O9K49j12p6L12Mm07J83r6
$$ [...]
8191F1
##END NTUPLES=NMR FID
##END=
