##TITLE=1H_Pr Q-A
 CDCl3, 8 sc, 
 3.06.2021
##JCAMPDX= 6.0         $$ Bruker NMR JCAMP-DX V2.0
##DATA TYPE= NMR FID
##DATA CLASS= NTUPLES
##ORIGIN= UXNMR, Bruker Analytische Messtechnik GmbH
##OWNER= root
$$ XWIN-NMR		Version 3.5
$$ Thu Jun  3 11:52:16 2021 Russian Standard Time (UT+4h)  she@DPX200
##.OBSERVE FREQUENCY= 200.131506
##.OBSERVE NUCLEUS= ^1H
##.DELAY= (6, 6)
##.ACQUISITION MODE= SIMULTANEOUS
##.ACQUISITION SCHEME= undefined
##.AVERAGES= 8
##.DIGITISER RES= 18
##SPECTROMETER/DATA SYSTEM= spect
##.PULSE SEQUENCE= zg30
##.SOLVENT NAME= CD3CN
##.SHIFT REFERENCE= (INTERNAL, CD3CN, 0, 15.7039)
##AUDIT TRAIL= $$ (NUMBER, WHEN, WHO, WHERE, WHAT)
$$ ##TITLE= Audit trail, XWIN-NMR		Version 3.5
$$ ##JCAMPDX= 5.01
$$ ##ORIGIN= Bruker BioSpin GmbH
$$ ##OWNER= she
$$ F:/spectra/data/she/nmr/H-F/1/audita.txt
$$ ##AUDIT TRAIL=  $$ (NUMBER, WHEN, WHO, WHERE, WHAT)
(   1,<2021-06-03 11:50:16.87 +0400>,<she>,<DPX200>,
      <created by zg, POWCHK disabled, PULCHK disabled
       configuration hash MD5:
       00 E9 B6 7A A2 85 ED C7 34 08 36 98 17 FE 4E 26
       data hash MD5: 16K
       BD 5E 9C DA BC 01 E9 C7 53 30 53 5F AC 34 AE 61>)
$$ ##END=
$$ 
$$ hash MD5
$$ 75 9D 4D D9 40 7F E9 D6 89 AD F2 BE 34 62 13 33
##$RELAX= 
##$RELAX= 
##$RELAX= 
##$RELAX= 
##$RELAX= 
##$RELAX= 
$$ Bruker specific parameters
$$ --------------------------
##$DU= <F:/spectra>
##$EXPNO= 1
##$NAME= <H-F>
##$PROCNO= 1
##$TYPE= <nmr>
##$USER= <she>
##$AMP= (0..31)
100 100 100 100 100 100 100 100 100 100 100 100 100 100 100 100 100 100 
100 100 100 100 100 100 100 100 100 100 100 100 100 100 
##$AQSEQ= 0
##$AQ_mod= 1
##$AUNM= <au_zg>
##$AUTOPOS= <>
##$BF1= 200.13
##$BF2= 200.13
##$BF3= 200.13
##$BF4= 200.13
##$BF5= 200.13
##$BF6= 200.13
##$BF7= 200.13
##$BF8= 200.13
##$BYTORDA= 1
##$CFDGTYP= 0
##$CFRGTYP= 5
##$CHEMSTR= <none>
##$CNST= (0..31)
1 1 145 1 1 1 1 1 1 1 1 1 1 1 1 1 1 1 1 1 1 1 1 1 1 1 1 1 1 1 1 1 
##$CPDPRG= <>
##$CPDPRG1= <>
##$CPDPRG2= <>
##$CPDPRG3= <>
##$CPDPRG4= <mlev>
##$CPDPRG5= <mlev>
##$CPDPRG6= <mlev>
##$CPDPRG7= <mlev>
##$CPDPRG8= <mlev>
##$CPDPRGB= <>
##$CPDPRGT= <>
##$D= (0..31)
0 1.2 0 0 0 0 0 0 0 0.06 0 0.03 0 0 0 0 0.0002 0 0 0 0 0 0 0 0 0 0 0 0 
0 0 0 
##$DATE= 1622706616
##$DBL= (0..7)
120 120 120 120 120 120 120 120 
##$DBP= (0..7)
150 150 150 150 150 150 150 150 
##$DBP07= 0
##$DBPNAM0= <>
##$DBPNAM1= <>
##$DBPNAM2= <>
##$DBPNAM3= <>
##$DBPNAM4= <>
##$DBPNAM5= <>
##$DBPNAM6= <>
##$DBPNAM7= <>
##$DBPOAL= (0..7)
0.5 0.5 0.5 0.5 0.5 0.5 0.5 0.5 
##$DBPOFFS= (0..7)
0 0 0 0 0 0 0 0 
##$DE= 6
##$DECBNUC= <off>
##$DECIM= 32
##$DECNUC= <off>
##$DECSTAT= 4
##$DIGMOD= 1
##$DIGTYP= 9
##$DL= (0..7)
0 120 120 120 120 120 120 120 
##$DP= (0..7)
150 150 150 150 150 150 150 150 
##$DP07= 0
##$DPNAME0= <>
##$DPNAME1= <>
##$DPNAME2= <>
##$DPNAME3= <>
##$DPNAME4= <>
##$DPNAME5= <>
##$DPNAME6= <>
##$DPNAME7= <>
##$DPOAL= (0..7)
0.5 0.5 0.5 0.5 0.5 0.5 0.5 0.5 
##$DPOFFS= (0..7)
0 0 0 0 0 0 0 0 
##$DQDMODE= 0
##$DR= 18
##$DS= 0
##$DSLIST= <SSSSSSSSSSSSSSS>
$$ [...]
##$SUBNAM2= <"">
##$SUBNAM3= <"">
##$SUBNAM4= <"">
##$SUBNAM5= <"">
##$SUBNAM6= <"">
##$SUBNAM7= <"">
##$SUBNAM8= <"">
##$SUBNAM9= <"">
##$SW= 20.0188882624521
##$SWIBOX= (0..15)
0 0 2 0 0 0 0 0 0 0 0 0 0 0 0 0 
##$SW_h= 4006.41025641026
##$TD= 16384
##$TD0= 1
##$TE= 0
##$TE2= 300
##$TE3= 300
##$TEG= 300
##$TL= (0..7)
0 120 120 120 120 120 120 120 
##$TP= (0..7)
150 150 150 150 150 150 150 150 
##$TP07= 0
##$TPNAME0= <>
##$TPNAME1= <>
##$TPNAME2= <>
##$TPNAME3= <>
##$TPNAME4= <>
##$TPNAME5= <>
##$TPNAME6= <>
##$TPNAME7= <>
##$TPOAL= (0..7)
0.5 0.5 0.5 0.5 0.5 0.5 0.5 0.5 
##$TPOFFS= (0..7)
0 0 0 0 0 0 0 0 
##$TUNHIN= 0
##$TUNHOUT= 0
##$TUNXOUT= 0
##$USERA1= <user>
##$USERA2= <user>
##$USERA3= <user>
##$USERA4= <user>
##$USERA5= <user>
##$V9= 5
##$VALIST= <valist>
##$VCLIST= <CCCCCCCCCCCCCCC>
##$VD= 0
##$VDLIST= <DDDDDDDDDDDDDDD>
##$VPLIST= <PPPPPPPPPPPPPPP>
##$VTLIST= <TTTTTTTTTTTTTTT>
##$WBST= 1024
##$WBSW= 4
##$XGAIN= (0..3)
0 0 0 0 
##$XL= 0
##$YL= 0
##$YMAX_a= 419432
##$YMIN_a= -410879
##$ZGOPTNS= <>
##$ZL1= 120
##$ZL2= 120
##$ZL3= 120
##$ZL4= 120
##$ABSF1= 10
##$ABSF2= 0
##$ABSG= 5
##$ABSL= 3
##$ALPHA= 0
##$AQORDER= 0
##$ASSFAC= 0
##$ASSFACI= 0
##$ASSFACX= 0
##$ASSWID= 0
##$AUNMP= <proc_1d>
##$AZFE= 0.1
##$AZFW= 0.1
##$BCFW= 1
##$BC_mod= 2
##$BYTORDP= 1
##$COROFFS= 0
##$CY= 11.3945322036743
##$DATMOD= 1
##$DC= 2
##$DFILT= <>
##$DTYPP= 0
##$F1P= 15.9154993809931
##$F2P= -4.1035820241983
##$FCOR= 0.5
##$FTSIZE= 0
##$FT_mod= 4
##$GAMMA= 1
##$GB= 0.15
##$INTBC= 1
##$INTSCL= 1
##$ISEN= 128
##$LB= 0.24
##$LEV0= 0
##$LPBIN= 0
##$MAXI= 10000
##$MC2= 0
##$MEAN= 0
##$ME_mod= 0
##$MI= 1.114404
##$NCOEF= 0
##$NC_proc= 0
##$NLEV= 6
##$NOISF1= 3.799351
##$NOISF2= 2.8
##$NSP= 1
##$NTH_PI= 0
##$NZP= 0
##$OFFSET= 15.70392
##$PC= 1
##$PHC0= -11481.64
##$PHC1= 14.20099
##$PH_mod= 1
##$PKNL= yes
##$PPARMOD= 0
##$PSCAL= 0
##$PSIGN= 0
##$REVERSE= no
##$SF= 200.130013532006
##$SI= 16384
##$SIGF1= 3
##$SIGF2= 2
##$SINO= 400
##$SIOLD= 16384
##$SREGLST= <1H.CDCl3>
##$SSB= 0
##$STSI= 0
##$STSR= 0
##$SW_p= 3612.71676300578
##$SYMM= 0
##$S_DEV= 0
##$TDeff= 0
##$TDoff= 0
##$TI= <>
##$TILT= no
##$TM1= 0
##$TM2= 0
##$TOPLEV= 0
##$USERP1= <user>
##$USERP2= <user>
##$USERP3= <user>
##$USERP4= <user>
##$USERP5= <user>
##$WDW= 1
##$XDIM= 8192
##$YMAX_p= 0
##$YMIN_p= 0
$$ End of Bruker specific parameters
$$ ---------------------------------
##NTUPLES= NMR FID
##VAR_NAME=  TIME,          FID/REAL,        FID/IMAG
##SYMBOL=    X,             R,               I
##VAR_TYPE=  INDEPENDENT,   DEPENDENT,       DEPENDENT
##VAR_FORM=  AFFN,          ASDF,            ASDF
##VAR_DIM=   8192,          8192,            8192
##UNITS=     SECONDS,       ARBITRARY UNITS, ARBITRARY UNITS
##FACTOR=    0.0002496,     1,               1
##FIRST=     0,             0,               0
##LAST=      2.0444736,     0,               0
##MIN=       0,             -410879,         0
##MAX=       2.0444736,     419432,          0
$$ Real data points
##PAGE= N=1
##DATA TABLE= (X++(R..R)), XYDATA
0@%%%%%%%%%%qJ6j6J6k4L2l3M1n6O4p2Q8j04J28j53J77k08K40k76L17l63M15m72
33b51N35o04O80p64Q56r58J070j191J322j467J627j800J987k194K421k668K940
50A541l238L565l930M338m793N305n886O553p326Q235r326J0661j2335J4506j7453
65i583K1705k8403M0543o9385K59704K04851o32095j17415M07732J49682k70891
76d3555l6563J02471J713N569K4040j71420j958K83019M3347l35818q3233K97921
88H5533Q8801k43693k8193J68741J330j01865k2663J4953M8241P0154k3954j25349
100f7964P717J02149n4492m0410J47392Q641k04339l3046J89113L3003j29422
111d1658L9226P7717j24106n5079J25226K9750n5235M9538M581j77636j8208K70996
$$ y = [0, 0, 0, 0, 0, 0, 0, 0, 0, 0, 0, -8, 8, -8, 8, -16, 16, -17, 24, -32, 32, -40, 48, -56, 72, -81, 96, -112, 128, -148, 169, -194, 221, -251, 284, -320, 360, -404, 452, -506, 564, -627, 695, -772, 855, -945, 1042, -1152, 1269, -1399, 1541, -1697, 1868, -2062, 2276, -2517, 2788, -3098, 3455, -3871, 4364, -4962, 5699, -6636, 7870, -9583, 12122, -16281, 24262, -45123, 214581, 419432, -212663, -330078, 77654, 227336, -43555, -80118, 22353, 24066, 29635, 53675, -117745, -119703, 163316, 206663, -129155, -212388, 85533, 174334, -69359, -97552, 71189, 72519, -29346, -52009, -37056, 11185, 81339, 57385, -67964, -60247, 41902, -12590, -53000, 94392, 103033, -101306, -134352, 54761, 87764, -41658, -2432, 75285, -48821, -103900, 21326, 51076, -4159, 45379, 49960, -127676, -145884, 125112]
123A25112M5987k63502l1626J96507k4172j58608P6402J59477q4453j25470M8244
134c6102K9750j3658O8590J6094j06620l0937R8740P468r1138N4520R7558q9024
146E241r6555O4141P5482k5885l4695J9130k042j7527J1952k2468J409Q9169P98
159F8150j31354k9444J31672M8618j13365k5206R6239r504p5639Q134L8343J8087
171B4731K0645j5715q7426k1516J28272M5061j23778k9706J00542L616r7829N62
183e2541J00717J3260o4781j9536j1511L585O5541K7197o4525m4820M1021K4746
195A8353m1863J4672N9523k9839n6960P551K2963P170J8064J6304m0492m7718
207e2272L4661L9262j5012J436N740k9384j7137L0037K3938k8162l037L8761k5916
$$ y = [125112, 171099, -92403, -124029, 72478, 48306, -110302, -33900, 125577, 41124, -84346, -36102, -6352, -20010, 48580, 64674, -41946, -72883, 25857, 33325, -57813, -3293, 94265, 5241, -91314, -27173, 48309, 22424, -12271, 6859, 4817, -12710, -758, -23226, -21817, 67352, 68150, -63204, -92648, 39024, 87642, -25723, -50929, 45310, 35806, -39833, -31699, 6644, 24731, 45376, 29661, -57765, -79281, 48991, 94052, -29726, -59432, 41110, 44726, -53103, -52541, 48176, 61436, -3345, -22881, -34392, -30807, 34734, 61931, -2594, -47414, -6393, 18353, -23510, -8838, 50685, 20846, -36114, -28563, -5600, 1570, 19634, 35938, -4554, -52272, -17611, 21651, 6639, 8075, 13815, -15569, -32706, -2669, 21269, -6893, -9930, 28831, 2915]
220B915m9818K7867M7587p832l0453K134O522j7025J2756K1523j9206O28K1768
233A9366k0955l6038J8355N3219l784m5080R04J2750r996R243J7252l44j2118
246B774r587m788p048K3721L2853k4887l5480J0844J4178k700K870J7639l699
259A6690l2251j72J6587n39J2903J0663k3172k1782R920K3971o495p666K0460
272A9117r835l2325O457K5277P283q326l347m210j9136N793K9786k434j4292J344
286A152m480j1135K739K3835P237k2095n468L173p863R735J6543k177j5827p914
300a2545Q507O3j480J4430j324j1969j738k977R51Q060J0264n72j8890l481J1253
315a448l015L708J1151l165j1766r113N430Q160M804J1412j0387k4132M889J6254
$$ y = [2915, -46903, -19036, 28551, 20719, -9734, -7600, -1078, -18103, -5347, 16176, -3030, -2402, 19366, -1589, -37627, -19272, 33947, 30163, -14917, -14013, -1263, -11259, -2016, 15236, 14892, 2774, -6813, -11601, -18649, 5072, 37925, 13038, -22442, -11598, 2580, -120, 2750, 20389, 16690, -15561, -15733, 854, 315, 13218, 23881, 709, -21073, -11153, 12818, 6323, -1343, 19117, 9282, -23043, -16586, 8691, 15974, 7648, 4301, 91, -19045, -13252, 16534, 14100, -192, 1152, -3328, -14463, -11724, 12111, 19348, -2747, -8215, -5042, -12905, -3170, 13373, 11196, -4631, -12545, -4038, -3975, -5455, 8975, 7651, -4318, -6056, -9033, -8082, -22, 10242, 9670, -9220, -12701, -1448, -4463, -755, 10396, 7231, -4535, -13648, -8218, -58, 4746, 16158, 5771, -18361, -13472, 2782]
329B782M182q21J23k137j6479l453K1814O619n556k754r074o747N209J5167O501
344A5376j4494m146M533q091K144J2903M138q198r916L172J793k785J1584L369
358A1382j0468m147p49J782L191M288N677r136r273L237J649N201O723l493o781
373i17p628J613R138J895K619k727j1512K30L955L687N296q24l916q377k949J1244
389H27K808k818K825m714n950KN094P082k768k292L68r288Q84R834L064r53n651
406a646j152k015l933J0984P820p221o096l182J029N002K784O345n908r556J632
421e113L166L099N667j493m637o491o46Q288L085n05j380m514j690O45L393N018
437E892j805k589j094l958J976L340J409L743n005m294l55P07N388J677j085j353
$$ y = [2782, 6964, 6143, 6266, 4129, -12350, -15803, 6011, 12630, 7074, 4320, -4754, -11501, -6292, 8875, 15376, 882, -3264, 1269, -6822, -4678, 8225, 12363, 4165, -5751, -2579, -786, -3571, 8013, 11382, 914, -3233, -3982, -2200, 991, 5279, 10956, 1820, -7453, -4216, -2567, 2634, 9357, 5864, -917, -8545, -6932, 2206, 4101, 6720, 3993, -7519, -7289, -3334, 353, 5649, 4825, 909, -7468, -10417, 827, 3635, 817, 3642, -1072, -7022, -7020, -1926, 5156, 2388, 96, 464, -8824, -7940, 1894, 4958, 4005, -1646, -2798, -4813, -8746, 2238, 10058, 2837, -3259, -6441, -5412, -410, 2374, 8719, 2811, -6745, -5113, -1947, 1152, 6819, 5326, 689, -5802, -6448, 1840, 4925, 4420, 3040, -1474, -3164, -2519, 874, 5892, 4087, 1498, 404, -3554, -1578, 1762, 3171, 6914, 1909, -2385, -2740, -2033, 3355, 5032, 3947, 2594]
453B594o564l81N538J602K712j322n474l898p19Q649N390o421k776j641j550L151
469a110K111L731j375p037J21J39R92O157k0l822m245n45N231r06o15M700l203
486C04m035n60J086M611J42m30k43n973M2M169K199K377k931l493m99j867N579
503D78M237l186j533l330k67K489J279M191j89o654j166J187M007L197l796p53
519A91k75k262K199J075J335J279k772p89k479M96O292k71k873o34j345N65o10
536h78J584N361k976m350p28l4L298J992L58j166o033l65M949P80J321n23l476
553h86j758j002M781K981l654m51n55k185J094J036L831l34n684J97J264l8K052
570F89o54K17n02k287J113m54P32M012j365l495j873O54M988m65j846J298k186
$$ y = [2594, -3970, -4351, 1187, 2789, 5501, 4179, -1295, -5193, -5912, 2737, 8127, 1706, -1070, -2711, -4261, -1110, 1001, 4732, 3357, -3680, -3559, -3420, -2428, 3729, 3709, -113, -4358, -4903, 328, -578, -1193, 3507, 304, -3731, -4291, -3205, 1406, 1548, 1118, 875, -5098, -5056, -887, 1312, 3689, 758, -2735, -3234, -5101, 478, 4715, 1529, -4, -3334, -3601, -1112, 167, 4358, 4169, -2485, -3651, -2464, 1543, 4740, 944, 191, -84, -2346, -147, 928, 2263, 3542, 770, -19, -2498, -2002, 4290, 4019, 1146, 512, -833, -268, -878, 706, 6067, 3091, -1259, -1987, -2021, 1277, 3269, 3627, 2461, -3572, -3937, 1012, 1792, 3113, 2590, -886, -2644, -3646, 1135, 4116, 462, 11, -544, -2729, -1635, -599, 3232, 2898, -2786, -2589, -1325, -1363, 689, 35, 252, -250, -2537, -1424, -1878, -1146, 2866, 1501, -1994, -3867, -3213, 1775, 1310, -536, 762, -1424]
587a424j763P45K125M101k357l543l4r28K808K952p77j637k866L85K967o23J431
604A562J047k921r59k98K357J973k840J402O17l664N70J237K040R56l254P36n67
621fj625K427J213r2k12k271j07k24Q69M414j592l930p89Q84K607M3o35J076k705
640f55j373J647O74K330j384k183j20q65J393K533j433o69o86n22R90j269J672
657H0J764k511p53J66n1J066m08J553J24l423L43Q39Q25J868j539l88j153j366
675b964K785R38p57P68j941j002O22J363L222k111k802R44l27J528O99q43J290
692A412k106q18J869l47J112N57j428l90j046R82K044j793R71N99j683m51k24
709g40J395J739j793J25m55j796J892J023O58p54k335O05L06j30K456m13j864
$$ y = [-1424, -3187, -2442, -317, 3784, 1427, -2116, -2150, -3078, -270, 2682, 1905, 268, -2598, -2213, 754, 131, 1562, 2609, -312, -1271, -1569, 788, 2761, -79, 1323, 1940, -1724, -1154, 83, 2123, 3079, -175, 561, -6, -1631, 796, 2009, 1917, 1705, -566, -673, -897, -28, 4386, 2794, -1136, -1925, -1041, 1566, 1609, 974, 2050, -655, -2028, -381, 293, 2623, 1239, -944, -1064, -1929, -536, 1997, 564, -105, -791, -1313, -323, -1592, 80, 1844, -667, -1420, -1254, -1305, -239, -647, 906, 1030, -2393, -2050, -1211, -386, 1482, -57, -445, -1598, -2964, -179, 759, 2, 770, -1171, -2173, -1551, -188, 3034, 923, -1879, -935, -1262, 266, 965, 122, 1412, -694, -1512, 357, 10, 1122, 1679, 251, -139, -1185, -203, 1841, 48, 1019, 1618, -65, -516, -740, 655, 2394, 601, 726, 271, -1525, 367, 1390, 2048, 1294, -1041, -436, -130, -260, 2196, 1783, -81]
726h1n09o07J887L87o41O34j514j096J227M41J233r82j346J206j304K38J347n07
744A3K62m28p67L80j100J076J754j561j28o17l15J072m84J428P50k928J46L00
762a147P97J115r80L22j105j334K158Q46l83j06j380K62L18J2J974o99j556P79
780a07l38N61K21m23J346j289j038J592k27J5M15j55O46j714p6J415o12N51L01
799A084q61j53r51R38J812j335j05l1j098J284P6Q85k7k379L18M97J1J288m59
818G94n88n92o84J378O10j083O41m16o20K09j06J027l86j107J476q51p29O94K8
837c05P58p77n07N46p02qJ509n47q0j095j04J359n82P62Q26k033l41M91P17Q08
857F95j059L41k29j055P59R32K27l25j360P13M47j031J528M9r31M56m07O05k08
$$ y = [-81, -590, -1197, 690, 1077, 436, 1070, -444, -1540, -313, 128, 1361, 379, -967, 239, -1065, -827, 520, 13, 275, -153, -920, -540, -1640, -564, 1190, -371, -499, -1116, -1431, -359, -843, 585, 1335, -1593, -1447, -1147, -350, 765, -215, 107, -998, -2332, -174, 672, 289, 183, -1197, -935, -617, -605, 1369, 670, -886, -107, -445, 116, 337, -86, 1260, -29, -1067, 525, 298, 313, 728, 573, 1219, -495, -571, 844, 232, 783, 1084, 223, 70, -881, 57, 1869, 534, 429, 398, -700, 584, 660, 1545, 1518, -861, -543, -46, -35, 1253, 794, 206, -386, -1070, 308, 918, -165, 476, 60, -560, -351, -457, 570, 184, -923, 553, -298, -1027, -333, -305, 453, -324, -831, -285, -987, -995, 514, -33, -113, -1208, -1312, 47, -535, 227, 1053, -980, -1321, -830, -113, 695, -364, -23, -252, -1307, -548, 384, 611, 286, -1074, -361, 86, -945, 583, 632, -299, 157, -250, 355, 147]
876A47m78J316m73o82L04m12O43m3Q6Q63j249o33J182j27J36J22q99N70r22M81
896f8J855j228o0j17q82L51K45P02K25j699M23N33n05Q30n96Q9J62j259R40N18
916D59j027Q49j54O9l06r32J286j6r27R06l49o32J76J16J050o32q59R44p36J78
936e37P10o0J89j121m93J384m81L20N08r33j09j01L30J029j266L31M72p10K96
955b42K16k8L95r89P87K75j013J075J9l25K94p36J39L20q08J176L75q48j74k49
975c41O87L75l15M43l63j208O47M61M79m15p61Q69p58Q3J069m33k04m09o2N22
995C66k06PP45r94k23M71j66L01o38J95L32p49O38Q6n70M51j65J99R7j087O61
1016b49L01l85M08l67%l65k31J515n97q40M77o8Q2M31j75L91r22l76Q67k5m3J29
$$ y = [147, -331, 985, 512, -170, 134, -278, 365, 322, 408, 1271, 22, -611, 571, 444, 580, 702, -197, 373, -549, -68, 1787, 559, 499, 382, -500, -149, 96, 798, 1023, -676, -253, 280, -225, 605, 9, 98, 260, -999, -59, 459, -568, 281, 127, 196, -110, -1042, 244, 228, -699, 207, -142, -774, -598, -482, 568, -64, -923, 21, -715, -537, 173, 113, 302, -819, -1312, 72, -409, -89, 419, -514, -623, -724, -394, 635, -631, -300, 172, -538, -242, -26, -54, 341, -648, 139, 414, -599, 476, 495, 170, 464, -272, -133, 187, -621, 555, 930, 82, -92, -341, 346, 721, 406, 849, 486, -722, -75, 386, 865, 450, -311, 558, -200, -117, 952, 519, 315, -94, -156, 366, 160, 167, 912, -82, -305, 166, 0, 301, -337, -142, 190, -559, 79, 165, -405, 46, -119, 80, 177, -910, -249, 52, -333, 75, -292, -292, -657, -888, 627, 30, -810, -333, -401, -319, 112, -63, 328, -594, -970, -103, -128, -171, -42]
1038d2m86N13q9j46Q98q91j32L89k70J88o8K32K37o39K04N57o72J39J40M26k8
1059D60p57K77M54l90K61L14l98j56j22M42J93n56P06n64k95J31R0N77m33n18
1079b84O21n7m97N77j08J73m29j21P77p32k90Q89k63m92J58l19P12n84J08O68
1099E07o83mo5P5J81q6P3L07j009M80K65k30L3k04P2L45r73J012K9n07K03j16
1121b95L14r0m25J076p87p45P33K40k8k44j35P38l32n34P84k62k90M11k40L87
1141B76m68j85R31o24L34l3m43K53j56M39K89r39K04L67j56J19K11j60k13n22
1161d76N93O45o24J83j41l99N21k42M31j76m48M60k04o1M01l97L96n13k10P68
1181E07m30m13N73j34o8l8k72K45j57j81N46k38rj65J58J04k02n8K98m60J70L15
$$ y = [-42, -528, -15, -104, -250, 648, -243, -375, 14, -256, -68, -136, 96, 333, -306, -102, 455, -217, -78, 62, 488, 460, -297, -20, 434, 44, 305, 619, 221, 65, -57, 385, 578, 22, 728, 164, -131, 0, 90, 667, 234, -284, 337, 280, -217, 360, 252, 425, -4, -125, 652, -80, -370, 519, 256, -236, -78, -397, 315, -269, -161, 507, -176, -180, -245, -170, 11, -75, -2, 305, -704, -224, 41, -189, -156, -360, -288, 57, -916, 96, 125, -382, -179, -295, 19, -71, -496, 580, -207, -952, -219, 21, -7, -251, -386, 352, 20, -514, 270, 8, -282, 129, -111, 276, -192, -377, 554, -70, 264, 231, -212, 41, -115, 324, 613, -326, -122, 245, 89, 208, 419, 259, 46, -476, 117, 762, 138, 321, 180, -219, 302, 60, 491, 315, -133, 327, 123, 62, 463, 66, 462, -51, -261, 507, 77, -336, 237, 103, 35, -3, -275, -30, -187, -368, 178, -60, -69, -234, -76, 28, -174, -232, 66, -394, -224, 91]
1203I1k92J16k61o3L67k16M21P9p09L87k78M62j11l98O40k52o84R33k22n2J41
1224I9m97P55l9o97J48L10n07Q12l29J46k12l67Q37q2k49j78p6L16j47J35M84
1245F62o50o5L37Nj54k14R8K50l10J99K96l74J97o4k0J65p21O77Op42K75M27j65
1268A15Q0l84N26l8q31Q83n10l26N31L6K31o58l81Q56m8l1J33n42J86j05J12O69
1290E04q18K4O8k92L46J74k39K85k60p9M13l76L0K31k63M25p63N80K71p24L94
1311f9J58m17J50o9J37K26l75J27K57m04K02k0M49j08k02J08k84M8M39j4p7k05
1333E7k19L50l40L18M39m07k93J54M5L64m87J13N62n99J36J69J37l22j70J46J41
1354B94k78j16N30n21M64J4j59j35l23L15J93n39K25M9k57K24j71L63l0n20M25
$$ y = [91, -201, -85, -346, -409, -42, -258, 163, 242, -467, -80, -358, 104, -7, -405, 235, -17, -701, 232, 10, -42, 99, -398, 357, 318, -379, -231, 79, -428, 384, 55, 201, -11, -378, 459, 377, 128, -50, -126, 190, 43, 178, 662, 12, -53, 284, 289, 135, -79, 19, 269, -41, 158, 454, 80, 277, 213, 193, 358, -363, 314, 320, -422, -147, 280, 115, 195, -189, 337, 299, -532, 351, -159, -485, 46, 82, 313, -345, -726, 130, 82, 51, 184, -358, -172, -277, -165, 504, -314, -290, -222, -514, -168, 6, -233, 52, -208, -287, 126, -250, -220, 11, -252, 173, -590, -10, 261, -463, -69, 89, -328, -178, -247, -110, 116, -259, -132, 125, -279, -77, -97, 352, 244, 42, 150, -134, -86, 353, 339, 262, 57, -162, 188, -152, 166, 605, 198, -95, 59, 104, 468, -19, 94, 656, 57, 193, 362, 499, 177, 7, 153, 294, 16, -100, 430, -91, 373, 387, 228, 93, -230, 85, 278, -261, -36, 13, -244, -20, -191, 172, 142, -378, 47]
1375D7j86n0M11o54K39j98MQ56m93k45K26k67J00J09J56l1k96j93P43m40L2L3
1397i7j09M24n50K59K95n90K34n0J21K99n81L87M30o64M43j52q7j84J41L07J10
1418C86l30J31K08m60M35j18r9j42k91O94l01J9J71j14K05o40K60K06k5j66M58
1439D87n11OK21q4J92j93j5K97k42k34K85l61L13l21k2K36l71J70K95M5l93Q5
1461a15r4L00l96M25O9l24m5L91m88J53j27N48j86m19K55NR0j94J4L02j47l45
1483c28N18l96J11K44l17J62j29k50N31k75n1O6k39M36N6k68P4l94K55O14n15
1504i5R6J30j47K13j85n6M67n47O5J33j44J52J07j96J6M1K61k9m02L45k24L15
1526C16k38j11M37m54P3J53j60J3j49j93M48l6j51K99l19m6L37L0j44j04r5M40
$$ y = [47, -139, -189, 222, -432, -193, -391, -387, 469, -24, -269, -43, -310, -210, -101, 55, 24, -272, -465, 278, -162, -130, -97, -206, 218, -332, -73, 222, -368, -134, -184, -63, 236, -345, 42, 472, -192, 251, 99, 12, -172, -31, 276, 386, 56, 187, 395, -65, 370, 252, 153, 11, -280, 414, 113, 132, 303, 189, 394, -246, 14, 220, 195, 29, 487, -24, -18, 203, 119, 311, 118, 103, 400, 158, -76, 209, -152, 161, -160, -182, 54, -317, -147, 148, 193, -200, -115, -209, 91, -305, 120, 189, -135, -180, 211, -277, -124, -251, 297, 111, -308, -53, -48, 42, -152, -138, 164, 17, -328, 190, -206, -95, 149, -168, -6, -135, -385, 146, -129, -180, -114, -353, 83, 139, -129, -55, -449, -194, 420, -95, 1, 131, -16, 197, 12, -44, 423, -124, -59, 74, -70, 82, 189, -7, 9, 50, 311, 282, -120, 225, 1, 316, 78, -33, 404, -50, 23, 176, 16, 29, -120, -313, 135, 99, -52, 247, -72, -118, 219, 249, 105, 1, -94, 346]
1548C46n87J25L03k07J96k92J23n6j67J49j45K48J76k13NN0j43k55L93k62K52
1569C9n9q0o8oJ29K5l37M70j14k28J79j05K28k92O3K44Lk19O6J39J8R2k27J39
1593I9j11j72L85r9r0O3k23J80J89l31M32m77K97j86L3L80m24K62j08l17K75k97
1615b40J38L65m5p7J62n41M35j51l8J05L01m83N8k64K52P1k64L07l26K89k47K57
1637F4M9j24o5J41r5j60M9J00Po9K17o9k99J74K64k00J83l45J34N2j17J66j15
1660e8j62O5M5j02K61l08L13N6j68L0L8O8n5L9j34n7j94N35k82k0J33J1P3Q2k52
1685d3J41j2k28N21l51k83J41K61k01K21k35K39m9j16J84nJ65m15J22J21r9j2
1707F7K71n3j12k65J25K5M6j69j72J50R8j36K08O3m23L30j61N8j01K31J44l24
$$ y = [346, -241, -116, 187, -20, 176, -116, 7, -49, -216, -67, -212, 36, 212, -1, 4, 54, -89, -344, 49, -213, 39, -20, -100, -168, -174, -45, -20, -357, 113, -1, -229, -50, -155, 73, -219, -156, 88, 91, -128, -62, 77, 95, 187, -40, 99, -12, -184, 201, 102, 12, 75, -148, 32, 221, -110, 322, -155, 142, -44, -11, 369, -55, 207, 99, -218, 57, -240, -102, 263, 218, 141, 303, -238, 197, 46, 8, 113, 414, -69, -11, -275, -23, 48, -216, 91, -235, 54, -193, 64, 113, -11, -76, 65, -30, -190, -141, -41, -34, -103, 114, 45, -254, -80, 184, -16, 167, -178, -44, 8, -109, 57, -58, -220, -155, -110, -212, 49, -259, 54, 110, -58, -28, 10, 78, 23, 62, -72, -129, -323, 212, -70, -90, 43, 54, 127, 209, -43, 98, 86, -142, 379, 28, -255, -114, 147, -54, 167, -68, 171, 122, 6, 190, 185, 350, -65, 57, 178, 79, 67, 338, 285, 173, -92, 33, 58, 104, -65, -237, -87, 11, -125, 83, 146, -277, 53, -108, -50, -151, 80, 224, -100]
1729a00K77P6l88j45M69p6M3n02J99k2K26k76M37J7p50L74k42K70j83o7M46k40
1751a57J20J07J42k87pj53L00Qj00m0o0p7L40j73K11k76J26J76o06N11P4m04L40
1774A15k01K81j51J06o7m8r6J15j57K49j03k60M78m53K35J17j70J1O1k12J60k03
1796a93J07L54l11Nj57L58p7k2j28K14l7k13M11l57J8r1p6O16o69p4L61m3J7l38
1820c25J82J47l1J99l15N6J26Mq0J38l02K41j54K01l00J35K34j76qj11K3J38m
1843A8k37J29J94k04k09J05J00J02o3mR1J21J92m77J75j4k74J67J76K51m14j24
1865a99j26M05k55M61k9l90J31J19j84j0m0K14j28j2K50J21k47j01K70q3L07m24
1887E0j93J16K37l38K12RR8j07K4K8N2l9k94K02K4k1m7l7L8j80L51J3j26j1N0
$$ y = [-100, 177, 253, -135, -280, 189, 113, 156, -346, -147, -169, 57, -219, 218, 235, -515, -141, -383, -113, -296, -363, 83, -157, -37, 70, 212, -75, -82, -235, 65, 73, -27, -67, -127, -204, 136, -37, 174, -102, 24, 200, -406, 105, 179, -225, 115, -86, 195, 44, 150, 83, 35, -61, 54, -103, 146, 43, -217, 261, -192, 43, 160, -10, 1, 62, -150, 10, -193, -86, 268, -43, -38, -195, 163, 86, 64, -64, 150, 113, -100, 311, -46, -28, -119, -195, 421, -248, -322, 39, -4, 13, -325, -143, 4, -27, 172, -143, -87, 39, 43, -37, 101, -201, 40, -114, 87, -213, -78, 156, -20, -28, -139, -116, 22, 18, -219, -90, 104, -100, -309, -204, -104, -2, -65, -69, 22, 143, 335, -142, 33, 19, -255, -88, 88, 339, -75, -199, -325, 80, -175, 286, 257, -133, -2, 117, -67, -77, -117, 97, -31, -43, 207, 328, 81, -20, 250, 167, 474, 50, -143, -27, 210, -128, 84, 93, 191, 84, 108, 136, 188, 149, -145, 57, 81, 60, 13, -24, 14, -166, 185, 198, 72, 61, 111]
1912A11R7nQm57J56k90L60L8M4k00L19o1j06N5qo7q0nJ85q73R08j61o2k40K08
1937a26J74j97o9O50j42l38M63q66K11l99Q24j87N05R1j18j54q10J208n68n5l34
1958b37L66j22k33N04K44o32J80l76M51j70j14L25k8j27J16p5o9J0q5L80l58n7
1980a07J54Ml29K12K4K18k49J00J33j08k39K98kk14q2M70Qj20m2j05j17J47q8
2003c4O5O5Oj58%q4J18P1n2L0j27J02j94J59L1j06M35j76qm9J46p20M77J40k00
2028f3M4m1J30j70J72j06Q8J14l42J85P5k64K09K5k09M0K83j17N4o7R3j07P5k2
2052G9q4K13J99k79l33L12K3j74o7m7L12O1j61J21j18J10k23Q2j42K7P8J52n2
2075H9j36r2J28J22m64K39L87k36j13J82k98J13J06j63r7L8K7O7J58q2R7j37M5
$$ y = [111, 208, 203, 211, -246, -90, -380, -20, 18, 62, -138, 181, 120, 14, 69, 61, -6, -86, -91, 94, -779, 129, -32, -94, -334, -126, 48, -149, -218, 432, 290, -48, 415, -451, -240, -639, 185, -2, 503, 594, 476, 322, -488, 720, 152, 97, -237, 129, 7, -226, 278, 522, -110, 70, -306, 145, -25, -139, 186, 158, 31, 147, 72, 3, 13, -72, 308, -50, -107, 47, 51, -278, -66, -42, 176, -73, 27, 160, 52, -187, 111, 109, -105, -187, 283, 291, 171, 129, 24, -93, 54, -34, 31, 96, 102, -56, -56, -140, -22, 49, -3, 27, -100, 2, -192, -33, -2, -108, 327, 151, 143, 94, 240, -480, -3, 137, -63, -19, -60, 70, -100, 72, -34, 54, 168, -174, 11, 86, -178, 31, 56, -153, -113, 170, 53, 107, 40, 133, 26, 101, 79, -5, 208, 407, 128, -205, 107, 130, -44, -111, -158, 154, 215, 54, 175, 57, 167, -56, 26, -116, -89, -11, 141, 89, -47, -139, -11, 111, -353, -114, 273, 37, -76, 106, -192, -79, 27, -136, -233, -195, -168, -101, 57, -25, 72, -65, -20]
2098b0j12K45r4J2K12k54j98J16P4N7j55kn2K9L38j02j28O2k6k1L4k52l5L22j61
2123a11J38J17j46L00m86K49K55n73J69j78L61j27j8k76M10l29L96j66LJ61l55
2144b06J19K19j46K46k11J11K13l98J84J28l22K56P7l54J15j84K65l69J74O0M
2165a9k0j6k6J29q5J13J42k13pJ0M9Q3k99L7J73l2j62K22J9j62J17Q7k28p6J75
2190A1K92l31j1K56l38K62k94M9Q8J5j39J02N6Q6k0l18M8L40m64L07l2j57J81
2213a1l90L13J01L5J06n6j61K01j38k8m0J91J6j73L26m7k59K42k41K39j09k85
2235a68L1K26k63Q4p9J28K25pk54J22n9J76j99K27j70J67k1k29R7L7k08O9r7O9
2259i6L4L9J02j64L69k68k37L29Q5k79J28j72K42l93j4K96r2k96N33l17J92q2
$$ y = [-20, -132, 113, 19, 31, 243, -11, -209, -93, -19, 38, -117, -119, -171, -142, 196, 94, -34, 28, 2, -19, 15, -237, -272, 50, -111, 27, 144, -2, 298, -188, 61, 316, -257, -88, -266, 95, -32, -50, -326, 84, -245, 151, -15, -12, 149, -206, -87, 132, -14, 232, 21, 132, 345, -53, 131, 259, -63, 193, 270, -84, 31, -153, 112, -257, -83, -23, -19, -39, -55, -81, 48, -37, 76, 218, 5, -2, 8, 57, 140, -159, -122, 51, 19, -143, 79, 98, -64, 53, 140, -88, -164, 11, 303, -28, -39, 217, -121, 141, -153, -104, -16, -1, -140, -38, 18, 104, 84, -234, -186, 154, -310, -3, -35, -192, -11, -401, -88, 13, 48, 154, 98, -63, 138, 0, -28, -68, 123, 139, -34, 292, 245, -14, 228, -13, 226, 117, -168, -137, 89, -174, -90, -169, -41, 184, 177, -77, 45, -14, 162, -37, 190, 20, 187, 166, -63, 34, 71, -137, -68, -165, -96, -62, -23, 79, -85, 284, 16, -221, 108, 193, -86, 42, -130, 112, -281, -295, 1, -91, -387, 146, -171, 21, -61]
2281f1J70j25J0Km6Rk37K87k3L5j55K92O6j82j88K0J55k60J32k5K17j62K5J86
2305A42r9J94j35p3o4K3j98L00J3j47o4Q9O4q7j20J64J00j68J66L31l64N5j02
2328B0J03j88j61J70J63M1j97o9L48l18k5l7J84J9m3j30L24j36j69P2j96J71K46
2351A92j82n1J54p8j80J34m3J13k0j27J54p1J26l93L35j69L11j56j14K57l58K41
2373G5Kj07M6n0K6jR3j84R8k46K43r6J55J14k24K12m0o5J86r0k40M8J8J59j16
2398A6N9k0j33LL66l90j8N5K59k87n1J65k23K25N0j35M32j80k33J54P2j04kl15
2422b35J48n4J40k3J32p8q2R4O1l23J19M2m9K43L2q1j07q6J93N8j12J24m45K33
2446e6k22J10J70P5k91Q2K98l4l15K53qq9j94K03J5J46o1l15Q2Q4Q2J40q4q6l09
$$ y = [-61, 109, -16, -6, -4, -50, -41, -278, 9, -14, 21, -134, 158, 224, 42, -146, -126, 29, -231, -99, -124, 93, -69, -44, 142, 43, 237, 102, 29, -35, -12, -210, 90, 103, -44, -108, -19, 45, -42, -162, 2, 102, -66, 100, 431, 67, 122, 20, 123, -65, -226, -56, 107, 148, -49, -118, 230, -88, -113, -150, 34, 53, 10, -120, 204, 68, -101, -29, -225, -54, 192, 10, -41, 113, 35, -145, -11, -54, 59, 39, -88, 66, -5, 121, -272, 63, -106, 205, 49, -65, 192, -166, 75, 77, -30, 16, -34, -8, -9, 84, -100, -2, -248, -5, -101, 54, 168, -56, 156, 116, 51, 237, 147, -93, -45, -27, 132, 16, 75, 55, -78, -75, 291, -99, -117, -62, 197, -90, -141, 24, -199, 26, 76, -59, 373, 193, -40, 114, 186, 82, 80, -235, -87, -141, -1, -24, 108, 30, -52, 42, 103, -220, -101, -59, -108, 135, 167, 86, -21, -107, 86, 144, 32, 156, -289, -56, -278, -168, 2, 77, -214, -132, 166, 132, -183, 70, 62, -27, -221, -18, -3, 143, 82, -233, -151, -67, 15, 155, 71, -15, -324]
2471c24K57L2J30j90J16r7R7Q8j83L7J66j54M9j15kj54K61j49Q7k75J85L00M4
2494B06j52J81m2k55Q1j63O28n53QnM9m0k28K28K13n06Q7K61rJ93q8J71n5N5j76
2519H9j92K81k18M1P1k09J69k49L93k07n7J61k74J49QK09k57P4j6q3o9p4J84J20
2543D4j56J68m9j64K11j34j93K39q8J98Ro7j4j61L06j81l5j59M03j35J8l50M63
2566A73j30r3K88k30J44m16L59Lj32K7P3Mo7J30P8l86L31j69K91k80J30o1J44
2589B11L2n5j40J91m54K54pr6j4J62O5j78J79l21K04J38j70L31k93q1K7j25q6
2612b26N48j88j89J09J6O1l11J21O8L7J45j24q1Jj29J93L2N6j57J36k76K42J3
2635I7j62J03p5K00r1P6n2J11j33j60J41j68J94L6m01J12J6L5Q0j5j72L43l44
$$ y = [-324, -67, -35, 95, -95, 21, -76, 21, 109, -74, -37, 129, -25, 24, -91, -93, -247, 14, -135, -48, -323, -138, 162, 206, 54, 235, 193, -62, 19, -144, 484, -69, -61, -66, -17, -57, -285, -57, 156, -350, -263, -2, -11, 182, 94, 265, 210, 265, 89, -103, 178, -40, 1, 72, -137, 32, -217, 176, -31, -88, 73, -201, -52, -44, 165, -92, -18, -34, -117, -186, -260, -76, 44, -112, 56, 7, -157, 54, -80, -273, -34, -122, 76, 85, 18, 4, -157, 149, -32, -67, -226, 177, 42, 60, -290, 173, 43, -50, 238, 8, 152, -264, 95, 98, -34, -7, 66, 70, 3, 133, 211, -175, 156, -13, 278, -2, 128, 67, 211, 243, 188, 48, 239, -215, 39, 32, -64, -78, 84, 149, -29, 150, -171, 33, 171, 1, 332, 39, -42, -15, -140, -226, 322, 134, -55, 54, 70, 131, -180, -59, 9, 46, 191, 67, -14, -13, -142, 51, 83, 139, -18, 118, -158, 84, 97, -65, 38, -37, 163, 72, 148, 96, 207, 74, -86, 55, -113, 81, 117, -284, -172, -156, -121, -41, -56, -228, 115, -229]
2658b29L75J8j30k50K74o7j1K84l48pj27M00k59K4oJ64o3j02K76l05K73J37n6
2681B65j53k52L20n1r2jL5j13j44L25j66K50k96J80l4O1j58j05L11Qj64J88o8
2704A46k22j5J54m2k7rJ4p6J54j98J47NJ75l09J89j65L09l42J87m1k16J53K0O3
2728E4m69O46l29J20K2k5J18k05Q9k81L75J0Nk47Q4J44n7j48k26J87nJ02r5J14
2752a7J54j91j4K1nJ0l1K56j58R8J50o2j29J53k39r8j49L00k13O4L75j45k4J03
2776B09q9k62o6J88j45M08j99J90L9m11K14j20M4k3J20K7o5J4j23K02j35O2N6
2799A35l9k67L40j39k32K93mj86J8J61o7l29L78%j65M4k13N16q0k4j64P5m4j9
2823a2J46l1k33J51n3J35j93J23k20P2K59k74K22j08Qn5p8J49j35J76R5k1J3l81
$$ y = [-229, 146, 164, 34, -216, 58, -9, -20, 264, -84, -91, -218, 182, -77, -53, -59, 105, 42, -60, 216, -89, 184, 321, 265, 112, -140, 180, 129, 37, 36, 71, -42, -186, 139, -27, 223, -73, 107, 73, 134, -24, -129, 182, 190, 26, 214, 146, -76, -91, 63, 21, -6, -15, -1, -77, 77, -121, 26, 31, 206, -103, 86, -79, 230, -112, 75, 34, -182, -29, -9, 54, -415, 231, -98, 22, 44, 19, 137, -68, 21, -260, 115, 125, 130, -117, -33, 111, 54, -94, -320, -133, -138, -36, -131, -17, 137, -54, -68, -47, -52, -42, -73, 183, 25, 123, 273, 211, 82, 235, -4, -102, -251, 49, -164, -100, 275, 130, 106, 209, 120, -142, -208, -20, -165, 243, 44, 234, 273, -138, 76, -44, 0, -23, 97, 124, 59, 73, -50, 152, 17, 79, 135, 96, -171, 169, 30, -202, 91, 87, -99, -81, 80, 13, -316, 62, 62, -103, -59, -272, 244, 164, 140, -24, 51, 7, -12, 134, 103, -130, 21, -32, 103, -90, 33, -187, -115, 144, -130, 92, -16, -8, -63, -141, 8, -127, 49, 144, 123, 136, -245]
2847b45P5M25j96j43K36ko2RqJ62k51J03l05J44j94J60J39q1J67j96k52K71m0
2870h4K54l26J90j07J54J12j45O6k28K06j91K92j05l42K6J21J11N4j58J83j68
2891h5O8J75j12R9k69kQM5N5j00K23j70r6J64R9k9o5j63K88J06O6k90J95l12J91
2916H9N7k23J49r7lL50l01J05k9j78R5k96K02L26l30N2J23j31p2K79j71P8k01
2939a27K81k19l6K56l19q0M02r8J81k1k68J38n1k1m0N7j22K0K9J95l44M06k39
2962b0J4J24j62J70n0N0j41K35m05n8K40J0O6j33J20M7j89mK55j19n0n5K69k14
2986@J00j99K29k40J74j87J76j06j11L79k04J12j78q0j1K60j36P7p5J4J60kl56
3009b04K04k4K96k77j41K1O5J61o5k3k21L06p1Q2jj35J14l9J88o20L68K48O0k31
$$ y = [-245, -170, 255, 59, -84, 152, 150, 88, 97, 89, 251, 0, 103, -202, -58, -252, -92, 47, -34, 133, -63, -315, -44, -84, 170, -156, 34, -73, 81, 193, 48, 114, -114, 92, -99, 193, 88, -254, -228, -107, 4, 58, -100, 83, -85, -17, 158, 46, 145, -124, -126, -118, -73, -18, -118, 105, -65, -161, 3, 102, 73, 8, -155, 133, 239, 305, 15, 210, -102, 89, 146, -77, 72, -25, -28, 322, 21, 126, 97, -81, 14, -282, -80, 246, -84, -32, 91, -40, -112, 167, -4, 74, -127, 154, -65, -101, 155, -164, -244, 158, 60, 241, 220, -48, 90, 39, 18, -22, 35, -87, -67, -38, 157, -187, 219, -20, -6, 118, -44, 126, 76, 126, -15, 220, -185, -243, -3, 7, 73, -60, 60, 107, -82, -86, 169, 50, 0, -55, 214, 0, 100, -99, 130, -110, 64, -123, 53, -53, -164, 215, 11, 123, -55, -135, -146, 114, -22, 55, -20, -6, 154, 152, -204, 0, -24, 272, -5, -146, -125, -60, 101, 36, 13, -208, 98, 27, 109, 108, -27, 87, 48, 236, -384, -16, 232, 292, 61]
3033F1r5k03J7J32J72k52J81m1J63j35m2r2LKK71J30j91m3j15j28K43Q1R2k19
3057hm8l05M72j59J94k53o6K76J6j74k0r5K11%k17L11q2J14l04M03r4k55J41j61
3081a03J2j0L55j38k26J47K3o1j22o3K12j93k6LP8J92k04Nr9J29m5K38j40j26
3105a62j12N62k92j25J70O3o6m2o1J02N3n35M28L2l4J96k19m00L65Q1k5J74j47
3128Fj3j00j20J39k54K95N05p56M05qK97lk88k62J92L68l00K3O7J6j05m22M38
3151A20P3k29p4N13j55k9k94j00M77n41K48J24j97l4K52J06k14r6j65J73J97l1
3173A24l70M92k30K24n35L50k36l9L91q3j32rj39K21M11l78P2K49l09m30J94p
3195a69J1k1K43j57J0J63m5k1J66m2M9j50J50l33J28K07m16K86J71m3k40J72J9
$$ y = [61, -34, -237, -220, -88, 84, -168, 13, -28, 135, 0, -42, -134, -131, -129, 142, 272, 81, 38, -77, -205, 38, 119, 211, -8, -56, -361, 111, -48, 146, -107, -173, 103, 119, -55, -75, -170, 41, 41, -176, 135, 53, 167, -137, 266, 172, -83, 58, -103, -91, -101, 254, 116, -110, 37, 60, -1, -123, -186, 26, -167, -193, -190, -112, 80, -124, -119, -218, -89, -134, 104, -36, -162, -274, 288, -4, -129, 41, 104, 38, -4, -65, 37, 90, -445, -17, 15, -19, 177, -42, -442, -77, 4, -21, 153, 6, -7, -107, -227, -88, -342, -47, 458, -298, 107, 99, 396, 393, 105, -157, 35, 403, 103, 126, 193, 209, 104, -318, 120, 193, -36, -110, 403, 248, 219, -75, -175, 302, -239, 9, 133, -64, -98, 154, 260, 46, -50, -215, -42, 155, 124, -246, 246, 16, 240, -295, 55, -181, -220, 171, 88, -44, -53, -192, 29, 440, 62, 134, 383, 74, -356, -162, -169, -158, -179, 64, -93, -83, 80, 35, 14, 180, 138, 187, 37, 187, -146, -18, 189, -227, 59, 230, 187, -53, 119, 138]
3218A38k85J40k42J15j17M87n67M01Q0N6m51K81j6k65J31r8L12J28l6j04j90O4
3240c8m5j20K45l3j27P0N5J71j7j11J64j92j55K7J78L0k31J30l51J07L01k44M62
3263B76m73K70j32J98j63o5l9j3M0J19K55m22J9j83L25J8j47J25R2j58j15J22
3285e1j8Q4M7P6k28O3j4k22J79J54l9l00o5J64J82L47l68Q3J2j54O4l2J22j08
3309b2j27m8L24j98p2L36n0m3k27l0J66J52k8j28K2m2n8p8J34K4J04j25l0k5k28
3334b97L82J9n28M97O6k08J31p4N5mK28l44l5r0j56M52l1l89K93R9K24l87J12
3357A5j02o4K3r6J14J03k15Q8OJ25k7J00j6j81L61l46K27m38R3K80j13M9j15N2
3381g7L30l17L8q7J43J15k38K09k45N8M4j53J93no1O2J1j23J7K78M8l26j77K49
$$ y = [138, -147, -7, -249, -134, -251, 236, -331, 70, 150, 206, -245, 36, 20, -245, -114, -212, 100, 228, 192, 88, -102, -38, -83, -203, 42, 9, -118, -48, 7, 178, 161, 50, 214, 22, -133, -106, 72, 102, -129, 1, -350, -243, 58, -186, 276, -197, 73, -59, 139, -24, -89, -128, -141, -101, 18, 273, -149, -130, -313, 12, 30, -117, 8, 100, -58, -173, -51, -69, 15, 62, 138, -90, -27, -41, -263, -84, 70, 31, -269, -334, -170, 12, 359, -9, 74, 86, -68, -4, -36, 86, -22, -149, -197, 127, -71, -143, 193, 143, 100, -127, -157, 9, 161, 133, 5, 27, -15, -73, -151, -17, 7, 111, -14, -44, -69, -297, 85, 104, -424, 73, 139, -69, 62, -12, 43, 39, 267, -77, -112, -202, -358, 94, 63, -326, -33, 66, 290, -97, 15, -87, -151, -128, -224, -110, -7, -222, -134, -128, -3, -30, 70, 54, -127, 234, -112, 115, -323, -230, 50, -63, -14, -129, -77, 253, -64, -26, -113, 30, 145, -93, 116, -129, -71, -27, -180, 13, 8, -53, 9, 20, -103, -86, 192, 240, -86, -263, -14]
3405a4J68r6k2p2k9o5K08Oj61PqoL2l8k2J0J57j8N4j87J18O5l5K3jPk98K64j02
3434e5J82Kj69j4J69m1J70k39k50N41k93q5J65k11J56K6k04J46P5Q3p0j58m7L32
3458B11N0l82J95j1j84q5J35J93k5k17n6M34j01m9m0j48J39q3J40j39m7k03J63
3481a10K30q2O7r2l6j51K3J73j42J38J34j56N6K67j3kk42Qq7J30K00n47K96Kj16
3506e2J61q8k4L0k0J52j14oJ97k04nJ40j18J17j46m7P5j28J37j04J29o7o0O7k23
3531b01K13O4m1j62K38j32n6J70j74N4K67k59m1l8K88j24J39o9L0k06Rl1k17J89
3555i0J41j59K07p5p5O4r6J62q0j60j10K14J25L0J69j15m29L48k97J85k09M36
3577A86j13l29K22j38J07L39n80J72J34j48L6L04J46n60J44L1K67k69j54L81r6
$$ y = [-14, 154, 58, 36, -36, -65, -130, 78, 84, -77, -70, -78, -84, -52, -90, -112, -102, 55, 37, 91, -96, 22, 87, 52, 75, 74, 81, -217, 47, -55, 127, 129, -40, -54, 115, 74, 244, 5, -245, 296, 3, -82, 83, -128, 28, 54, -150, -4, 71, 154, 84, -74, -121, 211, 261, -121, 74, 63, -121, -206, -71, 122, 97, -120, -176, 258, 157, 108, 68, -80, 59, -24, 116, -23, -70, -273, -110, 120, 38, 105, 13, -23, -174, -151, 22, -120, 18, 152, -4, 52, 319, 306, 304, 62, 70, -17, 113, 313, -234, 62, 64, -52, 109, 21, -3, 27, 7, 159, 45, 39, 236, 32, 27, 167, 49, 166, 20, -27, 48, -80, 57, -47, 82, 15, -45, 22, -201, 12, 76, 35, -127, 111, -21, -77, 93, -81, -27, 240, -19, -60, -98, 190, 66, 205, 136, 166, -40, -31, -62, -279, -90, 51, -108, 99, 24, -51, 13, -83, 79, -1, -161, -271, -57, 68, 98, 267, 152, -277, 71, -226, -41, -250, 186, 73, -256, -34, -172, -65, 274, -306, -134, 0, -148, -112, 192, 338, -222, -78, -47, 220, -49, -203, 178, 82]
3598H2o9p2O7o4J32p7K2J62j04Kp3l4J25q7o2L74l28J4lm5J56N5M2m58L03r4j71
3625b05J75J18j18Q6j31R5J09n6k6j45L61l85M1j4K63j12n7j47Q9q6P9PJ65j52
3649d6p7J66k04K36J6m4j76R5R8Q4j62L6j34L8P9J48j74J18L1N9j43K46o43M49
3673I6o1P79r52K81J62r00J33P06L99q76O99P64j378l44P10O63j139O5L18K22
3693C47l83P40j035K80m36O15L50p17L71m73O51l41J58Rp8R6L77r68P81r1p34
3714d81O53R9k50o3r0K66k57P0M0k9P2J92r3m6k26J67l0M9NK9k94L15l59L39O
3739H4k50J30K50k01K44n11L38j4j72j3J21J30q0k47N1M90L1m34k53J164K06j383
3761c19l9M93l81J37L5j41L05J76k74o9k7R7l5J75l32K83j18l41M75k10J09l5
$$ y = [82, 13, -59, 8, -56, 76, -1, 21, 183, 79, 81, 8, -26, 99, 12, -50, 324, -4, 10, 7, -38, 118, 173, 215, -243, 60, -34, -205, -30, 88, -30, 56, -75, 20, 129, 73, 47, -98, 263, -122, -81, -95, 168, 56, -1, -148, -59, -145, -66, -59, 106, -46, -123, 43, -161, 75, 91, 47, -129, -34, 64, 148, -14, 22, -112, -74, 5, 153, -21, 97, 128, 187, 44, 290, -353, 96, 35, 814, -138, 143, 305, -595, -462, 244, 643, -233, 466, 1230, -148, -492, 218, 881, -258, -193, 125, 347, -36, 704, -331, -51, -487, 128, 478, -239, 132, -341, 310, -31, 127, 136, 58, 154, 531, -437, 344, 253, -481, 172, 271, 21, -42, -132, 134, -123, -53, -13, -42, 30, 222, 129, 83, -143, 24, -6, 43, 48, 77, -217, 98, -261, 78, 84, -166, -36, 214, 13, 257, -254, 84, 70, -102, -115, 6, 136, 56, -191, -140, 350, 381, -53, -306, 858, 1064, -319, -358, 135, -246, -109, -74, -215, 90, 266, -8, -77, -104, -7, -42, 133, -199, 84, -34, -375, 100, -110, -1, -36]
3783c6L0N4n4J34K13m29J51m36M46q7k6n0J12n3q3K77j41L8j89J30J58j25k22
3806a88N6K84j75l3P9P0r1J84p3k32J45nj10J46j80r8J59Q2J57l17L57l1k04k6
3830d4L16k02j89J28K09k20j7j02K18j90L75m2l49j25L74r9lR7Pj04l72N38q5
3853A19j49K38k41J29l42O00j00l17J0J61o7J55j99j84J38P2P5JJ20k29N3j36
3875i3K15k7k54J16P5kR9l68N18j59k25J73j24N4J96K44o62J43j39J07J09j39
3897a43J8O2J54r3nO6j29L32l22L3K3k91O42k64r7l2J96m9j13K37l31K10JL5k54
3922a14p3m6J8L51k32K06k94M91l22N2P0o8k55J30K75k76m5J88L8J49m07K52J87
3945B75l08J32j3K55k90lJ91r3n6k76P7J84L7j7r5J6J28j83OL4o0J22Q2n0J39
$$ y = [-36, -6, 48, -6, 128, 341, -88, 63, -373, 73, -14, -40, -90, 22, -31, -114, 163, 22, 60, -129, 1, 159, 34, -188, -132, 152, -23, -56, 23, 93, 2, 186, 113, -119, 26, 21, -89, 57, -123, -221, -62, 20, 177, -140, 217, 186, -18, -44, 272, 70, -119, 9, 218, -2, -19, -121, 97, -93, 282, 240, -109, -234, 140, 41, 38, 135, 142, 38, -334, 204, 119, -30, 208, -33, 96, -246, 354, 254, -63, -53, 108, 41, 196, -3, -187, -49, 23, 98, 99, 219, -10, 43, -93, 122, 95, -159, -43, 32, 30, 129, -239, 279, 120, -105, 68, -56, -2, 194, 438, -224, -81, -220, -113, -4, -143, -125, -63, 91, -2, -7, 59, -70, 262, -60, -27, -4, -295, 347, 83, -14, -46, 150, 101, -12, 225, -106, 104, 105, 140, -114, -187, -233, -215, 136, -96, 110, -184, 307, -15, 37, 107, 39, -216, -86, 189, -87, -132, 56, 94, 243, -164, 88, 275, -33, 99, 86, 341, 51, 48, 239, 146, 90, -186, -109, 75, 112, 95, 0, 16, 144, -39, -33, 1, -59, 63, 145, 95, 234]
3970B34j84j04R8kL6n5j37J46l5n9l28M88j21J94k74K69l07L78o5k79n6K12j6
3993C3j88M7J61J59k67J75j99M00m40K09j8k06J40k62L95k59P7J18jo8n1pj61
4016b13J14J97r0o6J32m9K0m6J49j75j06J44o0j32J32K35k51o9J97L1Q7j59k96
4039b74J39P7k96K41P2K01o5k43K92k53J26O9k13K34j79R2r5K38k21J70j07O2
4061F7j07K9q7Q7Jm4P5K36R3l49K9q2n5J11J53P0j50P6j61j1J87l19J42j2J15
4086I4j09j83K54P6j94M1m9%P4j43J06k4RR2j0o4J8J0J40k18o6L72k1J19l62L4
4112dM3J24j68j36K55Jl86K12J92q6o1J44p1n2K00l18J46Jk5P9k51K54j57j5k67
4137c46K81OR3j67K12k18l1K39n6K43q6k67mK40n9j34q0R1n8J41k84L19K6k0K04
$$ y = [234, 50, -54, 44, 42, 78, 23, -114, 32, -3, -62, -390, 98, -23, 171, -103, 166, -141, 237, 172, -107, -163, 49, 33, -155, -108, 53, 212, -55, 120, -79, 321, -119, 90, 72, -134, 6, -256, 139, -120, -43, 75, 74, 6, -45, -52, -213, -99, 98, 8, -58, 74, 25, 45, -1, 148, -27, -133, 11, -49, -181, -49, 186, -65, -134, 63, 94, 181, 22, -274, -135, -58, -354, -113, -41, 160, 95, -148, 144, -109, 17, 86, -127, 107, -72, 20, -75, 163, -58, 112, 5, 67, -40, -11, -98, -11, -10, -54, 21, 257, 350, 1, 30, -52, -107, 4, 157, 227, 77, 153, -8, -19, 168, -151, -9, -21, 94, -15, -198, 56, 132, -62, -21, -70, -70, 4, -139, -33, -57, -48, 44, 34, -30, -12, -2, 138, -80, -146, 226, 205, 324, -38, -4, 39, 163, -5, -141, 114, 115, -271, -59, 133, 47, -14, 130, 59, 7, 207, -111, 35, 36, 11, 90, -161, 93, -64, -79, -346, -65, -59, 34, -133, 79, -139, -170, 69, 13, 256, 170, -97, -101, 139, 80, -54, -134, -43, -101, 40, -244, 75, 101, 81, 285]
4162B85j75k02p0K25jm9j50J13J17k12J11J56k94J59j22n7J26L26l95j40M93k91
4184d7K66k23K79k25L7NJ80J8k13j11l1m5o7m6K92N9m3j27p7J92Jj6r5J45Jj80
4210g1l1k6R3J17p5j49J5J41j27J15m4m6J91j34J9k98M40j38k66J1K45k60L65
4233H7M9j20j99J45J57q9j02k11K25K0k50L14J97j89J02l13K29J99k82K46l77
4254a62K5L01l15L28k87L05n11K28J75K21l95P0j92K96P0k74L75k78K31q5k49
4275a23J28k40N8J84p5L1q2K53k68J0J86K80l03o5R5j68j18R7P7r3L65j70j90
4298a31p4K26p3R2j17J66n2m76K57j4K3K30k72K13n1Q4m4K30m00J98k42K88K7
4321H8Qj59j18K56l48J54J14j17j00J72l4K16J75k23k22R3M7m9m2k72K55L64k18
$$ y = [285, 110, -92, -162, 63, 62, 13, -137, -24, 93, -119, -8, 148, -146, 13, -109, -166, -40, 286, -109, -249, 244, -47, 219, -4, 275, 50, 87, 92, 272, 290, 77, -34, -65, -110, -177, -223, 69, 128, 85, -42, -119, 73, 74, 58, -37, 108, 109, -71, -102, -128, -35, 82, 7, -142, -127, 14, -113, 2, -42, -88, 103, -31, -12, -310, 130, -8, -274, -263, -18, -278, 87, 136, 16, -183, -38, 119, 30, -72, -283, -58, -38, -288, 26, 223, 34, 136, -177, 52, 251, -31, 215, -162, -137, 164, -151, 177, -110, 195, -316, -88, 87, 308, -87, -17, -209, 87, 157, -117, 258, -20, 211, 126, -123, 5, -235, -177, 7, -68, -37, -119, 134, -134, -124, 62, 342, 39, -26, 69, -99, -217, -120, -43, -136, 229, 59, -131, -205, 21, -52, 40, -77, 89, 37, -439, -182, -196, -173, 57, -215, -2, -53, 31, -13, 217, -183, 15, -227, 61, 88, 96, -63, -181, 75, -273, -119, -5, -122, -222, -50, -84, 132, 307, 84, -138, -45, 2, -47, -89, -361, -106, 258, 40]
4344D0Q2l6n0J2Q9k05J24k25J87j30J04J16j14L66q8l46J1L35m23J97J4j56M3
4367e3M40k86l92Q2O72l92j21L80j03k73J04p14O97k34m67J091r87L02P27n16
4387d3k68P15r42O94j03P3l1l14O07o25k72N11l9k04L99P2k97L0m55O99k93K48
4409A62p6o8k47j71N09k77J21k17k38J248n17k78O81m81J5o7k94K63J5J95k96
4430a8m36M01M82j180R37o28J259o18n88K15j51J51O05p35j77P9J59L6K07o78
4450f78O59Nl39o2K84L93k79j8J72j66m97P91j82m00P88l57N2k34Q4k8MQ6J17
4473A95l87L19j51Q5j72r0P2RK43n3K2K32k56N1QP5m06L78p8Lo5j50k02K20N9
4498c9J2L39K9k79q4L8J13m6k70J75k6K9Q5j50m6j9k0L9L91l88Q1J58k0m8p9N6
$$ y = [40, 122, 86, 36, 48, 137, -68, 56, -169, 18, -112, -8, 108, -6, 360, 272, -74, -63, 272, -151, 46, 60, -96, -53, 387, 101, -291, -209, 463, 71, -50, 330, 227, -46, 58, -656, 41, -193, -660, 431, -556, -254, 473, -43, -311, 404, -538, 156, 53, 126, 95, -219, 388, -237, -509, 2, -37, -241, 158, 230, -67, -37, -492, 207, -86, 162, 86, 18, -229, -400, 109, -168, -47, -264, -502, 746, 229, -49, 632, 151, 166, 99, -195, 68, 83, 278, -18, -454, -53, 429, -751, 186, -442, 817, 199, -389, -174, -325, -174, 431, -304, -481, -402, -243, -207, 0, -678, -19, -14, -353, -415, -131, 262, -17, -35, 137, -29, -526, 265, 83, -317, 471, 114, 166, -68, 16, -12, -8, 78, 195, -192, 127, -24, 61, -111, -201, -129, -120, 123, 70, 92, 324, 68, 119, 127, 202, -204, 174, 96, 99, 34, -116, -318, -98, -39, -27, 312, 341, 62, -22, 16, 129, 83, -187, -12, -38, -9, 76, -74, -120, -139, -159, -120, 271, -117, -36, 122, 102, 54, -25, 31]
4524C1Kq7K28N8l52L00k35j84K11j42J35J61n3k30J98L8p6j50k8K51k38K91l35
4547b06L16k68Q4J76j12L3J8q4m3M5j53J10P7k15L87k43K46j62J24k40O4R0M2
4570H6k24J19j32K17j55J37J64o04N04qQ5j22k74K43l8M0q4K58j93N2p1j18J4
4593a04J86o1J6K40k60o7K58j22kr2K02j14j48O1k8K8p3m2n5K97j45P5j74K9Q1
4618a4J7j6k4L1j48j87J55P3P1p1K87m33K41J4K8n3r5L0K34No3j50J47k41K41
4643G9jJ94r1l20J96n6k90L49p7k9J70l61L14j75J09J85j91K7m08K03J32R3J2
4666F4J77l28J25J62j51KJ25j50L52m18J48j06k31M17m22K07J48M3Ll26K91k01
4688f9r4J6J65J94k10Q5P0J37m32O7J17R8n1j18P0q6K2J01J51m03K70m6l0J22
$$ y = [31, 33, -54, 174, 232, -120, 180, -55, -239, -28, -170, -35, 126, 73, -157, 41, 79, 3, -147, -175, 76, -162, 129, -206, 110, -158, -74, 102, -10, 23, 41, -43, -86, -41, -194, -84, -7, -222, 165, -78, 168, 6, 130, -110, -46, 44, 86, -138, -19, -151, 66, -89, 48, 212, -392, 112, 104, 189, 67, -207, 36, -2, 38, -46, 212, 19, 71, 0, -118, -104, 82, 21, 37, 277, 17, -50, 208, 86, 84, -8, 194, 80, -68, -7, -35, -7, -80, -122, -177, 120, -25, 50, -124, -95, -14, 3, -13, -37, -6, -154, -341, -186, -113, -42, -113, 174, -259, -18, -4, 24, -29, -124, -94, 140, 145, 82, -68, 79, -162, 79, 78, 272, 181, -139, 57, 1, -289, 60, -17, -46, 124, -237, 77, -98, 11, 196, 5, 32, -376, -173, -41, 52, 64, 241, -87, 38, 200, 49, 51, 176, 26, 378, -40, 108, 2, -229, 188, -234, -27, 121, 164, 167, -159, 132, -69, -163, -147, 18, 212, 2, 87, 157, 294, -138, -71, 46, 144, 93, -25, 45, -41, -19, 82, 233, -170, 100, 54, 24, 146]
4712A46k58L0K08j46m8L4j72K42%J60n6k70K58l40L84J28k72m0J4J68r8k6J7J27
4736A90q5qk76J96k74M9O0L22l19mK67J71k85J01k09L31P3l27J32m19K90j32K55
4759I9j07J12q7o5K56l14k2M8M9M9n7K26k73L8j2J10n1p4o8p4m3J08M45l98j25
4784b30P5M07l41M7M2J63k46K0L65k88j0p6NK63l58K07j61K61N0l28K23j61k91
4807c62N62k57K04j2l48K96j71J25N3J02k53k67L46r0Q0J86J0j51k82J84P5N6
4829H6j42M08l80J65n9j3j55l3J14m0k1J95p1P8j38k2p5M61l15K09j77Jl1QJ61
4854B14j20m3O4K5k64M0J04J19j24k16J73J31k7l71K28K65k33J42k42J15j9k65
4876c04M93k97J19j21N5OJ69j80J35m7j71K69J89l35M3k51M81k02k13l24O25l16
$$ y = [146, -112, -82, 126, -20, -68, -34, -206, 36, 36, 196, 140, -130, 128, -212, 172, 300, 28, -12, 2, 170, 72, 46, 63, 190, 105, 97, -179, 17, -257, -208, -148, 174, -145, -149, 118, 289, 4, 105, -104, 227, 300, -27, 105, -314, -24, -156, 99, -8, 104, 17, -48, 208, -106, -128, -80, -31, 18, -39, 187, -86, -48, -60, 50, -1, -75, -143, -217, -260, -152, 293, -105, -230, -155, 252, -89, -42, 0, 163, -83, -63, 302, 14, 4, -72, -67, 196, -162, 45, -116, 145, 195, -133, 90, -71, -362, 200, -57, 147, 135, -213, 83, -88, 37, 90, 192, -61, -328, 18, -72, 8, 194, 204, 53, -229, -45, 30, 86, -56, 352, -28, 137, 78, 65, -90, -123, -9, -49, -70, 125, 54, 132, -6, -28, -103, 358, 43, 252, 75, 76, 45, 53, 214, 94, 51, 115, 140, -124, -84, 20, 139, 15, -201, -28, 103, 76, -295, -67, 198, -35, 107, -135, -20, -39, -304, 189, -108, 11, -110, -55, -49, 120, -60, 75, 28, -143, 126, 315, -20, 23, -228, 253, 51, -162, -486, 139, -177]
4898a77j21L50J3l65J72K13O0k01J21R1k79K8o0L10l86M72l47K75%r8k78K20k83
4921b70N79n25M40J02m67J48j65K54q1J6K66k73mN7J4m4p4jJ15l80M18r2M5J62
4945B40m70O2l2K72k9j28j18K99j53j2J09j27Ok4J04j92K34m1K9K39n96K69J51
4968I2J33m75K94J4j57J51L6k26K74J89Ll74J02n9j77K86L9j56No3Q5j44L40l9
4992A73k84O6N1J05j60R1l13M60j7l46L04j09l00R8K19p2J18j26ml0K46j32j2
5015B6J44k51J2M1k6J5K9K4j35r1L47l47L33M5j10J48j36j6nj60L91k91L46k70
5039F3L7k99K51j38L22l35J10K2K3m6j41K69p0j68N7L86q30M72l9j03L27k55K26
5062A41M5j52j38M9l3M8R6j1j54J89j35J81j76Q6K3J03j3n08K36J43R0l7j23j60
$$ y = [-177, -298, 52, 65, -300, -128, 85, 145, -56, 65, 156, -123, -95, -155, 155, -231, 241, -106, 169, 169, 71, -207, 13, -270, 309, -216, 224, 326, -141, 7, -158, 96, 15, 31, 297, 24, 20, 77, 91, 47, -27, -28, 87, -293, 125, 33, 78, 240, -230, -168, -200, 72, 43, -85, -203, 96, -57, -69, 40, -87, -81, -105, -1, -193, 41, 0, 29, 268, -328, -59, 92, 225, -250, 44, 58, -99, 52, 88, -138, 136, 325, 328, -46, 56, -3, -180, 106, 145, -11, -6, -69, 16, -128, 212, 173, -111, -45, 6, 111, -49, 42, -271, 189, 172, -174, 130, 21, -279, -181, 38, -34, 84, -42, -46, -76, 170, 38, 26, 170, -81, -69, -28, -54, -39, -10, 14, -121, -212, 135, -212, 121, 166, 56, 204, 68, 52, 47, -113, 278, -13, 333, 63, 100, -199, 52, -86, 236, -99, 11, 33, 56, 10, -131, 138, 68, -100, -43, 343, -487, -15, -54, -157, 170, -85, 141, 186, 34, -104, -55, -88, -40, 56, 45, -109, 80, -55, 126, -50, 36, 59, 162, 149, -359, -123, 20, 110, 73, -50, -210]
5086b10L57l0O1k83J34J31k17j22J65j2P2n8K08J78k75Kl31L91n9k93J40J43J8
5109A10j78J11lj84L61l26J17j79qJ60j81L83j00Pl8j18KJ35k60L57k12nK68k48
5133b9R6j03J17K78m28P1J50M7l30J84j54j00K70kq5L55m82M4J74k03J22j43P7
5156g4k62J22J66k60L08K19j94r1J7J49k37ML22m21L77k46J68R8j27j24J04j59
5178a41K61q5l0J07m4J19M1k21o6J17q6J42j23j10J41j13j7P5J06N0m6Qk08K10
5202H7J05k74o9L42N9l19r2Q0j04J53K4m7k1J57k15L48m1o7J31P3k04j60K44j65
5226B5K3l9k02L08L1j88j1J99m22R1L79m47K16p2K2J55N9j12L11l24J36l9k58
5249a59K33p4j24J28j65k12O66l50oo9J80J70r7l48K75p0K9P9q0j87j60M80k77
$$ y = [-210, 147, 117, 178, -105, 29, 160, -57, -179, -14, -26, 46, -12, 196, 374, 99, 101, -230, 161, 102, -191, -51, 92, 110, -68, 43, 40, -144, 217, -109, 8, -171, -179, -19, -200, 183, 83, 90, 52, -66, -64, 71, -189, 168, -44, -49, 219, -29, 67, -36, 81, 359, -69, 2, 152, 199, -131, 53, -101, -201, 69, 67, -18, 337, -145, -101, 73, -130, -8, -151, -74, -336, -214, -48, -308, 0, 219, 25, -66, -49, 100, -137, -133, 189, -232, 145, -101, 67, 165, 38, -86, 18, -141, 120, 35, 5, 112, 68, 187, 228, 7, -59, 58, -28, 114, -9, -119, 22, -91, -108, -33, 73, 123, 77, 85, -123, 87, 192, -82, -151, 191, 250, -69, -161, -81, -185, -32, -8, -55, -76, 81, -134, 214, 173, 106, 237, 310, 106, -54, 190, 25, 48, 9, -193, 115, 146, -42, -53, 146, -276, -185, 194, -253, -37, -109, -87, 68, 127, 15, 326, 2, 138, 99, -159, 74, 0, -124, 4, -161, -373, 293, -57, -63, -132, 48, 218, 121, -227, 48, -22, 7, 86, 6, -181, -341, 139, -138]
5272a38K62k84O2N5j60K57M11n12J89j33K16j49j01j7L9J27j47K39p4k79J83j65
5294a19k15L64k0M6n6N9j06j33J64Rj17K46k15J16j04J41j06L6K8n7J67r3j14
5317g9J74O3O3j41r8O9l3j6K7O7j30J38o5j0k6j98K89o9L41n15K52k91J68M3p6
5342e3J26j30K2l09P3L68J0l61K78J9J16j84J8K9N5j15J34p5M4K7j77J25l3J84
5366A91J61n73K77q2L05M7o47M37j95J96m2m60O39n14q5K35J41o00K42Q21q69
5387c75M55o0j67J07K3K06J6J98k10o04J004n96J85R2p34K69MK15l32L31N01n95
5409f7N79m35m1J23L40j7q94m81Q10J87K10o49K30J95n00J24K79K93r7J3K35l55
5431H2j44K13p3J19L95m20q94L76K97o17K87M25n23P55k83K47l43j47M42L9l67
$$ y = [-138, 124, -160, -98, -43, -203, 54, 465, -47, 142, 9, 225, 76, -25, -42, -3, 124, -23, 216, 142, -137, 46, -119, -334, 30, 10, 56, 0, 59, -47, -180, -16, -7, -124, 122, -93, 23, -81, 60, -46, -10, 18, -39, 128, 35, -79, 95, 158, 221, 80, -18, 51, 18, 2, 29, 96, -34, 104, 39, 29, 3, -195, 94, 25, 366, -149, 103, -188, -20, 23, -53, 73, -57, -35, -344, -271, 97, 107, -254, 24, 43, 159, -25, -7, 22, 77, -38, 96, 21, 65, 92, -85, 40, 7, 191, 352, -221, 56, -26, 279, 326, -321, 116, -79, 117, 75, -385, 254, -260, -345, -110, 31, -569, -327, 494, -375, 80, 20, -147, -40, -17, 189, 205, 403, 193, -411, 593, -3, 182, 274, -460, -191, -187, 28, -304, 27, 528, -67, 512, 77, 36, 159, 499, 482, -412, -893, -83, 104, 314, -335, -105, 90, -410, -286, -7, 286, 189, 202, 437, 82, -62, 151, 78, 197, 592, 172, -722, -346, -49, -666, -379, 46, -477, 278, -5, 242, -101, -248, 194, 233, -134]
5452a34o6K37j19k33o6J93M7L29j95j41L0L3K32j26j22M2p1p4L30o9J66j16k77
5475a70L40k59q4K68Q6l09K68j59j57J66J11o4k5l83M47R0Pl47J24P5j89J39K79
5498B54k18j0L4j48K83l21K11J93l09pJ04k37Q7R0K71l45J42k04J51j4j49K69
5520A27n8k27K08Km0r7K24m8J42m76L30m5L1J4p1l25K25N9rN2pL3J7l50J66K53
5546A30j62J97j40k92j07L58K45K76j095N50n3j58J16l50O29k6l82R79j086L97
5566B6J04m41J20M80l31M8k6j20j31K43l0J40r9J45%l3j53j53K22p7J98J14l32
5589h6L14l83K63k9J47j83j2m5o7L4j10M3R8O5k5K22m36L62k69Q8Q7J10j07m3
5613C8j48j43L30l3K4j31M1j08K46r0K51l18J97j00J12k24j9p8K89k45k0l42L31
$$ y = [-134, -200, 37, -82, -315, -381, -188, -141, 188, -7, -148, -118, -85, 147, 21, -101, -59, -130, -204, 126, 57, 223, 107, -170, 170, -89, -173, 95, 181, -128, 140, -19, -176, -10, 101, 37, 12, -371, 76, 166, 173, -174, -50, 25, -164, -25, 254, 36, 26, 60, -88, 195, -126, 85, 278, -31, -38, 66, -171, -84, 6, 277, -68, 74, -130, 21, 7, -142, 127, 69, -158, 50, 52, 12, -85, 139, 91, 233, -243, 87, 42, 73, 87, 16, -309, -84, -25, -34, 18, 11, 44, 61, -289, -123, 130, -32, 165, 25, -267, -374, -16, 229, 505, -590, -40, -93, -251, -135, -485, 144, 118, -264, 715, -371, 26, 130, -311, -191, 289, -42, 6, -20, -140, -271, -28, -58, 82, -17, 128, 128, 95, -58, -211, 11, -66, 132, 246, -86, 228, -155, 108, 79, 226, 43, 31, -14, -81, -47, -157, -114, -16, 49, 24, 246, -190, 172, -97, -9, 78, 188, 81, 38, -110, -253, 77, 44, 68, -63, -22, -130, 116, 26, 277, -41, 156, 56, 168, -56, -75, -153, 136, -109, -129, -471, -140]
5636a40J52K6J91l30K20p9oj72j1J72j09J7k7k22L78l5J30k8j66J5o7K12p8j2
5660C1j27k09K41K2R2J23k03O0Q9J72k46q3r5K58j0n2k57K37K0j14J51l79L43
5683F4k0jo4m7n8J65J02k8j22j23L10l02K85j22M3j25P7n3m6K45k57L87j35k58
5707h3J01j7k83M90J14m35L88l91M10k21j15L40m62k05M48j26j72M1L84j59l0
5728A7n4K46r2N7m2j75R9k10N70p32j93L45L4j32J55l8L50m8j35rj50K64j7Q9
5752A99l09j18Q8J72j67L03j05j64Q0M3J29n6L9k51M14l52r2J51p2LJ23j43J28
5775D3q5Q7O6j59N4R3j75J20m6k45L54q1K62j16l85K15J83j53l4j03j99L35N0
5798H1l2k09q3L03o3j24O9J62J47k27n4O5j2j7J3J40j90J35n3k01o2J33J21j33
$$ y = [-140, 12, 38, 229, -101, 119, 40, 34, -138, -149, 23, -86, -69, -96, -318, 60, 25, 155, 127, -39, -24, -91, 121, 43, 31, -96, -305, -64, -42, 50, 173, -30, 30, 119, 291, 45, -38, -133, 125, 115, 63, -194, 43, 63, -51, 100, -279, 64, 44, 43, -21, -68, -126, 39, 141, 113, -9, -132, 178, -124, 161, 39, 82, -43, 34, -19, -65, 180, -77, 310, 175, -83, 18, 1, -282, 208, 322, -113, 275, -116, 294, 73, -42, 298, -164, -369, 79, -47, -219, -178, 206, 47, 17, -37, 209, 117, 174, 132, -43, 56, -154, 416, -316, -509, -164, -130, -262, -107, -145, 205, 157, 22, 13, -137, 127, 110, 199, -110, -228, -140, 32, -135, 168, 63, -101, -21, 22, 151, 95, 134, -117, 297, -55, -147, 4, -68, -65, 58, -85, 43, -42, 45, 111, -48, 6, 99, -76, 44, -2, -247, 107, 26, 288, 172, -213, 2, 185, 32, -2, -105, -304, 31, 81, 49, -160, -243, 60, -3, -127, -58, 104, 251, 24, -30, 35, 23, 6, 19, 159, -31, 104, 51, -150, -212, -79, 42, -91]
5822i1J08p3l03L73p3J01J19k11J66o11M14j1J12j69nK5L08p0k00k7l9J92j91
5845a56k00M86j48OK0j52l5l7K25M96l97k10j33K00p4K41N5j66K7N8Q2p6J16n7
5869A71l37L70l73M10Jj88p0J98j97J81j08rL47o25K89q7k5N4r7K9Oo8L13k47
5893f2j24J37J46O1m70O84k79l5j08J22m8p1J89k68Q8R9l9k8l03L63j18N23n79
5916a20j03P9L06j38r5K02k82J47L5R1q3J09k5Q1l72K3K31j34n0j97M64o4n9P6
5940A22m07J84M1p3L6R6J60k26J30j36K46j06q0jP9j65J95k55K18k29K4j97J46
5963a98M26m42L00j00L8R8j0j23K08j49j48L03j96rj01nL22q8m23J52N3K52j61
5986aM9k23J83P1P1r6j24K40l38M6J54k67J68K37l86J47P2K38l11J59l11Q7K37
$$ y = [-91, 17, -56, -359, 14, -59, 42, 161, -50, 116, -495, -81, -92, 20, -149, -154, -129, 179, 109, -91, -118, -157, 35, -156, -356, 130, -18, -12, 8, -144, -179, -216, 9, 505, 108, -102, -235, -35, -109, 132, 187, 21, 48, 106, 188, 112, 228, 171, -166, 204, -169, 241, 242, 54, -16, 182, -15, 166, 58, 49, 396, -229, 60, -27, -52, 2, -95, -66, -60, -128, 185, -62, -186, -49, 97, 158, -312, 372, 93, 58, -50, 72, 24, -47, 142, -126, -38, 61, 22, -6, -309, 54, -64, 459, -120, -223, -144, 162, 24, -71, 131, -151, -4, 31, 122, 39, 148, 123, 204, -168, -145, 86, -48, -98, -295, 169, 105, 46, 122, -285, -101, -60, -133, -97, -1, 159, -67, 63, -73, 173, 67, -13, -14, 65, -100, 95, -160, 58, -171, -147, -344, -198, 228, -214, 86, -14, 24, 122, 112, -11, 197, 48, -100, 203, 7, -2, -103, -108, 214, 126, -297, -145, -92, 160, -1, 48, -175, 8, 79, 150, 54, -70, 170, -168, -122, 32, -235, -67, 170, -216, -69, 3, 241, -70, 89, -222, -135, 102]
6009A02j1j64P7J31k97L1J26O3Pj84J60l4Q8n5K05k68K96l99j22L56k25K3k1N9
6033e6J3j29J95j58M48l89LM3M7q7p4j40J01M57m18l1k9K30j50P7J58k13J17l3
6057a8K6O0k68L14m2K5q1O7j70j77J60L38k43k07K98k70n5R8K19k2o4K52j23q8
6081B9J8k26K35o8P3j16O8K3L8Oj89J87k02K09J01k21j01R3j05K50o9j42K29r0
6105C0l12L16j34J57Q7J5k43p7N00l23K9l4j69K39j95MJ83J92j53n5j07Q9J31
6128A70J06n66J49OK42j8J12l03J38J1j56j7o5L20k90L94l51K19J26l62K6j7J35
6151IK26l91K46K0K9j58L9J04K8j67O4J6j87J70o7m1N8K46ll86Q9J3P1J57l44
6176a59J14q8K80j82J57j14mj82K75r5L0P8M6M5m93N22r2N6j94o0J64p6j01n5
$$ y = [102, 91, -73, 4, 135, -162, -131, -5, 58, 65, -119, 41, 7, 95, 40, 245, -23, 273, -126, -248, 108, -117, -94, -115, -56, -43, -172, 23, -135, 313, -76, -73, -30, 17, -70, -144, -284, -183, 274, -144, -175, -204, 26, -124, -47, 111, -102, 15, -18, 8, 68, -200, 114, 72, 97, 16, 83, -87, -264, -104, 234, -9, -216, 82, -188, -243, -145, 74, 52, -12, 240, 117, 29, 47, -179, 56, -12, 61, -55, 13, 36, 74, 80, -109, 78, -124, 85, 186, -35, -136, -43, -148, 102, 33, -109, 120, 30, -282, 34, -100, 57, 144, 159, -84, -161, 339, 16, 45, 11, -158, 81, -114, -110, 73, 265, 112, 57, -50, 39, 170, 276, -290, -141, -135, 107, 89, 201, -102, 36, 47, -109, -126, -191, 129, -161, 233, -118, 101, 227, -135, -109, -126, 9, 235, -156, 90, 110, 139, -19, 20, 124, 152, -15, 49, 65, -122, 48, -19, -60, -2, 244, 241, -145, -56, -43, 28, 185, -159, -45, -133, 147, -35, 122, 8, 4, -178, 97, 2, 32, 110, 156, 201, -292, 230, 138, 194, 0, -60, 104, 28, -73, -128]
6200a28J98j42K99k56N5O6P1k17J27J60l90OJ02j3J85q6K33m33K18k70K55p5p
6223d2l0J95r0r1J35k73L78k00j24j8p2K53k87J25L09O8k33k1l1J54j08j32j58
6246b93M76L4m5j69O4l3J28j59j25K96n8k70Q0N0Q5o3j37K26R6m12M00j45m5n8
6270g7j00J73P2J29p8n7O1N4O0k26j64J25q8J68q4j82m4J93J36k7n8K25j87n1
6294b7j87J55L16l16K61J78l5l33k3q6j59J58M50k19J80n89M31k20K89j21O2j41
6316B4k84K20k05M38l35j23q7K69K53o0k22n7j1O4M10R01j459K40J68K64l46L93
6338D55l61Q4p98R6M25j41L13q3L42m3J45m85N92o58J60N45m85kj61J48n7N1O0
6361A42p76M84L99J89o66l86J151l29P57j191Q3Q31o16m21M87m05O74lk25o83
$$ y = [-128, 70, -72, 227, -29, 26, 92, 163, -54, 73, 233, -157, -151, -49, -62, 123, 37, 270, -163, 55, -215, 40, -35, -42, -72, 123, 33, -58, 77, -196, 182, -18, -142, -160, -232, 21, -266, -141, 168, 236, 3, -18, -49, 105, -3, -135, -293, 183, 217, 172, 3, 67, 34, 162, 3, -122, 174, 116, -154, -74, -24, 61, -2, -139, 87, 183, -229, 171, 26, -19, -77, -177, -4, 68, 197, 119, 62, 123, 177, 237, 11, -153, -28, -116, 52, -32, -214, -258, -65, 71, 44, -14, 211, 24, -27, -214, -59, 257, -59, 202, 380, 345, 12, -11, -97, -256, -98, 352, 133, 313, -276, 155, -65, 224, 103, 165, 24, -260, -40, -245, 193, -142, -265, -352, -83, 170, 110, -112, -169, -180, -116, 294, 1195, -264, -24, 144, 408, 62, 455, 94, 178, -620, -524, -99, -240, 73, -10, 332, 289, 434, -51, 541, -117, 43, 588, 103, 101, -60, 88, 31, 82, 142, -634, -150, 249, 438, -228, -614, 537, 208, 965, -226, -143, 688, 72, -349, 138, -267, 407, 404, 179, -504]
6381e04P75J6p31J30N51l29J3J95l53J50J03J1J11j44J40k88M46n54N40j52j88
6402f2L91q1m19J3L37l56O58l83p6KOo5L50k86M5k29K66k53l2o5J90m5J43J6p8
6427a3j14Q5J72k46K61l25K32q9J57l23J86k17LJ38J47%pP3K3j07J32j29K29l77
6451a09O0j0Q1J37n05M70q1N3j20L5J12jj19J39k74J39j25R5k1L00k38j05K62
6474A75k1o4l43L65m54P5o2J44J13P1P3k50J48j48N6K57L3j80lJ02k91J0K58j26
6498f2J92j21J6p9k05L77k56K99k17K06j7K17m84O3o1J46J51j68J4K56n28K59
6520bK14k79jL1J25l04M52J72l22P6k13J24J01J02J5j32J11k67o7j9n6K07j9k07
6544a58J77R8p8p5j64J34J11j26kK16j71K7o4J12j35R9Q1q7J39k62J67m4n1j30
$$ y = [-504, 271, 287, -444, -314, 237, -92, -79, 116, -237, -87, 16, 27, 138, -6, 134, -154, 292, -262, 278, 126, -62, 329, 248, -171, -158, 179, -177, 481, 98, 22, 24, 30, -35, 315, 29, 74, -155, 111, -142, -174, -239, -49, -94, 49, 65, -13, -127, -42, 130, -116, 145, -180, 52, -37, 120, -203, -17, -234, -231, -93, 54, 54, 47, 120, 143, 36, 168, 39, 268, -109, -49, -59, 22, 159, -346, 124, 43, 96, -24, 11, 123, 122, 3, 142, -132, 7, -118, -23, -44, 256, 18, -87, 175, 154, 90, -253, 112, -342, -267, -329, -185, -72, -1, 72, -178, -30, -178, -122, 135, 168, -12, -15, 87, -204, -194, 64, -62, 130, 9, 25, -54, -259, 118, -138, 161, -56, 150, 133, 350, -134, -71, -132, 14, 165, -3, 11, 267, -261, -2, 212, -67, -68, -37, 88, -216, 236, 408, 86, 162, -51, 73, 174, 276, 291, 159, 270, 3, -64, -83, -139, 68, 49, -158, 19, 117, 39, -36, -200, -66, 45, -81, -83, 133, -38, -11, -75, 37, -98, 1, 82, -5, 134, -128, 39, -5, -56, -186]
6568a86K17l79K18O3K2O5j44O8k41K82j96N99m15k4J62N8k78J29J83j31k2Jp2
6591b1j80J89j2J65j17j3k06M67j94k86L03n8l8j16j2q4OL05l17K02k48J97Q5
6614A7k56Q8O9K33r4j25K57k14N8j85K07L2k86q9L16L1J12l45J92J89l01K83j84
6637EJ86n07M54j12j35N8K12rm6l21K29P4k34J32P5op2P6Jm1k59L04j05J65k48
6662a24K45m21M65j87p5L15k47j61K56J9o9j6J88j3p3k3m4m1j69J79J60k65j16
6685b17K49j3l34J92K60p2rL6p1o8J12J2m29nN23m02K18J15n7k85L77j48L12p2
6709B24m26K98l10J4L71r4j2N8l3j60k01M39k64M6j20L15q2K19J58o95K67M24
6731D36k91l4l77j25L76K57r5l21J5J96J01p6J38j17j2Q7j43J26l55J47L48n05
$$ y = [-186, 31, -348, -130, -67, -45, 20, -124, -56, -297, -15, -211, 388, -27, -51, 111, 169, -109, 20, 203, 72, 50, 51, -21, -201, -12, -24, 141, 24, 11, -195, 272, 78, -208, 95, 37, -1, -117, -129, -213, -207, 98, -219, -17, -265, -68, 17, -239, -151, -82, 151, 57, -68, 189, -25, 33, -152, 55, 87, -199, -288, 28, 59, 171, -174, 18, 207, -94, 189, 5, 191, -316, 138, 26, -109, -51, 161, 152, 106, -215, 14, 88, -146, -14, 61, 55, -17, 59, 60, 19, -240, 64, -41, 124, -124, 121, -300, 165, -22, -97, 218, -29, -190, 66, 85, 16, 0, 188, 175, 102, 79, 35, -6, -175, 4, 164, -101, -217, 32, 19, -315, -123, 137, 65, 56, 92, 21, -47, 65, 77, -352, -357, 166, -236, -18, 97, 40, -245, 132, -16, 296, 224, -202, 96, -214, -200, 171, 77, 65, 123, 90, -70, -271, 168, -96, -50, -170, 145, 63, 282, 440, -255, 12, 436, 145, 111, -266, -391, -15, 242, 147, -174, -159, 37, 138, 62, 200, 83, 71, 158, 15, 141, -214, -67, 281, -224]
6753b24Q9L37J04j41k19Q8J80j96J61o04P95m32m1J63k5Q4j34q4o9j49O38l12
6775Il5J60k41n7M29l94N00l70J3n4L17k80o7R6J32M3l62J04j03K25Q9k48K06
6798A12j98J5Q7j6O6j52R3R4j72lj41J29K38k24K11k21J37j60J15J73j30l9J43
6821A57r0m8K44k32p9J04O7j17L68m96M27l76R0J10l51L77L5k45K20k10K89k05
6843C9l8L2k11L73j45k65K37N8rJ62l85O4M6J02l15M81r8Pk12M43m83K96q7O3
6867A55j85K49k97J01j13P8M9rJ57m5o3k11O8Q1j35M9qk4m5J27Qj19R8j51L29
6892A44k70O5j93M53l01J77l04L49k51J28J52l23N5J58K2K5r9O7nm3q1j11M35
6915B49n64L16K36j52J56k44M50l09J61l55J52j87J34n9p6J44l4N3k0K07k06j7
$$ y = [-224, -135, 202, 306, 165, -54, 34, 214, 18, 179, -425, 370, -62, -103, 60, 35, 119, -15, -99, -168, -317, 321, 9, -26, 134, -107, -164, 265, -129, 371, 1, 14, -40, 277, -3, -70, 26, 158, 201, -161, -57, -160, 65, 154, -94, 112, -86, -71, 16, 0, 66, -86, 7, 101, -71, -74, -215, -86, 152, -72, 139, -82, 55, -105, 10, 183, 53, 14, 157, 67, 19, 263, 31, -48, 56, 123, 6, 374, -122, 305, -71, 19, 129, -222, 155, 190, -55, 165, -45, 244, 39, 1, 33, -178, 195, 50, -215, 22, 80, 71, 233, -152, -88, -42, 60, -255, 226, 128, 135, -77, 366, -117, 179, 92, 155, -30, 219, -78, 23, -90, -12, 37, 28, 185, 140, 77, -134, -66, 15, -120, -71, -79, -103, -148, -21, -13, -132, -34, -185, 144, -126, -61, -254, 199, -102, 75, -229, 120, -131, -3, 149, -174, -119, 39, 61, 86, -13, 54, 49, 6, -75, -186, 249, -315, 1, 237, 85, 241, -3, 447, 138, 299, -56, 96, -91, 43, -16, -92, 52, 18, 71, 51, 258, 52, 35]
6937C5j2j34K16k80M02j07n1l26J80J41J9k52K77j50K05l30L27J5l76K05l9J9
6959a6K67k08n4K23k60j67K36j6K50l79PM3M6k33M38k60j0j03jL12l90J86q1K92
6983A22kk71NnJ29J0K73l7j93Q4l1p5j12J13K49l83O0P8k50J04K24k29K09j52
7007h0J02j36J47J3J11j01j23J62l7k14J00j89L25J5o7m3k40K51J07k6j4O5n3
7030G5n5J35k62K25j36l8Kj33O8LJ57j00K19j62k16L07o8P4k74K57j14q0L46k09
7054B1j49J86J55m20K04NJ69m55K09M6k22L47l6M8k92K85k37o2K97l2k6r9Q1k3
7078@J74o7KQ4j55J28j56J48Nk40l4K09k23p1L66j05k30j0M30q4l74P6M04l55
7102g8L4K34l50K13k73K03j52J80j15N1p8J14K2N6p7L0P3k57K93j64q0J07J66
$$ y = [35, 23, -111, 105, -175, 227, 120, 69, -257, -77, 64, 83, -169, 108, -42, 163, -167, 160, 175, -201, 4, -35, -16, 251, 43, -11, 212, -48, -215, 21, 5, 255, -124, -117, -74, -28, -261, 177, -83, -93, -196, -197, 115, -275, -89, -170, 122, 120, -151, -146, -151, -22, -12, 261, 224, 31, 115, 84, 9, -103, 10, 259, -124, -64, 14, -236, -132, 92, -137, 72, -80, 22, -114, 33, 46, 157, 56, -67, 95, 58, -156, -56, -245, 80, 95, 28, -15, -255, -4, 103, 77, 63, 128, 75, 20, 155, -107, 118, -18, -56, -54, -187, -119, -116, 41, -59, 160, -2, -218, 89, 21, 95, -179, 78, -36, -116, 230, 21, -128, 58, 213, -207, -3, 2, 171, -284, -75, -29, -251, 96, 60, 108, -184, 101, -136, -198, 99, 67, 41, -58, 23, 0, 174, 107, 109, 193, 38, 166, 10, 158, 163, -77, -111, 98, -125, -196, 170, 65, -165, -175, 255, 171, -203, -127, 277, -78, -44, 190, -160, 53, -220, -17, -169, 11, -104, -53, -131, -17, 5, 61, -16, 14, 87, -170, 123, -41, -121, -14, 152]
7125A52P6k94j83K39L9j21k4K74l67K91l9L33m47J06l6P5J91l38l0j39J12L51
7147B21j62l9o8%j85K03L9J31j15P0O1j40J2o5K11k47M8J35j55j0J22K00j58l62
7171b53K86n9j13L43k13J92k70L44l41J23j02j38Q5J37k5o4J27j63L19k45j53
7192a83R0J14M4L5r2J24j40O9k78M03m36K96m43O03l53j38J84N25N1o33j30P44
7214D56j111Q86k77l62L81J65l98q2M64KJ48M09r13P33P1p89j2L84J0p02J092
7235E55r00K0L71P19j031M92l64K83m5m51N79k34K08j27m97l05N75J90k48K78
7255F8m8P9j0j97K22k71L31m82L96j19j05K39j61l0J06m4NL5J01j25j27j10J51
7278i6N4n1K77j10n6o2N4j22QK46j66J23KQ2j58k37J20J92K15j58m18P2R5o5J11
$$ y = [152, 228, -66, -249, -10, 29, -92, -116, 158, -209, 82, 43, 376, -71, 35, -1, 74, 265, -73, -103, -242, -130, 221, 59, 20, -48, -48, -233, -30, 9, 140, 25, 95, 156, 16, 28, -37, 174, -73, -25, 110, -45, -55, 67, 267, 109, -253, 33, -26, -139, 204, -9, 183, -87, 257, -84, 39, -63, -201, -116, 21, -4, -68, 59, -104, 215, -30, -183, -93, 21, 65, 100, 8, 132, -8, 61, -217, 186, -250, 46, -397, 206, -147, -285, -101, 424, 475, -158, -288, 456, -655, 231, -46, -408, -27, 138, -260, -342, 122, 124, 272, 681, -232, 501, 572, -217, -229, 155, 165, -537, 555, -345, -325, 46, 765, -266, 226, -138, 145, 100, -351, 228, -6, 202, 75, -422, -727, -152, 38, -210, 68, 20, 99, 89, -108, 114, -157, 174, -308, 88, -31, -136, 103, -58, -88, 18, -26, -21, 14, 115, -10, -137, -247, -96, -42, -93, 184, 74, 18, -44, 10, -112, -104, 142, -24, 99, 101, 183, 25, -212, -92, 100, 315, 157, -261, -189, -94, -159, -48]
7303d8N2M4m0o3K12l86K53k9j20K34Q4j01m8J88k91K7O9Oj07J50j58j1j4l23N74
7328A54j33J25j20J53k71J99Rk42J77O2L3o2Kj27K34l1r2K76k84M3Mj40L41m41
7352a31o7J76k24J27L12m21M13K0l42q9K41jN3r9P5P4k23J91j88K70o5j56J41
7375H7j20k69K85k3m6K15M8j60k0p3J89r1J26k09j08K50k28K35Jp5M9j25L5j22
7399a49j76M04ok58J73J23j74J66K72l79N1K2N8j92J45K4o2J85k10Q8j68k30M44
7422A51j57M9j16J5J7K22k08J01j63P4k7J19n1j65L06j59J84l65J30K01q3k01
7444a26RK75j28j84pL55m18M40j50k99J27J68j8j28j4J89mj62J9n1L71j60n6o8
7468b0k69J82j8J7N8p8J4P6K87n79K47R0p4o1P6L50l50K8RL39l68J68j30O5j74
$$ y = [-48, 4, 48, 8, -55, 157, -229, 24, -5, -125, 109, 193, 92, 44, 232, -59, -32, 37, 43, -64, 86, -72, -83, -97, -420, 154, 21, 146, 26, 179, -92, 107, 116, -126, 51, 113, 146, 84, 86, -41, 193, 162, 70, 346, 62, 105, 109, -31, 310, -131, -198, -22, -246, -119, 193, -228, 185, 205, -137, -226, 15, 14, 67, -32, 43, 117, -106, 85, -103, 167, 102, -54, 87, -33, -302, -17, -40, -86, 129, 177, 17, -3, -76, 113, 22, 148, -61, -169, 81, -147, 88, 89, 14, 63, -62, -27, -149, -325, 79, 73, -185, -12, 111, -63, 103, 375, -4, 47, 69, 127, -65, 80, 104, 42, 227, 17, 105, -63, -293, 151, -6, 43, -73, -58, -41, 181, -27, 74, -89, -15, -42, 77, 26, -139, 167, 8, 192, -173, -43, 158, 75, -126, -117, 158, 30, -154, -161, 194, -224, 216, 66, -233, -106, 62, 44, -84, -98, 91, 87, -75, -56, -107, 264, 104, 48, -20, -289, -107, -125, -108, -50, -128, -114, -38, 249, -330, -83, 7, -67, -128, -52, 298, -52, -24, -15, 324, -44, 124, -6, 59, -115]
7493a15k4m3J06J38K95m25o1M7K6K57l50K82k17l10M60O4k5k18K19k07K92l65
7515a74J46K1j68J09l5K43n1j64o5K83q6j62J53l30J06L01j39j08n6j9K13O1K09
7538B88j63j06j4k5J20k2n9n3P1j18R9r0K00j50j55J16K38K06l13j95L28k67Q4
7561B0L5J05m3k80J4N5J10RJ00l72J90r6j60L83j20q9L20j54O7L8P6k14N1M6N
7586I6n1Jr7K4j9j18K13r0p6J54j35K20k50M45l40MM2J05L5p3J00k70q2N3K80
7611A71l54JK49J00k30K00j50K08l93R5K14k19K11m3k05Q6l9K36m41M73k62O2
7633c0L22l73q6K53j09K12m57J93J4r2L44j68P3k19q2K27j25R6o9nJ10J15l2K13
7657C25k87p4oj79L16l10J22J13j7l3j88K92o3J83k49R7o2P7n1o2j42N0N5j7j4
$$ y = [-115, -139, -182, -76, 62, 357, -68, -129, -82, -56, 201, -149, 133, -84, -394, 66, 130, 105, -113, 106, -101, 191, -174, -28, -7, -175, -66, -101, 142, 91, -73, -138, 145, 59, -103, 50, -280, -174, 127, -12, -120, -176, -195, 18, 79, 288, 125, 19, 5, -20, 100, 78, 19, -34, 37, -81, 18, -72, 128, -22, -177, -61, 177, 383, 70, -125, 203, -64, 20, 55, 160, 117, -163, -149, -94, 16, 25, 125, -247, -57, -153, -313, 70, -50, -139, 181, 27, 94, 132, 208, -6, 45, 91, 96, 45, 46, -51, -27, -46, -164, 49, -41, -117, 37, -98, 122, -128, 317, -23, -19, 23, 128, 163, 90, 190, -80, -162, -109, 171, -183, -182, 67, 167, -63, 137, -13, 195, -198, -103, 111, -108, 103, 60, -145, -59, -98, 138, -303, 170, -92, -30, 292, -81, -167, 86, -23, 189, -268, -75, -61, -153, 191, 23, 96, -123, -205, 22, -103, -7, -76, -81, 29, 144, 112, 325, 38, -36, -42, -221, 95, -215, -93, 20, 3, -30, -218, 74, 11, 194, -55, 42, -20, 57, 6, -56, -198, -148, -93, -110, -124]
7682a24J14j77J52J26J09k25K65l81L87k87Q9k4N0o2J9J3n4k80M34k0j16j5J4
7705Gj72J88r0j18L13o9p1L00l84k27L61k06n9J77Q5q8j62K71l76L79N6k6k19
7728a30J45k64K46k3l2J70M9m26K11L1K71l86K65J49M6l52j2L61n97L62j72K30
7750A42j66o1r3J85M2j11J76j92J23L7J40k63J34j40K96j44j78j53N36l47J12
7771G5M5j7j59J54j16J41j61r6K54l09J41Qk0j10L89l88O4K61k12M0%K72l04j73
7795b21J90O4j21P2j01J50n3J42k2j54k00L45k00K62l19J04K15k49Q7j4r4J70
7817E3k34J83J4j39K00j05MO3k09O1K13L8j80k1K26m17L12j95K42r0J62m70N58
7840B69n19O1J63J26j34j1J88P3r6k46O5p1pK79j50j06K52r2J99k29K29k84m4
$$ y = [-124, -10, -187, -35, 91, 200, -25, 240, -141, 246, -41, 48, 24, 74, 12, 31, 44, -10, -290, 144, 124, 8, -7, 7, -165, 23, -67, -185, 128, 59, -12, 288, -96, -323, 38, -168, -227, -50, 35, -53, -215, 56, -320, 59, 115, 89, -130, 15, -249, -3, -26, -58, 112, 161, -265, -54, -23, 248, -138, 127, 276, 322, -30, -42, 319, -278, 84, -88, 142, -24, -85, -178, 7, 49, -62, 114, -78, 45, 82, 222, -41, 93, -47, 249, 105, -73, -226, 310, -37, 75, 120, 103, -56, 98, -18, 123, -38, -134, 120, -189, -48, -40, -60, -170, 219, -169, -105, 156, -56, -16, -16, 256, -48, -221, -31, 33, -88, -16, -117, 33, -20, 122, 100, -54, -254, 91, -109, 153, -166, -62, 153, -96, -9, -23, -117, 53, -181, 2, 16, -123, 77, -28, -24, 39, -170, -109, 104, 142, -38, -59, 167, -250, 62, -133, 109, 19, 181, -289, 269, -250, -189, -26, 100, -34, -45, 143, 216, 120, -126, -61, -132, -139, 140, -10, -116, 136, 44, 243, 14, 243, -41, -85]
7863h5J03L9n4J55k63k6J75K2q0K9p8L0O6P5k7K01L3l42k9J52j01L2M2j55j69
7888b55J64J84q3J32r8J3M1j95j51K54K98j12r1j68P9Q2Nj94j21M07l59K99j60
7911b9k25J95N7J84K4j16J3P4r2K6R1k28j75L45j75O8k92J49K26j29k05K57k36
7934a93J76J7j18J09l2J50l71L50J5Nm9l5m3jn2K0K4L13l30L4L1K18J07k31o8
7959D6K1k08Q3n5K61k35K27j23K38j05k58j12L66j28k52m4J22P8K26q4j7q2Q9
7982E4oj49P6m5J66j00l13J13L13k78j15L27l9m3j01K52k45k1K58rl88N38k70
8005b5M0l8K0R8L1j55J6O6j7J57k28J84j91j48J01K77q3Kj79O5M9J22k37QK59
8030A94m5k62Q5k0M17k82m3lk94K85j24M72k51o5MQ7m6j26j56O9m0K39m09N84
$$ y = [-85, 18, 57, 3, 158, -105, -131, 44, 66, -14, 15, -63, -33, 33, 108, 81, 282, 315, -27, -56, 96, -5, 27, 69, -86, -255, -91, 93, 10, 142, 44, 57, 98, -97, -248, 6, 304, 192, 101, -67, 12, 94, 99, -95, -216, 191, -168, 131, -29, -254, -59, -2, 182, 206, 90, 103, 177, 85, 111, 202, -26, -201, 144, -31, 37, -255, -106, 120, -9, -214, 43, -193, -17, 0, -118, -9, -41, 109, -262, 88, 103, 108, 59, 24, -19, -20, -72, -52, -28, 285, -45, -11, 20, 238, 345, 114, 46, 67, -141, -58, -113, 148, -87, 140, 17, 255, 150, -108, -220, 146, 18, -234, -278, -156, -78, 148, 64, 47, -35, 54, 48, -101, -25, -70, 96, -4, -317, -204, 109, -169, -284, 43, 4, -39, -140, 112, -133, -154, 104, 95, -293, 245, -25, 15, -23, -3, 95, 126, -29, -13, 53, 36, 193, -35, 149, -42, -190, -89, 188, 105, 107, -72, -7, 42, 164, -73, -65, 194, 149, -113, -28, -48, 369, 87, 44, 41, -253, 32, -92, 380, 129, 64, 68, 155, 109, -17, -173, -104, -144, 95, -314, 270]
8054B70m44J96J4J3j78Q9o6r3J71OJ72k03K11j7J13j86k9M9l90K90j28P2r1L74
8078B15k31k78K62K07j83Kj0j71M37k31k38L58m0q7k59L80k72L9R2k05K20kK3
8101B8K4R0k59J33Lj6j7J86j35J13j25K51k39lL4j10j21K84j85J19m7KN7k65J75
8126b3l0k33L59k94K86J12j37k94L97k66or6K05L08n57M18k5k48M8K51J5j67j27
8149a04q8K09J07l47L12l1L3J2j14J57l51M53k4k46K58j54J86m54L27k04j27J66
8171b4N1k96J47O6J63k10M6J93k20N8R3J66j2j79l14L06R3j60j30K64
$$ y = [270, -174, 22, 36, 49, -129, -40, -106, -199, -28, -22, 150, -53, 158, 141, 254, 68, 39, 88, -302, -12, -140, -68, -159, 215, -16, -294, -32, 175, -8, -6, -16, -187, 250, 19, -219, 139, 99, 12, -247, 133, -139, -100, -8, -213, 7, 5, 28, 52, 142, -117, 16, 19, 3, -14, 172, 37, 150, 25, 276, 37, 34, 68, -42, -163, 121, -64, 55, 8, 10, 67, -198, -23, -53, -286, 73, -221, 65, 177, 40, -254, 143, -123, -129, -225, -20, 288, -269, 149, 124, -124, -76, 175, 190, 23, -104, -192, 17, 124, -223, 89, 58, 91, 103, -11, 146, -205, 248, 224, -22, 236, 82, 268, -186, 141, -63, -190, -24, 27, -269, -122, -56, 107, -103, -57, 136, -84, -26, 67, 233, 221, 42, -272, 34, 127, -33, -163, 101]
8191A01
$$ Imaginary data points
##PAGE= N=2
##DATA TABLE= (X++(I..I)), XYDATA
0@%%%%%%%%%%qJ6j6J6k4L2m0N5o3P2q8J11j35J54j79K13k52K91l34L86m44N07
32B70n77O56p42Q37r42J056j182J320j472J640j823K021k236K472k729L012l323
49a742L661m033M443m896N397n955O584p295Q103r035J0124j1411J2963j4885
63g977J7328k0550K5033l1742M3004o6613K01173l18093k52442N45586P3943k63228
75e4578o5149K12974l0299r3202j0775m8039K8962K65003j9041l62756r3828L52738
87H2010J35814k44727q5498J65423k0764j14727L1868Q6919K2750r636o8412q9704
99a08684M6687J50493l3837j07611P2243K5943j50073R125J98672J0029j88581
110g5594M30J30736o0960o6607J09181J9592r2609K8731M9331j11082l0112K09170
$$ y = [0, 0, 0, 0, 0, 0, 0, 0, 0, 0, 0, -8, 8, -8, 8, -16, 16, -24, 31, -32, 40, -48, 63, -72, 82, -97, 116, -136, 155, -179, 207, -237, 270, -307, 349, -393, 444, -498, 558, -624, 696, -776, 864, -959, 1062, -1174, 1298, -1431, 1581, -1742, 1919, -2114, 2329, -2567, 2830, -3125, 3459, -3836, 4267, -4768, 5356, -6055, 6908, -7977, 9351, -11199, 13834, -17908, 25096, -41517, 159656, -158437, -410879, 134707, 208650, -54578, -119727, 93247, 62948, -30254, -41029, -89068, -60106, 204897, 185856, -176900, -270728, 82010, 217824, -26903, -112401, 53022, 32258, -82469, -50601, 36318, 59068, 49432, -18980, -108684, -61997, 88496, 54659, -52952, 19291, 45234, -104839, -95714, 102958, 112987, -75594, -75164, 55572, -5388, -71995, 37186, 56778, -35831, -7100, 42231, -68851, -98963, 110207]
122A10207L2599k56534j9501K34843j5272j95143N0008J78350o1984j45614N1010
133c7031N8959l3501M1726L3488q8471m0468Q2850J8246p9083M4531J02375r1865
145A1756j20661P2784J00272k1651m6215Q689n660l2080J9941K2282M416M8100
157F1973k2243j26805o432J52994N4547j29056n8389R2839R720p1878K6308N5943
169C9521r357k3142k0280m1164J0491J11351K3902j42643m0560J24139K6733r6381
181c7390r813Q9588N318p8936p657K9529M372L3619R880o1539k9285N3658L1035
194C2379m8325p064N8710j6422n9818J4304L2277Q69N710J0070k8985m0971L1262
207a6004M5697j9474j0522J1983k3822j8686K7313K7735j9040j1804K8300k1261
$$ y = [110207, 142806, -113728, -133229, 101614, 86342, -108801, -58793, 119557, 57573, -88041, -37031, 21928, -11573, 30153, 63641, -24830, -65298, 17552, 35798, -43285, 1246, 103621, 11756, -108905, -36121, 64151, 42500, -3715, 4974, -686, -32766, -12825, 9457, 13873, 61973, 39730, -87075, -93507, 59487, 114034, -15022, -73411, 19428, 29148, -42730, -16422, 39521, 30164, 7022, -13258, -54422, -43931, 67420, 91322, -51321, -91881, 32258, 58991, -37390, -47203, 42385, 47703, -31233, -38890, -9361, -4989, 28630, 38510, -23029, -52314, 1344, 32379, -15946, -23010, 35700, 19278, -40540, -26236, 6041, 6910, 12620, 22690, -6295, -47266, -16004, 29693, 10219, -303, 11680, -12142, -30828, -3515, 24220, 5180, -6624, 21676, 415]
219D15m9967L4856N9190j3434m3273n924J3562o356J1969K8291j9310j9439J4451
232E031j1825k0637K8344M4947j6932n8750R18L6043P10J475R349j2846j6890
245a1063k032J0686M687R942J5745k7699l3329K4137K6754q722r346P078p44k2809
259a6715K952K4724m459k689P797j6904j5127J4711J9523p609j3799J4969J35
272G509l0624N304K9232L844j2847o621j927j0621L906K9587m79k2200m71j020
286g428p149P028K2281N535k6752j2119J1277L4R217J6290r254j9965o535J2487
300e053R594j975P810l373j8259K52P264N448P516J615p775j6300M7J9420J895
315H126m885N002o447j0542l72J0142R405k624k05p163j7086R531K0478j604q713
$$ y = [415, -49552, -14696, 44494, 31060, -12213, -18137, -4575, -10931, 1038, 29329, 10019, -9420, 5031, -6794, -27431, 913, 45860, 28928, -29822, -28904, 7139, 7849, 9324, 18673, 5827, -11063, -13095, -2409, 2278, 12220, 27965, 266, -33063, -8926, 17828, 9106, -240, 6838, 6094, -16715, -13763, 10961, 6502, 3813, 11610, -5294, -20421, -5710, 13813, 6204, -7595, 7374, 7509, -23115, -17811, 11421, 15265, 2418, -4203, -6130, -16751, -12845, 16742, 16263, -5937, -6408, -7428, -14577, -7549, 14732, 20267, -6485, -18604, -7327, -7293, 1924, 18214, 8960, -11005, -17540, -5053, 4541, 2566, 10376, 7003, -11256, -11004, -3740, 1708, 9224, 10839, 3064, -13236, -13189, 6231, 8126, 3241, 8243, 1796, -8746, -9118, 1024, 10429, 7805, 7600, 437, -16649, -7118, 13360, 11756, 3043]
330C043k867j3p277j524J9255M840j4220l233k441k785P122J0445K297j4468o498
345h324R318l867j336J2979J592r874r442L052O600k092P037M558j3825o126M099
360e651L656N368K160K39r209j0446Q008P746K836L338p901r114j828N336J1782
375F320P33n339m050q839L336R846L009M68n093n963k070J202J1151L376q971
390h84r31j058l408M112N187L146m332n073K307m035R53J0755K10n448l689q32
406c020J645p56O426P334j0125o927J156L466N061J947P32n747q456L789O355
421B880Q28K420k342o084k770R31R870J834n586l83m236j496L846K185L940k242
437C595o671N83j495L153N573j062o47l728n438K846L360L775P10n647j917k119
$$ y = [3043, 176, 163, -7114, -8638, 10617, 15457, 1237, -1996, -4437, -7222, -100, 10345, 12642, -1826, -8324, 994, -2873, -4209, 8770, 10362, 488, -8954, -5902, 698, -1394, 5643, 10201, -3624, -9750, -5651, -1995, 3373, 5533, 5772, -3437, -13883, -5875, 1871, 4707, 8045, 144, -8970, -10798, -5462, 6320, 7053, 1714, -2336, -11175, -7839, 2007, 5016, 5484, 391, -5572, -7642, -6440, 4711, 8087, -884, -1815, -2873, -6281, -2169, 3018, 6164, 1832, -3241, -934, -4969, -4016, 6739, 6949, 1501, -2188, -3020, -1375, -2131, 4295, 11629, 1504, -5423, -4267, -801, 4260, 6207, 6939, 1192, -7264, -3475, 2880, 3708, 6128, 3786, -2298, -5068, -4137, 5733, 7567, 1981, 1598, -2638, -4134, -288, 1897, 5837, 3595, -3076, -2493, -3988, -835, 4738, 3676, 3029, -699, -6137, -3291, 69, 3844, 4554, -1093, -3010, -5129]
453e129N88P737Q72k365j818n756k75L793O337L136r216m195K585J039L496J463
469B292k74j921n854J207M014K71L592p48n608j648J353M816P03l040L138j889
485D04m853J743K615L626Jl366n53l253J20O314J080r5k995m570J432J517L847
502C014L822n009l779k32Q2M468J118O25r25o668n24M602L177J676m702k398J496
519a57j415K488K285j010j97k811j197J049K10N024l55n701RL79N49J386j42L206
537C600k296n675J354K378K153J257k178j392l792J70O348L06j499n77l598m02
553c843J564L597K370m580j836J338j244J486J780J259l68n490L36L622J60J017
569A168n51j238M5j715J212J467k86L018j891m302L20J975M141J54m280M48M0
$$ y = [-5129, -4541, 3196, 4068, 1703, -115, -5871, -6146, -2353, 3984, 7120, -2096, -6291, -3706, -2667, 829, 2292, 2018, 97, -5757, -4550, -536, -265, 3327, 2579, -3029, -4677, -3324, 1492, 2195, -845, 2293, 404, -4449, -2706, -91, 3535, 3536, 170, -383, -3636, -3516, 2798, 3878, 3783, 788, -3782, -2350, -833, 3014, 6836, 1827, -1952, -2184, -2102, 2366, 3484, 4109, 3184, -3484, -4008, 594, 3771, 5447, 745, -1653, -157, -1572, 916, 3201, 2191, 1994, -817, -2014, -965, -755, 4269, 3914, -1787, -1778, -1399, -850, 536, 394, 3600, 1304, -4371, -3017, -639, 1514, 2771, 593, -799, -4591, -4421, 1927, 2233, 734, 157, -3441, -3843, -2279, 1318, 3688, -892, -2728, -1390, -2634, -1148, 632, 1891, 1523, -3967, -3631, -9, 151, 1168, 617, -621, -576, -2291, -1079, 388, 102, 3120, 1229, -3073, -2753, -778, 3363, 3517, -763, -315, -275]
586b75j410J640K191J981k854m352J795J177J823K666k688k183j250N50L904p63
602A952p54J089l049j068J708J692J673k874q59K028k874k0K664M97J35k918l48
619a326J516j570K286J466k057n07j707J64J538K23K971j458m964N69J934K184
635A262J56k314Q75j707j438K894J240M24j604k406P92N40P81K605k268j543M64
652a247j1J015l52N99J758l175p60J389J41J199n1n0J44k738M78K445L25O00j468
671B41j155K85p83K436J821k331j01p77j074J610J268J524j844l487J877J074
687E84K71J101j381J31p61j255K600j63l73R34j805l61J72M60J744j451m77J246
705A216j507p27J199N08J432k109j078Q22j045J565J421q46q90k031Q09J735q10
$$ y = [-275, -1685, -45, 2146, 4127, 1273, -3079, -1284, -107, 1716, 4382, 1694, -489, -1739, -1189, 2715, 1952, 1198, 2287, -762, -1830, -122, 1570, 3243, 369, -490, 1538, -1336, -1356, 1308, 1805, 1940, -978, -1326, 190, -1380, 906, 2372, 315, -192, -1899, -1735, -197, 26, 2997, 1539, -3425, -2856, -922, 1262, 1418, -896, -21, -1728, -3166, -272, 968, 1392, -212, -2618, -1826, -1286, -505, 2100, -168, -1711, -1247, -1258, -243, -595, 4, 1762, -1413, -2173, -784, -643, 556, 505, 455, 599, -2139, -1661, 784, 1109, 1709, 241, -914, -629, -1412, 1024, 2845, 514, 413, -364, -1438, 172, 1440, 2964, 1120, -2367, -490, 584, 855, 1956, 575, 706, -55, -1310, 1290, 1127, 754, 1688, -117, -478, -306, 154, 1898, 447, -30, 1216, -291, -1018, 181, 689, 2121, 12, -1066, -244, -1289, 276, 1697, 851, -39, -2070, -1261, 474, -336]
722c36J499l97k466J75L09J741L27j686O47p01j404K114O20K23j033j256J215
739d09k13n25J499j04n26j58o87O99k58o5J838j139j263P67k2J133q5O1O65k261
759a053o28K174J56O28q71r60K17q05J611J564j282p88l64J35Q62j39J065m37
777A085j928P90N81j65N10n86P57r97j030J597K60n65M05l85J36o33n91J902l53
796G90q28O73j075j61J64N46J592j709j195P11n94R92P84m8l46j872K13K002p29
815i0L08m5j198jQ8N85J174j682M15J66p63N57J4P92K7j713J418J4j221J122J89
836A56J65m05q93R31j84n05J739n58p40l18k96J552l12n22J375j612o86J602k34
855B55R29j176k16O11j166Q40J340o95l45o51p0J247q59P22K37j215J39N70m4
$$ y = [-336, 1163, 766, -1700, -1525, -1216, 525, 852, -834, -187, -888, -2292, -178, 442, 665, -368, -1624, -409, -622, -1147, 352, 248, -278, -436, -1123, -424, -682, -747, 1091, -48, -1311, -544, -566, 567, 482, 543, 1208, -1053, -1681, 493, 649, 1277, 406, -554, -337, -1142, 469, 2033, 751, -37, -401, -266, 596, 457, 1522, 1085, -843, -53, 528, 363, 873, 287, 1044, 47, -983, 614, 874, 309, 714, 329, 465, -168, -759, 1143, 790, -38, 635, -440, -601, -437, 109, 1701, -8, -1203, -492, -1086, -94, 690, 642, 296, -1576, -1363, 639, -90, 218, 173, -1025, -1026, -938, -353, 821, -861, -446, -280, -1043, -486, -472, 320, 347, -1366, 52, 66, -1155, -33, 156, 321, -84, -977, -46, -230, -735, 1004, 446, -294, -612, -908, 644, 332, -190, 1185, -427, -1113, 489, 255, 1184, 8, -208, 403, -763, 77, 1417, 722, 377, -274, -344, 903, 44, 766, 1003, -212, -73, 497, 453]
874D53L81p99J101m17j179O89K53k88K82l83L04k47j115J244O03m08j14p70P0
893c40q5j07J619q49r88J80l60Q58L61l29N32j319j54J237l36ql02n7M50q64M14
914d47J019j183N1N07m82J28m17R00K28j067O06J44p03N46m5O68j28j395O69L37
934f4l56J106l99j73n04r5R51J6n56O59p43r5M93n5Q84r29n29J029p18J04P13
955G39j88J93p55n9P64n98K86O69o18Qn37L1O23m22M60L70j037j13K03K24J10
976C53n57L58l68o03P83M73M2n24m81M35q7l56J367r13k87J89n54P74j09m26N75
997H4l39o37J028k80k3j57J31L92p50m1P27o00L89j02k50M35p99N61P59o87K6
1018a33l5k69N29n37Q86J50j312L06L37J89L49m55R5l39l20R63J40n51K40k77
$$ y = [453, 834, 35, 1136, 719, -460, 229, 482, 194, 476, 93, 397, 150, -965, 279, 882, 474, 360, -410, -340, -425, -532, 1087, 238, -750, -570, -930, -72, 289, -40, 492, -827, -981, 256, -80, -88, -390, -447, 3, -861, -447, 572, -611, -560, -53, -535, -407, -824, 76, 304, -763, -157, -13, -716, -170, -215, 453, 325, -1070, -401, -64, -420, 686, 287, 114, -390, -485, 466, 482, -74, 585, -158, -253, 240, 185, 1069, 140, -389, 640, -78, 26, 739, 551, 744, -11, -70, 694, 96, 382, 1051, 433, 441, -96, -65, 558, 136, 596, 966, -71, -184, 19, 243, 353, -204, 154, -214, -817, -34, 439, 481, -43, -524, -89, -176, -532, 835, -78, -365, -176, -730, 44, -65, -491, 84, -255, -892, 136, -144, -167, -324, -193, 199, -551, -592, 135, -465, -76, -178, -428, 7, -792, -231, 528, -159, -133, -168, -437, 92, -445, 441, 591, -721, -415, -78, 111, 460, 5, 100, -239, -559, 404, 544, -7, 233, -44]
1038d4r3J97p2J072r99l15P41l65p8K23P9K38o28k53J058o84K45K05m7K00p37
1059e7M0O32p20L06L92l07m24L3R3O10o17J52k7o11O93R6j09n5n61J53L52m17
1081c53K60Rk13j06n3M50n3n83Q69o4p19L47j25N34k37l86O65m30n48N99R8J12
1103G3N4m93N64q52J21J069n90j28n4j06N15m72M48K36q29j03M57K51K99n87J19
1124hL99p13L29P26p28o2KM61P3q71O42K2j07J96k36K88k30r3O75o47l37O53l73
1147F1j43L43k02O39q43l19P60p0OJ86m77O8k51Q4Q14p14j82M18n77M81J08j45
1169D5J25q40L86L57n29N59o17N15P0n69L48J79m12L26k5n9K1l67N13j43j57M66
1191A92n47n4J12K30K58l68m45P95l24j50M47L2k89r9j65N64j70jM11q86K49K1
$$ y = [-44, -137, 60, -12, 1060, 61, -254, 487, 122, 44, 267, 346, 584, -44, -297, 761, 77, 322, 527, 480, 680, -57, -17, 615, -105, 201, 593, 286, -138, -105, -12, 598, -19, 133, 106, -505, 188, 284, 175, 120, -441, -288, 64, -353, -93, -84, -297, -403, -456, -6, -59, -642, 227, 163, -556, -209, -334, 200, -37, -423, 242, -188, -736, -137, -39, 73, 127, -366, 198, -654, -533, 536, -54, -182, -236, -342, 173, -299, 149, 385, -444, -547, -90, 161, 460, -127, -8, 391, -322, 7, 733, 5, -57, -55, 406, 479, -392, 250, 272, 165, 361, 125, 413, 183, 90, 765, 118, -219, 434, 61, -82, 261, 59, 698, -145, -464, 296, 226, 232, 418, -59, 9, -242, -158, 656, -58, -240, 178, -399, 82, 190, 45, 170, -670, -284, 73, -456, 103, -514, 1, 71, -498, -150, 29, -383, -57, -82, -141, -120, -487, 26, -117, -274, 192, -355, -409, -297, -67, 191, -177, -622, 173, -151, -301, 146, 178, -111, -210, -375, 189, 19, 18, 429, -457, -208, -187]
1213a87O07J76n16NM53n47M0J62k43P2m8K09K47p10M90J66n63K67j21M69k2m36
1235c0M02J74n39J09l55L16K57k40M96o12l89O38J44k30L3j84K51l86N3M22l52
1256b2m68L62k86N81j11l35P11p64J29K94n67L35j10M41k8n15J91J78l54K47K3
1277f8J36n0n80N09o9p3L29k66k32L47j50L99k30k95J53J11j58L61j75K49j94
1298E4l78P12l80O1M90m16j0j57J63J09m10K93M75m44j1M4k60L60l36L75J14m37
1320A1j08P71n30P2k17M8K7j95L19J20k65N3j34K59J0m09K57M7l02J38L86j83
1342A75k83k2L09j01j59J73m32J57J17j26N55m83j6L20m53J41J26k25M26l18j69
1363b88M61l70j9O9j12J12kj2J84m74M18P2j40N6j71L13R9o36P62j72n27M49r1
$$ y = [-187, 420, 596, 80, 85, 538, -9, 31, 193, -50, 22, -26, 183, 430, -280, 210, 376, -187, 80, -41, 428, 406, -30, 372, 546, 7, 116, -239, 77, 334, 94, 590, -22, -411, 227, 371, 141, 174, -10, 241, -145, -92, 330, -22, -490, -128, -414, 167, 56, -279, 432, -332, -203, 91, -476, -141, -251, 190, 162, -353, -162, 16, -338, -91, -68, 68, 18, -562, -53, -122, -195, 134, -132, -364, -17, -167, 232, 2, -293, -140, -29, -187, 174, -1, 248, 54, -324, 388, 8, 69, 559, 143, 133, -24, 139, 248, -162, 131, 606, 162, 151, 195, -65, 295, -41, 334, 448, 11, -97, 674, 144, 216, -1, 47, 74, -121, 198, 318, 53, 106, -28, 231, 241, -168, 89, 136, -166, -28, 358, 175, -108, -130, 179, 78, -81, 92, -340, -183, -66, -192, 363, -120, -136, 184, -269, -128, -2, -227, 199, -119, -288, 173, -197, -216, -147, -259, -147, -149, -161, 23, -451, -33, 39, -101, -45, -216, 97, 196, -440, 322, 150, -377, 72, -19]
1386a9L4K09m51L67j28j46M11l1k87L6J63J18j11k40N46o01J01L45l72p2K31j18
1408a5L31m10K42R2k98Kl0L00J1n12K58q6m5K70n2P7o0q4L71j04n70N16p6j68
1432d0K82l82K86O8o22O62k00m2J41J45l93N5l41O76n39O1K55q4l25J45NN1k1
1455a57j55L47j97k77L35r3L17r9N5O3l89J37k1j18L34m57J16M08l61M09j58q5
1477d6j2k05M84k07j01K17j00j56L86k38o6k1P4R2p0r1K10J02k66J06j14M08n79
1500a93J87K86l47P5J2r6J12J33j80L83n27N66k38R9k85J34k03J21k17J72ok81
1522b93M05m61M11m0r4K3k2o9L47m32J0j35K18J60M9k97M62m31J57M5k03J72M4
1545B6k66L1J28j22L64j23j03m0J34M73o41k96O28j79j05K09k78K09M9jj27j45
$$ y = [-19, 15, 224, -227, 140, 12, -134, 277, 246, -41, -5, 158, 276, 165, -75, 471, -130, -29, 316, -56, -128, 103, -15, 316, -94, 148, 240, -58, -56, -86, 214, 225, -287, -29, -115, -160, 110, 58, 135, 75, -9, 362, 258, -312, 204, 128, -40, 242, -140, 146, 214, -408, 254, 54, 12, 153, 298, -95, -40, -381, 295, -244, -183, 72, -12, -337, -192, -187, -136, -157, -312, 35, -162, -439, -104, -197, 120, 21, 76, 139, -250, -113, -134, -252, 82, -375, -259, 149, -212, 197, 39, -46, -58, -263, 221, 14, -87, 130, 30, -126, 260, 22, -44, -65, 9, 101, 31, -60, 150, 252, -14, 92, -22, 386, -193, -6, 280, -67, 8, 20, -76, 36, 169, -11, 372, -155, 411, 173, 272, -13, 121, -82, 39, -178, -6, -12, -293, 112, -349, 62, 22, -72, -49, -71, -140, 207, -225, -215, -350, -132, 28, 77, -220, 242, -189, -32, 13, -190, -18, 26, -240, -209, -81, -203, 161, 38, -65, -105, 29, 502, -139, -435, 193, 14, -91, 118, -160, 49, 98, 97, -30, -175]
1567a75NR4N1J06n2K8j5k16O43q6n85L46l23K49N6m33M50j84k59K57n8L68k13
1590E4l05M98m2k61K94j61k45K33J24O7j62j61M15m73p3R2J03K27k21j61L08p0
1612H0j73P1j0M8J4J3N2l64o6K79q3J38j7j71N0J46J17j84l61L23J37j71j34J35
1636a31K14o1j25L6J95m38M38j78j0j03o6M70k13J93L5l49J11l1r8K21l06J74
1658b2K69l33P3j7L7J81J02r2j51n8P3J9l04L83j14m06L78Q9K26k99%k4L7J63
1682B10J66l03j61L70l56M53j59q8j15k61L04m1L70k89j34j55M5l4J42j60K33
1703C7O7j51K00J78k72O5j17M8K75l93K1K6j28Qj40P5L26q3r1K33n08O73l85R5
1727E9q3j38K11j24k40J89N9K30j43k68K17J43n9k33K46j20j3p1J27kJ93j5m7
$$ y = [-175, -170, -76, -25, 81, 29, 57, 42, -174, 469, 383, -202, 144, -179, 70, 126, -307, 143, -41, -300, -43, -101, 267, 54, -251, 247, 205, -56, 238, 77, -168, 65, 189, 256, 94, -67, 348, -125, -198, -106, -3, 224, 3, -158, 150, 80, -93, -22, -32, 16, 30, 43, 95, -269, -335, -56, -139, -1, -18, -189, -139, 7, 124, -60, -421, -98, 39, -132, -266, -131, 83, 22, -103, -67, 128, -310, 128, -50, -60, -163, -229, 241, 28, 221, 256, -93, 18, -13, -111, 110, -196, -22, 247, -86, -13, -30, 7, 188, 290, 198, 47, -11, 62, 81, -223, 160, 46, -360, 18, 107, 333, 34, 34, 10, 47, 210, 376, 73, -88, 282, -74, 379, 220, 132, 17, -244, 60, 19, 389, 100, -34, -189, -144, -178, -36, -196, 37, 104, -47, 153, 331, 59, 124, 7, 55, 330, -63, -42, -16, -144, -136, -276, -201, 125, 42, -49, 184, -324, 349, -36, 59, -24, -162, 49, -75, -315, -126, -67, 163, 20, -248, -31, 112, 53, -180, 66, -54, -67, -138, -11, -13, 180, 165, 118]
1750A18k80K65J59k78Q1j09K32k89L47J42m92O1K86l83J23n1P1J09j96P5k04L64
1772A51k9q5k0q0K7J10K06j85L6n5K1j07j40M59k70k38M87j21j91K41l33J82J61
1795B27m51L80J29m4j76q6j0l7j50M06k25K1J9j19J25j58n4L05j58j35N1J64J98
1818B22n43M25l52L10j93L23k07k24M06m47L44n0Q8j94m1J16q8j26J60q6K31j14
1840d0n3K67k00k58K68J11k94J08J53J40k53j1M79m11J45k21K25k6J17j59J65
1861B52j17j24M2j30K88k71J08J21j25K48k94k0J38j98J22N44o21Q3J31l17L47
1882B07l69KL27n09K07L4k17K40k45J06K75j92J51m11O73l61P9k05J84l9O2L4
1904C3k3j48J27J93j28j11J03J2j54K25m05K89K52l35J66j22J24r6j03J31R5j03
$$ y = [118, -162, 103, 262, -16, 65, -44, 188, -101, 246, 388, -104, -43, 243, -140, -17, -68, 3, 112, -84, -9, -213, 151, 122, 37, 17, -63, -36, 74, 280, 95, 131, 76, 97, -10, -150, 309, 39, -199, 288, 167, -24, 217, -116, 66, 227, -224, 156, 285, 241, 65, -21, -31, -68, -218, 188, -37, -16, 3, -116, 9, -149, -203, 102, -56, -191, -140, 24, 222, -321, 104, -248, 62, -131, 192, -15, -239, 167, -280, 64, 14, 102, -92, -133, -17, -105, -231, -71, -157, 74, -40, -93, 174, -26, -284, -16, 95, -199, -91, 62, 202, -51, -62, 417, 6, 151, -70, 155, 129, 246, 87, 252, 135, 11, 53, -77, 211, -60, 48, 169, 44, 292, -2, -22, 116, -82, 40, 584, -37, 46, 177, -140, 207, -162, -160, 167, -342, -135, -101, -318, -78, -323, -217, 58, -134, 17, -394, 279, -82, -3, -208, -24, -63, -1, 33, 10, -138, -11, 182, 54, -57, 46, 58, -96, 129, -276, 13, 265, -70, 96, -26, 98, 2, -101, 30, 125, 22]
1926B2j24J66K24l2j77j62J76L64k81m26O89l28m08Q85m53m61J65P25m90M83l20
1947B37jl63K31L23n88o7Q39n22M8P4o64O47l78l03N07J92j47J71k90K92m31j36
1969c29L13J07K9j40R8l20L26l5q5Q7j65L86n40L39j14o0L48l04K87j18k27P9
1991c8k08J09M7K7K54r1j63J97J40l72J68j91J73k46J22K20m54M08k90J4J62j46
2013a58L07j36j83J90J47j71j08J69m6k0J10l5J43k43l4J36J63n48L52L0L9K00
2035C04m18J51j85J29J62j13j08J95kj3m67M78r4l19J81K76O4j41n1K19l18j69
2057b39L25p8Lr0n7K44r9k8J78l4j78PM7J34r2k5J51k41J18p0Q4j57j49K12K6
2082hp1Q9R1k07j1j6K47k00K73j15k29J74l4k2l1j7j03L3K3J84j47K1K19q6k31
$$ y = [22, -102, 64, 288, 256, 79, -83, 93, 457, 176, -250, 439, 111, -297, 588, 135, -326, -161, 564, 74, 557, 237, 236, -127, 104, 427, -161, -228, 611, 89, 137, 211, -453, 194, -184, -487, 20, 212, 65, 236, -54, 238, -193, -329, -16, 91, 120, -20, 78, -242, 84, 49, -36, 51, -114, 272, -268, 71, -43, -103, 245, -59, 228, 110, -117, -38, -246, -137, -90, -63, 191, 100, -63, 134, 274, -98, 70, -121, 52, -194, -72, 148, -306, 102, -188, -174, -12, -158, 149, 13, -170, 20, 167, -4, -112, 57, 11, -9, 101, 66, 209, -34, -68, 68, 231, -317, 35, 65, 104, 304, -114, 37, -148, -19, 143, 30, -78, 117, 115, 102, -365, 113, 19, -300, -119, 157, 221, 80, 29, 248, -70, -239, 86, 8, 11, -79, -136, 108, 9, -19, 159, 125, -53, -46, 1, 135, 43, 18, 169, -72, 46, -24, 60, -97, -246, -34, -8, -79, 10, 101, -106, -117, -133, 114, -86, 187, 72, -157, 17, -17, -39, -70, -87, -190, -157, -134, 50, -97, -76, 143, 57, -174]
2107a74J92K84m45N15m08K78k15J36m4ql9lJ2K5jM4j14j70M32j77j88J61Nj63
2131f5o5l1K82l6K3l56J28M27l96K9J5K1J52r1n7Rq2K40RJ94l22j30K81k77J79
2156H1J56m75J44j95m7M16L3J09k12o3l2K1j79lK28k2l3K77j24Km1r1P3k4j2p3
2182h6k92N06j52LN7R5j57M4q9p5J13L4p7R0r4K07j56j59M55l86k9j0L5M6O1J9
2208CO8k66K70ok28M56k95J3j06L4l0P4OnK30k52J13p5N5kJ78k13j52J45n3R2
2234E4j03j62Q0M18j83k07J28l9r9J14J4k11K43n3m0J75j78R8j4J83l54L37m19
2257b18L69j7J08j07k50L09R0Jl79R3j5J2j40M0K06j24j41O3j05j10K86mL2j65
2281a66L15j29J8J41j55Ko3P1j79K94j11m30N55j10j99K45l15J39K66j34l00J01
$$ y = [-174, 18, 302, -143, 372, -36, 242, 27, 163, 119, 111, 72, 69, 81, 106, 105, 149, 35, -135, 297, 120, -68, 93, 98, -65, -130, -161, 121, 85, 108, -248, -120, 307, -89, -60, -45, -24, 128, 37, -20, -11, -93, 147, 156, 350, 28, -102, 179, -98, 81, 237, -238, -94, -289, -336, 80, 113, 222, 10, -53, -85, -64, -243, -246, -18, -40, -73, 204, 80, 82, 41, -50, 23, -1, -13, -86, -378, 128, -24, -21, 36, 131, -26, 18, -71, -146, -33, 1, -76, 14, -80, 127, -29, -188, 267, -119, -148, -158, -123, -77, -16, 3, 71, -195, 75, 69, -159, 297, 2, 15, -91, -57, -87, -13, -7, -12, 218, -34, 79, 4, 59, 57, 235, 22, -130, 15, -38, 54, -49, -211, -131, 287, 104, -103, 25, -14, -113, 1, 15, -196, 47, -6, -46, 129, -49, 49, 35, 218, -136, 201, -218, 151, 134, 242, 135, -115, 194, 284, 285, -94, -1, -16, -4, -144, -104, 102, -22, -163, -100, -205, -315, -29, -33, -1, -166, 149, 20, 38, 179, 24, 26, -37, 34, -145, 149, 38, -392, 163, 53, -146, 99, -216, -77, 189, 55, -245, -144]
2303a44PL21l08K90J51m54N6o4L39j17j82J09j27J43J34k65J26J45j44m6J42o8
2325D4J6j85K62k55l58N32j25r3K63j83M9R6O7j22Q8k66J98j13Mq2K13Oj2j35
2349i1K9M7k35J30J58J95k63o4J0J22m6N4j45om1K94n02J79J5Q4N8j7K29k84M5
2374d5j82J9M88k56K03k96k14J94K15j74L50m19K46j55K1n3O6j11K9L24j8k00
2396C2j5Q7o1j99N0J84k68N8p1J46L06m26R1K11k31K03j62K12r2K5n3L4l4J1J57
2421A95p3L4N7j14L2J36kl36R3k03J23n0J48p9p9K30M5j8j17o1j69O9N3k4R4J08
2447I2M3j50j9k3k1L05r3o6j84K5J76j16j5J49k38M00l05j77K9J21k83L12l1J4
2471e5j63M91j19jL3k27J98j06j17j3K47j50r3m4K31q4K37j79j35M9j31Lp5K1
$$ y = [-144, -137, 184, -124, 166, 317, -137, -81, -145, 194, 77, -105, 4, -123, 20, 154, -111, 15, 160, 16, -30, 112, 44, 60, -125, 137, -118, -476, 56, -69, -162, 101, -82, -33, 63, 130, 8, 96, -170, 28, -85, -81, -163, 50, 56, 44, -91, -62, -15, -250, -120, 38, 233, -30, -94, -84, 38, -8, 46, -99, -105, -146, 148, -354, -175, -160, -76, -18, -35, 194, -90, -45, -227, -208, 280, 24, 227, -69, -283, -89, 126, -48, 302, -117, 129, -26, -5, -58, 8, -103, -74, 250, 232, 32, 17, 104, 43, -156, -106, 78, -190, -132, -203, -57, 249, -177, -86, 125, -106, 97, -65, 147, 55, 80, 27, 61, 27, 38, 195, 122, 156, 213, 99, 131, 267, 265, -71, 22, -181, -58, -108, 40, -39, -118, 112, 157, 139, 22, -39, -208, -139, -86, -110, -16, 92, 135, -15, -34, -57, -78, 227, 134, 68, -116, -91, 85, -31, -46, 103, -135, 265, -40, -217, -188, -67, -350, -38, -69, -55, -218, 273, 154, 153, 186, -41, 157, 51, -66, -79, 168, 18, -75, -119, 112, 28, 265, 86, -49, 0, -131, -128, -203, -182]
2495a82j7K59r8Q3j39L05q3J27k31o5M2q1J50j32nL10j14j21q4J06j49O7J19o4
2519CJ07p3J44j89k68M64j98k1pK5J00k61RR8L1n4M17m48J21R8n2J1J58q3Q3l77
2545a62K28p5l39M08j17r4J66j46J43j30j88L27o9L5K5j00O8j05p1J66j9j8J20
2568E3k38L13j0j34R9j53j22L45k13k3J56N1j68j4J02p3N2l9J12p8J40m22J91
2591g3Mk17L50N9k40J36Q9k66K8N06l71r2l9J6K21j68l1O2r0K65l00K17j15k43
2615b92M11r8j8m0L49k63n3j43olR5N1m4L3n1J79K6J39n2r7r3k36K12j01J57P2
2641A34l97L43o5j96L67q5L2k37M5qn2k6J70k96L54p8k54R1RK47j47K76j66k81
2665b20L28k33J67J40K4l49O4M23j99j73R3J67n23J91M5K64k23m5R7k9n4J24M5
$$ y = [-182, -199, 60, -38, 45, -94, 211, 128, 255, 24, -41, 1, -80, 70, -62, -67, 243, 129, 8, -76, 30, -119, -52, 67, 3, 110, 37, 181, -8, -276, 188, -10, -31, -38, -13, 87, -174, -165, -67, -36, -90, 327, -121, 0, 98, 46, 57, 215, 132, 215, -162, 66, -9, -348, 60, -57, -151, 15, -131, 12, -118, -306, 21, -48, -13, 12, -88, -20, -125, -196, -30, -49, -67, 53, -185, 128, 118, -16, 83, -70, -192, 153, -60, -83, 73, 124, -44, -58, 44, -29, 23, -16, 96, 18, 158, -264, -73, -69, -286, 64, 123, -117, 19, 108, -158, -130, 376, 5, -87, -126, -110, 111, -57, -88, -26, -116, 149, -151, 66, -49, -292, 119, 21, 3, -37, 312, 49, -4, -147, -153, -156, -61, -10, -54, -21, -72, 107, 133, 272, 220, 123, 30, -206, 6, -95, 62, 134, -263, 80, 15, -181, 186, 101, 133, -104, -59, -67, -119, -145, 25, -271, 83, 5, -249, -158, -149, 98, -49, 227, 61, -220, 108, -125, 42, 182, 206, -143, -79, 344, 145, -28, 65, 232, -291, -100, -55, 209, -14, -59, 38, 9, -45, 79, 124]
2688A24j11J09o1R8k5k89J01k7J9j36J55J04j40J37j16K24k3Pl12J3J15l14L97
2711D9r2q3J47l4j88J80J97j03l4k9n7O4L5k19K32K02j90k0k54L72k93l2J26l1
2735e5J25K5m0k37j06M24l13N2Q0oN4P5o3o2m8J23P5k45J03n1r2M29j92K4k27
2760a48M2K00l06J89J30p6J1J10j73R2K01j57k68L03j96l7o9L03j74k50N16l7
2782B06k14MN8j52K53k22JO2J57j06J81L1m71K04JO8j17J47k07R2L15j9m75K98
2806I5n6j37K42j43j17J08j61N3l6J90j33o2K10K5Q2l95K95j20j97J87j27L84
2828A87l62J29q0J95j01J1L48m48o4J3J66k1O7j46q9J90J39k44P0j30O6M25j53
2851A68j89j03J31j4J67l27O6p1J96p4k62M22Q9k55n5N1m5L2K25k77J67j74K78
$$ y = [124, 13, 122, 61, 159, 134, -155, -54, -81, -62, -198, -43, 61, -79, 58, -58, 166, 143, 150, -162, -149, -34, -348, 49, -43, -126, 21, -13, -201, -21, 176, 73, 39, 10, -47, 17, 52, -167, 65, 267, 77, 57, -197, 175, -118, -150, -24, -55, 70, 95, 55, -182, -288, 136, -177, -125, -45, -51, 3, 78, 15, -47, -95, 28, 103, -142, -39, -90, -182, 247, 55, 79, -148, -106, 94, -212, -23, 107, 31, 42, 152, -21, 71, 272, 115, -153, 150, -46, -83, -152, 151, -23, -273, 243, 206, -8, -4, 54, -98, 155, -67, -66, -4, 153, 47, 228, 259, -212, -8, -7, 61, -56, 91, -116, -24, 291, 272, -203, 95, 39, -98, 144, 1, -116, -8, -169, -116, -152, 38, -95, -157, 53, 78, 160, -235, 60, -60, -257, -70, -197, 187, -175, -46, -126, 69, -32, -21, 327, -121, -185, -172, -6, -27, 40, -106, -195, -5, 134, -110, -40, -170, -104, 321, 168, -21, -124, 7, -7, 160, -167, -101, -172, 24, -50, -312, 110, 199, -56, -111, -60, -105, -73, 152, -125, 42, -132, 146]
2874A46k86M08k18k18R3K05k89J93k3Q0q1j74L11j19j03L23l82J58J62k73K78
2895A91m3j12k4J03j41n2K29l37l2K04L9j31L11j49q7J9n0K2J4j62j7J90k7J7
2919b5k2K10k08J14j68R1l3m5k2J46o2k3J68k26M3J21Jm5J70j16l40K77m2k03
2943b39J9K42Q0k05k9K18Mk65J18k09N41o2k01Qj0j44P5Q0N3K4K19k82j74K01
2967F2R3o2k88J15K01j33K96k44r3J12k14K15j40J21R3k15J53kMn31K64K44o4
2990a3n1k4K25k61J73j94L60l36L41K3j98J91l73J59l08J33J84J8k26M7J16r7
3012a11J61k32M29k73L6q1P3n3O0R4j61K5J06k32K14l0M0l19J96N3N7J10j13p8
3036b9L00j99j27P8K35j50k65L31mK56m91J65k3L7J3o1J83l52K52k15k6kP3j52
$$ y = [146, -140, 268, 50, -168, -75, 130, -159, 34, 11, 91, 10, -164, 147, 28, -75, 248, -134, 24, 186, -87, 191, 148, 36, 12, 115, -26, -78, 151, -186, -218, -14, 25, -106, 205, 56, -31, -12, -62, -40, -26, -188, -205, -15, -42, -25, -47, 163, -45, 69, -99, -8, -41, -86, -108, 38, -24, -47, 121, -105, -62, 59, 60, 15, 185, 69, -271, 6, -36, -239, -220, 22, 102, -103, -132, 86, 90, -175, -57, -266, 275, 213, 12, 20, 10, -134, -59, 21, 74, 98, 317, 35, -139, 62, 155, 93, -195, -80, 121, -12, 284, 40, -53, 59, -155, 60, -80, 41, 134, -81, 72, 70, 74, -457, -193, 51, -13, -64, -88, 137, -124, 49, -145, 215, -121, 220, 243, 45, 236, -137, 22, -286, -153, 31, 49, -177, -130, -14, -111, 50, -182, 247, -26, 10, -71, 2, -51, 9, 103, -58, -33, 73, -159, 55, 25, 65, -254, -58, -5, 52, 162, 49, -29, 271, 72, -55, 23, 258, 108, -157, 174, 170, 426, -65, 100, 77, 114, 127, 66, 249, -103, 149, -66, -92, -94, -21, -173]
3060a73J71J39l89K36p3n5O4K35j49K05O1j49j26j66J12Q8k2M7j52J89j41M7j50
3083a51M00l48J52QJ8J08q6k23L2J59k37K39q7M1J4k09J82j01r5J79J96j02O5
3106A54r1k5j55L76k08k2j42l01L28O3j17j38K80K25k67J17L3O5r3J31m6j21P0
3129A16J0N1j03N1P1k38J46J04k14m49M50k32j9K30K07o5k72L62n93N10k83NL93
3152B38j84J67n74L30KM3K36j61l69K12L9j53K95R7n24K50K44l30K24p8k80L05
3174B9k1j42L9L60l01j11Q4M13k57k20P5R2j36l24M91n8j08J78k15k54M08p2m7
3197i7L6j14K2K03j85rO6L17k38J29K3J48o05J34K01j85K42M1p4j58K11K3l55
3220b24J83nP6J49ll3k02J90l29L06j08J34k36n3J20J23L9q3j21P0j8J09J10k97
$$ y = [-173, -2, 137, -252, -16, -89, -144, -80, 155, 6, 211, 272, 123, -3, -169, -57, 31, 9, 56, -96, 93, -48, -1, -151, 249, -99, 53, 61, 79, 187, 101, -122, -90, 69, -168, 71, -16, 25, 39, -170, 12, -89, -184, -5, 191, 89, 154, 63, 38, -117, 259, 51, 29, -113, -414, -86, -23, -140, -278, 2, 227, -40, 77, 110, 175, 82, 213, 167, 46, 116, 126, 177, 74, 125, 196, -42, 104, 208, -6, -455, -5, -237, -256, -26, 181, 116, -156, 206, -387, 123, -160, -155, 238, 54, 221, -353, -23, -21, 22, 258, 97, -272, -60, -21, -174, 121, 218, -306, -56, 188, -142, 82, 4, -276, 29, 8, -134, -95, 265, -36, -147, -63, 350, 93, -127, -52, 40, -96, -420, 71, 13, -95, 83, -132, -386, 22, -50, -97, -61, -175, -153, 50, -135, -144, -78, 239, 1, 130, 153, 301, -304, -170, 31, -154, 88, 129, 55, -103, 108, 131, -224, -41, -46, 30, 179, 176, 143, -59, 131, -198, 108, 0, 134, -102, -155, -35, 88, 127, 44, -77, -7, -25, 84, 194, -103]
3244a03n4k03K09J32m5Q5K9j15p8k9M58l02Okl7J31K0P5l36K87j36j03R8j14K30
3269A03J45l52o5O5l4J17k5K46k61R0mN2n6j9N9k92J28O7J41j95L68M1l14j79
3293a74L75r2j9o1j23J41p2j00P1K4k41L78k10K60n8k00K13k69L05k42K38j45
3315aN5p2K97k87o5j9Q2K6k08M54k24oj29R9o5K43j90J14k86L27k1k27K69k08
3339d2K89o4l28j42L80p4o3J08k07J59k02K18K9k75K80j11k5K04q3l72L04R2j66
3362i1n8J53j73J39J16k21m0L32k70J76j8m7J77k11J12j54J24J1k44M25L0n0j16
3385A02k3q3J24j44p8J66p3n2m0K36r2m9j13R9L6r4j04N1J60p0k31J25K43j48
3409e2q2M53j61j47O5J1Lj56J3j17M0J0L7K99j96l9J53j43j11K77l29L05j69N
$$ y = [-103, -157, -360, -151, -19, -64, 21, 50, -65, -143, -172, 286, -16, -10, -12, -49, 82, 102, 177, -159, 128, -8, -111, -13, -127, 103, 248, -104, -169, -104, -138, -21, -46, 200, -61, 29, 25, 77, 21, 2, 61, -231, -103, -36, 105, -90, 278, 319, 5, -174, 201, 109, 90, 29, -94, 47, -25, -125, -54, -30, -271, 107, -103, 157, 99, -101, 112, -157, 148, -94, 144, -1, 54, -18, 279, -8, -73, -92, -10, 16, -192, 262, 38, 32, -97, 2, -63, 180, -10, 104, -182, 145, 124, -103, 166, -42, 247, 183, -145, -287, 93, 19, -44, 64, -143, 16, -186, 32, 61, -214, 66, -45, -70, 134, 51, -321, -17, 75, -91, -149, 4, -169, -30, 86, -135, -175, 157, -113, 63, 45, -2, 175, -36, 76, -78, 46, 57, -187, 238, 268, 218, 102, 79, -4, 120, -24, -102, 64, -9, -61, -101, 135, 43, -6, -119, -20, 16, -78, -182, -131, 29, -41, -272, -147, 96, -52, -134, 319, 158, 11, 76, 87, 90, -66, -53, -170, -130, -120, -83, 216, 20, -19, 134, -9, -120, 157, -172, 133, -36, -31]
3433c1m7R0k12L10l47J77j7k00K51p8K09p1Q2K0o5j71k20M27j72m7nk7K69j88
3457f3J00j82K06O8j9k28j7J08K95k13j08k0Mj44MK71k60J9J52M1j17Loj04K98
3482H8k91N64m80P2o4K11j12N3k26L1J72n7j52L73J83m42K89j75J20m14J65K56
3504A64j07m43N29J11l60J6Rk4J33j1j95J04N7O6K04o08K00M3Q8j65J60m3k7M40
3528C41l21j32L2n3j8K36k19O1O1m2J26j32L8J09k24P7k6K0j62K57j36j12O9K64
3552A14J9j26j14K77k88j19J37J54j50R3j30k9k4J11j77M44L80p57N85l05kj21
3574b8M4K49n20K4K21q9m51O90j19k42K35k13J20j4qj65M4J29j30L47j89l3Q2
3597a6j15r1J42J16r4K81l46K93j85j47J37J01m24N76k65r8o4K92J0r1K56m39
$$ y = [-31, -78, 12, -200, 110, -237, -60, -77, -277, -26, -104, 105, 34, 116, 136, 71, -100, -320, 107, -65, -112, -117, -144, 125, -63, 37, -145, 61, 129, 110, -118, -135, -27, 268, 55, -53, -73, -69, -213, -209, 62, -198, -179, -27, 14, -103, -100, -106, -210, 88, -203, 361, -119, -47, -111, 100, -12, 41, -185, -154, 18, -39, -191, 182, 365, -77, 212, 37, 157, -257, -92, 164, 57, -386, 143, 254, -106, -90, -81, -105, 28, 17, -178, -74, -17, 49, 253, -355, -155, -112, -24, -189, -29, -72, -99, 341, 20, -112, -80, -133, -151, 85, -134, -73, -12, -54, 72, -60, -22, 87, -137, -60, -86, -66, -228, 29, -107, -219, -150, 114, 133, 7, -107, 170, -118, -237, -100, 54, -96, -3, -133, -162, -186, -75, -252, 192, 572, -185, 400, 95, 93, -28, 16, 265, -255, -231, -10, -99, -550, 140, 21, -221, 14, -199, -79, -93, -101, -266, -222, -93, -223, 124, -65, -98, -16, -131, -222, -80, 36, -58, 223, -123, 170, -15, -162, -25, 76, -348, 228, -37, -135, -199, 93, 103, 12, 268, -171]
3619a71K42k10J73j79K08l0m04M36K40l80M0O8j64J71O0P1m36K86m0k08J80K6
3641b1R8q6N9oj05n0J03M9KJ29k63J45M4J34q2k39L32k93K64l78J35M05m29k17
3665b70j1M53l81J00k08N14K13l59O7k42M53m23M26j01j31q1L8K91jk34l84p56
3687a027J074k10L03n49K37q7L10l58Q58N47j102n4M1P0J01n66R30r36O76J54
3707D12q7N1o22L17J9J55k74j21J2J22p7K11j31K47m10J17J3J5O7P1n5j17jK56
3731A90k96R3J6k66M90m20J26K24o3j64O2j26j86K98Q5r4P6k8j19K33k08J58k95
3754b14Q3J69K26n71P7N6J7K15J56o8N5k61K27j56J14j74K08j14oj10M4R7j99
3777a29j40K50j72K87j88Q7M9n0j95q6K72qL1l9L0l16L07P1R9j72m30M78o0O5
$$ y = [-171, 71, -139, 34, -145, 63, 33, -371, 65, 305, -75, -35, 33, -131, 40, 100, 171, -265, 21, -19, -227, -47, -21, 77, -9, 50, 44, -61, -111, -8, 41, 43, 172, -91, 54, 98, 232, 150, -89, 243, -50, 214, -164, -29, 376, -53, -270, -281, 172, -209, -109, -317, 197, 410, 51, 118, -124, 329, -94, 332, 231, 100, 19, 57, 348, 347, 113, -271, -1027, 47, -163, 140, -409, -172, -259, 51, -307, 551, 1098, -4, -58, -17, 53, 154, -412, 518, -418, 258, 412, 325, 376, -246, 71, 90, 245, -29, -150, -138, -16, -93, 118, -13, 234, -176, -59, -46, -31, 36, 107, 52, -65, -66, 190, -106, -13, 3, -263, 227, -193, -67, 157, 94, -70, -8, -134, -320, -22, 63, -31, 45, 17, -102, 131, -77, 81, -214, -131, 38, 264, -307, -230, -174, -157, 58, 214, 146, 201, -60, 167, 11, 125, -49, 159, 45, 39, -71, -27, 70, -129, -269, -19, -191, 96, -92, -5, 44, -6, -201, -287, -15, -23, 8, -31, -1, -317, -10, 61, 160, -12, -442, 36, -24, 41]
3801D1j44j49L57k78M31r0k17J18n9j6J25j3j68r8Q2R7j96J70o2k3K85k78J93
3824A08j08j8K5J01j9j48N3J01Jr0K91k19j6j18N9l4n7J20J7l0J15k4K23n24J47
3849d4K29k53q3J44J02k6k24K73o9j6j05Q7J44k55N2k6R8NJ15l54P4p6P7J21j7
3874b7J06qm8Lq9J33K34m71j7J69m2J36J32q7L5l7l44K50q4K02l84mQ3J32K07
3899A80l46J65j59k02K78j90L12j36K21K86l23p0K53j67l08J19J92k08J55N2k33
3920a29L24j82j34K40q8k22K21r6K5K24k94k1K23l60J66J14J87J5l06N5R0J9k12
$$ y = [41, -103, -252, 105, -173, 258, 168, -49, 69, 10, -6, 119, 106, -62, -160, -78, 19, -177, -7, -69, -92, 193, -85, 108, 0, -18, 7, 108, 89, -59, -6, 95, 96, 6, 297, 78, 62, -56, 3, -31, -88, 32, 49, 19, 134, 110, 333, -191, -44, 185, -68, -151, -7, 95, 69, -155, 118, 49, 33, -72, 15, 159, -96, -44, -70, 28, 33, 148, -206, -132, -208, -131, -10, -27, 79, 71, 23, 26, -63, 70, 304, -167, -184, -15, -57, 79, 211, 124, 159, 122, -222, 28, -56, 146, -238, -242, -159, -27, 180, -166, -1, -160, -362, -84, -274, 38, -98, 123, 409, 86, 16, 269, 102, -206, -87, 105, -103, 52, 104, -129, 195, 13, -121, 119, 31, -191, 30, -66, -41, 183, -111, -132, 91, -269, -103, 11, 198, 213, -93, -38, 52, 71, -141]
$$ [...]
8191B15
##END NTUPLES=NMR FID
##END=
