##TITLE=1H_Pr Q-9.5
 CDCl3
 8 sc, 
 26.09.2022
##JCAMPDX= 6.0         $$ Bruker NMR JCAMP-DX V2.0
##DATA TYPE= NMR FID
##DATA CLASS= NTUPLES
##ORIGIN= UXNMR, Bruker Analytische Messtechnik GmbH
##OWNER= root
$$ XWIN-NMR		Version 3.5
$$ Mon Sep 26 15:03:08 2022 Russian Standard Time (UT+4h)  she@DPX200
##.OBSERVE FREQUENCY= 200.1313499994
##.OBSERVE NUCLEUS= ^1H
##.DELAY= (6, 6)
##.ACQUISITION MODE= SIMULTANEOUS
##.ACQUISITION SCHEME= undefined
##.AVERAGES= 8
##.DIGITISER RES= 18
##SPECTROMETER/DATA SYSTEM= spect
##.PULSE SEQUENCE= zg30
##.SOLVENT NAME= CDCl3
##.SHIFT REFERENCE= (INTERNAL, CDCl3, 0, 15.7039)
##AUDIT TRAIL= $$ (NUMBER, WHEN, WHO, WHERE, WHAT)
$$ ##TITLE= Audit trail, XWIN-NMR		Version 3.5
$$ ##JCAMPDX= 5.01
$$ ##ORIGIN= Bruker BioSpin GmbH
$$ ##OWNER= she
$$ F:/spectra/data/she/nmr/H-F/1/audita.txt
$$ ##AUDIT TRAIL=  $$ (NUMBER, WHEN, WHO, WHERE, WHAT)
(   1,<2022-09-26 15:02:16.59 +0400>,<she>,<DPX200>,
      <created by zg, POWCHK disabled, PULCHK disabled
       configuration hash MD5:
       00 E9 B6 7A A2 85 ED C7 34 08 36 98 17 FE 4E 26
       data hash MD5: 16K
       4E AC 8C 35 54 6C B8 84 76 75 09 44 27 60 3D 63>)
$$ ##END=
$$ 
$$ hash MD5
$$ D7 B2 95 F0 A1 95 55 24 70 F6 AC 9E CC 2F 2C A8
##$RELAX= 
##$RELAX= 
##$RELAX= 
##$RELAX= 
##$RELAX= 
##$RELAX= 
$$ Bruker specific parameters
$$ --------------------------
##$DU= <F:/spectra>
##$EXPNO= 1
##$NAME= <H-F>
##$PROCNO= 1
##$TYPE= <nmr>
##$USER= <she>
##$AMP= (0..31)
100 100 100 100 100 100 100 100 100 100 100 100 100 100 100 100 100 100 
100 100 100 100 100 100 100 100 100 100 100 100 100 100 
##$AQSEQ= 0
##$AQ_mod= 1
##$AUNM= <au_zg>
##$AUTOPOS= <>
##$BF1= 200.13
##$BF2= 200.13
##$BF3= 200.13
##$BF4= 200.13
##$BF5= 200.13
##$BF6= 200.13
##$BF7= 200.13
##$BF8= 200.13
##$BYTORDA= 1
##$CFDGTYP= 0
##$CFRGTYP= 5
##$CHEMSTR= <none>
##$CNST= (0..31)
1 1 145 1 1 1 1 1 1 1 1 1 1 1 1 1 1 1 1 1 1 1 1 1 1 1 1 1 1 1 1 1 
##$CPDPRG= <>
##$CPDPRG1= <>
##$CPDPRG2= <>
##$CPDPRG3= <>
##$CPDPRG4= <mlev>
##$CPDPRG5= <mlev>
##$CPDPRG6= <mlev>
##$CPDPRG7= <mlev>
##$CPDPRG8= <mlev>
##$CPDPRGB= <>
##$CPDPRGT= <>
##$D= (0..31)
0 1.2 0 0 0 0 0 0 0 0.06 0 0.03 0 0 0 0 0.0002 0 0 0 0 0 0 0 0 0 0 0 0 
0 0 0 
##$DATE= 1664190136
##$DBL= (0..7)
120 120 120 120 120 120 120 120 
##$DBP= (0..7)
150 150 150 150 150 150 150 150 
##$DBP07= 0
##$DBPNAM0= <>
##$DBPNAM1= <>
##$DBPNAM2= <>
##$DBPNAM3= <>
##$DBPNAM4= <>
##$DBPNAM5= <>
##$DBPNAM6= <>
##$DBPNAM7= <>
##$DBPOAL= (0..7)
0.5 0.5 0.5 0.5 0.5 0.5 0.5 0.5 
##$DBPOFFS= (0..7)
0 0 0 0 0 0 0 0 
##$DE= 6
##$DECBNUC= <off>
##$DECIM= 32
##$DECNUC= <off>
##$DECSTAT= 4
##$DIGMOD= 1
##$DIGTYP= 9
##$DL= (0..7)
0 120 120 120 120 120 120 120 
##$DP= (0..7)
150 150 150 150 150 150 150 150 
##$DP07= 0
##$DPNAME0= <>
##$DPNAME1= <>
##$DPNAME2= <>
##$DPNAME3= <>
##$DPNAME4= <>
##$DPNAME5= <>
##$DPNAME6= <>
##$DPNAME7= <>
##$DPOAL= (0..7)
0.5 0.5 0.5 0.5 0.5 0.5 0.5 0.5 
##$DPOFFS= (0..7)
0 0 0 0 0 0 0 0 
##$DQDMODE= 0
##$DR= 18
##$DS= 0
##$DSLIST= <SSSSSSSSSSSSSSS>
$$ [...]
##$SUBNAM2= <"">
##$SUBNAM3= <"">
##$SUBNAM4= <"">
##$SUBNAM5= <"">
##$SUBNAM6= <"">
##$SUBNAM7= <"">
##$SUBNAM8= <"">
##$SUBNAM9= <"">
##$SW= 18.0517283424941
##$SWIBOX= (0..15)
0 0 2 0 0 0 0 0 0 0 0 0 0 0 0 0 
##$SW_h= 3612.71676300578
##$TD= 16384
##$TD0= 1
##$TE= 0
##$TE2= 300
##$TE3= 300
##$TEG= 300
##$TL= (0..7)
0 120 120 120 120 120 120 120 
##$TP= (0..7)
150 150 150 150 150 150 150 150 
##$TP07= 0
##$TPNAME0= <>
##$TPNAME1= <>
##$TPNAME2= <>
##$TPNAME3= <>
##$TPNAME4= <>
##$TPNAME5= <>
##$TPNAME6= <>
##$TPNAME7= <>
##$TPOAL= (0..7)
0.5 0.5 0.5 0.5 0.5 0.5 0.5 0.5 
##$TPOFFS= (0..7)
0 0 0 0 0 0 0 0 
##$TUNHIN= 0
##$TUNHOUT= 0
##$TUNXOUT= 0
##$USERA1= <user>
##$USERA2= <user>
##$USERA3= <user>
##$USERA4= <user>
##$USERA5= <user>
##$V9= 5
##$VALIST= <valist>
##$VCLIST= <CCCCCCCCCCCCCCC>
##$VD= 0
##$VDLIST= <DDDDDDDDDDDDDDD>
##$VPLIST= <PPPPPPPPPPPPPPP>
##$VTLIST= <TTTTTTTTTTTTTTT>
##$WBST= 1024
##$WBSW= 4
##$XGAIN= (0..3)
0 0 0 0 
##$XL= 0
##$YL= 0
##$YMAX_a= 198832
##$YMIN_a= -267400
##$ZGOPTNS= <>
##$ZL1= 120
##$ZL2= 120
##$ZL3= 120
##$ZL4= 120
##$ABSF1= 10
##$ABSF2= 0
##$ABSG= 5
##$ABSL= 3
##$ALPHA= 0
##$AQORDER= 0
##$ASSFAC= 0
##$ASSFACI= 0
##$ASSFACX= 0
##$ASSWID= 0
##$AUNMP= <proc_1d>
##$AZFE= 0.1
##$AZFW= 0.1
##$BCFW= 1
##$BC_mod= 2
##$BYTORDP= 1
##$COROFFS= 0
##$CY= 11.3945322036743
##$DATMOD= 1
##$DC= 2
##$DFILT= <>
##$DTYPP= 0
##$F1P= 2.36226072786647
##$F2P= -0.459571619588291
##$FCOR= 0.5
##$FTSIZE= 0
##$FT_mod= 4
##$GAMMA= 1
##$GB= 0.15
##$INTBC= 1
##$INTSCL= 1
##$ISEN= 128
##$LB= 0.24
##$LEV0= 0
##$LPBIN= 0
##$MAXI= 10000
##$MC2= 0
##$MEAN= 0
##$ME_mod= 0
##$MI= 1.114404
##$NCOEF= 0
##$NC_proc= 0
##$NLEV= 6
##$NOISF1= 3.799351
##$NOISF2= 2.8
##$NSP= 1
##$NTH_PI= 0
##$NZP= 0
##$OFFSET= 15.70392
##$PC= 1
##$PHC0= -18048.87
##$PHC1= 35.80069
##$PH_mod= 1
##$PKNL= yes
##$PPARMOD= 0
##$PSCAL= 0
##$PSIGN= 0
##$REVERSE= no
##$SF= 200.130013532006
##$SI= 16384
##$SIGF1= 3
##$SIGF2= 2
##$SINO= 400
##$SIOLD= 16384
##$SREGLST= <1H.CDCl3>
##$SSB= 0
##$STSI= 0
##$STSR= 0
##$SW_p= 3612.71676300578
##$SYMM= 0
##$S_DEV= 0
##$TDeff= 0
##$TDoff= 0
##$TI= <>
##$TILT= no
##$TM1= 0
##$TM2= 0
##$TOPLEV= 0
##$USERP1= <user>
##$USERP2= <user>
##$USERP3= <user>
##$USERP4= <user>
##$USERP5= <user>
##$WDW= 1
##$XDIM= 8192
##$YMAX_p= 0
##$YMIN_p= 0
$$ End of Bruker specific parameters
$$ ---------------------------------
##NTUPLES= NMR FID
##VAR_NAME=  TIME,          FID/REAL,        FID/IMAG
##SYMBOL=    X,             R,               I
##VAR_TYPE=  INDEPENDENT,   DEPENDENT,       DEPENDENT
##VAR_FORM=  AFFN,          ASDF,            ASDF
##VAR_DIM=   8192,          8192,            8192
##UNITS=     SECONDS,       ARBITRARY UNITS, ARBITRARY UNITS
##FACTOR=    0.0002768,     1,               1
##FIRST=     0,             0,               0
##LAST=      2.2672688,     0,               0
##MIN=       0,             -267400,         0
##MAX=       2.2672688,     198832,          0
$$ Real data points
##PAGE= N=1
##DATA TABLE= (X++(R..R)), XYDATA
0 0 0 0 0 0 0 0 0 0 0 0 0 8 -8 8 -8 8 -16 16 -24 24 -32 40 -48 56 -64 72 -88 98 -114 131 -152 172 -195
33 -195 220 -250 282 -316 355 -396 442 -492 546 -606 671 -743 820 -906 999 -1101 1213 -1335
51 -1335 1471 -1621 1788 -1977 2188 -2429 2703 -3022 3399 -3849 4398 -5088 5985 -7200 8951
66 8951 -11704 16684 -28544 119712 -12455 -231358 67835 160407 -5734 -77687 23304
77 23304 6440 -18166 14115 13206 -54082 -17646 57788 21197 -85311 -42954 80050 66348
89 66348 -64606 -72489 29933 60731 -2298 -29282 -15190 -1917 15791 19540 -21384 -25841
101 -25841 29813 29176 -36839 -21393 43799 23083 -23877 1308 13962 -17191 5094 44381
113 44381 -3983 -57342 -12146 43602 11154 -40696 -26458 15014 10446 -19580 -12649 13718
125 13718 6444 -12333 87 11449 -2853 727 22353 3248 -29383 -1400 39288 10736
137 10736 -29948 -9457 22043 9146 -10805 -3881 7927 4552 -6386 -8540 3445 9728 -1599
150 -1599 -12145 -8011 1113 6266 228 -13232 -10673 7139 4529 -12337 -2295 15625 223
163 223 -15106 5475 19178 2030 -4274 6565 2036 -1937 12408 9363 -13500 -9103 13509
176 13509 6655 -14586 -9241 8885 5295 -12324 -12064 5659 8924 -6435 -11569 -220 4394 -835
190 -835 -2467 -1919 -1259 2604 2706 -2598 1123 9142 2392 -7912 2007 13471 2359 -6000 3816
205 3816 6282 -3579 29 7334 -1498 -8250 343 3266 -5547 -6452 927 995 -8292 -8539 4059 8283
221 8283 -6640 -12250 4794 11961 -3144 -7895 6001 9068 -1658 -3244 5155 5819 946 106
235 106 1650 1405 1031 1659 1511 482 -2554 -4365 1373 3788 -4044 -8148 -475 2981 -3516 -5616
251 -5616 -1027 1171 -2338 -4009 440 4006 -940 -3835 3708 6582 -2296 -2264 9073 6973 -5897
266 -5897 -2283 10822 6083 -7017 -3358 7341 3158 -6217 -3653 3080 1222 -4929 -4746 79 729
281 729 -3832 -3901 606 -1129 -4115 25 3024 -1453 -3262 1594 4163 1613 -1255 462 4872 4706
297 4706 -1358 -1284 6703 4701 -3982 -2031 5954 2495 -5593 -2242 4029 -193 -6697 -2465 2546 -1489
313 -1489 -6117 -2940 2130 -44 -5660 -2627 4827 1103 -5320 -17 6935 532 -3782 3300 5458
328 5458 116 -889 3237 3843 767 -1207 842 3806 259 -4303 -472 4205 -1728 -6869 -187
343 -187 3131 -3671 -6256 11 1856 -3134 -4018 124 1725 -690 -2268 359 3953 1584 -2521 1497
359 1497 6487 1038 -3458 3605 6778 -1311 -3008 3346 3716 -1659 -2699 413 1455 -1657 -4126
374 -4126 -898 1336 -3022 -5207 534 2235 -4457 -4634 2897 2716 -4643 -2742 4163 2655 -2308 -626
390 -626 3576 3300 827 -458 1785 4143 973 -2196 2072 4138 -1893 -2726 3061 1702 -4609 -2768
406 -2768 2148 -34 -4198 -3613 683 804 -3267 -4212 870 2724 -2889 -3140 3199 3220 -2702 -614 5870
423 5870 2463 -3114 1511 5845 1511 -2191 581 3694 2148 -1309 -2211 1334 2628 -2471 -3990
438 -3990 1085 924 -4103 -2678 1259 -1635 -4445 -230 1966 -1517 -3435 -177 3456 1876 -2800
453 -2800 -1424 5293 4641 -2948 -1711 5783 4017 -2586 -217 4261 655 -2030 775 1404 -1628 -2173
469 -2173 159 739 -1350 -4635 -2086 3174 -204 -6954 -2379 5428 429 -6113 -1139 4624 831
484 831 -2720 1026 3392 588 -228 2399 3683 241 -1862 2408 5439 -685 -5120 2171 6300 -2554
500 -2554 -6670 1357 4092 -3284 -5205 -158 1166 -2033 -2972 -1375 281 -947 -2759 935 3246
515 3246 -2141 -3252 3922 5302 -2544 -3568 4949 5844 -1830 -2275 3001 4307 -781 -2059 1714 2331
531 2331 -1961 -2982 1955 1438 -4741 -3679 3321 1204 -6929 -3742 5350 1246 -6730 -3038 4318
546 4318 2629 -2508 -2288 2200 3186 -125 -400 2650 1659 -1129 1874 4371 -535 -3672 2222 4787
562 4787 -1216 -4452 120 3231 -418 -4548 -2352 2044 675 -4204 -3157 1428 1041 -3019 -2015
577 -2015 1995 7 -2258 1572 3080 -571 -1856 2805 4737 169 -2690 1734 5017 972 -3275
592 -3275 373 4267 489 -3160 -187 1697 -1755 -2401 313 -115 -3224 -2195 860 -141 -2690 -2281
608 -2281 1240 1723 -1775 -2678 1299 3313 94 -2301 1015 3957 1048 -864 825 2418 933 -297
624 -297 437 1439 167 -1457 -322 1363 -1009 -2867 -178 1130 -2190 -3811 197 1395 -2350 -3126
640 -3126 863 1899 -1595 -2052 1320 2666 -466 -1001 2043 2924 -242 -1023 2954 2884 -985 -959 2844
657 2844 2110 -1563 -1629 889 619 -1461 -1463 -163 144 -1894 -2364 -254 494 -1744 -2412 225 1269 -1282
675 -1282 -2122 1209 2302 -542 -898 2471 2811 -652 -411 3180 2453 -984 -753 2763 2009 -2060 -1194
692 -1194 2240 894 -3575 -1758 1820 -96 -3651 -1909 1248 -280 -2557 -1760 779 285 -1362 -1043
708 -1043 1164 1130 -868 167 2219 1244 -1124 682 3284 1442 -1400 157 3251 1041 -2227 -408
724 -408 2379 494 -2721 -1760 1330 258 -2976 -1371 1239 -711 -3216 -698 1616 -818 -2263 200
740 200 2225 -174 -1634 847 2660 840 -1516 851 3465 966 -1462 864 2925 186 -1854
755 -1854 393 1867 -1000 -2058 192 466 -1531 -2563 -215 625 -1287 -2972 -313 1572 -1062 -2733
771 -2733 174 2424 -732 -1834 1268 2646 -78 -890 1505 2230 296 -626 1344 2447 21 -1395
787 -1395 821 1980 -1115 -2140 389 1109 -2472 -2689 666 630 -2738 -2432 618 1040 -1775 -1699 1033
804 1033 1316 -1190 -1258 1493 2171 -762 -864 2517 2495 -908 -362 2710 1887 -1082 -626 1603 1263 -1435
822 -1435 -1343 778 612 -1869 -2177 522 713 -2208 -2267 1204 427 -2383 -1115 1744 796 -1920 59
839 59 2211 1095 -1034 -21 2550 1727 -851 -110 2827 1514 -1367 -294 2509 369 -2127 -486
855 -486 1667 -256 -2441 -1043 668 -543 -2345 -1034 696 -341 -2107 -1018 1958 131 -1853
870 -1853 -202 2324 327 -1296 1098 2538 787 -816 830 2470 736 -1168 114 2097 262
885 262 -2228 -361 1671 -327 -2723 -459 898 -1352 -2318 -369 500 -1014 -2071 179 1131 -473
901 -473 -1716 507 2089 -6 -1380 1150 3049 517 -1424 1129 2354 104 -887 988 1530 -128
917 -128 -1242 69 853 -1114 -2027 26 797 -1449 -2629 231 1192 -1590 -2583 568 1263 -1067 -1529
934 -1529 866 1417 -408 -647 1141 2001 -35 -621 1612 1949 -395 -1024 1771 1719 -1388 -1264 1562
951 1562 1210 -2146 -1813 991 767 -1986 -2073 206 940 -1528 -2052 900 752 -1866 -1113 1661 1082 -1892
969 -1892 -363 2671 1312 -1390 474 2618 1652 -912 -368 1759 1107 -1235 -1085 1387 733 -1973
985 -1973 -882 1341 -223 -2635 -885 1067 -721 -2269 -628 1275 -343 -2032 -490 1734 1048
1000 1048 -1453 -20 2584 840 -790 942 2337 592 -772 839 2083 -172 -1215 512 1631
1015 1631 -424 -2009 35 1338 -988 -2448 -504 1047 -848 -2328 -197 1091 -785 -1345 359
1030 359 1012 -698 -594 1171 1352 21 -555 1377 2259 115 -1060 1036 2144 -25 -967 816 1109
1047 1109 -918 -1317 122 493 -1172 -1601 -87 88 -829 -1844 -57 605 -965 -1354 939 1103 -684
1064 -684 -1010 1181 1510 -321 -461 1245 1514 127 -397 1133 1176 -469 -524 897 941 -1297 -1045 554
1082 554 566 -1074 -1370 348 158 -1438 -1288 467 330 -1374 -1328 673 931 -715 -892 881 1250 -627
1100 -627 -376 1691 1543 -786 -323 1757 1178 -790 -707 1185 542 -1231 -1160 710 216 -1412 -1212 403
1118 403 2 -1878 -1154 595 114 -1564 -941 1236 262 -936 -185 1243 698 -687 181 1629 1089
1135 1089 -473 248 1391 843 -795 -217 1412 530 -1469 -131 1035 -201 -1924 -705 923 -253
1151 -253 -1824 -703 814 -383 -1570 -123 1149 -216 -1241 27 1711 51 -1259 501 1829
1166 1829 408 -672 651 1826 406 -739 603 1318 -186 -1156 48 1049 -371 -1853 -330
1181 -330 689 -946 -1701 -347 618 -953 -1522 193 980 -682 -1265 573 1247 -23 -810 602 1644
1198 1644 -126 -639 928 1608 -236 -765 1127 1337 -683 -915 720 678 -844 -1128 219 471 -1309
1215 -1309 -1393 152 279 -1305 -1469 488 640 -1047 -671 968 885 -750 -320 1164 897 -468 -220 1241
1233 1241 1274 -180 -413 1227 1096 -735 -735 1001 600 -1193 -848 943 96 -1418 -1304 502 130 -1602
1251 -1602 -911 385 109 -1167 -333 1147 628 -781 9 1526 873 -563 308 1907 816 -857 395
1268 395 1451 294 -880 -111 938 204 -1381 -705 854 -140 -1636 -701 659 -388 -1630 -552
1284 -552 539 -290 -1228 -166 996 -78 -723 594 1202 502 -661 73 1570 518 -758 469 1462
1301 1462 73 -994 294 985 -387 -939 -59 816 -644 -1224 -57 566 -644 -1357 -250 499 -418
1318 -418 -1154 106 927 -508 -986 657 1221 -169 -763 754 1153 371 -551 817 1161 -44 -706 485
1336 485 918 -446 -1155 230 592 -764 -1213 131 365 -860 -951 156 539 -574 -1029 326 710 -331
1354 -331 -687 849 892 -675 -599 1412 985 -293 -411 1211 975 -378 -445 657 518 -590 -857 459
1372 459 390 -893 -916 455 301 -1082 -901 396 327 -1332 -649 685 273 -784 -96 838 974 -281
1390 -281 -153 1083 963 -508 50 1362 569 -630 -115 1113 420 -1047 -503 1015 -107 -933 -488
1407 -488 471 -171 -1285 -641 599 -102 -1290 -480 663 141 -1223 2 922 294 -614 115 1257 311
1425 311 -704 442 1378 81 -636 182 858 9 -1027 8 883 -281 -1166 -36 550 -693 -1327
1442 -1327 -148 373 -533 -1339 -189 939 -230 -878 141 1023 -77 -462 607 1166 -45 -673 705
1459 705 1457 24 -306 376 868 -571 -892 343 603 -533 -1099 64 402 -669 -1246 247 270 -820
1477 -820 -855 286 448 -471 -526 527 587 -83 -53 733 903 -269 -160 1037 761 -496 4 989 482 -512
1497 -512 -239 693 81 -965 -765 436 238 -720 -815 71 -112 -971 -504 434 234 -748 -577 815 260
1516 260 -392 -245 667 635 -11 -187 719 752 -392 -143 841 646 -365 -379 802 367 -838 -316 567 263
1536 263 -910 -824 143 -163 -1069 -486 238 -103 -887 -817 511 439 -705 -69 949 260 -220 28 1189
1555 1189 332 -571 202 899 533 -837 -204 993 -41 -769 -232 690 -341 -1180 -184 236 -163 -759
1573 -759 -200 531 -33 -937 -95 464 -104 -814 52 1013 142 -319 251 975 184 -338 423 985 -30 -566
1593 -566 183 551 -231 -1009 116 856 -469 -1127 -92 505 -797 -973 41 403 -464 -849 156 555
1611 555 -430 -527 580 897 -254 -412 704 930 -260 -362 717 863 -247 -166 549 508 -446 -667 382
1630 382 183 -664 -647 63 289 -1040 -868 473 254 -786 -709 525 719 -182 -295 806 542 -275 -68
1649 -68 857 839 -430 28 1097 664 -746 -407 535 383 -620 -474 401 254 -582 -630 435 27 -881
1668 -881 -578 391 150 -904 -535 523 94 -456 -184 661 102 -610 326 867 319 -324 -133 1219 583
1687 583 -191 -233 561 156 -640 -160 662 199 -978 -455 437 -401 -660 -271 276 -91 -1025 -138 141 91
1707 91 -455 -35 788 34 -695 169 950 70 -188 651 817 136 -417 286 651 -89 -579 2 319 -173
1727 -173 -781 -39 200 -258 -1227 -210 298 -835 -743 346 384 -124 -576 109 692 -160 -380 336 904 69
1747 69 -216 699 896 -25 -233 478 314 -443 -320 308 434 -363 -491 298 520 -700 -1155 34 248 -677
1767 -677 -751 538 220 -311 -415 439 389 -278 -209 677 669 -136 -210 899 613 10 -105 601 383 -357 -427 429
1789 429 218 -538 -269 278 -12 -966 -760 164 39 -790 -495 293 164 -911 -142 584 384 -405 83 839
1809 839 201 -336 17 671 650 -365 396 731 348 -131 27 397 38 -476 -241 460 -78 -777 -122 426
1829 426 -212 -787 -217 467 -231 -460 -159 217 58 -481 233 480 213 -314 331 815 94 -359 340 724
1849 724 234 -559 129 790 -230 -641 -43 324 -375 -620 -113 215 -381 -652 -34 330 -244 -566 -282 365
1869 365 3 -562 512 609 139 -223 385 784 92 -53 208 384 76 -292 -50 497 -320 -427 58 291
1889 291 -321 -779 -104 143 -735 -589 -78 309 -270 -594 263 416 -244 -418 376 668 -72 -36 553 753
1909 753 -180 -239 440 316 -176 -341 738 242 -361 -365 363 427 -577 -659 174 -2 -632 -621 173 16 -342
1930 -342 -172 251 94 -601 -106 648 299 -360 -78 616 473 -190 -87 520 230 -243 46 542 -131 -112
1950 -112 48 264 -69 -524 -171 361 -151 -492 -58 4 -178 -843 -204 497 -196 -503 -175 496 213 -339
1970 -339 -32 889 334 -420 -24 519 326 -383 41 384 57 -363 -250 538 -21 -652 -88 163 -602 -459
1990 -459 5 147 -377 -668 -37 652 -71 -312 146 366 -44 -244 320 508 -56 -215 396 571 87 -239
2010 -239 547 802 -184 -157 414 458 -190 -565 36 196 -354 -747 -105 270 -144 -652 89 287 -494 -289 383
2031 383 315 -29 -373 244 642 -64 -254 229 347 -55 -188 434 218 -125 -499 447 513 -122 -375 162 240
2052 240 -396 -369 215 -213 -331 -403 127 21 -833 -198 284 34 -327 -156 487 258 -330 -64 507 291 13
2073 13 -476 492 117 -295 -110 670 29 -288 -189 132 54 -411 -211 245 -151 -461 -493 327 -41 -440 -300
2094 -300 215 -53 -366 45 583 324 -429 325 702 300 -101 240 456 -85 -18 -35 385 0 -505 -145 253
2115 253 -421 -560 -293 178 -239 -671 -102 342 -32 -324 -46 383 -173 -434 141 525 198 -290 83 534
2135 534 229 -55 74 534 -2 -305 161 394 -220 -552 94 126 -139 -319 67 269 -374 -395 20 46 -471
2156 -471 -805 -52 367 114 -545 180 452 -63 -18 321 206 54 -95 483 499 -39 -362 419 260 -313 -307
2177 -307 150 229 -493 -389 283 169 -516 -176 100 100 -561 -158 29 344 -269 -225 478 190 -270 -373 365
2198 365 267 -489 31 623 297 -305 -132 460 -29 -177 -192 351 206 -560 -130 340 447 -572 -361 261
2218 261 -108 -465 24 311 72 -295 120 511 179 -408 329 348 148 173 86 501 160 -94 227 541 222
2239 222 -188 42 343 -105 -400 -358 -24 -249 -298 -205 225 -176 32 -33 160 72 -551 -72 348 97 -119 428
2261 428 604 208 -28 264 257 -2 -194 222 338 -36 -221 202 336 -232 -500 195 131 -214 -537 10 297
2282 297 -247 -452 -80 195 -313 -166 39 442 -33 -244 388 417 -147 -157 263 396 155 -196 189 248 -258
2303 -258 -125 150 442 -200 -521 144 220 -275 -333 57 98 -163 -250 201 116 -573 -263 438 222 -288 -280 626
2325 626 275 -166 -82 307 231 53 -215 296 317 -209 -111 292 60 -434 43 432 -25 -167 -37 230 -61
2346 -61 -329 -90 248 169 -504 -150 97 87 -296 -156 388 157 -207 313 343 -346 -255 205 366 279 -258 46
2368 46 141 -41 -75 187 220 -139 -358 -85 180 -280 -493 -224 141 -136 -314 -182 180 26 -162 -122 383 22
2390 22 -431 100 301 63 -99 127 446 117 -409 126 344 -163 -402 -47 337 -243 -547 29 244 -160
2410 -160 -459 22 312 -71 -219 178 144 -192 -155 -68 154 57 -29 248 460 138 190 573 376 -162 -58 362
2432 362 392 -224 -395 142 111 -249 -204 -151 307 14 -118 48 315 -146 -301 133 126 -305 -362 247 82 148 16
2455 16 232 376 -251 154 325 383 -57 57 283 17 -28 -421 288 228 -495 -110 95 108 -425 -159 -23 -10
2477 -10 -481 63 10 -84 -361 89 323 249 -188 221 357 -66 40 109 341 248 18 -5 220 -168 -128 176 276
2500 276 -26 -342 -200 138 -182 -257 -147 132 48 -170 -300 306 61 -275 160 91 174 -311 49 377 137
2521 137 -444 147 377 211 -295 -65 241 -68 -217 178 75 -32 -80 48 59 -106 -335 -155 68 -104 -301
2542 -301 36 57 -168 -498 -144 257 81 -327 108 410 -193 -113 179 457 152 -353 174 258 16 -148 -9
2563 -9 285 -169 -227 257 63 -356 -401 54 302 -182 -487 134 210 -310 -284 131 319 -365 7 170 204 -55
2585 -55 -247 326 277 -286 68 116 489 -187 -158 -72 218 -166 -351 60 -156 -332 -138 -11 -25 -201 -104 81
2607 81 143 -180 -79 92 104 -146 -79 233 153 -403 32 256 337 19 -158 366 114 -239 84 -128 139 -326
2629 -326 -217 90 -150 -248 -120 73 -272 -290 -32 25 46 -332 -142 333 -141 -318 -63 343 -35 13 50 249
2651 249 -10 -150 -75 191 -142 14 -19 366 34 -277 -70 68 -118 -396 -5 92 -121 -225 -52 155 -121
2672 -121 -320 -71 125 -274 -320 59 276 -57 -255 14 442 38 -167 125 116 -120 63 415 146 -268 -50
2693 -50 112 211 -61 -237 -117 284 -26 -236 -38 200 -304 -360 293 91 -33 -347 342 181 -129 34 252
2714 252 108 -96 -92 87 291 191 -38 444 -13 -241 -95 32 -101 -143 53 261 32 -291 -295 53 110 -392
2736 -392 -286 331 81 -163 -36 245 162 -133 -140 246 81 -213 74 121 -122 -249 -84 100 126 -124 -108 293
2758 293 -22 -369 281 23 -50 -461 -155 107 51 -30 163 176 -132 -419 -196 169 -97 -13 -1 331 -82 -84 288
2781 288 286 39 -181 181 578 -102 -146 -121 201 -216 -179 32 258 60 -537 -34 -70 -46 -232 131 327 -418
2803 -418 -244 -174 260 -133 -29 243 130 74 -228 188 162 -27 -62 166 84 219 73 -56 245 -158 -80 -74 -244
2826 -244 -247 -179 -71 -194 -253 59 -163 -61 -266 -247 -37 9 117 -184 -194 -66 -284 -41 222 180 -4 -77 41
2849 41 -21 128 -233 211 29 -170 -75 -50 79 4 -286 98 -69 -14 170 21 -74 -345 -174 -100 300 -52 103
2872 103 263 234 -330 -46 394 -36 -23 -16 417 13 -204 -64 75 186 -281 -127 323 134 -420 -225 160
2893 160 -116 -272 45 245 -13 -213 133 178 -247 48 235 267 46 -10 -191 46 -94 -137 145 495 50
2914 50 162 -145 98 42 -310 87 2 -173 -128 -12 238 -153 -265 60 94 -248 -401 32 254 -39 -173 122
2936 122 204 -123 -2 1 281 -48 -16 163 157 -36 -151 -22 -1 32 -155 -208 138 -233 -435 83 75 -288 -207 -22
2960 -22 -56 -91 -167 -69 248 -165 -269 173 271 -124 -46 35 204 144 -76 165 -78 -169 -215 261 187 -233 48 50 -4
2985 -4 -35 -121 -81 -62 -62 -196 194 75 -164 -78 39 283 -325 -166 184 -171 -74 -16 270 39 -191 -184 147 66 -44
3010 -44 14 244 344 -89 -68 197 -64 -24 83 17 -74 -48 -194 203 -320 -133 -115 19 77 -186 -17 102 179
3033 179 -59 76 31 49 -23 237 121 -42 -247 174 307 -26 -133 76 298 -11 -262 8 -3 -120 -145 -32
3055 -32 44 -183 -169 56 -89 76 -202 -33 80 136 -124 73 225 -134 -40 16 418 73 2 -59 216 128 -153
3078 -153 207 99 -137 40 -76 318 115 -263 -38 76 16 -278 117 190 -130 -125 249 -118 18 -88 89
3099 89 101 -89 75 222 -71 70 132 100 44 -118 -114 124 443 -164 -14 37 68 -246 -157 76 -95 -98 6 83
3123 83 -270 -277 -38 172 63 -11 -101 82 183 73 -45 481 32 -62 257 125 58 -212 -14 357 3 -50 -127
3146 -127 328 -168 -168 -128 19 -124 -274 -224 -172 -135 -197 -74 99 15 -245 156 123 18 45 52 314 124 79 0 91
3171 91 -27 -60 89 202 110 -40 207 219 -95 -195 -57 -78 -130 -294 -54 -124 -134 -401 -95 227 -55 117 101
3194 101 228 63 83 119 256 61 -29 94 81 255 -436 370 74 -194 -23 -19 130 -176 44 -302 230 -309
3216 -309 -91 76 0 -98 -147 24 64 -233 12 -89 433 -96 -30 217 -38 -28 -104 298 -68 -152 -156 243 307 -45
3240 -45 -112 227 83 -101 -233 94 130 -234 -73 -4 229 -166 -197 100 10 -6 116 260 -104 -117 -151 179 172 -232
3264 -232 -47 366 179 -256 -81 81 -34 48 88 240 -47 -309 -90 -86 31 -130 -178 82 31 5 -48 -36 -89
3287 -89 46 -102 183 -56 -266 210 134 188 -24 -181 533 92 -98 52 136 104 -196 79 -16 7 -267 -122
3309 -122 37 -298 40 -117 69 -92 13 171 -191 -171 -241 292 84 -127 36 92 -61 14 -226 92 210
3330 210 150 -80 -25 377 231 -215 196 313 111 61 112 39 -34 -59 32 114 -107 -75 123 77 -277 -63 65 167
3354 167 -159 -175 54 -97 -82 -132 206 12 30 -34 108 259 92 -122 125 49 -73 -18 119 237 -156 -74 52
3377 52 28 -291 -173 83 38 -193 -316 -53 103 -182 -8 -85 54 -45 -77 416 268 -179 33 226 -56 -46
3399 -46 -18 34 -88 -33 60 203 324 70 53 -80 -5 -458 -55 68 279 -121 -71 97 -283 -134 -3 30 123
3422 123 -137 74 -56 -166 133 201 233 117 -53 -39 171 106 -37 -288 -33 -83 -222 -151 -57 22 -180 88 5
3445 5 -158 -288 31 96 -50 -145 -4 159 41 -208 66 319 93 -180 185 130 96 -51 -67 92 103 31 -60
3468 -60 258 26 184 -38 -27 118 -277 110 61 43 -92 -20 220 6 -59 135 78 -189 -307 160 -96 -52 -158
3491 -158 184 153 -84 72 -89 58 75 -139 -80 45 -289 -65 333 65 57 43 -22 185 -25 3 -36 -118 26
3514 26 -214 -148 -20 -120 40 113 -117 116 48 370 275 -82 92 34 180 22 30 95 -107 -100 -210 185 24 131
3538 131 193 119 -66 -232 4 32 -213 -136 -119 -144 230 -274 -5 161 44 -59 153 167 -98 -141 -7 111 121
3561 121 -141 86 261 -146 51 -180 92 65 -75 107 -81 20 -227 92 -6 -111 32 -285 214 29 10
3582 10 127 244 -157 -132 131 135 -80 -210 192 60 -188 254 -46 278 -41 -11 84 251 -105 -37 -19 171 -54
3605 -54 -118 -63 93 -131 -165 -177 76 38 -64 -43 131 -2 120 223 -53 203 12 154 96 -131 237 147 -151
3628 -151 -6 119 54 145 -80 18 106 -225 -289 86 261 -25 -344 133 103 20 -135 -67 -197 174 -99 -231 -29
3651 -29 -51 -38 -131 343 88 161 -19 152 332 42 -239 140 148 -18 83 53 -9 -41 91 64 -73 -258 -167 -80
3675 -80 0 -266 -62 159 -99 -138 -60 32 -234 -56 104 254 144 0 -7 -11 70 -21 -53 -184 -66 198 49 262
3699 262 -75 -74 129 239 70 -229 -105 195 35 -188 77 98 6 -271 -56 270 -78 -89 13 119 140 -39
3721 -39 128 -238 99 -144 -59 129 -50 -92 -161 162 65 23 -58 104 170 -166 152 -40 89 -231 -3 137 -31
3744 -31 89 218 55 29 45 70 197 -81 58 0 135 81 56 88 111 -96 -84 212 -28 -126 -8 -34 24 -216
3768 -216 12 49 -91 66 -168 251 300 -232 -30 52 2 128 -31 218 152 -62 173 89 176 133 36 110 152 -118
3792 -118 85 111 80 11 13 172 -115 8 -122 69 -50 -60 -155 50 41 -58 53 -25 290 -95 -169 77 271 -64
3816 -64 -47 14 47 186 -47 -1 116 -297 67 -63 14 -29 -44 -8 66 42 226 105 -337 -113 -354 112 -163 -37
3840 -37 -98 -89 -262 -173 -93 122 -67 -254 -61 301 -68 -78 -45 79 99 -113 98 126 -140 -17 173 26 48 -134
3864 -134 -19 57 -103 -28 208 52 110 24 14 264 173 -76 277 133 12 -34 -49 -82 -117 -145 176 -42 115 62
3888 62 -63 171 -150 -98 -31 -155 -51 -68 -135 -281 -326 -79 139 -118 -120 -299 -30 64 279 -27 101 86 -51
3911 -51 -105 235 144 -122 184 179 118 -79 -40 100 71 -311 14 1 -91 -28 -279 21 -87 -74 -159 36 -168 94
3935 94 164 32 -30 -193 -216 -132 124 -118 -132 253 259 -245 -5 -29 193 27 58 260 81 18 -136 291 -122 -22
3959 -22 98 79 -119 -61 -61 -63 -223 -109 33 -16 -72 99 35 15 -113 -183 72 11 100 99 98 215 179 -25 -140 65
3985 65 36 -348 -203 -104 -131 -201 -160 -28 72 -169 -43 -66 128 -73 -66 58 -283 73 97 104 1 -135 -90 -108 -150
4010 -150 -29 49 38 228 26 -46 149 -251 -182 -86 178 -146 -374 -164 -151 -6 74 269 -82 41 -61 -134 4
4033 4 -268 -14 57 91 188 57 -83 14 -81 -149 -36 -37 -177 220 8 268 -33 51 -73 51 -7 67 119 0 -290
4058 -290 -6 62 -42 -122 94 361 -50 97 -221 205 112 79 -14 183 -175 90 -139 -45 -72 -44 69 -40 16
4081 16 -275 85 17 -6 41 120 -104 130 -388 -357 197 24 4 -9 114 -157 21 -44 161 183 53 75 122 -73
4105 -73 -61 150 9 -21 -260 23 -100 244 -56 273 -199 22 204 -281 93 -159 -279 -81 121 -139 -322
4126 -322 -240 88 -232 -17 226 57 123 -118 31 33 150 111 115 54 110 124 -81 -110 72 -156 -122 24 177 79
4150 79 39 63 99 281 -127 100 -96 -49 66 -46 -156 -135 335 107 -333 1 73 52 -225 -36 -273 -46 -168
4173 -168 -72 159 172 60 -112 -25 117 108 128 159 144 -212 -100 176 112 -72 -17 35 1 -174 69 172 -137 -118
4197 -118 239 22 1 146 171 107 159 41 -84 92 62 -41 13 -17 -30 -208 49 -93 126 49 138 106 -162 -126
4221 -126 47 -41 21 -219 -10 112 -19 -282 -13 -28 -117 1 -95 521 87 30 -232 110 21 -96 69 151 22
4244 22 -31 68 32 69 -61 200 -73 -122 298 -212 160 -203 44 -34 70 -103 -239 32 93 252 -44 -75 217
4267 217 -31 53 4 80 -142 -256 53 138 -42 -139 121 -154 -16 -124 261 -113 15 22 72 273 -223 -23 169
4290 169 209 -197 45 6 204 16 158 155 -373 142 159 -52 172 254 100 150 5 -13 175 -129 156 -115 -268
4313 -268 -145 -323 441 25 -155 -32 -127 -232 -107 -1 -98 -65 122 -140 19 50 183 -52 -145 -95 29 84
4335 84 -120 31 -14 86 -146 -5 73 71 95 68 -96 -276 -88 -137 13 42 166 -94 123 168 -24 -129 109
4358 109 -169 61 109 141 -131 108 2 -277 -110 -5 -92 124 -151 -124 -4 -12 -33 -130 -125 -91 -152 49 149 -161
4382 -161 -153 57 2 50 10 -33 -73 68 -177 -89 11 142 -136 -64 337 -30 35 40 22 132 56 -11 -195 228 -41
4407 -41 -48 80 -176 -134 71 97 -30 -126 108 7 111 -4 -34 -218 -108 -216 -67 40 28 181 -94 63 -44
4430 -44 50 64 160 297 95 317 56 -89 10 -60 -115 163 68 45 228 213 202 -356 12 -1 -23 -199 43 -129
4454 -129 -101 -165 56 41 -115 98 223 238 -133 85 237 -79 -12 -27 311 -156 -215 -14 297 -137 -329 -134
4476 -134 -2 52 -99 256 156 -288 -235 -48 -100 45 28 2 122 140 -21 221 92 14 121 -41 -118 -58 -265
4499 -265 19 -82 99 163 -121 24 -18 -230 -63 179 234 -12 153 -32 -6 101 78 223 166 -162 200 -8
4521 -8 -7 -160 99 77 188 -109 124 125 74 -203 -11 -41 24 -125 100 -18 -221 101 -311 105 -71 51 139 -158
4545 -158 81 0 -99 134 85 45 -97 145 -96 176 40 -95 66 -87 22 -73 -146 134 191 20 -232 -84
4567 -84 -10 113 124 42 -400 4 18 -77 27 33 -34 -40 9 56 -271 0 98 107 -68 93 15 -229 -23 -90 47 93
4593 93 -148 -296 203 137 -51 -211 84 233 70 8 14 -155 37 101 -148 -123 -336 96 -149 -81 -143 -39 -40 -210
4617 -210 -127 86 -76 -129 -293 77 -89 -128 102 39 -45 -190 -79 104 64 -272 148 -72 -140 -129 -177 -41 81
4640 81 -215 1 185 -161 238 113 -237 -63 33 -65 -72 -120 46 -59 235 40 403 381 222 -36 41 -38 31
4663 31 112 -8 -38 -90 13 157 -35 157 232 -116 233 -167 241 -135 40 -20 -144 -45 99 78 133 15 -175
4686 -175 339 -115 -27 -374 266 165 -15 27 -68 -268 -100 -13 256 203 -196 -74 -135 59 -103 -29 296 112
4708 112 -198 61 14 114 -50 -216 256 -32 11 23 -29 177 23 72 61 -6 -41 6 -1 13 -99 174 -97 73
4732 73 -42 99 -64 -145 -108 -26 -71 -210 -379 -73 -237 -274 -49 175 -170 198 -155 -55 2 -53 -113 -82 -45 -108
4756 -108 -84 -57 -245 -99 -99 -158 342 -282 -307 71 84 56 105 22 -233 25 155 148 102 -51 -186 108 -344 -18
4780 -18 -17 213 15 -27 -9 -60 187 -238 289 -68 31 13 -35 -66 188 14 -107 -78 -57 -80 5 -218 176 -342 -40
4805 -40 -50 -78 -226 -19 159 95 44 -151 3 76 50 175 112 92 152 -77 -59 179 75 -108 47 7 -44 -34 135
4830 135 73 42 -111 457 -103 -22 80 142 -92 25 387 -352 -21 34 -287 68 -27 192 -255 128 19 80
4852 80 58 125 201 187 232 -28 -123 -169 -4 228 -214 -120 244 -48 -11 -264 -12 85 2 44 11 50 -30 -143 59
4877 59 30 -177 33 40 199 -118 -267 51 -68 113 -284 -161 85 227 -106 28 268 -143 -227 -247 -171 -83 -69
4900 -69 144 155 139 -203 86 -281 100 18 73 45 27 -197 29 188 -21 116 30 13 -154 -124 -109 65 -318 -39
4924 -39 42 79 36 -91 -234 -110 62 -126 -140 122 -8 -134 -120 203 26 -126 -95 -264 -3 179 -124 174
4946 174 -46 53 28 96 7 -76 43 -186 -82 -25 162 142 100 189 125 -85 -79 -116 150 -249 -166 -31 60 -179 74
4971 74 -226 70 85 -159 113 176 50 -61 131 215 -17 -215 -13 216 85 52 460 31 10 108 70 -60 146
4994 146 -112 145 73 -94 44 -23 53 -144 31 -41 52 -193 -13 60 -207 187 -70 46 168 69 -79 -126 294
5017 294 15 -266 55 -72 -242 151 -96 -79 70 -116 -176 -106 -41 -106 -75 -3 278 -25 37 -93 -30 -145 -24
5040 -24 67 -14 -103 2 278 -220 195 -87 39 -178 206 -99 -99 -279 -187 77 183 255 -31 20 56 57 -96 179
5064 179 -6 -208 -119 86 102 27 56 2 -12 -71 -77 312 -13 119 114 79 -153 219 357 -161 143 186 -39 132
5088 132 9 -72 47 -110 -41 19 20 -299 -50 -312 22 -258 -58 -56 -64 111 139 -9 -117 -97 -15 -99 -6 50 36
5113 36 138 -152 46 -16 -196 -294 -63 168 -179 -42 -77 133 98 88 220 17 150 53 70 -129 -128 -139 106 71
5137 71 -32 300 237 -104 -282 136 -149 8 10 240 85 -367 -74 -39 57 -78 208 342 -145 191 -86 80
5159 80 75 -58 -104 -19 -107 61 15 96 148 -29 -60 149 -186 18 134 109 -5 110 46 -146 170 45 -175 156
5183 156 -77 46 -43 174 65 46 -185 -54 84 -112 -368 -217 9 -133 -87 -70 72 -282 -5 182 182 -109
5205 -109 -117 16 35 -11 31 272 41 -104 171 -235 23 184 8 182 92 -71 23 78 53 -6 201 -32 -68 -104
5229 -104 -289 46 238 -82 -80 -116 -225 105 66 19 6 -58 -62 107 -90 194 -45 42 53 19 -131 78 134 -11
5253 -11 172 127 102 -139 66 -241 37 29 60 3 -98 7 140 170 -151 -213 -303 10 121 92 -9 177 -141 101
5277 101 25 -61 158 -49 -19 -108 -286 -104 -180 290 90 -19 -33 -23 -52 69 95 -223 -111 58 -127 172 -174
5300 -174 -304 0 264 -440 -231 -91 68 -95 -52 208 66 256 64 -77 -184 -131 -86 -155 217 18 -159
5321 -159 62 -24 -65 79 8 46 231 -17 203 -10 236 -178 -10 -112 0 35 60 191 27 95 18 -58 175
5344 175 183 244 -149 -37 -292 9 154 -57 191 -6 109 -197 19 123 59 -12 -79 -77 218 144 -138 -203 -52
5367 -52 66 -46 -57 15 14 28 -170 26 -48 -22 -71 28 150 31 33 -245 95 236 -217 143 -247 4 80 21 -10
5392 -10 -53 -155 121 -82 -131 199 -300 19 -145 77 79 -130 211 -80 236 -100 -86 81 -31 -41 -176 -116 230
5415 230 137 -19 -35 -45 141 -81 37 60 34 -45 -49 -73 -111 -150 -27 157 -68 112 250 -162 27 -121 101 -13
5439 -13 -127 -37 -97 -94 -79 108 194 -48 101 -112 59 35 164 390 -77 164 -126 -18 109 149 -87 -135 130
5462 130 -10 -123 -21 -138 -93 38 -36 3 -37 7 238 91 -171 -25 89 -15 -66 -81 92 75 -18 128 128 -183
5486 -183 8 5 131 -213 24 -101 13 -115 -108 66 285 23 -169 19 1 -33 136 -167 -171 211 184 60 -41
5509 -41 -122 61 198 103 -7 -146 139 -212 68 -192 82 -315 55 -225 60 130 -198 15 0 -55 78 66
5531 66 -84 164 -83 -237 -55 23 126 81 69 10 59 49 -406 -8 137 -8 -75 102 -66 30 134 -78 -245
5554 -245 -93 -7 81 -11 134 122 185 230 53 43 -83 54 -126 15 47 -198 65 -184 -49 -14 223 -102 122
5577 122 64 -65 61 16 -407 29 -83 -142 1 -120 -27 61 65 -212 41 141 -130 -56 101 -45 -104 -359 257
5600 257 34 15 111 -78 -323 -51 -7 52 -104 174 205 188 483 15 105 61 103 -11 169 -141 -65 -33 -107 101
5624 101 -141 -151 224 131 -107 -50 78 33 -70 -334 -30 104 -95 188 -136 234 67 -5 196 -54 301 7
5646 7 220 18 -98 105 202 -16 -239 35 -92 -199 165 -119 -293 56 109 82 165 0 36 181 48 278
5668 278 -115 15 -8 87 136 -135 211 -115 -66 164 162 142 -84 -108 222 -82 372 70 58 -80 -189 -215 97
5691 97 105 143 -35 235 -17 3 185 -44 180 -267 -80 146 106 55 61 -83 26 -91 -442 39 180 65 90
5714 90 -79 67 -28 258 123 30 115 68 292 -37 308 -51 -169 -84 -26 366 -133 35 38 217 -130 -68 -166 -102
5738 -102 -88 42 -156 -153 -63 49 -437 77 -55 -96 138 -50 66 -111 -231 -50 -7 40 56 -63 -108 -9 166
5761 166 -90 -16 46 258 15 85 41 -16 183 -180 -52 -7 88 -49 -70 179 -144 -55 227 110 -95 309 113
5784 113 -117 82 168 68 137 303 -177 138 143 12 -109 102 -10 155 120 170 84 72 185 -97 -107 61 86
5807 86 196 -210 110 -253 75 35 97 18 161 5 -148 -19 9 -102 16 141 144 -16 -58 48 -52 -5 281
5830 281 -26 109 -170 243 83 -136 -34 -162 135 -254 -142 -10 106 -45 -24 -56 -198 -226 -135 -52 51 128
5852 128 25 -269 118 29 -214 27 24 154 274 154 106 36 121 -180 -72 -56 -275 78 -46 104 -258 36
5874 36 -99 -119 -139 -158 -108 -24 34 -251 -267 -30 110 89 133 -113 53 -20 -59 12 172 78 75 153 -19 125 29 74
5900 74 -170 105 -308 67 176 18 -35 -260 17 -6 -41 -102 11 251 19 374 163 67 78 117 19 -40 -193
5923 -193 11 41 -77 137 116 50 -65 8 43 280 18 -65 -50 -175 -64 -136 -111 -36 -11 59 14 79 -285 -258 19
5948 19 227 47 -117 307 16 -46 -250 -252 -51 131 37 -65 230 132 99 -119 -4 101 -147 -109 61 -29 -134
5971 -134 42 -189 90 -162 -18 118 -57 -173 -198 155 -18 42 280 90 -23 68 112 -22 -18 259 -78 -90
5993 -90 146 -152 116 97 180 -11 -182 40 -123 85 223 25 12 -106 -283 -66 7 -207 67 359 21 110
6015 110 67 -30 -14 260 -23 224 -14 -131 -6 -228 158 106 18 -44 112 -53 77 -188 28 16 101 -114 0
6038 0 24 4 52 40 228 102 221 -64 72 1 -79 218 80 44 180 -67 3 -184 106 -185 -104 179 129 -92
6062 -92 -65 -276 28 81 140 90 90 29 27 -157 215 -149 -146 43 71 247 -281 106 98 -15 -44 92 45 -173 -74 -106
6088 -106 188 -64 -34 228 13 -4 108 -339 40 -66 -65 486 -240 -10 -68 -253 -138 -158 -71 247 -36 -36 86
6111 86 -156 78 54 85 38 23 -219 -256 219 19 159 -36 77 71 109 70 94 -107 30 60 -41 -27 -46 206 190
6136 190 8 -58 47 -56 170 244 75 -72 -7 -215 -29 106 209 -87 98 110 -182 70 -34 143 63 -43
6158 -43 -129 61 42 -82 -4 -29 -54 22 4 -135 -166 -232 -52 -149 133 -57 -90 -249 -158 124 -62 -59 5 238 135
6183 135 84 -320 -56 171 36 258 -199 -17 -13 -46 -28 1 61 138 56 16 27 -369 226 -96 -6 -180 -40 -75
6207 -75 189 -120 6 -216 82 222 68 -147 -92 -174 59 57 -27 -60 -39 -54 106 -75 -70 69 -113 63 -126 -67
6231 -67 0 72 57 -17 -221 -156 126 -132 -212 -84 51 45 11 203 182 155 -32 256 111 159 -124 -10 40 -107 27
6256 27 94 -5 -123 177 -34 -65 -364 122 157 -71 -114 72 -20 168 133 146 -129 -49 -43 -30 99 130 122 -95 -136 90
6282 90 141 -105 246 -164 284 94 -177 69 63 -58 24 168 10 165 6 -243 48 -293 139 57 351 -60
6304 -60 39 -84 78 -43 57 -234 -159 183 -84 -216 -168 -37 85 -56 -23 100 -133 -79 -42 233 84 -122
6326 -122 -78 154 43 154 117 161 192 -236 57 -62 186 54 -33 -168 -51 101 22 -2 -77 -33 -50 20 69 -25
6350 -25 159 93 -83 54 29 24 46 -44 -79 -44 -69 168 -4 -24 368 181 -115 167 6 -39 300 -270 -9 -121
6374 -121 -137 -119 150 82 42 -148 118 -70 -101 132 -3 5 1 -60 -204 72 -166 74 -270 42 38 -2 13 -161 133
6399 133 -56 -91 -4 -40 57 -133 -245 225 -43 204 -117 -27 10 -58 -22 314 49 -86 104 -17 71 -38 83
6422 83 -180 -133 -133 45 -292 -120 -69 47 143 186 -75 -96 194 -94 -25 88 -175 35 -181 30 -222 209 112
6445 112 -10 157 21 89 -61 144 0 -63 66 -245 -107 -69 -126 93 115 -67 -67 145 -31 22 342 -127 -68
6468 -68 204 115 -126 -209 -59 126 -422 74 94 -6 -49 -230 -136 -82 -118 245 -68 -4 -64 -111 233 -48 245 -48
6492 -48 294 61 5 239 26 -47 -79 -82 22 151 -62 -132 236 -59 74 -187 147 -56 -336 51 224 -35
6514 -35 27 7 -141 -238 -147 53 -136 -113 -50 -228 -98 16 34 -159 141 -21 -149 -62 182 216 -8 -314 -76
6537 -76 193 -140 -4 98 87 -34 129 -53 -4 -145 98 -51 179 100 -150 -92 135 66 17 27 -259 -176 174
6560 174 123 -1 143 39 -165 -188 -105 -251 -141 -79 -158 37 -349 -79 -41 -115 67 -48 -253 122 152 41 118
6583 118 21 185 182 237 184 -62 9 18 -204 -165 -69 170 263 55 -93 -84 -78 135 -201 -31 48 126 159 44 51 -205 43
6610 43 -61 -88 -34 37 112 -224 -70 -99 88 41 6 -50 102 118 181 161 -123 4 -107 -30 6 3 -81 118 -159 5
6636 5 -161 10 118 -2 -5 -72 -65 -3 -105 -103 -23 -294 -181 -21 245 -197 65 -9 -126 -53 263 -210 148 182 146
6661 146 -91 -52 -58 -4 83 -64 -284 -71 164 261 -230 177 100 205 170 -146 -121 -42 -156 50 118 44 -141 72
6685 72 32 -156 38 44 -40 -117 284 224 -250 110 77 -98 -110 100 -82 -148 -124 -128 201 156 51 77 12 -85 -140 120
6711 120 -11 90 107 29 145 -461 81 106 -120 -23 -227 -4 61 -28 6 -24 106 14 146 -40 -73 -2 -170 -129
6735 -129 -65 -113 -47 -61 -162 173 -399 -21 45 -172 138 -71 287 122 -31 11 -66 38 83 153 -42 -115 -64 40
6759 40 60 165 101 -3 -77 -20 308 -166 13 -173 1 -105 110 115 146 13 -145 -110 -24 -175 -124 7 -97 -42
6783 -42 -109 -226 51 -71 5 3 55 -181 -25 9 -8 165 125 -107 -288 16 5 148 28 -40 -62 46 -279 -154
6807 -154 -4 83 179 48 -212 18 81 -80 -75 149 209 -116 54 -31 35 -225 98 139 -201 228 -21 241 -32
6830 -32 249 -106 -206 24 174 45 19 159 347 -50 -39 -14 -56 -24 25 -17 -197 193 -191 94 5 32 -417
6853 -417 178 21 -12 -105 44 83 111 15 145 142 -50 230 -23 11 76 65 39 -138 -165 106 -197 1 -6 97 92
6878 92 53 -91 -17 -148 52 67 34 2 47 -164 -60 -51 237 -197 136 -137 44 -147 -68 41 -225 -22 84
6901 84 12 -94 -28 127 46 -186 -159 -35 240 -146 -213 -42 -25 124 15 98 -270 -215 -318 111 90 -89 -240
6924 -240 62 186 -278 -75 274 334 -53 -49 51 -65 -40 -133 -12 -38 116 51 -189 58 28 -132 90 59 -80
6947 -80 8 302 -50 106 -124 -43 31 115 -208 1 -5 39 86 -105 -35 -246 38 -53 223 -149 211 -7 -6 157
6971 157 -146 -23 -143 -61 -60 91 108 183 -83 245 55 -136 -149 -120 102 92 295 78 180 -292 47 192 12
6994 12 -53 -205 173 77 -77 81 41 6 -37 94 -196 -267 -8 -191 -31 -52 -84 -70 34 -252 -119 -182 -22 -110
7018 -110 -77 -222 -10 -80 -55 5 53 -121 -99 -31 -144 37 -70 86 139 -76 -140 -38 -83 77 -218 -47 101
7041 101 202 -224 18 -202 1 43 -67 109 -88 -163 -75 0 66 93 -30 4 -106 -103 -42 12 42 -198 -75 64
7065 64 87 146 -118 -175 41 40 111 -178 -25 -20 -252 -27 -52 -172 -126 -108 120 203 -15 197 -71 -140 110 -152 199
7090 199 -160 -25 -2 -8 -28 -144 -101 -94 16 -83 148 117 -14 68 31 -111 145 14 28 -22 -3 -58 292 -14 99
7115 99 182 -182 -73 71 -323 167 230 5 276 -140 -39 -176 95 196 173 291 272 9 -68 177 -8 -157
7137 -157 15 52 201 195 84 -118 121 -22 9 -68 76 174 237 222 112 211 -170 36 37 -94 -7 -204 56 211
7161 211 -124 -54 31 -94 249 16 -66 46 -20 105 61 -208 -86 166 -154 -87 -46 210 90 -119 -65 125 77
7184 77 129 -78 -14 197 -134 -146 1 50 204 -80 -146 67 -41 166 236 94 1 170 -50 162 -38 23 100
7207 100 334 -86 -167 -164 -42 -78 72 112 -179 -32 10 31 15 -98 178 1 77 65 93 -69 34 -8 -135 66
7231 66 -154 -170 -149 -39 127 83 132 191 90 -235 -122 106 54 -327 -284 98 -90 5 -26 -11 -165 37 -240 -166
7255 -166 -9 -105 -51 -131 -72 92 -124 104 248 24 -21 77 -4 -59 -73 51 -44 50 35 -153 28 -78 -63 38
7279 38 -33 -137 -1 -234 -142 309 44 -36 262 196 -33 200 31 -95 -110 237 333 -121 -28 -383 -100 12 -7
7302 -7 73 -63 -66 229 -224 29 -15 62 88 -144 133 -104 -79 -105 -44 -319 -196 -454 43 -100 -146 -170 -258 -126 91
7327 91 124 -4 49 -117 32 64 -37 10 -410 60 -14 54 82 100 -150 222 -82 -182 33 23 -65 250 181 89
7351 89 -188 119 37 71 26 131 -11 129 -82 -62 88 -219 19 -87 -407 -73 91 82 -60 62 91 146 -28
7374 -28 112 -33 -104 343 5 -226 43 -26 -11 172 -193 244 244 -121 5 164 -205 -44 -90 -337 -329 -166 -42
7397 -42 125 -51 -157 190 336 52 1 -88 -232 -70 -60 45 -37 207 -222 52 -32 87 -212 -221 -220 35 -105
7420 -105 121 61 -49 195 -23 274 -347 -57 72 -118 151 -201 95 -26 -123 -38 34 157 220 -211 -323 57
7442 57 249 -77 0 -112 -107 -46 -104 226 40 -214 59 181 179 -155 65 -40 -216 -57 -96 306 30 58 -10 -88
7466 -88 -133 108 245 -34 -37 -133 28 233 -141 -73 -2 245 -240 -197 167 43 36 -140 219 -136 21 347 12
7489 12 22 -23 -50 0 77 104 17 25 -88 -206 -202 44 262 40 -47 -214 -3 -221 -70 28 154 119 140 367 150
7514 150 -192 -8 -135 119 258 -124 -112 -143 -165 114 -29 -25 -242 10 -43 18 139 163 145 -246 -99 -142 -54 42
7538 42 42 86 28 33 97 178 31 42 33 33 -5 34 -136 -1 11 88 42 -6 129 -167 58 -129 200 -161 245 0 23
7565 23 179 -113 27 -94 162 51 -109 -14 -128 -138 52 -176 -95 168 -220 85 9 -179 140 114 -231 112
7587 112 -114 -73 246 -186 -3 218 14 -52 4 15 120 -142 -58 -82 29 95 33 -3 -194 -56 -264 190 -159
7610 -159 229 48 2 -93 -48 -15 -10 -41 -281 -200 167 -195 -26 169 -280 141 260 -87 -161 79 126 121 208 0
7634 0 81 3 192 -85 -99 23 73 108 -10 224 -57 109 62 -144 -31 -215 -99 -192 -95 62 -5 222 -101 19
7658 19 -15 -60 -203 -108 93 170 56 101 -126 94 -39 128 54 2 160 213 -81 -174 -5 251 150 11 -19 -211
7682 -211 186 44 -60 -9 9 -185 102 -23 -166 -25 60 -299 31 -44 -81 -230 2 33 -52 -77 51 31 -22
7705 -22 -43 220 -52 -150 -46 1 182 -207 11 96 -169 -55 12 186 -141 -78 68 42 13 -159 89 21 -120
7728 -120 -221 -191 38 131 142 -11 84 108 237 -36 -131 1 84 -93 -75 115 78 112 200 -200 179 234 -167 -131
7752 -131 165 -29 144 -330 -149 -390 -96 30 -229 -43 -78 50 -209 105 -48 -168 109 -22 110 -50
7772 -50 -113 -308 -87 161 45 -217 87 91 84 79 -152 103 31 -5 -214 -219 -28 10 137 64 -2 6 92 -162 -160 -178 116
7799 116 21 -163 -301 -67 54 -328 148 -27 -128 6 -54 291 194 -141 22 -74 51 -142 -112 -10 -105 54
7821 54 -79 34 -166 82 91 -82 176 -61 -97 -85 277 -86 -294 -62 44 53 -50 -73 -296 187 97 97 -17 -81
7845 -81 154 6 7 66 -271 207 53 -22 -119 -87 283 65 -71 54 -65 187 -11 -129 -96 12 73 305 111
7868 111 -93 -128 86 -22 -363 213 236 -170 67 -51 -208 9 -124 10 -235 -89 -76 -290 -128 -54 16 122
7890 122 -127 -81 -41 -145 111 89 -123 72 129 -75 -17 -8 -54 -264 -104 -78 -317 -93 4 35 -97 -7 294 -113
7914 -113 82 4 -29 -70 -140 -12 26 63 -156 -337 14 40 114 -115 -104 -4 29 237 94 122 -99 13 -109 106
7938 106 1 79 52 270 209 15 328 -65 -105 43 -37 73 207 79 -35 43 -232 211 211 -28 331 -85 -22
7961 -22 -83 -71 21 25 -67 105 142 -104 -71 73 -275 -46 30 -190 24 -172 152 56 -63 67 -104 -26 -81 91
7985 91 59 -175 112 162 45 -112 -6 125 51 -260 123 -68 -294 65 160 33 70 49 -111 22 75 94 13
8008 13 -184 -81 -179 -261 -148 41 -34 -73 -159 -175 150 123 35 99 8 118 -90 10 3 92 -14 -215 -80 125 -73
8033 -73 -116 -115 -103 372 -2 244 85 -35 -34 17 231 48 -2 -227 -19 143 8 141 -40 71 -143 69 -153
8056 -153 -77 -166 -95 60 -257 -68 -19 -115 -156 100 -25 228 47 31 -133 -347 10 -234 139 212 -51 142 230
8079 230 -233 102 -178 -30 143 153 124 76 128 17 -96 -3 -4 -8 104 -67 13 -96 -118 -206 261 22 -27 -41 -57
8104 -57 -95 -186 223 -4 7 -151 202 -60 44 -66 -203 296 -32 198 -153 156 -91 -383 257 133 119 182
8126 182 280 -17 55 -84 67 -118 88 96 186 -188 -445 126 -284 42 -16 -97 -11 39 -49 24 174 -130 5 42
8150 42 -118 31 187 48 -119 -18 196 7 158 30 -151 -47 80 -84 -72 -20 329 -96 -127 29 107 -60
8172 -60 116 -320 -27 -46 -2 22 -236 203 -12 -337 10 -228 -33 -139 -41 126 -136 95 -244
8191b44
$$ Imaginary data points
##PAGE= N=2
##DATA TABLE= (X++(I..I)), XYDATA
0 0 0 0 0 0 0 0 0 0 0 0 0 0 0 0 8 -8 8 -8 8 -8 16 -16 16 -24 24 -32 33 -40 48 -56 63 -71 80 -88 100 -113
36 -113 126 -140 156 -176 193 -216 238 -264 290 -321 354 -389 429 -472 520 -573 632 -700 774
55 774 -859 957 -1069 1204 -1361 1555 -1797 2111 -2534 3132 -4043 5593 -8699 17277 -87712
70 -87712 -267400 56477 198832 -19056 -108165 30803 50307 -6596 14935 25059 -31096
81 -31096 -10952 55490 17299 -75937 -33493 80772 52396 -78472 -73989 45421 68013 -16565
93 -16565 -46900 -10120 11858 14666 10938 -20570 -26437 21948 24595 -36954 -28150 38922 21112
106 21112 -36614 -11407 21194 -4782 2294 38449 1101 -45239 4040 59045 17615 -39312
118 -39312 -18936 26242 15928 -20938 -17303 9783 2683 -19980 -9358 7532 -4436 -7959 10900
131 10900 -113 -26262 -981 36369 7578 -34456 -9288 27946 11289 -14051 -4235 11341
143 11341 6001 -4145 -3627 7999 12017 -169 -9281 -1365 8787 8397 -277 -10736 -7317 8001
157 8001 4889 -13282 -7889 8997 -3583 -20559 -1340 14631 -3683 -13237 2468 4068 -1953
170 -1953 9026 9687 -9202 -5198 17872 11887 -10782 -5347 13758 8740 -9766 -7903 9258 10585
184 10585 -6820 -11564 1437 6385 -2237 -5600 -2992 -2513 -848 -591 -5096 -3374 3794 -1339 -10004
199 -10004 -1035 10697 609 -9085 2059 8171 -1286 -4 9192 2553 -4846 4697 8823 -22
213 -22 -2726 4608 3718 -5249 -5589 4273 5880 -8251 -13753 2351 9168 -6736 -12517 2345 6843
228 6843 -5430 -6833 2965 4584 -1592 -2166 1310 1963 1755 2508 2602 2150 608 201 4713 6409 -942
245 -942 -4896 2855 6298 -1349 -4530 201 1790 -2376 -4780 -1109 1507 -3242 -6691 -543 2925
260 2925 -4995 -6234 4741 4129 -7395 -4152 9518 5999 -6644 -2302 9877 6058 -3984 -1228
274 -1228 7128 4518 -2528 -1733 3375 2902 -2313 -2996 1053 220 -4133 -1517 1153 -3327 -5919 -664
290 -664 1190 -2281 -4297 -2114 1701 1670 -3174 -2622 4877 4077 -3614 -1431 7316 4812 -3514 290
306 290 7403 3163 -3141 248 5628 1146 -3969 -1489 3492 356 -5569 -3152 3011 -304 -7340
321 -7340 -2950 3857 -1702 -6819 -114 3354 -2376 -3609 2182 3080 -228 -1210 1781 4590 1990 -1924
337 -1924 2125 6253 970 -3699 2362 5834 -878 -4312 1705 3312 -2429 -4129 -47 750 -2416
352 -2416 -4365 -1705 752 -1329 -5147 -1523 3472 -1035 -5423 1510 5658 -1580 -3785 3889 4964
367 4964 -712 -1108 3335 4375 652 -1027 1930 3701 -409 -3346 1521 3251 -3437 -4788 2249
382 2249 2068 -5503 -4595 2449 471 -5340 -3218 1488 599 -1887 -2200 490 2770 653 -2318 1943
398 1943 4873 -129 -1836 4260 4277 -1751 -477 4795 2397 -2463 -1277 2507 1913 -2481 -3800 670
414 670 1691 -3364 -4540 1028 1152 -4926 -3231 2949 413 -5074 -907 4215 603 -3346 466 4037
430 4037 2451 -818 -362 3010 4432 -103 -1951 3222 3719 -1793 -1047 2969 205 -3392 -397 2130
446 2130 -2370 -4503 -983 1817 -945 -5205 -3358 2741 1761 -4981 -3928 4064 3276 -4029 -1078 4899
462 4899 1956 -1736 1827 3547 330 -107 2354 2792 389 -1659 190 4366 940 -5890 -2003 5452
478 5452 286 -7649 -2378 3720 -959 -5325 -1468 1630 -1231 -2808 219 1747 -687 -2657 1847
493 1847 4494 -482 -3784 2876 7250 -561 -5021 3503 6659 -1372 -4185 2139 3562 -1018 -2307
508 -2307 -233 606 -1143 -2828 -775 1135 -2711 -4629 1735 2945 -4708 -5455 3230 4330 -3133 -3814
524 -3814 2870 4087 -897 -1730 2842 3845 -283 -1166 3298 3699 -2034 -1740 4462 2510 -5086 -2817
540 -2817 5595 1738 -7006 -3105 3916 1205 -4802 -3826 1143 1486 -2011 -2813 625 858 -1924 292
556 292 3218 -314 -2999 2673 5742 -388 -3240 2488 5570 996 -2703 78 3855 1917 -2960
571 -2960 -2319 2246 1438 -3484 -2757 1349 -484 -3545 -982 1190 -2144 -3733 976 2627 -1714 -3518
587 -3518 925 4429 351 -3385 366 5140 1547 -1923 1036 3735 597 -844 2037 1953 -1350 -763
603 -763 2151 549 -2693 -2002 1172 621 -2869 -3272 4 1606 -1987 -3685 -386 1914 -396 -2414
619 -2414 -283 1937 809 -262 813 1999 1250 -95 1210 2664 587 -738 1432 2687 -800
634 -800 -2322 1274 1988 -1782 -3012 699 1392 -2579 -3460 157 765 -2194 -2779 231 1397 -1646 -2044
651 -2044 1630 2164 -1455 -1221 2914 2629 -951 -824 2371 2559 -115 -61 1335 1542 -190 -1085 1073
668 1073 1117 -1471 -2234 314 1057 -2015 -3152 -15 946 -2180 -2788 691 1189 -2076 -1858 1711 1706 -1509
686 -1509 -926 2890 2483 -985 -579 3529 2351 -1912 -417 3830 1792 -2386 -668 2717 918 -2601
702 -2601 -1444 745 142 -1950 -1964 -90 -399 -2426 -1321 595 -195 -2149 -753 1951 647 -2030
718 -2030 128 3326 1338 -1504 223 3156 2035 -1239 -3 3065 1620 -1787 -327 2485 351
733 351 -2684 -574 1644 -831 -2930 -781 1008 -1388 -3022 -588 1225 -701 -2491 -211 2279
748 2279 159 -2205 226 2998 679 -1558 1115 2940 487 -825 1432 2364 -33 -1069 1014
763 1014 1931 -723 -2171 140 1798 -1063 -3164 -125 1441 -1491 -3304 -36 1152 -1420 -2305 278
779 278 1475 -532 -1415 806 2533 133 -919 1555 2893 188 -956 2270 2626 -573 -1334 2079
795 2079 1998 -1905 -1642 1125 691 -1870 -2220 106 568 -1757 -2611 185 1062 -2019 -2152 1405 1116 -1883
813 -1883 -1081 1999 1539 -1125 -360 2546 2167 -486 -132 2203 2099 -521 -1041 1525 1829 -1300 -1429
830 -1429 1289 992 -2438 -1544 1034 -60 -2763 -1595 814 -295 -2228 -1231 1189 655 -1965 -769
846 -769 2280 1273 -1326 -263 2736 1351 -1007 535 2853 831 -1037 463 2179 410 -1465
861 -1465 -410 1265 180 -2170 -1160 941 -557 -2544 -895 1203 -765 -2652 -382 1349 -353
876 -353 -1795 294 1896 325 -865 539 2419 904 -1114 248 2656 636 -1692 618 2264
891 2264 -87 -1556 78 1057 -672 -1884 -158 649 -1128 -2147 -504 1027 -1138 -2501 -62 1782
907 1782 -593 -2302 486 2173 -473 -1241 1133 2048 4 -584 1531 2156 112 -568 1090 2145
923 2145 -369 -1425 933 1748 -1539 -2256 855 1180 -1872 -2498 231 622 -1282 -1949 -27 794 -855
940 -855 -1602 706 1534 -759 -1146 1794 2322 -860 -625 2515 1962 -1004 -790 2254 1832 -961 -862 1272
958 1272 1454 -1190 -1552 795 565 -2173 -1604 909 105 -2797 -1195 1380 179 -2350 -937 1893
974 1893 689 -1358 -403 2049 1227 -983 -61 1833 1634 -847 -257 2119 980 -1392 -66 1912
990 1912 -235 -1968 -464 1198 -484 -2407 -849 1160 -295 -2561 -1355 1176 204 -2322 -486
1005 -486 1761 -48 -1352 612 1924 179 -742 1108 2248 260 -1015 1156 1870 347 -1452 676
1021 676 1826 -304 -1904 -24 1439 -1107 -2045 -229 624 -1206 -1567 -83 242 -992 -1460 319
1037 319 1128 -350 -1256 555 2017 39 -858 1514 1750 -240 -599 1146 1496 -121 -574 680 1077
1054 1077 -392 -1131 155 694 -1005 -1365 184 711 -1487 -1796 109 455 -1435 -1370 756 598 -504
1071 -504 -617 780 836 39 -507 1304 1243 -119 -185 1258 1406 -616 -525 1157 1078 -818 -638 705 588
1090 588 -1096 -1194 333 425 -1286 -1554 340 536 -1266 -835 565 334 -1179 -827 1696 839 -814 -284
1108 -284 1669 1077 -414 -116 1758 1201 -369 -340 1558 717 -1147 -907 1225 56 -1471 -924 627
1125 627 -260 -1889 -927 643 -197 -1532 -824 834 84 -1268 -81 1327 582 -719 -40 1538 974
1142 974 -362 318 1664 748 -1000 196 1765 437 -1145 -225 964 47 -1667 -599 737 -705
1158 -705 -1980 -566 743 -311 -1606 -407 1245 -507 -1097 553 1270 -112 -951 726 1394 132
1174 132 -606 910 1743 166 -895 620 1800 137 -864 449 1115 -939 -1155 90 598 -831
1190 -831 -1484 -21 384 -786 -1502 -104 816 -480 -1331 516 1243 -462 -850 988 1501 -457 -699
1207 -699 1531 1462 -233 -460 1184 1124 -431 -633 812 781 -1072 -956 801 419 -1216 -1359 295 130
1225 130 -1619 -1060 629 119 -1160 -646 649 630 -712 -562 1305 1075 -449 -375 1101 1183 -536 -231
1243 -231 1650 713 -807 -434 1292 93 -880 -716 591 -94 -1214 -1044 540 79 -1483 -839 647
1260 647 100 -1353 -596 962 359 -1118 71 1246 535 -495 126 1373 1017 -689 104 1198 493
1277 493 -569 -189 1302 163 -1284 -227 927 -222 -1546 -224 269 -668 -1532 -389 573 -204 -1191
1294 -1191 -297 976 240 -1050 208 1474 141 -686 431 1495 73 -525 696 1283 126 -678
1310 -678 407 1251 -285 -1050 -106 898 -610 -1372 -338 609 -830 -1600 -38 360 -775 -1275 417
1327 417 750 -224 -750 369 1104 -117 -822 763 1454 -41 -399 1183 1132 -319 -508 682 784 -655
1345 -655 -882 376 477 -698 -958 -121 320 -1251 -1216 2 520 -938 -1023 450 450 -629 -851 641 975
1364 975 -559 -254 1297 989 -395 -137 946 923 -346 -555 1001 831 -777 -711 680 370 -1066 -804
1382 -804 531 -142 -1398 -870 296 -11 -873 -660 493 435 -861 -710 883 710 -797 -135 1375 946
1400 946 -319 40 1408 597 -448 -173 972 441 -557 -239 586 19 -1235 -916 606 -149 -1408 -451
1418 -451 639 -172 -1354 -423 693 -422 -1115 162 920 160 -390 211 1094 242 -538 126 1425 498
1436 498 -678 404 1015 25 -671 267 734 -321 -1107 -74 572 -625 -1357 -225 492 -474 -1489 -139
1454 -139 836 -420 -807 354 830 -598 -469 715 1056 -144 -207 552 934 113 -166 747 905 -169
1472 -169 -638 470 783 -904 -921 315 228 -819 -869 171 92 -896 -1007 108 462 -791 -987 632 682
1491 682 -568 -536 889 1080 -93 -283 871 1048 -244 -144 673 705 -274 -424 478 681 -395 -643 559
1510 559 199 -1004 -867 553 133 -1006 -845 277 272 -757 -517 302 369 -616 -84 802 630 -317 47
1529 47 1001 801 -619 -133 883 820 -560 -387 807 -188 -629 -86 520 40 -984 -605 451 -394 -1040
1548 -1040 -453 415 172 -748 -136 527 -3 -968 -105 956 528 -425 231 753 362 -459 235 859 190
1567 190 -689 122 507 376 -757 -131 552 -214 -957 -590 324 -159 -825 -94 533 -140 -643 -129 859 106
1587 106 -702 333 958 96 -267 396 945 141 -260 534 1075 -20 -558 134 738 -144 -471 -52 562
1606 562 -718 -871 59 543 -584 -744 154 220 -648 -935 1 263 -467 -365 763 710 -468 -345 743
1625 743 905 -240 142 679 896 -183 -428 496 648 -362 -340 522 325 -612 -799 377 210 -846 -535
1644 -535 95 187 -646 -626 402 324 -636 -508 819 716 -557 -7 1152 485 -293 198 617 484 -97 -108
1664 -108 745 289 -441 -298 390 396 -896 -436 273 -135 -848 -329 225 -94 -928 -480 458 -47 -871 -152
1684 -152 512 212 -318 44 686 580 -513 55 1069 520 -532 348 739 166 -718 -94 400 -363 -621
1703 -621 -5 90 -367 -962 -317 633 -199 -865 -515 627 -173 -742 180 591 -265 -386 456 704 -7 -314
1723 -314 382 1067 86 -342 457 850 102 -346 75 772 -424 -877 137 450 -275 -705 -240 161 -505
1742 -505 -843 -346 364 -440 -726 391 241 -324 -504 544 689 77 -226 604 874 -136 -464 605 494
1761 494 -349 -305 363 362 -525 -519 436 220 -638 -862 267 325 -461 -841 229 138 -359 -509 190 590 -322 -42
1783 -42 539 399 -187 57 530 667 -312 129 671 420 -473 -364 594 495 -362 -163 261 194 -628 -489 449
1804 449 -13 -652 -567 452 56 -843 -621 421 244 -445 152 928 270 -337 -129 918 225 -128 138
1823 138 672 519 -306 332 682 310 -480 -142 563 -53 -704 -224 -19 -130 -846 -192 102 -181 -665 -140
1843 -140 138 99 -231 218 673 -3 -304 570 683 -73 -322 352 610 145 -463 170 615 -104 -341 37
1863 37 450 -265 -653 70 501 -542 -592 36 514 -442 -601 103 422 -168 -191 301 468 42 -455 514 806
1884 806 -17 -241 534 824 -99 -174 329 356 -74 -431 467 256 -236 -772 64 411 -554 -821 50 139 -676
1905 -676 -478 459 150 -578 -355 388 231 -402 -304 625 688 17 131 457 161 -232 -55 611 503 -326 -147
1926 -147 404 267 -531 -88 389 -12 -840 -514 167 52 -556 -488 530 -39 -455 -463 373 245 -229 55 316
1947 316 117 -428 20 569 360 -342 -8 394 220 -410 -259 413 -126 -717 -171 334 -24 -645 -92 -2
1967 -2 -185 -545 -725 304 75 -313 -317 555 -5 -272 129 573 17 -151 377 545 546 -448 12 770 -153 -308
1989 -308 35 262 -69 -583 -118 220 -227 -595 24 195 -504 -396 -286 200 -452 -662 72 200 -105 -505
2009 -505 257 320 -187 -367 347 371 -33 -291 400 571 -50 -521 27 554 -426 -434 125 70 -543 -540 193 206 -409
2032 -409 -382 485 76 -369 -359 220 402 -430 -140 396 500 -11 -159 490 510 -278 -77 185 564 -188 -262
2053 -262 526 244 -111 -145 264 245 -449 -518 22 123 -394 -541 82 69 -335 -361 226 133 -413 20 343 276
2075 276 -137 29 546 352 -239 -246 629 261 -459 -10 454 333 -445 11 324 -78 -554 -285 -38 -71 -312
2096 -312 -367 -2 -62 -473 -24 438 -249 -497 -119 289 145 -247 -62 607 61 -231 9 381 83 -327 165
2117 165 278 11 -699 -89 89 -191 -723 209 172 -244 -695 -79 118 -263 -648 -43 560 -120 -175 248 292
2138 292 132 -207 252 553 -24 -195 419 320 -56 86 158 330 77 -368 278 146 -390 -709 227 -47 -473
2159 -473 -718 37 203 -129 -297 192 254 -59 -260 218 290 9 -400 454 434 18 -243 238 494 -369 -44
2180 -44 363 167 -265 -118 333 211 -221 69 127 218 -707 -245 230 -14 -517 -417 298 50 -423 -150 404
2201 404 289 -113 -60 243 356 -158 98 332 542 -207 60 453 333 -112 -228 331 103 -542 35 116 67
2222 67 -692 -273 63 -30 -602 -286 166 364 -516 -225 619 176 -565 104 585 313 -118 230 412 90 -283
2243 -283 201 729 246 -80 -132 202 170 -369 -37 180 -83 -585 26 142 -50 -215 -170 -33 -1 -327 -129
2264 -129 206 -43 -70 -98 588 -43 -137 105 226 174 -178 293 527 -178 -391 169 79 -67 13 135 168 -280
2286 -280 -472 142 112 -31 -448 42 119 -223 -237 -68 184 -260 -90 358 58 -113 -80 55 304 -161 -361
2307 -361 413 396 112 -383 160 155 -213 -191 112 61 -448 -426 216 -25 -42 -337 75 135 -273 -263 209 75 -300
2330 -300 -196 10 216 -196 -105 422 130 -166 18 533 685 -143 16 502 259 -201 184 209 12 -331 -336
2351 -336 291 -189 -600 -210 295 -244 -581 -114 204 28 -235 131 279 269 -179 -51 408 -124 -137 66 575
2372 575 81 -628 97 438 -39 -438 7 295 -90 -566 -290 37 -252 -367 -65 332 -26 -420 -349 99
2392 99 -150 -192 248 269 173 -248 320 241 121 14 259 616 241 -174 93 512 -46 -26 61 246 -131 -483
2414 -483 44 320 -297 -211 225 295 -231 -380 176 459 -132 -168 76 235 -67 21 182 118 166 -160 416 381
2436 381 -56 -162 20 302 -214 -613 -116 -34 -405 -598 -33 -229 -306 -291 -38 329 -410 -229 58 222 -110
2457 -110 -219 98 71 -116 189 251 436 -205 -50 81 274 -175 -5 321 434 -383 -215 352 212 -450 -52
2478 -52 298 -79 -321 -169 -26 104 -431 -170 128 70 -245 -21 268 -263 -84 -112 515 290 -131 -321 566
2499 566 -159 -155 0 321 78 -269 433 360 -53 -228 100 215 -259 -493 -236 266 -54 -348 16 74 -87
2520 -87 -162 -88 67 106 -347 304 49 -112 -361 191 229 -52 67 226 260 -60 -305 338 612 -185 -392 125
2542 125 247 -221 -440 -184 166 -244 -187 188 -64 -117 -274 17 217 -359 -281 268 392 189 -99 295 58
2563 58 31 80 221 418 -180 -340 41 261 -318 -374 65 87 -219 -210 217 166 -304 -294 78 163 -177 -311 -169
2586 -169 69 -250 -277 -130 189 -263 -161 44 291 -34 -31 276 224 -179 63 360 40 -144 -271 329 119
2607 119 -195 -367 130 -120 -308 -40 156 182 -382 -77 -132 37 -343 -86 190 158 -293 35 479 171 -231
2628 -231 -82 291 179 36 209 410 -182 -154 -24 115 109 -254 -95 54 75 -372 97 65 237 -352 -89 248
2650 248 -177 -257 117 149 -70 -26 139 160 -3 -365 40 259 -150 43 -64 391 28 -177 45 574 -71
2671 -71 -142 90 -9 -165 -196 79 292 -171 -554 116 301 -348 -274 55 245 -71 -354 7 153 -307 -236 278
2693 278 222 50 -195 118 119 162 -410 140 80 -188 -389 -28 54 -278 -198 -1 -165 -219 -469 117 0 -148 -297
2716 -297 303 111 100 -61 203 278 -210 -102 84 282 -219 -135 248 193 102 78 413 124 -183 -189 93 138 -245
2739 -245 -9 -7 72 -94 -162 470 229 -334 -230 196 252 95 -172 65 -56 -381 -48 264 168 -223 24 201
2761 201 -51 -432 -60 287 18 -83 67 167 -85 -160 -136 6 -146 -320 -36 98 -79 -308 -219 270 132
2782 132 -304 41 -59 81 -144 83 -55 141 -218 85 114 -49 27 84 305 -69 101 154 42 -153 -334
2803 -334 -49 75 -73 -133 22 -145 -54 -247 -151 269 -166 13 91 379 -14 -230 -1 475 -65 -20 451 270
2825 270 44 -213 -17 150 182 -116 211 14 -336 16 117 281 -320 -272 28 382 -115 -253 17 37 -350
2846 -350 -6 255 -14 -28 -198 81 108 -181 8 248 265 -372 -203 326 62 -59 107 40 113 -213 -223 327
2868 327 -264 -167 -392 329 82 -393 -207 -32 10 -284 -209 264 189 -109 -290 158 464 -30 77 265 110
2889 110 -275 -55 186 118 -37 25 329 309 -98 -15 18 -126 -391 -134 90 -138 -261 45 -9 -17 -104 -31 -114 148
2913 148 -277 202 145 275 -212 -123 246 -204 -308 -229 348 249 -184 -18 318 -1 -389 77 120 -33 -91 324
2935 324 92 -83 -241 -123 193 -220 -209 59 218 -125 -146 -123 396 178 -39 304 356 -65 82 -148 258
2956 258 -210 -23 93 206 -143 -116 -87 137 -95 -351 -59 296 -418 -346 65 15 -42 58 -166 326 -5 -382
2978 -382 102 -14 9 -119 145 299 -41 39 219 240 120 -75 305 -60 -67 -138 141 -42 141 -126 83 -1
3000 -1 -344 -207 270 152 -424 -31 102 -103 0 73 -32 170 55 196 134 395 -117 -50 329 -11 -44 3
3022 3 115 312 -121 54 170 94 -242 -197 148 213 -240 -29 235 -87 -265 -422 60 -81 21 39 257 31
3044 31 -136 138 567 150 79 -14 195 231 -104 30 164 -209 -142 165 221 -88 -95 -303 147 -106 -159 -31 129
3067 129 -115 -172 88 -72 -74 -201 183 169 -51 -89 105 329 148 78 15 13 81 -124 11 170 -41 -188 -21
3090 -21 5 -328 128 -80 5 2 -88 -85 46 -340 -132 -161 93 -191 -136 23 310 -45 -49 182 296 227 -148 266
3114 266 208 161 138 68 122 -149 -56 -11 88 163 -135 -67 206 -392 -108 91 199 -182 -72 104 106 -186 -100 295
3138 295 175 10 75 199 208 33 -22 -4 287 209 -166 153 -183 60 99 51 -80 -95 -33 315 -153 -336 -96
3161 -96 104 -62 -2 107 210 131 -133 -119 64 30 -245 110 111 -93 -96 217 231 -166 22 58 532 -6 -314 -178
3185 -178 34 111 -220 -160 79 -262 -565 2 -83 -40 -455 -167 21 -71 -137 -134 15 -106 -27 215 196 215 -159 128
3209 128 -35 92 -72 175 368 72 -202 388 339 -41 -312 -88 287 -17 -86 71 67 -49 -295 -41 235
3230 235 -194 69 -149 121 -55 -232 219 -109 -117 -134 126 122 -65 -229 222 13 -223 -148 249 76 15 -160
3252 -160 238 289 78 -97 41 144 -387 -91 141 -35 -193 -97 125 151 -107 -116 109 -34 -125 25 232 59
3274 59 77 -11 289 50 -43 164 31 -70 -181 17 63 -210 -104 -159 191 126 -72 97 60 -45 -150 103 422
3297 422 -220 -357 65 -156 148 -139 126 395 202 177 -4 -73 -154 0 130 6 -181 -183 -11 -232 -36 -219
3319 -219 -146 22 -229 -198 -175 185 -100 -45 303 316 168 -135 -142 189 -18 -397 68 323 131 -197 355 263 248
3342 248 58 244 255 -43 -247 464 163 11 29 144 144 -4 -38 20 80 -80 -90 99 225 -319 -224 89 294
3365 294 83 26 -36 234 10 -243 145 202 -180 -131 479 131 -120 56 -33 284 23 -79 -77 35 -207 -43
3387 -43 -16 -61 -154 -309 -104 49 -100 -188 285 -17 77 -149 -29 74 -28 9 203 -20 -198 98 -13 137
3409 137 -120 137 190 245 -96 26 261 94 -124 -26 150 121 -59 304 3 -31 -124 -8 150 172 83 -36 281
3432 281 -184 126 -176 287 12 -193 100 162 -178 176 128 211 145 -150 -36 275 128 134 72 -4 -368 -311 -5
3455 -5 226 -111 -118 -32 -109 -45 -27 120 29 83 -322 124 237 -270 -172 274 378 52 -269 71 34 -327 -139 -46
3479 -46 -61 68 93 11 -10 68 -79 136 -202 -151 -235 262 -7 -85 -21 37 2 -204 225 125 63 -12 -115 9 226
3504 226 -31 -112 2 300 -209 189 54 278 -25 -72 18 234 -244 -59 152 -189 -106 -184 100 26 -246 -16
3526 -16 75 34 -224 30 122 305 36 28 61 101 100 14 87 135 -58 149 139 12 140 -166 271 -1 -31 28 38 19
3552 19 -229 -324 51 160 182 -35 210 -34 -16 -11 118 165 -167 165 93 -70 -248 -85 388 -146 132 -268 52
3575 52 -161 47 67 382 7 -220 259 -25 -60 -123 108 91 -134 81 230 20 -148 204 -124 323 -97 -162
3597 -162 61 152 37 -111 33 208 -307 -53 -162 269 -120 -180 30 -111 163 -224 -16 89 -11 -218 -113
3618 -113 2 36 -79 312 162 -138 -8 24 30 -36 -251 173 69 -127 -349 109 208 -152 -55 119 426 94
3640 94 -65 -4 144 -242 -282 -49 38 102 -79 274 256 -137 -295 -43 34 -27 69 172 73 -258 -103 52 125 -89
3664 -89 -82 -77 57 57 -167 100 -57 -54 108 -51 -103 -298 -266 193 -127 -132 -11 -88 -26 -80 205 358 -154 -5 47 -2
3690 -2 140 -337 52 319 -53 59 177 72 186 -145 -148 -70 98 -277 -38 -145 73 -165 119 228 -2 -94
3712 -94 -19 124 -46 21 -127 182 -90 -309 -96 -77 -107 -205 86 81 -19 -81 -60 314 -179 -20 -81 -19 116 -183
3736 -183 28 -346 214 48 -33 -85 28 -25 33 144 24 -241 141 141 -21 20 -319 108 74 -9 -111 292 197
3759 197 -44 253 53 75 -146 77 204 -178 -156 -142 80 -114 -240 -26 -41 -296 -144 -20 159 77 -158 222
3781 222 190 -181 252 140 176 -337 130 279 170 78 -262 -60 21 23 174 -39 149 10 148 158 218 53 76
3804 76 8 16 -80 140 -54 59 -382 -97 -49 75 -45 -47 -29 555 -201 -110 158 107 13 -221 106 -5 -20 -60 -63
3829 -63 101 -66 175 -47 144 252 100 -114 95 -71 -49 -126 120 9 -14 -42 -132 41 -8 124 -33 -68 478
3852 478 -161 -39 104 69 -39 -279 -118 -135 40 -89 -132 -35 27 -270 -179 -131 57 65 -258 -245 -140 300 -237
3875 -237 62 84 -41 16 136 -70 36 -164 170 75 78 50 220 415 160 287 57 387 -24 29 76 -225 210
3898 210 33 45 116 -97 -377 95 -14 -145 -81 213 68 167 -180 80 160 48 41 -81 127 10 -143 -29
3920 -29 210 48 -28 384 34 -78 -42 -34 185 93 -337 -12 327 -104 106 61 33 -44 -233 50 46 -307 116 -32
3944 -32 -85 -297 -40 242 220 181 -80 64 130 -187 -29 48 13 -146 -92 148 -133 105 192 57 -142 18 56
3967 56 152 36 -256 -93 238 59 -24 107 -233 -210 -108 108 38 -350 25 103 420 -144 103 -107 -235 170
3989 170 92 -121 353 -143 -268 -302 327 37 -250 -81 -36 -63 92 143 -46 84 -86 -96 39 -17 -147 97
4011 97 -233 -4 -230 65 -16 -80 -217 298 -203 -92 27 218 -17 213 -60 1 136 -247 -40 156 -92
4032 -92 -179 7 -56 121 -34 13 -3 26 -150 -301 92 -136 -123 -222 -6 -119 -150 24 348 213 49 158 -58
4055 -58 8 -58 71 -98 15 58 -321 -208 -151 -76 65 335 -46 -5 114 -169 -401 -127 39 -12 66 9 1 -73
4079 -73 -211 77 48 301 77 -285 -237 111 10 -209 153 -30 390 -137 -28 124 -272 -156 63 68 -11 -103
4101 -103 41 10 -197 -164 -6 -199 -303 -118 169 65 76 -86 18 121 82 -214 166 -48 144 -160 71
4122 71 -15 14 -330 -41 117 -29 -189 -3 -46 -27 -117 124 8 128 -150 94 32 -113 -31 12 -33 -138 245
4145 245 -45 -68 -21 -137 193 65 109 -124 65 188 321 -29 71 -178 -93 -128 -60 -36 42 -34 138 96 72 358
4169 358 -93 -129 -171 67 51 -21 -75 223 138 99 205 -260 193 -147 -88 269 62 4 -22 -2 38 127 -96 -91 -20
4194 -20 -203 98 -201 -131 181 -9 -54 29 34 18 84 105 -71 -48 62 49 177 -18 18 101 -189 -150 76 23 -108
4219 -108 103 -20 -8 -16 -190 -262 46 91 8 -198 -198 57 276 85 28 -150 -62 -80 104 176 -295 -11 -103 144
4243 144 83 72 -83 -162 142 -34 -263 16 175 116 77 -32 -125 164 -258 7 -14 18 -24 -190 82 0 106
4266 106 23 -166 -39 155 129 -367 153 -145 -182 130 59 18 155 -181 59 -33 171 133 154 -29 71 63 112 -79
4290 -79 -449 190 160 -41 115 109 -164 -159 -125 211 154 51 -32 140 -109 118 116 -235 -87 -316 108 14 -77 -85 -59
4315 -59 -129 35 220 120 -177 -27 35 -42 -185 -14 -41 99 -211 -29 8 -91 -47 -41 15 -49 44 172 -83 39
4339 39 8 225 24 -172 -19 83 -82 -79 -139 93 -212 31 -107 -22 118 262 90 17 -94 -94 173 -32 -31 -350
4363 -350 19 193 87 36 -41 184 101 -228 -48 -12 -36 -150 48 -31 23 -108 22 174 115 -141 -22 245 38
4386 38 -45 -4 3 -179 198 -81 -93 -39 -96 9 137 110 -105 138 112 -193 22 -37 232 -114 131 237 157 -93
4410 -93 -32 123 184 -20 30 -104 99 101 39 303 -61 -87 36 -74 11 -146 -34 222 67 -163 -7 -77 189
4433 189 -31 37 -108 -27 -87 -7 203 26 170 -351 -96 -146 14 -146 75 129 -204 50 34 -300 105 -57
4455 -57 -56 173 -186 -116 -154 122 28 7 12 -26 15 -114 153 72 -108 180 -22 146 -119 -105 -14 -7 131 -4 -165
4480 -165 -100 -248 -5 152 14 -136 -33 130 91 24 -277 -109 -237 55 259 -60 -33 -63 197 -142 68 104
4502 104 132 148 86 -95 133 -91 59 211 16 114 220 -26 -114 141 -220 -161 -54 -189 31 -193 -42 101
4524 101 266 -192 -21 56 -275 -96 136 -89 -28 44 -147 6 170 40 152 90 25 -77 10 -48 89 -157
4546 -157 17 -22 -53 35 35 123 -144 30 -177 26 -158 -10 -59 203 -169 6 45 -31 -189 46 -7 54 155 13
4570 13 279 150 -75 -139 -48 -74 -100 106 223 1 203 -142 98 -186 56 -6 -145 -131 -199 20 -59 -184 -224
4593 -224 -42 -85 -39 172 -176 -125 21 116 25 -107 -110 147 -28 60 145 135 165 -59 -27 -175 -38 231 -35 -17
4617 -17 -159 417 -75 -159 89 -75 152 -323 -140 -132 -108 28 254 -49 -70 18 10 -272 10 49 -6 -8 -223 48
4641 48 11 142 154 -272 -5 -227 -8 -186 101 210 31 149 -112 -79 183 34 6 -94 -128 20 151 -13
4663 -13 -33 -251 -14 -218 3 21 65 -73 123 -158 253 -7 189 102 26 93 190 -18 -110 -116 -193 -131 -165 -27 43
4688 43 74 -25 -114 3 22 86 123 -118 92 -177 -43 -87 -113 149 212 240 -142 75 -181 -50 -76 -489 71 -17
4712 -17 42 31 -7 263 63 -181 106 -201 236 -139 64 2 -134 109 -92 -46 -212 140 -80 -243 -164 -298
4734 -298 -57 -216 -110 -34 -100 -253 44 -100 33 -20 -5 6 -66 230 -226 -265 96 -23 -23 46 -56 -11 -68 73
4758 73 -146 157 111 40 16 -166 -112 -20 157 -117 350 -104 4 -64 298 382 119 31 -91 18 -25 -351 159
4781 159 106 -18 -112 40 -32 -3 142 105 116 -121 -55 -15 -2 -11 -20 52 127 19 -64 212 46 -126 -61 8 -17 142
4807 142 -47 46 93 -156 153 -301 -34 -115 -124 76 -40 165 -164 -5 63 -147 -105 255 306 199 170 82 -5 -96
4831 -96 35 -155 -34 122 110 111 -46 73 -10 -95 3 193 28 24 104 -59 82 217 -41 -62 -227 149 -153 -187
4855 -187 46 25 74 14 182 189 28 56 111 -6 -22 101 112 -1 -98 -127 -207 50 -124 59 89 126 181 45 -106
4880 -106 -64 32 -103 37 72 73 85 -98 -94 184 184 182 -194 127 -355 -133 -120 -155 -140 -3 139 41 28 101 -19 -238
4906 -238 -276 31 153 -207 -218 235 45 -21 -19 74 -29 150 -150 310 -132 -8 -229 -187 252 -76 -41 -109 -57
4929 -57 124 -191 -127 -43 -180 -228 102 3 -72 -149 -104 -1 184 -34 -293 -42 59 54 47 7 -131 63 -56 168
4953 168 108 51 269 -121 -131 -32 -102 -22 85 -76 167 99 -59 -262 203 22 -162 -123 20 -295 -90 87 -13
4976 -13 55 104 232 -112 35 8 -56 -45 202 -170 155 -82 78 -19 -194 -272 9 -82 64 -28 2 -337 -170 -13
5000 -13 -129 -141 1 111 86 -98 98 32 139 -114 140 90 -162 7 -106 -28 -216 -30 27 -72 77 -147 6
5023 6 207 61 -108 86 -123 -100 -189 122 291 -178 52 -7 22 -189 -310 -6 -124 95 -55 -14 -144 18
5045 18 53 -78 -166 -58 -19 140 23 -117 -274 -140 112 -81 -274 -193 -208 177 116 -16 58 -32 27 178 142 71
5069 71 -40 -108 -151 -88 -33 47 -24 -2 -47 21 8 137 93 -23 -147 41 40 -80 -32 -139 79 -9 119 -57 158
5094 158 110 4 -96 -158 9 -49 54 111 -232 234 196 104 129 -160 -123 -68 197 79 -118 -32 -19 -341 -99 -52
5118 -52 -70 -88 -63 -326 -29 -86 79 97 5 155 -80 44 -54 -4 -99 15 -12 90 -70 -169 197 -38 143 108
5142 108 229 -263 -108 -95 -53 -141 166 139 -80 -85 -5 90 129 302 14 -373 15 22 -121 -91 -68 -213 80 -228
5166 -228 173 149 -4 -102 22 -271 92 -170 -106 -89 -90 33 -130 5 140 4 -71 140 -18 -8 -71 11 -240
5189 -240 -345 78 25 -196 -41 -238 -203 37 83 -292 -295 -2 78 -144 -136 -112 91 -269 -139 242 228 46 -142
5212 -142 24 -120 236 90 65 -4 107 200 25 45 48 89 41 -129 260 -86 -64 46 -201 81 -7 -12 77 -27
5236 -27 -48 370 60 86 130 31 -7 -251 292 -128 -120 114 163 168 -284 -101 6 144 35 -59 -118 98 187 -101 248
5261 248 -48 -93 -65 10 6 11 -41 -50 -77 10 -171 1 90 -127 123 -53 64 121 -171 -221 227 -189 -162 122 -36
5286 -36 -42 -39 -45 -37 256 -417 -52 71 -150 91 -94 -98 52 -160 36 -26 207 -85 -18 77 123 -180 25 -157 -108
5311 -108 -89 29 28 -66 -17 113 -9 -49 -82 192 -262 -80 -27 73 67 -168 -148 23 217 -104 245 57 -16 170
5335 170 -210 172 18 231 -138 -95 -315 49 -236 -53 139 106 -21 -71 48 -47 210 61 -42 90 44 22
5357 22 66 1 -109 -125 183 -78 -194 72 36 -183 -30 -137 -211 -102 -36 -104 28 60 35 110 96 4 -130 87
5381 87 77 -44 -85 53 15 -282 -94 26 24 96 -12 40 219 -311 30 -112 140 -326 -249 13 273 248 119
5404 119 164 -82 186 -70 326 121 -163 -2 208 -291 -134 193 -257 118 190 132 -210 -165 -38 210 74
5425 74 -59 -133 -72 48 50 -259 73 -251 14 32 62 -124 -42 -109 142 -168 -27 -22 285 21 -66 101 -27 -115
5449 -115 -123 -139 -39 -204 -44 -95 -116 -158 -85 -100 77 200 -45 -46 0 -50 -162 133 157 -76 3 -188 -173 94 1
5474 1 -69 91 -32 38 24 6 37 -13 86 -96 -36 37 187 57 180 -70 -6 -156 -155 -97 -69 278 78 186 85
5499 85 12 156 -188 -37 18 155 -31 107 -11 -138 -159 38 90 163 259 -7 126 142 -335 74 -30 -173 104
5522 104 71 -142 -260 -95 -123 -70 247 -26 -81 79 136 -8 45 243 78 -176 216 -17 41 157 -158 -178 43
5545 43 338 -34 177 -80 -134 -51 -106 125 -159 -57 -38 120 -141 126 -49 202 -267 41 135 -146 -9 -188
5567 -188 -37 -242 -39 13 68 13 121 -102 28 -14 -28 109 -112 28 19 88 -40 97 -59 -63 -42 -45 125 13
5591 13 -151 -217 5 -79 -6 -85 -93 27 156 -218 172 273 7 40 1 -154 397 95 363 270 -144 -21 131
5614 131 -81 -13 13 -9 42 144 12 -44 60 63 31 -97 121 175 282 -32 -9 151 -206 77 244 -74 126
5637 126 22 -40 65 -272 -17 2 44 -131 90 -122 144 -186 58 116 60 104 -34 72 159 -124 -218 68 -96
5660 -96 -169 -98 118 155 72 19 8 -146 -117 72 195 22 -155 -344 37 76 -125 20 97 84 -5 -102 -43 -147 62
5685 62 161 118 -99 66 115 -148 -59 113 -137 202 -112 14 -120 -72 35 -35 37 -32 15 -61 -47 118 -96 45
5709 45 -157 74 23 -38 138 138 4 4 74 -52 392 -139 119 -116 74 285 33 76 0 -11 237 132 -93 49
5733 49 131 46 -75 70 109 304 12 -149 -142 -126 -34 -78 86 -166 -83 -173 137 84 136 244 207 70 22 181 129
5758 129 363 370 114 156 4 26 52 -274 249 238 9 527 -37 93 -70 -102 -113 102 -241 -147 -33 265 7
5781 7 52 -51 59 203 -80 -193 28 32 137 215 122 137 4 17 -80 14 70 61 42 -41 250 165 -3 99 16 -283
5807 -283 48 118 90 80 238 28 206 -211 -37 -115 -70 -71 54 21 63 -77 -47 186 205 -86 -98 199 339 58
5831 58 -50 -117 254 77 241 -175 -239 -177 -83 113 215 -32 -93 115 170 -100 -68 42 80 83 167 -206 47 123
5855 123 32 -113 181 -99 45 0 -152 192 -20 -40 75 100 77 131 32 155 -279 91 47 110 9 -167 59
5878 59 -118 9 20 50 -8 120 35 172 -75 -12 141 21 64 30 53 -127 -219 -192 199 -54 -119 -293 -93 25
5902 25 268 59 -10 -51 243 134 9 -31 -58 85 107 146 -25 -109 154 -47 -3 -28 8 -147 139 136 -309 175
5926 175 -89 153 -239 34 92 58 75 -7 -76 159 -23 -124 80 116 -111 -139 10 87 188 268 36 -171 15
5949 15 3 1 88 -17 -94 108 -97 -177 -139 -170 47 127 -11 18 5 183 21 -41 244 -83 -196 -42 4 109 -109
5974 -109 76 273 -125 -81 53 206 -143 136 67 141 -191 -156 95 -2 82 166 -21 47 70 -40 18 5 -104 -195
5998 -195 135 1 41 -277 102 133 -9 -259 -233 10 100 -190 36 -28 210 -146 -18 22 -150 -80 -140 156 83
6021 83 -92 -67 -6 -64 -336 26 180 -107 179 -51 27 -72 -20 122 26 104 29 -42 208 -92 -129 -138 101 -68 157
6046 157 110 250 -55 -75 36 -59 -17 -23 -87 -168 79 -114 -132 -118 204 -32 -51 62 209 -147 154 30 73 85
6070 85 64 -41 -104 102 15 -10 -305 -171 -180 -40 47 153 -57 -23 -167 -116 17 55 29 55 66 -58 -55 -296 -22
6095 -22 94 4 -318 18 -47 -250 179 217 20 -34 67 -115 -43 -66 140 79 29 38 -366 130 232 63 -159 -53
6119 -53 -155 127 230 95 106 -243 170 -126 52 -66 133 114 172 -73 91 -86 -21 0 5 121 30 -134 258
6142 258 -29 288 -220 -158 90 -108 109 -31 106 -141 88 -13 82 193 16 -92 75 157 12 -27 -107 -41
6164 -41 136 98 146 14 35 -38 39 59 113 22 78 -39 25 21 -17 -62 59 -77 -138 -244 130 -66 30 -39 32 -238
6190 -238 125 56 25 98 -111 134 -195 -75 154 48 -16 20 -83 104 82 -196 38 -77 69 121 -3 -54 -192
6213 -192 104 51 16 -109 239 -164 -252 -20 -95 181 -28 -43 235 297 -2 -7 42 -117 149 -66 -11 65 56 -276
6237 -276 107 -110 -93 -14 -68 -38 -144 195 83 86 -46 -61 91 -110 -44 -192 -213 371 76 -170 158 50 146
6260 146 -34 60 280 -8 -180 -207 52 104 -321 164 -57 -217 -77 -42 322 -243 -30 117 143 -143 -75 112
6282 112 228 65 -197 -250 9 30 -9 115 12 -114 -50 185 -77 -261 -29 -102 3 48 -99 50 23 -10 358
6305 358 91 -80 -3 -13 62 -79 224 -162 -21 -120 4 311 -40 34 84 -170 -118 -50 53 -76 -219 -84 -16
6328 -16 -87 -57 -14 -285 -304 -125 117 42 9 -18 166 -90 119 -102 74 -58 -59 -117 -9 -125 89 202 170 85
6352 85 75 -133 150 -165 -9 -86 -183 -178 -42 -180 -252 -211 -193 35 -204 200 74 146 116 -146 17 -87 -195 108
6376 108 -122 -196 -26 71 253 148 -56 -17 74 55 -70 -60 -106 -167 154 3 -20 -65 -77 76 220 -218 -8 127
6400 127 111 -47 -297 -194 45 -61 -126 54 -191 114 131 -93 -17 32 -109 -167 135 63 -117 52 -36 -144 86
6423 86 98 -65 -34 64 177 10 65 423 34 -119 76 43 -87 153 78 -7 152 40 36 -81 224 102 -74
6446 -74 99 -58 94 64 -57 21 -55 -48 -60 -83 -136 55 32 33 64 137 1 78 54 -173 -154 195 -144 242 -14 20
6472 20 17 93 -15 -47 -108 91 -301 43 -154 66 -131 -85 -8 -206 -17 25 -58 20 -440 -66 -61 -34 -40 10 -162 -199
6498 -199 2 81 74 5 -197 -292 76 -123 -35 -288 -153 -35 202 -13 79 85 -63 -48 71 -144 -118 129 151 43
6522 43 158 -59 14 -51 228 -28 -80 -102 -83 157 -111 -148 -9 -122 -65 58 -57 -20 -268 89 -127 75 195
6545 195 -77 0 228 141 -1 72 4 56 -13 170 284 -146 -269 -2 250 -109 -51 167 -10 -194 -138 72 110
6568 110 115 71 -51 -40 -107 -131 -30 -135 -115 -31 -1 29 306 -51 -230 -39 246 72 73 45 33 139 -210 -85 -72
6593 -72 -97 85 2 -141 -326 21 135 78 167 181 28 143 -104 24 -97 80 129 -168 -162 239 -152 143 74
6616 74 -118 -9 220 168 220 58 -89 60 178 -267 240 41 343 -119 21 139 -204 -45 155 253 -69
6637 -69 -239 -5 67 186 52 47 89 128 -165 30 61 -55 -381 23 -52 37 109 157 -127 -331 97 36 -91 149
6661 149 -266 -36 29 117 71 -236 39 131 -2 -56 -38 -68 -92 -182 -91 -166 457 133 -48 -6 -89 143 65 -36 110
6686 110 187 -66 -218 -106 -55 271 -116 7 15 9 -58 238 -59 -126 6 -4 -88 -321 15 -18 117 -88 -97 -192 -73
6711 -73 -96 -148 -34 185 -99 -92 85 35 -81 97 -103 -102 -102 41 42 -7 -48 -9 -47 -18 51 134 -238 -86 -134 366 32
6738 32 131 45 -59 -33 58 190 22 -6 137 169 -24 30 54 6 29 309 -135 44 57 185 -88 -112 -114 -202 3
6763 3 -48 -152 -74 -3 -124 -20 85 49 -203 89 67 62 83 90 35 -90 54 -28 419 168 14 -115 90 6 107
6788 107 -38 58 445 26 -205 147 255 -308 -72 -257 131 -48 -34 130 -29 168 140 82 -138 -190 -126 10
6810 10 -168 -41 17 -167 -27 34 -179 -108 128 -172 -54 28 -34 12 -9 5 -41 63 108 195 67 -89 204 144
6834 144 85 86 -36 -85 -163 -170 -125 -98 -61 -26 83 71 19 -127 -16 -76 -48 -42 6 -86 -22 177 272 49 -215 -66 71
6861 71 -11 -84 167 -43 -117 19 -145 150 91 167 -100 -191 91 30 -21 -271 -100 116 -201 30 111 -212 34
6884 34 -66 -66 43 -39 81 -121 -94 3 -146 365 -205 102 110 75 33 1 -55 63 19 127 -142 -88 -30 -85 -75 -128
6910 -128 -130 199 176 47 110 75 90 2 -146 -371 2 -197 -227 145 -106 241 -139 24 34 -14 27 64 -23 33 45
6935 45 8 150 -77 -7 107 109 -60 -37 140 33 1 -77 -124 235 -186 -75 302 -7 -162 -27 -19 121 -185 -264
6959 -264 -19 38 234 57 -199 -155 19 -14 46 413 242 -270 41 211 61 -22 45 234 -5 -252 160 -134
6981 -134 -107 -151 -75 -133 -122 -281 106 60 -130 -60 -84 174 -168 21 83 117 -85 58 52 232 -53 -12 30 40 134
7006 134 34 133 -84 148 133 -133 22 -104 -386 154 142 24 166 38 116 -100 11 175 1 76 148 159
7028 159 -113 223 -26 126 14 15 -192 76 -104 -114 137 -28 -46 23 13 -73 -32 40 46 104 4 -117 72 30
7052 30 -19 20 -338 104 -3 -220 48 28 16 227 -189 -173 -31 -120 -15 -88 62 -143 -207 -266 -108 -96 25 232
7076 232 201 -11 84 210 10 -217 294 55 103 198 89 -76 -119 38 -38 181 263 114 -167 -64 -163 -158 103
7099 103 83 27 -42 35 -186 -150 39 -68 86 -162 -179 -67 -69 -117 -201 -61 30 -2 64 133 212 -73 -224 -200 -95
7124 -95 -99 -94 -260 250 220 -77 -57 -21 -58 -71 -12 133 155 -145 42 179 -257 111 112 -255 -119 -88 96 -44 -122
7149 -122 96 106 -209 -74 138 87 -63 80 -124 -67 21 198 104 233 -180 40 128 -35 -43 -71 116 143 -33
7172 -33 -41 97 -35 196 144 75 -103 -49 -235 -37 70 -184 -125 -74 4 -110 155 40 125 157 -301 -214 -53 -119
7196 -119 -89 181 -182 -113 -136 138 43 -20 33 86 72 -275 26 77 18 -247 43 15 -96 -24 -42 -207 178 184 26
7221 26 -41 170 -126 -108 192 182 80 51 -21 99 37 164 173 75 -33 -7 103 -218 -246 123 73 148 5 -306 -8
7246 -8 -41 -200 -142 -207 135 -117 30 -364 160 -154 -122 -42 -30 60 -112 253 284 163 45 -91 -45 98 -149 172
7270 172 156 -266 -119 -211 -137 -173 -172 95 -155 -196 78 -174 342 -69 -71 44 -60 29 28 -123 -43 43 -72 73 39
7295 39 -53 -58 168 114 -28 -59 -44 36 -89 0 -61 -243 151 -69 -12 -45 -55 36 64 164 61 -22 169 -10 -54 -136
7321 -136 -219 34 158 -163 -14 70 -216 -99 104 9 -254 -165 46 124 71 108 -145 68 -30 -65 174 -13 -30
7344 -30 -61 63 -60 177 50 11 241 -273 -303 -6 -222 -165 303 -7 4 170 -56 203 -385 -109 82 -125
7366 -125 17 -211 -88 106 -160 73 30 58 -34 -129 138 -70 -83 260 -249 121 259 -177 -22 -276 -17 10
7388 10 -42 -17 96 99 183 73 181 -161 217 127 -222 -152 72 -59 -152 -318 -88 54 47 -72 9 113 40 287
7412 287 -32 -187 70 117 61 15 77 -146 -113 -9 -73 -70 13 15 226 123 -85 29 42 74 1 20 298 77 166
7437 166 -72 -155 -10 110 53 14 -82 -187 123 -55 -67 -360 68 -193 204 175 -107 0 32 54 19 10 376 213
7461 213 -270 113 170 -45 67 -92 -21 16 -73 -81 4 -149 64 -47 28 67 -182 -67 0 158 -14 98 -207
7484 -207 -147 -104 -45 -40 84 79 104 72 121 19 18 90 102 -44 -169 126 -4 -61 -39 173 137 -131 -170 -12 120 48
7510 48 18 -16 106 266 -76 -9 50 71 50 -104 75 86 -38 -76 -16 -10 -1 47 -35 -19 93 -120 16 222 -64 31
7536 31 -384 -108 -87 -270 -35 -144 149 305 -85 -237 -66 17 124 -202 132 43 168 32 -27 187 72 -34
7558 -34 99 -198 -119 45 -172 54 48 -63 170 37 16 6 44 -121 33 31 -127 77 47 309 83 328 -67
7581 -67 108 -11 86 -289 -62 89 86 64 -19 -321 10 -46 43 -24 8 -9 -187 280 50 -159 -52 49 82 221
7605 221 -17 -102 -243 207 168 -153 319 94 41 -229 107 -6 123 -31 -138 -339 -74 76 -7 128 272
7626 272 67 216 -84 33 -171 -87 96 -42 227 210 342 99 55 165 -74 -57 -112 -47 -23 -238 110 -42
7648 -42 256 49 120 203 -156 -14 -189 277 -95 -55 -203 -97 -28 -87 425 161 -83 -109 -118 111 -173 114 -32
7671 -32 124 44 -276 86 18 -210 145 -23 101 119 -206 -90 245 112 78 -170 -122 -292 -31 -45 81 -178
7693 -178 86 41 -41 -93 239 344 225 121 52 -69 28 -81 -63 64 -111 146 99 -48 -78 26 -4 2 104 95
7717 95 -41 18 -55 -34 -76 -40 162 -254 29 158 -232 25 34 179 347 205 -129 127 -52 -76 159 248 198 -20
7741 -20 91 91 -10 225 -229 175 -131 18 139 259 6 150 282 31 138 -45 -81 162 75 -287 -8 -69
7763 -69 72 -228 155 26 -234 175 44 -158 -174 -27 186 301 -81 -18 -88 -169 -118 -274 22 110 -98 -126 108
7786 108 -76 -73 74 18 155 48 -124 122 167 344 -85 54 -80 -106 -121 2 40 86 -185 40 -61 67 -98
7809 -98 -11 275 23 32 -20 -185 -236 1 -55 27 -141 -13 280 -202 -173 -150 -22 231 -10 -215 -49 195 -24
7832 -24 -198 259 -72 227 56 68 -127 33 192 -88 194 301 134 295 48 -193 33 117 -55 -211 -27
7853 -27 -45 -74 -274 138 -29 -86 -66 -119 155 84 -133 -192 7 255 -42 176 100 -264 199 -95 -108 42 54 136
7877 136 21 59 -53 -302 231 -114 79 65 -81 63 -67 19 -115 128 75 169 -60 -137 122 -40 227 -128
7899 -128 -104 29 -128 175 115 -71 140 60 -55 -49 -73 -115 -82 47 242 85 -36 90 234 -83 158 86 -91
7922 -91 -25 -235 46 273 175 -29 111 173 148 16 -120 -100 109 -86 1 -7 -225 -114 -91 148 -87 -160 -57 81
7946 81 46 -7 -45 413 156 18 248 -108 -137 -63 37 45 -230 -72 -160 73 -32 -32 -156 -181 2 -55 30 164 154
7971 154 36 -182 89 81 -14 -62 -13 57 -147 55 -52 42 -121 3 83 -187 -87 58 54 106 -104 33 33 217
7995 217 415 -44 151 149 23 106 -141 -128 22 34 -34 -181 -99 72 190 103 -4 94 159 -99 224 -35 135
8018 135 3 5 36 23 -178 279 81 -45 -84 25 27 -94 147 -191 -77 -16 -57 61 -374 -15 86 -16 74
8041 74 -104 6 9 2 -80 -250 -100 -85 -27 231 -193 89 -153 -20 85 -138 -59 -198 181 115 57 61 13 -105 -313
8066 -313 7 -231 71 -37 -9 46 290 -48 -32 191 290 -46 -36 -31 -30 -21 48 -127 78 -63 43 55 118 -212 -33
8091 -33 85 174 -35 2 199 84 -206 -220 147 14 -225 102 197 251 211 -196 52 -109 -226 -69 56 23 -71
8114 -71 -114 152 189 -152 21 190 39 32 -125 70 -81 -223 191 170 -47 14 105 79 -105 -303 -23 143 62
8137 62 -117 -238 77 58 -135 -97 334 -28 13 54 162 53 -26 -130 -69 -40 32 118 223 -47 -254 253 -80
8160 -80 91 -66 -209 204 26 -77 -46 -223 323 -89 123 12 -57 -167 -101 88 -3 -228 33 -96 -226 68
8182 68 -1 44 -257 226 -183 23 -101 -29 -12
8191a2
##END NTUPLES=NMR FID
##END=
