##TITLE=1H_Pr Q-8
 200.13MHz, CDCl3,
 8 sc
 
 8.10.2025
##JCAMPDX= 6.0         $$ Bruker NMR JCAMP-DX V2.0
##DATA TYPE= NMR FID
##DATA CLASS= NTUPLES
##ORIGIN= UXNMR, Bruker Analytische Messtechnik GmbH
##OWNER= pz
$$ XWIN-NMR		Version 3.5
$$ Wed Oct  8 15:46:12 2025 Russian Standard Time (UT+4h)  she@DPX200
##.OBSERVE FREQUENCY= 200.1313
##.OBSERVE NUCLEUS= ^1H
##.DELAY= (6, 6)
##.ACQUISITION MODE= SIMULTANEOUS
##.ACQUISITION SCHEME= undefined
##.AVERAGES= 8
##.DIGITISER RES= 18
##SPECTROMETER/DATA SYSTEM= spect
##.PULSE SEQUENCE= zg30
##.SOLVENT NAME= CDCl3
##.SHIFT REFERENCE= (INTERNAL, CDCl3, 0, 14.3821)
##AUDIT TRAIL= $$ (NUMBER, WHEN, WHO, WHERE, WHAT)
$$ ##TITLE= Audit trail, XWIN-NMR		Version 3.5
$$ ##JCAMPDX= 5.01
$$ ##ORIGIN= Bruker BioSpin GmbH
$$ ##OWNER= she
$$ F:/spectra/data/she/nmr/H-C/1/audita.txt
$$ ##AUDIT TRAIL=  $$ (NUMBER, WHEN, WHO, WHERE, WHAT)
(   1,<2025-10-08 15:44:54.70 +0400>,<she>,<DPX200>,
      <created by zg, POWCHK disabled, PULCHK disabled
       configuration hash MD5:
       00 E9 B6 7A A2 85 ED C7 34 08 36 98 17 FE 4E 26
       data hash MD5: 16K
       7C ED E0 A0 0B 1F 59 C7 20 89 86 39 A4 16 1E 99>)
$$ ##END=
$$ 
$$ hash MD5
$$ 4F B7 6E 73 F1 F6 89 B7 AC 0F 11 FD 2F 71 3A 95
##$RELAX= 
##$RELAX= 
##$RELAX= 
##$RELAX= 
##$RELAX= 
##$RELAX= 
$$ Bruker specific parameters
$$ --------------------------
##$DU= <F:/spectra>
##$EXPNO= 1
##$NAME= <H-C>
##$PROCNO= 1
##$TYPE= <nmr>
##$USER= <she>
##$AMP= (0..31)
100 100 100 100 100 100 100 100 100 100 100 100 100 100 100 100 100 100 
100 100 100 100 100 100 100 100 100 100 100 100 100 100 
##$AQSEQ= 0
##$AQ_mod= 1
##$AUNM= <au_zg>
##$AUTOPOS= <>
##$BF1= 200.13
##$BF2= 200.13
##$BF3= 200.13
##$BF4= 200.13
##$BF5= 200.13
##$BF6= 200.13
##$BF7= 200.13
##$BF8= 200.13
##$BYTORDA= 1
##$CFDGTYP= 0
##$CFRGTYP= 5
##$CHEMSTR= <none>
##$CNST= (0..31)
1 1 145 1 1 1 1 1 1 1 1 1 1 1 1 1 1 1 1 1 1 1 1 1 1 1 1 1 1 1 1 1 
##$CPDPRG= <>
##$CPDPRG1= <>
##$CPDPRG2= <>
##$CPDPRG3= <>
##$CPDPRG4= <mlev>
##$CPDPRG5= <mlev>
##$CPDPRG6= <mlev>
##$CPDPRG7= <mlev>
##$CPDPRG8= <mlev>
##$CPDPRGB= <>
##$CPDPRGT= <>
##$D= (0..31)
0 0.7 0 0 0 0 0 0 0 0 0 0.03 0 0 0 0 0 0 0 0 0 0 0 0 0 0 0 0 0 0 0 0 
##$DATE= 1759923894
##$DBL= (0..7)
120 120 120 120 120 120 120 120 
##$DBP= (0..7)
150 150 150 150 150 150 150 150 
##$DBP07= 0
##$DBPNAM0= <>
##$DBPNAM1= <>
##$DBPNAM2= <>
##$DBPNAM3= <>
##$DBPNAM4= <>
##$DBPNAM5= <>
##$DBPNAM6= <>
##$DBPNAM7= <>
##$DBPOAL= (0..7)
0.5 0.5 0.5 0.5 0.5 0.5 0.5 0.5 
##$DBPOFFS= (0..7)
0 0 0 0 0 0 0 0 
##$DE= 6
##$DECBNUC= <off>
##$DECIM= 32
##$DECNUC= <off>
##$DECSTAT= 4
##$DIGMOD= 1
##$DIGTYP= 9
##$DL= (0..7)
0 120 120 120 120 120 120 120 
##$DP= (0..7)
150 150 150 150 150 150 150 150 
##$DP07= 0
##$DPNAME0= <>
##$DPNAME1= <>
##$DPNAME2= <>
##$DPNAME3= <>
##$DPNAME4= <>
##$DPNAME5= <>
##$DPNAME6= <>
##$DPNAME7= <>
##$DPOAL= (0..7)
0.5 0.5 0.5 0.5 0.5 0.5 0.5 0.5 
##$DPOFFS= (0..7)
0 0 0 0 0 0 0 0 
##$DQDMODE= 0
##$DR= 18
##$DS= 0
##$DSLIST= <SSSSSSSSSSSSSSS>
$$ [...]
##$SUBNAM0= <"">
##$SUBNAM1= <"">
##$SUBNAM2= <"">
##$SUBNAM3= <"">
##$SUBNAM4= <"">
##$SUBNAM5= <"">
##$SUBNAM6= <"">
##$SUBNAM7= <"">
##$SUBNAM8= <"">
##$SUBNAM9= <"">
##$SW= 18.0517328524113
##$SWIBOX= (0..15)
0 0 2 0 0 0 0 0 0 0 0 0 0 0 0 0 
##$SW_h= 3612.71676300578
##$TD= 16384
##$TD0= 1
##$TE= 0
##$TE2= 300
##$TE3= 300
##$TEG= 300
##$TL= (0..7)
0 120 120 120 120 120 120 120 
##$TP= (0..7)
150 150 150 150 150 150 150 150 
##$TP07= 0
##$TPNAME0= <>
##$TPNAME1= <>
##$TPNAME2= <>
##$TPNAME3= <>
##$TPNAME4= <>
##$TPNAME5= <>
##$TPNAME6= <>
##$TPNAME7= <>
##$TPOAL= (0..7)
0.5 0.5 0.5 0.5 0.5 0.5 0.5 0.5 
##$TPOFFS= (0..7)
0 0 0 0 0 0 0 0 
##$TUNHIN= 0
##$TUNHOUT= 0
##$TUNXOUT= 0
##$USERA1= <user>
##$USERA2= <user>
##$USERA3= <user>
##$USERA4= <user>
##$USERA5= <user>
##$V9= 5
##$VALIST= <valist>
##$VCLIST= <CCCCCCCCCCCCCCC>
##$VD= 0
##$VDLIST= <DDDDDDDDDDDDDDD>
##$VPLIST= <PPPPPPPPPPPPPPP>
##$VTLIST= <TTTTTTTTTTTTTTT>
##$WBST= 1024
##$WBSW= 4
##$XGAIN= (0..3)
0 0 0 0 
##$XL= 0
##$YL= 0
##$YMAX_a= 584518
##$YMIN_a= -664100
##$ZGOPTNS= <>
##$ZL1= 120
##$ZL2= 120
##$ZL3= 120
##$ZL4= 120
##$ABSF1= 10
##$ABSF2= 0
##$ABSG= 5
##$ABSL= 3
##$ALPHA= 0
##$AQORDER= 0
##$ASSFAC= 0
##$ASSFACI= 0
##$ASSFACX= 0
##$ASSWID= 0
##$AUNMP= <proc_1d>
##$AZFE= 0.1
##$AZFW= 0.1
##$BCFW= 1
##$BC_mod= 2
##$BYTORDP= 1
##$COROFFS= 0
##$CY= -3
##$DATMOD= 1
##$DC= 2
##$DFILT= <>
##$DTYPP= 0
##$F1P= 0
##$F2P= 0
##$FCOR= 0.5
##$FTSIZE= 0
##$FT_mod= 4
##$GAMMA= 1
##$GB= 0.15
##$INTBC= 1
##$INTSCL= 1
##$ISEN= 128
##$LB= 0.25
##$LEV0= 0
##$LPBIN= 0
##$MAXI= 10000
##$MC2= 0
##$MEAN= 0
##$ME_mod= 0
##$MI= 1.114404
##$NCOEF= 0
##$NC_proc= 0
##$NLEV= 6
##$NOISF1= 3.799351
##$NOISF2= 2.8
##$NSP= 1
##$NTH_PI= 0
##$NZP= 0
##$OFFSET= 14.38212
##$PC= 1
##$PHC0= -2281.488
##$PHC1= 14.59224
##$PH_mod= 1
##$PKNL= yes
##$PPARMOD= 0
##$PSCAL= 0
##$PSIGN= 0
##$REVERSE= no
##$SF= 200.129724274929
##$SI= 16384
##$SIGF1= 3
##$SIGF2= 2
##$SINO= 400
##$SIOLD= 16384
##$SREGLST= <1H.CDCl3>
##$SSB= 0
##$STSI= 0
##$STSR= 0
##$SW_p= 3205.1282051282
##$SYMM= 0
##$S_DEV= 0
##$TDeff= 0
##$TDoff= 0
##$TI= <>
##$TILT= no
##$TM1= 0
##$TM2= 0
##$TOPLEV= 0
##$USERP1= <user>
##$USERP2= <user>
##$USERP3= <user>
##$USERP4= <user>
##$USERP5= <user>
##$WDW= 1
##$XDIM= 8192
##$YMAX_p= 0
##$YMIN_p= 0
$$ End of Bruker specific parameters
$$ ---------------------------------
##NTUPLES= NMR FID
##VAR_NAME=  TIME,          FID/REAL,        FID/IMAG
##SYMBOL=    X,             R,               I
##VAR_TYPE=  INDEPENDENT,   DEPENDENT,       DEPENDENT
##VAR_FORM=  AFFN,          ASDF,            ASDF
##VAR_DIM=   8192,          8192,            8192
##UNITS=     SECONDS,       ARBITRARY UNITS, ARBITRARY UNITS
##FACTOR=    0.0002768,     1,               1
##FIRST=     0,             0,               0
##LAST=      2.2672688,     0,               0
##MIN=       0,             -664100,         0
##MAX=       2.2672688,     584518,          0
$$ Real data points
##PAGE= N=1
##DATA TABLE= (X++(R..R)), XYDATA
$$ [...]
1878b8R7j77Q1M29o17J9N06k55n26N51N53o34n46Q12K1m74n81J068P0q55J63K45
1900g8k46J77k19L47J29K7m40K39M12k6n41j03R04j96p32K61QK50o7n05O47o4
1922A84m77k0N00p1k63j05L42J91k91J63K4j38j2l39L44O8O5j26j10J83j3k0n00
1945d21O08R0p78N85J38j98l38L11M91n97O5K58j24p3k77N31j82l2L9m30K71j69
1967b32J42l47K07M89k62k78L92K70k48m23L87K16n56K51L03l41k62K14O5m87
1987e00M62n9R4j46L98k24j44R8o7j53R5M23j48l03N74k77l33j04N84m7l18j81
2009b76N79k09j97J5L68l1m14k15M96m4j54R6K71k58J03l81M07q7j96j03O07k70
2031A07m35K80l04L62J51j64q2L37k90j45L8L32l08J59J39K88p67m3O24k1k69
$$ plain form
1878 -28 69 -108 -27 402 -215 -196 310 55 -471 80 633 -1 -547 265 286 -188 -769 299 369 -486 -323 -78
1900 -78 -324 -147 -366 -19 110 137 -303 -64 348 322 -219 -322 582 386 -346 -85 -77 173 106 -399 248 184
1922 184 -293 -313 187 116 -147 -252 90 281 -10 153 177 39 27 -312 32 100 165 39 -71 112 99 79 -421
1945 -421 187 277 -501 84 222 24 -314 -3 488 -109 -44 214 90 17 -260 271 89 57 96 -334 -63 -232
1967 -232 -90 -437 -230 259 -3 -281 111 381 133 -290 97 313 -243 8 311 -30 -292 -78 -13 -500
1987 -500 -38 -97 -3 -149 249 25 -119 -21 -88 -241 -146 277 129 -174 400 123 -210 -314 270 223 -95 -276
2009 -276 303 94 -103 -88 280 249 -165 -380 116 72 -82 14 285 27 130 -251 156 69 -127 -230 377 107
2031 107 -328 -48 -352 10 161 -3 -85 252 -38 -183 -145 187 -121 38 177 465 -302 -345 279 258 -11
2052a1J23J00k85K8J17k66LM59k00o18M73L78l22k45M72L77q79j75P35j18m95
2073c49L41K05m02K98q8j26P5O3L68o97J54N27n07k29M81K07n35L13L60j33m11
2094h5J31K27l11q4K09J4l15L79j84%q0J59q5L1Mj79J30k9L96m98P2N16m81k1
2118h4M8K06o8K7l78M04j22q9q1J94k33K46j00j44M67m97K20K64j51r3J8j02j25
2141a73l0K35j9m9J43k82j26L84M9k10k18N14j06k67J80P8j83k07O26j43l62Q1
2163h5M28l61o7L10O3m76q6P5K74n63P97l02m92O97k36J50j46L57k28j76K3L20
2185B76n57n4Q24l83l78j11N36j12j90J22P2J92m26J95j61J30J58j70n5K85nl11
2207a23j21K96R6k41L0j11R0P6l9pJ80l48p4Q5L92k93K30j2q7J46k72jM19l99
$$ plain form
2052 -11 112 212 -73 -45 72 -194 -191 268 68 -550 -77 301 -21 -266 206 583 -296 -471 264 146 -349
2073 -349 -8 197 -205 93 5 -121 -46 17 385 -312 -158 369 -138 -367 114 321 -214 99 459 326 -85
2094 -85 46 273 -38 -122 87 101 -214 165 -19 -19 -99 60 -25 6 10 -169 -39 -68 328 -170 -98 418 -63 -84
2118 -84 -36 170 102 129 -249 155 33 -56 -137 57 -176 70 -30 -174 293 -204 16 280 129 36 54 -48 -173
2141 -173 -203 32 13 -36 107 -175 -301 83 132 -78 -296 218 112 -155 25 103 -80 -287 339 196 -166 -85
2163 -85 343 -18 -85 225 288 -188 -274 -199 75 -488 309 7 -485 212 -24 126 -20 337 109 -67 -44 276
2185 276 -281 -335 489 106 -272 -383 153 41 -149 -27 45 237 -189 6 -155 -25 133 -37 -92 193 188 -123
2207 -123 -244 52 148 -93 -63 -174 -84 -8 -47 -54 126 -222 -296 -211 181 -112 118 106 19 165 -107 -108 311 -88
2231h8j42R6K3JK54l92K97K04j20qj40J86l99K0L03K6l09L26L4j37j03R1J71l96
2255b02p9N13k45j08Q6k9j9r1J86k02q0K80nj11J01K08n41L29J58q6l4J1J80l02
2279h2j98M81k27j95L50M7l75n4J47L78m36L48l1j61p1K08k20l1K50j16j18m6
2301a52M40l15J5J73k8k66j18J40Q3j79K2L65j05k11J53L2j71K00j24J36j00N0
2323D0K6l90J26J31pJ2J56J76k53l82K44N45m07j16L26j85k06P4K19k51N28l38
2345F8k12J52j37kk3K0M00k69j59O1K41K2p8R7j2j07m65Q07p0n04R5J78r6k1j74
2370a88K4J37j00K84N7mj66k18N6M42j51n3j70N3J21l13J4L87j25k06K45Kl71
2393b43l0L18K18n27N2K78n13O6M08J25k29LK67k06j66J59K72k87L3L22l06k43
$$ plain form
2231 -88 -230 -134 -111 -110 144 -248 49 253 133 125 -15 171 -228 -208 95 121 -188 138 172 35 -68 23 194 -202
2255 -202 -281 232 -13 -121 -35 -64 -83 -174 12 -190 -270 10 5 -106 -5 203 -338 -9 149 63 29 40 220 -82
2279 -82 -280 201 -26 -221 129 176 -199 -253 -106 272 -164 184 153 -8 -79 129 -91 -122 128 12 -106 -152
2301 -152 288 -27 -12 161 133 -133 -251 -111 -28 -207 -185 180 75 -136 17 49 -122 78 -46 90 -10 40
2323 40 66 -324 -198 -67 -74 -62 94 270 17 -365 -121 424 17 -99 227 42 -164 -90 129 -122 406 68
2345 68 -144 8 -129 -131 -154 -134 266 -3 -162 -101 140 162 84 181 169 62 -403 404 334 -170 -75 103 7 -14 -188
2370 -188 -164 -27 -127 157 214 210 44 -174 -118 324 173 120 -50 3 124 -189 -175 212 87 -119 126 128 -243
2393 -243 -273 45 263 -264 -212 66 -447 -381 27 152 -77 -74 193 -13 -179 -20 252 -35 -2 320 14 -229
2415b29K60k44p3L15k27J13j1L3O1J34l10K82O3j42j54J94Q4P9k90M1N1r5l13
2438c78M76j51l6k5J82l15K01J41o1m77O00k66j00K35L49m51MJ54o0k27L2rj26
2461c08J77J47J6j05J8N9R1M8j37j63m8K42L70j30o27M40J26k36j66L48N2m37
2483b23J40J05J56l40K07L45l35j68K48j29pL3L93n98M7M62k20r6K76l21m38L80
2505h3L50n36J25J26J48j81K73R3n13L28j36j05j00K97q7P5j5n0J65n8j65J50
2527A01m18J24L37O9k8l94j30N21k97k22N11J4k45N5q8L93J6k69J72J06n22L73
2549A79J42k99K39l37J54o7Q7k39RK37k64K67k93M52J32m96K30j16j12J21J45
2570A71m6L9k87J27j3j70J6N53l05j42j09L23l41Q8L96l85N5K35m45P4M92j68
$$ plain form
2415 -229 31 -213 -286 29 -198 -85 -96 -63 -2 132 -178 104 167 25 -129 65 149 228 -62 -21 30 -65 -378
2438 -378 98 -53 -89 -114 68 -247 -46 95 34 -443 157 -109 -209 26 375 -76 -72 82 22 -205 -173 -182 -308
2461 -308 -131 16 32 -73 -55 4 95 143 6 -157 -205 37 407 277 -350 90 216 -20 -186 162 214 -223
2483 -223 -83 22 178 -162 45 390 55 -113 135 6 -1 32 425 -173 -126 336 116 20 296 -25 -463 -83
2505 -83 267 -269 -144 -18 130 -51 222 315 -198 130 -6 -111 -211 86 -1 74 59 9 174 116 -49 101
2527 101 -317 -193 144 213 185 -209 -339 182 -115 -337 174 188 -57 -2 -90 303 319 50 222 328 -194 179
2549 179 321 22 261 -76 78 11 98 -141 -132 105 -159 108 -185 267 399 -97 133 17 -95 26 171
2570 171 125 164 -123 4 -9 -179 -163 390 85 -57 -166 157 -184 -96 300 -85 -30 205 -240 -166 326 158
2592A58k09R4K13k13k41k9M50n24m4M42j93k3J06J32k8l08L03k81J99J05j83O5
2614iK5kl7q2K54J16q05L96K80k94J5Q0M65n38p1J08L50k49R0j73R3J90l62o1
2638b21p5L01Kj22J92k2j63J69k88M04l1l20j8L88q0l12K61j08r7j3q5K35km82
2662d87P19j09j19m0n5J26j20J90j80L30l04M06k46l01K81j44k62K97J51k19M4
2683d2j45L49m85J13K33K99m47r1J53R5j07R8M5j60J50n4j28lL05J7k71R6J30
2706A50o00L70K04j44o4K49j38O8j18L55j30m01L79o0N0l64J79J41k73m4J50J63
2728A22k47J70j20j89J72k9P1j52j26M2K25o3K59q2O0K1L84l89l03P2O6J37j62
2751f1j58L70Qk11L13q2j39P6k7k20K43k92K00J39j33N97p26P0K18j61q4R6K01
$$ plain form
2592 158 -51 43 256 43 -198 -227 223 -301 -345 97 -96 -119 -13 119 91 -217 86 -195 4 109 -74 -9
2614 -9 16 14 -23 -105 149 265 -540 -144 136 -158 -143 -63 402 -136 -207 -99 251 2 92 -81 12 202 -160 -221
2638 -221 -296 5 7 -115 77 55 -108 61 -227 177 146 -174 -192 196 116 -196 65 -43 -140 -153 -238 -3 -5 -487
2662 -487 232 123 4 -36 -91 35 -85 105 -75 255 -49 357 111 -190 91 -53 -315 -18 133 -86 -42
2683 -42 -187 162 -323 -210 23 322 -125 -216 -63 32 -75 23 68 -92 58 4 -124 -127 178 195 -76 20 150
2706 150 -450 -80 124 -20 -84 165 27 95 -23 332 202 -199 180 120 170 -194 -15 126 -147 -191 -41 122
2728 122 -125 45 -75 -264 -92 -121 -50 -202 -328 -286 -61 -124 135 53 113 134 518 129 -174 -102 -36 101 -61
2751 -61 -219 151 159 -52 261 179 40 116 89 -131 112 -180 20 159 26 623 -103 -33 185 24 -60 36 237
2774B37l84j1J09J98j94M3j9LK4J7J44K5k45K94l7l65R4K27k01J53L03q05L05
2797h5M33k87l36J54N6%l17K62K55J70m44J76j08J33l59L09K66k76K1K08l03J52
2819H0o0j42J08J31l05k3K91J30j74k73K07J68r4j74l6L31j83P6J14m10K24MK10
2842B00k18k4J95j93J30k78O1o3K20J67Qk1j54j14J96p6J48k37o6Q7O6L3k86J14
2866a05K24k69R5M20j77k58r1K96o2k06K01J72m44J48K73k94j48L66m81M06Q4
2887A50J65m97r4L10K19k92J44p4J54j81j63K59j2P9m4j87J02l0n6j95J83K0p0
2910a10K60l38M17n82K44M24j63l22M50J12m55k6K14jr3k37K61J59l31j04K08
2931a3m1K58k77O1N8o6J31l19P7M12m57RJ91J90l30J21J23r5L6j54n0L23k35j72
$$ plain form
2774 237 -147 -158 -49 149 -45 -2 -21 -18 6 23 167 192 -53 241 204 -161 -67 160 -41 112 415 -390 -85
2797 -85 348 61 -275 -121 -65 -65 -382 -120 135 305 -139 37 -71 62 -297 12 278 2 23 231 -72 80
2819 80 20 -122 -14 117 -188 -211 80 210 36 -237 -30 138 44 -130 -166 165 -18 58 172 -238 -14 -10 200
2842 200 -18 -42 153 -40 90 -188 -127 -190 30 197 205 184 30 -84 112 36 184 -53 -119 -32 34 67 -219 -105
2866 -105 119 -150 -55 365 188 -70 -161 135 73 -133 68 240 -204 -56 217 -77 -225 141 -340 66 150
2887 150 315 -182 -276 34 253 -39 105 31 185 4 -159 100 88 167 123 -64 38 8 -48 -243 -60 -40 -110
2910 -110 150 -188 229 -353 -109 315 152 -170 280 392 -63 -89 125 124 31 -206 55 214 -117 -221 -13
2931 -13 -54 204 -73 -12 46 -20 111 -208 -131 281 -176 -167 24 214 -116 5 128 33 69 -85 -135 188 -47 -219
2955b19L84p5R5j95K8p4J60%J64q0m3j78r0K42J23k37r2J51j37k38j80O60k91
2978a22K2j11K72j39n8K06l07k85L93J59l11K93Q0j91J82j89J78j15J01N1l19
2999b10n9K21N8J13j42n7K98n71J76K35k9q7j76M33k09KO3o5m4J73j39k19R2K95
3023A52l13J00M6K32k46O6m6M7k05K46J90l61K38j0j85Q6l7J69j32ql4N6j82L
3047a28J43K1J21k10r5nL37j40R0j39J57j5n95O44m7j0j86j33J49M7j05j00N38
3070C39m27J71j79R1Q4j71j62M95k71k78J86L40l43L85j28j0k4K69n62J1M88l29
3092b5n1j23M98k86k65J3L43J20j50j95L06l43J39L7%l64K02j04J00q7J34K9k18
3115b90L46j30j73K03q8m9q9M66J37n25M06o5j98k1J42L5k93K53J3j63R7p4K38
$$ plain form
2955 -219 165 90 185 -10 18 -56 104 104 268 188 145 -33 -123 119 242 5 -87 64 -73 -311 -491 169 -122
2978 -122 -100 -211 61 -78 -136 70 -237 -522 -129 30 -281 12 92 -99 83 -106 72 -43 58 109 -210
2999 -210 -269 -48 10 123 -19 -76 222 -349 -173 62 33 -54 -230 203 -6 -4 59 -6 -50 123 -16 -235 -143 152
3023 152 -161 -61 -15 217 -29 37 -9 38 -167 79 269 -92 146 136 -49 37 0 169 37 29 -5 51 -131 -128
3047 -128 15 36 157 -53 -148 -153 184 44 134 -5 152 137 -458 186 139 129 -57 -190 -41 6 -99 -199 339
3070 339 -88 83 -96 -5 79 -92 -254 241 -30 -308 -122 218 -125 260 132 122 98 367 -195 -184 304 -25
3092 -25 -76 -199 299 13 -252 -239 104 224 74 -121 185 -158 -19 18 18 -346 -144 -248 -148 -235 -101 -72 -290
3115 -290 56 -74 -247 -44 -132 -181 -270 196 333 -192 214 149 -49 -70 72 107 -186 67 80 -83 14 -60 178
3138A78n5k76J72J16J94l41P0q3J21k5jK43l48M5L31l17R8Q6o33K82J83j55K92
3161A77l21L34k57P0j64K92n0j76K75R5k79j52R3K41j21j02N0k09L39k70r2J25
3183a02J88P2l19pK87J23k99J55j52R0l40K67J91k67K47k48K62J89m70L7j71M88
3205B21j86j35j83M62j37k77L70O4k73j5N9K95k23J7L5j21k27K92j41j08J84j38
3227a65J89R7P2k63n0K56L6l09M4K67k41J70l38M7J11l23O57j79p0K1M7l6K04
3250B44j97k02M37k58N2K70n16K0M5j6M4K10n7j78N4N5K05k55l2L52k28R7j1P0
3274B05k70J0J54O1k90J97Q8j25q6L21k31j8J8o5j29J5L73j10m00J09J88P3k45
3297a57M81m66O1N92l03j85j71K35l2Pk70J66R7k73O0J27P7j48j04K15k6J16k70
$$ plain form
3138 178 123 -153 19 135 329 -12 58 -25 96 71 70 313 -35 10 341 24 122 208 -425 -143 40 -115 177
3161 177 -144 190 -67 3 -161 131 81 -95 180 275 -4 -156 -63 178 57 -45 5 -204 135 -135 -227 -102
3183 -102 86 158 -161 -168 119 242 -57 98 -54 36 -304 -37 154 -113 134 -114 148 337 -133 -96 -267 221
3205 221 35 -100 -283 179 42 -235 135 199 -74 -89 -30 265 42 59 94 -27 -254 38 -103 -211 -27 -165
3227 -165 24 121 193 -70 -120 136 172 -137 -93 174 -67 103 -235 -188 -77 -400 257 78 8 29 76 40 244
3250 244 47 -155 282 24 76 346 -170 -150 -105 -121 -77 133 76 -102 -48 7 212 -43 -75 277 49 146 135 205
3274 205 -65 -55 99 160 -130 67 155 30 -56 265 34 16 34 -31 -160 -145 228 118 -282 -173 15 88 -157
3297 -157 324 -142 -81 511 208 23 -148 87 55 62 -208 -42 55 -218 -158 -31 46 -102 -206 9 -17 99 -171
3320a71K28j49J55j25R3J12j3m16J93L96k85J4k15J70q4k4J10l0N6O7o1K96j77
3343A40p5Q5k27n9n4L21N3l7n2j85J25O8On57L80o2m8O9K02J30k70j27M22j68
3367H0r5N0l1M5K24k41r3k4J52j77L03k63J64l77J14K08N7l39J91K59j53j55p1
3390a72M77j9l71J29k2J67k16J71k70M2J90j87n9j14M85j83m8L70j14k94R7mL3
3413H8n4J57j66j10K84M1N9j89j89L5r4j10K94j05rj18k5K73K0j47K21k55O1N0
3437A2K6J88j72k60K98k66J97j49Q1j04J65o1j78K73J65r4k0q9MJ62k42K87j74
3460D9J19j99k30N05j73k78M52j89k4K0l5j65K70m11J27P8J63l48L58qJ76l46
3482h9J06K62m00J39r7Q7oj22O5L1Q8P8j20J61k45K02m3j79j23L82l02J44N4j59
$$ plain form
3320 -171 57 -92 63 -62 31 143 130 -286 -93 303 18 32 -183 -13 -97 -121 -11 -41 15 82 21 317 140
3343 140 65 150 -77 -136 -190 131 184 147 95 -90 35 103 109 -448 -68 -130 -178 -109 93 223 -47 -174 248 80
3367 80 -15 35 4 49 273 32 -61 -85 67 -110 193 -70 94 -283 -169 39 96 -243 -52 207 54 -101 -172
3390 -172 305 286 -85 44 22 189 -27 144 -126 -84 106 -81 -140 -254 231 48 0 370 256 -38 59 55 88
3413 88 34 191 25 -85 199 240 299 110 -79 -44 -138 -248 46 -59 -68 -186 -211 62 82 -65 156 -99 -38 12
3437 12 38 226 54 -206 92 -174 23 -126 -45 -149 16 -45 -223 50 215 121 101 12 16 178 -64 223 49
3460 49 168 -31 -261 244 71 -207 245 56 32 52 17 -148 122 -289 -162 -84 79 -269 89 81 257 -89
3482 -89 17 279 -121 18 -79 8 2 -120 -55 -24 64 142 22 183 -62 140 97 -82 -205 177 -125 19 73 -86
3506h6k26L98L6M7k19N3O4q7j67J38L66l60kj54Q7K12J76k65j03K25j03j41N4
3529e7L49k46j98J68J36j62M0m5j7k08N3J36J68l87L37j24r7J84Pj35m7M16l79
3552a08K26k9j86K4n8J72Mk55N37k03N4k16m5J20ON6J23k16k18L47J88n3m46L71
3576A95k34m9j80K14j41K70LL0j68Q1j16J14k7K83m40K65j4l22J0M2qJ97J66k76
3600a05J5J99k11J00p3Ln7l7K24Q7r9O2r8K90l68q3K41l49L33q9r6Q7R2o4P2k6
3626E0J56m12Q3o7J35N9j46O7K50j16j4M8J07o8j4j16r6K98j90km4M05n72J10
3650h9K11Jj08K23m31J01j68P9M19j82p9K63k76J52mk50m8J54r6K38q1n5l4J0
3674e0NJ63l38K86m73L84K26m52J85L39k24o7J15k32M90l63k19J88j28J90k16
$$ plain form
3506 -86 -312 86 122 169 -50 3 67 -20 -187 -49 317 -43 -45 -199 -112 100 276 11 -92 133 30 -111 -57
3529 -57 292 46 -152 16 152 -10 30 -15 -32 -240 -187 -51 117 -270 67 -57 -154 30 37 -98 -145 271 -108
3552 -108 118 89 -97 -73 -131 41 45 -210 327 124 178 -38 -83 37 43 99 222 6 -212 135 323 270 -176 195
3576 195 -39 -88 -268 -54 -195 75 78 108 -60 21 -95 19 -8 275 -165 100 86 -236 -226 -184 -192 5 171 -105
3600 -105 -90 109 -102 -2 -75 -72 -129 -166 58 145 46 108 10 300 -68 -151 90 -259 74 -15 -111 -24 68 4 76 50
3626 50 206 -206 -123 -190 -55 4 -142 -75 175 59 45 93 200 132 118 2 -94 204 14 12 -32 373 -199 -89
3650 -89 122 123 15 238 -193 -92 -260 -181 238 56 -23 240 -36 116 112 -138 -186 -32 -128 110 29 -26 -60 -50
3674 -50 -45 118 -220 66 -407 -23 203 -249 -64 275 51 -16 99 -133 357 -6 -225 -37 -165 25 -191
3695a91K76l26L71j59P9J44k43N2R5j18J31J50j43l39R6J53jK13k31N2m05L38
3717fj03K06k28M49k45K93l79K14l34Q3M5j01J59O0j05Q8J05k00J12m6k00K05
3739G2j94K30m30N97j18j16N9k83M75j76j13J4J70j16p7j17M72l25l14J66k12
3760c36M98j66j68K02J45r7j36K7L8r6R1L18j97j30K7JJ44j61r5k26M40Q1m95
3783b91K00K49j10R9j49jj82M72j4k57J07M6m57Q2M05k09j69K08K31k95K18j78
3805ER3j14KJ71l8K1p6R5j90J44k84m8Q4L43k85L09r3k40K77k63M3J35o3k57J69
3830f0l88M33Q0j29M31n15K83p8q5j59J92J78k94Q5K12J49k37j54J5l8L26m44
3852a97J76J99l81Q0J3j06J44J80l3o3j07j81L99J4k14K87j03Q8j73j65K10p5
$$ plain form
3695 -191 85 -241 130 -29 50 194 -49 3 98 -20 111 261 118 -221 -125 28 27 240 9 61 -344 -6
3717 -6 -109 97 -131 318 73 366 -13 201 -133 -50 -5 -106 53 113 8 96 201 1 113 67 -133 72
3739 72 -122 108 -322 275 157 41 100 -183 292 116 3 17 187 71 -6 -123 349 24 -290 -124 -336
3760 -336 162 -4 -172 30 175 78 -58 -31 7 -89 2 320 123 -7 20 21 165 4 -91 -317 123 204 -291
3783 -291 -91 158 48 147 -2 -3 -185 287 273 16 123 169 -288 -206 199 -10 -179 29 260 -35 183 5
3805 5 98 -16 -14 157 119 140 64 159 -31 113 -171 -219 -135 208 -77 232 139 -101 176 -87 -44 91 28 -229 -60
3830 -60 -448 -15 65 -64 367 -148 135 57 -28 -187 5 183 -111 -26 186 335 98 -56 -41 -79 247 -197
3852 -197 -21 178 -203 -123 -110 -216 -72 108 75 12 -95 -276 123 137 -77 210 107 195 22 -143 67 -8
3874hK8k2k81L44j59kK36m0N6p4J8K1j44J42m80L17K64m10P7J25J28m7k3l22L49
3899I3l51K60j07MJ87l34L58o5k10J62L1J31j59j55R2K43j26k33K65LJ97k05J15
3922A96j63j74L6J06J85o9j79P6N9Q4k13J56j27o4P2J20k30K53m6j79J13J26J9
3945A57k85j29L75K8j74p3K34k70L8K17n3j38q2K98j93J54j39r6q2J26L88n53
3967b52M16j44L5J03l49K89k5k65L82m14K55j22K16k59P0O7Q2Lk88M02j93j08
3989i9J93J65j49pL1j76J38k74K57j53N8r2R9K17j47l2J65j1k13P9j50J57k77
4012b21K59r8n6M2k38L36m9o5J32l07K41R5N5k86k64P08l6k55M0j03J13j1j22
4035i0j6j08K97l24K27n0J26j88J48K5J29j25J08j09l10J40J95j61k11M36l74
$$ plain form
3874 -8 20 -2 -283 61 -98 -100 136 96 152 78 96 117 -27 115 -365 -48 216 -194 -117 8 136 89 66 -256 93
3899 93 -258 2 -105 -101 86 -248 110 45 -165 -3 28 159 0 -155 -63 180 54 -179 86 89 286 81 196
3922 196 33 -141 -105 1 186 117 -62 14 73 157 -56 100 -27 -91 -19 101 -129 124 78 -101 12 138 157
3945 157 -128 -257 118 146 -28 -101 133 -137 -99 118 65 -73 -155 143 -50 104 -35 -131 -213 -87 301 -252
3967 -252 164 20 55 158 -191 98 73 -192 190 -224 31 -91 125 -134 -64 3 85 88 -200 202 9 -99
3989 -99 94 259 110 103 134 -42 96 -178 79 -74 -16 -108 -9 208 61 29 194 183 -30 49 -101 56 -221
4012 -221 38 -60 -116 -74 -312 24 -25 -90 42 -265 -24 71 126 -160 -424 284 248 -7 33 -70 43 32 -90
4035 -90 -106 -214 83 -241 -14 -64 62 -126 22 47 176 51 159 50 -260 -120 75 -86 -297 139 -235
4056b35K31M2P4j18n1J6J78l88J42M88l85j74j70J80K2J80k14K56k05J97o9k4
4078b7L05m76q6N19q8j18O1Q8jl11J58j22l4p5N67r2l36O9j89L2L23k44R1L4j47
4103i9J76J0m3lmq0o4J98J9k91L4L8j04J14J92k70J63K10l62M2L70l70J59j61
4127a26L01l22J23L5J54l87K02N6J36j08J4k33j68J48J54n1p6R2j71K45K65j97
4149H6Q6o1k9k35K33l04L40k25K17K0j52J8J9j32J58K1j3k36L65k41o9J33K0K76
4173B95l54j53L47k86J80N4l5K1j70K40l11J53J77j34M1J22j45n9O5p8o9R5M9
4196D5J63j27k1M7k32J28k24N9J68r8R3K1m1M2k13J13M9k1l2J7K70m7l38K89j06
4221Dk57K57P1K08l68K31l50rK92l97L08K22k30%j82M37n2l68K83l3m46K97k9
$$ plain form
4056 -235 -4 38 112 -6 -57 -41 137 -251 -109 379 -6 -180 -350 -170 -148 32 -182 74 -131 66 -3 -27
4078 -27 278 -198 -284 235 147 29 90 178 177 -134 24 -98 -132 -207 360 268 -68 1 -188 -156 167 -77 14 48 -99
4103 -99 77 87 44 41 37 -43 -107 91 110 -181 -147 -109 -213 -99 93 -177 -14 196 -166 -124 246 -124 35 -126
4127 -126 175 -147 -24 11 165 -222 -20 36 172 64 78 -155 -323 -175 -21 -72 -148 -56 -227 18 283 86
4149 86 172 111 82 -153 80 -224 116 -109 108 128 -24 -6 13 -119 39 60 47 -189 176 -65 -134 -1 19 295
4173 295 -59 -212 135 -151 29 83 48 69 -101 139 -172 -19 158 24 65 187 42 -17 48 -30 -99 -4 45
4196 45 208 81 60 107 -125 3 -221 -162 6 -92 1 22 -19 23 -190 -77 -28 -49 -81 -64 206 159 -179 110 4
4221 4 -253 4 75 283 -85 146 -204 -213 79 -318 -10 212 -18 -18 -200 237 185 -183 100 67 -379 -82 -111
4244a11K19M0j84K04n2p0J29j64l9L5R9j43M5K21j59l20K06L2Q4j18K70j31m40
4267c47O08j44l20K51l0r8j7L5O9P5P7O9k78j35J51K5N5L2k29q8L52N9j07J95
4291B60j18J38l58k49PN08kL4j57R6k77m8L4J33j31J31K00j73M8n7L2J18j16l41
4315b88M41J97k43j79o2L02l19K9L39j57M4J3k11J17q1J47p2K5L02k31k48K33
4337I8J50j12j79j60N2p0K31p9J36j14j16oM57m28J94kJ51k90J46j47K36l6j27
4360a5K10k21K6m9k2JO3mn3MK41j20j26J00K1k64J44L2K42k14Q2o7j09J74J5p4
4386A7p8K05k63J15M8R6m12J31J85P7k50J38J48j34pK0p4j0J45j56j9L6m5n5l8
4411a80J3M9J74P2k75j06L55l07K2K53k23K0R1k09J74p8J18J46j22R7n8K23k59
$$ plain form
4244 -111 108 148 -36 168 116 46 175 11 -28 7 106 -37 8 229 70 -250 -44 -12 72 -46 224 93 -347
4267 -347 261 117 -203 48 18 -80 -97 -62 7 82 159 228 -50 -185 -34 -9 46 78 -151 -239 113 172 65 260
4291 260 142 280 -78 -327 -320 188 186 220 63 159 -118 -166 -132 1 -130 1 201 28 76 19 51 169 53 -288
4315 -288 153 350 107 -72 -134 168 -151 -122 217 60 104 117 -94 23 -58 89 17 42 344 113 -135 98
4337 98 248 136 -43 -203 -151 -221 10 -69 67 -47 -163 -169 288 -140 54 52 203 -87 59 -88 148 112 -15
4360 -15 195 -26 0 -49 -71 -70 -7 -11 -64 -60 181 61 -65 35 56 -208 -64 -32 210 -4 78 11 -98 76 91 17
4386 17 -61 144 -119 -4 44 140 -272 -141 44 121 -129 9 157 23 16 36 -38 -48 97 -59 -78 -42 -87 -142 -180
4411 -180 -167 -118 56 128 -147 -253 102 -205 -183 70 -153 -133 -42 -251 -77 -155 -37 109 -13 84 26 249 -10
4434a0R8j7N5j78J21o8J1J16L8pl92J4J52r2J90k32j2N7J72m04N70j07O9j53J56
4459A47j21P0k6j28k2R4P7k60K34q2J62p8P3k12O8k55J11Pq9K50J27j95J73p8
4483D7J24l11R2J40j63P0k36K17j25N1J95n5J75l52J58k53K03p2J13L4K2J92m17
4506a51J28J08p2P6p7JJ17k18P8pJ57k2k64J62Q5J17m28Q2J73l36J48P4R5l7J8
4531Gl5K75l22K67r3k3R7k38K10j46P1l66K5L59M1k06J25Jj2j35J98K1k0r5P2
4556G8jL6p5j07P3k12J24J60k30k3M3M6K13j89K24l39K68J09n14L73k12K4L02
4579A71nmj88L7j43M1n9J11K04Q5j74k33J8L35k60K41j64N35o97K00N0J32l04
4602g1K30j18J20j50l6K56o96N90j50K8k57L48j7p0q0K09k13mM09k01J19k35P5
$$ plain form
4434 -10 88 71 126 -52 69 1 12 128 166 159 -233 -219 -67 -159 31 -201 -213 -156 16 -388 182 75 144 -9 147
4459 147 26 96 70 -58 -80 14 91 -169 65 -17 145 67 140 -72 -4 -259 -148 -141 -230 20 147 -48 125 47
4483 47 171 -140 -48 92 -71 -1 -237 -20 -145 -94 101 46 221 -131 27 -226 -23 -95 18 52 74 266 -151
4506 -151 -23 85 13 89 12 13 130 -88 -10 -17 140 118 -146 16 101 218 -210 -128 45 -291 -143 -69 26 -11 7
4531 7 -28 247 -75 192 99 76 173 -65 145 -1 70 -296 -271 88 129 -77 48 49 37 -98 100 121 101 6 78
4556 78 77 113 38 -69 4 -208 -84 76 -154 -177 -134 -88 125 -64 160 -179 89 198 -316 57 -155 -131 171
4579 171 166 162 -26 11 -132 -91 -150 -39 165 250 76 -157 -139 196 -64 177 13 548 -149 51 101 233 -71
4602 -71 159 41 161 11 -25 231 -465 125 -25 3 -254 94 77 7 -73 136 -77 -81 328 127 246 11 86
4625H6j44L78m59j36K05L24j28k91J89k49J10k19L74m39M21J20j16j09j48K00
4645c1K34M5j88k8q7j8j6k5K23o0j88K8r0L04K79l86j10J05J37k00J02O5j32K39
4669B02m74L40j91n1K27k08J58o1J7K35j08j64J45nJ17l61J11n2J5J73K02m19
4691a52j30M63n8m23L07Q1k67J32n1j69M95j58Or4R2l45K82l5O3kj03j01J51Q5
4715F9N5l6K17k80O2k23K22L3k66R6J12j95K07mk78L92r2q0K16j27n2o2J4m7j6
4740f3J26j36N0%r2K11o8Q7o4k1J59k20K14l18J81K3J39m30N6K28j10m8pJ73N6
4765A26m08L02NL9j68k24N71k79J26j09j1m1K94kl7j48K1q7Q8R4Qj30J27j11k30
4790a84K73k02J43O1l57M04Mk01k08R8K91L9j41n3j74L29j9k13K81j56J10j80
$$ plain form
4625 86 -58 320 -139 -275 -70 254 126 -165 24 -225 -115 -334 40 -399 22 142 26 -83 -231 -31
4645 -31 203 248 60 32 -55 -73 -89 -114 109 49 -139 -111 -201 103 382 -4 -114 -9 128 -72 30 95 -37 202
4669 202 -272 68 -123 -174 53 -155 3 -58 -41 194 86 -78 67 62 179 -182 -71 -123 -108 65 267 -152
4691 -152 -282 181 123 -300 7 88 -179 -47 -98 -267 228 70 76 -18 74 -271 11 -24 39 37 -66 -167 -16 69
4715 69 124 88 305 25 87 -136 86 119 -147 -51 61 -134 73 69 -209 183 91 11 227 100 48 -14 0 -47 -63
4740 -63 63 -73 -23 -23 -115 96 28 115 51 30 189 -31 183 -135 46 69 208 -222 -166 62 -48 -96 -103 70 126
4765 126 -282 20 25 64 -104 -328 243 -36 90 -19 -30 -71 223 221 184 36 57 -30 58 152 160 30 157 46 -184
4790 -184 89 -113 30 91 -266 138 142 -59 -267 -169 122 161 20 -33 -207 122 103 -110 171 15 125 -55
4812e5qo0j82L64k5pk23J46o7k36K89J54m4Q6r5k38K69k51R2J52q5m0J27k9j19
4837h5J61j63O5M2k11K86k20J1L40k30j93K27l6j79KK19k37J67N8j40J30k5P5
4860F4N0k89J58L9LP0j94K66K03l96J09j56lJ04O8p8P3J30l18J38j75M28j55k02
4884f3J56j2q8J35k61J22p6r2J33J93k02m6K80k73J61j44J24j3j44L52l36l4J97
4907F9qj37L03l33j76L16p7K48l81J54pj27Q7K23q0J08j49k56L82l71L43j77J24
4930G8k52N7pn6L40j87p7R1J71M3k60jJ64Rj6o4M8pM4j31Q5J53k46P7o4O2j39
4957h5M0k81L42j29J73j18J26p1k09q7L26j34R7j67K13j27o1j81K96L2k68Q9M04
4980B20m02J7L39m94N13M0o3j27k03K10J65m93L14J4j5p2J00j67k5K19j23l11
$$ plain form
4812 -55 -63 -123 -305 59 34 27 -196 -50 -117 -353 -64 90 46 132 37 -201 68 -183 -91 61 -24 -64 63 34 -85
4837 -85 76 -87 -22 20 -191 95 -125 -114 226 -4 -197 30 -6 -185 -183 36 -201 -34 24 -116 14 -11 64
4860 64 114 -175 -17 22 25 95 -99 167 370 -26 83 -73 -76 28 96 18 91 221 -97 41 -134 294 139 -63
4884 -63 93 81 -7 128 -133 -11 -87 -179 -46 147 -55 -101 179 -94 67 -77 47 34 -110 242 -94 -128 69
4907 69 61 -76 227 -106 -282 34 -43 205 -176 -22 -29 -156 -69 154 74 182 33 -223 159 -212 131 -46 78
4930 78 -174 -117 -124 -180 160 -27 -104 -13 158 201 -59 -60 104 113 97 33 81 74 118 -13 72 225 -21 56 -8 54 -85
4957 -85 -45 -326 16 -113 60 -58 68 -3 -212 -299 27 -107 -10 -177 36 -91 -152 -333 -37 -5 -273 -184 220
4980 220 -182 -165 174 -320 193 233 170 43 -160 50 215 -278 36 50 35 -37 63 -104 -129 90 -33 -344
5002c44O24l11nJ42r6J02q8L3q2Q4k22M09j50j32M5k18K84o0j22J15j19K32O7
5025A88j59J20J12l06J3j6J6J12j12m7M8p8P4l1o9J14R7k12j54K95P7o6r3K92
5049B15p3l93K07J30r7k4J11N1l00K08k9j33p8P8J78J03j68J70k1Lk41j37M32
5072A92j99m2J37j02K17j74k36L02j22k5K31j69l7L39l74J77j85pJ5m76K99K88
5094D9k16J70k50L19j30J45L6m1k54J33j62K83j09P5j82p3K17k96J13J60j14L76
5116B49n13M63j6l04K88j59j19L1J51k28J47l00K74kp0J0q2oJ28K49j63N4j82
5139a00J73J37j23J24j60J40j04jj57J27R0k94j4N0j11Q0K57m3J90k16m5j6j26
5162a42N9j8O0J50k82L02k86N15l29j20P9nJ65k83M6K13k06j39P1J99M7j61pL8
$$ plain form
5002 -344 280 -31 -36 106 10 112 24 57 -25 59 -163 246 96 -36 9 -209 75 15 -107 8 -111 121 188
5025 188 29 149 261 -45 -32 -48 -32 80 -32 -79 -31 -109 -35 -66 -135 -21 76 -136 -290 5 82 16 -77 215
5049 215 142 -251 -44 86 -11 -35 76 127 -173 35 6 -127 -205 -127 51 154 -14 156 135 138 -103 -240 192
5072 192 -7 -49 88 -14 203 29 -207 95 -27 -52 179 10 -27 312 -62 115 -70 -77 -62 -538 -239 49
5094 49 -167 3 -247 72 -58 87 123 82 -172 -39 -201 82 -27 48 -134 -207 10 -286 -173 -13 -127 249
5116 249 -264 199 183 -121 167 8 -111 -80 71 -157 -10 -310 -36 -38 -108 -98 -180 -186 -58 191 28 82 -100
5139 -100 73 210 87 211 51 191 87 86 -71 56 146 -148 -162 -112 -223 -143 114 71 261 45 0 -16 -142
5162 -142 -83 -101 -41 109 -173 129 -157 358 29 -91 -12 -17 148 -135 -89 124 -82 -221 -150 49 96 -65 -72 -34
5186c4o5j01M0K49r1J80l76L60j26M4n2K17m73K45m58L21J49j12M1j75J2L59k75
5209a21K86O2n18K4kK1K79j27o0M64k76M8k1J54j05q0l14M06j50o7q4N14l18j64
5233a49N3L73k34J30j51l7j09J41l6n3J54O0p0m13N01q4j89K43l53M20k84Mj19
5256b02M12p6j47J40p5j9l0o1N3J41l28K02N9k35J73m8l9j82j6K32J6J19jJ47
5280B35k19P4k69Q2J17R1m7j09J13m43L76l1M8J3M9k23j90M32p6K56l23j97J79
5303f2Q5p9q5k3O2L20k79J37r7J53n2n5k53K82j92J55K15j40nJ16n8l4j22Ol72
5328c77M69l60J31M03m49K44k32K12J57k19J07r2K07M2l11n6K29m49M58K8j54
5349a2j87K77j02Q2j44q5j41K20L4O2R7N1j35J37j61J99r3K02k79J95l39P7l1
$$ plain form
5186 -34 -99 -200 -160 89 -2 178 -198 162 36 80 28 245 -228 17 -441 -120 29 -83 -42 -217 -205 154 -121
5209 -121 165 227 -291 -267 -269 -248 31 -96 -156 308 32 80 59 213 108 28 -286 120 -30 -97 -181 333 15 -149
5233 -149 -96 277 43 173 22 -15 -124 17 -19 -72 82 142 72 -341 160 76 -113 130 -223 197 -87 -83 -202
5256 -202 210 134 -13 127 52 33 3 -58 -5 136 -192 10 69 -166 7 -41 -80 -262 -278 -46 -30 89 88 235
5280 235 16 90 -179 -97 20 111 64 -45 68 -375 1 -30 18 31 80 -143 -333 99 23 279 -44 -241 -62
5303 -62 23 -56 -141 -164 -102 218 -61 76 -21 132 80 25 -228 54 -138 17 232 92 87 203 145 111 -11 -5 -377
5328 -377 92 -268 -137 266 -183 61 -171 41 198 -21 86 -6 201 243 -68 -124 105 -344 114 142 -12
5349 -12 -199 78 -24 58 -86 -171 -312 -92 -58 4 101 152 17 154 -7 192 99 301 22 217 -122 -45 -76
5372g6j4L12j32k3m9N0j61K47J38m56K95J11l20P0R0J85j79r1K07j26l62M38j72
5395a8lp8m4n5M22k16k0n5K85l5q7J47k91K96k45n2K44q1p5K47k82k13o5J98o6
5420a42J15R9Q2k74J84j71j16L39m6%M4J63l88J27n8m9J17p0J62l54R1j69J22
5443a92P4O5J26L2o3l01N66k60m6j82J86M0k19k35N27j85j32L86l67K96p1n18
5465d73N55j67J3J28Rk26J28J16j14j73M8K21J60j2l17R8n2J60J04K5k07k14O7
5488a23J03j48L33j13P2j0k44j27L72J15l71M00m30J35K43m20L30k80M2K31j72
5509f2K12Q0j57q7J80p8j04O0J95j81k4j28J37J15l81J18J93J6j74L9K51l50L16
5532A86l60J06J6j15J54J2M9K14j43Q3k96N0j36L13j61q3J3J35ro7M0j9J64k17
$$ plain form
5372 -76 -90 222 90 67 18 68 -93 154 292 -164 131 242 -78 -8 82 267 88 -3 204 78 -284 154 -18
5395 -18 -21 -99 -143 -198 224 8 -12 -67 218 183 96 243 -48 248 3 -49 195 114 39 286 4 -209 -274 -76 -142
5420 -142 -27 72 154 -120 64 -107 -223 116 70 70 114 277 -111 16 -42 -91 26 -44 118 -236 -145 -314 -192
5443 -192 -118 -53 73 105 42 -259 307 47 1 -181 5 45 -174 -409 118 -67 -199 187 -180 116 45 -473
5465 -473 82 -85 -72 56 65 -161 -33 83 -31 -204 -156 65 225 213 -104 -6 -58 102 206 231 24 -190 -123
5488 -123 -20 -168 165 52 124 114 -130 -257 115 230 -141 259 -171 -36 207 -213 117 -163 -121 110 -62
5509 -62 150 230 73 -14 166 88 -16 44 239 58 34 -94 43 158 -223 -105 88 104 -70 -31 220 -130 186
5532 186 -174 -68 -52 -167 -13 -1 48 262 119 202 -94 -44 -180 133 -28 -111 -98 37 28 -39 1 -18 146 -71
5556g1j46N2K58m0K0o5M5J04k4m06L16m9k12M29n9j48k53J91J48q1M0P7N8K0j62
5581D2O4o2j09J61M9j40J31j70P6N2Qk07q8J65j11N3j15Q9O9o5m8J06J8P7R5j46
5607fJ49j64j00L32j46M2K27k06j70q4j48Q8j3L72k34j67K44O1k82J57J69K5j64
5630a8rK08k86K02Q1J20k95J1J43j38r8L03j20j43m7j06K86k8k34J25K07k80M70
5653C54j89j34N1j36J59K3jp6k09J89jl05J38l5K41m0m4j65L15j81J82J31k22
5676D5O3k99M36k26L60m30L48k86n2R7M0j19o7J94j99J58j41p3L60l24K92P9m12
5699a56L24N4j78l15J87l4j24m1P2J27Q2j79L11k85J09O2Rl03O91j48m27J14p9
5722a27j42Q0J05j35O0J48p5J41Q2l98J29K51J8j79k43K13K1L58k26N9k08J95
$$ plain form
5556 -71 -217 -165 93 53 73 8 53 157 133 -273 43 -6 -218 211 152 4 -249 -58 90 9 49 126 184 204 42
5581 42 106 44 -65 96 145 5 136 -34 42 94 102 -105 -193 -28 -139 -86 -201 -112 -43 -108 -156 -50 -32 45 140 -6
5607 -6 143 -21 -121 211 65 107 334 128 -42 -126 -274 -186 -199 173 -61 -228 16 77 -205 -48 121 146 -18
5630 -18 -27 181 -105 97 178 298 3 14 157 19 -79 224 104 -39 -86 -192 94 66 -168 -43 164 -116 354
5653 354 165 31 82 -54 105 128 127 51 -158 31 30 -275 -137 -172 69 29 -15 -180 135 -46 136 267 45
5676 45 108 -191 245 19 379 -51 297 11 -41 56 96 -23 -90 104 -95 63 -78 -151 209 -115 177 256 -156
5699 -156 168 222 44 -271 -84 -118 -242 -283 -211 -84 -2 -181 130 -155 -46 16 25 -278 413 265 -162 -48 -127
5722 -127 -269 -189 -84 -219 -159 -11 -86 55 137 -261 -132 119 137 -42 -285 -72 -51 307 81 140 -68 127
5744A27j50p1K04l50M18j44j09M5nR4N4k80L98n93N58Q1m88K81l16J32J30l04
5766b88K64k19R0L19k82N7P5K16p3l64J68R8m64L92N3M5m67K57J62k54K90j67
5788i2K67j04j73M25l33j70pJ52J00R2Rn8k1r2j48J98j16N6j77J61J28k1l05J99
5812c0K00k37K26k13J07l2k27J4K40j44J27N9J1r6k42J56J45r7m0q9L17k95NM06
5836B71l40Q8N5l4k20K34j54N2j95J90l26M69M7j78K05j64K51j29l26K18QJ5l41
5859c04L85p1j58J59j89Q0k56L01K1K08j83N4r5J87j5lj00j79P6J71k55R6j79
5882b49K97k81L72l1q7j04K40j65m7J03L1m0j19J00L6J57r3J54j05pm00J42J21
5905B5q2O2m9k20L77r7J3J93R1n81J57L81k04k84K38n5P8N62r18N21l8o6pj57
$$ plain form
5744 127 -23 -94 110 -240 178 34 -75 -30 -35 59 113 -167 231 -362 196 277 -211 70 -246 -114 16 -288
5766 -288 -24 -243 -153 166 -116 -59 16 232 159 -205 -37 61 -403 -11 42 87 -380 -123 39 -215 75 -92
5788 -92 175 71 -102 323 -10 -180 -187 -35 65 157 166 108 87 -5 -153 45 -71 -15 -192 -31 97 76 -229 -30
5812 -30 170 -67 159 -54 53 21 -206 -192 48 -96 31 90 101 5 -237 -81 64 -33 -73 -162 155 -140 -135 271
5836 271 -69 19 74 40 -180 54 -100 -48 -243 -53 -379 90 137 -41 164 0 251 122 -204 14 22 37 -304
5859 -304 81 10 -148 11 -178 -98 -354 -53 -32 176 -7 47 -48 139 124 121 21 -158 -82 89 -166 -70 -249
5882 -249 48 -233 139 108 21 -83 157 -8 -55 48 79 39 -80 20 56 213 120 274 169 162 -238 -96 25
5905 25 -57 5 -44 -264 113 16 29 222 313 -268 -111 270 66 -218 20 -35 43 605 -313 208 170 104 97 -60
5929f0M70k41j83K45P2k65J06K3m3j30L32o03J80L62l35M5O6j04j32N2J3L65k01
5952C4J1k7L1k80j03L45J78j04o3K61k00k07K9J90M8J01o8j57j08j54RQ8J84k91
5976b53L80j98L98m57L71j08k98M9K92k71K29J1P2j96r9J28J4n6J95l92J46P0
5998B7k50J10N5lJ7k9PQ9L0K80j18k84R4j92J29J77m9j85K26k24K7n4L3l20M53
6023D6J16n5o4j51J54J08k80J99Q4k03j65J96p6J83l62J14L19k99J75j95O01l24
6045A21k51K10N6m62N08j98r8N5P3m67N93m4j33q2L83j36k49J99J27j67qk09p0
6068b49M23k32m2J35K1R5m19L32pJ51j41r6J69P3j94L5j47K92k76K8pj32O3J14
6092a1L52m19J27j61R4j1J21j37O4p5O0J53k04j04K8L01m60M16j60J36p7j53p3
$$ plain form
5929 -60 410 169 -14 231 303 38 144 167 124 -6 326 -277 -97 265 -70 -25 41 -63 -195 -143 -130 235 34
5952 34 45 18 49 -231 -334 11 189 85 22 283 83 -124 -95 95 143 244 176 19 -89 -243 -234 -146 38 -253
5976 -253 127 -71 327 -130 241 133 -165 -116 176 -95 134 145 217 21 -78 50 64 8 203 -189 -43 27
5998 27 -223 -113 -58 -61 -44 -73 -66 23 53 333 215 -69 25 -167 -38 139 90 -95 131 -93 -66 -120 -87 -407 46
6023 46 162 107 43 -108 46 154 -126 73 157 -46 -211 -15 -91 92 -270 -156 163 -136 39 -156 445 121
6045 121 -130 80 136 -326 182 -16 -114 -59 14 -453 140 96 -37 -119 264 128 -121 78 205 38 30 -179 -249
6068 -249 174 -58 -100 35 56 151 -268 64 57 208 67 -29 140 213 19 54 -93 199 -77 -49 -56 -188 -125 -11
6092 -11 341 -78 49 -112 -18 -29 92 -45 19 -56 4 157 -47 -151 -123 178 -282 134 -26 110 33 -120 -193
6115a93O6j0p1K89J87k18j20M30l44o6P4j77K88n4k31J07O5O4j65J76l07M04j87
6138GL9K40k10J10k03m0n3j13L64J24m78K38J51n9j44m2l0k5L35l0p9j55K3R9
6162F9r8K15l18K30k3j4j48J66j28j08J24J34j2l21K58Q5k09O6j75K25o4j55Q7
6185a14O9L39j35k55J63o9k48K56j02K81J86m49k8Q7p4O3J62j99j39J52j39L11
6207A18j49J08J47l2j91o9K2K05j30N9m01M29j63M2N0Q8m1j6L26k32j37n6Q6j7
6231D6K5j17O2J63m8l30K34j4k28O6K13k1j03j2Q8k41J89K02m41K89l5r8J23l04
6255b92L23J14l19R2J78j35R2o3J84j77M4K99k85J26k54K85k88R4o7o0L5K0K68
6278B14J55k25j25j50M2p6K58l0r5J55J6M5Kk82J92q8r3J48j34j83L87J55o2j46
$$ plain form
6115 -193 -127 -137 -208 81 268 50 -70 360 16 -50 24 -153 135 81 -150 -43 22 86 -79 97 -210 194 7
6138 7 46 286 76 186 -17 -57 -110 -223 141 265 -213 25 176 117 -27 -69 -99 -124 211 181 102 -53 -30 69
6162 69 -29 186 -132 98 75 61 -87 79 -49 -157 -33 101 89 -232 26 111 -98 -32 -207 18 -46 -201 -114
6185 -114 -45 294 159 -96 67 -2 -250 6 -96 185 371 -78 -106 -19 -93 -30 132 -67 -206 -54 -193 118
6207 118 -31 77 224 192 1 -68 -46 159 29 88 -313 116 -47 -5 45 133 92 76 402 170 33 -23 63 46
6231 46 71 -46 16 179 131 -199 35 21 -207 -141 72 51 -52 -64 24 -217 -28 174 -267 22 -13 -111 12 -292
6255 -292 31 145 -174 -82 96 -39 53 -10 174 -3 41 340 55 181 -73 212 -76 18 -49 -109 -74 -54 214
6278 214 369 144 19 -131 -89 -165 93 63 -32 123 139 184 186 -96 96 8 -85 63 -71 -254 133 288 226 80
6302H0N4r6Q0k27P3J41j29l6J04M5l50N31m82J67j8o0J90j07J02k8j16J25k70
6325b27L61k39K07j35J01p7R5J15m13K59j9N5j93L15l42n3O3j31J77K6j6r6J86
6348A9n3J28j39J33m1j37J03M4J3o6J7j5Pj45J93Oj39J39r1k58L06P9J71l54O3
6373a7K25m16J40j09K12j15m18L95j11K36O5P5k10n1n9M25l68R5n2P7J60l42K42
6396G9O4l18R2j84L06m12P4L14j35n7J95j37N9J98k56L17m43K71j61l3J60j11
6418a18j6J08j19K52j30n0L9O9k22K30l18P02m62O5J42n7j11J70M1m11O8J04L21
6441B97k76q2n1M34Ok31k71L32l06j39j6K45Nj45j21M49O2j99J54j06%nq2J74
6465A28j08J01k9j45K14j91r5K41j67J98Kj08j11R9K2k96J52K55o2N5n11L5N34
$$ plain form
6302 80 134 38 118 -109 -36 105 -24 -60 44 89 -261 270 -212 -45 -63 -123 67 -40 62 34 -82 43 -227
6325 -227 134 -105 102 -33 68 -9 86 201 -212 47 28 83 -110 205 -137 -190 -127 -258 -81 -55 -71 -167 19
6348 19 -34 94 -45 88 47 -90 13 57 70 4 21 6 13 -132 61 67 -72 67 -24 -282 24 103 274 -80 -17
6373 -17 208 -208 -68 -177 35 -80 -498 -103 -214 22 87 162 -48 -99 -158 267 -101 -6 -58 19 179 -163 79
6396 79 143 -175 -83 -267 39 -373 -299 15 -120 -177 18 -119 -60 138 -118 199 -244 27 -134 -167 -7 -118
6418 -118 -134 -26 -145 107 -23 -73 -34 35 -187 43 -275 427 -35 30 172 115 4 174 215 -196 -128 -24 297
6441 297 21 -61 -112 322 328 97 -174 158 -148 -287 -303 -58 -53 -198 -319 130 192 -7 147 41 41 36 -46 128
6465 128 20 121 92 -53 161 -30 -125 116 -51 147 149 41 -70 29 51 -245 -93 162 100 155 -356 -321 213
6488B13l56N9J20k45J10L9l1p2Q6P1N2L1k35K55k3j20j45Q8j93K17n0j45K68k9
6512c5Q3l90L20O0k21J54RL6J55m8o3J13k24K6n8J16M3j01j78R0K5m7R8j74K37
6537B6j76j13J28K78o6o8j70L64K7j39J2j06L2n6O9j26J86m18J50J11J99j0l23
6560a89K19k1J57q5o1P6NL9o9j49j31J29Q0j42M5k5Q9O2R3j63p7l9k1K70j90L47
6586B49j70Rk39K78K3j79R6J6j19k39J10J26J80k14l04M25J07l5J01j57l80L91
6608G5n4j98L06M2j48j30J86k33N08j43o9n5l05J24J97k32n3J6K44j22k41K13
6630g2k05M61k87L68k90J2Q7k23J60O4J7k26L1K14j17J05r1j48J35j44L9pj31
6653b48K39J34L3l20O6J61K0j90K33R2k59P9k7p8J18j8j46M0J08J05m0n5j13K12
$$ plain form
6488 213 -143 -84 36 -209 -99 -60 -91 -163 -77 -6 46 77 -158 97 74 -46 -191 -103 -296 -79 -129 -274 -6 -35
6512 -35 48 -342 -22 38 -183 -29 -20 16 171 123 60 173 -51 -25 -83 33 76 -25 -203 -113 -88 -135 -37 -211 26
6537 26 -150 -263 -135 143 77 9 -161 203 230 91 103 -3 29 -27 42 -84 102 -316 -166 -55 144 134 -189
6560 -189 30 9 166 81 20 96 101 140 71 -78 -209 -80 0 -142 -97 -122 -33 29 122 -41 -118 -157 -178 92 -98 249
6586 249 79 88 -151 127 150 -29 67 83 -36 -275 -165 -39 141 -73 -377 48 155 120 221 64 -316 75
6608 75 21 -177 129 171 23 -107 79 -154 354 211 142 87 -218 -94 103 -129 -182 -166 78 -44 -285 -72
6630 -72 -277 184 -103 265 -25 -13 74 -149 11 75 92 -134 -103 111 -6 99 8 -140 -5 -149 -110 -117 -248
6653 -248 -9 125 158 -162 -96 65 85 -105 128 220 -39 40 13 -65 53 35 -111 -71 37 142 102 47 -66 146
6677A46j9m8k03l8J51k79L60O3j92R0N0k13J63J5L1j1j78L11k49%p6J77J24l46
6701a71P5L35j82o5m4Q2M0J95j68j19Q0K0k9q3NJ4M0j52J18j31J36k94L26k9p4
6726g5K29o4j90J11r9J37K70k61Mj4k20K38nn0k14M90p4k95p3M30k89N7q9J37
6750I1j83Pl3P0k68M03l42K25J57K7j18n2J48J4m1N4N4m17J59j06N85m36J86l3
6774A51J32k75j07R9M2l1p7P1J11k25J30R5j34j6Kj0R7J22j03l2j28Q6j66K74
6798A08q7j94J09k21L41n2j35O7L08k75K01j21m3OJ73k34J52r0j70L09m29L66
6820H9J9j96J30j69KL39j15l27K28k11J63l3J19RJ74j92l53N02N7n29K98J47k42
6843i1%k11K88L3qL2k7L4mO9k60K13j4M8q3Q4j38J47j45K06l90L41n2j04j81J27
$$ plain form
6677 146 127 79 -124 -162 -11 -290 70 133 -59 31 81 -132 31 46 77 66 -112 199 -50 -50 -126 51 175 -171
6701 -171 -96 239 57 -8 -52 30 70 265 97 -22 58 78 49 -34 -29 -15 25 -127 -9 -140 -4 -298 28 -1 -75
6726 -75 154 90 -100 11 -88 49 319 58 62 48 -172 66 61 11 -203 287 213 -82 -155 275 -14 43 -46 91
6750 91 -92 -85 -118 -48 -316 87 -255 -30 127 154 36 -16 132 146 105 159 213 -204 -45 -151 434 -2 184 151
6774 151 283 8 -99 0 42 11 -66 5 116 -109 21 116 -18 -34 -32 -42 55 177 74 42 -86 0 -166 108
6798 108 21 -173 -64 -285 56 4 -131 -64 244 -31 170 49 6 12 185 -49 103 13 -157 152 -277 89
6820 89 108 -88 42 -127 -125 214 99 -228 0 -211 -48 -81 38 47 221 29 -324 178 235 -294 4 151 -91
6843 -91 -91 -302 -14 19 11 43 16 50 46 115 -145 68 54 102 19 103 -35 112 -33 173 -217 124 72 -32 -213 -86
6869h6Q4J35j27R0q9N9l0j17M0o8J44P8K89m36K11m36K94OJ84k13n8j00L45l87
6893a88K86l02N7J42k49J93K40k21k77J35J04O2N8q8k06L57K3k44n5K16j58L27
6915B12n61J37L46m08M38j44L0k62L44k55j19L12j91L37k84J5K61j57J57m84K89
6936A3j97Q3J11O0J83J12n26J30J9r4j23Q9L77k79J63l47K82J2j95K84l13k4P2
6959a08J08M8r1q9k07K88J03j67K80l8m4k21q9L30p3K77j21l93L00j64J77n3J24
6982A77l39N6j18L50j79LJ38Jj01K19j62N2q4O5p2K65k55L19l94K61m63J61J96
7005I6O5q5q6N7j5m4L10j86Mk76j39M71l61K08M0j71K30J4j18j02j08J89L40n76
7029b43J48p0J0J51r9K65J83m49P6K22k96N6K36r6k07r9J88j85L59l14L63j30
$$ plain form
6869 -86 -2 133 6 96 7 66 36 -81 -41 -109 35 113 402 -34 177 -259 35 41 225 12 -46 -146 199 -188
6893 -188 98 -204 -147 -5 -254 -61 179 -42 -319 -184 -80 -18 40 -48 -254 103 126 -118 -173 43 -115 212
6915 212 -349 -212 134 -274 164 20 50 -212 132 -123 -242 70 -121 216 -68 -53 208 51 208 -276 13
6936 13 -184 -101 10 70 253 365 -161 -31 -12 -106 -229 -140 237 -42 121 -226 56 68 -127 157 -156 -180 -108
6959 -108 0 48 -43 -132 -339 -51 52 -115 165 127 83 -138 -227 103 30 307 186 -207 93 -71 106 53 177
6982 177 -162 -106 -224 126 -53 -50 88 89 -12 207 45 97 13 78 6 271 16 335 -59 202 -261 -100 96
7005 96 161 76 -10 47 32 -12 298 112 116 -160 -299 172 -189 19 59 -112 118 132 14 -88 -196 -7 333 -243
7029 -243 -95 -165 -155 -4 -103 162 345 -104 -28 194 -102 -46 190 94 -113 -212 -24 -209 150 -164 199 69
7051F9j63p0J22l29O2L70k62K25q0j6r6K83j02m3K40k49J27Q2j53l7r9K70k21
7074g0L09l15M3j82K69M27p08J63N9J33j02K4K50n90M02r0J91l41K81k54j45O4
7096a82K85n4j55K89l03J28J15j33j99Q6R0J09K52m77q1K26J25r0j30J68k31J94
7118C2n5K0j07l15N24k34k6K68r8k86K74K86l98p1M16J3j68l19J49L70j67k33
7140a25lJ23j07k8J54J74k07Q9J77k77J2r3J89P3p4k78J60o5J95m9R0J8j05K47
7164B90j57k36j73K14J23k31L54l23oO6J29m2P1L55m60j4j50L05l24M08k10o6
7186g7J34k34M6K8K25l44J17Q9J33j27l1k64L38P6j2l40K39Q7K07j92q4L65m36
7209e7Q7r2J65j55N9K12n1l20J7q2J50J45j78Q8L62m7k63k82K63J21j49j22j2
$$ plain form
7051 69 -94 -164 -42 -371 -309 61 -201 24 -56 -72 -168 115 13 -30 210 -39 88 170 17 -20 -119 151 -70
7074 -70 239 -76 -33 -215 54 481 -227 -64 -5 128 26 50 300 -290 112 22 213 -128 153 -101 -246 -182
7096 -182 103 49 -106 183 -120 8 123 -10 -209 -123 -33 76 328 -149 -230 -4 121 31 -99 69 -162 32
7118 32 -23 -3 -110 -425 99 -135 -161 107 9 -277 -3 283 -115 -186 230 243 75 -244 -95 275 108 -125
7140 -125 -128 -5 -112 -140 14 188 -19 70 247 -30 -18 -111 78 151 77 -201 -41 -106 89 40 130 148 43 290
7164 290 133 -103 -276 -62 61 -170 184 -139 -145 -79 50 8 79 434 -26 -40 -190 115 -209 199 -11 -77
7186 -77 57 -177 -131 -103 122 -222 -105 -16 117 -10 -41 -305 33 109 97 -243 -4 83 290 98 14 379 -57
7209 -57 30 -62 103 -52 7 219 168 -152 -135 -217 -67 78 -100 -12 350 303 40 -242 21 142 -7 -129 -141
7232a41K27lj40J74l18L86m10K14N04m86K51k3l87q8M79l33O7K02j91k7K1j49
7254a71J81R2k82p4L69j29Oqk50K94NK56j78J51l12N9n3J63m66M65p6K1j09Q5
7278C9J49K6m30M68k79k75K91N0l48N27l36N0J16J4P3j80l01L73o4k00K85k09
7300a61N6J30P2k11J51k1m19O23k37j1J14k50j24J79j60J44L92j22j96l3J72n2
7322C6J05k17J96m29K42j09J57MK10q3j07o9L7l8O3P4r0L6k61J34K1L15j61l71
7346c05L08O4k08J85jjJ09o8k50J23J20j00L43n3l63m1N4j96J71J17k23J19L6
7369f0J67j63L3K4J36Q9l02Q9m08K94K42k15K78m08QL68m93K04J27j30K03l75
7391b92L26J58j25k94M89l33L05L6k79n9K6J24j64K03k86N8QL0m9O3K20l75K05
$$ plain form
7232 -141 86 83 -57 117 -201 185 -225 -11 493 7 258 235 -152 -240 239 -94 -27 175 -16 -43 -22 -171
7254 -171 10 102 -180 -254 115 -14 -8 -16 -266 28 33 289 111 262 -50 9 -44 119 -347 118 42 63 -46 39
7278 39 188 214 -216 252 -27 -302 -11 39 -309 218 -118 -68 48 62 135 -45 -346 27 -37 -237 48 -161
7300 -161 -105 25 97 -114 37 16 -403 220 -17 -28 86 -164 -288 -109 -269 -125 267 145 -51 -84 88 36
7322 36 141 -76 120 -309 -67 -176 -19 -15 195 112 5 -64 -27 -65 -2 72 -18 18 -243 -109 -88 227 66 -305
7346 -305 3 67 -141 44 43 42 151 83 -167 -44 76 -24 319 266 -97 -138 -84 -280 -109 8 -215 -96 -60
7369 -60 107 -56 -23 1 137 226 -76 13 -395 -101 141 -74 204 -204 -196 172 -321 -117 10 -120 83 -292
7391 -292 34 192 67 -227 262 -71 234 270 -9 -68 -42 82 -82 121 -165 -107 -99 -69 -118 -55 165 -210 -5
7414eo3J87J5p4m5J90r2J1K8p0J91k22j4j26M8q2K42K13m83J22j26K18rJj4K6
7440F7j0K43j28j76M1J05k13J23r5j8P1K72k30j64J97j77j22M8J25K89j81j10
7462d3K48j34M0j44m9J27r8n5m5J65K31k85p0P9RJ41m6j36P7m7j62K67p2k4lM9
7488B0P1k29R6J93q6k80J49q8L21j32J17j00k09K79j36l21M61j65J54J82m74k6
7510b03Q6K86j89O4j58j09K53j29J49j52N3J10n6k8R1J29l92K66L2K1k59Q4J85
7533A34j21J16l34J14Q8K8k33J32L63l04j56K16n6J4j54K09kk65K07K21nj04j84
7556g6J41J9m0k08K41k20L46j66m46O60P4l45L2k21K26Lk4j4k27J59m5J39l6j
7580b9q5m8J90j74J68p4K06J80k12q0k08Q9r8o6J77K29j02k16L54k06l02L05m6
$$ plain form
7414 -5 -68 119 134 60 15 205 113 124 152 82 273 51 37 -89 -41 -123 119 332 -151 -29 -155 63 54 55 41 67
7440 67 57 300 172 -4 37 142 -71 52 -43 -61 10 282 52 -112 85 -92 -214 -166 -41 248 67 -43
7462 -43 205 71 111 -33 -82 45 -53 -108 -153 12 243 -42 -112 -33 -24 117 71 -65 12 -35 -197 70 -2 -26 -29 20
7488 20 91 -138 -42 151 65 -215 -66 -154 167 35 152 52 -157 122 -14 -335 126 -39 115 297 -177 -203
7510 -203 -117 169 -20 44 -114 -223 30 -99 50 -102 -49 61 5 -23 68 197 -195 71 103 124 -135 -51 134
7533 134 13 129 -205 -91 -3 25 -208 -76 287 -17 -173 43 -13 1 -153 56 54 -211 -4 217 212 108 -76
7556 -76 65 84 44 -164 77 -143 203 37 -409 251 325 -20 12 -209 17 20 -4 -18 -245 -86 -131 8 -28 -29
7580 -29 -114 -162 28 -146 22 -52 154 334 122 42 -166 -77 -175 -241 -64 165 63 -153 201 -5 -307 -2 -48
7603d8p1J70q7j01l4K47K1j0p5j24l0J84J52n39M68k21M0m7j04K61J35k68P9J29
7627A27l4j36k32M82k00J24l20K96J30l24J04k08K88nj5j33O8j87Q0k04L48k6
7649B3j56K79l29J71K49l45N36j22n42P9J50J58r6j8k0J71j47j06j21K79P5k40
7671g2J47o7n0J17L7L3k09M2J75j3o2j42Pj36l4L45P9l4k15ON5lJ24j37K1j35
7697a21J34J1N8n8q8J00k20L2L21Q6l56J98kj82L23l33K94l18J65l6p4L20j58
7720I6J2j1K4j33k8j74J40K39k54K18j75k36J85p0J51qk38L71P1l64J98P2l08
7743b22M66q2o1N4r3j17J39j26J75n0J3l54J3L74J5K5k55K23k68n9L15j63o0J37
7767C9J47k8j77P8j0R4j34J23j68J99k08k6L0j83J02j45J05J09Mp2m3O8J49J40
$$ plain form
7603 -48 -119 51 -36 -137 -171 76 97 87 12 -112 -142 42 194 -345 123 -98 -58 -105 -209 52 187 -81 -2 127
7627 127 93 -43 -275 207 7 131 -189 107 237 -87 17 -191 97 92 77 -56 12 -175 -95 -299 49 23
7649 23 -133 146 -183 -12 237 -108 428 306 -236 -157 -7 151 55 37 17 188 41 -65 -186 93 168 -72
7671 -72 75 8 -42 75 112 145 -64 -22 153 140 78 -64 -57 -193 -227 118 197 163 -52 -46 9 6 130 -7 14 -121
7697 -121 13 24 82 24 -64 36 -184 -152 169 255 -101 97 95 -87 236 -97 197 -121 44 8 -66 254 96
7720 96 108 97 121 -12 -40 -214 -74 165 -89 129 -46 -282 -97 -167 -16 -24 -262 109 180 -184 14 86 -222
7743 -222 244 162 101 155 62 -55 84 -42 133 83 96 -258 -245 129 144 169 -86 137 -131 -190 125 -38 -98 39
7767 39 186 158 -19 59 49 143 9 132 -36 163 -45 -71 -41 -224 -122 -267 -162 -53 -49 -121 -164 -96 53 193
7791A93k29k79M55j30k94J84J07J00j19K6Mj66K42j15QJ02l25k4J53nN4j05j97
7814c60L43n1k12P4J24M50n00r3L83j33J38l9K2j40j04J58K7k05K97J44m23J73
7836G3j66K12J20l60K41l08lQ2K92o3n6j15o7K67j73PL8M9l31o6L33k3m7p6K57
7861A17j81m9J83J81j31K7l5k74K38O9k18k2j19J72J99l67J35L1k9k95M87j54
7883c5J05l12L13r9J6mj50L43m23k05L29K61M1k86K4O8K88j23p9n3kO7j47L09
7907B46j11l09J82j30K8J36j96J27j00K5K01j21J53p6j87J13K2j13Q0J22J3k66
7929a61K51m6l8J57K28m69P1Rj23L9N9Q5oK24k5j14J3q1Mj09R4j41L68m47o0J82
7955c6M8j07J50pj23J70K32k97j48P3J29m29L75k4l15K57k5J07Kp3k18M41l1R8
$$ plain form
7791 193 -36 -315 140 10 -284 -100 7 107 -12 14 18 -148 94 -21 -13 89 -236 -260 -107 -112 -58 -163 -360
7814 -360 -17 -68 -280 -206 -82 368 -132 -225 158 25 163 124 146 6 -98 60 87 -118 179 323 -100 73
7836 73 -93 119 239 -121 120 -188 -191 -109 183 120 64 -51 -118 149 -24 -17 21 70 -261 -327 6 -17 -64 -140 117
7861 117 -64 -113 70 251 120 147 112 -162 76 145 -73 -95 -214 -42 157 -210 -75 -44 -73 -368 119 -35
7883 -35 70 -242 71 -28 -12 -16 -166 177 -246 -451 -122 139 180 -106 -82 -14 274 151 72 19 17 84 -63 246
7907 246 135 -174 8 -122 -94 42 -154 -27 -127 -102 99 -22 131 55 -132 -19 3 -110 -30 92 105 -161
7929 -161 90 44 6 163 391 -78 -7 2 -121 -82 -23 62 56 280 255 141 154 73 77 -32 62 -79 289 -158 -218 -36
7955 -36 12 -95 55 48 -75 95 327 30 -118 -45 84 -345 30 6 -309 -52 -77 30 32 -41 -259 182 151 249
7979B49J6k35l9N9j36K15m6r5MK00j45j51M1m9n5L15M8k97k24J64K32j49OJ46
8003G4m28K21o5K65J84pl61L19k31J4M8q6j0l5O6J92l97j3M89l57P7K25Ll64K33
8028E6j01K05L6J4j51j96J9K05Rk48J3K29K3j04j80K42l04M04j67q9J41k4j70
8051a38J40R5l6k0j93L9K32o4K33k21O4J2k31p2J79M0o8J27o4m2J92l81M52j46
8075A29k14M7J10l07L25j83q4R3k8K44m20M62l21J96k85J83J48N4j44j88P4l52
8097d61O45l9Nl16qK11n32N37o8r2K32n8Qm10L80r2K05K0k52J1J93l1K08n6j98
8122D2R0J10j32J63l18J71j68K55k86K06m1q7M7K4k09K14O9l66M80j01k15M8l0
8145c4k6N75o75K17M0j60O2P9j27l8n2k44M91K51m66J62J55L2j47r9k0K29j35
$$ plain form
7979 249 265 30 -9 50 -86 129 83 -12 -8 192 47 -104 -63 -112 -167 148 196 -101 -325 -161 71 -78 -72 74
8003 74 -354 -133 -198 67 251 244 -117 202 -29 -15 33 -53 -63 -98 -32 160 -237 -250 239 -118 -41 184 187 -177 56
8028 56 -45 160 196 210 59 -137 -118 87 96 -152 -139 90 113 9 -171 71 -233 171 4 -85 56 32 -138
8051 -138 2 97 61 41 -152 -113 119 55 288 67 131 143 -88 -160 19 59 -9 118 54 12 204 -177 275 129
8075 129 -85 -38 72 -235 90 -93 -177 -84 -112 132 -288 174 -147 49 -236 -53 95 149 5 -183 -109 -461
8097 -461 184 145 150 -166 -174 37 -495 42 -26 -118 114 56 64 -346 34 -58 147 167 -85 -74 119 88 296 240 42
8122 42 132 242 110 273 -45 126 -42 213 -73 133 92 5 52 76 -133 81 150 -216 264 163 -52 -4 -34
8145 -34 -60 515 -160 57 97 -63 -1 78 -49 -87 -139 -383 108 359 -107 55 210 242 95 -4 -24 205 70
8168G0k92M04m41K75j17J73r6l00N93n03R9P4J87M5l10K65j33K77k60l6P4J79
8190B27k59
$$ plain form
8168 70 -222 182 -259 16 -101 72 -24 -324 269 -234 -135 -61 126 171 -139 126 -7 270 10 -26 48 227
8190 227 -32
8191c2
$$ Imaginary data points
##PAGE= N=2
##DATA TABLE= (X++(I..I)), XYDATA
0@%%%%%%%qJ0j0J6j6K4l2M0n1O2p7R4j16J44j73K03k38K80l28L82m44N11n88O76
31C61p72Q78r95J125j269J427j601J792k001K229k480K754l053L380l735M123
47B163m549N016n528O088o706P390q148Q998r952J1029j2260J3683j5346J7321
61I199j9716K2689k6491L1554l8672M9489o8075J08551l51969L09558N58401p09430
73a24912j98338M11878O4499k92763K26331J02846l76756n7065M81109l8287m05052
84b06510Q0878L18995j06344j32530Q1725n0572j16247K13714J18083l01294j16591
95b16693L14183M8895k38650M3420J42840j61830p0837K33011M3244k24356J9548
106f7225J51177j23028q2590K00776Q588k18825O8994K04513j31009j56682K00492
$$ plain form
0 0 0 0 0 0 0 0 0 -8 2 -8 8 -8 16 -16 24 -27 35 -42 52 -64 80 -93 110 -128 152 -176 206 -238 273 -315 361
31 361 -411 467 -528 597 -672 755 -846 946 -1055 1174 -1306 1448 -1605 1775 -1960 2163
47 2163 -2386 2630 -2898 3190 -3516 3874 -4274 4724 -5228 5801 -6459 7224 -8122 9199
61 9199 -10517 12172 -14319 17235 -21437 28052 -40023 68528 -283441 26117 584518 -124912
73 -124912 -323250 88628 153127 -139636 86695 189541 -187215 -244280 236829 198542 -206510
84 -206510 -125632 193363 87019 -45511 36214 -14358 -130605 83109 201192 -100102 -216693
95 -216693 97490 146385 -92265 -48845 93995 -67835 -138672 94339 137583 -86773 -67225
106 -67225 83952 -39076 -121666 79110 87698 -131127 -62133 142380 11371 -145311 55181
117E5181J15403k55811q2448K49083K2400j97418O1261J53164j09003j00473J40884
128E2223N4255j61622l0923J31401j3490q6619M6763M5908k4778J4536k3839r5610
140i1795M3121J53996m9617j82324N0747J63104n7252p9768J02260j749j43433
151i2710N1958J46740r5550j31144J35588R9835j65411m5854J81898j1540j66078
162i2268O1227J17544j01162o1292J30196P981j38979M7306J23346j04158q3806
173i4065J47497M0890j55498n754J18570l0558o0952P2235o046j23496N4323J48498
185A05644q0962j18464J00795O2292j05652J16R8691n5785q5460R7945N7550j22084
197d5374p354J29372m5206j09836Q5211O5774j15899k5683J28925j2158j24353
$$ plain form
117 55181 170584 -85227 -167675 81408 103808 -93610 -32349 120815 11812 -88661 52223
128 52223 106478 -55144 -86067 45334 31844 -54775 -8012 37896 13118 27654 3815 -91795
140 -91795 -48674 105322 55705 -126619 -75872 87232 29980 -49788 52472 50723 -92710
151 -92710 -40752 105988 10438 -120706 14882 114717 -50694 -96548 85350 73810 -92268
162 -92268 -31041 86503 -14659 -75951 54245 62226 -76753 -29447 93899 -10259 -94065
173 -94065 53432 94322 -61176 -66930 51640 21082 -39870 32365 26319 -97177 -42854 105644
185 105644 24682 -93782 7013 69305 -36347 -36231 62460 6675 -78785 19160 76710 -45374
197 -45374 -52728 76644 31438 -78398 6813 72587 -43312 -68995 59930 47772 -76581
208g6581M9498J02198p6249n2073R6703p636j09756M6441J06652n8776q3195O0889
220a885M5530o0513M558N0596n5422l5743Q2916R323q9564J8599Q5640l8130o8688
233e2783O0426M3512p8769j0525Q5924k4183p5640M8179N3990n8032k9012O3229
245B6316n94o8673K8197O4584m9380m7010N5794J6619n0954J3571M3409l6781
257d902l3932N8010K5423o9837p080O9692j5236n6780K8584L0980l5911p770M1037
270B2278j2830m3446L3697L8474n0608k3045N5280m08m5983K1795L2630l3157
282e323j5870M4156j885n2347K2652M8806m4388l4804N4590J1786n3207R062M5571
295B8799k7147l6347M2519K3665n4437k311N6923j8075m3832L2447K6414l6286
$$ plain form
208 -76581 -27083 75115 -1134 -53207 43496 35860 -73896 -27455 79197 20421 -62774 -1885
220 -1885 43645 -16868 -12310 38286 -17136 -52879 30037 39360 -50204 -31605 54035 15905 -52783
233 -52783 7643 51155 -27614 -38139 47785 23602 -52038 -3859 50131 -7901 -36913 26316
245 26316 25722 -42951 -14754 49830 450 -46560 9234 25853 -25101 -11530 31879 -4902
257 -4902 -38834 19176 44599 -25238 -32318 37374 22138 -34642 -6058 24922 -10989 -18759 22278
270 22278 9448 -33998 -301 38173 -12435 -35480 19800 19392 -26591 -4796 27834 -5323
282 -5323 -21193 22963 21078 -31269 -8617 40189 -4199 -39003 15587 27373 -25834 -16772 28799
295 28799 1652 -34695 7824 31489 -22948 -25259 31664 13589 -30243 2204 28618 -7668
307g668r490L3432o371k9921K1834J7529l5092J230L9005k3232l1957L8038J9981
320B7318m3322q162M5313l992m2739K0260L4287l4067j7264M0062r79l5002J2651
333e636K4534j9689j5857K3039J756k6087J5462K1352l0177q278L8218m128l5884
346b1375J4308L0279k0209k4039K6619J4433l0660p98K7041j1708j6583J6304
358C612L576j6012N188J3103j3087j0515K1427M622k6783P682K6212j8350j8035
371a7360K5064J0099k6581m650K7586j427k7754Q265K1108j5741r852J6142k218
384B681j3430R902J0086j3186o391J7513J533j9319R066J6291j9046p899K4252
397A2053M2k4690M177K2731r589j9586J6420J1012k3883P64K5356j2151k1525
$$ plain form
307 -7668 -17158 16274 9903 -20018 1816 19345 -15747 -14517 24488 1256 -30701 7337 27318
320 27318 -16004 -24166 21147 17155 -25584 -5324 28963 -5104 -22368 17694 16715 -18287 -5636
333 -5636 18898 -791 -16648 6391 8147 -17940 -2478 18874 -11303 -19581 18637 14509 -21375
346 -21375 -7067 23212 3003 -21036 5583 20016 -10644 -11442 15599 3891 -12692 3612
358 3612 7188 -8824 -3636 9467 -3620 -14135 7292 11914 -14869 -7187 19025 675 -17360
371 -17360 7704 17803 -8778 -13428 14158 12731 -15023 -6758 14350 -1391 -11243 4899 2681
384 2681 -10749 -847 9239 -3947 -10338 7175 8708 -10611 -1545 14746 -4300 -12199 12053
397 12053 12095 -12595 -8418 14313 4724 -14862 1558 12570 -11313 -10549 14807 2656 -18869
410a8869J8458J6722j8708r264J9150l38j8161J4772J3793k6908n836L0509l755
423A1565k7834R237K0309j5367j0555K3722k845l1646J7814L2344k7039k5480
435b5775L1285J4622k8437l361K5653q903k0147K2543J0350l1843P11L0323j2740
448D281k0742K0330Q255k5623L331K9096j6470k8895L1181K2741l8768q865L8744
461A8596n690l3708J6504K7040k2641j8110K5104L962k5304J1797J7378k2997
473h069m168K6706j0291k6445K0950K4809k7876j6939L4766M461l8080J1068L4608
486B5500k2575k6416K8522J8015l0056j1891K5741J970j9333J0538Q917j8959
498a0027L529J9354j2837j5278J9708J2472k2389o798K3508n100k3133J8780K2367
$$ plain form
410 -18869 -411 16311 -2397 -11661 7489 7151 -11010 3762 17555 -9353 -15189 15320 11565
423 11565 -16269 -7032 13277 -2090 -12645 11077 8232 -23414 -5600 26744 -295 -25775
435 -25775 5510 20132 -8305 -11666 13987 5084 -15063 7480 17830 -14013 -13302 17021 4281
448 4281 -16461 3869 12124 -13499 -10168 18928 2458 -26437 4744 27485 -11283 -20148 18596
461 18596 12906 -20802 -4298 22742 101 -18009 7095 11057 -14247 -2450 14928 -8069
473 -8069 -12237 14469 4178 -22267 -1317 23492 -4384 -21323 13443 17904 -20176 -9108 25500
486 25500 2925 -23491 5031 23046 -7010 -18901 6840 8810 -10523 15 8932 -10027
498 -10027 -6498 12856 19 -15259 4449 16921 -5468 -12266 11242 6142 -16991 1789 24156
511B4156k7401k0025K5873J5283k1074r746J5419N17r478J1432J789k0047M183
524i119K3246n661j6916O066P546q723K217J5465j3730k1983K4687K5246l1504
537c163k5949K5969K1642j5188j1032Q916m317p403J8906N979k5605j118K3863
550A1500k202j6237N777N101r429N636J5187j6505k0629K4908J7112k8937p753
563a6471K7242k008k1181J0501J4480j9796p369K7869N64k7561J0550J9060k2087
576f207q993K8506O62k8328O608K3222j7005j7213K7055P872l0751L185K6645
589A5258j3219j7771J9346R417k1505N08K3144j0444k1415J8832J3209k2425j274
602h339K0670r487j7125J5823J0802k1533m483K6917j245k6416O786J7244j1594
$$ plain form
511 24156 -3245 -23270 2603 17886 -3188 -12934 2485 3002 -6476 4956 6745 -13302 -9119
524 -9119 14127 8466 -8450 -2384 5162 -3561 -1344 14121 391 -21592 3095 28341 -3163
537 -3163 -29112 -3143 18499 3311 -7721 1195 -3122 -10525 8381 14360 -11245 -12363 11500
550 11500 9298 -6939 -1162 3939 -5490 146 15333 -1172 -21801 3107 20219 -8718 -16471
563 -16471 10771 8763 -12418 -1917 12563 -7233 -14602 13267 13831 -13730 -3180 15880 -6207
576 -6207 -15200 13306 13968 -14360 -7752 15470 -1535 -18748 8307 16179 -14572 -11387 15258
589 15258 2039 -15732 3614 13031 -8474 -7966 15178 4734 -16681 2151 15360 -7065 -8339
602 -8339 12331 2844 -14281 1542 12344 -9189 -13672 13245 12000 -14416 -7630 9614 -1980
615a980l911J7220m607j9934R036J8685j3907j4461J9013P533k1832P34J8579
628A0168q037j4736J1867J0888j3831n355J6228j230j7128Q653J4493j1089q564
641g673J0732K828r759J424P697o869l965J4570j903k1326M574K1057o216j4168
655h997Q527P183j2394r45J7280m809j9205J1216J6797j4242j0302J3590K622
668F321j2526M145J2041j1256j0558J4916N730j6975K315J3969q379p947J3761
681E557K559j7906J055K1292l779j8466P329R930j1459m26J3439o948j3066R873
695a016J1196j2177p682J2727J479j0571O514O438j1962j354J3899k212j2602
708g323N566J1171q973q816J2436K906j4336K448J2761n816r212N916N460o297
$$ plain form
615 -1980 -5891 11329 6722 -13212 -4176 14509 602 -13859 5154 12687 -9145 -8411 10168
628 10168 2131 -12605 -738 10150 -3681 -9036 7192 5962 -11166 -2513 11980 891 -7673
641 -7673 3059 5887 -3872 -2448 5249 -1620 -5585 8985 7082 -14244 -9670 11387 5171 -8997
655 -8997 -470 6713 -5681 -6626 10654 5845 -13360 -2144 14653 411 -9891 3699 6321
668 6321 -6205 -2060 9981 -1275 -11833 3083 8813 -8162 -5847 8122 -257 -8204 5557
681 5557 8116 -9790 -8735 12557 8778 -9688 -2359 7571 -3888 -4314 9125 2177 -10889 -1016
695 -1016 10180 -1997 -9679 3048 4527 -6044 470 6908 -5054 -6408 7491 5279 -7323
708 -7323 -1757 9414 441 -8375 4061 6967 -7369 -4921 7840 2024 -7188 -1272 4188 -2109
722b109j774P738j608p930N385N345o170l99M730k760l160M457K015o618j353
737d211R018j726r475M502P794o634n280O415M570o213l536O619J471n522J945
752b63L518m125m63M543j387l830Q64L125k113j562L709k366n547P068M710q876
768b995l399R013L036p664k234Q136m38p172M157M040o065j197N503j407l455
783b141J609J909l108o06M878j954n522N580L869p391J7P131k233n908L325O183
799E638n141n408O591K971p084k36M400k040j169J611J01j787N40K916k498j887
815b482M292K91m843K721L351l534j697L198J208l639j005M217n04m879K092K897
831A684j978j367Q34J098N85j187k32J027J25K43p17n31J545j24j514J113k77
$$ plain form
722 -2109 -3883 3855 2247 -5683 -298 5047 -1123 -1522 3208 448 -2712 1745 3760 -2858 -4211
737 -4211 4807 3081 -6394 -1892 5902 -732 -6012 403 4973 -1240 -4776 1843 3314 -2208 -263
752 -263 3255 -870 -1333 3210 1823 -2007 -1143 1982 -131 -1693 2016 -350 -5897 1171 5881 -2995
768 -2995 -6394 2619 5655 -2009 -4243 3893 3455 -3717 440 4480 -1585 -2782 2721 1314 -2141
783 -2141 -532 1377 -1731 -2337 2541 587 -4935 645 4514 -2877 -2860 4271 2038 -3870 -545 5638
799 5638 497 -4911 1680 4651 -2433 -2669 1731 -309 -1478 133 234 -1553 -1013 1903 -595 -2482
815 -2482 1810 2101 -2742 -21 3330 -204 -1901 1297 2505 -1134 -2139 2078 1574 -3305 -1213 1684
831 1684 -294 -1661 -827 271 856 -331 -563 464 589 832 115 -416 1129 1005 -509 604 327
848C27j322Q62J06K38m18j534J208J740j677r73J099J724n05k654J562K948k478
865B53j477K286M15j837p25J463R43k454o33K334n21r45O08q05J104P14j022M8
883b51P10K24j95j202J574J327l273k02L361q48k940K79K662N97l936m04L669
900A152k80k092N54P45N82o67m83J901q55j225J303L75k51p51j188J122J634j754
918a78j573O84J887j78k894P43L474j007k966J814K072j513j722J689K240k401
934A71j755K770m51j587J000j59q24J085Q0j101p46J458J332k622M34L458k433
951A10k955L969K227l696j603L513Q08l767m51L494j704j555K888m99l129J607
967g43J680j213j013K249M35k976R57L491l241k333N084O12m778K37L742j849
$$ plain form
848 327 -995 -133 -27 211 -207 -1741 -533 1207 -470 -1443 -344 1380 875 -1779 -217 2731 253
865 253 -1224 1062 1477 -360 -1085 378 1321 -1133 -1766 568 47 -898 -290 -1095 9 723 -299 -251
883 -251 459 683 488 -714 860 2187 -1086 -1288 2073 1225 -1715 -1436 1226 1823 -2113 -2517 1152
900 1152 872 -1220 -666 79 661 -6 -489 1412 557 -668 635 1010 759 8 -1180 -58 1576 -178
918 -178 -1751 -1067 820 642 -2252 -1509 1965 958 -2008 -194 1878 365 -1357 332 2572 171
934 171 -1584 1186 735 -852 148 -11 -835 250 330 -771 -1517 -59 1273 -1349 -915 2543 110
951 110 -2845 1124 3351 -345 -1948 1565 2373 -1394 -1845 1649 -55 -1610 1278 779 -2350 -743
967 -743 937 -276 -1289 960 1395 -1581 -624 2867 -374 -2707 2377 2989 -1789 -1552 2190 341
983C41l289L105K764m701j157N117j510m171K848L142k328j259K462J3l450J599
999d74M332l527k825L893L59l487Q61K051j966p61L158O9n270J236N645k506l745
1016b957L944J721l979m35L496k47l588J943L550l472l004L084P10k043J050J184
1032I57j445p56J708K5k782J722L944l317k488M058L14m103K39M734K7m883N74
1049a472L979k620l066L451J503k511O7R15p45q46J326R60j741J212K263l590
1065i15j983M671O24m533J167M506k360n223K180N148l774l091N029J331m641
1080a864k40K564l94r94J591J104k583J98K587k723j280M775n20n004J596M270
1096C083l154l638L974L600n341j876N753j079m466K275L627j829k296K049K49
$$ plain form
983 341 -2948 157 2921 -1780 -2937 2180 670 -3501 -653 2489 161 -1098 1364 1377 -2073 -474
999 -474 3858 331 -2494 1399 1758 -1729 -868 1183 -783 -1544 1614 1683 -3587 -2351 3294 788 -2957
1016 -2957 987 2708 -1271 -1706 1790 1543 -2045 -102 3448 -24 -3028 56 766 -1277 -227 957
1032 957 -488 -1244 464 489 -2293 -571 3373 56 -2432 1626 1940 -2163 -1924 2810 2837 -2046 -1472
1049 -1472 2507 -113 -3179 272 1775 -736 -669 246 -499 -1345 -19 941 -800 412 2675 -915
1065 -915 -2898 1773 2397 -2136 -969 3537 1177 -4046 -1866 3282 -492 -3583 1446 2777 -1864
1080 -1864 -2104 460 66 -928 663 1767 -816 -618 1969 -754 -2034 2741 2221 -2783 -1187 3083
1096 3083 -71 -3709 265 3865 -1476 -3352 2401 1322 -3144 -869 2758 929 -1367 682 931
1111I31k357J169K269k875n89L894j681l908K164K841k463j240L111N24m373L69
1127b214N097j839l716L346J915k755j033K567o57k082J380J959k302j552K544
1142F58p78j431J998P64k351k35K581m3l252J680L221k406j896K819K02l189N64
1159a094L247q28l167Q29K765k205j811K986J60k278J083J151j127n16J198N51
1175I44j678J040J624k652p21L236k96l504J353K688k085k569K364K624m075o30
1191b337M370j69l947Q90K548r75j098J210O78j948N65J701j882o97K632r54k663
1208b076K057J748k568j781L303J791l836n93L465j87k886J619J590j463j021
1223h38J347O37j490k88R86p83K76J316j845j302K463R49k364p83K532Q19l055
$$ plain form
1111 931 -1426 -257 2012 -863 -1452 2442 761 -3147 -983 1858 -605 -1845 1266 1790 -2583 -2214
1127 -2214 2883 1044 -2672 674 2589 -166 -1199 1368 711 -1371 9 1968 -334 -1886 658
1142 658 -120 -1551 447 1211 -1140 -1375 1206 1163 -2089 -409 2812 406 -1490 1329 1531 -1658 -1094
1159 -1094 2153 1325 -1842 -1013 1752 -453 -2264 722 882 -1396 -313 838 -289 -805 393 944
1175 944 -734 306 1930 -722 -1443 1793 1497 -2007 -654 2034 -51 -2620 -256 2368 -1707 -2337
1191 -2337 2033 1864 -2083 -1193 1355 380 -718 492 1170 -778 -213 1488 -394 -1091 1541 587 -2076
1208 -2076 -19 1729 -839 -2620 683 2474 -1362 -1955 1510 1323 -1563 56 1646 183 -838
1223 -838 509 1146 -344 -632 354 -429 -153 1163 -682 -1984 479 1428 -936 -1719 813 1632 -1423
1240a423M2L523j172k895K293J921j987k078K143J113j864j011K174q78j147J293
1256D7N14j298N20J092j087m31J657L07k421J58K862j062k513K041J092j771r08
1273a201J667K35j847L88K198j656j472K320N6j782J034J146r24r12J431N44j792
1290e67M8J827j203j233J707M00k286P92J289o91j290R90J162j522m43J849j96
1307F33j597J230J046j076p43L99Q89m58o04N54k23m57N70k47p43J003k0r56J68
1326f32Q33L21j512L18K043m70j957P10J535q02j239P71J297j028j453J155P09
1343E99o50n21J52O86J6p11o0P91k93K18m60k79J822n22j886J060J546j357j341
1362a190J140J348j351j556K047M64j802M4J296j72p74M81J09J29Nj18k61j11
$$ plain form
1240 -1423 -1381 2142 970 -1925 368 2289 302 -1776 367 1480 -384 -1395 779 -99 -1246 47
1256 47 561 -737 -217 875 -212 -643 1014 1321 -1100 -942 1920 858 -1655 386 1478 -293 -1201
1273 -1201 466 701 -1146 -758 1440 -216 -1688 632 688 -1094 -60 1086 162 -750 681 1225 -567
1290 -567 -519 1308 105 -1128 579 979 -1307 -515 774 83 -1207 -217 945 -577 -1020 829 633
1307 633 -964 266 1312 236 -507 -108 781 323 -281 273 50 -407 163 -84 -827 176 156 -800 -632
1326 -632 201 522 -990 -672 1371 901 -1056 -346 1189 387 -852 -81 1216 188 -1265 -110 599
1343 599 -51 -572 -420 266 282 -429 -489 302 9 227 -233 -512 1310 788 -1098 -38 1508 151 -1190
1362 -1190 -50 1298 -53 -1609 438 902 -900 -856 440 268 -506 -25 84 213 218 100 -161 -272
1380b72J642j140j431J592Q19j732m79J496N12j717j81J630m43j642R82P65n84
1397a83J73j17N16m0j60l04k02J76O22m98p00Q97j19p26J81Q04M2j087L47J095
1417G17k40j287O18R88o55k49K44K16k70m93Q46p5q74L45P88q70M0K31K3l10j19
1438c86P16k92l77M65K67p05L45L17m69O9P36p70m36N03J163j188q99J328M40
1457H27j627J31J069J57j165O5J031k96p65P25k7J59L25o71n64Q68J79o23m93
1476f95Q45Q57j532r26J836K21j573L75J458mj589K20J209j50p90M06L06k0o61
1495b07j31j61J002k10o59j23Q70J7r33k16J567N7j651O32J304p84j165O93J191
1514A093p41j093P10Q30j078l57R32j17m63o1L26p77N27L97m80j98J387q0j839
$$ plain form
1380 -272 1370 230 -1201 391 1210 -522 -1001 495 1007 -710 -891 739 296 -1346 -364 401 -183
1397 -183 -10 -127 389 349 189 -115 -317 -141 481 -17 -717 180 61 -665 -484 320 362 -725 -378 717
1417 717 477 -810 -192 796 141 -108 136 352 82 -411 435 360 -514 -169 619 -251 -211 20 43 -267 -386
1438 -386 330 38 -339 126 393 -312 33 350 -119 -50 686 -84 -520 -17 1146 -42 -941 387 827
1457 827 -800 -669 400 557 -608 -543 488 192 -573 152 125 284 609 -62 -626 242 421 -202 -695
1476 -695 150 1007 -525 -1451 385 606 -967 -592 866 862 -727 -507 702 552 -238 168 474 454 -207
1495 -207 -338 -499 503 293 -366 -489 381 398 -535 -751 816 873 -778 -146 1158 374 -791 -98 1093
1514 1093 352 -741 -31 799 -279 -636 296 179 -284 -345 -19 -796 -269 128 -352 -550 837 757 -1082
1533a082P27J614j057r65Q73J198j344j208J546M32j164J58P25m43n49M05Q5p9
1551a28L06L63n14o74J218j70j406J296Q72j106n44O83L12j164K17J218n14j108
1569h43P58P35j368K37J092l94k83J29J90l19k38O01K72n58J94K29o16J55O9j33
1589i1l96O09K21o04m54J125j2p18K78P57n30o52L24P29j00j094P01Q31j033m52
1609e61L68O56q23K33M24k26l03m12M86m9N04j4n60J90N78l26p74K11J605p09
1629D98j627J256P44j356n68J379Q2r18J4R26l53n27L95Q7l05Q13k00j062O79
1648d3Q82n72j019J053P11j221r52J687K24j904K98J867j064o26M95N70p11J75
1666a50P83m70m73O75l13r07J052M60j092rJ163n36r45K23J373n21j046O83K82
$$ plain form
1533 -1082 -355 1259 202 -763 110 1308 -36 -1244 302 734 -430 -272 453 10 -539 -134 -49 -128
1551 -128 178 541 27 -647 571 401 -1005 291 1163 57 -487 196 508 -656 -439 779 265 -843
1569 -843 -85 650 -718 -481 611 217 -66 63 253 -66 -304 297 569 11 205 434 -182 -27 42 -91
1589 -91 -487 122 343 -261 -715 410 398 -320 -42 715 185 -467 -143 586 486 -608 93 924 -109 -561
1609 -561 -193 463 -360 -127 297 71 -232 -644 -158 -207 297 283 -277 -87 491 165 -609 -398 1207 498
1629 498 -1129 127 871 -485 -1053 326 408 -510 -496 430 77 -450 -55 32 -273 540 340 -722 -43
1648 -43 839 267 -752 301 1012 -209 -1161 526 750 -1154 -856 1011 -53 -679 -184 386 -325 -150
1666 -150 633 163 -310 365 52 -855 197 657 -435 -444 719 183 -762 -539 834 313 -733 -50 232
1685B32m91o7R48k25l53j29L05o6k42L87k11l85N67L5o22q2M60M3l41M53N4m17
1707a47m1M52K00k53l57K99O9j89M5K07o7m71K74M26n38l09O9L80o4Q4j44L61
1729B86p13L24N11o23N6M37k09J12K57l99j37L98J32q54k38Q68N19j217j18R58
1749C50j99o27K03R16n45o55N99K32m34K09J33k74q1K25m47PP76m7q35q6Q99j68
1771A51j075N63J057n63n75L04Q03p20m21P30K72q48K12L62m82K24N15o65j41
1790b97N50k04o15K14J000m96r13R72M81j010k6N96L42o80l88R86j05o19K30P6
1810I4k70JQ2k92K20L73l21p6R4K70k90r3N72Qm49p2L50J28o33n7Q22o0n30j96
1834c25M12O0l23K00K21n09o9M83p8l40L37J11k03J31K2o6j37K22J08k20r7J17
$$ plain form
1685 232 -259 -326 622 397 44 -85 220 154 -88 299 88 -297 270 305 -317 -399 61 104 -237 216 270 -147
1707 -147 -188 264 464 211 -146 153 222 33 78 285 218 -253 21 447 -91 -400 -331 49 -15 69 -75 286
1729 286 -427 -103 408 -215 -159 278 69 181 438 39 -98 300 432 -422 -660 208 727 -490 -608 350
1749 350 151 -476 -273 643 98 -557 42 274 -160 49 182 -92 -173 52 -395 -388 388 341 -494 -580 319 151
1771 151 -924 -361 696 133 -442 -138 665 -55 -476 254 526 -322 -110 252 -230 -6 509 -156 -297
1790 -297 253 49 -566 -352 648 152 -761 211 692 -318 -344 252 594 -86 -474 512 407 -212 18 94
1810 94 -176 -175 -93 -385 -165 208 -113 -189 -95 175 -115 -208 364 372 -77 -149 201 329 -304 -361 461 401 -129 -325
1834 -325 87 147 -176 24 245 -264 -333 150 72 -268 69 180 -23 108 130 64 -73 149 257 37 -60 57
1856E7K00n68K06K90n68J0N24j68l63K71O33m85l39M18K41n78k3Q23o55k71M96
1877A51M5q9j93O6K8j02J03J5n24N27M91r65J78K37N26n02k64M97J39o85K01N06
1899C86m66J3m4J83J83n03K44q8p1k5K54m08N33J70n44K50L35k36k34j0M06p2
1921B56n41K19K91j99j79k01R2L33q5k29O45o09J25K05k14J63J08m66Q1M98k81
1942A2M1m10N77m4p87L48O52m02k55K37K97n27k30O31J44l72m6O08m03k36N09
1963C44m51r7M85J22k67m43M75k15k27M37J28m86k3J55J90k66K21P4L1l36L33
1984A84M5l60L40J13m30m5J69L0k21J13M05n47J42l1M13m07q3J69KJ70J35j58
2006A48j89j62N29n0l58J00Qk38N5J92k56K09l69M15N1K4Ol33M38j57K91j53p5
$$ plain form
1856 57 257 -311 -105 185 -383 -373 151 -17 -380 -109 524 39 -300 118 359 -219 -242 581 -74 -345 151
1877 151 196 107 -86 -20 8 -94 9 24 -500 27 518 -447 -269 -32 494 -8 -272 225 364 -321 -120 386
1899 386 -80 -67 -111 72 255 -248 -4 -92 -163 -188 66 -342 191 361 -183 67 402 166 -68 -78 328 256
1921 256 -285 -66 225 26 -153 -354 -262 71 -14 -243 402 -207 -82 123 -91 72 180 -286 -205 293 12
1942 12 53 -357 220 176 -611 -263 389 -13 -268 -31 266 -261 -491 140 284 -88 -134 474 71 -165 344
1963 344 -107 -204 281 403 136 -307 168 -47 -274 163 291 -195 -218 -63 127 -139 82 156 187 -149 184
1984 184 229 -131 209 322 -108 -153 16 46 -175 -62 343 -204 -62 -93 320 -87 -170 -1 1 171 306 148
2006 148 -41 -203 326 276 -82 18 26 -212 -157 35 -221 -12 -381 34 85 109 115 -218 220 63 354 201 126
2029A26k24J46K39p31N24j58r6JL46k18p1JM14k99j49N0N10o89P9M71J65l03k7
2052A07o3j52L00l64J26N5J21L18r25L62L79l41j91M63K89n13k88L95L04k99j85
2073a02N40n99k35K88J0j81J62K01j79j31M65m32l75P24L82q09J04M83n4n35K87
2094A4L10j50n05L40J16m50O08j15j74j40L57l9j79M3J31j88J24R8l23J15K00
2115A93%k76K9L57j02k68NJ32K41m40pK14k09l8jK83k60j72J84K78j65n8M3P8
2139D1k17j93P01k23j64N0K15k05j07M28m46j15L99j80k13J31M62l59j14L89k99
2160a9j96l2O63k70j90L7K25l23j27L08J00k47k7L58o34L11J96j34n03O69l6l32
2182b03J56M93j71n16K84J40k86j16J04J46j66J4J01K25l42N8j27K26L2K2j69
$$ plain form
2029 126 -98 48 287 -444 80 -78 -174 -173 173 -45 -116 -115 299 0 -149 -99 411 -278 -199 272 437 134 107
2052 107 44 -108 192 -172 -46 9 130 448 -477 -115 264 -77 -268 195 484 -29 -317 78 382 83 -102
2073 -102 438 -161 -396 -108 -98 -279 -117 84 -95 -226 239 -193 -568 156 538 -271 -167 316 262 -273 14
2094 14 324 174 -331 9 125 -325 283 168 -6 -146 211 172 -7 36 167 -21 103 201 -122 -7 193
2115 193 193 -83 -54 303 201 -67 -62 70 311 -129 -136 78 -131 -169 -170 113 -147 -319 -135 143 -22 -80 -37 41
2139 41 -176 -369 332 109 -55 -5 210 5 -102 326 -120 -235 164 -16 -229 -98 364 5 -109 280 -19
2160 -19 -215 -247 416 146 -44 -7 218 -105 -232 76 176 -71 -98 260 -374 -63 133 -1 -504 165 129 -203
2182 -203 -47 446 275 -241 43 183 -103 -219 -115 31 -135 -121 -20 205 -137 -79 -206 20 52 74 -95
2203i5K29k33Kj77K87J98j69m01N60k02k55L32Q5k70QJ8rK14l42M1L69k23R2L0
2227H9j56J76k41N6L3K50k10p4R2R2n2K6j90K93j48j08k69M97l0k49K9K22k61
2250a33L0O4J52J02k47K28l93K15L11j97k88J04J58j00k47L43k22L8LL00p3k93
2272a45M36j64o6r6K83l12O3r4J28K0j11J07R9j22q4J43m7q7M1R1j86j6J64P7
2296A22k8Qk08K3N5M1j54J0L49m16K1j1L45j8l34q9N81j92l32L60qk01pM85k43
2321A59J1r0J8l37L91j67k94L84M1l03N3J84P5K64o75N01n4k91L0J23R8n6j36
2344g1K3l8p5K62k4N0mj94k15N63l78j50K1K13L59n01qN41l63p6k3K56m3m89N09
2369A45M1j71j99K90j03m2J30Q4m43J48L52l18j18L94j35%k55J49R4k86K31M7
$$ plain form
2203 -95 134 -99 -97 -274 13 211 42 -359 201 -1 -256 76 161 -109 -101 -83 -92 122 -220 -179 190 -33 59 89
2227 89 -67 109 -132 -76 -43 207 -3 -77 15 107 55 81 -109 184 36 -72 -341 156 126 -123 -94 128 -133
2250 -133 -103 -39 113 215 -32 196 -197 18 329 132 -156 -52 106 6 -241 102 -120 -82 -79 221 148 -145
2272 -145 291 127 61 -35 248 -64 -1 -95 33 53 -58 49 148 26 -58 85 38 -49 -8 83 -103 -119 45 122
2296 122 94 102 -106 -83 -28 13 -141 -131 218 -198 -177 -188 157 139 -195 -284 297 105 -227 133 125 -76 -83 402 159
2321 159 170 80 98 -239 152 -15 -309 75 116 -187 -134 50 125 389 -286 215 161 -130 -100 23 121 65 -71
2344 -71 -48 -86 -161 101 77 127 123 -71 -286 277 -101 -251 -230 -17 342 -159 -167 374 11 -65 -88 168 125 -364 145
2369 145 186 15 -184 106 3 -39 91 175 -268 -120 232 -86 -204 190 55 55 -200 -51 43 -243 -12 35
2391C5q0P7p3K59l33N1R2j7j18J99j64j04L43N3l92J43N7K44l12J28n3j35m3N10
2415C67k33J05k97J41K4j73k17K80n3k7K8j14K48l80M46m8Q6Jj94m0L47k02J35
2438B30k10K33l36q0J36j4J18k37M2J28K2j38L89n0l34j70M35k84J68j74J00L06
2460B80n75K45K55m31Q6P6J84j61J50l4J4j66o9m9K36J6M3l73L04J02J3l06J17
2483d3L36j01k89K26K44p52K15J46j62J55J08K51m57Q7Oj3j06L03P3m79K90J44
2505A82j59k24K15k8J78k65L7L1k03K69j20M2J42j91j27L36K41m77j64M28k60
2526a17K71j46J06n4k31J8K84j1k53o6J53j3R7j00J62N6m3k08J00p4K01p7J70
2549B25k70j53K81J08k77J33K41l31J8K1n3j40M0L46j12j44K64j93p9m2K60k07
$$ plain form
2391 35 -45 32 -41 218 -115 -64 28 11 -107 92 -72 -176 167 220 -172 -29 28 272 -40 88 35 -100 -143 367
2415 367 134 239 -58 83 107 -66 -283 -3 -56 -83 -55 -169 79 -301 145 97 183 184 -10 -50 297 95 230
2438 230 20 253 -83 -163 -27 -41 77 -160 -118 10 32 -106 283 233 -101 -271 164 -120 48 -126 -26 280
2460 280 -295 -50 205 -226 -140 -64 120 -41 109 75 89 -77 -146 -195 41 57 100 -273 31 133 146 -160 -43
2483 -43 293 192 -97 129 373 -379 -164 -18 -180 -25 83 334 -123 -36 -30 -43 -149 154 227 -252 38 182
2505 182 23 -201 14 -14 164 -101 -64 -33 -236 33 -87 -45 97 -94 -221 115 356 -121 -285 143 -117
2526 -117 154 8 114 60 -171 -153 131 120 -133 -199 -46 -59 38 -62 100 156 113 -95 5 -69 132 55 225
2549 225 -45 -198 83 191 -86 47 288 -43 -25 -4 -57 -197 -157 189 77 -67 197 4 -75 -117 143 -64
2571f4j16K03M9m05L69K29j00m32L36l02j86L81j1R8k62J59P2k55L24K86o10k2
2593b59J23J11r8J92j23J97l82J22K19m38M35L0k50R4P9p3M1k2m0n6K14k03L7
2616e0j52K43J17l19nL59N0m29K19j39L53n60J57K49oj12l2L59k45j33k53M49
2638A20N8P7l99L8K15o7k50P5J48j50J25j8P1K12l08K27K20l45l26J61M31l46
2660c1j27K14l2J24n57L35j26J39n0J74j10J30k10l6O8O7pk52J28M33m1m73J86
2683e4K39l53j9J92J64l18M8J64l16j8K51K11j97N2J52j94k14K33OL4P0j51R5
2706G7l94L97k53P0J6p3L91m70J61J18q4J78m8j03M6MJ35Ok24M8Q9P1p1j89M22
2731C20l13M0l03J54j8N6N4j88L12o3P6j14J89k18J35k89K73k67k5o2M60k39L5
$$ plain form
2571 -64 -180 23 72 -333 36 265 165 -267 69 -233 -419 -38 -49 49 -213 -54 18 -237 87 373 -237 -259
2593 -259 -136 -25 -123 69 -54 143 -239 -117 102 -336 99 129 -121 -27 52 -21 20 -2 -42 -98 116 -87 -50
2616 -50 -202 41 158 -161 -166 193 243 -186 33 -106 247 -313 -156 93 87 -25 -57 302 57 -76 -329 120
2638 120 178 255 -144 -106 109 42 -208 -133 15 -135 -10 -28 43 255 -53 174 394 49 -277 -116 315 -31
2660 -31 -158 56 24 148 -409 -74 -200 -61 -111 63 -47 83 -127 -163 -95 -28 -35 -287 -159 274 233 -240 -54
2683 -54 185 -168 -187 5 169 -149 -101 63 -253 -271 -20 191 -6 46 198 4 -210 23 29 63 133 -18 77
2706 77 -317 80 -173 -103 -87 -160 231 -239 -78 40 -44 134 86 -17 29 33 168 174 -50 -2 87 158 87 -102 320
2731 320 7 47 -256 -102 -120 -64 -10 -198 114 51 127 13 202 -16 119 -170 103 -164 -189 -251 209 -30 5
2754EJ23N8m3j01J16m7j85J63o1j63L89o04K17K85j69k84O0K60K81n20K89Ql9
2777C8l89J64M02Mp4j63J25J5k60K30nj00M77o52k36P25k42K02l48n3M43m80l
2800a80L92n0o77L54J56j4l91K60K6j05j19O5M29j20k05K15J33p5j77P3P7k02
2822a35J38l09L50m7J6O1L9j06l5J11K3m2k73J83J44J00l17K49j06K95l08K07
2844B38o4k04Qp0K46k75J04j26p4K02J31J49l05K45K7l04J56Pk8K35l34k1o8k96
2868d21M37K65l97J96K83k44k63P9J19K0k3l4J34l28K05o0p2k11L66r3j19L27
2890A66L3m01M4M68k98j63J49K17n01J09K7J26J65j57l9K98j52L1l34J58O1N0
2912E7l32p9O08j28l26J38L02l46j47L41J29l15j53K04K61k82j25J68j25L14k49
$$ plain form
2754 5 128 186 143 42 158 111 -74 89 28 -135 254 -350 -133 152 -17 -301 -241 19 300 -220 69 77 38
2777 38 -351 -187 215 219 145 -18 107 122 -138 92 87 -13 464 -188 -424 301 59 261 -87 -140 303 -177 -180
2800 -180 212 162 -515 -161 -5 -19 -410 -150 -124 -229 -348 -283 146 26 -179 36 169 94 -83 -10 67 -135
2822 -135 3 -306 44 -3 13 74 113 7 -28 83 106 64 -209 -26 118 218 -99 150 44 339 31 238
2844 238 174 -30 -22 -92 154 -121 -17 -143 -217 -15 116 265 -40 205 232 -72 84 91 63 298 -36 -57 -125 -421
2868 -421 16 281 -116 80 363 119 -144 -65 54 74 51 17 151 -177 28 -32 -104 -315 51 -42 -161 166
2890 166 199 -202 -158 310 12 -151 -2 215 -286 -177 -150 -24 141 -16 -55 243 91 122 -212 -54 7 57
2912 57 -275 -354 254 126 -200 -62 240 -106 -253 88 217 -98 -251 -47 214 -68 -193 -25 -150 164 -85
2933h5n8nq1K37k12L00J50k77j29K56R0k42k95N02K09l68J37k39L46j54p4J06
2955A14N9m30J96k8p1m4K91m6P3j47O5P4k20J01j20k24N04j07k53L42J9j64J94
2978A78l59K31K3j26J24Lj11l0J78q5%P0k40Q9k7M7k35Qm3K69k7n9L51l35J66
3003F0m2K37m59K32J25l9j24l9K0j58o9J41J67j76J7J64j10R8n2J67l20J77J7
3026C4J19k52J85r3p1J06Mk25J84J27J78l64N0L8L7j77K37q6j26N6nOJ67j45j79
3051a95J38L05j61j11Q7k16J92l73M32qQ7m11J7J17J19l08L70R5j20m13m7O99
3073B95k02n0m03N24j74J29k67J34k5Rr1K70Q4k30p0J97j67J93k59L1L34l64j98
3096c00J20L01j20j18L46M2m06K43j13J16j26J59k41J84Nk63Q0LK23j73L8o9M60
$$ plain form
2933 -85 -143 -148 -229 8 -204 96 246 -31 -160 96 186 -56 -351 151 360 -8 129 -110 236 82 8 114
2955 114 173 -257 -61 -89 -160 -204 87 41 114 -33 32 106 -114 -13 -133 -357 147 40 -213 129 148 -16 178
2978 178 -181 50 73 -53 71 74 -37 -67 111 26 26 96 -144 -55 -82 -35 -270 -262 -305 -36 -63 -122 229 -106 60
3003 60 18 255 -204 28 153 114 -10 -49 -29 -187 -256 -115 52 -124 -107 57 -53 45 -7 160 -160 17 34
3026 34 153 -99 86 -7 -78 28 32 -193 -9 118 296 -68 -18 20 57 -120 117 31 -95 -39 -44 -38 129 -16 -195
3051 -195 -57 248 87 -24 63 -153 39 -334 98 90 177 -234 -217 -100 19 -289 81 176 56 -357 -404 295
3073 295 93 43 -360 164 -10 119 -148 -14 -39 -30 -121 149 233 3 -67 130 -37 156 -103 -72 262 -102 -300
3096 -300 -180 121 1 -117 229 271 -135 108 -5 111 -15 144 -97 87 92 -171 -91 -88 135 -38 0 -69 391
3119C91j39n17M42k52j55pO3K38p6r7K37k65K11Rl13%L67N3l03J11J08L7k23K43
3143A63pO0j34N3l17L08Pl26J67J60l04K22j65o3N0RJ08j66J47N6k75n6N07k3
3167A81l40J06LK13k06N0J79j6Mj31j33J38N2j86K43J12l15l78M20J66l11L4L03
3190A88P5k71l69M86K12j83l92M96j37J42o4l31J29o0J45k45L44M2l09k02N41
3211B37m76K51k15L61K54o67K41M21n30p2L16K14j94l9m8P1k45J95r1k87K69J29
3233I5k10J81k21L6K76m43M35j49j29J6J84j17j72K07r0J01J16l89N05L6j79r9
3255a0K01j93po3J94j70OJ78J58J9l16j96J6L90k58l62M09M9l43M7K52j63J50
3278a2j60L87q0O0M0j80M2j37R3Q2ql29K51K9k42N32o61M5J3L83j93J65J15m31
$$ plain form
3119 391 252 -265 177 -75 -230 -237 -174 64 -12 -109 128 -137 74 83 -230 -230 137 190 -113 -2 106 143 -80 163
3143 163 156 216 82 135 -182 126 133 -193 -26 134 -170 52 -113 -176 -126 -117 -9 -175 -28 28 -247 -303 204 181
3167 181 -159 -53 -50 163 -43 7 186 170 174 43 -90 48 100 -86 157 269 -46 -424 -4 162 -149 -115 188
3190 188 263 -8 -377 109 321 138 -254 242 105 247 183 -148 -19 -79 66 -179 165 207 -102 -304 237
3211 237 -239 12 -203 158 412 -255 -14 407 -123 -195 121 335 141 102 54 125 -120 75 -16 -303 -34 95
3233 95 -115 66 -155 -119 157 -286 149 0 -129 -113 71 -46 -218 -11 -101 0 116 -273 232 268 89 -10
3255 -10 191 -2 -9 -72 122 -48 -42 136 294 313 -3 -199 -183 207 -51 -413 -4 45 -298 -251 1 -162 -12
3278 -12 -172 215 135 195 235 55 97 -40 53 135 127 -202 49 78 -164 368 -293 -248 -235 148 -45 120 235 -196
3302a96J22K07J76k18k19L17j56j37L31l60J52M5n7j73M1J05R0m4K5p6q0J58J61
3325B14k44m2L6O9P4k62J43q5N8M7l3J4j23o8L8K46J35l79m6M10k67n3J3J1J77
3350H3n0j69K77j07j40m6M0M75n27l0L73l9j54j86r4L39j03l34M94r7r2L62j72
3373A03K5l00J38K27k72Q5o6N7k83L08j69j15L90lj03K7r5J12P2m5j75K49p2k1
3397G4oj9k04J29J17p4j64R2q2J89l9r1J11P6j92P7K74j46kPm1j0j83ON7j19J12
3424e1o2K06k96l2K22n7J16j66j3J66j28K55j99o4K26j08o5j7J49J13j99O0J89
3447B45l6l43K52j96O0k4j48M72m95K44R4m7K01m61O7L61l89L40k44L32L0j44
3469A71r7j52L35m34J82j93L63l15j41M33j0l14R7K71k12J5J19jj56K11l47K05
$$ plain form
3302 -196 -74 133 309 91 -128 189 33 -104 227 -133 19 64 7 -166 -125 -20 70 26 51 -25 -105 53 214
3325 214 -30 -72 -36 33 107 -155 -12 -97 -39 8 -25 -11 -134 -202 -164 82 217 -162 -208 202 -65 -118 -105 -94 83
3350 83 33 -136 141 34 -106 -152 -112 363 -164 -194 179 140 -14 -200 -294 45 -58 -392 102 5 -87 275 103
3373 103 128 -172 -34 193 -79 6 -60 -3 -286 22 -147 -262 128 125 22 49 -46 66 138 93 -82 167 95 74
3397 74 68 49 -155 -26 91 17 -147 -55 -137 52 13 -78 33 109 -83 -6 268 122 120 127 86 76 -107 -101 -44 -163 -51
3424 -51 -113 93 -203 -235 -13 -70 46 -120 -133 33 -95 160 -39 -103 123 15 -50 -67 82 195 -4 56 245
3447 245 209 -134 118 -78 -18 -42 -190 282 -213 31 125 78 279 -182 -115 246 -143 197 -47 285 315 171
3469 171 74 -78 257 -177 5 -188 175 -140 -281 152 142 -172 -75 196 -16 -1 118 117 -39 172 -175 30
3491C0J52l20j90J31L76k15j44k68N63r4j71K66R3j83l4J02Lj25L31l60K30k80
3513a07J89n2M5m7n42L91K75j82Jj5J58q0Q7o1P6J01j53q2j34K83k95K09p1P6
3537G0j36k02N41l09k66N64j94l4k67J07kN9J15J02j05l5m9q1j76K41O0P5K17
3560B95j60k81rN15m57MmP3J55K3m58L53k47L41Q4k21K86j40r2M9l58J41J54k61
3584b15J40M9J97m69M90j91J5j67m0L0K16j52J42o3m0O6Q2K1r8k08O14l96k47
3607b24K56J01k30N4J74n7o3J86k1j82J46Q1j47k97M84j61j79K38N5q04O28o5
3629b7K33m61m9L94L2p4K12j33j57j9P4q8J12k7k9L14m29N75n40j60L20j43p3
3652a43J20J13J19m20M05OQ3m13J14o7K54J05k53j62J65mq2J46M2L9k49J15J2
$$ plain form
3491 30 182 -138 -328 -197 179 -36 -180 -448 115 21 -150 116 209 26 -8 94 97 -28 303 -57 173 -107
3513 -107 82 30 75 28 -514 -123 152 -30 -29 -44 114 34 121 60 136 237 84 2 -132 151 -144 65 -6 70
3537 70 -66 -268 273 -36 -302 262 68 34 -233 -126 -128 -69 46 148 43 8 -41 -122 -298 -57 3 78 295
3560 295 135 -146 -155 360 -97 -93 -97 -24 131 154 -304 49 -198 143 227 6 292 152 60 109 -249 -108 46 -215
3584 -215 -75 -26 171 -298 192 1 16 -151 -191 -161 55 -97 45 -18 -58 8 90 111 13 -195 419 23 -224
3607 -224 32 133 -97 -43 131 74 11 197 176 -6 140 221 74 -223 261 100 -79 159 214 -590 38 -27
3629 -27 206 -255 -304 90 122 48 260 127 -30 -49 25 -63 49 22 -7 307 -122 453 -87 -247 73 -70 -143
3652 -143 -23 90 209 -211 194 200 283 -130 -16 -83 171 276 23 -139 26 22 -60 86 128 167 -82 33 45
3675D5j83p4L21Mn7l39J14K25j76o4Q8K10J01j44k20J55J23l30R5J20L7m7l14
3698c10L01O9q4J06j67M52m01N2r5l4J72j2K14n92L32o3M3J94k54N7j8m9K9j0
3722f8K01j92N8P4L63n07K38l03L5R9J75l02K53O1m02K52l5RK3k34J29M5K5k17
3746b20N85m17k0k9L15k45M5j00K35Q3k41R3k94K77j16k0m4J49k6j20J86j19K58
3769B15l46J61k7j79Q7O3J68l5mk89L22j12p4Q7O5jKk73R1k0J94l35J29J68J55
3794B12l09j75M84l55K7L29l45L52k10J03K2j81l28N21n1M2k86J99RK11j83k25
3816a37J99J34l56L5J01j22O7n2J01K79k55N5J25j18nK4L9k45J39n7K51m90L27
3839C9p1J96k35Q7J42j65m9m1K71k62L26j84o2J62n7l10r6J92k24K22k3M29k90
$$ plain form
3675 45 -138 -212 109 113 56 -283 -169 56 -120 -184 -96 114 215 71 -149 6 129 -201 -106 14 51 4 -310
3698 -310 -9 60 -24 82 -85 367 -34 18 -77 -111 61 49 263 -329 3 -60 -17 177 -77 -20 -38 -87 -58 -68
3722 -68 133 -59 -1 73 436 -71 167 -136 -101 -2 173 -129 124 185 -217 35 0 9 32 -202 -73 -28 -3 -220
3746 -220 365 -52 -72 -101 214 -31 14 -86 149 232 -9 84 -210 67 -49 -69 -113 36 10 -110 76 -43 215
3769 215 -131 30 3 -176 -89 -26 142 107 103 -186 136 24 -50 37 102 101 103 -170 -79 -99 95 -240 -111 57 212
3794 212 -97 -272 212 -143 -116 213 -132 220 10 113 135 -46 -374 147 96 138 -148 51 60 271 88 -137
3816 -137 62 196 -160 -125 -24 -146 -79 -131 -30 249 -6 49 174 56 51 75 114 -131 8 -49 202 -288 39
3839 39 -32 164 -71 16 158 -7 -56 -97 174 -88 238 54 -8 154 97 -213 -309 -117 -341 -119 -142 287 -3
3862cJ48j61m4k20O32n21K00j49K73m3j44j31J33O2l7J17k31j04O7K10M7j10K8
3885A9Q1R5k98K96k21j79L75k15J96k0j11J4J90n13M15J44j77j13l7N0Rj23J21
3908bJ4k0P4J18j58r9M0k29L64p9O8l53l7O12j91k23K82k15r0Q9j69J27J31j25
3932g1j41J09J44k0l84L91O4p9J82j86J56o2j10j40J59j10J05j75K63o2j46O0
3954e3N3M2QJ8p4J35k94M65n55P85k98l04L3O3qj13J96J8j15J05r2j93k67K43
3978b02K5M22l87J30R5k38n0K07R2l1j12J24l38M07j44j5J31k14J34O8K8oj21
4001Eq0J25j03J91k32K52j97p8K00o2j49j8K7K1J33l8J93k59M9N5M8M6L6k93j9
4026a47J40L10k15k3q1J3L6J1j7J51p9m00L18K02j97m10K16L31J44l82j97L50
$$ plain form
3862 -3 145 -16 -60 -280 352 -169 31 -118 155 112 -32 -163 -30 32 -5 112 -119 -223 -156 54 101 -9 19
3885 19 100 195 -103 193 -28 -207 168 -47 149 129 18 32 222 -291 124 268 91 -22 -59 -9 0 -123 -2
3908 -2 12 -8 66 184 26 -73 -33 -262 102 23 91 -262 -299 313 122 -101 181 -34 -124 -35 -204 -77 54 -71
3932 -71 -212 -103 41 21 -363 28 92 13 195 9 165 103 -7 -147 12 -98 7 -168 95 33 -113 -53
3954 -53 0 42 50 68 -6 129 -165 300 -255 530 232 -72 -39 24 16 -97 99 117 2 107 15 -178 -445 -202
3978 -202 -177 245 -142 -12 83 -155 -205 2 94 63 -49 75 -263 144 0 -15 116 -98 36 104 132 126 5
4001 5 -75 50 -53 138 -94 158 -39 -117 83 21 -128 -146 -119 -98 35 -3 190 -69 -20 35 83 129 165 -128 -147
4026 -147 -7 303 88 65 -16 -3 33 44 27 178 99 -301 17 219 22 -388 -172 159 303 -79 -276 74
4048G4J2k85J79K28j42j7j72Q6J24n3l65J72J6j6l9K44J10k58j23K23K2j32P5
4071c7O9j13l4K28k30Q4M6j26J09KQ0l1j99J88N9j96lK27J9j34J67j70j01P6j09
4096a29P8J61J9J31l47k02M36j24m48O02j86k5J63K4j11l4L9N1J59l18J34l80
4118c07K10k1n5P2r0m7L32k56Q6J68j14l7K65q2j24R3j28No0j91J81N37m14j48
4142a25L21k75K25k53K01P2j18k72J73P2Q8R6q6l52J3L98M7l18K09l1j80J41N8
4165A04k41k20L51l26M60p3L4K02k62k39J50j73M31j2k05j39J33L21k18j5R5j38
4187B0k87J65O1l9J32K29k2j45l01j65O19l74k0J2n7K79K58m19M5J8N6j53K96
4210B08J69l62k66j9M12l30J38l04J39K12j92J87j81J94j8k07K15O9J8k77J83
$$ plain form
4048 74 86 -199 -20 208 66 49 -123 -37 87 34 -331 -159 -143 -159 -198 46 156 -102 -225 -2 20 -112 -37
4071 -37 32 -81 -115 113 -117 -33 13 -113 -4 -2 78 47 -152 36 95 -101 -104 123 142 8 175 5 -96 -20 -129
4096 -129 -51 110 129 260 -87 -289 147 23 -425 177 -9 -34 129 153 42 8 47 98 257 -61 73 -307
4118 -307 -97 -118 -173 -101 -191 -238 94 -162 -76 92 -22 -59 206 124 0 93 -35 -30 -90 -281 -100 437 23 -125
4142 -125 196 -79 146 -107 94 166 48 -224 -51 21 109 205 119 -233 -220 178 225 -93 116 85 -95 46 104
4165 104 -137 -357 -6 -332 128 55 89 291 29 -210 -60 -233 198 186 -19 -158 -25 296 78 63 158 20
4187 20 -267 -102 -41 -80 52 281 259 114 -187 -352 267 -107 -127 -115 -172 107 365 -54 -9 9 65 -88 208
4210 208 377 15 -251 -270 142 -188 -50 -354 -215 -3 -195 -8 -189 5 -13 -220 -5 64 82 -195 -12
4231a2O3j04m3j79L40J0j44K14J65k62l47J86M33j97l03J44K80l27L2J31K40l29
4253iJ15l24L04q6J33O4l69M28k71j5J71m9R3k82Q9J0p9J79j12L39m32J53J33
4276A83k60k4M38m36o9K65j30M8R8rl2k54L87l97K23J25l24K08O5j45J04j28J08
4299D4L5j55J57OJk71J78J96o6j27M7J5J13k33l5q1Q3rL66k59J11l43K65o5K77
4324B50k42j11J8r5J29j40K90p1N4K6q7K94m35K13j93L13j02j18K03k66L15k03
4346D2j85L3QJ58l52J04J58K31j87J43J77l45Q6j76J48l6j53p9J83j39J57K7k8
4369b5L9J44j27p8K2N8J40l53J0J74L3m4N9J8j65PL21K2l78M8P5o3J90n03K67
4394a09m7J31j48L01M5j77J57j24j25J96k21L85l90K0j1oL95k76R1O5j98k63L57
$$ plain form
4231 -12 51 -53 -96 -275 65 75 -69 145 310 48 -299 -113 320 123 -180 -36 244 -83 -51 80 320 -9
4253 -9 106 -218 86 0 133 197 -172 256 -15 -30 141 92 185 -97 -8 2 -77 102 -10 329 -103 50 183
4276 183 -77 -101 337 -99 -168 97 -33 15 113 104 72 -182 205 -192 31 156 -168 40 105 -40 64 -64 44
4299 44 79 -76 81 87 88 -183 -5 191 125 -2 45 60 173 -60 -95 -176 -93 -102 264 5 116 -227 38 -27 250
4324 250 8 -103 -85 -180 -51 -191 99 28 82 108 21 315 -120 93 -100 213 111 -7 196 -70 245 42
4346 42 -143 -110 -102 56 -296 -192 -34 197 10 153 330 -15 71 -105 43 7 -146 -225 -42 -181 -24 3 -25
4369 -25 14 158 31 -47 -25 33 173 -180 -170 4 37 -7 52 70 -95 -88 233 255 -123 -75 0 -63 127 -376 -109
4394 -109 -156 -25 -173 128 173 -4 153 29 -96 100 -121 264 -126 -106 -117 -123 272 -4 87 152 -46 -309 48
4417D8r1Q0r0j05J09MN8L14n96L62k9o2j84J13J1K20j78m9K43j24J50k52j44J09
4441h3NP6J10L7l19Q9K56Q8r5k21o2J58J54l94J54j59M38k30l08J47J68J26k70
4464a35J03J21j15m7m16N21Q0q8o5j30L40M0m98K46L05k80M3R0O9k78OM3j61J72
4488c4l8j11L22j01P1l81K02J82l06R6K17pl6M8J4j38J08o6J26k66O6J65j20R8
4512A11j69Q9K2J87l18K23j12j00k9l0P2K63l07l5K70j87k5L7L31l33K82k12p5
4535d5J1K50l14LM2K44k96P2L00o9l19J21m1K0J55m1j11j43K74k62n4m3K19N7
4559C0K34q3j28n4k38J51j24J99r8J36j49L55j21l78K66M8p6j90J72K02k89J15
4581b0J47k61O9K29j27K05j12M3m19L32l5J09m49K45K8J75r2r9J56j66K63l74
$$ plain form
4417 48 -43 37 -53 -158 -49 -45 13 327 -269 93 64 2 -182 -69 -58 162 -16 -65 178 54 204 -48 -192 -83
4441 -83 -78 -2 108 145 -174 -85 171 259 164 -57 -119 39 193 -201 -47 -206 232 2 -306 -159 9 135 -135
4464 -135 -32 89 -26 -73 -489 32 112 24 -41 -171 169 209 -289 -43 262 -18 25 115 184 -94 -88 -45 -206 -34
4488 -34 -72 -183 139 38 109 -272 -70 112 -194 -98 119 112 76 124 138 0 108 42 168 -98 -32 133 13 111
4512 111 -58 31 53 240 -78 145 33 -67 -96 -126 -54 209 -98 -133 137 -50 -75 -38 293 -40 242 30 -45
4535 -45 -34 216 -98 -95 -53 191 -105 -33 267 198 -121 0 -41 -21 134 93 -18 -161 113 -149 -203 -246 -27 30
4559 30 264 181 53 -1 -239 -88 -212 -13 -111 25 -124 231 110 -268 -2 46 -30 -220 -48 154 -135 -20
4581 -20 127 -134 -65 164 37 242 130 173 -246 86 51 160 -289 -44 -16 159 67 -32 124 -42 221 -153
4603a53J74K15k28p9J4lQ8k52M09j69k55L00o7k8L9l57L34J29r4l47M35k78J96
4626B3N9R9q9m8k23O4JJ95k15J04J34m07K30kQ4L05j99k62r2J82K7J39j01j59
4650a51J29L0P4j02l2N1m8p3J01K13k50r1j69K71P8m3k4o3P0j5j07O9j3o1K71
4675A15J89k87rj94J28m9R8j24P5m1J68j00J6k7J41l32L25j82K05J07j43lj52
4698g6J95k82M80k44l15K26k24J40L87j88Q4j19mJ6j12K68j34k72M4J4n8K45k08
4721a37L28j82m3m0J34Q8k40K15j0k80M33k39Rj40L4K45k99L33j61m5N7K91m65
4744a14J42K59j28j06j97K36o6J40k05O5K8k43J30R4j96J5P7j23L73k43J36pk29
4767a62M19m72J90O1N4n7Q6j95O6j6O1J85k80q1L6K52j30o7J82o4J36m35L28K
$$ plain form
4603 -153 21 236 8 -71 -57 -60 28 -224 185 16 -239 61 -6 -34 5 -352 -18 111 17 -330 105 -173 23
4626 23 82 181 92 44 -179 -115 -114 81 -134 -30 104 -303 -73 -75 9 314 115 -147 -239 -57 -30 109 8 -151
4650 -151 -22 8 82 -20 -52 -1 -49 -122 -21 192 -58 -149 -318 -47 31 -12 -36 -99 -29 -44 -151 -82 -95 -156 115
4675 115 304 17 8 -186 -58 -107 -9 -133 -58 -99 69 -31 -15 -42 99 -233 92 -90 115 222 79 76 -76
4698 -76 119 -163 317 73 -242 -16 -240 -100 287 99 183 64 60 76 -36 232 98 -174 -130 -116 -174 71 -137
4721 -137 191 9 -34 -74 60 148 -92 123 113 -167 266 27 36 -104 -70 175 -124 209 48 3 60 351 -114
4744 -114 28 287 159 53 -144 92 26 166 -39 26 54 -189 -59 35 -161 -146 -69 -192 181 -62 74 67 -162
4767 -162 257 -215 -25 36 90 33 119 -76 -10 -26 35 220 -60 -141 -105 147 17 -50 132 68 204 -231 97 99
4791I9j89J81p2l03L00J77j57J24j44m7J59r2q8L2j38K66J28n35L27j33J23J2
4813C0nj93k10L56j46j24M23j58o7M9N8J14k09J50r7K25k73K29o6K6J6j25m9R9
4837E3O0P9n13K53J42q7J09k57L07j36o2O1k93L65P3j58Rj89K81j72j8L16q3m60
4861c20K58j13N9J07j05o7P9P2R9j04LRN4o5J25K00o6j40n8J88k52MJ28O2m0k85
4887a68Q9J82n0j52K51l51K76k95L05J7k24K33J82o34K91N9p1m9K85k22M3K5j08
4910h6J17O9r6J00j06k04K76j80J14p8ok4J68j34P4J10J20j28l10J10K32k95K11
4933E4o1K1j39J69J1J89m58K61J78k53n3j47O31k88m80L70k13K17k54J34K36Q7
4955B12k33j99J4K5L50n31O26k32J67j92j0o1K86p9r2r3j50O4j46L60KJ9l93L40
$$ plain form
4791 99 -90 91 19 -284 16 193 36 160 16 -31 128 36 -52 -20 -158 108 236 -299 28 -105 18 30
4813 30 25 -168 -378 -22 -168 -292 131 -27 -94 -45 13 127 -82 68 -29 196 -77 152 86 112 128 3 -46 53
4837 53 113 192 -321 -68 74 -13 96 -161 146 10 -52 9 -284 81 154 -4 5 -184 97 -75 -93 223 140 -320
4861 -320 -62 -175 -116 -9 -114 -181 -102 -30 69 -35 -32 -23 31 -34 91 291 225 85 27 215 -37 -33 95 157 117 -168
4887 -168 -79 103 53 -99 152 -199 77 -218 87 104 -120 113 295 -339 -48 11 -60 -109 176 -46 -3 22 -86
4910 -86 31 100 4 104 -2 -206 70 -110 4 -74 -80 -104 64 -70 4 114 234 106 -204 -94 138 -157 54
4933 54 -7 14 -125 44 55 244 -214 47 225 -28 -81 -228 403 115 -365 5 -208 9 -245 -111 125 212
4955 212 -21 -220 -206 -181 169 -362 264 32 199 7 -3 -64 222 143 51 -42 -192 -128 -274 86 88 107 -286 54
4979E4j83L79l03J84j44K29j73J15n00M08m6q6L7n2k86M35R2j01m2j24j07Q8K96
5002A70k05P8k30l0K44k77L18m9k1R3k28K24K0j80j73J51J34k28K86j60nJ21j49
5025i6J44l94K29J15M2m2N4LJ62m3l14O3j25K64J22j24m3o1J3q5p8M3L07l14J52
5050fq8p1J32j46K29K50l48k09N26l75QK13k55J80Oj24K54k81P4J50K70l95o1
5073f7M6K5M21k65j75l5J60l61L84K5m8j82P3o5L7J11k34L08j81K7j81M9O0K10
5097A42k17q5K47k68N2L39k24J91n0o9l08J75K42n7j06K54k9j82j46K61r7P6l
5120A38N7j93K8N0j70l2K17r0k0j17K32o5o3j33K48k19J6Q6j00J17o7M2k51L74
5144H5mn5k23L10r9j72K19K46l43q0O8K09m8k91K2R8N6j35J92p3J21j61P7K58
$$ plain form
4979 54 -129 250 -53 131 -13 216 43 158 -342 66 20 -66 -29 -81 -367 68 160 59 17 -107 -214 -126 170
5002 170 -35 43 -187 -217 27 -250 68 19 -2 91 -137 87 107 -73 -246 -95 39 -189 97 -63 -68 53 -96
5025 -96 48 -346 -117 -2 40 -2 52 55 217 174 -140 -77 -202 62 184 60 17 -44 -31 -116 -194 -151 156 -158 -6
5050 -6 -94 -165 -33 -179 50 300 -48 -257 269 -106 -98 115 -140 40 46 -78 176 -105 -31 119 389 -6 -67
5073 -67 -21 4 425 160 -15 -50 110 -251 133 158 110 -72 1 -64 -27 84 -150 158 -23 4 -177 -128 -68 142
5097 142 -75 -160 87 -181 -129 210 -14 177 127 58 -250 -75 167 110 4 258 229 47 -99 162 65 141 138
5120 138 195 2 30 80 -90 -122 95 5 -15 -132 100 35 -28 -161 87 -132 -116 -30 -130 -13 -80 -38 -289 85
5144 85 81 26 -197 113 14 -158 61 307 -36 -116 -48 161 113 -178 -156 -58 -2 -137 55 -18 103 -58 19 277
5168B77j19k75J48L9k3M7k30K36l0l16N20j69j52p4J99k29K40Q6j66J60k34l2
5190i7J1L27l10N2j73K18J01J23j79k25o3p8M9L16j10k3K43l09K12K5J89m16j32
5213b49L11k30K02j28J47O5j27K5j53M8K92o7n4k9j98j16P5K87L21k41J48j49
5235A80l13J78j12L07q7l70K10l7J40r6K0k59J53j38q3K45J95j16J0J54j63k1
5257ck58N2K02Nn3J28j39j5N5qK3K0p4J43j09nK48K9mk53n1J70j69Or8J2nK78
5285A27k17P5J50kM0j90J24j33K61p9l14J77r9J0J36j18MJ27N2k41q5K97r3j02
5309i3JM0K7kk91J04M36j76j06K8J20k05J53q4R3j28k2K35k31M09l90J65j92K26
5333A17Q3j84M4k83K55L4O3j01o6N6oN8j04K75j11no9p2j02K08j85OQ2j49lK80
$$ plain form
5168 277 158 -117 31 70 47 94 -136 100 70 -246 274 105 -47 -121 78 -151 89 175 9 169 -65 -97
5190 -97 -86 241 -69 -17 -190 28 129 252 73 -152 -215 -293 -244 72 -38 -61 182 -127 85 110 299 -117 -249
5213 -249 62 -168 34 -94 53 118 -9 16 -137 -89 203 136 82 53 -145 -261 -186 101 422 181 329 180
5235 180 -133 45 -67 240 153 -217 -7 -44 96 0 20 -239 -86 -224 -307 -62 133 17 27 181 18 -3
5257 -3 -261 -209 -7 -2 -55 73 -66 -81 -26 -34 -11 9 -65 78 -31 -36 212 241 237 -16 -67 103 -66 -60 -158 -146 -151 127
5285 127 -90 -15 135 133 173 -17 107 -26 235 156 -158 19 -80 -70 66 -52 -48 79 131 -110 -195 102 9 -93
5309 -93 -92 -52 -25 -27 -318 -214 222 46 -60 -32 88 -117 36 -48 45 -83 -105 130 -101 308 -82 83 -109 117
5333 117 200 16 60 -223 32 66 129 28 -38 18 12 70 -34 241 130 125 56 -16 -118 90 -95 -89 -7 -156 -159 121
5359A21j56R5j5k66J10L52j88j64K38l23O3N0K1K3J72k3l89K12R6k13L10j43k27
5382b44M05k13Pj18K02j61L19n6J3j66j02K94k36k12K80p1j91M31p1j4n9L2k28
5405a59J86p9j50K35j3Q3j65m2R5l82L29J1P3J11k62j50L78l97K06m6L00m71M59
5428A50r6j81K47p1Oq2J4l3j7J45l35N0J52J34k29j18L19j51Q4p9J99l22K0J31
5452f3K56k84qL1K57k06J27m1L10n10J48k1o5J13n0j99M02k13J81j94R8q1K5K64
5476B77k63J0JL36n96J31M8J30l0j18N3K15o2k24J14L0M5K04m68K03M9m1J62k05
5500AJ78k12K41l13R3P9k49R9J84k70L38M9O4l45K49j05k63J24K4J9j5k0k6K51
5524A75J43l20m4o7K42K8j06j44J67j45K08k24j04L16j51N40m02O7k26J1j05K61
$$ plain form
5359 121 -35 60 45 -221 -111 241 53 -111 127 -196 -133 -83 -62 -39 133 110 -279 -67 29 -184 126 -17 -244
5382 -244 161 -52 -45 -163 39 -122 197 141 154 -12 -114 180 -56 -268 12 -59 -250 181 110 96 37 69 -159
5405 -159 27 -52 -202 33 20 103 -62 -104 -9 -391 -62 -51 22 133 -129 -279 99 -298 -92 -138 162 -309 150
5428 150 54 -127 120 49 55 -27 -13 -46 -63 82 -253 -203 -51 83 -146 -264 55 -96 -12 -91 108 -214 -194 -63
5452 -63 193 -91 -99 -68 189 -17 110 69 379 -131 17 -4 -69 44 -6 -205 197 -16 165 -29 69 -12 13 277
5476 277 14 24 25 361 -235 -104 -56 74 44 -74 -21 194 132 -92 22 52 97 301 -167 36 85 44 206 1
5500 1 179 -33 208 -105 -12 67 -182 -83 101 -169 169 218 282 -63 186 81 -182 -58 -34 -15 -30 -50 -76 175
5524 175 318 -2 -46 -113 129 157 51 -93 74 -71 137 -87 -191 125 -26 514 112 179 -47 -36 -141 120
5546A20l52M42q1k28N5M9K58l84J24M5j51M4J74j81j92Q1K92l15J78n9K99j92
5568B6J94k34k21L25o8k92M6L49j0j18J0J04j29J83l43P6l3K24J5m0N8k3j09L5
5592B5p2K16k04k7P0N3k10J24M0J31k31K47m39J92J55q3p1K98r9k12J93l32K58
5615B2k9n2o2R1K79m03j35K09K18k6j00M1j4r8K52N2l19M04k61O3q8j79K25K69
5639C59m61K7K39k09p7K16r7j40L8J23j57n0L77j05j66n0K8M3J58J30q4j61o6
5662h5Q6j52K91n4o7L7R2l05J57J4Q0k6p5J55j49K12j16N0k62K83j2k61k38O12
5686B67k92K5J95k2l16R9N2q1J21r4j3J55k8Q7k06J21j56L16p4l54N8O5l2r4J40
5711f1q0M01k47r1R9R6Qm7j38K56j44p2K82n5l20K8mJ21R3j83kO3m8oN6k2J21
$$ plain form
5546 120 -232 210 129 -99 -44 5 263 -121 3 48 -103 -59 115 -66 -258 -177 115 -200 -22 -81 218 26
5568 26 220 -14 -235 90 22 -270 -224 125 115 -3 7 111 -18 165 -178 -102 -135 89 104 64 122 99 -10 25
5592 25 -47 169 -35 -62 8 61 -149 -25 15 146 -85 162 -277 -85 70 -13 -84 214 115 -97 96 -236 22
5615 22 -7 -59 -121 -30 249 -154 -289 -80 138 112 12 53 39 -59 193 245 -74 330 69 132 44 -135 90 359
5639 359 -102 -75 164 -45 -122 94 -3 -143 -105 18 -139 -189 188 83 -83 -133 -105 -62 96 226 142 -19 -85
5662 -85 1 -151 140 86 19 56 148 -157 0 14 94 68 -7 148 -1 211 95 145 -117 166 154 -107 -345 267
5686 267 -25 0 195 173 -143 -44 8 -73 48 -46 -59 96 68 155 -51 70 -86 230 156 -198 -140 -75 -107 -201 -61
5711 -61 -141 260 13 -78 21 117 125 78 -60 196 52 -20 262 207 -113 -85 -89 32 125 -58 -60 3 -45 -51 5 -17 104
5738A04K5k16J54NJ6k29l3L25l53L61l36K80k05m8J49J90r8J05l14K12j66J16
5760D4K99m19J70k73P3k27M78j65j15M2K70l52J32M5K16m91K49K97j67m7l9J23
5782A43o9Q0j10R0k14l2K22k76qK17n9K25k59l9j23j03J48K13N7j79lk5J4mK24
$$ plain form
5738 104 129 -87 67 72 88 -141 -174 151 -202 159 -177 103 -102 -150 -1 189 91 196 -118 94 -72 44
5760 44 343 -76 94 -179 -106 -333 145 -20 -135 -93 177 -175 -43 2 218 -273 -24 273 106 59 20 143
5782 143 74 154 44 134 -80 -112 110 -166 -174 43 -16 209 -50 -89 -212 -315 -167 46 103 -76 -79 -104 -90 -94 130
$$ [...]
8191e6
##END NTUPLES=NMR FID
##END=
