##TITLE=1H_Pr Q-7
 200.13MHz, CCl4,
 8 sc
 
 7.2.2025
##JCAMPDX= 6.0         $$ Bruker NMR JCAMP-DX V2.0
##DATA TYPE= NMR FID
##DATA CLASS= NTUPLES
##ORIGIN= UXNMR, Bruker Analytische Messtechnik GmbH
##OWNER= pz
$$ XWIN-NMR		Version 3.5
$$ Fri Feb  7 13:55:01 2025 Russian Standard Time (UT+4h)  she@DPX200
##.OBSERVE FREQUENCY= 200.1313
##.OBSERVE NUCLEUS= ^1H
##.DELAY= (6, 6)
##.ACQUISITION MODE= SIMULTANEOUS
##.ACQUISITION SCHEME= undefined
##.AVERAGES= 8
##.DIGITISER RES= 18
##SPECTROMETER/DATA SYSTEM= spect
##.PULSE SEQUENCE= zg30
##.SOLVENT NAME= D2O
##.SHIFT REFERENCE= (INTERNAL, D2O, 0, 14.3821)
##AUDIT TRAIL= $$ (NUMBER, WHEN, WHO, WHERE, WHAT)
$$ ##TITLE= Audit trail, XWIN-NMR		Version 3.5
$$ ##JCAMPDX= 5.01
$$ ##ORIGIN= Bruker BioSpin GmbH
$$ ##OWNER= she
$$ F:/spectra/data/she/nmr/H-C/1/audita.txt
$$ ##AUDIT TRAIL=  $$ (NUMBER, WHEN, WHO, WHERE, WHAT)
(   1,<2025-02-07 13:52:55.40 +0400>,<she>,<DPX200>,
      <created by zg, POWCHK disabled, PULCHK disabled
       configuration hash MD5:
       00 E9 B6 7A A2 85 ED C7 34 08 36 98 17 FE 4E 26
       data hash MD5: 16K
       83 B7 0B B5 D8 03 45 A8 59 29 42 BE 20 63 23 25>)
$$ ##END=
$$ 
$$ hash MD5
$$ 52 AE 91 5F 1A 25 87 31 7C 6E 69 4C 4C EC E9 0E
##$RELAX= 
##$RELAX= 
##$RELAX= 
##$RELAX= 
##$RELAX= 
##$RELAX= 
$$ Bruker specific parameters
$$ --------------------------
##$DU= <F:/spectra>
##$EXPNO= 1
##$NAME= <H-C>
##$PROCNO= 1
##$TYPE= <nmr>
##$USER= <she>
##$AMP= (0..31)
100 100 100 100 100 100 100 100 100 100 100 100 100 100 100 100 100 100 
100 100 100 100 100 100 100 100 100 100 100 100 100 100 
##$AQSEQ= 0
##$AQ_mod= 1
##$AUNM= <au_zg>
##$AUTOPOS= <>
##$BF1= 200.13
##$BF2= 200.13
##$BF3= 200.13
##$BF4= 200.13
##$BF5= 200.13
##$BF6= 200.13
##$BF7= 200.13
##$BF8= 200.13
##$BYTORDA= 1
##$CFDGTYP= 0
##$CFRGTYP= 5
##$CHEMSTR= <none>
##$CNST= (0..31)
1 1 145 1 1 1 1 1 1 1 1 1 1 1 1 1 1 1 1 1 1 1 1 1 1 1 1 1 1 1 1 1 
##$CPDPRG= <>
##$CPDPRG1= <>
##$CPDPRG2= <>
##$CPDPRG3= <>
##$CPDPRG4= <mlev>
##$CPDPRG5= <mlev>
##$CPDPRG6= <mlev>
##$CPDPRG7= <mlev>
##$CPDPRG8= <mlev>
##$CPDPRGB= <>
##$CPDPRGT= <>
##$D= (0..31)
0 0.7 0 0 0 0 0 0 0 0 0 0.03 0 0 0 0 0 0 0 0 0 0 0 0 0 0 0 0 0 0 0 0 
##$DATE= 1738921975
##$DBL= (0..7)
120 120 120 120 120 120 120 120 
##$DBP= (0..7)
150 150 150 150 150 150 150 150 
##$DBP07= 0
##$DBPNAM0= <>
##$DBPNAM1= <>
##$DBPNAM2= <>
##$DBPNAM3= <>
##$DBPNAM4= <>
##$DBPNAM5= <>
##$DBPNAM6= <>
##$DBPNAM7= <>
##$DBPOAL= (0..7)
0.5 0.5 0.5 0.5 0.5 0.5 0.5 0.5 
##$DBPOFFS= (0..7)
0 0 0 0 0 0 0 0 
##$DE= 6
##$DECBNUC= <off>
##$DECIM= 32
##$DECNUC= <off>
##$DECSTAT= 4
##$DIGMOD= 1
##$DIGTYP= 9
##$DL= (0..7)
0 120 120 120 120 120 120 120 
##$DP= (0..7)
150 150 150 150 150 150 150 150 
##$DP07= 0
##$DPNAME0= <>
##$DPNAME1= <>
##$DPNAME2= <>
##$DPNAME3= <>
##$DPNAME4= <>
##$DPNAME5= <>
##$DPNAME6= <>
##$DPNAME7= <>
##$DPOAL= (0..7)
0.5 0.5 0.5 0.5 0.5 0.5 0.5 0.5 
##$DPOFFS= (0..7)
0 0 0 0 0 0 0 0 
##$DQDMODE= 0
##$DR= 18
##$DS= 0
##$DSLIST= <SSSSSSSSSSSSSSS>
##$DSPFIRM= 0
$$ [...]
##$SUBNAM0= <"">
##$SUBNAM1= <"">
##$SUBNAM2= <"">
##$SUBNAM3= <"">
##$SUBNAM4= <"">
##$SUBNAM5= <"">
##$SUBNAM6= <"">
##$SUBNAM7= <"">
##$SUBNAM8= <"">
##$SUBNAM9= <"">
##$SW= 18.0517328524113
##$SWIBOX= (0..15)
0 0 2 0 0 0 0 0 0 0 0 0 0 0 0 0 
##$SW_h= 3612.71676300578
##$TD= 16384
##$TD0= 1
##$TE= 0
##$TE2= 300
##$TE3= 300
##$TEG= 300
##$TL= (0..7)
0 120 120 120 120 120 120 120 
##$TP= (0..7)
150 150 150 150 150 150 150 150 
##$TP07= 0
##$TPNAME0= <>
##$TPNAME1= <>
##$TPNAME2= <>
##$TPNAME3= <>
##$TPNAME4= <>
##$TPNAME5= <>
##$TPNAME6= <>
##$TPNAME7= <>
##$TPOAL= (0..7)
0.5 0.5 0.5 0.5 0.5 0.5 0.5 0.5 
##$TPOFFS= (0..7)
0 0 0 0 0 0 0 0 
##$TUNHIN= 0
##$TUNHOUT= 0
##$TUNXOUT= 0
##$USERA1= <user>
##$USERA2= <user>
##$USERA3= <user>
##$USERA4= <user>
##$USERA5= <user>
##$V9= 5
##$VALIST= <valist>
##$VCLIST= <CCCCCCCCCCCCCCC>
##$VD= 0
##$VDLIST= <DDDDDDDDDDDDDDD>
##$VPLIST= <PPPPPPPPPPPPPPP>
##$VTLIST= <TTTTTTTTTTTTTTT>
##$WBST= 1024
##$WBSW= 4
##$XGAIN= (0..3)
0 0 0 0 
##$XL= 0
##$YL= 0
##$YMAX_a= 289806
##$YMIN_a= -268348
##$ZGOPTNS= <>
##$ZL1= 120
##$ZL2= 120
##$ZL3= 120
##$ZL4= 120
##$ABSF1= 10
##$ABSF2= 0
##$ABSG= 5
##$ABSL= 3
##$ALPHA= 0
##$AQORDER= 0
##$ASSFAC= 0
##$ASSFACI= 0
##$ASSFACX= 0
##$ASSWID= 0
##$AUNMP= <proc_1d>
##$AZFE= 0.1
##$AZFW= 0.1
##$BCFW= 1
##$BC_mod= 2
##$BYTORDP= 1
##$COROFFS= 0
##$CY= -3
##$DATMOD= 1
##$DC= 2
##$DFILT= <>
##$DTYPP= 0
##$F1P= 0
##$F2P= 0
##$FCOR= 0.5
##$FTSIZE= 0
##$FT_mod= 4
##$GAMMA= 1
##$GB= 0.15
##$INTBC= 1
##$INTSCL= 1
##$ISEN= 128
##$LB= 0.25
##$LEV0= 0
##$LPBIN= 0
##$MAXI= 10000
##$MC2= 0
##$MEAN= 0
##$ME_mod= 0
##$MI= 1.114404
##$NCOEF= 0
##$NC_proc= 0
##$NLEV= 6
##$NOISF1= 3.799351
##$NOISF2= 2.8
##$NSP= 1
##$NTH_PI= 0
##$NZP= 0
##$OFFSET= 14.38212
##$PC= 1
##$PHC0= -269.3324
##$PHC1= 14.19221
##$PH_mod= 1
##$PKNL= yes
##$PPARMOD= 0
##$PSCAL= 0
##$PSIGN= 0
##$REVERSE= no
##$SF= 200.129724274929
##$SI= 16384
##$SIGF1= 3
##$SIGF2= 2
##$SINO= 400
##$SIOLD= 16384
##$SREGLST= <1H.CDCl3>
##$SSB= 0
##$STSI= 0
##$STSR= 0
##$SW_p= 3205.1282051282
##$SYMM= 0
##$S_DEV= 0
##$TDeff= 0
##$TDoff= 0
##$TI= <>
##$TILT= no
##$TM1= 0
##$TM2= 0
##$TOPLEV= 0
##$USERP1= <user>
##$USERP2= <user>
##$USERP3= <user>
##$USERP4= <user>
##$USERP5= <user>
##$WDW= 1
##$XDIM= 8192
##$YMAX_p= 0
##$YMIN_p= 0
$$ End of Bruker specific parameters
$$ ---------------------------------
##NTUPLES= NMR FID
##VAR_NAME=  TIME,          FID/REAL,        FID/IMAG
##SYMBOL=    X,             R,               I
##VAR_TYPE=  INDEPENDENT,   DEPENDENT,       DEPENDENT
##VAR_FORM=  AFFN,          ASDF,            ASDF
##VAR_DIM=   8192,          8192,            8192
##UNITS=     SECONDS,       ARBITRARY UNITS, ARBITRARY UNITS
##FACTOR=    0.0002768,     1,               1
##FIRST=     0,             0,               0
##LAST=      2.2672688,     0,               0
##MIN=       0,             -268348,         0
##MAX=       2.2672688,     289806,          0
$$ Real data points
##PAGE= N=1
##DATA TABLE= (X++(R..R)), XYDATA
0 0 0 0 0 0 0 0 0 0 0 0 0 0 0 0 0 0 0 0 3 -8 8 -8 8 -14 16 -16 20 -24 30 -35 40 -44 52 -60 68 -77 90 -99 113
39 113 -127 142 -160 180 -199 219 -243 271 -302 333 -365 402 -442 487 -535 589 -645 709 -777
58 -777 853 -937 1027 -1126 1230 -1332 1414 -1431 1250 -403 -3289 34736 247375 -201506
72 -201506 -38828 248475 -243240 32085 200912 -255121 83908 163742 -268348 135733
82 135733 115020 -258685 170639 64840 -238336 202494 6384 -206569 225352 -46326
92 -46326 -173661 239898 -93696 -132976 238021 -132598 -85600 225095 -168458 -32583 203671
103 203671 -197232 17766 177510 -215544 63318 142572 -220187 104760 98968 -214188
113 -214188 143532 50439 -200141 175046 3141 -178247 195338 -40788 -147130 203882
123 203882 -82908 -107341 202539 -122304 -63187 193239 -154385 -19576 175141 -175686
133 -175686 22747 147692 -186977 64056 112707 -190187 102743 73787 -185620 134978
143 134978 33998 -172098 158327 -6282 -149391 173369 -46565 -119825 181477 -84936
153 -84936 -86100 182213 -118094 -49712 173284 -144211 -10902 155302 -163114 28727 130458
164 130458 -175517 67039 100474 -179932 100933 66510 -174563 128821 29281 -160328
174 -160328 150440 -9451 -138919 165354 -46812 -112271 172044 -80487 -80891 169689 -109194
185 -109194 -45802 158992 -132586 -9289 141854 -149453 26282 119192 -158980 59227
195 59227 91431 -160314 88693 59662 -154314 113737 25753 -141957 133225 -7930 -123605
206 -123605 146053 -40199 -99819 151605 -70660 -71226 150026 -97552 -39905 141775 -119332
217 -119332 -7477 126975 -134539 24403 106269 -143100 55039 80299 -144688 82501
227 82501 51155 -139289 105152 20558 -127059 121751 -10192 -108888 132023 -40022 -85885
238 -85885 135804 -67048 -59619 133018 -89775 -31456 123944 -107264 -2577 109208 -119663
249 -119663 25786 89660 -126100 52419 66768 -126595 75532 41148 -121056 94734
259 94734 14162 -109956 109164 -13327 -93737 118581 -39755 -73589 121950 -63522 -50214
270 -50214 119337 -84072 -24495 111058 -100222 2061 97374 -111409 27980 79352 -116645
281 -116645 52018 57579 -116103 72776 33504 -109606 89581 8329 -98221 101707 -16529
292 -16529 -82469 108657 -39829 -63067 109756 -60606 -40903 106001 -77980 -17709 97176
303 97176 -91446 5971 84002 -100056 28660 67267 -103794 49754 47243 -102500 68258
314 68258 25547 -96702 83091 2902 -86048 93840 -19569 -71319 99482 -41027 -52992
325 -52992 100496 -59997 -32496 96371 -75765 -10837 87579 -87468 11088 74501 -94420
336 -94420 32044 57898 -96769 51077 38867 -94172 66952 18407 -87016 79021 -2350
347 -2350 -75761 87410 -22686 -61269 91140 -41375 -44197 90429 -57586 -25253 85650
358 85650 -70883 -5524 76890 -80574 14142 64363 -86340 32897 49182 -87955 49842
369 49842 31681 -85342 64223 12843 -78564 75486 -6439 -68045 82875 -25428 -54205
380 -54205 86157 -42824 -37828 84969 -57711 -19906 79651 -69657 -1228 70618 -77995
391 -77995 17114 58166 -82322 34412 43118 -82528 49698 26213 -78682 61921 8514
402 8514 -71229 71174 -9251 -60634 76832 -26072 -47169 78754 -41538 -31778 76961
413 76961 -54751 -15117 71588 -65266 1824 63009 -72499 18872 51321 -76251 34652
424 34652 37247 -76271 48479 21504 -72706 60225 4932 -65563 68701 -11752 -55227
435 -55227 73734 -27635 -42240 74987 -41994 -27612 72436 -53926 -11696 66580 -63122
446 -63122 4404 57714 -68923 19953 46141 -71487 34121 32605 -70386 46461 18052
457 18052 -66158 56244 2820 -58954 63398 -12361 -49193 67348 -26687 -37171 68203
468 68203 -39519 -23754 65893 -50330 -9167 60533 -58812 5649 52324 -64438 20211
479 20211 41672 -66763 33527 29013 -65949 45167 15159 -61955 54399 479 -54903
490 -54903 61006 -13704 -45084 64457 -27058 -33504 64438 -38881 -20437 61505 -48582
501 -48582 -6721 55686 -55663 7029 47417 -60098 20140 37014 -61481 32098 25116 -59998
513 -59998 42216 12226 -55780 50256 -792 -49015 55756 -13760 -40070 58759 -25867
524 -25867 -29475 58889 -36670 -17540 56131 -45523 -4798 50928 -52281 7991 43259 -56423
536 -56423 20197 33554 -57771 31337 22436 -56176 40852 10287 -51965 48023 -2199 -45296
548 -45296 52900 -14233 -36693 55114 -25312 -26379 54600 -35017 -15274 51616 -42617 -3517
560 -3517 46307 -48354 8084 38985 -51608 19044 29915 -52278 28968 19631 -50743 37391
572 37391 8645 -46799 43927 -2587 -40739 48244 -13490 -32881 50433 -23832 -23573 50144
584 50144 -32793 -13228 47443 -40065 -2126 42449 -45319 8601 35497 -48242 18843 26953
596 26953 -48889 28024 17109 -47052 35640 6818 -43012 41358 -3643 -36935 44969 -13590
608 -13590 -29441 46412 -22683 -20690 45549 -30412 -11095 42558 -36599 -1230 37794 -40935
620 -40935 8500 31421 -43447 17445 23583 -43718 25673 14875 -42101 32373 5519 -38445
632 -38445 37652 -3869 -33062 41068 -13057 -26247 42392 -21444 -17977 41681 -28694 -9179
644 -9179 38887 -34535 -76 34504 -38420 8905 28216 -40357 17184 20909 -40411 24553
656 24553 12718 -38451 30437 4068 -34932 34737 -4508 -29524 37496 -12507 -23093 38138
668 38138 -19853 -15587 37306 -26129 -7700 34512 -31071 544 30345 -34435 8402 24648
680 24648 -36069 15912 17923 -36144 22570 10617 -34506 28163 2789 -31146 32138 -5239
692 -5239 -26140 34492 -12847 -20159 35165 -19553 -13084 34037 -25133 -5652 31456 -29499 1990
705 1990 27247 -32325 9354 21878 -33663 15991 15404 -33080 21586 8597 -30949 26263 1532
718 1532 -27657 29444 -5532 -22919 31336 -12057 -17383 31674 -18113 -11064 30350 -23040 -4426
731 -4426 27890 -26902 2437 23976 -29339 9120 19040 -30348 15271 13289 -29998 20522 6883
744 6883 -28184 24810 276 -24995 27835 -6296 -20489 29354 -12440 -15272 29448 -17917
756 -17917 -9246 28154 -22329 -2988 25518 -25622 3569 21721 -27594 9213 16784 -28192
768 -28192 14678 11494 -27486 19449 5521 -25454 22930 -499 -22225 25573 -6399 -18243
780 -18243 26751 -11922 -13280 26846 -16696 -7813 25392 -20674 -1966 22972 -23875 3882
792 3882 19479 -25712 9675 14980 -26220 14611 9681 -25531 18962 4036 -23528 22241 -1568
805 -1568 -20434 24444 -7035 -16466 25320 -12073 -11663 25193 -16541 -6437 23640 -20087 -1068
818 -1068 21040 -22486 4283 17609 -23998 9248 13476 -24407 13790 8650 -23394 17661 3480
831 3480 -21503 20559 -1657 -18618 22460 -6743 -14863 23486 -11390 -10468 23277 -15524 -5691
844 -5691 21843 -18913 -721 19535 -21287 4481 16396 -22825 9162 12155 -23045 13701
856 13701 7711 -22225 17186 2866 -20383 19922 -2186 -17435 21750 -6745 -13869 22409
868 22409 -11200 -9595 21900 -14933 -5126 20605 -18019 -333 18227 -20050 4432 15111
880 15111 -21317 8775 11404 -21458 12643 7061 -20690 16062 2615 -18906 18617 -1979
892 -1979 -16360 20318 -6484 -13006 21018 -10697 -8951 20793 -14293 -4772 19557 -17357 -73
905 -73 17360 -19440 4378 14239 -20481 8623 10753 -20569 12443 6679 -19881 15538 2367
918 2367 -18072 18019 -1988 -15592 19277 -6161 -12349 20051 -10060 -8610 19747 -13208 -4642
931 -4642 18442 -16087 -557 16363 -18034 3614 13747 -19033 7684 10454 -19307 11093
943 11093 6557 -18584 14221 2704 -17197 16674 -1458 -14878 18308 -5587 -11941 18929
955 18929 -9223 -8491 18880 -12526 -4736 17762 -15185 -547 16034 -17300 3483 13391 -18226
968 -18226 7335 10153 -18550 10583 6639 -17806 13484 2808 -16529 15600 -1018 -14564
980 -14564 17093 -4889 -11786 17853 -8240 -8247 17642 -11382 -4904 16737 -13867 -1250 15152
993 15152 -15840 2631 12825 -16933 6184 9965 -17295 9595 6635 -16860 12250 3076 -15646
1006 -15646 14474 -615 -13888 16102 -4298 -11260 16992 -7610 -8407 16886 -10649 -4998 16004
1019 16004 -13063 -1412 14458 -14819 2101 12378 -16012 5442 9795 -16492 8513 6709
1031 6709 -16057 11274 3304 -14916 13175 67 -13243 14744 -3371 -10936 15528 -6414
1043 -6414 -8196 15662 -9367 -5099 14930 -11618 -1816 13682 -13435 1476 11851 -14779 4750
1056 4750 9354 -15197 7602 6625 -15038 10344 3463 -14166 12397 18 -12663 13922 -3094
1069 -3094 -10397 14750 -6067 -7955 14784 -8745 -4982 14265 -10990 -1849 12893 -12583 1264
1082 1264 11275 -13775 4122 9048 -14223 6964 6372 -14080 9286 3549 -13259 11291 524
1095 524 -11783 12580 -2483 -9880 13525 -5258 -7586 13728 -7699 -4875 13286 -9913 -2114
1108 -2114 12314 -11682 913 10589 -12950 3784 8569 -13358 6412 6200 -13312 8574 3539
1121 3539 -12594 10609 670 -11267 12066 -2137 -9408 12795 -4864 -7187 13063 -7319 -4789
1134 -4789 12566 -9226 -2007 11696 -10879 537 10149 -11944 3333 8168 -12466 5699 5754
1147 5754 -12266 7961 3377 -11733 9731 657 -10536 11137 -1937 -8932 11973 -4446 -6827
1160 -6827 12192 -6881 -4532 11782 -8737 -1820 10934 -10335 592 9434 -11386 3203 7683
1173 7683 -11885 5678 5499 -11771 7666 2984 -11047 9357 512 -9822 10484 -2013 -8311
1186 -8311 11182 -4493 -6243 11419 -6541 -4105 11062 -8265 -1766 10167 -9660 728 8828
1199 8828 -10671 3157 7193 -11219 5222 5050 -10999 7318 2737 -10329 8859 347 -9232
1212 -9232 10120 -2107 -7740 10747 -4384 -5838 10864 -6407 -3713 10477 -8173 -1287 9565
1225 9565 -9504 1081 8264 -10236 3386 6583 -10750 5539 4638 -10508 7343 2343 -9790
1238 -9790 8695 -62 -8794 9832 -2216 -7200 10321 -4362 -5384 10442 -6342 -3269 10007
1251 10007 -8062 -1067 9014 -9191 1180 7979 -9945 3396 6154 -10322 5532 4239 -10109
1264 -10109 7261 1928 -9492 8716 -243 -8310 9597 -2452 -6851 10176 -4690 -5000 10153
1277 10153 -6518 -2788 9799 -8156 -689 8930 -9304 1605 7260 -9991 3667 5816 -10081
1290 -10081 5806 3755 -9993 7377 1661 -9253 8759 -557 -8030 9655 -2583 -6375 9954
1303 9954 -4788 -4733 10132 -6440 -2588 9641 -8017 -412 8473 -9123 1815 7275 -9842
1316 -9842 3923 5498 -10048 5641 3552 -9959 7336 1436 -9118 8744 -845 -7839 9654
1329 9654 -3003 -6392 10189 -4859 -4353 9915 -6739 -2377 9409 -8265 -335 8519 -9275
1342 -9275 1972 7052 -9885 3971 5369 -10033 5937 3444 -9757 7535 1259 -8910 8746
1355 8746 -871 -7781 9543 -2932 -6157 9904 -5073 -4245 9829 -6748 -2300 9187 -8157
1368 -8157 -148 8375 -9257 2110 6912 -9793 4094 5186 -9950 6112 3207 -9748 7705
1381 7705 1157 -8804 8913 -1080 -7702 9686 -3282 -6131 10009 -5172 -4093 9944 -6923
1394 -6923 -2159 9294 -8321 -16 8119 -9100 2064 6709 -9775 4214 5162 -9955 5958
1407 5958 3224 -9517 7585 1073 -8807 8781 -1089 -7561 9449 -3119 -5981 9885 -5064
1420 -5064 -4090 9657 -6815 -2065 9276 -8194 49 8149 -9310 2287 6657 -9742 4268
1433 4268 4972 -9819 6194 3026 -9554 7688 882 -8675 8805 -1206 -7474 9698 -3237
1446 -3237 -5865 9953 -5204 -4118 9665 -6825 -1919 9117 -8282 20 8092 -9159 2245
1459 2245 6697 -9734 4221 4990 -9768 5951 2967 -9375 7481 1026 -8567 8655 -1174
1472 -1174 -7332 9482 -3177 -5828 9802 -5042 -3964 9673 -6845 -1879 9029 -8015 163
1485 163 7852 -9083 2283 6656 -9697 4336 4921 -9638 5993 2906 -9171 7401 1007
1498 1007 -8545 8605 -1306 -7247 9298 -3263 -5673 9536 -5071 -3993 9332 -6632 -1856
1511 -1856 8757 -7950 153 7772 -8974 2034 6367 -9290 4064 4700 -9391 5822 2843
1524 2843 -9065 7278 941 -8223 8443 -1112 -7182 9046 -3057 -5505 9323 -5022 -3593
1537 -3593 9042 -6616 -1808 8462 -7751 182 7509 -8757 2289 6114 -9202 4078 4446
1550 4446 -9105 5712 2695 -8697 7107 716 -7886 7925 -1331 -6709 8777 -3059 -5296
1563 -5296 8910 -4935 -3493 8829 -6412 -1654 8196 -7498 329 7164 -8332 2175 5833
1576 5833 -8758 3988 4225 -8697 5548 2417 -8356 6933 550 -7543 7943 -1353 -6453
1589 -6453 8553 -3333 -4832 8703 -4882 -3120 8452 -6308 -1259 7712 -7492 738 6754
1602 6754 -8119 2409 5369 -8493 4069 3822 -8362 5604 2116 -7892 6673 318 -7073
1615 -7073 7674 -1528 -5894 8173 -3350 -4541 8270 -4837 -2863 7924 -6146 -1050 7450
1628 7450 -7147 731 6267 -7916 2532 4943 -8076 4036 3328 -8029 5700 1790 -7569
1641 -7569 6652 -165 -6661 7539 -1829 -5341 8035 -3438 -3892 7963 -4997 -2377 7733
1654 7733 -6156 -636 6863 -7138 1098 5868 -7725 2754 4548 -7939 4392 2988 -7607
1667 -7607 5606 1244 -7132 6689 -437 -6264 7354 -2103 -5112 7783 -3592 -3626 7645 -4989
1681 -4989 -1931 7250 -6170 -244 6556 -6988 1465 5400 -7558 3031 4035 -7582 4472
1694 4472 2496 -7452 5658 895 -6760 6680 -871 -5729 7288 -2520 -4413 7329 -4009 -3125
1708 -3125 7456 -5184 -1510 6845 -6331 144 6031 -6955 1718 4990 -7361 3240 3589 -7267
1722 -7267 4572 2155 -7064 5745 461 -6262 6493 -1184 -5384 7124 -2568 -4057 7445 -3994
1736 -3994 -2785 7172 -5348 -1184 6660 -6271 647 5582 -6995 2005 4556 -7215 3569 3189
1750 3189 -7179 4832 1750 -6707 5962 90 -6063 6653 -1617 -4938 7102 -2958 -3707 7109
1764 7109 -4302 -2267 6926 -5427 -712 6249 -6330 752 5414 -6900 2421 4180 -7146 3786
1778 3786 2991 -6882 5137 1346 -6467 6093 -139 -5829 6672 -1792 -4685 7013 -3253 -3313
1792 -3313 7025 -4589 -1869 6655 -5676 -313 6062 -6490 1276 4956 -7023 2756 3899 -6949
1806 -6949 4204 2405 -6792 5379 903 -6366 6147 -625 -5494 6861 -2106 -4373 7163 -3556
1820 -3556 -3088 6950 -4729 -1504 6476 -5694 9 5958 -6455 1484 4784 -6902 2889 3670
1834 3670 -7117 4292 2150 -6807 5427 694 -6209 6224 -857 -5317 6779 -2519 -4105 7021
1848 7021 -3698 -2918 6934 -4919 -1304 6399 -5825 230 5690 -6630 1785 4576 -6921 3158
1862 3158 3345 -6932 4578 1873 -6624 5446 337 -5904 6270 -1143 -4969 6750 -2516 -3827
1876 -3827 6885 -3904 -2651 6692 -4950 -1083 6262 -5897 438 5390 -6515 1889 4446 -6768
1890 -6768 3360 3135 -6809 4498 1802 -6500 5557 196 -5735 6193 -1114 -4760 6646 -2741
1904 -2741 -3590 6836 -4041 -2259 6562 -5120 -841 6127 -5973 693 5177 -6370 2056 4146
1918 4146 -6843 3337 2824 -6543 4705 1444 -6210 5530 -2 -5552 6144 -1357 -4541 6501
1932 6501 -2823 -3416 6542 -3894 -2095 6405 -5002 -671 5756 -5854 829 4967 -6369 2201
1946 2201 3919 -6539 3366 2668 -6428 4505 1260 -5996 5568 -261 -5270 6067 -1577 -4237
1960 -4237 6279 -2939 -3117 6371 -4052 -1870 6125 -5090 -368 5646 -5756 949 4754 -6189
1974 -6189 2241 3588 -6377 3542 2380 -6091 4632 1028 -5644 5389 -395 -4909 5856 -1697
1988 -1697 -4074 6087 -2940 -2835 6196 -4034 -1743 5813 -4994 -363 5245 -5492 1003 4328
2002 4328 -6078 2388 3233 -6036 3579 2067 -5871 4476 816 -5505 5128 -624 -4690 5725
2016 5725 -1854 -3744 6020 -3021 -2624 5862 -4087 -1369 5603 -4891 -113 4895 -5462 1176 4080
2031 4080 -5763 2454 3143 -5813 3511 1833 -5673 4413 489 -5081 5086 -720 -4368 5569 -1890
2046 -1890 -3381 5779 -3112 -2327 5601 -4026 -984 5216 -4840 213 4540 -5306 1359 3725 -5631
2061 -5631 2641 2621 -5500 3710 1491 -5382 4490 274 -4633 5035 -1045 -3996 5464 -2055 -3116
2076 -3116 5494 -3137 -1850 5332 -4042 -837 4930 -4760 486 4213 -5208 1518 3323 -5413 2545
2091 2545 2296 -5384 3570 1265 -4921 4313 -74 -4419 4805 -1061 -3678 5240 -2171 -2797 5228
2106 5228 -3128 -1581 5079 -4015 -508 4610 -4570 759 3981 -4991 1753 3036 -5126 2832 1968
2121 1968 -4992 3701 1004 -4620 4429 -215 -4220 4985 -1341 -3289 5066 -2354 -2383 5038 -3266
2136 -3266 -1303 4808 -4093 -184 4322 -4616 1003 3531 -4910 2001 2676 -5020 2910 1723 -4785
2151 -4785 3674 654 -4477 4336 -494 -3746 4800 -1599 -2978 5054 -2498 -2132 4895 -3504 -912
2166 -912 4610 -4081 109 4044 -4650 1213 3323 -4931 2096 2442 -4797 3103 1478 -4595 3863
2181 3863 353 -4234 4367 -852 -3433 4838 -1781 -2757 4870 -2748 -1794 4652 -3447 -675 4343
2196 4343 -4080 314 3759 -4569 1294 2941 -4741 2269 2054 -4676 3220 1132 -4412 3877 84
2211 84 -3928 4314 -910 -3227 4740 -1855 -2382 4658 -2890 -1560 4537 -3598 -494 4128 -4189 540
2227 540 3466 -4522 1477 2763 -4610 2475 1926 -4641 3288 997 -4199 3932 -176 -3674 4366
2242 4366 -1150 -3115 4496 -2152 -2250 4515 -2924 -1301 4416 -3624 -291 3935 -4074 681 3249
2257 3249 -4540 1716 2674 -4610 2545 1792 -4449 3356 653 -4126 3938 -242 -3620 4256 -1395
2272 -1395 -2991 4492 -2243 -1854 4341 -3059 -1029 4259 -3671 -193 3833 -4206 857 3217 -4423
2287 -4423 1731 2206 -4557 2695 1395 -4277 3352 514 -3914 3919 -425 -3450 4351 -1482 -2768
2302 -2768 4261 -2292 -1882 4351 -3015 -948 4181 -3622 92 3672 -4088 1063 3003 -4298 1882
2317 1882 2199 -4371 2565 1294 -4277 3440 191 -3704 3872 -659 -3142 4196 -1566 -2416 4362
2332 4362 -2278 -1527 4185 -3003 -775 3928 -3731 146 3405 -4101 1078 2760 -4179 1797 2014
2347 2014 -4143 2598 1120 -3958 3383 254 -3633 3736 -517 -3014 4084 -1569 -2317 4031 -2335
2362 -2335 -1486 4047 -3058 -666 3888 -3613 193 3304 -4032 1151 2583 -3982 1979 1885 -3978 2704
2378 2704 1091 -3833 3301 59 -3424 3721 -652 -2927 4028 -1690 -2129 3893 -2368 -1343 3841
2393 3841 -2974 -588 3433 -3560 315 3067 -3761 1211 2582 -3849 2025 1724 -3881 2655 864
2408 864 -3616 3187 59 -3320 3536 -787 -2630 3765 -1633 -1963 3815 -2341 -1232 3668 -2832
2423 -2832 -601 3282 -3256 387 2708 -3742 1163 2241 -3740 1959 1598 -3665 2645 739 -3365
2438 -3365 3224 -77 -3015 3372 -900 -2532 3668 -1624 -1832 3489 -2329 -1123 3488 -2823 -379
2453 -379 3100 -3281 484 2631 -3503 1153 2040 -3451 1976 1464 -3386 2537 429 -3118 2952 -120
2469 -120 -2760 3269 -884 -2234 3446 -1656 -1641 3325 -2266 -943 3145 -2736 -205 2792 -2964 570
2485 570 2452 -3249 1352 1792 -3273 1967 1133 -3184 2416 395 -2843 2889 -270 -2390 3044 -1034
2501 -1034 -2047 3165 -1622 -1257 3219 -2201 -728 2887 -2487 65 2541 -2921 655 2138 -3028
2516 -3028 1393 1548 -3044 1928 837 -3045 2460 221 -2707 2716 -398 -2217 3005 -1062 -1768
2531 -1768 2983 -1690 -1236 2973 -2125 -503 2704 -2507 154 2382 -2734 710 1887 -2930 1421
2546 1421 1331 -2926 1924 679 -2749 2437 150 -2393 2667 -559 -2098 2714 -1122 -1589 2777 -1719
2562 -1719 -909 2692 -2070 -323 2510 -2554 344 2156 -2738 936 1633 -2891 1402 1204 -2548 2017
2578 2017 478 -2575 2272 -86 -2140 2551 -727 -1766 2697 -1442 -1328 2737 -1740 -778 2539
2593 2539 -2249 -119 2276 -2431 451 1905 -2685 995 1437 -2650 1605 851 -2512 1891 372
2608 372 -2328 2317 -192 -2086 2593 -794 -1560 2586 -1442 -996 2589 -1785 -406 2419 -2257 110
2624 110 2109 -2464 738 1687 -2657 1177 1227 -2550 1645 596 -2574 2054 44 -2181 2390 -499
2640 -499 -1903 2516 -973 -1416 2534 -1510 -762 2397 -1942 -203 2197 -2209 91 1917 -2436 705
2656 705 1526 -2546 1335 965 -2492 1792 546 -2277 2159 -110 -1999 2327 -626 -1670 2695 -1164
2672 -1164 -1131 2504 -1596 -736 2416 -1999 -39 2279 -2245 420 1702 -2423 893 1378 -2501 1494
2688 1494 920 -2422 1758 465 -2191 2102 -146 -1951 2461 -857 -1619 2453 -1137 -1011 2331 -1624
2704 -1624 -490 2266 -2019 -208 2055 -2357 401 1758 -2409 1113 1191 -2497 1525 753 -2359 1894
2720 1894 283 -2259 2241 -264 -1888 2461 -810 -1526 2443 -1309 -1090 2402 -1806 -540 2323
2735 2323 -2054 54 2046 -2297 589 1577 -2398 899 1191 -2447 1574 768 -2439 1852 265 -2043
2751 -2043 2215 -447 -1804 2303 -777 -1357 2428 -1345 -868 2310 -1854 -466 2164 -2114 194
2766 194 2040 -2319 683 1555 -2332 1132 1158 -2374 1596 644 -2322 1860 128 -2042 2099 -307
2782 -307 -1827 2330 -821 -1326 2403 -1323 -923 2400 -1778 -333 2073 -1982 150 1888 -2217 645
2798 645 1678 -2255 1075 942 -2273 1542 607 -2252 1974 127 -1999 2206 -328 -1715 2212 -854
2814 -854 -1329 2315 -1242 -875 2347 -1709 -340 2064 -1983 157 1796 -2116 637 1494 -2193 1173
2830 1173 1005 -2329 1390 598 -2086 1846 147 -2015 2012 -248 -1585 2205 -857 -1152 2355 -1234
2846 -1234 -859 2102 -1637 -309 1989 -1714 138 1771 -2052 614 1329 -2127 993 1123 -2160 1402
2862 1402 581 -2000 1698 148 -1901 1972 -326 -1481 2020 -789 -1144 2016 -1206 -835 1925 -1608
2878 -1608 -381 1775 -1773 40 1653 -1853 577 1304 -1958 861 960 -2006 1231 575 -1890 1559
2894 1559 240 -1706 1675 -266 -1425 1937 -796 -1192 1944 -1104 -806 1816 -1388 -478 1714 -1657
2910 -1657 70 1509 -1806 552 1103 -1938 807 919 -1846 1258 599 -1798 1604 97 -1537 1705
2926 1705 -325 -1248 1821 -711 -972 1971 -1055 -745 1660 -1218 -251 1530 -1507 103 1392 -1732
2942 -1732 492 1062 -1753 848 742 -1746 1085 443 -1607 1352 57 -1449 1452 -351 -1111 1557
2958 1557 -579 -965 1700 -854 -609 1666 -1272 -260 1513 -1441 135 1363 -1497 497 968 -1506
2974 -1506 786 744 -1514 1035 367 -1424 1314 40 -1388 1405 -281 -1085 1509 -603 -757 1495
2990 1495 -873 -536 1433 -1165 -159 1323 -1371 139 1133 -1414 452 1031 -1513 704 557 -1445
3006 -1445 987 376 -1214 1197 110 -1061 1246 -218 -1039 1318 -586 -675 1377 -1001 -388 1303
3022 1303 -1167 -128 1258 -1245 108 1002 -1267 442 807 -1288 676 585 -1283 1048 302 -1254
3038 -1254 1136 -19 -1035 1135 -237 -944 1146 -556 -624 1230 -866 -330 1258 -933 -237 1052
3054 1052 -1011 234 938 -1108 471 732 -1199 801 471 -1140 878 125 -1157 1116 -7 -998
3070 -998 1155 -430 -727 1108 -601 -494 1248 -733 -375 1146 -819 35 997 -1116 272 759 -1146
3087 -1146 336 611 -1206 707 222 -965 773 131 -1017 950 -115 -839 1018 -476 -622 1155
3103 1155 -651 -432 1029 -717 -191 989 -762 45 884 -983 289 750 -1114 419 473 -1055 607
3120 607 321 -1056 776 140 -929 902 -221 -786 1022 -383 -565 1034 -523 -314 1086 -777
3136 -777 -107 952 -817 -125 883 -895 237 595 -1062 543 561 -1027 606 281 -1040 778 120
3153 120 -932 918 -265 -743 906 -339 -494 1029 -596 -349 944 -729 -90 769 -792 64 838
3170 838 -932 237 632 -971 496 456 -965 605 244 -847 730 54 -757 891 -112 -656 821
3187 821 -222 -600 1019 -396 -303 988 -583 -250 788 -911 112 801 -882 237 509 -964 568
3204 568 551 -886 596 237 -863 748 36 -813 845 -127 -644 907 -314 -595 1085 -511 -202
3221 -202 861 -664 -121 748 -873 4 684 -879 235 561 -902 413 391 -834 609 318 -917
3238 -917 678 72 -797 872 -106 -709 770 -159 -524 914 -482 -349 858 -558 -139 846 -631
3255 -631 -7 708 -738 161 648 -864 308 506 -868 432 360 -786 644 154 -768 801 -37 -554
3273 -554 802 -171 -506 817 -443 -405 846 -564 -171 760 -755 -17 720 -698 132 579 -901 255
3291 255 535 -806 467 368 -838 534 68 -723 673 62 -629 788 -204 -586 892 -281 -402 796
3309 796 -431 -350 808 -660 -253 682 -731 42 675 -776 254 552 -824 372 475 -788 444
3326 444 201 -715 724 14 -712 699 -20 -589 724 -201 -480 708 -376 -272 727 -468 -170 746
3344 746 -495 82 718 -565 197 483 -769 250 476 -720 441 196 -736 371 168 -674 552
3361 552 -14 -617 609 -140 -396 642 -316 -501 687 -475 -182 746 -504 -67 570 -737 120 469
3379 469 -677 217 447 -629 258 334 -650 417 289 -576 504 162 -646 592 0 -528 597 -252
3397 -252 -284 745 -430 -287 753 -563 -159 583 -549 99 520 -556 131 438 -633 366 417 -637
3415 -637 422 188 -562 472 69 -482 564 -23 -559 592 -82 -375 730 -325 -383 671 -413 -139
3433 -139 554 -308 -59 484 -546 105 461 -548 227 341 -571 270 180 -618 464 66 -516 491 53
3452 53 -520 533 -173 -414 442 -282 -371 718 -290 -197 530 -396 -3 526 -524 57 454 -542 130 351
3472 351 -508 349 232 -505 347 188 -447 413 7 -506 511 -44 -375 532 -71 -272 527 -151 -262 489
3492 489 -441 -46 494 -377 82 358 -521 156 337 -496 171 150 -520 369 153 -480 479 83 -405 436
3512 436 -45 -379 513 -117 -255 552 -261 -184 501 -465 27 394 -385 65 528 -495 42 292 -553 317
3532 317 236 -485 379 177 -518 472 23 -464 538 -56 -406 506 -205 -220 473 -212 -136 497 -458 -68 509
3553 509 -302 114 380 -471 124 180 -445 252 311 -467 331 63 -492 299 55 -418 395 -142 -368 541 -234
3574 -234 -369 530 -275 -185 501 -303 -174 434 -431 81 358 -552 79 238 -459 189 179 -534 296 197 -570
3595 -570 499 31 -446 570 -199 -426 416 -388 -217 622 -401 -102 468 -397 -71 458 -460 206 346
3614 346 -600 304 317 -612 308 277 -563 285 92 -571 311 75 -514 583 -278 -472 561 -284 -219 555
3634 555 -384 -226 669 -447 90 600 -483 184 463 -526 194 308 -483 392 240 -622 424 143 -503
3653 -503 550 -143 -402 672 -194 -411 494 -377 -304 565 -295 -65 512 -441 -15 586 -667 149 383
3672 383 -633 332 376 -599 296 200 -594 439 -16 -565 537 -128 -386 617 -205 -343 532 -312 -253 661
3692 661 -544 -90 568 -536 56 516 -730 122 426 -748 303 279 -669 345 259 -591 486 96
3710 96 -538 728 -18 -468 628 -210 -556 659 -347 -310 731 -470 -247 758 -579 6 536 -625
3728 -625 228 498 -677 341 414 -669 544 170 -642 598 148 -694 697 -99 -607 845 -286 -436
3746 -436 706 -422 -304 709 -486 -193 718 -688 55 576 -624 306 491 -765 200 331 -791
3763 -791 332 305 -731 635 103 -610 643 -66 -517 881 -271 -426 758 -344 -325 820 -539
3780 -539 -139 715 -552 12 718 -725 117 627 -777 314 458 -814 358 240 -796 600 49
3797 49 -708 731 -94 -648 772 -227 -547 725 -456 -431 803 -485 -327 736 -685 -21 792 -797
3815 -797 162 496 -841 276 314 -765 498 363 -770 535 213 -682 683 52 -656 820 -158 -619
3833 -619 776 -456 -337 768 -592 -249 755 -600 -80 788 -751 107 590 -845 399 442 -799
3850 -799 490 340 -784 650 97 -766 812 -1 -585 825 -133 -506 827 -353 -279 806 -495
3867 -495 -196 695 -781 -13 743 -713 137 697 -952 230 519 -666 536 266 -826 567 171
3884 171 -825 748 45 -686 743 -305 -472 812 -562 -326 730 -503 -154 786 -757 -82 741
3901 741 -717 132 557 -759 273 456 -761 494 243 -761 585 122 -626 572 -101 -694 676
3918 676 -148 -399 830 -405 -276 771 -428 -211 780 -584 6 600 -765 184 516 -715 260 438
3936 438 -783 491 280 -655 512 73 -685 737 -33 -645 660 -146 -449 739 -346 -349 611 -562
3954 -562 -151 673 -613 63 584 -663 112 509 -582 372 349 -698 437 258 -758 453 54 -614
3972 -614 503 -79 -603 722 -122 -408 757 -369 -300 659 -542 -85 626 -556 81 612 -703 79
3990 79 454 -726 233 366 -585 406 335 -609 482 133 -663 484 -135 -528 587 -277 -424 610 -423
4009 -423 -314 599 -469 -195 642 -551 20 451 -655 213 404 -683 315 324 -597 349 215 -469 552
4028 552 12 -464 571 -62 -440 548 -426 -321 651 -416 -276 606 -539 -15 564 -528 119 419 -591
4047 -591 161 430 -542 321 42 -491 448 24 -535 502 -61 -456 583 -269 -177 635 -414 -248 644
4066 644 -438 -38 615 -554 -38 491 -551 200 426 -564 352 248 -584 350 116 -621 487 -3 -597
4085 -597 412 -58 -423 615 -233 -121 580 -367 -154 576 -461 -169 454 -519 -42 400 -471 319 171
4104 171 -600 268 208 -547 559 61 -560 538 -214 -336 577 -213 -344 644 -423 -192 485 -398 -95
4123 -95 425 -612 22 434 -475 238 473 -524 332 280 -548 418 101 -518 476 -40 -530 541 -47 -417
4143 -417 671 -226 -351 507 -430 -220 562 -481 -34 454 -449 41 493 -538 241 385 -691 315
4161 315 232 -575 651 17 -567 559 -72 -440 541 -78 -369 636 -360 -155 608 -376 -138 533 -559
4180 -559 38 515 -663 120 329 -609 211 312 -544 336 176 -480 516 54 -514 575 -175 -425 603
4199 603 -202 -443 625 -422 -179 566 -489 -198 606 -501 44 536 -540 226 278 -626 366 260 -549
4218 -549 345 59 -552 519 24 -558 527 -268 -432 588 -287 -294 588 -356 -183 599 -491 -96 428
4237 428 -534 128 533 -670 205 198 -622 346 292 -650 370 135 -560 520 -78 -493 520 -141 -371 616
4257 616 -275 -281 717 -266 -153 537 -601 -14 485 -523 103 404 -649 260 337 -587 314 229 -523 343
4277 343 82 -572 505 -74 -458 652 -294 -249 612 -230 -320 696 -316 -94 621 -492 10 412 -539
4296 -539 256 449 -626 262 371 -585 360 133 -615 532 12 -517 554 12 -354 609 -253 -368 549
4315 549 -269 -271 505 -313 -15 457 -448 36 327 -608 141 396 -470 302 163 -403 416 149 -479 525
4335 525 94 -577 498 -174 -347 555 -165 -160 518 -449 -283 377 -387 -132 424 -417 31 412 -489 80
4355 80 249 -552 309 173 -548 277 235 -460 341 -15 -400 473 -86 -397 594 -196 -177 521 -335 -101 473
4376 473 -281 -147 479 -378 -52 332 -429 81 186 -497 259 111 -403 299 64 -479 361 -50 -411 435
4396 435 -92 -276 400 -302 -209 465 -266 -42 438 -489 -49 437 -422 92 325 -335 123 287 -408 255
4416 255 85 -366 357 -9 -319 307 -214 -220 392 -247 -266 534 -293 -95 371 -296 39 365 -427 157 322
4437 322 -526 67 216 -384 200 96 -424 404 47 -413 384 -34 -380 447 -184 -222 518 -282 -128 371
4457 371 -264 -103 251 -437 118 232 -331 -8 121 -296 134 116 -400 318 5 -357 379 -66 -242 323
4477 323 -193 -128 426 -202 -110 394 -308 -69 304 -354 -43 317 -349 184 184 -472 172 181 -380 206 73 -461
4499 -461 346 -51 -404 327 -36 -388 448 -182 -137 392 -249 -31 383 -366 -21 353 -294 90 247 -468
4519 -468 283 139 -376 229 100 -457 278 -24 -481 294 -59 -218 358 -78 -207 411 -135 -248 421 -314
4539 -314 -99 402 -323 76 242 -302 76 347 -438 152 100 -364 247 52 -334 315 -46 -190 425 -130
4559 -130 -296 465 -130 -158 361 -258 -154 368 -383 -11 268 -434 37 300 -453 146 172 -449 291 267 -410
4580 -410 171 -69 -338 344 -79 -315 327 -240 -400 488 -209 -188 325 -364 -57 200 -383 10 323 -467
4600 -467 115 252 -408 253 318 -426 338 51 -335 449 71 -327 453 -164 -308 473 -195 -55 498 -274
4620 -274 -139 413 -363 -62 373 -303 98 313 -458 153 358 -428 164 250 -380 324 37 -320 349 28
4640 28 -293 420 -149 -310 361 -235 -155 426 -98 -108 485 -261 -44 363 -364 127 279 -516 346 321 -480
4661 -480 320 249 -354 284 149 -333 417 -61 -313 457 -155 -293 361 -200 -215 372 -218 -76 430 -286 67
4682 67 307 -449 10 329 -501 169 201 -451 181 108 -379 335 98 -386 233 -57 -200 349 -100 -255 393
4703 393 -146 -75 418 -318 -46 374 -387 -20 359 -302 145 332 -463 172 332 -362 233 167 -300 316 16
4724 16 -394 450 -16 -353 441 -74 -295 345 -163 -209 384 -161 13 341 -328 126 238 -366 83 261 -435
4745 -435 265 181 -297 192 220 -418 332 77 -237 395 -136 -209 350 -86 -87 423 -120 -132 468 -277 -32 488
4767 488 -372 160 289 -350 176 169 -298 203 184 -308 148 108 -419 310 48 -253 329 -172 -295 371 -185
4788 -185 -192 305 -251 -53 352 -361 45 239 -320 74 249 -276 89 115 -430 305 49 -315 305 59 -410
4809 -410 285 -65 -205 217 -81 -183 257 -181 -49 268 -193 -63 225 -307 -7 238 -323 50 156 -287
4829 -287 270 84 -261 240 4 -371 288 1 -135 173 -76 -207 144 -201 -157 323 -168 -65 317 -239
4849 -239 -13 346 -354 81 120 -298 81 65 -424 180 -18 -164 274 0 -187 366 -83 -272 394 -165 -146
4870 -146 320 -148 -106 314 -182 67 264 -263 21 222 -389 144 147 -294 63 129 -292 346 20 -343 351
4891 351 -66 -232 266 -191 -113 299 -42 -49 187 -216 42 185 -246 -58 336 -393 109 101 -248 190 16 -210
4913 -210 213 39 -290 182 -36 -233 253 -58 -241 372 -178 -18 192 -207 -76 309 -257 -21 297 -286
4933 -286 146 145 -299 120 71 -360 323 143 -257 283 -66 -258 191 17 -177 306 -128 -238 347 -147 -155 219
4955 219 -264 13 260 -228 -20 184 -165 164 181 -236 199 89 -324 194 99 -339 327 8 -268 292 -160
4976 -160 -223 352 -155 -123 418 -250 -36 366 -349 -90 309 -222 63 179 -300 69 173 -279 146 113 -249
4997 -249 207 -65 -319 292 -16 -265 294 -200 -205 235 -135 -82 312 -208 -96 297 -286 -59 148 -343 180
5018 180 168 -310 82 268 -356 155 126 -306 202 16 -268 362 33 -205 280 -95 -285 368 -65 -142 273
5039 273 -302 -129 372 -360 -22 197 -355 88 208 -343 232 107 -197 211 27 -211 160 -74 -249 349
5059 349 82 -208 264 -70 -185 406 -210 -127 270 -200 -91 262 -208 -68 210 -284 14 148 -318 128
5079 128 168 -294 192 61 -296 295 -48 -267 365 11 -256 262 -163 -210 240 -151 -118 307 -157 -24 257
5100 257 -153 18 427 -227 170 147 -249 133 153 -204 167 -10 -374 253 -26 -227 215 -74 -203 271 -188
5121 -188 -188 174 -230 -132 272 -254 -25 189 -200 -53 285 -163 104 45 -223 11 111 -230 48 -22 -217 306
5143 306 20 -221 221 -30 -212 206 -159 -146 236 -208 -80 275 -211 -52 222 -227 -56 239 -283 -1
5163 -1 20 -296 61 20 -214 50 82 -176 174 122 -309 246 19 -34 251 -32 -96 277 -119 -48 225 -188 96
5186 96 216 -220 77 240 -160 11 137 -30 132 -105 -215 73 65 -142 112 -60 -258 117 -130 -102 145
5207 145 -201 -93 102 -194 -69 11 -221 78 99 -265 -9 58 -126 36 43 -209 167 110 -135 106 107 -40 108
5230 108 -170 -181 196 -65 -28 145 -156 -58 151 -78 -85 101 -154 -50 39 -117 104 15 -155 151 -35 -182
5252 -182 29 -105 -79 187 -79 -41 66 -94 -47 186 -152 -71 253 -103 73 189 7 16 173 -184 171 142
5274 142 -183 37 136 -101 203 -21 -148 83 -24 -50 109 -95 5 190 -130 27 142 -198 -21 109 -139
5295 -139 -2 -64 -198 65 87 -67 94 -53 -54 78 -51 -71 210 -83 -51 129 -76 -60 171 -158 -57 110
5317 110 -157 12 118 -47 70 148 -160 70 66 -209 43 37 -277 80 -41 -75 59 -81 -57 111 -118 -125 130
5340 130 13 93 91 -75 39 149 -130 -93 215 -163 49 87 -181 119 131 -128 243 32 -121 202 65 -91
5362 -91 69 -152 -99 158 -74 -50 137 -102 4 88 -139 18 94 -223 -66 97 -262 -11 123 -183 104 90
5384 90 -170 153 8 -84 190 -125 -100 82 -158 -101 99 -92 -74 193 -121 28 138 -32 -14 219 -158 70
5406 70 42 -153 94 182 -214 162 42 -137 94 60 -129 206 -85 -198 256 11 -191 166 -102 -14 193 -240
5428 -240 -176 200 -17 -36 152 -251 -4 193 -45 61 34 -64 75 101 -43 210 -38 -207 131 47 13 154
5450 154 -60 -94 93 -36 -95 192 -57 -137 203 -179 105 86 -184 45 103 -233 -20 44 -118 225 187 -68
5472 -68 113 68 -142 59 -52 -60 256 -41 17 54 -72 -191 202 -12 11 263 -369 -24 186 -74 138 198 -291
5495 -291 118 141 -94 200 66 -89 122 -38 -92 124 -27 -200 87 4 -201 165 -67 -50 70 -145 -78 216
5517 216 -150 -12 156 -100 -49 108 -68 16 -44 -201 95 -46 -91 142 97 -138 194 -72 -167 60 0 -123
5539 -123 136 -14 -39 59 -92 -54 76 -186 21 137 -155 -68 50 -149 -18 100 -39 155 86 -127 40 97
5561 97 -157 197 51 -109 153 30 -96 168 -238 34 55 -41 12 63 -8 -116 84 -83 19 -7 -99 92 8
5584 8 -58 -7 110 -106 -54 -74 -149 90 37 -62 71 0 54 109 -40 -145 18 -33 -55 84 -64 -3 109 -101 53
5609 53 126 -13 61 51 -184 61 173 -27 47 72 -84 96 22 -110 56 -65 -97 90 -3 -71 -16 -6 -54 57
5633 57 -71 -15 87 -37 34 83 -27 -45 34 -49 46 63 -48 41 5 -34 -17 46 -15 -28 115 -62 102 -37 -179
5658 -179 -55 16 -22 51 -130 19 175 -7 15 105 -34 -37 17 -76 46 19 -32 12 38 72 -23 23 -38 -91 -87 120 57
5685 57 48 81 -7 -37 9 41 -51 93 66 -54 2 -37 -31 -59 26 8 -19 7 -19 14 101 32 101 21 16 19 -116 -24 -17 1 26
5716 26 84 -66 82 -47 32 16 -11 45 -8 -91 -23 62 10 26 15 -53 25 86 -17 -109 -10 20 34 109 -54 63 3
5743 3 -58 22 -38 -46 -41 -12 -28 185 24 -48 28 -88 -35 118 -76 28 -16 -50 -67 3 -44 -17 -96 125 52 -33 -109 -4
5771 -4 -81 -67 -12 -62 132 -84 50 69 -12 -57 -34 55 -68 21 66 -34 -6 72 -92 -39 73 -12 18 -12 -35 -90 21
5798 21 34 8 -12 26 -43 -58 20 -45 -30 -13 53 -26 -35 7 -97 34 33 -20 44 76 -18 109 27 54 7 -32 -108 -45 70
5827 70 -119 10 -8 52 81 9 -93 16 17 52 -53 -129 -20 -17 -7 -14 84 -3 -39 49 9 -20 56 14 -22 60 93 -28
5855 -28 -71 -5 22 41 -73 58 -30 63 -55 78 -33 35 49 -12 174 -72 121 24 109 -15 36 38 -16 36 98 17
5881 17 -2 7 -140 34 3 -26 -98 56 -70 -66 -71 -29 67 -87 89 -33 -70 68 -14 -94 -85 -67 157 10 65 -120 13
5908 13 -50 -30 13 -33 75 90 39 53 76 27 -39 -27 1 -11 39 -6 13 -20 129 -1 25 57 108 21 11 9 71 8 -17
5937 -17 -36 -28 0 -121 -11 -81 -4 -49 92 -36 70 -14 -37 0 51 17 -33 63 9 -74 16 60 -61 27 90 -134 38
5964 38 4 21 50 -120 -29 97 -89 -44 78 -97 -58 28 -89 23 57 103 -2 -78 -63 34 82 22 230 71 -64
5989 -64 -31 -101 -73 -1 30 -9 -11 -25 35 -7 -84 46 57 -51 -92 8 55 127 -9 -68 41 -63 -35 89 60 -211 101
6016 101 59 -82 61 -85 36 -3 54 -19 144 27 -123 35 -38 37 -8 -41 -26 181 -95 -52 102 -65 143
6039 143 218 -104 93 -25 -134 122 59 -118 175 -37 -125 92 90 -7 44 -63 -1 -8 22 -10 60 -43 -108 120 -77
6064 -77 -111 121 -59 -22 -39 -71 -14 -1 -28 -56 36 -183 -95 27 12 61 10 -48 77 39 -5 63 -89 42 138 -54
6090 -54 14 0 -108 -146 56 4 -32 83 -40 57 -99 29 -17 35 -123 -33 5 -103 55 -45 -110 2 -20 -18 141
6115 141 38 -46 128 -40 -43 197 12 78 -32 1 -37 113 -56 127 81 -172 -8 87 -33 -58 -127 -71 16 -39
6139 -39 -71 63 -58 -42 71 -98 -108 153 -107 -85 6 12 36 114 -68 -29 131 -9 10 6 18 -2 17 -24 35 43 -70
6166 -70 77 87 -31 -21 -6 -81 68 -30 23 69 -3 -26 162 -177 -36 72 -89 15 123 -71 -101 -73 9 104 -18
6191 -18 -158 44 -23 -31 56 -53 -16 146 5 -92 134 -2 54 185 7 -155 -11 -117 -46 79 -54 51 15
6214 15 -144 77 68 -75 -14 97 -45 66 76 -99 67 29 -34 -6 25 -13 92 23 -92 34 26 41 130 -78 24
6239 24 67 -51 76 -11 -6 69 -55 -104 170 -18 -50 77 -12 -97 42 17 15 62 -52 -16 209 -81 -65 59 -125
6264 -125 -12 114 40 -14 3 26 32 96 35 72 51 -102 -82 -48 -40 110 -43 -57 53 -11 33 50 9 -17 106 -36 19
6291 19 115 -39 17 1 34 102 45 19 77 57 -64 75 -8 -121 31 68 -98 26 27 47 133 -97 -106 86 -16 -61
6317 -61 76 -121 -39 78 -57 9 -78 -4 94 -77 -87 -71 -72 -80 122 6 -71 66 27 -40 98 -86 34 92 -7 -6
6343 -6 131 22 11 23 -122 -30 -32 22 196 38 -53 92 31 -53 174 10 -29 -5 13 -52 62 -91 -4 -2 -38 -43 82
6370 82 -44 17 108 -86 -59 96 -118 51 2 -148 -3 45 -56 115 16 -49 200 48 -54 185 -30 -93 92
6393 92 -51 97 -18 -128 -41 47 -32 -86 43 -88 -43 122 -120 77 66 -79 117 -25 -96 77 -82 -114 125
6416 125 0 -35 135 92 -54 73 -49 65 109 -120 14 210 -48 18 152 -149 -43 40 -142 28 13 -172
6438 -172 150 61 -60 120 -11 -148 110 -23 -176 124 99 41 141 5 -13 149 -73 -33 140 -58 3 142
6460 142 -200 9 68 -135 153 40 -146 64 -98 -121 -19 114 -54 147 44 -198 106 -76 -40 -8 -5 -36
6482 -36 80 -124 -76 91 -99 -81 81 -165 118 64 -152 67 103 -187 67 -92 -136 29 -70 -8 140 -93 -89
6505 -89 212 -38 -36 158 15 -92 191 -71 69 38 -172 107 115 -98 3 73 -106 138 96 -92 55 37 -160
6528 -160 -68 -53 -110 159 -6 -27 147 -48 -69 113 -189 -51 94 -88 -108 81 -119 47 -12 -140 111 85 -58
6551 -58 -27 83 -72 64 -31 -29 45 157 -213 165 36 -147 149 -114 -81 145 -131 -89 267 -62 -21 97 -51
6574 -51 -19 158 -247 -10 77 -246 -69 32 -145 139 -19 -175 70 40 -113 180 -75 -146 193 -4 5 162
6596 162 -38 3 270 -181 -76 73 -101 -41 78 7 75 49 -71 167 63 -143 105 44 -102 116 36 -121
6618 -121 210 2 -29 8 -143 -37 122 -32 -67 111 -43 93 108 -139 -12 138 -199 45 116 -127 83 12
6640 12 -161 67 66 -161 87 57 -210 94 -71 -175 99 -102 -70 68 -73 -26 14 -87 -25 -2 -148 23 111
6663 111 -229 12 96 -96 104 129 -93 -1 -22 -152 61 -12 -84 95 -56 -117 56 -73 -10 145 -124 77 61
6686 61 -75 2 37 -70 72 88 -104 46 -53 -124 63 81 -84 55 -99 -123 106 -38 -57 -1 19 -41 162 -18
6710 -18 23 125 -64 -22 81 -267 53 78 -132 99 52 -51 10 20 -112 177 19 -180 105 -37 -116 -30 -47
6733 -47 -14 132 1 -12 119 -76 88 47 -84 -18 54 -129 -44 85 -164 -84 89 -20 36 57 -68 -14 -114 -74
6757 -74 31 -7 -134 150 -41 -42 174 17 -94 106 4 -27 179 -68 26 54 -176 87 27 -84 47 57 -60
6780 -60 49 -13 -107 124 -70 -102 172 -107 -94 68 -97 -67 18 -117 87 51 -68 -26 10 -152 92 12 -155 -7
6804 -7 49 -38 86 38 -92 -9 -22 -69 46 -93 14 134 -28 -102 28 -57 49 147 0 -78 112 -84 -77 72 -193
6829 -193 81 67 -91 -45 -108 -126 73 -46 -76 44 61 15 144 -2 -54 164 -28 5 172 -8 89 90 -48 -66
6853 -66 49 21 56 108 -54 59 13 -194 106 160 -187 51 -83 -20 134 -70 -28 19 -51 -129 125 -163 -84 9
6877 9 -196 -45 82 -148 17 -30 -100 -14 49 -112 189 58 -44 160 27 -123 110 -24 -25 128 -2 -176 6
6900 6 -15 2 115 16 9 196 -93 -40 28 -120 -3 121 -80 79 85 -82 98 -61 -63 77 3 -55 98 -49 -77
6925 -77 139 55 -63 39 -74 -39 -3 -143 -66 111 -137 27 142 -145 62 -17 -116 -5 -27 -88 72 41 -18 136
6949 136 -6 -73 -6 -72 -83 141 -34 -117 110 -45 40 177 -74 72 124 -93 -29 109 -155 45 3 -102 87
6972 87 -55 -101 104 -11 -145 -2 29 -16 74 -52 9 7 -53 -152 91 -13 -151 112 -82 -13 19 -104 -36 41 -147
6997 -147 176 103 -124 65 -7 -73 141 -31 -85 110 11 -22 108 -42 -27 66 -193 -123 139 23 25 34 -96 -115 12
7022 12 -176 146 128 1 28 -121 -107 115 -6 -82 128 50 -8 129 7 -15 167 -151 -22 16 -147 -55 97
7045 97 -162 52 28 -183 71 7 -207 23 56 -119 186 27 -61 139 -4 -48 160 6 31 80 -72 -40 183
7068 183 -54 12 102 -55 -43 156 -98 4 105 -131 38 86 -254 93 36 17 184 -9 -130 89 -27 -158
7090 -158 26 -6 -139 111 -99 50 131 -121 -78 48 -12 -54 107 -12 71 47 -126 41 -34 -177 83 32 -139
7113 -139 104 41 -109 107 -43 -153 57 -62 -90 47 -85 -17 142 -137 -3 24 -52 -20 64 -135 119 -65
7135 -65 -137 72 54 -187 112 -83 -128 139 -47 17 144 53 -20 110 34 101 159 -83 -16 54 -87 -55 156 -127
7159 -127 -38 58 -117 -3 100 -110 -83 -23 -113 222 -85 -174 -40 -35 2 147 -43 -227 82 -57 -92 30 -146
7182 -146 -11 124 -169 -61 78 -4 101 89 -130 74 -11 -100 165 126 -92 248 57 -41 93 -8 -159 180
7204 180 34 -25 96 -111 -11 93 -120 -42 123 -165 66 103 -81 38 135 -155 58 3 -99 84 34 -120
7226 -120 114 -14 -149 167 -68 -135 153 20 5 209 -99 35 168 -106 -115 145 -112 111 103 -105 210 -44
7248 -44 -132 -28 49 -72 183 -85 -102 94 -33 -71 26 -9 -97 75 -84 -153 153 -80 -11 64 -24 54 225 -141
7272 -141 121 173 58 149 -3 -188 92 89 -102 99 -122 -183 108 86 -64 48 -38 -107 29 -53 -2 104 -143
7295 -143 -124 125 -198 128 73 -194 33 116 -273 35 22 -123 124 44 -243 61 -20 -118 143 78 7 118 -6
7318 -6 -98 52 -102 -128 204 -71 -58 203 -151 67 108 -198 20 105 -191 109 -14 -175 83 42 -196 183 -21
7341 -21 -78 110 3 -22 115 -66 -24 183 -152 -87 170 -18 -14 145 -125 72 96 5 138 -28 -78 88 78 -139
7365 -139 12 -8 -143 263 27 -147 23 -68 -76 82 -152 -15 157 -173 18 61 -17 42 94 -116 28 202 -223
7388 -223 135 36 -127 113 101 -215 -78 26 -124 31 -36 -127 207 -55 -78 198 -88 -112 44 -45 19 39 -181
7411 -181 98 -39 -4 57 86 -53 70 -13 -79 126 -56 -214 67 36 -114 177 -88 -131 158 -115 -164 138 -155
7434 -155 -76 65 -125 55 42 -117 17 239 -82 113 115 -133 188 101 -41 131 24 -12 149 42 -162 120
7456 120 -32 9 174 -69 -131 14 -135 -142 166 -70 -84 125 -141 -22 71 -164 99 -18 -140 76 85 -133 35
7479 35 81 -75 92 19 -48 5 -180 -80 193 -77 -58 175 -22 44 148 -86 -32 104 -136 -157 83 -181 49
7502 49 7 -159 86 -133 -147 -56 -41 -82 133 33 -60 154 -149 -72 220 27 -81 120 -123 59 84 -100 135
7525 135 95 -105 8 43 -221 -42 182 -137 144 12 -123 127 31 -234 216 -12 -103 188 -42 -54 198 -104
7547 -104 -105 114 -147 -39 161 -216 161 132 -182 -12 159 -290 70 17 -43 51 24 -207 -30 13 -43 151 -74
7570 -74 -108 2 -35 -44 -1 -89 -30 129 13 60 140 -130 66 127 -229 -7 123 -16 131 75 -137 -68 -66 -44 135
7595 135 -42 -141 126 27 58 39 -121 -100 111 -58 -27 186 32 6 98 -244 97 70 -146 114 82 -136 108
7618 108 27 -151 152 -18 -73 43 -22 -124 70 30 -107 77 -84 -28 136 25 152 59 -97 58 191 20
7640 20 38 97 -93 31 38 -25 216 -39 -238 126 -56 -162 175 -35 -178 122 -97 -49 244 -108 13 207
7662 207 -133 -2 87 -121 86 110 -131 -18 60 -129 -34 37 -105 95 -11 -157 129 47 29 120 -40 -46 166
7685 166 -19 29 114 -65 -54 155 0 123 78 -285 111 91 -130 42 -56 -180 93 -38 -118 65 -51 -135 53
7708 53 100 -88 200 -67 -71 52 59 -28 52 -49 -106 109 -102 -47 61 -213 60 45 -107 -11 112 -176 111 -57
7732 -57 -117 162 21 -208 114 -20 -56 164 -7 -13 135 48 29 123 -15 -13 240 -129 94 158 -141 46 98 -172
7756 -172 42 108 -126 79 131 -161 65 13 35 218 55 -113 140 -37 -65 180 -113 -11 105 -80 -53 160
7778 160 -121 97 112 -35 69 162 -99 62 -4 -197 93 48 -31 146 6 -187 248 -20 -104 146 -158 -37
7800 -37 138 -10 5 94 -22 46 59 -154 -73 68 -141 79 49 -199 100 44 -140 115 33 -72 47 -13 -72 198
7824 198 -108 67 107 -141 -71 170 -65 -98 91 -3 111 10 -167 -16 58 -145 98 135 -73 77 21 -94
7846 -94 54 -69 -4 93 5 -67 75 44 -60 134 -74 36 126 -121 73 109 -13 11 -22 -10 39 -8 -56 48 44
7871 44 -29 63 -11 -120 -22 9 -55 55 83 -130 112 -28 -145 144 -77 -39 116 -26 -72 79 -29 6 22 -147
7895 -147 -39 77 -24 94 123 -43 106 22 -129 -25 -41 -111 79 -125 -120 132 -18 -24 -40 46 -21 121 -12 11
7919 11 107 -77 21 35 -20 27 16 -50 57 6 -30 13 55 -80 63 46 -24 116 -19 -136 73 -72 -23 57 -13 -109
7945 -109 -13 -184 3 39 -117 -3 127 34 53 89 -133 5 7 -30 -135 57 -37 45 135 -24 135 -87 -119 -26
7969 -26 -19 -30 76 5 5 123 -55 -30 20 -43 -5 13 -60 161 58 -79 -77 -154 -39 12 67 76 41 46 -208 110 -47 -12
7997 -12 62 38 -96 178 -27 -48 125 -84 9 -9 75 -136 69 175 -43 88 -24 48 50 -89 93 40 -105 114
8021 114 -76 37 68 -33 -15 -23 99 -35 19 -13 -77 -38 -100 -106 123 -9 -67 163 -126 68 77 -21 -17 -132 94 -30
8047 -30 119 -102 0 59 -98 111 -61 -152 46 -33 21 45 7 48 76 -123 34 41 -81 55 9 -104 9 52
8071 52 -150 8 30 -52 124 -92 26 105 72 6 82 201 -115 62 21 6 8 -80 -7 135 23 17 149 -42 32
8096 32 78 -163 -80 54 -14 71 39 -93 51 -15 -87 106 -72 -20 110 13 -102 -92 -110 -45 29 -2 31 162 -87
8121 -87 -20 84 -39 17 -28 -25 55 -12 -75 114 49 56 39 42 13 17 -6 18 -5 -35 23 84 42 48 118 -115 -30 85 -60 80
8151 80 11 3 72 12 -55 2 110 11 -33 47 23 52 16 89 32 20 70 88 39 12 41 60 -56 -65 -135 -34 -26 -20 59 43 -64
8182 -64 -39 77 -85 84 17 -152 163 -20 -8
8191h
$$ Imaginary data points
##PAGE= N=2
##DATA TABLE= (X++(I..I)), XYDATA
0 0 0 0 0 0 0 0 0 0 0 0 -8 8 -8 8 -16 16 -24 24 -32 40 -48 56 -64 74 -89 105 -121 139 -161 185 -211 240
32 240 -275 308 -349 392 -439 493 -551 615 -685 759 -841 931 -1030 1138 -1254 1383 -1525
49 -1525 1679 -1848 2038 -2246 2478 -2738 3030 -3362 3749 -4195 4718 -5349 6121 -7092 8353
64 8353 -10065 12529 -16378 23240 -39030 146166 -48352 -200457 289806 -138199 -118863
75 -118863 259608 -167026 -76443 257999 -217334 -12144 226536 -234578 32095 196467
85 196467 -249657 87177 144795 -245619 131412 97712 -242011 174393 46309 -223175
95 -223175 199804 -287 -195395 217535 -52005 -154649 224965 -99697 -112497 226610
105 226610 -141398 -67969 215537 -171495 -21982 192684 -193734 27892 159760 -208106
115 -208106 75715 122622 -213443 116467 82350 -206744 148595 37913 -187994 173444
125 173444 -9816 -160761 191178 -55523 -128396 199177 -95104 -91358 195416 -127562
135 -127562 -49797 181266 -154402 -5465 159705 -174604 37281 132531 -185707 75570
145 75570 99722 -185970 109162 61851 -177362 138196 20991 -161843 161377 -19442
155 -19442 -139872 176001 -57320 -110937 180993 -92330 -76269 177352 -123555 -38392 166737
166 166737 -149212 334 148683 -166505 38009 122796 -174723 73719 90790 -174857
176 -174857 105885 55533 -167523 132335 18730 -152426 151281 -17681 -129724 162385
186 162385 -52974 -101285 165735 -85030 -69413 161947 -112131 -35704 150923 -132904
196 -132904 -1177 132661 -146999 33150 108502 -154502 65173 80629 -155130 93206
206 93206 49947 -148412 116162 17213 -134618 133584 -16192 -114785 144769 -48218 -90072
217 -90072 148972 -77095 -61971 145621 -101650 -30563 135091 -120993 1809 118195
227 118195 -134276 33034 96323 -140385 61545 70207 -139274 86305 41365 -131738 106619
238 106619 11021 -117890 121236 -18650 -99215 129338 -46376 -76065 130922 -71103
248 -71103 -50027 126424 -92086 -22184 116406 -108289 5759 101268 -118973 32670 81378
259 81378 -123643 57718 58156 -122679 79884 32568 -116126 97977 5737 -103962 110682
270 110682 -20778 -86743 117823 -46013 -65608 119486 -68810 -41671 115249 -87609
280 -87609 -16261 105348 -101660 9481 90191 -110438 34250 71075 -113699 56780 49123
291 49123 -111450 75793 25474 -103612 90669 1054 -90958 100691 -22725 -74448 105917
302 105917 -44859 -54969 106061 -64310 -33169 101098 -80301 -10197 91214 -92265
312 -92265 12974 77323 -99655 35012 60069 -102201 55036 40021 -99649 72324 18063
323 18063 -92222 85705 -4454 -80342 94793 -26343 -64768 98779 -46509 -46211 97915
334 97915 -64062 -25467 92193 -78193 -3918 81915 -87977 17290 67948 -93225 36878
345 36878 50978 -93658 54468 31914 -89740 69118 11784 -81593 79770 -8386 -69782
356 -69782 86720 -27744 -54979 89208 -45541 -37700 87654 -60848 -18911 81920 -73122
367 -73122 519 72398 -81775 19765 59274 -86418 38063 43583 -86797 54196 25812
378 25812 -82939 67605 6754 -75127 77428 -12116 -63273 83264 -30135 -48921 84900
389 84900 -46647 -32120 82214 -60422 -14102 75769 -70830 4218 65620 -77580 21797
400 21797 52561 -80486 37988 37356 -79638 52189 20651 -74937 63428 3193 -66821
411 -66821 71662 -13973 -55695 76419 -30368 -42116 77463 -45087 -26641 74887 -57546
422 -57546 -9916 68699 -67050 7005 59116 -73266 23440 46855 -76022 38534 32442
433 32442 -74811 51694 16595 -69924 62122 161 -61823 69213 -16097 -50811 72906
444 72906 -31135 -37687 72915 -44377 -22743 69542 -55196 -7166 62773 -63198 8358
455 8358 53263 -68047 23259 41665 -69615 36756 28029 -68025 48269 13491 -63290 57447
467 57447 -1392 -55410 63727 -16236 -45291 67052 -30136 -33184 67198 -42431 -19413
478 -19413 64115 -52623 -4752 57904 -60240 9835 48872 -64652 23855 37635 -66056
489 -66056 36579 24736 -64098 47194 10774 -59154 55442 -3467 -51177 60702 -17192
500 -17192 -41048 62954 -29792 -29183 62238 -40734 -16388 58624 -49379 -2786 52173 -55807
512 -55807 10477 43633 -59150 22958 33146 -60040 34329 21200 -57978 43930 8480 -53265
524 -53265 51297 -4446 -46020 56162 -16958 -36822 58362 -28812 -25989 57896 -39004 -13819
536 -13819 54415 -47136 -1245 48413 -53021 11255 40104 -56098 22929 30046 -56453 33379
548 33379 18700 -54218 42016 6653 -49312 48422 -5228 -42157 52243 -16594 -33139 53592
560 53592 -27165 -22937 52730 -35981 -11879 49159 -43187 -379 43385 -48085 10798 35814
572 35814 -50801 21427 26740 -51028 30873 16407 -49146 38778 5487 -44699 44776 -5694
584 -5694 -38252 48421 -16323 -29919 49773 -26029 -20343 48717 -34394 -9807 45385 -41131
596 -41131 807 39879 -45436 11402 32570 -47591 20970 23690 -47322 29391 14047 -44908
608 -44908 36432 3984 -40409 41218 -6080 -34188 44250 -15528 -26492 44887 -23926 -17769
620 -17769 43768 -31339 -8255 40494 -37081 1222 35341 -40873 10706 28663 -42841 19494
632 19494 20828 -42827 27144 12021 -40572 33500 2899 -36546 38203 -6523 -30767 40848
644 40848 -15355 -23500 41632 -23230 -15247 40237 -29683 -6534 37067 -34860 2315 31909
656 31909 -38081 10792 25663 -39423 18853 18205 -38980 25433 10171 -36546 30705 1873
668 1873 -32537 34581 -6457 -27083 36627 -14184 -20528 37073 -21274 -13067 35676 -27027 -5201
681 -5201 32761 -31628 2801 28233 -34463 10682 22280 -35721 17924 15556 -35346 24094
693 24094 8115 -32898 29104 187 -29200 32532 -7368 -24051 34301 -14495 -17768 34249
705 34249 -20706 -10725 32801 -25797 -3397 29631 -29537 3796 25186 -31842 10709 19582
717 19582 -32566 17029 13176 -31753 22223 6415 -29286 26468 -474 -25819 29308 -7241
729 -7241 -21066 30715 -13734 -15243 30743 -19246 -8952 29242 -23950 -2361 26394 -27301
741 -27301 4369 22249 -29430 10845 17066 -30194 16754 11147 -29162 21591 4786 -26905
753 -26905 25352 -1628 -23521 27765 -7955 -18698 28803 -13682 -13344 28514 -18693 -7296
765 -7296 26863 -22645 -1200 23841 -25436 4810 19929 -27022 10623 15002 -27368 15705
777 15705 9607 -26375 19908 3776 -23976 23428 -2194 -20815 25558 -7938 -16420 26437
789 26437 -13182 -11452 26136 -17877 -5920 24628 -21749 -371 21799 -24150 5421 17891
801 17891 -25673 10915 13353 -25653 15721 8044 -24703 19631 2694 -22361 22474 -2963
813 -2963 -19135 24290 -8347 -14867 24878 -12893 -10194 24252 -17116 -5056 22539 -20362 300
826 300 19852 -22611 5451 16338 -23608 10365 11934 -23714 14673 7110 -22616 18174 2149
839 2149 -20433 20922 -3114 -17519 22713 -7982 -13595 23219 -12598 -9108 22804 -16380 -4305
852 -4305 21199 -19557 664 18678 -21668 5784 15089 -22616 10412 11040 -22488 14359 6356
865 6356 -21502 17657 1540 -19341 19977 -3310 -16266 21467 -7866 -12558 21876 -11944
877 -11944 -8470 21191 -15460 -3870 19590 -18343 788 17285 -20191 5240 14017 -21059
889 -21059 9618 10116 -21147 13542 5866 -20091 16673 1466 -18260 19074 -3181 -15386 20449
902 20449 -7640 -11830 20797 -11668 -7917 20415 -14878 -3441 18820 -17667 1069 16459
914 16459 -19547 5425 13432 -20324 9452 9701 -20271 12935 5642 -19196 15829 1285 -17128
927 -17128 17892 -2791 -14686 19159 -6863 -11320 19576 -10638 -7678 19098 -13860 -3653
939 -3653 17894 -16401 518 15662 -18136 4627 12763 -18978 8481 9375 -18981 11987 5715
952 5715 -18378 14839 1644 -16568 16903 -2453 -14263 18410 -6396 -11064 18819 -10108
964 -10108 -7636 18469 -13259 -3781 17113 -15555 331 15188 -17243 4095 12544 -18119 7625
977 7625 9462 -18162 10863 5669 -17308 13623 1992 -15826 15621 -1712 -13619 17002 -5489
990 -5489 -10758 17527 -8785 -7579 17230 -11800 -3987 16287 -14124 -253 14507 -15848 3434
1003 3434 12194 -16914 6789 9034 -17156 10000 5833 -16532 12630 2230 -15174 14736 -1368
1016 -1368 -13211 16085 -4971 -10532 16646 -8168 -7471 16503 -10896 -4192 15480 -13192 -823
1029 -823 13898 -14804 2684 11634 -15603 5982 9022 -15921 8844 5982 -15412 11445 2706
1042 2706 -14280 13477 -654 -12444 14600 -4013 -10156 15397 -7078 -7399 15235 -9808 -4329
1055 -4329 14537 -11974 -1023 13227 -13759 2295 11121 -14808 5410 8768 -15081 8313
1067 8313 5704 -14628 10704 2640 -13623 12713 -526 -11893 13887 -3643 -9600 14627 -6475
1080 -6475 -7047 14410 -8981 -4295 13748 -11042 -1176 12478 -12671 1823 10366 -13626 4724
1093 4724 8309 -13908 7330 5656 -13529 9692 2755 -12771 11368 -84 -11224 12824 -3069
1106 -3069 -9187 13468 -5890 -6862 13517 -8363 -4235 12993 -10379 -1186 11809 -12009 1640
1119 1640 10090 -12917 4460 7946 -13240 6858 5416 -13081 9137 2670 -11999 10903 -178
1132 -178 -10707 12005 -2699 -8783 12584 -5386 -6562 12632 -7626 -4020 12117 -9538 -1394
1145 -1394 10988 -10924 1253 9465 -11838 3873 7365 -12320 6335 5173 -12067 8289 2644
1158 2644 -11305 10099 -75 -9972 11145 -2598 -8341 11935 -5111 -6305 12078 -7298 -3726
1171 -3726 11439 -9154 -1188 10481 -10502 1457 8892 -11479 3838 6943 -11652 6146 4665
1184 4665 -11468 7981 2258 -10693 9645 -119 -9403 10658 -2490 -7780 11109 -4775 -5789
1197 -5789 11240 -6821 -3513 10663 -8613 -1072 9790 -9904 1380 8301 -10693 3703 6406
1210 6406 -10942 5804 4330 -10702 7785 1972 -9980 9230 -228 -8717 10204 -2779 -7122
1223 -7122 10739 -4931 -5198 10773 -6857 -2983 10214 -8542 -634 9113 -9622 1628 7800
1236 7800 -10450 3976 6091 -10594 5899 3805 -10230 7637 1642 -9395 8906 -521 -8299
1249 -8299 9950 -2884 -6671 10338 -4810 -4816 10261 -6771 -2720 9772 -8370 -480 8687 -9399
1263 -9399 1851 7398 -10135 4018 5540 -10221 5990 3566 -10097 7687 1224 -9212 8967
1276 8967 -959 -7932 9860 -3135 -6288 10155 -5211 -4389 10043 -6918 -2229 9567 -8511
1289 -8511 -34 8471 -9487 2084 7094 -9874 4234 5223 -10080 6068 3167 -9659 7474
1302 7474 1226 -8888 8800 -1183 -7731 9687 -3288 -6091 10103 -5155 -4249 10015 -7023
1315 -7023 -2163 9293 -8455 105 8264 -9458 2338 6861 -10015 4375 5041 -10078 6256
1328 6256 2982 -9704 7864 790 -8794 9080 -1483 -7531 9770 -3566 -5823 10049 -5317
1341 -5317 -3975 9974 -7171 -1908 9217 -8458 306 8041 -9422 2521 6681 -9946 4464
1354 4464 4845 -9980 6203 2844 -9549 7897 685 -8587 8933 -1424 -7381 9685 -3439
1367 -3439 -5789 10032 -5461 -3930 9890 -7142 -1668 9077 -8622 486 7975 -9543 2607
1380 2607 6584 -10002 4635 4691 -10011 6309 2586 -9604 8069 492 -8583 9110 -1595
1393 -1595 -7277 9852 -3638 -5612 10005 -5605 -3683 9690 -7073 -1716 9140 -8515 416
1406 416 7912 -9458 2567 6420 -9887 4653 4639 -9828 6401 2603 -9279 7939 501 -8419
1420 -8419 8904 -1659 -7153 9845 -3817 -5587 9913 -5537 -3492 9673 -7361 -1529 9068
1433 9068 -8690 715 7809 -9336 2742 6239 -9859 4876 4459 -9837 6515 2511 -9338
1446 -9338 8098 489 -8429 9094 -1736 -7014 9704 -3797 -5541 9822 -5596 -3535 9668
1459 9668 -7233 -1509 8917 -8407 584 7668 -9245 2598 6279 -9682 4663 4485 -9768
1472 -9768 6456 2567 -9177 7859 384 -8363 9003 -1687 -6932 9539 -3828 -5332 9808
1485 9808 -5569 -3423 9466 -7213 -1439 8807 -8514 722 7639 -9273 2775 6176 -9700
1498 -9700 4706 4333 -9418 6308 2372 -8956 7772 405 -8081 8699 -1748 -6813 9224
1511 9224 -3563 -5187 9549 -5383 -3275 9279 -6937 -1448 8391 -8026 548 7420 -9005
1524 -9005 2678 6033 -9345 4599 4200 -9298 6056 2239 -8808 7566 294 -7862 8494
1537 8494 -1770 -6688 9169 -3725 -5110 9333 -5422 -3196 8978 -6800 -1162 8225 -8106
1550 -8106 708 7131 -8715 2743 5734 -9101 4471 3895 -9003 5996 2091 -8475 7354
1563 7354 219 -7613 8218 -1703 -6257 8643 -3631 -4668 8832 -5190 -2952 8533 -6612
1576 -6612 -1099 7779 -7804 752 6785 -8440 2769 5318 -8819 4606 3741 -8533 6006
1589 6006 1934 -8092 7246 -64 -7022 8030 -1909 -5888 8498 -3773 -4176 8624 -5219
1602 -5219 -2538 8292 -6549 -830 7484 -7599 1106 6246 -8160 2849 4982 -8399 4433
1615 4433 3439 -8359 5864 1490 -7593 7002 -241 -6727 7770 -2048 -5416 8212 -3711 -3933
1629 -3933 8245 -5265 -2164 7836 -6402 -418 7009 -7366 1340 5952 -7886 2959 4473
1642 4473 -8123 4692 2759 -7894 5978 1061 -7190 7015 -708 -6159 7651 -2371 -4986
1655 -4986 7949 -3874 -3534 7916 -5372 -1903 7331 -6465 -90 6502 -7266 1620 5470 -7665
1669 -7665 3190 3945 -7743 4739 2520 -7610 5876 764 -6780 6827 -919 -5893 7408
1682 7408 -2532 -4613 7752 -4110 -3207 7591 -5512 -1366 6976 -6343 222 6159 -7279 1818
1696 1818 4993 -7516 3427 3587 -7409 4851 2035 -7056 6009 304 -6399 6865 -1317 -5302
1710 -5302 7374 -2770 -4119 7394 -4363 -2632 7206 -5403 -1003 6629 -6480 582 5691
1723 5691 -7046 2285 4561 -7333 3699 3058 -7358 5088 1612 -6829 5996 63 -6095 6837
1737 6837 -1743 -4957 7190 -3113 -3688 7232 -4467 -2156 6950 -5704 -580 6321 -6534 1020
1751 1020 5404 -7045 2713 4090 -7277 4179 2744 -7019 5122 1198 -6562 6115 -439 -5769
1765 -5769 6806 -1980 -4652 7111 -3419 -3270 7093 -4680 -1761 6631 -5764 -261 5945 -6514
1779 -6514 1234 5060 -6966 2868 3663 -6991 4218 2237 -6816 5389 823 -6233 6352 -858
1793 -858 -5426 6788 -2415 -4319 7266 -3731 -2925 6977 -5005 -1519 6474 -5913 228 5761
1807 5761 -6599 1761 4767 -7041 3134 3389 -7095 4492 1949 -6790 5481 509 -6079 6445
1821 6445 -1056 -5057 6817 -2628 -3818 7101 -3917 -2676 6819 -4996 -1062 6371 -6007 418
1835 418 5527 -6634 1817 4469 -7014 3369 3175 -6968 4573 1722 -6495 5689 263 -5856
1849 -5856 6422 -1326 -4936 6845 -2808 -3725 6911 -4141 -2309 6751 -5281 -848 6130 -6218
1863 -6218 713 5233 -6688 2202 4155 -6927 3645 2879 -6717 4739 1465 -6447 5742 -86
1877 -86 -5637 6483 -1515 -4667 6741 -2865 -3521 6803 -4220 -2163 6599 -5212 -550 5976
1891 5976 -6152 920 5087 -6672 2315 3924 -6827 3593 2733 -6729 4924 1233 -6202 5627
1905 5627 -223 -5516 6362 -1693 -4468 6738 -3122 -3366 6661 -4296 -1813 6271 -5323 -386
1919 -386 5776 -6071 969 4957 -6625 2375 3777 -6609 3771 2627 -6514 4752 1100 -6084
1933 -6084 5591 -443 -5284 6350 -1726 -4154 6579 -3026 -2984 6381 -4344 -1681 6224 -5227
1947 -5227 -319 5559 -6014 1166 4565 -6448 2579 3553 -6523 3780 2240 -6224 4864 771
1961 771 -5722 5686 -653 -5000 6175 -1914 -4039 6260 -3303 -2655 6196 -4325 -1469 5942
1975 5942 -5102 12 5284 -5943 1361 4361 -6151 2681 3270 -6283 3741 2067 -5962 4888
1989 4888 615 -5456 5500 -792 -4675 5957 -2076 -3686 6308 -3240 -2549 6093 -4254 -1275
2003 -1275 5650 -5118 136 4950 -5746 1482 4052 -5951 2593 2962 -5959 3987 1859 -5736
2017 -5736 4574 439 -5176 5323 -949 -4300 5856 -2160 -3295 5977 -3330 -2143 5743 -4361
2031 -4361 -977 5450 -5072 378 4808 -5667 1566 3757 -5787 2746 2738 -5659 3705 1511 -5383
2046 -5383 4621 290 -4869 5210 -996 -4031 5609 -2227 -3099 5665 -3243 -1960 5333 -4264 -647
2061 -647 5075 -4971 626 4409 -5419 1723 3390 -5645 2913 2442 -5498 3945 1228 -5030 4600
2076 4600 -96 -4608 5051 -1315 -3684 5435 -2420 -2658 5516 -3272 -1636 5158 -4207 -437 4580
2091 4580 -4864 673 3938 -5174 1880 3056 -5284 2883 2000 -5158 3837 824 -4804 4530 -313
2106 -313 -4232 5035 -1523 -3308 5233 -2576 -2313 5189 -3454 -1260 4858 -4310 -75 4306 -4851
2121 -4851 1023 3530 -5221 2038 2837 -5239 3036 1568 -4899 3906 625 -4470 4430 -535 -3964
2136 -3964 4768 -1704 -2984 5082 -2622 -2158 4991 -3449 -956 4599 -4141 191 4067 -4700 1209
2151 1209 3219 -4991 2199 2389 -4916 3183 1313 -4676 3845 86 -4267 4429 -854 -3530 4686
2166 4686 -1822 -2675 4878 -2902 -1700 4779 -3664 -682 4329 -4294 317 3824 -4660 1383 2996
2181 2996 -4926 2332 2017 -4788 3291 1117 -4432 3981 74 -3888 4459 -1019 -3191 4743 -1952
2196 -1952 -2334 4767 -2956 -1475 4510 -3605 -371 4127 -4174 618 3535 -4623 1706 2819 -4796
2211 -4796 2515 1825 -4611 3398 780 -4151 4042 -245 -3869 4400 -1305 -3057 4597 -2249 -2111
2226 -2111 4545 -3033 -1056 4319 -3743 -122 3875 -4142 857 3281 -4524 1723 2410 -4661 2723
2241 2723 1567 -4451 3480 595 -4171 4064 -510 -3514 4420 -1440 -2793 4549 -2319 -2000 4469
2256 4469 -3109 -965 4212 -3743 -9 3693 -4250 998 3072 -4478 1980 2296 -4543 2767 1364
2271 1364 -4349 3525 394 -3946 3976 -665 -3285 4370 -1624 -2615 4574 -2451 -1693 4330 -3172
2286 -3172 -768 4039 -3817 238 3603 -4150 1155 2876 -4412 2075 2149 -4398 2863 1314 -4138
2301 -4138 3546 310 -3734 3997 -578 -3164 4268 -1628 -2442 4342 -2502 -1527 4332 -3037 -583
2316 -583 3915 -3602 419 3492 -4115 1262 2740 -4344 2105 1913 -4340 2846 1108 -3980 3473
2331 3473 72 -3586 3973 -817 -3000 4152 -1812 -2176 4126 -2547 -1377 3988 -3085 -560 3726
2346 3726 -3785 417 3230 -4069 1339 2524 -4180 2154 1829 -4098 2853 915 -3728 3410 -34
2361 -34 -3501 3891 -856 -2786 4053 -1699 -2112 4045 -2525 -1307 3906 -3248 -460 3547 -3683 612
2377 612 3090 -3999 1295 2466 -4064 2224 1595 -4008 2869 751 -3737 3397 -141 -3396 3739
2392 3739 -965 -2571 3901 -1803 -1949 3975 -2472 -1026 3744 -3088 -196 3347 -3617 580 2852
2407 2852 -3837 1406 2235 -3800 2105 1556 -3748 2718 657 -3547 3297 -164 -2964 3575 -937
2422 -937 -2497 3810 -1785 -1718 3712 -2475 -955 3512 -2976 -209 3275 -3380 600 2636 -3710 1490
2438 1490 1925 -3592 2102 1301 -3490 2761 569 -3365 3227 -255 -2815 3536 -993 -2280 3619
2453 3619 -1830 -1652 3570 -2405 -795 3187 -2877 -39 2860 -3240 768 2490 -3473 1480 1859
2468 1859 -3469 2034 1085 -3293 2545 405 -3073 3051 -405 -2667 3265 -1104 -2097 3415 -1784
2483 -1784 -1299 3330 -2323 -723 3111 -2751 30 2545 -3024 879 2195 -3236 1504 1681 -3406
2498 -3406 2115 903 -3116 2595 257 -2683 2892 -480 -2344 3184 -1222 -1733 3124 -1821 -1208
2513 -1208 2981 -2225 -481 2820 -2627 89 2429 -2915 952 1840 -2965 1475 1290 -3165 2250
2528 2250 774 -2902 2356 75 -2435 2826 -654 -2065 2938 -1287 -1404 2860 -1896 -958 2727
2543 2727 -2280 -343 2581 -2710 340 2137 -2837 1053 1714 -2832 1558 1243 -2873 2147 599
2558 599 -2594 2414 -115 -2241 2834 -723 -1768 2728 -1345 -1218 2763 -1817 -766 2667 -2300
2573 -2300 -126 2296 -2499 566 1918 -2698 1205 1509 -2773 1576 835 -2736 2097 438 -2356
2588 -2356 2414 -282 -2054 2669 -907 -1495 2615 -1414 -1117 2658 -1923 -410 2546 -2210 122
2603 122 2051 -2529 638 1666 -2554 1210 1248 -2628 1779 639 -2401 2164 111 -2305 2479 -514
2619 -514 -1813 2517 -1052 -1483 2633 -1538 -810 2431 -1992 -281 2222 -2286 296 2001 -2469 896
2635 896 1423 -2469 1428 999 -2495 1758 446 -2405 2137 -65 -2129 2367 -582 -1644 2570 -1147
2651 -1147 -1176 2528 -1669 -576 2293 -2108 -124 2128 -2287 448 1767 -2509 1080 1328 -2397 1370
2667 1370 888 -2338 1830 411 -2260 2178 -181 -1957 2457 -797 -1545 2603 -1235 -1110 2480 -1658
2683 -1658 -483 2295 -2064 -18 2021 -2340 585 1727 -2365 1102 1128 -2381 1653 850 -2367 1890
2699 1890 246 -2167 2114 -358 -1716 2444 -909 -1450 2540 -1405 -870 2373 -1896 -353 2143
2714 2143 -2086 167 1880 -2337 620 1543 -2462 1210 1163 -2360 1713 568 -2362 1910 280 -2092
2730 -2092 2161 -473 -1666 2425 -866 -1259 2422 -1465 -872 2466 -1781 -327 2252 -2157 247
2745 247 2042 -2271 547 1464 -2444 1182 1001 -2424 1620 591 -2254 2024 69 -2033 2219 -419
2761 -419 -1610 2391 -943 -1243 2441 -1394 -630 2308 -1938 -301 2146 -2109 160 1839 -2209 765
2777 765 1511 -2314 1261 1045 -2336 1626 599 -2158 1958 -32 -2004 2355 -414 -1652 2352 -931
2793 -931 -1251 2431 -1448 -779 2187 -1699 -255 2051 -2038 191 1779 -2300 857 1407 -2332 1162
2809 1162 923 -2195 1576 494 -2271 1970 -30 -1849 2131 -471 -1658 2292 -1053 -1142 2372 -1280
2825 -1280 -779 2241 -1717 -235 1922 -2019 365 1800 -2158 718 1323 -2322 1135 906 -2166 1562
2841 1562 510 -1968 1835 19 -1827 2056 -391 -1462 2192 -895 -1075 2148 -1228 -727 2071
2856 2071 -1615 -238 1822 -1822 187 1734 -2034 676 1261 -2120 1069 849 -2073 1543 521
2871 521 -1953 1732 -49 -1848 1970 -561 -1399 2102 -866 -1109 1989 -1278 -586 1972 -1464 -225
2887 -225 1765 -1723 224 1538 -1900 667 1188 -2049 937 768 -1901 1375 541 -1873 1636 0
2903 0 -1658 1721 -471 -1246 1928 -806 -974 1982 -1081 -514 1832 -1414 -198 1712 -1572 151
2919 151 1491 -1803 666 1125 -1937 965 738 -1716 1191 191 -1693 1474 41 -1500 1664 -255
2935 -255 -1151 1656 -694 -923 1761 -1170 -623 1794 -1278 -203 1489 -1549 143 1267 -1681 604
2951 604 1151 -1600 844 670 -1716 1066 317 -1519 1452 60 -1446 1610 -423 -1142 1636 -744
2967 -744 -732 1609 -1056 -409 1512 -1235 -114 1490 -1417 199 1182 -1560 614 978 -1549 876
2983 876 685 -1453 1000 262 -1495 1274 -48 -1149 1452 -399 -893 1506 -617 -767 1473 -973
2999 -973 -354 1370 -1146 -79 1344 -1412 287 1028 -1459 541 841 -1396 797 564 -1455 1026
3015 1026 275 -1226 1177 -182 -1091 1246 -429 -882 1348 -573 -636 1426 -937 -380 1266 -1040
3031 -1040 -106 1070 -1177 366 955 -1255 560 766 -1294 768 474 -1204 885 236 -1073 1122
3047 1122 -62 -993 1257 -406 -781 1298 -767 -579 1225 -846 -273 1180 -958 6 982 -1264
3063 -1264 129 743 -1205 525 626 -1292 821 287 -1096 891 124 -1078 1055 -63 -944 1123
3079 1123 -375 -747 1190 -632 -423 1014 -772 -170 1142 -923 117 1006 -1082 300 637 -1019
3095 -1019 542 483 -1037 739 337 -1073 846 1 -920 812 -304 -813 1151 -237 -728 1057 -696
3112 -696 -313 1042 -751 -124 965 -1054 107 803 -970 373 451 -1037 487 565 -923 795 279
3129 279 -894 898 -29 -806 980 -158 -740 964 -554 -556 1078 -614 -313 934 -731 -85 909
3146 909 -902 179 711 -950 334 662 -994 477 412 -997 677 216 -906 852 73 -787 1007
3163 1007 -202 -580 906 -373 -493 1012 -535 -322 999 -852 -51 915 -818 82 728 -917 319
3180 319 734 -924 550 463 -953 785 130 -939 755 -26 -718 816 -187 -656 960 -417 -435
3197 -435 918 -628 -221 914 -711 -94 841 -910 89 706 -890 307 674 -855 577 300 -856
3214 -856 569 242 -794 801 -1 -813 979 -202 -592 896 -362 -482 826 -500 -301 907 -676
3231 -676 -217 703 -677 70 763 -734 205 520 -976 490 431 -905 462 289 -859 819 76 -720
3249 -720 826 -57 -576 866 -358 -537 863 -471 -370 947 -692 -198 789 -714 -10 748 -875
3266 -875 303 569 -777 291 457 -794 549 198 -808 662 55 -685 753 -99 -710 855 -238
3283 -238 -530 870 -453 -366 833 -608 -241 771 -608 -111 719 -714 169 666 -676 313 520 -696
3301 -696 427 273 -790 700 133 -694 665 -44 -742 745 -90 -634 845 -288 -275 865 -589
3318 -589 -155 841 -503 -117 611 -797 136 661 -731 200 378 -673 291 293 -746 413 145 -657 555
3337 555 97 -626 653 -6 -619 800 -285 -347 736 -291 -306 708 -372 -250 662 -522 3 568
3355 568 -648 202 570 -696 287 265 -723 413 170 -543 459 178 -600 646 -53 -526 621 -280
3373 -280 -392 660 -192 -384 661 -361 -259 717 -568 -134 523 -491 178 472 -684 254 549 -658
3391 -658 276 386 -705 508 143 -616 515 12 -659 586 -5 -456 705 -370 -368 561 -302 -358 777
3410 777 -429 -134 573 -518 164 450 -603 112 438 -644 179 355 -533 477 152 -546 593 143
3428 143 -550 575 10 -459 606 -142 -413 705 -319 -232 627 -355 -130 586 -377 -21 470 -567 65
3447 65 443 -557 301 326 -652 276 278 -581 359 98 -501 476 101 -414 593 11 -362 551 -225 -153 666
3468 666 -291 -124 515 -443 49 456 -512 58 507 -366 109 430 -583 216 175 -420 453 208 -463 373
3488 373 41 -547 408 -44 -349 521 -111 -274 549 -350 -198 497 -473 0 452 -536 51 351 -499 207
3508 207 374 -457 304 282 -594 450 118 -407 436 -53 -338 471 -69 -439 591 -185 -356 511 -314 -149
3528 -149 424 -426 -79 353 -520 38 440 -537 76 283 -399 280 290 -556 344 162 -421 521 -143 -468
3548 -468 433 -40 -278 482 -264 -282 339 -300 -220 541 -338 -75 458 -456 98 321 -544 147 301 -488 237
3569 237 98 -407 452 38 -535 410 -47 -387 508 -193 -301 423 -258 -279 491 -322 -135 457 -511 16
3589 16 422 -382 180 330 -412 147 477 -372 287 291 -503 398 12 -514 433 38 -414 572 -235 -295 606
3610 606 -329 -302 391 -355 -180 448 -371 -95 530 -476 119 330 -563 241 216 -524 338 122 -654 317
3630 317 132 -368 477 27 -420 478 -92 -380 608 -238 -97 544 -466 -118 608 -478 192 521 -458
3649 -458 206 475 -487 258 186 -492 406 201 -505 426 8 -483 557 -133 -427 604 -267 -502 607
3668 607 -395 -163 588 -516 -125 524 -481 58 574 -548 262 352 -629 331 342 -526 467 218 -585
3687 -585 499 66 -651 545 -16 -488 694 -317 -439 685 -357 -145 659 -473 -66 565 -599
3704 -599 34 591 -668 218 317 -704 458 346 -732 448 242 -621 540 19 -720 700 -194 -560
3722 -560 785 -206 -309 670 -366 -141 755 -591 -113 533 -522 120 573 -581 110 527 -795 403
3740 403 298 -672 331 54 -734 640 -21 -710 732 -140 -489 726 -189 -414 697 -464 -259 694
3758 694 -617 -117 779 -642 153 532 -670 174 473 -747 328 397 -761 401 183 -732 516 115
3776 115 -769 729 -88 -457 822 -192 -384 885 -350 -382 817 -646 -159 708 -687 8 704 -717
3794 -717 214 479 -777 373 371 -764 510 346 -830 645 145 -668 572 -6 -762 700 -165 -444
3812 -444 797 -405 -378 796 -544 -114 799 -658 -38 626 -761 167 521 -753 402 492 -797 566
3830 566 389 -725 651 73 -741 646 -157 -635 727 -180 -402 761 -418 -279 769 -592 -178
3847 -178 702 -622 60 593 -787 139 565 -784 271 495 -789 540 285 -794 745 60 -919
3864 -919 648 -71 -529 862 -253 -416 902 -355 -373 775 -575 -150 832 -592 53 715 -850
3881 -850 145 492 -801 402 477 -752 362 277 -703 489 112 -808 629 14 -540 870 -247 -493
3899 -493 729 -402 -315 852 -446 -153 756 -603 -16 704 -743 105 556 -748 320 465 -847
3916 -847 458 362 -705 659 34 -659 660 -32 -487 730 -201 -622 716 -339 -220 753 -558 -237
3934 -237 666 -562 19 751 -647 78 561 -747 391 392 -672 318 270 -716 582 4 -697 623 -117
3953 -117 -583 649 -290 -486 810 -418 -346 711 -688 -137 636 -670 89 697 -714 128 393 -821
3971 -821 248 383 -739 460 262 -663 487 -22 -638 627 -114 -566 718 -323 -329 796 -308 -309
3989 -309 710 -407 -62 639 -599 72 533 -620 129 434 -607 331 224 -665 441 165 -700 617
4007 617 -23 -606 625 -202 -431 605 -351 -389 649 -522 -223 636 -503 37 541 -569 45 448
4025 448 -587 177 368 -668 429 263 -573 436 2 -595 502 -82 -529 570 -164 -408 607 -304
4043 -304 -287 556 -409 -41 605 -558 47 530 -505 171 458 -565 212 319 -583 358 125 -555 523
4062 523 63 -457 482 -209 -365 537 -296 -247 445 -348 -149 535 -313 25 584 -471 5 286 -463 227
4082 227 308 -619 282 167 -535 406 15 -536 529 8 -380 611 -174 -316 510 -150 -168 626 -387 -112
4102 -112 513 -493 -39 473 -579 164 479 -529 294 232 -538 312 87 -548 530 -2 -594 550 -87
4121 -87 -346 620 -178 -383 568 -418 -210 592 -407 -140 480 -461 120 443 -502 291 359 -558 303 252 -672
4142 -672 438 104 -437 570 38 -380 592 -35 -327 692 -265 -237 679 -357 -219 620 -541 31 498
4161 498 -553 93 469 -565 313 322 -627 360 96 -546 369 -85 -469 401 -93 -401 575 -170 -358 615
4181 615 -343 -315 601 -534 -124 588 -522 -28 424 -526 153 354 -582 332 212 -649 298 92 -637 558
4201 558 114 -327 568 -112 -508 489 -250 -226 587 -340 -205 616 -580 -85 528 -499 -78 473 -585
4220 -585 259 423 -660 286 250 -600 425 146 -580 591 71 -533 604 -209 -401 495 -278 -208 628
4239 628 -430 -164 691 -512 -32 539 -495 162 455 -550 244 297 -592 353 176 -529 498 -7 -467
4258 -467 572 -154 -537 698 -171 -376 593 -419 -247 534 -379 -32 493 -452 9 533 -587 94 484
4277 484 -487 250 237 -661 341 131 -537 506 -57 -513 550 -39 -366 616 -198 -249 671 -360 -251
4296 -251 510 -494 -136 497 -475 -18 408 -456 94 394 -632 157 131 -412 393 192 -404 397 -10 -400
4316 -400 565 -75 -330 519 -201 -309 613 -395 -262 559 -472 -52 510 -388 135 347 -561 140 335
4335 335 -488 279 184 -531 337 88 -522 544 6 -474 477 -246 -466 505 -239 -252 601 -421 -21 489
4355 489 -472 23 405 -411 22 342 -428 202 325 -618 348 159 -427 406 98 -389 497 -62 -291 493
4375 493 -203 -426 507 -235 -299 505 -258 -38 443 -382 6 346 -391 214 249 -436 229 220 -442 292 239 -330
4397 -330 376 -66 -340 477 -111 -278 460 -146 -348 564 -167 -218 427 -269 -55 401 -379 94 225 -408
4417 -408 170 278 -438 316 201 -433 269 77 -407 311 -41 -386 429 -133 -103 518 -238 -198 428 -278 -193
4438 -193 327 -379 -137 219 -473 83 246 -367 212 188 -294 283 79 -324 461 29 -350 444 -80 -204
4458 -204 315 -180 -249 319 -222 -80 361 -363 6 285 -295 106 361 -302 133 189 -445 182 182 -352 277
4479 277 94 -427 292 -62 -291 440 -99 -211 349 -135 -3 429 -294 51 351 -274 -31 397 -410 163
4499 163 318 -401 180 180 -419 264 -2 -423 239 37 -266 398 -83 -299 327 -208 -82 446 -249 -132 351
4520 351 -390 21 281 -375 -36 337 -400 227 195 -284 223 140 -403 252 85 -378 397 -137 -258 286 -241
4541 -241 -250 380 -252 -100 412 -348 4 286 -363 12 322 -385 87 326 -391 167 92 -483 325 52 -389
4562 -389 284 -23 -320 433 -30 -199 447 -245 -195 509 -293 -100 427 -390 -9 312 -337 112 217 -490
4582 -490 144 254 -452 370 -20 -454 333 -76 -383 534 -117 -233 468 -50 -211 391 -311 4 538 -364
4602 -364 -13 388 -303 80 387 -402 219 208 -446 311 37 -385 330 -22 -339 434 -63 -464 503 -18
4622 -18 -187 531 -238 -202 355 -184 -159 439 -387 -26 272 -491 231 251 -387 67 205 -518 223 254 -471 312
4644 312 -76 -377 433 -69 -393 369 -101 -247 457 -261 -266 436 -330 -145 505 -251 -37 380 -561 51 205
4665 205 -360 222 186 -297 469 213 -436 353 14 -436 459 -53 -283 313 -154 -357 415 -279 -179 455
4685 455 -422 -101 299 -309 19 305 -342 202 298 -315 262 226 -377 149 166 -441 353 -56 -226 364 -67
4706 -67 -174 520 -63 -238 515 -230 -150 443 -297 -185 327 -292 98 297 -478 196 184 -439 178 168 -327
4727 -327 369 133 -422 309 -150 -357 392 -129 -178 387 -228 -192 392 -189 -121 355 -364 17 267 -290 134
4748 134 312 -310 186 292 -364 219 123 -329 346 -6 -291 313 -68 -447 363 -63 -157 508 -125 12 384
4769 384 -219 -121 260 -282 106 311 -329 32 202 -419 160 120 -326 280 49 -389 309 142 -252 301 -66
4790 -66 -172 485 -118 -132 365 -131 -98 353 -216 -37 319 -372 -73 272 -348 98 165 -329 164 175 -304 290
4812 290 91 -305 311 -43 -316 402 -42 -261 358 -62 -212 241 -248 -62 312 -178 -75 249 -216 49
4832 49 236 -315 204 247 -219 203 119 -249 247 -15 -95 303 -159 -241 254 -77 -180 202 -241 -41 363 -228
4854 -228 -15 160 -276 51 118 -191 118 68 -278 169 122 -193 215 -68 -304 284 -15 -157 303 -79 -210
4875 -210 353 -144 -72 177 -247 28 271 -259 64 169 -344 92 201 -300 87 75 -368 221 86 -209 163
4896 163 -85 -257 213 -106 -265 241 -205 -119 255 -215 -135 303 -237 -141 257 -210 3 222 -307 87 209
4917 209 -233 102 135 -378 112 62 -322 268 -113 -271 281 -83 -79 430 -230 -23 193 -181 98 284 -252
4938 -252 -38 207 -309 85 272 -231 201 159 -342 214 40 -232 114 -82 -242 307 -80 -198 328 -179
4958 -179 -249 244 -153 -110 251 -220 -79 397 -340 -14 199 -296 148 144 -297 117 201 -331 239 78 -309 295
4980 295 -49 -289 334 -151 -133 330 -184 -129 315 -188 -166 257 -157 72 237 -250 64 334 -332 133 190
5001 190 -331 236 191 -335 297 10 -175 372 -53 -196 341 -118 -216 164 -170 -184 295 -241 -53 354 -233
5022 -233 190 247 -242 67 241 -192 183 80 -277 240 22 -369 184 45 -225 370 -14 -184 376 -84
5042 -84 -133 362 -110 -264 378 -181 -50 248 -245 2 196 -238 1 149 -347 129 180 -296 204 130 -311
5063 -311 186 69 -280 316 -121 -331 291 -138 -168 313 -111 -32 262 -237 -186 367 -193 22 314 -232 87
5084 87 107 -301 39 83 -270 247 44 -304 203 96 -236 299 -134 -202 289 -107 -176 394 -171 0 192 -229
5106 -229 -128 252 -301 50 170 -209 95 44 -270 127 118 -379 278 -64 -266 301 -43 -155 364 -134 -275
5127 -275 321 -54 -60 239 -181 -205 275 -113 -23 287 -205 -1 212 -162 52 112 -331 39 152 -192 34 103
5149 103 -221 267 31 -215 214 -39 -156 320 -40 -107 233 -174 -9 188 -182 -40 224 -193 76 109 -140
5170 -140 32 63 -241 201 124 -174 141 92 -142 175 -9 -83 240 46 -56 135 -96 -63 249 -91 -40 131
5192 131 -198 54 75 -162 42 61 18 104 17 -109 225 144 -123 173 122 -230 215 -85 -87 165 -44 -109 97
5215 97 -167 -127 231 -127 27 224 -183 -68 103 -166 89 43 -167 40 63 -180 145 136 -115 141 66 -244
5237 -244 145 -155 -175 234 -180 -148 170 -270 4 63 -176 18 44 -164 74 148 -227 45 103 -197 -2 7 -102
5260 -102 132 -123 -99 155 -116 -81 218 -68 -70 119 -41 115 155 -133 62 35 -143 101 10 -61 93 -3 -105
5283 -105 20 33 -105 203 -28 -110 64 -14 -67 132 -57 -131 250 -187 17 206 -217 38 92 -203 66 51
5305 51 -137 73 72 -171 145 -5 -63 185 -57 21 153 103 -109 188 -77 -90 194 -146 2 59 -132 -14 135
5328 135 -130 106 151 -250 102 -10 -174 -14 115 -179 157 15 -42 203 -102 -89 203 -23 -120 66 -186
5349 -186 -62 115 -78 66 144 -116 46 81 -158 124 -41 -82 86 126 -132 89 -16 -148 122 -42 -76 161
5371 161 -23 -125 99 -46 -46 106 -108 -159 171 -142 5 67 -176 83 128 -79 134 59 -158 93 63 -223
5393 -223 178 -43 -132 44 -40 -16 168 -11 15 195 -168 16 108 -134 -98 242 -160 117 200 -146 113 179 -297
5416 -297 102 98 -137 139 -97 -107 187 -34 -114 136 -24 -152 143 -70 -29 261 -91 -21 341 -251 -196 45
5438 45 -99 -85 144 -153 122 118 -162 99 7 -161 74 15 -29 35 -109 -200 154 5 -117 166 -107 -69 177
5461 177 -103 -163 214 -86 -32 190 -177 -49 127 -62 35 121 -193 171 65 -150 43 85 -221 119 14 -140
5483 -140 143 38 -132 183 119 -239 170 -103 -167 112 -33 -28 148 -161 -23 194 -165 53 139 -97 29 77
5505 77 -222 125 -14 -135 77 122 -78 137 -7 -110 154 10 -2 208 -69 -1 195 -2 -33 117 -200 -22
5527 -22 185 -75 84 41 -61 150 89 -261 78 56 -169 -30 -6 -96 209 -21 -160 228 -41 62 116 24 -91
5550 -91 146 -66 2 107 -154 26 172 -134 45 147 -192 44 142 -85 17 87 -35 220 13 -47 120 -2
5572 -2 -62 120 -40 -55 134 -37 -65 96 12 -40 7 -16 -41 187 -129 -27 8 -151 38 -13 4 -62 130 -109 88
5597 88 -48 -121 40 36 45 141 -123 50 61 66 17 162 -26 -80 83 -14 -43 182 -83 88 -25 -87 -64 -9 -109 -10
5623 -10 86 -179 -6 -30 -80 33 80 96 6 -101 -7 7 -52 8 91 -111 17 74 -43 36 34 -126 -41 -33 62 40 50
5650 50 -38 -14 -2 38 -1 2 73 -38 6 -35 11 -47 -17 -115 -28 9 -53 -128 35 54 -59 36 -13 -107 -43 27 -110 -9
5678 -9 12 -58 82 18 9 30 -118 -62 26 53 -34 -27 24 -42 -45 37 -2 136 39 -21 -17 82 -18 -41 -27 -85 70 -136 -58 58
5708 58 29 79 64 -27 51 3 2 11 -39 79 -56 -97 15 -15 -75 56 -149 -44 40 -56 13 -46 76 87 36 58 59 95
5736 95 -50 79 72 -84 57 -34 -11 8 70 20 -37 22 -111 -15 -42 -53 -18 30 18 -46 -57 -67 -71 44 -56 -15 -77 8
5764 8 5 76 59 -12 19 -47 23 -112 -36 80 36 -116 91 -50 45 -27 -102 -36 70 -14 114 -50 10 6 -45 -45 -50 0 69
5793 69 -10 -54 -2 -5 24 8 36 -125 44 17 106 -41 -56 32 109 13 45 -60 158 31 -50 -11 6 149 -28 -80 -46
5820 -46 -118 -113 -81 -51 107 -38 26 58 16 -113 -87 37 -35 31 -3 45 26 6 -39 52 14 35 -109 -95 -47 -47 62 26
5848 26 -145 30 47 66 33 -15 55 -20 -65 58 -36 -31 -35 79 25 22 -73 21 86 1 -81 135 92 -100 46 -76 11 -134
5876 -134 -20 37 -7 -55 -61 28 15 -17 -133 -134 24 -70 101 -45 -20 -85 5 25 -9 -77 23 67 75 23 -27 57 -54 -8
5904 -8 -7 -141 -34 -13 -45 -37 83 -57 18 31 36 18 73 -50 -4 99 -90 -30 191 56 67 -49 16 16 32 37 28 91 -128
5933 -128 37 -95 4 1 4 -57 144 7 2 137 29 -81 -80 -26 -47 82 -169 -120 -4 -93 4 68 72 -9 -24 33 15
5960 15 71 48 77 103 -26 69 -97 -42 11 55 -90 -27 145 45 61 -89 -51 67 -30 82 151 -85 81 35 -21
5985 -21 150 -44 -99 34 12 -43 16 119 -45 42 -43 -27 -14 71 -128 26 15 -5 -25 86 -135 3 38 -57 23
6010 23 -132 150 113 -53 -29 -116 139 119 -12 30 -40 -27 -8 -34 -56 20 143 -4 -93 19 -58 -39 28 64 -29 42
6036 42 -109 57 -34 -32 108 157 -126 -29 141 -71 138 159 -84 98 -23 -53 17 34 27 37 81 -11 118 43 -181
6061 -181 97 16 -104 2 -27 89 3 -51 90 1 14 -38 -57 -62 7 28 -31 28 23 -69 30 78 -96 -61 -53 -115 44 -89
6089 -89 -85 83 -11 -30 133 -39 -46 85 -54 -11 54 -20 27 146 -10 -98 146 -46 45 89 -124 109 58 -145 45
6114 45 11 -72 56 -25 -135 211 64 -22 106 9 58 77 -125 -68 144 -50 -48 28 -6 -10 50 -158 55 35 45 -10
6140 -10 54 -163 97 95 -26 154 -118 -91 -6 62 -24 164 10 -39 -24 68 25 8 -132 23 78 -113 92 27 -135
6165 -135 115 -6 -53 67 -42 -8 8 3 -192 -12 37 -65 46 -117 -65 166 -47 -112 104 -179 -6 151 -11
6188 -11 -13 69 5 27 56 26 112 78 -96 -62 132 -3 92 68 -88 39 -41 -45 -9 -2 12 55 -99 -116 59 -38 -36 102
6216 102 -5 -41 71 10 20 49 -22 126 41 -87 114 49 -123 145 -127 -86 110 -1 2 52 9 24 108 -1 -49
6241 -49 60 -159 -25 104 5 5 21 -164 111 -36 37 109 93 -46 73 101 -15 123 -65 -37 112 -22 -28 -4
6265 -4 -106 36 -51 -65 -175 106 -137 11 -12 -120 -8 111 -113 45 73 -91 -64 34 -34 175 -12 -108 121
6288 121 -68 -120 50 -27 -23 100 -21 7 61 -42 -6 69 -91 -5 17 -24 -88 5 50 84 -135 -20 117 14 -81
6313 -81 58 -94 -68 57 1 -37 -15 -60 -131 84 -30 -4 -7 -29 55 17 5 66 0 -53 97 -7 -32 128 -82 -44
6339 -44 91 -32 -133 24 -51 2 -60 -48 -45 14 -51 -43 81 -36 74 -46 -66 95 27 -26 126 119 -70 95 73 -149
6365 -149 54 -20 -91 92 -37 -21 155 -37 -30 -39 -11 56 10 -97 -64 119 -72 -5 24 -87 117 31 -196 42 20
6390 20 -82 75 -50 -186 180 -63 -5 188 -4 75 169 -134 -34 68 -224 2 99 -147 -47 91 -74 101
6412 101 54 -164 -2 82 -73 20 -105 -274 130 25 -50 49 -4 -45 172 55 -128 93 -69 -42 101 17 56
6435 56 141 -114 27 144 -125 75 7 -120 133 46 -52 50 -35 -171 123 -39 -35 159 -41 -96 52 29 -37 213
6459 213 -128 -47 9 -116 5 68 -101 -72 19 -171 -58 29 -206 100 42 -216 38 40 -133 165 24 -168 -38
6482 -38 -80 -12 101 -52 -150 28 -19 1 73 -52 -14 142 -133 8 116 -108 35 -40 -139 4 65 -153 114 62
6506 62 -138 125 -56 -136 45 -83 -8 95 -20 -28 116 30 -95 56 9 61 129 -199 -75 59 -155 18 3
6529 3 -90 110 29 -92 49 19 -174 148 64 -194 139 -90 -123 162 -76 -65 92 -24 -110 119 50 -29 114 -109
6553 -109 -5 149 -142 7 52 -83 50 83 -61 35 -18 -141 70 -33 -11 99 57 -127 228 28 -82 151
6575 151 3 -47 130 -123 43 46 -153 10 54 -173 90 70 -91 163 68 -41 182 64 -4 99 71 -121 69
6598 69 -16 -81 200 -55 -100 156 -87 15 51 -109 -47 138 -58 -57 160 -145 115 201 -199 -12 -25 -233 61
6621 61 68 -148 140 -57 14 105 -43 -35 9 -78 -27 56 -29 103 171 -98 18 96 -116 -21 5 -107 72 41 -195 98
6647 98 38 -61 119 40 -84 169 -21 -41 -23 22 -84 127 -123 -8 110 -49 98 30 -166 42 96 -113 47
6670 47 47 -78 56 19 -185 185 -75 -84 126 -103 17 192 -78 9 101 -61 -106 129 27 -51 48 30 83 96 -90
6695 -90 40 117 -127 -1 125 -152 -21 -53 2 150 7 -89 80 49 -120 135 -6 22 60 -50 52 94 -42
6718 -42 -10 81 71 -85 59 -104 -72 29 -165 -39 135 -13 38 130 -118 15 25 52 78 -143 32 130 -77 -52
6742 -52 86 -98 -98 130 -76 6 33 -34 57 16 -51 -37 -5 -122 28 102 -65 -27 35 -62 81 74 -114 202 -10 -143
6768 -143 41 -91 -33 58 -1 -72 146 -75 97 9 -94 33 24 -129 134 -47 -70 47 20 12 73 -102 -96 52 -43
6793 -43 -183 32 -6 -13 42 -25 -56 53 -65 57 74 -159 -20 101 -74 36 69 -62 22 -36 -139 -35 107 -107
6817 -107 70 -20 -75 39 -78 -79 147 -15 -61 156 -104 50 149 -110 -34 35 -44 -127 21 -104 137 -15 -165
6840 -165 69 -36 -99 158 -95 -80 179 -45 -171 121 -1 -93 12 -88 -56 212 -195 -179 38 -198 97 21
6862 21 -41 33 115 -171 116 8 -173 34 -32 -41 86 -12 -24 129 119 -173 228 6 52 180 -58 -38 -15 -70 -34
6887 -34 56 -24 -27 30 -237 146 59 -35 54 -11 -71 44 1 4 69 -16 -29 55 -58 -180 71 123 -41 42 -60 70 90
6914 90 -83 85 91 -103 76 11 -145 196 60 -56 94 -40 -131 96 16 20 136 -66 -109 84 -106 -48 121
6937 121 -46 -15 122 -86 -52 66 -142 109 85 -130 34 50 -45 -58 -62 -199 82 -20 -87 74 -71 -119 140
6960 140 8 -53 87 -97 -121 150 -72 -53 42 -71 -30 53 -156 100 134 -10 -26 50 -57 101 87 -187 63
6983 63 82 -74 113 -64 -152 24 37 -122 91 -78 -86 72 -152 94 119 -30 -83 47 -166 109 60 -120 39
7006 39 43 -167 29 155 -88 110 -18 -16 65 -77 -33 111 -4 40 163 -105 3 146 -61 -35 17 -101 37
7029 37 106 -106 -8 6 -204 21 13 -133 117 -96 -176 106 -45 -117 126 -81 -63 123 -53 20 56 -106 -7 137
7053 137 -82 -63 5 -70 76 6 -239 92 -26 -51 180 31 -49 110 -50 -111 208 -60 5 41 -49 -64 151 -52
7077 -52 -49 157 -44 106 36 -141 -4 47 -174 117 108 -107 73 100 -192 113 -56 -108 144 -64 -50 56 -5 -59
7101 -59 14 -85 16 116 -178 34 74 -24 -29 13 -141 63 49 -217 197 33 -35 209 -15 -86 177 -114 -113 107
7125 107 -21 -68 63 -6 37 117 -5 -121 103 -48 22 78 -145 34 66 -166 61 43 -76 -1 119 -75 149
7148 149 66 -67 55 -124 -153 104 7 -249 97 -11 -127 44 -64 65 16 -66 -11 30 -86 7 35 -93 61
7171 61 -25 -89 130 29 -136 160 49 -124 108 -152 -11 209 -140 -35 108 -158 32 88 -149 -51 153 -20
7193 -20 -31 8 -236 57 160 -147 154 135 -163 206 -108 -24 188 -47 -145 91 -120 -200 187 -173 -134 187 -177
7216 -177 35 55 -207 -17 124 -186 108 34 -34 3 8 -154 69 92 -139 126 15 -142 11 111 -185 160
7238 160 -93 -122 34 -78 15 143 -141 70 193 -149 9 92 -155 35 36 -48 16 -61 -104 72 31 -70 105
7261 105 17 -136 96 -71 45 125 -66 -82 147 -32 -78 197 -163 33 169 -178 3 148 -213 33 100 -200
7283 -200 31 -2 -160 72 -2 -197 9 -27 -269 129 -94 -79 207 -49 -87 69 -186 35 128 -135 -84 70
7305 70 -170 44 80 -193 0 29 -90 149 29 -295 30 -37 -147 118 -10 -81 75 -63 -135 222 -48 -97
7327 -97 172 -166 31 251 2 5 154 -123 -87 38 -148 59 155 -59 159 -73 -189 70 -26 -68 233 -138
7349 -138 -162 6 20 13 215 68 -39 88 -114 -3 129 -47 -70 115 -177 79 73 -247 106 110 -184 69 56
7372 56 -137 104 58 -127 36 -132 -207 162 -82 -143 180 -9 -95 80 -91 6 233 -162 130 145 -91 12
7394 12 189 -81 98 137 -108 96 27 -52 55 -56 -26 231 -65 26 264 -123 -65 168 -203 -101 129 -90
7416 -90 -49 97 -101 10 87 -90 17 -32 -184 51 -5 -174 42 -57 -141 264 -74 -124 160 -61 -76 132 -36
7439 -36 -40 155 -29 -59 119 -85 58 29 -93 46 43 -91 49 65 -203 137 -38 -127 185 86 -179 23 135
7462 135 -69 121 109 32 219 -51 3 165 -229 -32 102 -136 -88 84 -63 91 73 -143 -48 27 -106 -36 -53
7485 -53 -166 58 -4 -106 79 68 -133 136 -110 -76 164 -131 -36 186 -82 -8 50 -80 120 127 -238 139 70
7508 70 -102 151 150 -123 28 -31 -109 166 -31 -68 137 -73 -39 172 -14 -81 231 -115 29 45 -87 11 205
7531 205 -152 44 71 -238 53 49 -131 137 56 4 171 38 -83 97 12 -113 186 -7 -107 197 -45 3
7553 3 122 -95 24 59 -131 -71 83 -241 -11 189 -95 99 -83 -216 30 160 -139 59 -18 -186 61 93
7575 93 -41 89 -24 -92 172 -42 -46 74 -105 27 105 -51 40 115 -127 -2 49 -220 93 44 -133 148 8
7598 8 -104 134 32 -83 315 -10 -136 158 -129 -18 107 -89 16 80 -119 -11 6 -126 22 15 -195 92
7620 92 137 -175 -5 71 -184 12 -49 -151 -11 49 -147 139 100 -142 159 -109 -62 126 -200 -112 128 2 -111
7643 -111 86 -145 -84 197 -189 -28 138 -106 127 128 -17 7 -31 -71 108 -109 -66 123 -9 37 142 -131 -1
7666 -1 201 -207 -7 27 -207 -42 131 -215 25 78 -237 100 -7 -197 125 -16 -86 61 -36 -15 54 17 -62
7689 -62 104 -160 -44 45 -98 -33 195 -144 45 117 -168 4 65 -141 93 75 -166 -77 79 -188 108 57 -191
7712 -191 143 -44 -72 201 -81 -106 56 -22 -82 50 -27 -4 124 -119 5 75 -207 56 126 -16 77 0 -58 47
7736 47 14 -154 68 1 -139 106 -63 -82 151 -65 -33 144 -122 -76 154 -53 57 15 -50 -125 108 -120 -53
7759 -53 49 -156 77 19 -109 198 94 -132 129 -37 -204 158 18 -31 111 -39 -154 118 -61 -98 158
7780 158 -70 -25 71 -166 32 9 -65 -40 151 36 46 -28 -123 85 71 -114 57 81 -95 33 42 -56 191 -66
7804 -66 -174 177 6 -11 191 -44 -163 159 -175 -69 -5 -120 51 71 -139 41 13 -26 29 107 -80 47 -43
7827 -43 -150 47 -95 10 0 46 -3 144 28 -22 119 -62 125 83 -119 -80 26 23 1 31 -292 90 93 -96
7851 -96 143 25 -56 121 95 -183 24 49 6 93 -67 -97 12 52 9 29 -82 -93 95 -51 24 25 -17 9 45 -130
7877 -130 114 46 -73 33 18 -4 53 71 -14 -28 -27 -29 41 -87 -135 69 -12 90 53 -40 35 2 -130 -4 -38 -138
7903 -138 121 14 -89 51 1 -134 89 24 -97 24 128 -21 42 -32 62 114 -76 -39 133 27 -75 -10 31
7926 31 -56 149 37 -27 87 -45 40 71 -125 -51 -36 -81 40 -17 -111 -18 70 30 -10 -27 -114 20 24 -18 102 -123
7952 -123 81 38 -42 -73 83 -41 88 56 23 30 -50 -81 97 -29 -106 -19 21 -59 44 -31 -140 70 -89 -57 -5
7977 -5 -7 41 51 -56 -16 26 -98 3 16 -168 27 159 -114 136 47 24 9 71 -181 -76 40 -145 30 -17 -58
8002 -58 102 -50 -66 -14 47 -16 113 10 -83 25 27 26 9 -142 50 70 -46 21 90 -43 43 40 -124 -56 -40 -158
8028 -158 66 2 -45 160 -71 -56 62 63 6 99 -121 14 37 -97 108 32 -8 60 23 -2 -15 -14 -27 66 -24 -19 88
8055 88 -80 -15 -101 -84 9 183 37 -81 58 -107 -11 101 27 -149 27 -39 -92 31 -40 -8 114 -78 51 -7
8079 -7 -46 75 13 -25 135 -71 70 59 -26 -71 146 48 -8 73 -20 16 83 -65 15 33 -110 111 28 -30 5 97 -17
8106 -17 -41 -9 -37 -35 9 -127 -1 54 17 1 -51 -77 39 -21 -55 87 -55 39 115 -184 -68 38 -2 40 -51 -126 -21
8133 -21 -10 2 8 -9 41 83 -12 -18 108 14 79 105 -13 -19 144 101 5 -17 24 -65 30 -19 21 137 14 68 21 -132 87
8162 87 48 -92 1 -29 44 -106 38 29 -60 23 -16 16 -10 -91 -56 72 -148 26 -46 -78 24 -22 -22 -37 -111 38 139
8189 139 -69 2
8191B
##END NTUPLES=NMR FID
##END=
