##TITLE=1H_Pr Q-5_3
 200.13MHz, CDCl3,
 8 sc
 
 5.2.2025
##JCAMPDX= 6.0         $$ Bruker NMR JCAMP-DX V2.0
##DATA TYPE= NMR FID
##DATA CLASS= NTUPLES
##ORIGIN= UXNMR, Bruker Analytische Messtechnik GmbH
##OWNER= pz
$$ XWIN-NMR		Version 3.5
$$ Wed Feb  5 16:54:52 2025 Russian Standard Time (UT+4h)  she@DPX200
##.OBSERVE FREQUENCY= 200.1313
##.OBSERVE NUCLEUS= ^1H
##.DELAY= (6, 6)
##.ACQUISITION MODE= SIMULTANEOUS
##.ACQUISITION SCHEME= undefined
##.AVERAGES= 8
##.DIGITISER RES= 18
##SPECTROMETER/DATA SYSTEM= spect
##.PULSE SEQUENCE= zg30
##.SOLVENT NAME= D2O
##.SHIFT REFERENCE= (INTERNAL, D2O, 0, 14.3821)
##AUDIT TRAIL= $$ (NUMBER, WHEN, WHO, WHERE, WHAT)
$$ ##TITLE= Audit trail, XWIN-NMR		Version 3.5
$$ ##JCAMPDX= 5.01
$$ ##ORIGIN= Bruker BioSpin GmbH
$$ ##OWNER= she
$$ F:/spectra/data/she/nmr/H-C/1/audita.txt
$$ ##AUDIT TRAIL=  $$ (NUMBER, WHEN, WHO, WHERE, WHAT)
(   1,<2025-02-05 16:53:32.98 +0400>,<she>,<DPX200>,
      <created by zg, POWCHK disabled, PULCHK disabled
       configuration hash MD5:
       00 E9 B6 7A A2 85 ED C7 34 08 36 98 17 FE 4E 26
       data hash MD5: 16K
       5E 75 DE 6A 73 39 8E D9 68 08 31 2E B6 38 81 C5>)
$$ ##END=
$$ 
$$ hash MD5
$$ EE 0C 1E 71 AD D4 EE B8 21 A7 B2 11 97 A5 14 8B
##$RELAX= 
##$RELAX= 
##$RELAX= 
##$RELAX= 
##$RELAX= 
##$RELAX= 
$$ Bruker specific parameters
$$ --------------------------
##$DU= <F:/spectra>
##$EXPNO= 1
##$NAME= <H-C>
##$PROCNO= 1
##$TYPE= <nmr>
##$USER= <she>
##$AMP= (0..31)
100 100 100 100 100 100 100 100 100 100 100 100 100 100 100 100 100 100 
100 100 100 100 100 100 100 100 100 100 100 100 100 100 
##$AQSEQ= 0
##$AQ_mod= 1
##$AUNM= <au_zg>
##$AUTOPOS= <>
##$BF1= 200.13
##$BF2= 200.13
##$BF3= 200.13
##$BF4= 200.13
##$BF5= 200.13
##$BF6= 200.13
##$BF7= 200.13
##$BF8= 200.13
##$BYTORDA= 1
##$CFDGTYP= 0
##$CFRGTYP= 5
##$CHEMSTR= <none>
##$CNST= (0..31)
1 1 145 1 1 1 1 1 1 1 1 1 1 1 1 1 1 1 1 1 1 1 1 1 1 1 1 1 1 1 1 1 
##$CPDPRG= <>
##$CPDPRG1= <>
##$CPDPRG2= <>
##$CPDPRG3= <>
##$CPDPRG4= <mlev>
##$CPDPRG5= <mlev>
##$CPDPRG6= <mlev>
##$CPDPRG7= <mlev>
##$CPDPRG8= <mlev>
##$CPDPRGB= <>
##$CPDPRGT= <>
##$D= (0..31)
0 0.7 0 0 0 0 0 0 0 0 0 0.03 0 0 0 0 0 0 0 0 0 0 0 0 0 0 0 0 0 0 0 0 
##$DATE= 1738760012
##$DBL= (0..7)
120 120 120 120 120 120 120 120 
##$DBP= (0..7)
150 150 150 150 150 150 150 150 
##$DBP07= 0
##$DBPNAM0= <>
##$DBPNAM1= <>
##$DBPNAM2= <>
##$DBPNAM3= <>
##$DBPNAM4= <>
##$DBPNAM5= <>
##$DBPNAM6= <>
##$DBPNAM7= <>
##$DBPOAL= (0..7)
0.5 0.5 0.5 0.5 0.5 0.5 0.5 0.5 
##$DBPOFFS= (0..7)
0 0 0 0 0 0 0 0 
##$DE= 6
##$DECBNUC= <off>
##$DECIM= 32
##$DECNUC= <off>
##$DECSTAT= 4
##$DIGMOD= 1
##$DIGTYP= 9
##$DL= (0..7)
0 120 120 120 120 120 120 120 
##$DP= (0..7)
150 150 150 150 150 150 150 150 
##$DP07= 0
##$DPNAME0= <>
##$DPNAME1= <>
##$DPNAME2= <>
##$DPNAME3= <>
##$DPNAME4= <>
##$DPNAME5= <>
##$DPNAME6= <>
##$DPNAME7= <>
##$DPOAL= (0..7)
0.5 0.5 0.5 0.5 0.5 0.5 0.5 0.5 
##$DPOFFS= (0..7)
0 0 0 0 0 0 0 0 
##$DQDMODE= 0
##$DR= 18
##$DS= 0
##$DSLIST= <SSSSSSSSSSSSSSS>
##$DSPFIRM= 0
$$ [...]
##$SUBNAM0= <"">
##$SUBNAM1= <"">
##$SUBNAM2= <"">
##$SUBNAM3= <"">
##$SUBNAM4= <"">
##$SUBNAM5= <"">
##$SUBNAM6= <"">
##$SUBNAM7= <"">
##$SUBNAM8= <"">
##$SUBNAM9= <"">
##$SW= 18.0517328524113
##$SWIBOX= (0..15)
0 0 2 0 0 0 0 0 0 0 0 0 0 0 0 0 
##$SW_h= 3612.71676300578
##$TD= 16384
##$TD0= 1
##$TE= 0
##$TE2= 300
##$TE3= 300
##$TEG= 300
##$TL= (0..7)
0 120 120 120 120 120 120 120 
##$TP= (0..7)
150 150 150 150 150 150 150 150 
##$TP07= 0
##$TPNAME0= <>
##$TPNAME1= <>
##$TPNAME2= <>
##$TPNAME3= <>
##$TPNAME4= <>
##$TPNAME5= <>
##$TPNAME6= <>
##$TPNAME7= <>
##$TPOAL= (0..7)
0.5 0.5 0.5 0.5 0.5 0.5 0.5 0.5 
##$TPOFFS= (0..7)
0 0 0 0 0 0 0 0 
##$TUNHIN= 0
##$TUNHOUT= 0
##$TUNXOUT= 0
##$USERA1= <user>
##$USERA2= <user>
##$USERA3= <user>
##$USERA4= <user>
##$USERA5= <user>
##$V9= 5
##$VALIST= <valist>
##$VCLIST= <CCCCCCCCCCCCCCC>
##$VD= 0
##$VDLIST= <DDDDDDDDDDDDDDD>
##$VPLIST= <PPPPPPPPPPPPPPP>
##$VTLIST= <TTTTTTTTTTTTTTT>
##$WBST= 1024
##$WBSW= 4
##$XGAIN= (0..3)
0 0 0 0 
##$XL= 0
##$YL= 0
##$YMAX_a= 312420
##$YMIN_a= -310680
##$ZGOPTNS= <>
##$ZL1= 120
##$ZL2= 120
##$ZL3= 120
##$ZL4= 120
##$ABSF1= 10
##$ABSF2= 0
##$ABSG= 5
##$ABSL= 3
##$ALPHA= 0
##$AQORDER= 0
##$ASSFAC= 0
##$ASSFACI= 0
##$ASSFACX= 0
##$ASSWID= 0
##$AUNMP= <proc_1d>
##$AZFE= 0.1
##$AZFW= 0.1
##$BCFW= 1
##$BC_mod= 2
##$BYTORDP= 1
##$COROFFS= 0
##$CY= -3
##$DATMOD= 1
##$DC= 2
##$DFILT= <>
##$DTYPP= 0
##$F1P= 0
##$F2P= 0
##$FCOR= 0.5
##$FTSIZE= 0
##$FT_mod= 4
##$GAMMA= 1
##$GB= 0.15
##$INTBC= 1
##$INTSCL= 1
##$ISEN= 128
##$LB= 0.25
##$LEV0= 0
##$LPBIN= 0
##$MAXI= 10000
##$MC2= 0
##$MEAN= 0
##$ME_mod= 0
##$MI= 1.114404
##$NCOEF= 0
##$NC_proc= 0
##$NLEV= 6
##$NOISF1= 3.799351
##$NOISF2= 2.8
##$NSP= 1
##$NTH_PI= 0
##$NZP= 0
##$OFFSET= 14.38212
##$PC= 1
##$PHC0= -107.7901
##$PHC1= 10.59221
##$PH_mod= 1
##$PKNL= yes
##$PPARMOD= 0
##$PSCAL= 0
##$PSIGN= 0
##$REVERSE= no
##$SF= 200.129724274929
##$SI= 16384
##$SIGF1= 3
##$SIGF2= 2
##$SINO= 400
##$SIOLD= 16384
##$SREGLST= <1H.CDCl3>
##$SSB= 0
##$STSI= 0
##$STSR= 0
##$SW_p= 3205.1282051282
##$SYMM= 0
##$S_DEV= 0
##$TDeff= 0
##$TDoff= 0
##$TI= <>
##$TILT= no
##$TM1= 0
##$TM2= 0
##$TOPLEV= 0
##$USERP1= <user>
##$USERP2= <user>
##$USERP3= <user>
##$USERP4= <user>
##$USERP5= <user>
##$WDW= 1
##$XDIM= 8192
##$YMAX_p= 0
##$YMIN_p= 0
$$ End of Bruker specific parameters
$$ ---------------------------------
##NTUPLES= NMR FID
##VAR_NAME=  TIME,          FID/REAL,        FID/IMAG
##SYMBOL=    X,             R,               I
##VAR_TYPE=  INDEPENDENT,   DEPENDENT,       DEPENDENT
##VAR_FORM=  AFFN,          ASDF,            ASDF
##VAR_DIM=   8192,          8192,            8192
##UNITS=     SECONDS,       ARBITRARY UNITS, ARBITRARY UNITS
##FACTOR=    0.0002768,     1,               1
##FIRST=     0,             0,               0
##LAST=      2.2672688,     0,               0
##MIN=       0,             -310680,         0
##MAX=       2.2672688,     312420,          0
$$ Real data points
##PAGE= N=1
##DATA TABLE= (X++(R..R)), XYDATA
0@%%%%%%%%%%%%%%%jOqJ1j6J6j6J6k0K8l2L4l9M5n3O1o8P8q7R7j12J24j36J53
39H1j70J86k05K29k53K79l08L38l74M11m50M95n46O05o71P43q24R20j032J165
59F19j324J521j774K103k550L196m197N915r373J8749q8396k35169L26711K18908
73B34939k39658p2315J33479j31697o7387L07715N5839l90527o2410L42339L6898
84A47215k04169M3934L5314j63938R2969K75523j47377l13497J43952K57765j16059
95E1632j10033J09699o7424j31754K11679J64840k77193j71876K53254J13493
105A46317j80358L217R7136j51803m4564K69267K2575l11488q912K67251k2299
116H6339j56648R1794L2799j78978O3534K50458j08505k63934J10332K01688r9892
$$ y = [0, 0, 0, 0, 0, 0, 0, 0, 0, 0, 0, 0, 0, 0, 0, 0, -1, 5, -3, 8, -8, 8, -8, 8, -12, 16, -16, 18, -21, 24, -29, 32, -36, 42, -45, 52, -60, 64, -72, 81, -89, 97, -108, 121, -132, 147, -161, 177, -197, 214, -236, 259, -287, 318, -353, 390, -434, 486, -546, 619, -705, 816, -958, 1145, -1405, 1791, -2406, 3509, -5864, 12885, -75511, -310680, 16031, 234939, -4719, -77034, 56445, -75252, -142639, 165076, 220915, -169612, -232022, 110317, 147215, -56954, -13020, 22294, -141644, -48675, 226848, 79471, -234026, -90074, 167691, 51632, -58401, 51298, -16126, -147880, 63799, 228639, -48554, -220430, 32824, 146317, -34041, -30824, 66312, -85491, -130055, 139212, 161787, -149701, -158613, 108638, 86339, -70309, 21485, 54284, -124694, -61160, 189298, 80793, -183141, -72809, 128879, 28987]
127B8987q3929R8822n3072j17146J58255J36824k02334j28823J84359P8709j25807
138b5155J6724O6352j21435k4509K01241N438k24447N382J82415l2538r8813P7100
150B7755J359j36202O9389J77463j03361j79232J06262J31410r5164m3307R2394
161D8766n0630r4867J24309R9534j51552q6186J37586M3327r8422K1227N4537
172D7629r1948k5184J39397O293j48745P146J17862k6632n9542N6856o44q6824
184f4336M7893J06508o9691r9947P1366O4518o5002j2026N7282m5412n5119Q4221
196B0255M9143r9666l6298Q9026J0832o2034K6831L4322o1726j0097Q7728k010
208D6306r0603J2620P2385k2608m0097L4839L353m9471K2679N5723l8467n2411
$$ y = [28987, -54942, 43880, -9192, -126338, 31917, 168741, -33593, -162416, 21943, 100652, -25155, -8431, 57921, -63514, -88023, 113218, 118656, -105791, -100409, 82006, 49468, -49345, 27755, 29114, -107088, -37699, 139764, 36403, -142829, -36567, 94843, -321, -43628, 48766, -1864, -96731, 27578, 127112, -24440, -110626, 26960, 70287, -28135, -6908, 47629, -44319, -69503, 69894, 76187, -72558, -65412, 52450, 25818, -33724, 23132, 22488, -64336, -16443, 90065, 20374, -79573, -8207, 56311, -8691, -20717, 36565, -8847, -63966, 20255, 69398, -30268, -66566, 22460, 33292, -28742, -1911, 32411, -29315, -39412, 48316, 46306, -44297, -31677, 40708, 18100, -21997, 12842, 16195, -33276, -10597, 45126, 6659, -45752]
220d5752M0906L3022l7108n652L2785k1322k7183M1810K2875m7868j2792M3711
232A7432j448l1148J8111J5463l3249l945M0599p202m0510J4082L0215k0842j5051
245a7493K5970J033k7378J2441K7193j8935j9366K2023J0897k0850k42J8236j0606
258B923j5373J5915R770j9329n242J5110j334j0778O111N944j0087m46J2053j677
272C560r863N169O938n573j560P358k752p427M487O009o365m954N235P48m815
287c805K098L686m333k510N802K744m558j432N016Q23l114J026J924j629j275
302D63J324m51k418l13J018q73j448k76R89K41l55K99K65J087P34M00P06R8J0
321A500J57N44L66j222j206R80R04k784r03J218k09j720P29J654j355j343L458
$$ y = [-45752, -4846, 28176, -8932, -14584, 18201, -3121, -30304, 11506, 34381, -13487, -26279, 17432, 15984, -15164, 2947, 18410, -14839, -18784, 21815, 14613, -25897, -11815, 18400, -2442, -17493, 8477, 9510, -17868, -5427, 21766, 2831, -16535, 5488, 16385, -4465, -4707, 13529, 2923, -12450, 3465, 13235, -6094, -11336, 3774, 2440, -8338, -2227, 3717, -6370, -6816, 5237, 3560, -6303, -1134, 5804, 231, -1329, 6029, 3277, -4150, 337, 6346, -19, -4973, 262, 1010, -3805, -1707, 1979, -2354, -4864, 938, 3682, -876, -2308, 2708, 3531, 417, 1443, 3367, 1738, 463, 1787, 1336, -1082, -1395, -377, -1250, -2698, -2974, -1985, -1744, -2099, -1800, -1535, -448, 286, 686, 1392, 1490, 1500, 1657, 2201, 2567, 1345, 139, 1119, 2023, -761, -1664, -446, -655, -2375, -1646, 8, -1347, -2690, 768]
338G68J262l138P90L584j040k796K156J883l842q98M354k126n844L172M078n013
354b650k297N523j165n027M846N996p196m146J0037K424q490K306P031p121m426
369d355J1336J000j5099R82J3977n273j1269Q954L940j3234K867J7003q642j6952
383a4765J3039J4409j4184n742J5963m964j5218J5560J3811k3242j1517K4461
395G611M601k2458N002J4917j7552p127K8388L14l2824N444L1852j1013j9679
408a2524J8630M579k6005J1047L2494k2686l3693K7031K4655k7525q628K4093
420A1468j3692k2750L3108K0955m4201j7206M4992Q043l3890R701J9414k9616
432a3674m967M8569n012n6377J1361M8204j7507k8737K5692J070l8120K2962M7952
$$ y = [768, 2030, -1108, -318, 3266, 2226, -570, 1586, 3469, -373, -1271, 3083, 957, -4887, -1715, 2363, -2650, -4947, 576, -589, -5616, -770, 5226, -1970, -6116, 3921, 6345, -2145, 161, 7192, 71, -4355, 6981, 7981, -7118, -6136, 7841, 2568, -8701, 253, 4193, -9041, -6174, 10829, 2187, -14765, -1726, 12683, -1501, -7243, 8720, 3756, -11462, 4098, 17909, -5333, -16850, 7611, 12212, -10246, -5244, 9673, -7879, -15006, 13382, 13696, -19128, -13684, 18168, 7155, -12524, 6106, 10685, -15320, -4273, 28221, 5535, -28158, -1127, 23528, -3997, -12625, 11468, -2224, -24974, 8134, 29089, -15112, -32318, 12674, 20717, -13173, -3472, 15942, -13674, -18641, 29928, 24916, -31461, -20100, 28104, 10597, -18140, 7552, 8622, -29498, -6536, 41416]
445D1416l8583m8594M2629L6203l8261q538L2571k3555k8180N3368K5916o7988
457b1596k1060O4113P397m6212J5380K0304m5209O94O9378j4714p8286K0640O5193
470C6022k4263l3097L3816n916m6657M1568N9428n9448o0464N9839M3298m8436
482d310q908L4219l4852k7305P1071K3390q7871j9635P9334O202n0595K0026J6843
495A7609n2959J2256Q0880k6171q9651L0772P2716l2636l3374L8267j4485n1957
507d8733N3275O3680p3571o4031P0327M3706n3494l232L5066m4940k2780Q5295
519D0568J9667r9974j5182Q6847J420n1333K5701R783o1935K1176R0475l6692
531C0521r8170L6563P5915l3647l0838L7761k1890m9366O4120O2481q1525o1601
$$ y = [41416, 2833, -45761, -3132, 33071, -5190, -13728, 18843, -4712, -32892, 20476, 46392, -21596, -42656, 21457, 28854, -17358, -1978, 18326, -26883, -26189, 43189, 28475, -49811, -29171, 36022, 11759, -21338, 12478, 6562, -40095, 1473, 60901, 1453, -59011, 828, 44126, -4310, -13218, 21001, -13851, -41156, 29915, 53305, -34566, -54201, 25133, 31335, -19260, 766, 17609, -35350, -23094, 57786, 31615, -58036, -27264, 45452, 12816, -20558, 17709, 3224, -48733, 4542, 68222, -5349, -69380, 947, 44653, -8841, -12073, 22993, -21947, -44727, 40568, 60235, -39739, -54921, 31926, 33346, -17987, 7714, 17497, -44438, -23262, 67213, 30521, -67649, -31086, 44829, 11182, -19656, 18105, -3785, -53151, 10969, 73450, -8075, -69676]
543f9676P4301M0788n1446J412K8027n0984j5837R0195J1315j04226r275Q6636
555C1230l062m7785K8064L682o0025K9495Q7003m3282r1345M2601O9339l6824
567I091k3043L6602k9358m4630O9230N2757q5270n1907P4674L0413m9882Q015
579c308K4181n3466p693Q7569K815r5860K94P7205q421l8163K8525l487n4643
592d4452L3541P4775m6212p6767M2874N3440l5166j3623L1360l0914l5529O4117
604A7444M0768p5005l7015O5176J9542m0898J2401J7475m7707k273P3550l645
616C9813p9956O143O1964j3839k9908K7831n605m6336L1676N8788m1607n7114
628d8150L9456L9026l2185n490K8032k9831k6836N4683K7124o1841k2507N1830
$$ y = [-69676, 4625, 45413, -6033, -4621, 23406, -27578, -43415, 46780, 58095, -46131, -55406, 31230, 28168, -19617, 8447, 12129, -47896, -18401, 68602, 25320, -66025, -23424, 45915, 9091, -13952, 22650, -6708, -51338, 17892, 70649, -14621, -66528, 8146, 38559, -11323, -3308, 20873, -32593, -40286, 47283, 50098, -45762, -45468, 31737, 23316, -14847, 13678, 10191, -44452, -10911, 63864, 17652, -59115, -16241, 37199, 2033, -11590, 19770, -11144, -46673, 17444, 58212, -16793, -53808, 11368, 30910, -9988, 2413, 19888, -27819, -30092, 43458, 39813, -40143, -34000, 27964, 14125, -15783, 12048, 6443, -39893, -8217, 50571, 8964, -48150, -8694, 30332, -1853, -7343, 20689, -9142, -35978, 18705, 45829, -16012, -38519, 13311]
640A3311P289l3092J5662J2276m0366R74N6885p704n7906J1440M3099j5595j8311
653a2038K5549p583l5077K6574M1007l3356l7637L1381K2030k6178Q44K0158k4427
666h753j7962L9801J5591m3632j0736L6106J285k1709J4297P517k8409L524L7899
679B4819r195l6759J1798K6094j5091r863J8288p276k3292J8885K4802k4014k1095
692b1899K2470J1420j8059L331J3626j5728j0471K5314P885k6762l469K1950k641
705F967j4183J0196M953j8111J396K1584n855k0679Q422J4083j0277m456J1904
718E944l731j3030J0953J3090j3423r821J3684M001j1048K581P874r576o038J3409
732D869K189j3661k10J1389l521p043P386K599r420J699J0577l406r281N721N832
$$ y = [13311, 20600, -12492, 3170, 15446, -24920, -23946, 32939, 25235, -32671, -21231, 21868, 6273, -12038, 13511, 5928, -29149, -2575, 38432, 5076, -32561, -1180, 20850, -5328, -4484, 15674, -8753, -26715, 13086, 28677, -14955, -25691, 10415, 11700, -10009, 4288, 11805, -16604, -13080, 24819, 15624, -21135, -9337, 16757, 1666, -8197, 10091, 2815, -20477, -1592, 23210, -804, -21899, 571, 11991, -6068, -2737, 10889, -4839, -15310, 10004, 17889, -8873, -12342, 9608, 6967, -7216, 2980, 7933, -10178, -8782, 12802, 6947, -13732, -5310, 8773, -1504, -5960, 5944, 2213, -10817, 136, 13226, -197, -10018, 3666, 7667, -3381, -800, 7074, -2502, -8540, 4869, 7058, -6603, -6813, 4576, 1055, -5988, 1398, 3997, -5423, -3724, 6853, 3447, -5834, -113, 5719]
747E719o447j056O240k897o240M958M685o546l170N511Q45m694J778L017l295
762a592j271M888N97m393Q73L716j606j989K407L01l180P24K441j636k324J324
778g20J215j781n09J574j37j092R25J473j032m98J569N05j075RR46n05p81N51
796F37r1r74o7N77o00q19N98N23p31l41J222J61o10Q55M39n45Q9Q59r6j157O89
817F18L24j072m54J092n32j464P35R40j170k48J342j36j275J425J266j336p20
834f65K349J28k203R79J250k021o83K031J70l252M21L097k299j889K751M20l190
851b606J846L425k233l036L189K860l965l63L920k225l474M005K481o003j810
866c989O024j37n472K622L016m903q40P453m36q539K745P593l752m291N529L49
$$ y = [5719, -728, -1784, 4456, 1559, -4681, 277, 4962, -1584, -4754, 757, 1602, -3092, -1314, 1703, -1592, -2863, 2025, 2622, -1771, -898, 2818, 1212, -777, 1630, 1931, -1249, -525, 1916, 280, -2044, -720, 495, -1286, -1795, -221, -358, -1450, -525, 948, -84, -582, 987, 1492, 417, 426, 1372, 867, 86, 637, 546, -428, -495, 82, -518, -1337, -739, -216, -947, -1288, -66, 95, -515, 340, 779, 234, 323, 1182, 1086, -71, 618, 942, -130, -584, 508, -24, -1488, -753, 187, -983, -1231, 111, -25, -1300, 125, 1391, 55, -665, 1684, 1812, -391, 588, 1838, -183, -866, 1165, 1335, -1917, -1496, 1601, -698, -2587, 164, 584, -2606, -760, 2665, 432, -2604, 585, 3445, -520, -883, 3037, 812, -2662, 1343, 3824, -2179, -3989, 2035, 1898, -3574, -952, 2064, -2839, -3679, 3774, 3338, -5201, -2456, 5137, 1385, -2906, 2623, 2972]
882B972o639L282P805o984q119P925N291q122j376P517m990n919R943N099j2878
897e193k892J3398m3r570M798N182r949l55J4144l294j6194N488J3211p729p281
912f279R521j341j2221R195J3737j3829j2737J5206Q648j2992j85J0799r842p758
926a0078J8022O149k2498l786K0472j207j4008P521M986j5885K585K2254p281
939G246k4268R781J9615j0429q470J2756m119j5923J5721J8558k1646j7339K1006
952B489J0672j7060R78J1240j5487p974K7143M972l0923k726K7140k320j5956
965g812J1098L497k1251P223L0090j3349l0912J4379K3370j4534q619J5227r267
978h60j8505K3069K1017k9434j9973K7767J1378j9467L227J1532j9896o092L3973
$$ y = [2972, -3667, -385, 7420, 436, -7683, 242, 5533, -2589, -3965, 3552, -1438, -7357, 2586, 7685, -5193, -8085, 5313, 5270, -4300, 498, 5680, -4269, -4624, 9520, 6226, -9968, -4480, 8731, 1002, -6279, 3242, 1901, -10320, -1125, 12612, -1217, -13954, 1252, 9900, -3092, -3277, 7522, -2320, -10078, 7944, 14093, -8405, -12191, 8281, 7074, -6934, 587, 5573, -10312, -7727, 14527, 7246, -17022, -7241, 12374, 1945, -6525, 6231, 2112, -13811, 1910, 20468, -1178, -18517, 2489, 13161, -3899, -2921, 8319, -7168, -15142, 12001, 16973, -13950, -16676, 10464, 8144, -7812, 3286, 6783, -14468, -7245, 22845, 9496, -21416, -7037, 16333, 1799, -6820, 8407, -860, -19365, 3704, 24721, -4713, -24686, 3081, 14459, -5008, -1781, 9751, -10145, -16237, 17736]
991A7736L438l7801j229L1474l900j7011J2439P06k4552J1337L2823j7791l3562
1004b5893J7757K4397j5893o630J6344j3464j8184K9135K1227l4763j9168L0853
1016E718R927k1083O016J0256k4460l557L7838J25m1499J671L2788o505j5574
1029h339J5329k462k5812J6462L3942k1647l3976K0663K4014j8054m083J5548
1041A1585j6401j7408L1493J8589l6651j6921L1051P684j9435P928P705k5340
1053a6121R3L8228k425m0004M436K9875p399j3016J5240n081k5096J7885L1469
1066B8084k3583l0308K1379J8940j6529j367J4251j8323j3922L1960J5227l5499
1078i690j2199K9330M158j7248R666N470k4690K670L4233o076l5348O630K5515
$$ y = [17736, 21174, -16627, -17856, 13618, 9718, -7293, 5146, 5852, -18700, -7363, 25460, 7669, -25893, -8136, 16261, 368, -6262, 10082, -3382, -21566, 7569, 28796, -5967, -25135, 5718, 15645, -5438, 578, 10834, -13626, -17183, 20655, 20780, -20719, -19048, 13740, 7235, -8339, 6990, 4528, -21284, -4822, 29120, 7473, -26503, -5840, 18174, 120, -3963, 11585, -4816, -22224, 9269, 27858, -8793, -25714, 5337, 13021, -6414, 1514, 9219, -16121, -16028, 22200, 19775, -20229, -15793, 14082, 6683, -6333, 8907, 3826, -21270, -3385, 28084, 4501, -25807, -4428, 14512, -2017, -3384, 10867, -7456, -21378, 10582, 25809, -9690, -21889, 7441, 11599, -5649, 4017, 9487, -15203, -12533, 21700, 15624, -19724, -13094, 12421]
1091A2421q985r638J4302p105k1308J8744K6195k2557k4060K0958J4108j5248
1103b173J113J2063j7621j0701K7975J0420l0285q199K4059J171j4356R853L641
1116F960k1170L598K8866p239k7986Q363J9702r467o191J3339p488j7247J6956
1129I96J9356k0014j7402J7975Q647j3454K997R397j5375p270K3208N555k3986
1142i370l067J9512k101j0121R771J455j7093M917K1098p704k0120Q496J2719
1155H392q951l271J0518p028j2286J3296J2745j4982j0386J3765M094r308L856
1168D54O100j0996m116J6180K358j6245l99J2317l496n967P190o0j1548L843J3364
1183H979o237j1706O684P516o614j127P673m823p752R085P351r970n442Q963J385
$$ y = [12421, 3436, -6202, 8100, 995, -20313, -1569, 24626, 2069, -21991, -1033, 13075, -2173, -1060, 11003, -6618, -17319, 10656, 21076, -9209, -17408, 6651, 7822, -6534, 3319, 6960, -14210, -10612, 18254, 11015, -16971, -8608, 11094, 1627, -4564, 8775, 1287, -15960, 996, 20352, 338, -17064, 911, 9558, -3896, -899, 8498, -6877, -14147, 9061, 14616, -9370, -12437, 7075, 4974, -5147, 4624, 6079, -11014, -6097, 15001, 7297, -12823, -4327, 8392, -559, -3830, 6688, -340, -12626, 670, 13415, -1567, -11953, 1812, 5906, -3402, 454, 6554, -4442, -8558, 7622, 9980, -6265, -6664, 5653, 2157, -3810, 3380, 3320, -8228, -4385, 8979, 2742, -8964, -2280, 5236, -1378, -2505, 5168, 345, -7407, 1678, 9029, -941, -6383, 2580, 3965]
1198C965o794K824M326p671k285R974N99r827O42P493k607l890N001N64o545K436
1214a795P506l751o484M615L621m521o49M399k783m886N069L581n524k500N472
1229A370o3l782K637K083m132m67M913r4m519J228L316k000j867K754N8l576J397
1246g44L058k213k968K725J351k323J73K052q92j594J826J171j874m44J814l47
1262G71j285Q46P43j343l86J458l32j740L96J079p65m69P54K46p07L21J078j93
1280D72r48Q24P09o54k83M85j33r55P85N3n72o52P74M0o77J65N31n24j04N18M44
1301B98o37K44R50o00m04Q26J48r12n9N94n30o45Q63N1j212j85J568n74o32Q73
1321B5K58p68L69J194p11o15P40O22q28l01J026p14j193J014M93j377n34J879
$$ y = [3965, -2829, -5, 4321, -3350, -5635, 4339, 4938, -4889, -4247, 3246, 639, -3251, 1750, 2314, -4231, -1795, 5711, 1960, -4524, 91, 3712, -809, -1458, 2941, 158, -4728, 341, 3922, -1602, -4102, 1370, 1307, -2475, 162, 2245, -1887, -2354, 2559, 2465, -2054, -826, 2490, 490, -1377, 1377, 1435, -2141, -744, 2314, 101, -2867, -142, 1209, -1114, -941, 1111, 219, -1375, 451, 1622, -252, -696, 1118, 771, -514, 332, 1075, -268, -654, 804, 472, -1268, -872, 207, -558, -1027, -273, -27, -734, -413, 665, 472, -476, 348, 1057, 403, 120, 605, 472, -483, 302, 355, -217, -869, -95, -55, -732, -567, -36, -560, -664, -146, 298, -339, -95, 855, 255, -149, 677, 825, -87, -146, 448, -82, -727, 136, 187, -1025, -1210, 358, -216, -848, 25, 283, -485, -116, 1078, 367, -248, 492, 1114, 286, -15, 1011, 297, -896, 118, 611, -766, -1300, 579]
1339E79l86j565R34J063j525j7K180m39k104R55K012j160j094J590J48k518J510
1356A63J817k275j822K091J526k632j7K376j620j890L500Q73l633k55L892l87
1372A707k821K130J026l555J23M398r75n287J966L774k598k309L748j021l908
1387c602L392M562m778l718N296K265m623M92L810l724k566O265J183p794o8O672
1403C064j264m643L295J637o388J945P508l229q000M737O220n327j356N330k983
1418E46n605O325O024q863n015Q396K317o831K184L805o697k235J0711L43j1445
1433f040P26R659k155n057N046L50q122L575J0788o149j0902O454P662o164k145
1448b474N968m515o656R818O969j2036o134J1138L050p870K967M407r450j043
$$ y = [579, 193, -1372, -438, 625, -900, -917, 1263, 824, -1280, -325, 1687, 527, -567, 1023, 1171, -1347, 163, 1980, -295, -2117, -26, 1500, -1132, -1149, 1227, -393, -2283, 1217, 2090, -1543, -1798, 2094, 1707, -1114, 1016, 2042, -1513, -1390, 3008, 2033, -3254, -1288, 2486, -112, -2421, 1327, 306, -3602, -210, 4352, -426, -4144, 1152, 3417, -1206, -714, 3096, -628, -3194, 3071, 4254, -3540, -3608, 3064, 1800, -2843, 452, 2089, -4299, -2354, 5154, 1925, -6075, -1338, 4882, -445, -1801, 3529, 546, -5059, 1266, 7290, -1573, -6588, 1808, 4125, -2706, -522, 3283, -3414, -5649, 5062, 5405, -6040, -5314, 4345, 2190, -2867, 2179, 2529, -5593, -2018, 8770, 2621, -8281, -1827, 5835, -329, -2474, 3494, -1021, -7677, 2141, 9110, -2926, -9060, 2078, 5128, -2742, 225, 4632, -4818, -5861]
1462e861J4012n42j5002J605J1659l504n860O829j375j0651O452J3286r277j2512
1476a0741R235P832p798n59P092p199o981J3869O776j5347o097J3392K216q722
1490c032M021L229j1326O27J5678j909j7091K878J2963m072n473P939k994j1322
1504i884R181J3758j1276j3331J0673P858q046K53O507r422o388J5467O400j7339
1518e589m780J4237O85q467O143K097j2593K298J7600m269j7230M348J2342n131
1532A691l932P604m824j1387J0839J3464j3373j2057J1468O753q618K032O073
1545E733j0697n104J7073M786j7578l282J3498l5o964N923Q94j3238L606J6501
1559A1116n153j6182N010J1111n698k563P617n700j0362J1609J1780j2655j0438
$$ y = [-5861, 8151, 7609, -7393, -5788, 5871, 2367, -3493, 3336, 1961, -8690, -2238, 11048, 1771, -10741, -1506, 6326, -1472, -2031, 5061, -2138, -9119, 4750, 11526, -3821, -9918, 3474, 5690, -3032, 989, 4218, -7108, -6481, 9197, 7288, -9803, -6925, 6038, 1966, -3507, 4432, 1438, -9884, -703, 13055, 1779, -11552, -879, 6979, -1067, -814, 5693, -3729, -10117, 5350, 11750, -5589, -10369, 3868, 4553, -3914, 2229, 4326, -8267, -5969, 11631, 7362, -9868, -5520, 6822, 1691, -2241, 5363, 539, -10848, -9, 13455, 82, -11975, -507, 6246, -2372, -340, 5733, -4964, -10068, 7005, 11791, -5787, -9069, 4429, 4394, -2570, 3353, 4247, -8991, -5385, 11116, 5963, -10219, -5209, 5902, 204, -2359, 5258, -442, -10804, 805, 12585, -70, -10508]
1572a0508J1282M975p851L007M954j0724l547J5051L325j6363j752J2316j511
1585B654n947O568n48j1743M894J4590n619j4038N902Q995n757j216O805o368
1599h28q309J1165Q923j1948p561R662K872o729L149M125r688k259J3414J652
1613G640j3198m82J0120k170m245N932q49r722M359J1352n548j0819N840O172
1627D382n759j79N914n513o402Q879O633r728m833Q047J559n435L716K924q284
1642d079o41J0386k9j0154P36P279k720l136M864q09p268L623Q136m758o919M434
1658a055M552m355J49M342m288m042O686L787o951k799N813O4l819K533K032n404
1674b755q94O627L6o613J106M971k303k029L940q67m503K595N080l296m247K846
$$ y = [-10508, 774, 5749, -2102, 905, 5859, -4865, -8412, 6639, 9964, -6399, -8151, 4165, 2654, -3293, 3275, 2727, -9016, -4122, 10468, 4849, -9189, -3287, 5708, -49, -1265, 5540, -828, -9137, 2028, 10951, -997, -8558, 1104, 3976, -2753, 396, 4521, -5167, -7426, 5988, 7640, -5558, -6040, 4080, 1910, -2335, 3597, 2748, -6974, -2615, 8737, 3189, -7630, -1790, 4382, -1377, -1556, 4358, -1155, -7557, 1322, 7955, -1773, -6606, 1441, 3000, -2435, 1281, 4205, -4079, -4720, 5666, 5637, -4517, -3781, 3498, 778, -2358, 2506, 1697, -5571, -1948, 6188, 1430, -5489, -1055, 3497, -858, -709, 3633, -655, -4697, 1989, 5776, -1175, -3974, 1839, 1903, -1916, 617, 2649, -2755, -3649, 2978, 3014, -3599, -2493, 2478, 175, -1854, 2086, 1219, -3284, -689, 4391, 1095, -3152, -306]
1690c06K664l356L71K802k956k569M041K354m322j554L854j07k632K068J587l268
1706a329k49M203p28l759Q67K984k185q50K416p18k919J625K612k032k151K122
1722i1J045k121O49J928j686j205K300J084k472j53J727l26j387J199L97j834
1738i46jJ834n00j783J277P38j066k09J147m22r02R43R19q74n31R27L53r29R8
1757G3P04o46q71O84O22j018k03O59l47KK49P5l68j21R94j10m82J34O71n90l16
1778b05N04R2o17j6N86m32n50O39J08r86L61P79k69k99L14N66o12j04P26j48p59
1799c22M98K17n35k33O66n4n90L85j22k01l96R92Mp07M55N05n85l86R88j21m81
1820b3K41L28m47J7K34k21p86P56M53q88m37P31M78q04j18M67j32k70J118J98
$$ y = [-306, 2358, -998, -627, 2175, -781, -3350, 691, 3045, -1277, -2831, 1023, 916, -1716, 352, 1939, -1329, -1578, 2625, 1897, -1862, -995, 1989, -196, -1046, 1370, 652, -2267, -642, 1970, -62, -2213, -91, 954, -1167, -518, 1410, -276, -1481, 819, 1903, -569, -722, 1005, 679, -708, 491, 888, -946, -947, 887, 387, -1396, -119, 619, -447, -656, 491, 69, -833, 110, 1029, 155, -376, 551, 904, -25, 73, 777, 131, -740, -56, 566, -452, -655, 4, -343, -341, -92, -17, -385, -506, 488, 378, -104, 30, 701, 111, -205, 299, 391, -226, -242, 344, -88, -638, 1, 109, -877, -516, 263, -6, -305, 9, 575, -37, -141, 585, 437, -322, 176, 393, -142, -375, 291, 237, -353, 32, -90, -291, -687, 305, 309, -398, 57, 562, -23, -409, 579, 458, -23, 218, 546, 99, 116, 350, 129, -657, 99, 552, -336, -773, -42, 436, -368, -486, -19, -151, -421, 697, 895]
1840H95j695M46J309j74j032N48K93j127K92J237q99j468J102J037p96j053J255
1857A70l19j480J899R26j259j328K121M98j686L96J293j907m06K536q3k795L87
1874a037K144q79j324J601J17k259J054K791j694k370J653J969j762p33K244j448
1890F7j706K623J631l740j041L139L29k868J323J398k928l32M278k71m222O32
1906a688L671j403j728K553l34l507K145L814k875l681K929K401l163k05K913
1921A842k616k363M590K045n440j260M923M0l179K120J141m048K57N835j495o035
1937c643J950M050k098j851K990q81m501L669M809m348m384L941K990l281J16
1952d72K897l572k359O118K094o652j692N520k26k918K118R83n506R75P171k071
$$ y = [895, -800, -354, 955, 781, -251, 297, 590, -537, -245, 992, 93, -1375, -273, 764, -32, -1085, 170, -149, -1629, 270, 1196, -63, -1391, 730, 1228, -458, -62, 1231, -676, -1082, 1454, 1371, -1424, -1037, 1107, 228, -1096, 505, 622, -1637, -583, 2208, 514, -1856, -203, 1766, 4, -729, 1515, 67, -1639, 984, 2615, -1125, -2166, 973, 1302, -1566, -243, 1155, -1773, -2105, 2173, 1902, -2320, -1688, 1983, 580, -1148, 1405, 1071, -2436, -291, 3523, 648, -3033, -104, 2297, -866, -1071, 1842, -774, -3137, 1453, 3498, -1942, -3202, 1721, 1761, -1418, 702, 1843, -2205, -1948, 3887, 2392, -3643, -1693, 2357, 259, -1592, 1398, 517, -3984, -315, 4494, 146, -4238, -297, 2693, -588, -472, 2425, -1147, -3506, 2612, 4706, -1946, -3638, 1882, 1656, -1262, 856, 1839, -3667, -2692, 4479, 2408]
1968B408p154K467N293k545j867L886j857n149M996N558n961m833N153K645m179
1983a139J251K381m684k390P562J784p881r22N868m17l230L616J67o242K030Q105
1999E859k762p696K498N230k892j023L675l275n032O143N388o689m769N711K103
2014B469l947J834K239n497j632Q679J239q666n80O284p02l062L633j053o165
2029d927K679Q083l661p472L565M405l231m97L996l655m771O400N249o934m224
2044d995N744J959m146K669J557n807j420Q212O73p926k90N856j283k413L759
2059B149j117o022L315P237l263o654L354L954l330J00L325l926l892O300L839
2074E369o662l220N333J056l176J936J725n469o57P617J3p087P49M794j871j494
$$ y = [2408, -4746, -2279, 3014, 469, -1398, 2488, 631, -4518, 478, 6036, 75, -4758, 395, 3040, -1139, 112, 2493, -2191, -4581, 2981, 4765, -3116, -4038, 1830, 1413, -1817, 1799, 1966, -4276, -2246, 5859, 3097, -4599, -2101, 3129, 237, -786, 2889, -386, -5418, 725, 6113, -576, -5345, 366, 2469, -1478, 356, 2595, -2902, -4534, 4145, 5384, -3282, -3862, 2422, 1720, -1342, 2291, 1238, -4927, -2248, 5835, 2174, -5298, -1733, 2672, -559, -1056, 2940, -715, -5486, 914, 6163, -771, -4995, 749, 2708, -1438, 1231, 2788, -3019, -4439, 3773, 4446, -3480, -3770, 2086, 803, -1610, 2149, 1032, -4990, -1675, 5562, 2299, -4355, -1001, 2953, -377, -277, 3048, -878, -4770, 1530, 5369, -1293, -4513, 820, 1876, -1300, 636, 2361, -3108, -3765, 3852, 3865, -3222, -2473, 2321, 450, -1044]
2090a044L533j505n263L084O175l722n309L261K911k714J78K839l680l053N805
2105A496K727n735j867M710j80k187K300R36m783j2N903p11n183M81L891j972
2121a86q77K761j014m066K583M739l310l926L260J608k295J014K068l356j702
2136b699M131J918m872o71L292n53j722J882M79l234J27M422q63l810J343K423
2152A593j639p44K299j209k523K453K591k719k141K132R25j813O97J327k057j376
2168b204L116R66k860m40K366o27q80J125M63k369M50K477m53k614R67J531j049
2185c5n24J710j231j536J528J509j618j419J889K58j170Q22Q11j071r39J921N81
2202A486j982k32J367j66j003J162k67j445J93J743l53j354N75O85o32m43J427
$$ y = [-1044, 2489, 984, -4279, -1195, 4980, 1258, -4051, -790, 2121, -593, -415, 2424, -1256, -4309, 1496, 4223, -1512, -3379, 1331, 1151, -1036, 1264, 2200, -2583, -2595, 3308, 2597, -2586, -2105, 1786, -186, -1063, 1698, 684, -3382, -799, 3940, 630, -3296, -36, 1572, -723, 291, 2359, -997, -2699, 1432, 3350, -1522, -2193, 1099, 546, -1176, 706, 1185, -2049, -1922, 2500, 1637, -2173, -830, 1593, -46, -790, 1509, 300, -2223, 230, 2821, 102, -2039, 93, 1018, -795, -98, 1229, -828, -2204, 912, 1878, -982, -1422, 944, 317, -563, 562, 1025, -1344, -894, 1583, 1130, -1484, -517, 1014, -35, -559, 1151, -80, -1616, -88, 1421, -197, -1616, 273, 531, -639, 183, 994, -77, -1016, 905, 1486, -496, -728, 639, 473, -530, 632, 365, -1080, -887, 856, 503, -851, -276, 409, -223, -666, 761]
2219G61m99r74Q59P49j111o75J452k61m21l8P60j170k72Q61L84j113K22J145q04
2238a45m09P84j83l44J94O58k13p13M24N14k94m79M11r9m24K77O17o11o42O59
2258a8K50n68K91M49n69j44N94M4l25o0O56j63k40j31P7k54p1J72k06n2J95J74
2280A01m48K5K95ml17K59L99k51k05N63O2o25M13J7l68M0L02M3p14L55K55j24
2302G3l64N98k40k96Q9K78j71j06L91j0m80K66O8P0m27M55K51o65p3N45r1q91
2324g30P31J46l93j77L69J6r1j79P61n02k39N61L08p19r6O86o30j36Q09j77p82
2345d64M5P54p65j75O16L7o64N81Q96o60r01J009J93r12J24P20m73q69J511K06
2365H09j330m57J253L9j142Q55L59j122K16J629n12j579O63J247q79k54Q72n42
$$ y = [761, 262, -712, 147, 896, -215, -890, 562, 301, -120, -158, 602, -568, -840, 21, 405, -708, -486, 659, -145, -554, 230, 47, -297, -103, 555, 342, -371, 53, 567, 273, -206, 205, 106, -318, -41, 576, -35, -677, -18, 232, -336, -45, 404, -165, -309, 285, 329, 4, -56, 600, 437, 197, 66, 143, -111, -182, -10, -216, -268, -73, 101, -347, -322, -27, -31, -348, -89, 310, 59, -146, 417, 479, -146, 267, 284, -84, -44, 258, 301, -413, -58, 197, 73, -291, 307, 67, -229, -140, 138, -33, -139, 252, 242, -238, 28, 96, 166, -261, 194, 445, -220, -293, 252, 161, -730, 1, 147, -246, -423, -54, -38, -129, -308, 453, -49, -288, 273, 581, -138, -234, 452, -178, -314, 495, 318, -464, -419, 335, -430, -605, 11, 48, -616, -35, 861, 201, -700, 309, 502, -410, -286, 434, -39, -908, 603, 809, -521, -978, 275, 314, -828, 27, 386, -736, -520, 1109, 597, -982, -319, 928, 49, -205, 667, 125]
2383A25j167R87J729j508j726J711M47j063L29Q75j045r96J801R17k193k85J830
2400G68j76j327J603m2j746O2K317p65k247R67J314o94p81J334k93j903J749J619
2418A759j968j512J925J093j891P82J182j876o91K391N46l176M1K508n57r28J297
2435I25l22k449J018L061j403k659J202J997j263m85J977j310k263K504K106k965
2451c29j491K114J028j853M87J070k526o40L776M26l753M48K237m81j345K309
2467A477o01k903J462L334j746l331K046J559j495o8J578j779k014L230J987l881
2483a145j057K565O51j899J548Q34l120j0M008R8m032L04K650j436q88K337r91
2500D17l041K181L289k334k959K043J819j822L35J712k551j510L736J556l659
$$ y = [125, -1042, -55, 1674, 166, -1560, 151, 598, -465, -136, 739, -306, -1302, 499, 1416, -777, -1062, 768, 592, -735, 868, 826, -920, -858, 1459, 694, -1553, -586, 728, 34, -747, 587, 294, -1609, 140, 1759, -209, -1721, 204, 1297, -594, 188, 1370, -506, -1197, 1194, 1740, -1436, -1395, 1113, 556, -372, 925, 603, -1846, -828, 2233, 830, -1829, -627, 1370, 107, -378, 1599, 289, -1974, 530, 2636, -329, -1820, 294, 1322, -531, -44, 1026, -1500, -2140, 1636, 2062, -1691, -1243, 994, 513, -832, 1477, 876, -2027, -565, 2769, 1023, -2308, -262, 1297, -198, -266, 1312, -467, -2481, 749, 2736, -1145, -2202, 363, 1014, -885, 663, 1497, -1623, -1633, 2375, 2473, -1559, -1255, 1395, -41, -929, 1408, 417, -2624, -443, 2846, 512, -2447, -404, 1415, -407, -72, 1640, -911, -2421, 1315, 2871, -788]
2515g88j704L544O5j798J579N71l438PM330o23m046J063K103q79o35K051j101
2532C01l058K582L298k705k848K031J420j542N31J363k758j150L575J496l851
2547a315p26K725j05j569J638J17k944Q48M013r28l803J344K040j478k44J800
2563A413j365k743K521K992k903k134K052J147j917P66J788k884r53L835O74l504
2579a215l48K525n80j146J878j76l076R78L415j079k859R93J822j465k42K203
2595A628j831k073K561K040k683j400K038O72j796J046J315k627n46L018N52k993
2611a079k19K099o96p76J301l8k269M96L050j383k093J370J129r56j18J431j181
2628F8j611J661J738k002j073J657L55j603P49Q93j895p2K038O04k476P2J780
$$ y = [-788, -2492, 1052, 1117, -681, 898, 1469, -1969, -1962, 2368, 1745, -2301, -1238, 865, -14, -649, 1402, 301, -2757, -175, 3123, 418, -2430, -399, 1021, -521, 10, 1373, -1385, -2535, 1040, 2536, -1315, -2041, 684, 579, -990, 648, 765, -2179, -1331, 2682, 1754, -2049, -705, 1335, -143, -387, 1413, 48, -2695, -174, 2818, -85, -2219, -167, 980, -937, -171, 1617, -1267, -2220, 1615, 2289, -1215, -1563, 962, 382, -764, 1114, 938, -2138, -1160, 2255, 1176, -1683, -690, 1132, -333, -575, 1628, -203, -2276, 285, 2325, -358, -1758, 280, 952, -844, 202, 1517, -1110, -1656, 1362, 1914, -1079, -1298, 801, 105, -671, 630, 592, -1677, -1181, 1869, 486, -1607, -237, 892, -64, -182, 1249, 68, -1543, 118, 1856, -146, -1219, 438, 793, -810, -61, 832, -1063, -1135, 903, 1507, -969, -897, 883]
2645H83p22o34J367j45k060Q72J663r82j397R47P46r75M21P87j039r18J338R04
2663A056j493l53R96K4q70R64N58j399J15J501l29j378K68J112p41n31R39n6j369
2682i86N91J218p42r18N38P54o49j02R32o92m70R02M00j052l23R97j04l76J56
2701G4L40r45N2R19l68n99J11O77m20J30L13j68k27P7P74n42n47N23K30o08l2
2722b36N76o37k60N61M46n11n95P49K57n76O5M00k82l9L39l0l36K24N1k7lQ7k95
2745g2l39M1O40l46l13N17J70m13l6O14m19k09J21J41q0k61N73j85l69M10j07
2766G8o5N3j20Q9l94r1O52l16r0L80l24K6K63R1k44k63M35J14k39j06K19k85J99
2789F2j18J70m91L05L00k63k18M51k34r4J10J79j13L2j02M57n19L12K6K6n74J41
$$ y = [883, 161, -473, 894, 749, -1311, -439, 1224, 242, -1155, -208, 538, -437, -16, 771, -268, -1186, 152, 1056, -437, -790, 206, 230, -640, 324, 882, -517, -402, 1099, 770, -608, -340, 772, 31, -500, 439, 383, -986, -395, 823, 81, -837, -299, 455, -194, -296, 636, -56, -526, 376, 776, -276, -599, 398, 294, -82, 74, 414, -531, -479, 440, 72, -527, -416, 261, -159, -29, 284, 116, -111, -34, 740, 198, -349, 174, 404, -204, -236, 340, -297, -557, 4, 450, -61, -656, 93, 350, -226, -161, 239, -43, -82, 257, 227, -109, 115, 166, 139, 136, 223, -72, -411, -370, 270, -76, -389, 128, 298, -115, -151, 463, 44, -165, -44, 97, 17, -244, 329, 144, -225, 185, 78, 13, 66, -54, 35, -359, -450, 202, -114, -204, 176, -148, -122, 141, 232, -12, -275, 160, 274, 35, -71, 148, -137, 62, -56, 114, -377, -72, 228, -35, -253, 198, -36, -130, -20, 159, 46, 78, -24, 433, -86, 226, 252, 278, -296, -155]
2811a55N95m89k70P28p97k10N00R3Mm00L73n0p7J96L84q14P4L23M02m41l2N26
2833D63m35l51N63M38q46m82Q94j29n53K63K98o87M15P32l73n72L32M06k88k51
2853a63M00J7q65M20P25q30k62O45J91n46o4N02o64J99M79J37n39J58O52m07m56
2874b71N17J90j062M74J018m52j128N37O43p92J21N32l13o31J053N60j303o83
2892i90J480j17o54L49O68j099k99J454Rj820O13J253r77l73O05L8j308Q97J422
2911A151r33j485J315N03o77J52O94q29o42J333Q14j580j001J654k0q87O74J92
2929D28j507M10J978n52j815K96J596q61j97J323j053j149J036J531j388j444
2945a368J191R00r36k09J248j223q89J693P87k100j91J558k25p80J112J07j854
$$ y = [-155, 440, -49, -319, 409, -388, -598, -98, -5, -1, -401, -28, -78, -155, 41, 425, -389, -315, 8, 410, -31, -63, 463, 28, -323, 240, 678, -168, -650, 244, 115, -438, -175, 123, -564, -149, 583, 210, -362, -30, 376, 88, -163, 237, 254, -611, -191, 534, -296, -558, 87, 278, -268, -332, 170, -494, -295, 184, 321, -218, -60, 592, 185, -271, 246, 436, -626, -152, 866, 414, -714, -177, 466, -326, -205, 327, 14, -617, 436, 996, -307, -990, 490, 373, -281, 68, 736, -363, -662, 792, 801, -1019, -406, 847, -130, -503, 102, 140, -1168, -271, 1151, 218, -1267, 48, 551, -126, 26, 720, -109, -751, 582, 1396, -184, -1185, 469, 449, -438, 236, 428, -1079, -669, 1309, 757, -1058, -762, 834, -27, -224, 1099, 46, -1103, -67, 1464, 76, -1368, -177, 723, -213, -422, 826, -397, -1286, 407, 1194, -906, -1097, 461, 236, -544, 568, 675, -1179]
2962a179K59K423m81k082N04J597j110m26J483r86j516J538J671j449j722J511
2978C5O34j162M81J057j819m43K267M55k295l95J573l80j73O98j48j954P54K332
2996A517n71k511J101J240q61k38J260j088j576J977J407j649j016J112L80q24
3012c40P58K78j714j62K370J56k414rJ637m68r22J606l79j977J078K298j115j951
3030a270R16J375j329J2J502j298j624J987J153j993q36J550L50j040J059K03
3046G17j805j41K244L76k386M7J940p31p68J504n87j764P12K085r56k044J307
3063b50O51r47N04P09j014j238J787J175j720q38J307M17j035Q71O37k193J77
3080a000J777K55j946J19J123n81l27J201l25j673J106J733j146j324J146N63
$$ y = [-1179, -920, 1503, 1022, -1060, -556, 1041, -69, -495, 988, 2, -1514, 24, 1695, 246, -1476, 35, 669, -493, -12, 1045, -774, -1217, 1050, 1505, -790, -1185, 388, 8, -165, 533, 385, -1569, -815, 1517, 946, -1565, -464, 776, -85, -323, 937, -151, -1727, 250, 1657, 8, -1008, 104, 484, -340, 418, 696, -1018, -1180, 1190, 1346, -1068, -1077, 560, 92, -830, 776, 397, -1580, -502, 1796, 681, -1270, -354, 1021, -308, -296, 1206, -92, -1716, 271, 1424, -569, -1405, 145, 495, -545, 514, 717, -1088, -1229, 1015, 1391, -995, -948, 992, 261, -507, 997, 410, -1354, -642, 1443, 487, -1557, -250, 401, -546, -42, 667, -347, -1585, 202, 1377, -343, -1181, 126, 543, -492, 379, 1016, -1177, -1000, 777, 1032, -914, -795, 328, -253, -580, 621, 296, -1377, -271, 1462, 316, -1008, 138, 701]
3096G01r77N65L52q83q48J477N19j448j80J017j73n98Q41M8j310K96J538m91j211
3115g65M98Q18m79k77O30J22j441M81J514r47j166J009O20j065L05Q22j168k43
3133g32J300L86j674J75J069q5l87J48M0j149L78J240j96j031L05N37o77l2M87
3152A02r0q56P32R86q52p68Q28M70p74K88M92q37r1O53M75j160j3P31k86k36L03
3173I7K32p59K60O71j0r27L78L64k68k19O40o25k8Q0P04n04k83J73J57j12q1K99
3195B39l56k39K73M46q30M69J45k83J16qJ13k30O9M07J27q00M46N2j64j06L81
3216B67K28q43M50J25k55l59K98M18n10Q7M15l05j46J31k8q8j0K58p6q2j79L78
3238A74l56R7L8P0j95K54l4r7k57N21o1j71j37L00r8k32M33k41o7K02r3O5k14
$$ y = [701, -276, 289, 641, -242, -1090, 387, 906, -542, -722, 295, 122, -476, 365, 413, -897, -601, 937, 446, -765, -267, 551, 72, -205, 425, 547, -894, -413, 1101, 154, -1012, -3, 617, -448, -143, 679, -489, -732, 568, 954, -720, -545, 524, 439, 52, 200, 240, -909, -531, 709, 513, -518, -213, 324, -353, -385, 102, 12, -844, -112, 874, 22, -746, 82, 552, -222, 66, 558, -279, -370, 283, 758, -402, -415, 316, 30, -206, 97, 329, -430, -170, 501, 491, -436, -58, 306, 38, -181, 459, -166, -194, -114, 590, 86, -197, -24, 133, 21, -60, 239, -117, -356, -83, 363, -467, 2, 147, -136, -20, -28, 85, -145, -76, 331, 458, -342, 104, 156, -8, -114, 267, 495, -348, 102, 227, -28, -387, -89, 329, -181, -94, 321, 16, -130, 1, -27, -115, -125, 133, 57, -25, -204, 174, -182, -85, -47, 23, -172, 82, 48, -49, -306, 215, 154, -17, -154, 146, 48, -184, 249, 8, -59, 143, 50, 115, -99]
3261i9K60p4k17J56l12L16j25J05K25m78L51r7nn8L10K53j65m50J18nj64J19J1
3284b5o2Q7Kl15R4J70L77k98Rp0j9r9K08L42l65o6K7L%K45j37O4n42M79J22o28
3310c97K52R3j95n3M42k8k36J22J87j9n07L87K85p60L61J03n7j21j62P59p18k87
3332e49O06j18j44L02J29l65r8N13j06m57p2L42P5o2K49j01k56m4N61m47l02O18
3354B74p3k90j66O33m86k21M61J25n28j19N83Q1m12M44j47l95k21O87J69p47K2
3375c26O46l90j27M17j14m04N9P05m23m85L69K96n61K97N59o48j82M73L28q44
3395c55j92O89O9n06N81j10o77J90R22m5j057M80M25l47m42K87pm05O47M94n71
3416G0o61P09L20k83k22L02n50r5O74J74q92k45J171k88l23M97j4r05L05R97o31
$$ y = [-99, 161, 87, -130, 26, -286, 30, -95, 10, 235, -243, 108, 11, 6, -52, 258, 511, 346, -104, 14, 9, -155, -36, -25, -87, 0, 2, -313, -219, -49, 328, 30, 39, -31, -50, -149, 59, 401, 36, -30, -3, 0, 0, 245, 108, 172, -370, 109, 231, -397, -145, -52, -247, -300, 142, 114, -122, 0, 187, 168, -339, 48, 333, -427, -66, 37, -20, -141, -303, 456, -262, -549, 57, -61, -205, 97, 226, -139, -237, 276, 170, -287, -359, -17, 58, -4, 245, 144, -112, -156, 405, -42, -344, 274, 201, -89, -255, 378, -108, -329, 132, 257, -271, -390, 193, 274, -138, 306, 159, -236, -457, 230, 399, -348, -326, 320, -70, -197, 220, 106, -298, -239, 466, 43, -442, -73, 223, -338, -41, 518, -130, -312, 161, 489, -355, -547, 142, 211, -295, 286, 176, -501, -311, 611, 566, -491, -11, 414, 67, -375, -88, -95, -500, 147, 641, 70, -591, 118, 438, 155, -67, 235, -315, -410, 264, 438, -454, -699, 472, 184, -139, 358, 344, -561, -256, 741, 110]
3437A10j048J075Q5j95j69L15j28q77J041M10n39n19N25l1k42L11O11j097l38
3456g00J366K92j244k36O54m34J5O16J00j281M87J178k73j422O84M77m73J81O47
3475F34o31p31R66O07j010o21R98Nm21L89K35j086l76J413N09j508L36O15k75
3494D8l01P71k35r91M00J249l33j211K84P84p31K23P08r46n37J009Q87j059p59
3513g40P76N22p72K49O41j012o41J440N24j601L72P50m34l65P33l38r63N53Q32
3532E26j28j298M48Q40o91M03L67n82p39R38Q45j195l17Q88Jk25K15Q8p81p2P83
3553C14N73j537j9J088p95K87P22m48q36O39R41o47j103R56J81m04Q1L22m60n45
3573f90J095K19r79j8L29J20l35M31j64p59L09Q18J76j075J88P72o48j77Q40k73
$$ y = [110, -938, 137, 222, 27, -142, 173, 45, -832, 209, 619, 80, -439, 86, 55, -187, 124, 735, -362, -700, 666, 958, -286, -522, 132, -302, -287, 329, 429, -852, -365, 813, 540, -882, -198, 279, -194, -13, 634, 3, -728, 238, 845, -165, -786, 212, 217, -204, 185, 420, -666, -1042, 371, 880, -628, -292, 323, 48, -253, 518, 283, -708, -308, 941, 608, -603, -319, 465, -266, -43, 665, -281, -818, 191, 1078, 19, -740, 36, 558, -214, 35, 676, -336, -977, 463, 987, -614, -242, 508, 74, -291, 442, 104, -859, -306, 526, 398, -900, -452, 388, -303, 100, 467, -115, -854, 84, 929, -266, -583, 305, 306, 81, 296, 384, -397, -469, 314, 887, -650, -669, 419, -376, -89, 633, 185, -651, -12, 929, 282, -821, 135, 316, -88, -7, 315, -145, -690, 405, 624, -355, -373, -44, 76, -259, 172, 8, -751, -442, 376, 552, -523, -335, 437, -211, -388, 452, 179]
3593A79p90L19R80n50r06O97M02l69m0P34j043m70J025J91n77k60M63j66o1L39
3613I7L03o30j18P73N8j068N04K0k69N0O46l35o97O78L29n07k41N18J4j48RM01
3635C87m43k04O65j6n90J64K94l90k35J71L36n05K70O05n81j10J60L38m42J15
3655a1K43k44j52J02N10l80k78K48J75l51K53o0j99n2j17N55j35l43L12rj47K72
3677A92kj51j25J55P8l68O8Q1k79R1K08rl61L57L96j92l47K01J11N8j67J42j01
3700C6P7k55K75m18L17k14K16J4n0k0j20k75K42J89j2J8P2j88P4%j31K17J01l9
3724A26k33P4P8j07K3J64j79j31p9M57j18j80K20k16L79l64K09q8k22J22M54j86
3746B03k78Q4N67o30j12K03p6%l56K59j1J96M6M7l18K71j50k3K11k33K59r1J25
$$ y = [179, -611, -292, 688, 138, -768, -71, 331, -38, -78, 656, -387, -857, 168, 359, -218, -478, -15, -181, -242, 97, 400, -230, -348, 425, 483, -585, -81, -61, -330, -280, 366, 31, -666, 12, 341, -166, -407, 111, 125, -23, -14, 387, -56, -260, 405, 389, -201, -37, 257, -133, -368, -197, 139, -366, -96, 509, -72, -182, -22, 316, -126, -11, 232, -12, -164, -62, 448, 68, -210, 38, 213, -138, 115, 55, -144, -196, -313, 242, 107, -236, 76, 67, -80, 192, 190, 39, -86, 69, 147, -221, -153, -72, -351, -260, -52, -61, -422, -65, 331, 139, -208, -7, 104, 162, -5, 137, 36, 113, -142, 133, -285, 32, -182, 34, 48, -2, -22, -142, -417, -175, 14, 2, 20, 92, -96, -22, -22, -153, 64, 165, 126, -107, -33, 45, -62, -39, 125, -54, -185, -264, 193, 75, -105, 115, -101, 278, -86, 123, 35, -187, -65, 389, 203, -75, 9, 576, -54, -166, 37, -39, -39, -395, -136, -147, 49, 95, 142, -176, 95, -55, -78, 133, -100, 159, 68, 193]
3769A93r3n4j3j54L63l21J64J03j17k15J52J32j20k9R7q8RJ28q4l3j99L64nl35
3793a55K68q4m5j07J42l8m8J09K06j50m41K01J36k16J3K58K52l69K38m5p3K7O5
3816A44p3J01L6j94p9j90K41k84P0J18P2k07k9L36K43k55j80N24m19lP2L23n45
3839a78J83M0m3j24K30J45j44j19j12K41k87J52N3l19L15L12j8p63P11l3m23P0
3861a11J17nl23N92J51o22j68J49K14j3j88N69n84J21K88J38n58J4L97j60j98
3882a80L04j1j91j9K29j64k97L40o0N5k47M79k53n13P04J69m14r0L08K34l23j27
3904f7r7j03J86M84m16k91J27L92m95J17J97j47m89O13L28n50n4L91N8m0j08l06
3926b70K40k70N90j15k1j34J31j37j55O9J50o56M19N68j95r14M08N24n03J71K97
$$ y = [193, 100, 46, 33, -121, 242, -79, 85, 188, 71, -144, 8, 140, 20, -9, 88, 0, 9, 137, 53, 20, -179, 185, 180, -155, 113, 29, -16, -123, 19, -19, -67, 42, 248, 98, -343, -142, -6, -222, -209, 49, 301, -68, 170, 125, 52, 79, 144, 71, 172, 208, 14, -65, -255, -14, -298, -228, -110, -38, -245, -274, 62, 305, 50, -130, 394, -25, -28, 44, 367, -178, 5, 45, 2, -122, 108, 253, 109, -10, -122, 119, -168, -16, 37, -282, 33, 345, 327, -436, 275, 242, -181, -111, 6, 1, -322, 270, 421, -201, -369, -220, -6, -19, -207, 362, -222, -101, 187, 325, -233, -219, 178, 18, -180, 124, 113, -78, -97, 132, -32, -329, 11, -49, 6, -241, 238, -15, -528, 176, 345, -69, -159, 149, 383, 60, -67, -164, -267, -81, 403, -13, -304, -177, 215, -280, -163, 34, -113, -602, 11, 339, -211, -265, 126, 184, 144, 36, -270, -30, -300, 290, 175, 154, 20, 151, 14, -141, -72, 78, -578, -159, 409, 214, -700, -292, 232, -271, -100, 197]
3947A97m4n31M31N45o67l74N24k70k65L95K62n34KO88j89l58j39N46k50j50N15
3968C34j67n58p6Q90j97m42K8J74o5N5N15l83n73N79J17m15j82N07J8j50K66j45
3990A30k6k35M70J76o35l68R33n57J51L28k63l90m4M77Q0n72K04K23m3J8J73l05
4012g5j88L06N76p44k8K73j32k55K42J87n76J24M54qn78L94K41j98k18N08j24
4033A81k44j12M17J54n80k3R2k96M37K26l30l6K49N1k55k54M82k3j63r6K64l42
4055b01LN98j84l59P9K72j96j33L10l07k02R6L77j59l23J43J43J7J15J21p53m8
4077e91M24N19k22l38J49J71j9J49p5m69J38J1L95l40K48No1k20r1O20n58J27
4099b8J97j62k13L09K33j98j10N8k28r6L60J35k17l24N42k13j36K90l94K05l78
$$ y = [197, 153, -378, 53, 598, -69, -443, 81, -189, -454, -59, 203, -331, -329, 359, 170, -188, -327, 219, -31, -181, 334, 167, -391, -467, 423, 226, -216, -188, -14, -79, -24, 491, 108, -465, 114, 231, -184, -366, 141, 159, 9, 275, 130, 104, -131, 339, 515, -120, -488, 445, -112, 39, 367, 104, -286, -330, 147, 227, -345, -141, 82, 39, 57, 230, -75, -263, 43, 619, -125, -153, 120, -12, -267, -25, 162, -414, -290, 164, 156, -422, -28, 213, 15, -203, 305, 181, -63, -175, 242, 396, -184, -207, -115, -411, 26, 252, -78, -114, 135, 186, -69, -323, 159, 136, -27, -123, 141, -201, -198, 400, 216, -143, -64, 208, 12, -121, 189, -118, -320, -224, 153, -6, -329, -186, -43, -26, 89, 210, -543, -591, -167, 352, 130, -208, -59, 112, 93, 242, 167, -302, -164, -153, 242, -98, 150, 155, 94, -126, -217, 403, -155, -28, 169, 7, -206, 103, 336, 138, 28, 86, -142, -238, 122, 257, 40, -284, 258, 45, -91, 199, -195, 10, -368]
4120c68K96Q1O6k20L75j91j34K95m14j36K31K60j07k73M32L6l28j5J18k51R3J48
4142fL25j71j02k1J91k46N1q1L3Rj43L94j32k28K14j24j80L12j73j08J54J44j97
4165h5n7R2J15j38K01J62m51J69J98J2l81K86j11k50L07J42j63k36O7K94j94O6
4187D5k4J67j74J38j07j64R9kK2O9l67M29nl50p2N70k65l8K6J63k35J9l2nK36
4212A43l05m9K51k29K21P0L0k15K03m46L38P0k29j73K78L27n45J31L73k66LJ4
4234em3P2O0j65L91n77J21J78k42j24K39J54j04k32L21K26n43J97K21j26r1J31
4256E9l5l0k3J65m47P0L89k15j20M8J31J09l84N67l74Q2J07Kq7nj02K41o1k07
4280a20J77m2M5K8j4jj5l21J97l39N66j31K6J0r1ll01J67J7L18k93O9J2o6J01
$$ y = [-368, -72, 9, 75, -145, 230, 39, -95, 200, -214, -350, -119, 141, 34, -239, 193, 229, -99, -114, 4, -247, -154, -6, 319, 148, 46, 25, 216, -30, 21, -60, -27, -18, -161, 233, 101, -127, 87, -37, -217, 95, -78, -186, -32, 112, -85, -142, -50, 65, -73, 128, 290, -161, 8, 206, 218, -163, 123, 12, -238, 69, 211, 48, -188, -121, 173, -21, 45, 21, 188, 14, 152, 45, -119, -20, -22, 0, 69, -298, 131, 126, -224, -296, 274, 9, -29, -3, 160, -75, -56, -88, -93, 143, -162, -211, 40, -189, 32, 102, 132, -83, 120, -326, 12, 82, -147, -320, -42, 285, -260, -129, 244, -22, -19, -5, -48, 24, 84, -81, 310, -267, -146, 32, -210, -334, -95, 59, -45, -277, 44, 270, -273, -76, 145, 19, -72, 59, 24, -6, -29, 136, -311, -241, 148, -67, -187, -139, -8, 101, -283, 284, -90, -8, 99, 101, 14, 9, -93, 148, 87, -120, 57, 15, 60, 88, 74, 73, 58, -263, -66, -405, 161, 30, 56, 66, -25, -28, -329, -162, -145, 173, -120, -51, -39, -105, -4]
4305dQ9M04m25J8M0j01R4k7j70R3O2k45J76J2Q0l90M33k77K62k55J19K08Kk74
4329g6k86M27k28K5J17j6j75J85R8N3k44K41O4k12k60N36l11K06j5k72L65l41
4351a19J62j34K23k33Q2R7j70K54m7k31j33K79J49j70K44k83K29K02l01j96L16
4372B20j73j40N6j59M38k92K91k24K88n18k5K03o0J54N8j09R9l75K17L57n52L4
4394b12L87l21K48l23L38j67J06O7j92j52K45J34n7p9j7l10J19K05N9l79L40j47
4416a08p6L07QO3k84J82K18k67L3Mo8j64L08K29l84k86L61k06j75K33K90q2L0
4439A66Oj97rQ4J55j62J2j26K03j12j07L3k4k58M63q2o2J6J32l44J43M25l24j85
4463a54n5K54J08k86L39O1l83K77l12R3J4r8K47pm6Q4pj66j43J93K6J32k75M34
$$ y = [-4, 85, 489, 64, 82, 122, 21, 115, 88, -82, 11, 73, -172, 4, 16, 96, -294, 139, -138, 124, -131, -12, 196, 198, -76, -362, 65, -163, -138, -21, -37, -212, -27, 71, 124, -120, 121, 185, -27, -287, 249, -62, 144, 129, -143, 222, -119, 43, -91, 132, -101, -19, 78, -92, 162, 115, -116, -249, 30, 179, 9, 253, -30, 199, 401, 100, -96, 220, 47, -93, -37, -196, 242, -50, 241, 17, 305, -213, -238, -35, -95, 59, 117, 8, 107, -268, -51, 306, -246, -212, 175, -146, 102, -221, 117, -50, 56, 123, -69, -221, 24, 158, 101, 22, 5, -305, -186, 19, 78, -301, 39, -108, -184, 123, 131, 194, -90, 92, 310, 43, 76, 80, 12, -152, 156, 385, 1, -285, 76, -130, -305, -72, 218, 136, 166, 172, -25, -34, 50, 205, 43, 55, -71, 132, 20, -87, -54, -78, -336, 127, 45, -17, -1, 131, -213, -70, 355, 31, -154, -209, 45, 153, -133, 206, 267, -116, 161, -151, -58, -44, -142, 105, 98, 52, 136, 129, -37, -180, 13, 39, 171, -104, 330]
4487C30m06Q2J69k8m30L11l8n49M10K98p9k19J44k2K8j27L22j08j53q1J21J01
4509G6l7j61M50j57j74K31j21k60Q7K29k66o5L20j52j69J36K60k67l17M33R0m82
4531c16Q1K52k6J25j51K43o38N95j9j64j72Q3K11k47J33N29m12k70K59J06n53
4552c51J75L0nP7J06K03n33K02J60M9l66L51K0J1j71J39j37j16K04rP0k17J47
4575C9J84n55M57K66o14j15M06q5K12l76K70m8k13K11J46j58j03J28l7j57P7Q6
4597B1l01L28l2J11l41L19j71j92M14j33K54j03j53J53k69O2K69m9l07R7p9rk8
4620a39K62k2R6k76L30j51k43J37kJ51L6O1j12j97P2K36j19l56J83J91R5k65J59
4643A27N0k14k6j31K13R1j81L8j5J91k81K36j87RJ21pN8K2l8j22J77l12J22M2
$$ y = [330, -76, 6, 175, 147, -283, 28, -10, -559, -149, 149, 70, -149, -5, -27, 1, -126, 196, 88, -65, -146, -25, 76, 39, -122, 328, 171, -3, 228, 107, -153, -66, 163, -103, -168, 152, 0, -169, -33, 227, -40, -357, 76, 166, -316, -235, 17, -9, 116, -35, 208, -430, 165, 146, -18, -190, -107, 104, -143, -10, 519, 107, -163, 96, 202, -351, -176, -146, -151, -74, 32, 235, -298, -96, 64, 113, -253, 98, 118, 129, -42, 97, -40, -156, 48, 39, 109, -108, 39, 223, -332, 125, 391, -223, -338, 68, -17, 195, -181, 89, 41, -172, 39, 185, 27, -76, 52, 15, -142, -65, 21, -280, 48, 16, 127, -214, 105, -66, -258, 156, 23, 277, 174, 21, 174, -95, -33, 236, 187, -120, -23, -102, -111, -139, 123, 101, 197, -79, 251, 100, -143, -6, -8, 143, 179, 240, 128, -69, 3, 239, 120, -236, -53, 138, 233, -32, 127, 177, -37, -63, -194, 19, 110, -71, -33, -48, 143, -138, 98, -89, -80, 41, 34, 92, 114, 76, -46, 131, -181, -59, -17]
4667a7M6j85j92K49j92J04K24K02k31o5M7K05J39k56k20J42K07n13K39J51j26
4688d2J56k59J0N40m47L7J46r8k21J38J07j2k67L80k35K38j62J26p0j67N0j00
4710a52L37m46Q9J64J89m23J33J08K6k22M94m51J21j06K74l39K77p2J24n8l18
4731b51K57q9Q3K2Q7j49J66m9R5k14j14J91J03j47q1J47o6k93L09J9kj52j42J31
4755a39J66P3k24J06k38L81j37p4j11L35j77J12j71m0L53j34j15L24m83M90l60
4776f3l0J95p3K8j39K09m22M59j91j48J01j05K51l03L58j1j34l7R6J62m88K71
4798a4K37m22M85p69M29k07J30m6pL66m66M15l38R9J85K3J61L7n33L73k40J92
4820I0k65J4lJ02R8J45p5K34k64l86M54r4r7q7P7l32L63j57K11K6n9j49M19l32
$$ y = [-17, 29, -156, -348, -99, -291, -187, 37, 239, 8, -57, -10, 195, 334, 78, -142, 0, 207, -306, -67, 84, -42, 114, -145, -135, 405, -42, -5, 141, 43, -178, -40, 67, 55, -212, 168, -67, 171, 9, 135, 65, -102, -52, -152, 185, -261, -172, -8, 181, -242, -109, -1, 25, -197, 297, -154, -33, -139, 135, -204, 73, 1, 125, 67, -251, 6, -83, 0, 22, 109, -40, 126, 77, 172, -42, -156, 35, 138, -9, -90, 57, -9, -302, 7, 26, 24, -128, -270, -139, 27, 100, -124, -18, -256, 125, -12, -86, -197, 138, -39, 73, -98, -138, 215, 81, -34, 290, -193, 297, -63, -93, 102, 29, 57, -82, 127, -295, 164, -27, -175, -74, -179, 72, -231, 127, 116, -18, -55, 41, 203, -285, -14, 223, -199, 286, -483, -54, -261, -131, -177, -184, 182, -284, 131, -207, -108, 77, 100, 261, 298, -235, 138, -102, 90, -175, -161, -164, -62, 36, 181, 106, 340, 76, -310, 144, 50, -47, -134, -57, -389, -26, -183, 28, 54, -5, -154, 265, -67]
4844f7L27j52k3j18Q3j44P5K10k5n9m4l3j90kK26l9j74K03l42K99j69J70R0P3
4868A75m26K19N8k0j93q5K08N1Lj40j26K16pN3j04N06n97J47P3O0J9j74M30m59
4892a13J01O5j56K92j89k16K74J47l31J0R9r2K3K36k41r7J10M1n5l5J41k39J26
4915i9L56k26j16J92K7j27L0j12K7k44M14l1l56K07J26j8k03K02P7l15nj16L30
4938B0p8K71j29j99r6K02k49L93J2n5q3M3j17J66k3j29j9q1k0J66o0Q9j76K90
4962A38j53k8R6l9j44P6J92l7j99M9jn1R9J36R3n66K73J42N1j81K7k26J52K50
4986A49J3j98J4J06J95l33J4j36L87l95L45Rj5k56K32J43k45l38J01M94l04K88
5008B70k61l9J00R9j63r5K8k36L52k3J91j30j98J29j53j30J91J0J78k43J35J78
$$ y = [-67, 260, 108, 85, -33, 50, -94, -19, 191, 166, 107, 63, 30, -160, -162, 64, 25, -149, 54, -288, 11, -158, 12, 102, 175, -251, -32, 26, 6, -187, -272, -64, -13, -10, -150, -276, -60, -67, -14, -118, 388, -209, -62, 11, 71, 90, -84, 346, -113, -12, 53, -103, 189, 0, -216, 58, 205, -126, -116, -17, -109, -86, 150, -91, -188, -78, -37, -92, -127, 14, -225, -99, 257, 31, -85, 107, 134, 7, 37, -75, -48, -292, 122, 91, -265, -58, 68, 50, -153, 49, 126, -189, -194, -310, 20, -58, 213, 84, -115, -211, -9, -258, 135, 147, 92, 9, 52, -65, 101, 78, -51, -70, -151, -171, -5, -65, 24, -152, 138, -15, -43, 53, 14, -130, -54, 138, 101, -98, -49, -50, -101, -2, 134, 227, -339, -66, 76, 127, -54, -27, -253, -101, 149, 162, -36, -22, 84, 279, -54, -40, -176, 211, -184, 161, 170, 155, -101, 131, 274, 29, -309, -208, 286, -18, 270, 9, -30, 70, 169, 6, -89, -61, -297, 55, 32, 223, 93, -105, 24, -129, -259, -68, -58, 120, -123, 12, 190]
5030A90k87R4k2l3p7L81j38k98n2K42N0j24L7K88k06p8O0q3K4p8R3k71J68L0K47
5055A57j43jJ19l59J05RJ18qk8J10j23L0J13J22l37Q6k30K45l34L44j73R3J11
5078B6m5j60K28m0J4K81o23P7M91k9j16j30m5j32J87M05n33O9p1n1J68N7K2m1
5102IJ95k32L0j77K11J40j50k6j41J60K18k15M3j91M3K35n6l00K45n3Q3m32M24
5125F3k20j5q8L30j11J33J42j42k05P7J63l23k8K59L5N7j28o6L52k26m7j49r7
5148b34J99j18M7j73Q1K01j3M0J60Q4n35P4J78j6k26o2O75k33j50k00L73m3k48
5171a39J90k4K7k71J48l1m4J23r2j62L91K99m00j01J89K5l81K82J72j68O4j21
5193b4J71o4O3O8k60k31M69r4k94K00l06J25K46r2o5L8J49j94J27J34l30J61J52
$$ y = [190, -97, -3, -25, -58, -135, 246, 108, -190, -242, 0, 50, -74, -37, 251, 45, -33, 27, -56, -32, -110, -17, -288, -120, -90, 157, 14, 13, 132, -227, -122, -113, 5, -3, -31, 79, -44, -14, 99, 221, -116, -30, -260, -15, -349, -5, -178, -85, 26, -19, -179, 49, 9, 23, 304, -319, -242, 249, 220, 104, -26, -71, -203, -16, 389, -144, -75, -146, -197, -29, 28, 50, 9, 204, -28, 2, -175, 36, 176, 26, 0, -141, 19, 237, 22, 65, -126, -83, 152, 96, -204, 41, -12, 71, -361, 63, -157, -172, -260, 70, -41, 92, 234, 92, -113, -36, 127, -196, -224, 35, 70, 127, -1, -67, 285, 59, 12, -137, -234, -35, -153, -106, -279, -198, 3, -10, 30, 190, 274, -261, -187, -9, -25, -251, -313, 362, 129, -21, -221, 152, 109, -139, 51, 27, 54, -217, -69, -100, -144, -21, -113, -275, 116, 415, 15, -86, 103, 128, -253, 29, 201, 33, 97, -24, 147, 83, 146, 214, -46, -277, 192, 98, -196, 4, -302, -177, 69, -23, -88, -50, 99, -95, 32, 166, -164, -3, 149]
5216A49o7j13J73k58J12n6M5K8k8L2j7N8p7J96M6L2k69K77k3J2l16J70j49K85
5240B42l43M1Q1q4J01k40M02k54m5P1j55l6J78Q2M2j8j2o2j04J7L18l89M41p8
5264A96l67K75l74L96J05j32k80j06L96q7j6R6j40N11l98K2l5K7l10J25j6Q1J98
5287A67m01K99j9k67M02j52l3k85J51J27J05k50N06n54L22j32r1K15l2j65L4K92
5309B39m91K10Q2m30M86j37J81k8J28j20k51K31l6m4j32J56j26J13p1J31Q1j15
5331E7O4k69Q1K55J30k39j53k29M60j13k91r1N02j38k56K45m6j59J39r8K15J68
5353B34m92J01pm5L74k79k93L56jN2K14N5k78J10j36l9Q1l35L30j09O5q6k2L88
5377B38n98M75m23k4M67j42k15K37J38l20Q7J73k24L55k87k02M32k24k3J75p0
$$ y = [149, 82, -31, 142, -116, -4, -60, -15, 13, -15, 17, 0, 58, -19, 177, 223, 255, -14, 263, 240, 252, -64, 106, -43, 242, -101, -60, 21, -63, 38, -202, 200, -54, -99, -28, -183, -219, -41, 41, 83, 65, 53, -9, -113, -96, 222, -167, 274, 196, -171, 104, -270, 126, 231, 99, -181, -287, 109, 22, 6, 102, -38, 473, 75, 97, 62, 89, -221, -96, -112, -31, 167, -234, 65, 46, -221, 181, 29, -4, -289, -138, -11, 94, -156, 350, -204, 118, -14, -105, 110, 78, -87, -53, 239, -252, -42, 40, -390, 96, -41, 140, 112, 240, 120, -131, 100, 64, 20, -112, 44, -82, 31, -40, 91, 172, 57, 121, -148, -67, 188, 318, 79, -74, -303, 157, 44, -247, -338, 164, 26, -230, 15, -31, -190, -51, -149, 66, 234, -258, -157, -164, -209, 165, -114, -407, -51, -52, 0, 214, 269, -9, 101, -35, -74, 7, -328, 2, -107, -42, -128, -150, 238, -360, 115, -308, -332, 135, -7, -222, 15, 153, -167, -80, 93, -131, 224, -63, -265, 167, -57, -80, 95, 25]
5398B5QM9k92N51k13Kj04O7j82j56M65j78j50k9N7j71J57J56j88j58K17j2K20
5421A41j40k67L30k04O3K20j16J30j31J11j08p7PK58k74q0J50o7J24j9R1j46q4
5444h8J26p7J78j51ok51K07K35k38L1J24J4J2j72K87k10k47M02j44j06K51j39
5466C8m9P3P0j75J7N1k63L38j62j54J63J45Q6l1l69L72j28j80R0j0j39K98m5J15
5490A51J51k01j45J21N1j74%K42n02K97q5k4j54K75O2K4m9q9p2p2o5L32j52L3
5514d5J95P1j94N1j21J66Q4j82k39L56n36L75J10N4L6m1k04L75j83m6qk95N01
5537B80k62J30j37J23k64K46j87J10k96M59l35J16l59R0M58k92Q9j17L94n78M02
5558G0k3j37n2K42k3j99J57k56O8L0J90k41L68q9j01Q5n1J65m98J35K56j65J33
$$ y = [25, 33, 82, -210, 341, 128, 130, 26, 93, -89, -245, 220, 42, -108, -137, -80, -251, -94, 62, -126, -284, -67, -79, 141, 1, -266, 64, -140, -77, 143, 27, 157, 26, 137, 29, -48, -41, 217, -57, -137, 13, -54, 70, 51, 142, -4, -88, 38, -39, 139, -12, -18, -269, -62, 173, -65, -34, 90, 104, 116, -56, 231, 21, -226, 176, 32, -74, 177, 38, -11, 62, 132, -43, -26, 25, -238, 100, -62, -216, -53, 92, 178, 147, -222, 150, 22, -158, -68, -78, -217, 81, 36, 151, 302, 101, -44, 77, 128, -46, -46, 196, -306, -9, -94, -118, -272, 3, 65, 89, 40, -49, -121, -193, -258, 74, -78, -45, 150, 221, 27, 78, -43, 123, 207, 25, -214, 142, -394, -19, 91, 145, 181, 140, -64, 311, 128, 82, 74, -221, 280, 18, 148, 11, 134, -130, 116, -71, 39, -257, 202, -133, -17, -376, -286, 172, -120, -31, -148, 246, -332, 70, 47, -90, -142, 100, 77, -122, 35, -221, -153, -123, 67, -174, 194, 105, 4, 89, 38, 203, -295, -160, 96, -69, 64]
5581F4j70K4j31K77k37J72n2k04L29l34J77J56m8L9l68K74R0k33L00K9l87NK85
5604E7l50J74k89M63l05J67J6N6M5J53j24j98K57n8K40k82j49RK65p5j33j3P6
5627BJ42P1m7j99j47J1kK53j19Q6R5o8k08J53j27M0j28J38k9k39L07N0P7k87K96
5652A21k20k60L72j62K08o9j0J38j48P3j08Q3K17n3N0l85L31p4k27%J73l21J49
5675a22R0Q0l82K38J47q3j37Q4M8L0K45k95J66j6k69j7P0m1M54k73l3LL00l66
5699g9J10j42K28k04L93n39K89J62l23N4J41l32L30j34K87k05p3R9k54Q7Q6L0
5721A1n0J78j44l0O8q6K85j35j54L8Q6M9K6l64M21k00J5K41j72k25K91o4j09l1
5745e5K38l2j93R3r6J31k25N1K1N9L2K40k47k41K30j23J14o9j09R9l58O90l62
$$ y = [64, -106, -82, -213, 64, -173, -1, -53, -257, 72, -262, -85, 71, 23, 62, -306, -32, 58, -175, 125, 154, -233, -228, 57, -293, -119, -408, 55, -250, -83, -67, -11, 34, 187, 63, -135, 122, 64, 304, 22, -127, -118, 147, 72, -61, -74, 2, 144, 215, 168, -31, -178, -167, -169, 84, -35, 51, 146, 78, -130, 23, -104, -64, -192, -54, -83, -322, -15, 35, 112, -175, 121, -99, -359, 13, -149, 59, -10, -20, 118, -30, 43, -65, 18, 235, 182, 232, -153, 178, 104, -123, -123, 50, -271, -122, -32, 48, -334, -96, 51, -32, -169, -85, -37, -7, 238, -57, 109, 93, -176, -193, -123, -164, 290, 17, -16, -13, 287, -79, 31, -111, 117, -87, 306, -233, 56, 218, -105, -51, 90, -242, 88, -46, 241, 36, -37, 62, -192, -105, -19, 11, -39, 139, -5, -35, 33, -53, 232, 97, -57, -19, 67, 116, 142, -222, 199, -1, 14, 255, 83, -142, 149, 85, -24, -55, 183, 151, -42, 51, -45, 86, -139, -88, -67, -8, 24, 264, 17, -224, 6, -117, -3, -72, -181, -82, -440, 250, -112]
5768a12L97m71J81j29M26k20L5J61k04J12j19l0l6j6K89j92r0L06m32K45Kj61
5790e8J18p6j16J67J46j89k47O9m5M02j47M5J21k46o1n0P1J56j15P2k0L4Pj42
5814a04J07K2m6j09R3j8J16k5K0K66n05j59M96k06j19K25J94m98PJ90J13q2k48
5837b70L12j64L24k25l1L10m88K03nj63K20J13j55l19M02j64J38j14L45l46P7
5858@K26j89L6k17K95l03J40j3k10Q3J00j76QJ44J25J37l44J46L0p1j49P9K15
5881I2J6l15L48l23j32M44k03J61j15J62k20l3m5K18Q3l06J92q8j27P1K55J53
5903B88l67L4K19j50j83M1M19m39p6M15k57L3Q8K17l07J09j16K7J58j24L2k58
5925a97K52k9j28L7O4n0j91K92J17j09j70J94J84j62k03k3L7J33j56Q9n6j46K83
$$ y = [-112, 285, -186, -5, -134, 292, 72, 107, 268, 64, 176, 57, 27, -9, -25, 264, 72, -18, 288, -144, 101, 103, -58, 60, -16, -132, 35, 181, -8, -255, -186, -231, 171, 24, 69, 190, -56, -117, -167, -96, 60, -55, 17, -3, 31, 38, -104, 3, 25, -21, -130, -37, -55, 61, 36, 56, 322, -183, -342, 154, -52, -171, 54, 248, -250, -243, -53, 60, -22, -270, 42, -122, 202, -23, -54, 256, -232, -29, -34, -197, 23, 136, -19, -338, 64, -100, 38, -76, 269, -77, 0, 226, 37, 73, -144, 151, -152, -12, -25, -235, -152, -52, -228, -220, -76, 49, 186, -158, -12, 18, -53, -202, -123, 92, 108, -207, 141, -182, -314, 130, -73, 88, -27, 135, -85, -118, -163, 55, 138, -168, 24, -64, -191, -120, 135, 288, -79, -45, 174, 24, -159, -118, 301, -138, -214, 201, -56, -23, 65, 282, -25, 84, -32, -5, 153, 29, 61, -197, 55, 26, -102, -65, -1, -51, -242, 50, 167, 58, -112, 82, 266, 104, -99, -122, -85, 48, -108, -19, -75, -221, 62]
5948F2p5N1q2K08m8k7l55J97J50m64L30k80L09oJ9k4o2J16q1j58P6J02j34J08
5972f8L7k03J76q9L59k11K86l38J9J58q2K00j32j2k39J28l5M3j31K00k99M37j9
5995A85l78J14L3P7k38L12l00k7L95j53m4Q4j47J61m7j80O6k5m5K91R1l10k13
6018b98L63L5j27M6l2m8L2K99k39J18k1n2j18r2K79j66l9k86J98Q6q6J97j15K01
6042A35j54J10j39K0K54m57J8J81R0J89l01J95K6l47q6J85K85l0k42K33k66O5
6064c6P5N9j01j4k01K24J12j09kK0k14O8m4J75J5L6j30J18J66j57N7j20nk00J32
6089g6K40j29l3j0J5K20k37q4J7K00l2q0k77N5k6K14j07K36j12j13l8K25l60L28
6113C6m5j96J29n6K66J52k51K15k7m5j58j41m5N63l00k17L75l99J23k2j4p2J16
$$ y = [62, -13, 38, -44, 164, 116, 89, -266, -69, 81, -383, -53, -333, -24, -30, -11, -35, -97, 19, -62, -220, -144, -42, -176, -68, -31, -234, -58, -147, 212, 1, 287, -51, -32, 126, 44, 244, 112, 100, -139, -11, -46, -3, -134, 66, -233, 204, 185, -193, -79, -46, 31, -207, 105, -195, -222, 173, 20, -24, 60, -87, 74, 27, -153, -87, -112, -157, 134, 225, -85, -298, 65, 100, -27, 19, -13, -61, -29, 270, 31, 149, 128, 76, -42, -134, 145, -21, -60, -346, -148, -62, -148, 49, -66, 135, -19, 91, -48, -28, 226, -231, -213, -32, 58, 247, -54, 141, 167, -180, -266, -81, 204, 174, -68, 165, -101, -36, 39, 98, -3, -17, -218, 6, 118, 9, 7, 27, -187, -119, -163, 12, 27, 63, -67, 51, 217, 60, 117, -3, -8, -208, -76, 164, 35, 2, -8, 7, 227, -10, -94, -77, 123, 91, 11, -266, -211, -237, -23, -130, 106, -6, -119, -157, 68, -292, 36, -9, -205, -76, -132, 134, 286, 35, 250, 223, 178, 20, -121, -166, 397, 97, -120, 255, -144, -21, -43, -57, -129, -13]
6136a3n6Kl75N10L7k18K43l92J78J3J52m5J03k51L67j33J30j12j11j75J55k15
6158b06K14k7J9Q1k19q1L78m37K69r9j43L20j44J63j96K41k02J36J41k17m7L3
6180b3p0J55k4j98J56n5R1j36L5J05K3k24J1p1K90k46J82K37k61L12j16k7l1n4
6204F1Rj95L94j67k28K54k0O8j36J76m64N12l29L47j03m6R0k42J78k98M6M8j38
6227a83J50O7q7J78J31k23k23r9L99j16k07K64k44NL07K15k21Q6j58k47J80K19
6249A93r8j94K10j15P1N7j35J37k06J24j04Q0J39j35j08J83l15J23J00p9n3O7
6271e8r8mQ7J36j64J27L7j93J31r5K61r7L2j58Q8l3p1K43j37N4k26L29m0j85n4
6296h8K91j47q2J19l21J02J18J97j96p7o0J27J93o0K98l39j30J95J1k48J40L02
$$ y = [-13, -69, -67, -442, 68, 105, -113, 130, -262, -84, -71, 81, 36, 139, -112, 255, 122, 252, 140, 29, -146, 9, -206, 8, -19, 0, 81, -138, -219, 159, -278, -9, -108, -251, 69, -75, 88, -108, 133, -69, 67, 208, -9, -56, -23, -93, 62, 38, -160, -4, -59, 32, -104, -69, 36, 59, -165, -154, -225, 65, -181, 1, 238, -23, 289, 173, 146, 115, 61, 70, -125, 269, 102, -126, 128, 108, 176, 40, 216, -248, 264, -65, 282, 179, 133, 223, -19, 159, -139, -93, -45, -183, -33, 34, -53, 125, 256, 33, -190, -289, 110, -6, -213, 51, -193, -188, 119, 334, 113, 199, 41, -206, -26, 193, 95, -99, 111, -4, 67, 124, -11, 126, -80, 44, -60, 20, 159, 24, -84, 99, -216, -93, 7, -72, -125, -58, -156, -160, -73, 63, -101, 26, 63, -130, 1, -94, 167, 70, 102, -56, 32, -1, -72, 171, 34, 88, -138, 191, 151, -34, -88, 203, 56, -26, 93, -228, -126, -8, 189, -7, -84, -144, -17, 176, 116, 414, 75, -55, 140, 151, -97, 43, 345]
6318C45o62L31N5j09j8K1L05n24K09J94k70J10j5N8q6k16N49l87Q1m6j17M36p9
6341A65R7k49K09j15j72K61k80J09j01m6J52m8l5n2r0K20m28J84J50J83k0L2j99
6364g3j56L76k50P9j29J5j06M7K62L4r2J81k32n8J2k67L41N5n5J07L9m46K08J53
6388D5J68k43jJ44j37qj15O1l1OL12q5j79l2N6m7K35j44j03K21k74k42M40J12
6412A59j26j10J32j33K23n9k58K18K8m40J49L01k90R3J29m9j73K98J30M8r8k07
6434c5j3j94K54j42P2N5o7L4P9LQ1j37j71J95K81m04L13o8j55O9J63o2l48%L4
6459a63J42k03R1K31Lk91Q0Ko6j54L12L00n05L41l70M49j86J03j83J70k86M07
6481B24l47J31j14MJ44K52j24q8j48K99k42j06J02k1j13N5K35k10K7j24K79q0
$$ y = [345, -317, 14, 69, -40, -58, -37, 268, -256, -47, 147, -123, -13, -28, 30, -56, -272, 277, -110, -29, -75, -192, 244, 165, 262, 13, 222, 107, -65, 196, -84, 25, -76, -122, 30, -18, -53, -105, -195, 25, -403, -219, -69, 114, 94, 126, -73, -229, 147, -103, -24, -153, -138, -244, -197, 65, 99, 7, 188, -44, -102, -90, -357, -16, 39, -16, 91, 130, -316, -108, 45, 213, -30, -31, 113, -24, -32, -147, -86, -117, -111, 201, 116, -63, -95, -39, -86, 149, 5, -98, 123, -151, -393, 47, 159, 33, -77, 55, -78, 145, 86, -172, 46, 74, -366, -217, 84, -206, -113, 16, -33, -206, 92, 222, 270, 172, -35, -48, -242, 12, -130, -58, -3, -70, -36, 43, 46, 127, -10, -181, 14, 295, -109, 204, 136, -19, 50, 213, 151, -197, -197, -163, -21, -224, -133, 98, 101, -190, -110, -108, -174, -328, -16, 284, -221, 120, -250, 199, 13, 116, -67, 103, -183, 224, -123, 8, -106, -102, 42, 294, 170, 82, -66, 233, -9, -115, -13, -34, -147, -92, 143, -67, -40, -164, 115, 35]
6503C5qP4j64J36j28L10k99K13m5n8n7l2J04l16J71J96j31p1J99k3m04Q1J76J21
6527H0Q6Qm76J78L05k96N6J55m3k08K37O2J20rl44p4L66l15L40l10m6O4N1Pj6
6552b2K9j70K16m9m6J70l8OK7n4J08j37q6J6O6q0J94N4l30P5n9m3K27m7J30j29
6578B8j23j69J66J36p2N4J52k05q7P8J43q0J41k06J50l16J41K69j54J57j99j79
6600a75L07j6l34L00k11K44p1L8K1o0j60o8L19k53J62r1m9J79l5j40K56PN3k68
6624d5M29n61P2K30m87K44Q6l6P4j44K00k56k7M15k15R4j79p0K01l7J37j72J06
6647E9k05K20j41L18l49o6K68k42O9J85j95N8j39K42J36k60q1J68o1K0N8J50j31
6670H1l05M1m4J62J81p8n5J24R2m09J26K61k30k59M29q4k75K63o9K00j9l62M00
$$ y = [35, 27, 101, -63, 73, -55, 255, -44, 169, 124, 66, 9, -23, 81, -235, -64, 132, 1, -70, 129, 106, -298, -217, -41, 80, 166, 174, -302, -124, 181, -115, -59, 96, 53, -155, 82, 144, 264, 255, -89, -163, 203, -112, 228, -82, -128, -64, -13, -6, -22, 7, -163, 53, 4, -42, 128, 90, 96, 123, 69, 177, 40, -46, -30, 36, -44, 150, 204, -126, -51, -110, -153, 74, 27, 157, 28, -95, -264, -98, 38, -34, 20, 172, -33, -120, -42, 101, 21, 162, -44, 106, -210, -69, 200, 46, 203, 4, -175, 132, 116, -218, 82, -129, 115, 44, 82, 103, 43, -117, -185, 134, -119, 43, -48, -97, 82, 47, -93, 163, 170, 223, -45, 384, -177, -105, 125, -362, -118, -32, -68, 6, -138, 62, -194, -221, 194, -21, 73, -106, -176, 25, -12, 125, -47, 59, -146, 74, -67, 251, -98, -164, 104, -138, -69, 116, -79, -21, -160, 82, 218, -42, -123, 45, -16, 4, 62, 212, 81, -224, -183, -227, -65, 116, 38, -17, 107, 199, -210, -84, 177, -53, -312, 117, 33, -242, 21, -48, 152, 133, -229, 171]
6693A71j44ko6J5p6K0N2M3n7O7J74l50K64j8k95L89j10j74J91j00K68j99l2o3
6717c2ok3J08j74M0K29k95N7j60K64j22K3L56k09j33q6L2N5l7P1K31j17l29N66
6741C09k89k14j2l4K36R3m1j68N49l95J59k4j56J72m35J10o8P6q2K02j79K09p1
6764e3L01k35k60N08l62Q0oJ14j06J02l47L64p4J20j46k15O7J50N0p4N7P8k9j24
6788d0J8Q2j65L14j80m2p6J3K47p5J02l40J35J9K12k16p1J03J84l99K50R9L1j4
6812A91j21O0k45N6m9l97O83j96l38K92J7n4Q9L10k26j54O4J55j37q6J14j23m9
6835a44K76j21qk12M67k64j20J22j53K09k0J24k98K39l1q5%k1P2k40L25j48J83
6858A52m18K69O9n95K55N80k83k46M60j75J2j02K19j53Jq8n5K33j83L32k26k02
$$ y = [171, 27, 25, -41, -26, -102, -82, -30, 13, -44, 23, 197, -153, 111, 93, -202, 187, 77, -97, 94, -6, 262, 63, 31, -32, -38, -61, 47, -127, -87, 142, -153, -96, -256, 8, -114, -91, 265, 56, -77, -163, -131, -76, -113, -42, 189, 72, -257, 309, 20, -194, -206, -240, -4, 89, 48, -120, 429, 34, 193, 169, 13, 185, -250, -140, -208, -132, -214, -12, -191, 18, -53, 248, 13, -247, 261, -101, -21, -27, 87, -19, 83, -264, 100, 26, 146, 0, -215, -148, 2, 52, -22, 35, 113, 84, -40, -22, 60, -105, 209, 29, -13, -89, -76, 171, 96, 198, -142, -7, 12, 224, 8, -63, 40, 224, -175, 75, 174, 205, 191, 70, 130, -115, -59, -108, -505, 178, -18, -356, -64, -47, -101, -12, 298, 72, -82, -18, 137, 0, -86, 28, -95, -144, 132, 11, 3, -209, 258, -6, -126, -4, -157, 52, 32, 156, -142, 97, 66, -19, -19, -40, 32, -208, 117, -31, 152, -266, 3, 72, -523, -268, 312, 29, -217, 243, 68, 80, -22, 197, 44, 45, -43, -98, 135, -48, 284, 58, -144]
6880a44K84q1K21k44K4k32l2O6N2J8p5J10p5j99M21q6K73l36J16j87J41J98n98
6903c65P66q9m7k40j93q5J62R7j01l13K37P60l85k44J60j76J34r7j32L00n3Q2
6925A78N7j18k87j16J45K44j57o3J18j08J66l47J95J48P9J01l05J74M0p2J72l07
6947f3nJ95j36m6L50j29k72n6P3l8j26K71p4L03m57L11j40L7o4O3O2%k1j89J80
6972B9k14K06n4O4J2K73n23J32K17n13L04K4rJ22j35J14l4j65J32L6k05mL62k31
6996f0P6o5J39J89j38j80K5k51K45K57k12j8J46Q6l70K72K5p0j82K39j51j79K56
7019G9j23j22K34j07J75k13M1n3k31N10n20L75k19P8j41J36O8L26l34j75K39j09
7041h6K62j28pQj5J44j04j76Q9K57l24l2K94l76K29n1l2M8j22N9p9J68J58m6J5
$$ y = [-144, 140, 59, 280, 36, 60, -172, -204, -138, -86, -68, -143, -33, -108, -307, 114, 28, 301, -35, 81, -106, 35, 233, -365, 401, 312, 265, 25, -168, -253, -91, 6, -95, -408, -171, 589, 204, -40, 120, -56, 78, -19, -151, 149, 96, 178, 235, 117, -170, -286, -141, 103, -54, -117, 1, -107, 59, -288, -93, 55, 134, 235, -70, 104, 144, 72, 244, -63, -68, 127, -9, -55, 295, 166, -106, -162, -89, -127, -253, 18, -56, 247, -210, 101, -39, -2, -66, -3, 59, 59, 38, -151, 29, -185, 21, -33, 31, 43, 316, -207, -75, 142, -371, -67, -43, -52, 70, -65, 49, 15, -150, -18, 18, -187, -191, 171, -60, 16, -49, 90, 279, 141, -39, -14, -265, -20, 237, 25, 7, 153, 239, -131, 141, 166, 96, -86, 153, 2, -177, 79, -44, -166, 68, -39, 136, -77, -36, -89, -320, 190, -330, 45, -174, -96, -237, -101, -33, 293, -41, -216, 23, -86, 176, 48, 41, 49, 34, 178, 74, -102, -13, 244, -80, -112, 182, -194, 35, -16, -48, 0, -122, -63, -142, 26, 184, 138, 153]
7066A53m03K22M0j87J68k04Q6J19q9K48m3j11%j85K62k3K3L11n85J32J91j53r8
7089a26J2Q5L22k74Jj48K32k34O9J43r9l0J09M8J88m36j30L81k29Q7j4J2j55J60
7113b6J06j03j17M20J28k49K7l48P0O6J30k32J63J6J16J55o1k42j69rK13P7j32
7136aM89l50j0j02J23k17J62k67J01J90qr0j06K63l67M35m64K66Q5j18j3k7J60
7159A34L5J9k48N0k02K92j03j81J97J39p9l05J60K81l7O6l16L9L60l40kp0P3p3
7183a11j99l9M05P9k97K56N2j54J53k33KQ8Q7j41J39j82KK44J2j01K0j34K51j45
7207E4N8l05M49j92O6j70r8k5L26k59q3K10m4n4Q6Kj43J13K1p6R6K03k43P5J32
7232A99j02m8J03j04pj44J88O5J58j82j33M5l85L37O6L9j46N5J3J57l37P0j33
$$ y = [153, -250, -28, 12, -175, -7, -211, -125, -6, -95, 153, 110, -1, -1, -186, 76, 53, 76, 387, -198, -66, 125, -28, -126, -114, -29, 293, 19, 20, -128, 104, -130, -61, 82, -17, -47, 62, 110, 298, -138, -268, 113, -116, -29, -43, -31, -186, -26, 80, -23, -140, 280, 408, 159, 186, -162, -92, -26, 104, -128, 35, 51, 167, 322, 261, 19, -150, -159, 54, 131, -1, 488, 138, 128, 26, 149, -68, 94, -173, -72, 118, 110, 20, -86, 177, -190, 245, -219, 47, 132, 14, 1, -26, 134, 169, 188, -60, -10, -212, 80, -23, -204, -7, 132, 53, -252, -92, 189, 152, 218, -98, -59, 301, -39, -41, -111, -38, -111, -310, -349, 56, 135, -162, 94, 146, -8, 145, -88, -86, 2, 89, -52, 87, -95, -93, 151, 163, 62, 82, -52, 199, 54, 112, -193, 256, 64, 130, -40, -138, -163, 163, -96, -179, 31, -13, -67, 19, 21, -122, -9, 12, -64, 32, 235, -8, 67, 199, 97, 49, 152, 48, 41, -103, 85, 150, 308, 126, -7, 38, -347, -10, 56, 95, -51, 4, 17, 174, -163, -93, -226]
7255b26R6J14J25r8j10J3P1R8j34K51M0j76L8PK7l69m6M09J09l5j26k4o6k32K50
7280Fk80K59q0M00l00j98K78k48m2L21j79k56L84K3j53j41M7J06P6j28QK60k7
7303A36l81J47J07N5p5J83P9l93J75N3k7O1k28P2K8J66K4l26J73j09K83L1l60
7326a26j6j49K89J0k79L66kk34K82k4j62J37Or6L1r1Op1L01k67k9J25J18j36J5
7351Dj49l2P7R3Q6j55Q6N1O6k70J70o9M9L2l32L63K8J63l02n5K80n11L13R1m2
7376C5J51k63K92j50k43J42O4j32R6J56k22J40L2j99K1J43l13L15k23L21l70K23
7398A6j94J77N8k86K67n3k84L68j09j6P1J5K6j12j29K04j03r6J50R6J22j23j89
7421a24M5r2J30j60K73p6j46L81j36m8k72K37m7L05m19K51k05J80o5j9j6j58N38
$$ y = [-226, -130, -16, 109, 11, -99, -86, -15, 83, -51, 200, 240, 64, 102, 109, 136, -233, -279, 130, 239, 204, 78, 54, -12, -244, 6, -274, -15, -95, 305, 5, -193, 85, -163, -205, 116, -63, -319, 65, 88, -65, -206, -159, -53, 23, -105, -97, 163, 136, -245, -98, 9, 64, -11, 172, 251, -142, 33, 86, 59, 120, -108, -36, -8, 158, 182, -144, 29, -80, 203, 234, -126, -142, -291, -2, 8, -271, 95, 93, -141, 141, 117, -45, 92, 98, 2, 33, -58, -52, -123, 178, -89, -118, 7, 125, -11, 4, -145, -177, -100, -7, 79, -76, 10, 61, 127, -143, 27, -42, 7, 39, -293, 70, 98, 261, -41, -96, 184, -327, -14, 77, 35, 186, -77, 215, 65, -178, -36, 28, -104, -8, 148, -74, 66, 98, -101, -80, 63, -250, 65, -158, 163, -207, 16, -178, -1, 57, -229, 38, -15, -299, 69, -40, -56, 15, 30, 56, -56, -185, 19, -84, -180, -30, 66, 188, 65, -124, -79, -171, -41, -201, 72, -4, -150, 231, 95, 47, -225, 12, -35, 270, -149, 102, -103, 77, 12, -7, -23, -181, 357]
7444C57l99qp9j41K03O0n5K6L01m56Q6j49K07k16K36oJ35k96J88N5r0q1K61k97
7468a58J00j6Q5J16o8j92K04j21L8R8Km01M19l34K86j57j19K68q9J72j98K6qO5
7492A8j78K8J83RMP1k31J02O6L4k67L01K2n07K43P0j0J10j68J68N9j60n8o0K38
7517H7pKJ32n91L62M4l2r2K2L60N8k07L6J33l32r0J96J24l94J83P0r0K68j84p3
7542a5k09L38k78J83qMJ19P9k92o3J82k44J9K23j04p2L74N3j21m84N8Q6L04k40
7566a08j57J73O3k83K87K10k53l6O0J18L9o0k8j72K14j52K31p4lj74L75k69J37
7589A38k33k23M95l17J41j38J59j2J48%k73J29N8J1nL4j92O7O2o7j24L32j99J16
7613A07l15L16l68N3J79L9J88J69l19l9j25j63L32k66K27k43K55Q8o3j37K79j58
$$ y = [357, -42, -50, -129, -270, -67, -7, -62, -36, 265, -191, -105, -254, -47, -263, -27, -33, 102, -194, -6, 49, -41, -122, 139, -158, -58, -74, 11, 127, 59, -133, 71, -50, -12, 86, 88, -313, 106, -228, 58, -99, -218, 50, -39, 133, -65, -39, -47, 18, -160, -132, 51, 60, 64, 135, -96, 6, 72, 106, -161, 140, 162, -345, -102, -32, -42, 68, -100, 68, 127, -33, -91, -151, 87, 80, 82, 214, -377, -15, 29, -3, -95, -73, 287, 345, 138, 174, 307, -25, -115, 81, 205, -189, -6, 64, -26, 242, 58, -15, -224, 114, -164, 19, 11, 15, 134, 213, -79, -142, 40, -204, -185, 38, -66, -138, 236, 289, 168, -316, -258, -172, 132, -108, -265, -92, -29, -312, -25, 185, -68, -104, -44, 74, 113, 53, 25, -147, 67, -85, 146, 72, 69, -105, 270, 1, 138, -95, -318, 177, -140, 1, -137, 22, 10, 158, 158, -115, 14, 72, 83, 78, 112, -80, -13, 49, -18, -142, 190, -9, 107, -208, 108, -260, -207, -28, 11, 199, 368, 49, 10, -115, -278, 54, -212, 15, -228, 27, 115, 52, -85, 194, 36]
7635C6j64O8m3J36K6m7L3j6j34k10K01pJ49n4j25L11J63k35j37j3J06p2m5k4L01
7660B04k34j20K07M8j15P9J89k86J10J23k6k07L5O3p1k10L37j19M8j1j42rL20
7683B13q7q0j8J66j22M1m6o5k4o4K09m11J03o9R0k7J17K41j45Q4k25Q5J45l7R2
7708A66k40Q0k51L30j3K4K05m11L30J6l98rl8K15l4M7J96j47Q3N5k82K09n5N8
7732A36m65K85k2J19K49m31J07j16L82o7j10n8K1K09Jm00K5l8J98L2j63M92m63
7755g7J88l5J8L0j00q5P6j21J96j16MJ14n3j82J88J43k60J99m17K49K1N5j56J98
7779G7j28J93J15l46K69L28o08J22K03k70j29N54m71mJ09j03P7J94k98J32j72
7800a56L4O2j15J06J01l52L82J78k79k07K95Q0j46m1K37l8K3l86L97j02N0k42
$$ y = [36, -128, -60, -103, 33, 59, 12, 45, 29, -105, -315, -114, -121, 28, -26, -151, 160, 323, 88, -49, -62, 44, -28, -73, -97, 204, -30, -150, 57, 105, -10, 69, 258, -28, 82, 205, 179, -28, 7, 70, -1, -211, 126, 7, 55, 44, -98, -107, 213, 126, 46, 28, 194, 72, 113, 67, 2, -22, -86, 123, -288, -185, -254, -164, -191, -74, 167, 22, 106, -119, -34, 111, 74, 166, -74, 6, -245, 85, 72, 96, 301, -110, 220, 236, -162, -171, -209, 6, -28, 19, 215, 68, 151, 206, -76, 133, 78, 136, -329, -44, -66, 53, 302, -129, -22, -138, 244, 177, 67, 9, 30, 239, 240, -160, -135, -173, 25, 57, -106, 386, -77, 111, 76, 94, 124, 24, -61, 15, -106, 90, -26, -22, 92, 39, -143, 45, 188, -72, 127, -290, -41, -20, 35, -121, 77, -51, 142, 257, -89, 180, 508, -100, 22, 225, -45, -174, 380, -91, -95, 14, -89, -12, 182, -116, 16, -156, -122, -60, -175, -69, 32, -320, 62, 240, -39, -246, 49, 129, -17, -58, 179, 141, 164, -222, 175, 73, 123, -119]
7822a19r8J45J34O6k65J80R2j19O0J07j07P5M3k38J18j2j36j8j55N64l33J25N3
7845A62l71P8O0L11J66k77l81J91j65L27l2j67L54p2l00L11k64qj84K82p4K38
7867A85j76Q9o4j10K56o31K96R0J48k06K50j01j8Mn5q6k9j67O14m13J14L7j57
7890a30J52J12k5k87K08k21J30J32j05O4R8j33K80J31o79J77K46q1l7o1K7k20
7912b22O2K52q8k96L05K46j10k84K31k00J74r7J59p4k01J43j7J17P5Q6j91j14
7934d4O8j48J54k63K72l66J76J02P8j01N8m2K58j04j15L2J31j76l0J19J4j70j11
7957b08K96J99m70J34K01j22L12n02K14k43Q8J24j0m2j17J27M81o67L74j21L7
7978H5r9K70j24j78N5n0L91n67L68n04K52Q7l4j6KL0k00K23O6j18j49L21j82J34
$$ y = [-119, -217, -72, 62, 128, -137, 43, 135, 16, 76, 183, 76, 151, 194, -44, 74, 62, -74, -92, -247, 317, -16, 109, 162, -209, -131, -71, 240, 406, 129, -252, -61, -226, 101, 69, -98, 256, 184, -116, 195, -69, -77, -261, 21, -53, 185, 9, 98, 34, -76, 180, -451, -155, -65, 83, -123, 127, 26, 8, 12, -43, -129, -158, -325, 289, -124, -10, 27, -130, 22, 134, 109, -178, 30, -191, -61, 71, -34, 30, 128, -5, 275, 406, -273, -96, 150, 69, 32, -29, -2, -222, -160, 92, 4, -292, 13, 259, 149, -135, 96, -104, 70, -27, 132, 58, -143, 0, -17, 100, 175, 261, 70, -44, 24, -124, 30, -233, 39, -327, -151, -49, 29, -72, -14, -56, 202, 98, -17, 15, 146, -30, -60, 59, 73, -97, -208, 88, 287, -183, -49, 152, 30, 342, -160, 54, -189, -101, 23, 13, -29, -146, -19, 462, -205, 169, 48, 85, -14, 256, 132, -46, 9, -41, 350, -217, 151, -353, -101, -14, -48, -64, -62, -32, -232, -9, 57, -61, -210, 111, -71, 63]
8002F3J6Q4Q3l26K18j59J79j26O6j64J5J92j89M5Q8pn5j00j04J40p0l4r2M12N
8027A80j99k50L15r6J63J9M5N3j93k16Q3l2J82m2o3N8l3J55k86j0M05k41K08r4
8051A11j85J66l5L5l15L06j6J0j00L47n30R1k7J78l41K50J49p0p5K73k19j15M9
8074f3m2K22n9j23J62R4N9k40p3k32K77J9K37j48j73k8O2J52k47K74j54q8j27
8097b39M8J22J56k15j47L20Mj64K93k51l6j81R5L34j91j18j01J26K38k2N7k27
8119i9kK08J08l42O3J18j55J29Q1Q0kl06K95j66r1%J84j51K89k84J25j13pl9K76
8144A99j60M21o53J46J9r0J15nm3m4J79m9j54L13q1q2n4N5k4r8O4k80L39j25R0
8169bJ43n9k58L60k2n5J18j09L9l27jP7j8J65ol1j04j86K59k75O3L26
$$ y = [63, 79, 163, 246, -80, 138, -21, 158, 32, 98, -66, -51, 141, -48, -3, 85, 78, 23, -77, -181, -41, -111, -145, -237, 175, 180, -19, -269, 46, -50, 113, 132, 177, 230, 37, -179, -96, -128, 54, 12, -51, 7, -26, 129, -157, -167, 238, -3, 205, 111, -74, 92, 57, 92, -223, 83, 67, 77, -23, 324, -206, -115, -142, 36, -305, -55, 94, 24, -51, 222, 3, -112, -63, -105, 117, 58, -65, 97, 191, 250, 10, -63, -295, -18, 1, 238, 90, -83, -111, -49, 103, -144, 130, -24, -112, -239, -191, -69, 87, -128, -275, 45, 49, -115, 178, -73, -109, -290, -195, 139, -52, -170, -271, -145, 93, 71, 128, -99, -101, 107, 215, -127, -64, 54, -101, 28, 109, 189, 187, -119, 176, 10, -81, -81, 103, -48, 241, -43, 82, -31, -38, -77, 199, 39, 460, -193, -47, -28, -118, -3, -8, -51, -95, 84, 35, -119, 194, 113, 31, -23, 32, 8, -90, -26, -306, 33, -92, -2, 141, 82, -176, 184, 162, 107, 225, 116, 155, -172, -173, -96, -114, 51, 45, 14, -90, -276, -17, -292, -229, 97]
8191I7
$$ Imaginary data points
##PAGE= N=2
##DATA TABLE= (X++(I..I)), XYDATA
0@%%%%%%%%%%Qj6J6j6K1k9M0m8N6o7P6r1J14j36J57j83K13k49K86l28L77m32M92
33B61n56O28p09P98q94J001j118J246j387J540j705J885k083K302k541K800l086
50a618L400l746M130m555N028n561O165o855P652q584R694j1044J2722j4873J7748
65I703k1807K8016l8799O2703k11844J18286L66162l11070j34839J42387j9632
76a0734j03326K52981N3834l54966p4014L85694N0029k71880p492J21111j10657
87f9420L8724K21499j24635l09209J51326K92874j27877j91387J13786K0379j16922
98a00862J45311J51293k53715j71344K73617J50389k23083o1254J37573p6574
108b8649o8666K14629K8097l01493j5487L00862l668k18803N2356R5731j31959
$$ y = [0, 0, 0, 0, 0, 0, 0, 0, 0, 0, 0, 8, -8, 8, -8, 13, -16, 24, -24, 32, -35, 41, -50, 64, -72, 85, -98, 115, -134, 152, -176, 201, -231, 261, -295, 333, -376, 422, -472, 529, -589, 657, -730, 810, -895, 990, -1093, 1209, -1332, 1468, -1618, 1782, -1964, 2166, -2389, 2639, -2922, 3243, -3612, 4040, -4544, 5150, -5894, 6828, -8045, 9703, -12104, 15912, -22887, 39816, -172028, -53742, 312420, 1350, -133489, 8898, -10734, -114060, 138921, 192755, -162211, -236225, 149469, 199498, -72382, -79874, 41237, -69420, -30696, 190803, 66168, -243041, -91715, 201159, 73282, -118105, -4319, 16060, -100862, 44449, 195742, -57973, -229317, 44300, 194689, -28394, -89648, 47925, -28649, -97315, 117314, 145411, -156082, -171569, 129293, 125625, -93178, -40822, 54909, -77050]
119g7050K3343K20137r2978k66002J15342K44615j04132j49132R4953J2884j05746
130h3766J12548J27418j91318j41110J98799J10819j56827l4744R3012p0680m1798
141g7647J69469J5803k20569j080K10244j5446j42235N3823M7984j08911L7149
152c1416J60172r0838j84293J06419J58920j02462q9693R4149l875r3227R1657
163A5513R8910j41899r3833J50454O8384j20316j3133P6814n6835l8540J17972
174F3491J2394j50426k97J37802j6689r2353L9230K8677p1357K8010R9595o1954
186A6123j07032P3767Q7744o7056l9405O0239j7868n5357O8514N2949r5995m6556
198f9933R5971K4517p6138O844M6847m5826k1671P7516M747r1108P250Q4039j6374
$$ y = [-77050, -53707, 166430, 73452, -192550, -77208, 167407, 63275, -85857, 9096, 21980, -83766, 28782, 156200, -35118, -176228, 22571, 133390, -23437, -58181, 34831, -35849, -77647, 91822, 107625, -112944, -114024, 96220, 80774, -61461, -7638, 40346, -68565, -31416, 128756, 37918, -146375, -39956, 118964, 16502, -73191, 20958, 17083, -76144, 15513, 114423, -27476, -121309, 29145, 97529, -22787, -35920, 40894, -15941, -54481, 63491, 75885, -74541, -74838, 62964, 46275, -46078, -6848, 21829, -49528, -21518, 78077, 16123, -90909, -17142, 70602, 3546, -35859, 24380, 6512, -48845, 19669, 72618, -23377, -69933, 26038, 50555, -25583, -18739, 28108, -17718, -39389, 38127, 42874, -48234, -40984, 43055, 26681]
211B6681n5654K9511K1828m3341J0377N3199l1841n6064L9864M2758m0906k1024
223b4612L5539q504l0294L2219K4559m5522j6869M8167O654l7529J0288K4593
235A8689k5224q440L8006l039m1840J1024L5663j8255k4040K1834P128k7117O531
248i080K7682j6947k4156K1224J6728k0792m842K0071n461j6344J4316J3333j8137
261b405q204J6641J842j3699L470P565r335m149J1502k26j1238L721Q374n168
275a309l260P835M0o271L499P129m729n158N766K267o309j90M378l862l734M043
291A35J777n541j654N110R50m023M44K839j91p15K185N94j468J67K055j12k096
308D56n89R47l27j217k15n29j53o7J06K67N27L8L07P97R27Q3n74J482R79j642
$$ y = [26681, -28973, 538, 22366, -20975, -10598, 42601, 10760, -45304, -5440, 37318, -3588, -24612, 10927, 2423, -27871, 4348, 28907, -16615, -33484, 14683, 21337, -16192, -5904, 18689, -6535, -14975, 23031, 19992, -21848, -10824, 24839, 6584, -17456, 4378, 11506, -15611, -9080, 18602, 1655, -22501, -1277, 15451, -5341, -10183, 9888, 4427, -11917, 2399, 15732, -2405, -10609, 6032, 7874, -5825, -2355, 5210, -4125, -8274, 3228, 3002, -8236, -4515, 3859, -1309, -4569, 3266, 3306, -2965, 534, 7663, 2934, -2224, 3542, 5809, -500, -690, 3688, -174, -3908, 135, 1912, -3629, -5283, -173, 777, -3246, -2802, 37, -154, -869, 1316, 1910, 442, 609, 2664, 2552, 456, -133, 814, 487, -730, -945, -1474, -1627, -1694, -1588, -1321, -794, -756, -449, 348, 1275, 1358, 784, 2266, 3245, 1603]
328A603j202K169l29k411n39J056j725j358J618P58l833J54M409p02k779K035
344a076L127k540l65M980m16n479K342M787m194l356M535J16o323K848N361o506
360b159n686Q711L861r239J88Q839m586n116R792K954j2599j18J5025l579j3214
375f926O563P614j1844j120J4439o758j7222J1025J5875j3563j0235J5433J405
388D686j4685J0758J5207j9584j2396K5122Q279k3960m11J8187j1258j1830K3120
401A1235L275l2605K090L3438q223k6295J4414J2884k2109M153L0256j7241l3323
414b8051K5810L0414k7439j7707K6350k925k3768K3264K1628m0683j9740M5593
426A2746J2723m0506M31K7402j9395j1422M0204rn3175Q944N4134j3555m0112
$$ y = [1603, 401, 2570, 2241, -170, -709, 347, -1378, -2736, -1118, -360, -4193, -4039, 370, -332, -3111, -1076, 2051, -489, -854, 4126, 3710, -1769, 573, 5360, 1166, -2190, 2345, 2461, -3862, -1014, 4347, -2159, -7845, 866, 4727, -4512, -4324, 4515, -71, -5187, 4605, 7559, -5040, -5158, 9867, 6288, -6926, -363, 7251, -4593, -5713, 8726, 1968, -15254, -4229, 11646, -1917, -12152, 3281, 4686, -9999, 759, 15966, -3618, -16014, 9108, 17387, -6573, -6984, 11203, -55, -11885, 11235, 14510, -18095, -16005, 17433, 9210, -17085, -2671, 10213, -11896, -7743, 22513, 5272, -28051, -2241, 28173, 734, -16973, 9377, 6452, -17316, 5948, 27576, -13107, -32847, 12746, 25469, -15037, -14606, 12796, -6599, -18021, 22183, 22174, -31001, -22057, 32077, 18522, -21590]
439b1590K1688J4977l2025J1213M2913l2901n0196M1739M4033m1660k4211L5312
451I292p433k9540M0110K7344o2571k3499O8998J5979n6266L445L2883l0268q426
464a9952N7994r365p6384J6980P4471k2711n1158K8143J3499l9913K5484N4068
476E1156n2506o1438O2397N4886n4936k7403M1227j2696l0252N4982K4760q3000
488c2823k3214Q6333J4173o7266M803L3515l6079p73O8285k0491q8269K9968Q4995
501E3157l0384n5255L5027R799m4615L6370N8217o6714o5961P3683N6224o3072
513c524k5980M3442k1389k8065O7400K0769r6172j7748R6989J0392p0006J0699
525a3193L0908m3526Q310P7532l1120r8133L7531R0602l5315n6330L4178M054
$$ y = [-21590, 98, 15075, -16950, -5737, 37176, 4275, -45921, -4182, 39851, -1809, -26020, 9292, 1859, -27681, 12429, 39773, -22798, -46297, 22701, 38680, -17586, -14141, 18742, -11526, -19952, 38042, 28677, -47707, -30727, 43744, 21033, -30125, -1982, 11517, -28396, -2912, 51156, -1350, -62788, -391, 54495, -441, -27844, 13383, 687, -29565, 25417, 50177, -32823, -56037, 30296, 44469, -22797, -17994, 15521, -20558, -21331, 46954, 26463, -61806, -31838, 53157, 22773, -32482, 2545, 12344, -32271, 4099, 62316, -4398, -70359, 3324, 59548, -3524, -29504, 13938, -7451, -35516, 31884, 52653, -43519, -61267, 35722, 46114, -23892, -13193, 17715, -25811, -17501, 60031, 28911, -69222, -31691, 58911, 23596, -32734, 1444, 5498]
537E498m3585M5818N6680p6321o4337Q0959N4380o3513k0927L9304k6044j9736
549c1824P3241J2578j00760j1275R8666M300o9169J3785K4628m3982J4635P4536
561E9359l8815r2832M4724Q4174l9448m7769L6459l378l9162N1660M9486q0567
573a6109n4132Q2848M3382o3754j3214L5589l0953j4649P2357M273r5623j595
585e1580Q9749l070n8713J7559J7168m1162K0973O6914m1943p8255M5418O8077
597E1135l9267l4995L2091r799l3148M9181L8227p2946m0051P1882L0129n3177
609a0738n100K8995k9997p964O2871j226p9454N299P3417r236m6992J9592J1412
622A0879l7300J9934N3378l8733o0869M1387N0706l6147k3071K9543j2366k6778
$$ y = [5498, -38087, 7731, 64411, -11910, -76247, 4712, 59092, -4421, -25348, 13956, -12088, -31824, 41417, 53995, -46765, -58040, 40626, 44926, -24243, -10458, 14170, -29812, -15177, 59359, 20544, -72288, -27564, 56610, 17162, -30607, 5852, 2474, -36688, 14972, 64458, -16109, -70241, 12607, 55989, -7765, -20979, 14610, -16343, -30992, 41365, 45638, -49985, -51580, 38169, 35099, -23614, -6055, 11113, -30049, -9076, 57838, 15895, -62360, -16942, 51135, 11868, -23127, 8964, -835, -33983, 15198, 53425, -19521, -59572, 12310, 42439, -10738, -15838, 13157, -16840, -24804, 38067, 36841, -42613, -37314, 36103, 26867, -20125, -533, 10879, -26421, -6487, 46891, 8158, -52711, -11324, 39382, 3235, -19836, 9707, -2659, -29437]
634b9437M4542K7737o0430k5550N8900J6602m3097L009K2063k8545n279N0437
646C0952n702o0263R838N1950j3178l1403K0137M532k9867J8378L9697l1621m0164
659c6714L3973L1251k8882j0815K2623j2692j9452L3201J6753m3980j3818M0801
671A2249O339k9897O487J4010k1666q95L4285o677l8115J0974L2514j2378j8569
684a1339J6718P93k0893J3963K4201k2625k3688K3009J6926k1059m277J5817r924
697b378j1919K1225R437k6670n765K5567J205j8077O597R161j4359j098J9995
710A2921m435k1438O844J7605r672r821J0736M39j2892P784J3310j2769j0939
723a2327J3645P505j1987m69R739o103o771J1928L893j4154j393J2889k568r490
$$ y = [-29437, 15105, 42842, -17588, -43138, 15762, 32364, -10733, -7724, 14339, -14206, -19485, 30952, 25250, -35013, -25175, 26775, 13597, -17806, 2331, 6863, -23004, -4626, 35071, 3450, -36714, -2741, 28510, -372, -11187, 11436, -1256, -20708, 12493, 29246, -14734, -28552, 12249, 18588, -11309, -4822, 9188, -12478, -13373, 20912, 14235, -23880, -12906, 19608, 7230, -11339, 5379, 6172, -14721, -758, 23443, 818, -22870, 139, 17065, -3994, -8271, 7546, -2378, -14297, 6928, 16365, -10305, -16070, 9497, 10702, -7375, -778, 8383, -5976, -7074, 12921, 8486, -12952, -6108, 11497, 1825, -7996, 2740, 3179, -9713, -1929, 11381, -1388, -12327, 1318, 8823, -3164, -3633, 6106, 3, -6768, 5160, 9053, -5101, -6494, 6395, 3827, -5663]
737e663N189M603q884k28J0380l108r692N249P594n717l411O597l11o138M000
752D60N761o098m181O085J702n783K92M064l213k773M622P73m623J67M156j027
768C84k620K526J536k810M25L257p94k695J108K031j986j528J623K99k076N68
784g52J062j453j189J996O55j485L92J683n22p04J060Q89j271j27J075k33j099
801b3J12N41q21j068R39k4j133K61J116o05k22J121j65m82P33Q51p81j95J590
820A745o94j211O38J014j540n73P66j29j637P19J203j241j076K048M82j643Q09
837c20J769j057j023K248L22k598L41K901j645k727K130R68l093k6L389j803l694
854c918L194L238l504j459M222o61l128K896L467n275k223O224Q27n833R52L837
$$ y = [-5663, -474, 4129, -4755, -4983, 5397, 2289, -7403, -2154, 5440, -277, -3688, 2909, 2598, -3540, 460, 6221, 123, -4058, 2027, 3729, -2054, -1762, 2302, -911, -3684, 938, 1711, -2912, -2745, 1411, 384, -2236, 290, 1826, -984, -559, 2698, 1904, -791, 317, 2348, 362, -1166, 457, 756, -1320, -752, 310, -1143, -2332, -336, 319, -1166, -774, 909, 387, -317, 743, 1632, 361, 234, 1309, 1076, -23, 89, 630, -191, -1259, -320, -344, -1477, -1216, -100, -705, -927, 194, 29, -453, 280, 1131, 350, 155, 1745, 1051, -160, 478, 1492, -48, -621, 145, 16, -1621, -902, 301, -940, -2016, 32, 514, -1129, -320, 1449, 392, -631, 1617, 1939, -659, -318, 2583, 938, -1789, 341, 1309, -1784, -1810, 1579, -224, -3918, -724, 2514, -990, -2449, 1773, 1112, -2016, 880, 4347, -928, -3151, 3073, 3900, -1933, -981, 2856]
870B856m012k177O074j61q051J568Q475l243o009M888K501n641J686P612m936
885A430q324P947O862q432l341P204j907o741P081N418j1922m283J3268J818j1485
900e407K151P736p304k227J3069j842j5857M800J5219o301j0702Q364K617j0794
914f478N203J3153j2433j4058J4767J1246j4234m583J1722m653q567J4380P165
927A2630k1044m554K2170J747j7180L524R181j1359j323J9480n807k4204Q650
940h089K2350r999j4727J1581K218j4093J0911J7463j9302j8522K2427J5094j9688
953b376n281J4521q693r164K1391O188l0128m431K9908P63k2682O425R997j6225
967i787K347K6176j0107l1388J4138K8487j4165j6561J4620l42j6546J6615J9705
$$ y = [2856, -1156, -3333, 2741, 2580, -5471, -3903, 4572, 1329, -4680, 208, 2709, -2932, -1246, 6366, 1430, -6894, 1053, 7915, -517, -3858, 3346, 1439, -5302, 1779, 7197, -4725, -9008, 4260, 6078, -5407, -3256, 4480, -2824, -5051, 8018, 6176, -9681, -4881, 10338, 4037, -6665, 1699, 4316, -6478, -1275, 11878, -555, -14613, 154, 11400, -2834, -7417, 4305, -348, -8915, 5465, 12630, -8414, -12968, 9202, 10949, -6231, -2707, 6474, -4885, -6208, 13272, 7465, -16739, -8089, 14261, 4262, -10465, 1116, 3334, -10759, 152, 17615, -1687, -20209, 2218, 17312, -2376, -7657, 6864, -1829, -10993, 10398, 16586, -13542, -17973, 11935, 12698, -9984, -3559, 6438, -9787, -7440, 18736, 8629, -22759, -8621, 19866, 5701, -10860, 3760, 3418, -13128, 3487, 23192]
980B3192k7449k1281K9088J6344k4118m759J5324j1659q219K7588M510l6939k112
993b0490L5987n03k4791Q162Q813j8538O226K9144j5583l4926J7989L0025j6903
1006D612j6178J5498l734j7282K2150K0274l2902k0856L4129J5660k6183k034
1018f846J5274j5479o224L1947J783m0991J78L8032m037k4647J0076N981k0646
1031a5599J0208L1109k0056l5177K2051K9919j8601j4418J6310o451j5678K5158
1043H775J8151l5740j8621L4794J3110k5923o44J3535j7304l587L2472j671m0348
1056b3001L934L6296n407k2038J1209L677j9625J2339K8947k1424l2078K2740
1068d431K5649j9181j0824J4764q592j4201K5744J5012l5391j4185L3485Q992
$$ y = [23192, -4257, -25538, 3550, 19894, -4224, -8983, 6341, -5318, -13537, 14051, 18561, -18378, -20490, 15497, 14994, -9797, -1635, 7178, -11360, -5134, 24010, 8427, -26499, -8510, 21515, 4612, -11566, 3932, 198, -17084, 5066, 25340, -7562, -28418, 5711, 21371, -4812, -6846, 8428, -7051, -13275, 18672, 20455, -20536, -20358, 17674, 13637, -11010, -934, 5047, -15599, -5391, 25718, 5662, -29515, -7464, 22455, 3854, -10564, 5746, -705, -16383, 8775, 26926, -8814, -27435, 7359, 20469, -5454, -6098, 7437, -9867, -13454, 19018, 17347, -23001, -19067, 17229, 11822, -10216, 993, 4670, -14955, -2616, 26331, 4907, -27171, -4431, 21218, 2037, -8787, 5977, -2615, -16816, 8928, 23940, -11451, -25636, 7849, 16841]
1080A6841k3232K262J1175j6924o38L0548m942l5813O518L1423p723j8339J1344
1093B500M62j7823J3823K3719k1452k6029K2249K0082j8002p005J3637r442j0665
1106a3946K3415J0575k9705r627K8137M734j9344M098P992j5570N01K5414n865
1119A0809k9554P682K4684q845j3089J1209n82j5026J3170J8885j9515j8870J9756
1132G14J3543j5587l368J1409r860q146J9837O290k4988m575K2303M01j4680O237
1146d70N431j3376K201J9482o312k1177Q498J7088q622q119R419k154j1649J0572
1160H12J2871j5161j1782J4384P484j1823j01P923p875m786J4149L415j6660j051
1174h201J4473j087r178N156L315r914K044J2535n373j3210O778R399o575m457
$$ y = [16841, -6391, -4129, 7046, -9878, -10516, 20032, 15090, -20723, -14205, 17218, 9495, -8844, 2500, 2962, -14861, -1038, 22681, 1229, -24800, -2551, 17531, -471, -7476, 6161, -3281, -13946, 9469, 20044, -9661, -19288, 8849, 13583, -5761, -1663, 6329, -9241, -8740, 16674, 10809, -18745, -11063, 13621, 4776, -8313, 2896, 2314, -12712, 458, 19343, -172, -19042, 714, 14257, -1330, -4698, 6711, -3149, -11295, 8542, 14832, -10156, -14731, 7572, 7973, -6707, -470, 4961, -8415, -6214, 13268, 6956, -14221, -5723, 11365, 2743, -5376, 4043, 1889, -9760, 812, 13683, -1478, -13260, 1124, 8608, -3215, -3316, 4607, -3268, -8054, 6095, 9510, -7150, -8201, 6272, 5185, -3993, 1163, 4478, -5436, -3392, 9143, 3770, -9440, -2662, 6737, 162, -4295]
1188d295O992k359p133P419P598r786o344J0186L579q261R72N884n724k849Q214
1203D093J646j0340N0Q567j672o044L961K234o392J117P669l121p332M343N353
1218D132m373j777M653j340m132L998L660n816k709N131J160m665Q66L353l428
1233a287j769M908L44m932O51M253j325k580K757P97l014Q48L077j698l295K575
1249C10J810k607o55J890o79k041J479J602k157q32K435K26j598N75J325q00r10
1266f27J821p3j525r1J538n25j151N76K25j045p3J341m37j123N76Q75n30k96P85
1285B41L06p18M82O31p95k75J056j54j178K37O59q77m18O21L39r06j45J056k61
1304i9r44J361L61r15K28Q31m68n21P70L7q34n7R41o32r96Q66K85q71k3P66l70
$$ y = [-4295, 2697, 338, -6795, 624, 8222, -1564, -7908, 2278, 5857, -2404, -1432, 4452, -1272, -4121, 4093, 5739, -4601, -4551, 4016, 2344, -3700, 261, 2495, -3897, -2780, 4889, 1768, -5564, -1221, 4132, -241, -2018, 2635, 1295, -2837, 1161, 4821, -995, -3704, 1427, 2587, -2078, -1212, 2141, -1287, -3056, 1852, 2196, -2736, -2085, 2168, 843, -1737, 1020, 1817, -1197, -349, 2728, 1030, -2265, 310, 2120, -487, -1142, 748, 69, -1972, -493, 1109, -1048, -1880, 555, 781, -817, -242, 1083, 283, -627, 1194, 1121, -404, -495, 1043, 518, -633, -57, 168, -877, -950, 391, -46, -1169, -593, 282, -248, -544, 241, 547, -171, 311, 942, 147, -128, 928, 774, -404, -167, 492, -385, -803, -182, 157, -749, -894, 162, -99, -1043, 318, 679, -236, -8, 823, 355, -166, 604, 641, -193, -250, 691, 59, -937, -71, 214, -657, -680, 86, -284]
1325b84q92J015P42p78l37J311k39j047R95J028j751n99K022l66j739L49J151
1342E81j026q89J969p9k395P88K291j080j521J980L08j585M61K728k236k259K449
1359D85J745k729n87K095r84j987K453J230l665j008M356K8l312J463K024k197
1375e90q55M070o73m809J771M505k602k860L124K86l994J982M264m241m198N275
1391D55K882m721r97M341j932l233N567J679o878q79P434j74o292K659K696n132
1407b525J51O979k649q294M240O897m722l850N109o12n057M745O195p821n619
1422f833Q647M343q131N2N187m544l268Q914J107j1330l20J0847j155p896L865
1437e15K761o676K064R981n307j0796O479R635o656m782O062j622n978P477O773
$$ y = [-284, -1176, -161, 581, -197, -534, 777, 538, -509, 486, 1514, -237, -836, 1186, 820, -919, -570, 581, -445, -1334, 635, 556, -1839, -1051, 1240, 160, -1361, 619, 927, -658, -197, 2531, 295, -1964, 485, 2230, -499, -1086, 1009, 25, -1962, 491, 1721, -1944, -2952, 1404, 1432, -1880, -417, 1607, -590, -1445, 2625, 1952, -2857, -1086, 3419, 817, -2043, 1081, 1367, -2627, -645, 3619, -622, -4820, 455, 3337, -1384, -2381, 1960, 28, -3205, 2362, 4041, -2837, -3716, 3718, 3544, -2748, -89, 2607, -2525, -2374, 4605, 1956, -6338, -2098, 4799, 77, -3773, 1336, 724, -4333, 412, 6607, -1214, -6833, 1814, 6157, -1974, -1922, 3265, -1279, -4547, 4367, 5474, -5856, -6176, 4671, 3516, -4380, -515, 2246, -4430, -2366, 7615, 2308, -8488, -2009, 7626, 970, -3812, 2250, 628, -5350, 2127, 8900]
1452H900j1554o812J1747M526r419n5N536n976k442J1823O13j5134J373J4026
1466G152k187r215M980K179q355L634J2064q179j3483R220J0501q289m816P421
1480B627l096p333J0983P357j4849o503J4780M431j1335J332N709p907j355J4273
1494I114j676j7223K543J5177l648r393N783J092r756O695J3003j0657j3912J1189
1508a669J1401r383l889P496n226o445J3123O138j7273o134J6266L451j1647K453
1522a338M693r469K95J5846l241j8121M196J5676m928q395O934o59r511Q677J2225
1537A2880j2464j3204J2276R634r727k913P247o485n414J4077M848j7903m224
1550a1372J6282J911j0343L517L387r391J900J5127m541j7353N057J4464n448
$$ y = [8900, -2654, -9466, 2281, 6807, -2612, -2667, 2869, -3107, -5549, 6274, 6887, -8247, -6874, 7152, 4965, -4250, 730, 2909, -5446, -1812, 10252, 2073, -11410, -2190, 8311, 22, -4794, 2627, -469, -7802, 3181, 10538, -4311, -10814, 3966, 8397, -2938, -1606, 4103, -3804, -5159, 9114, 7438, -9785, -7242, 7935, 4287, -5106, 677, 1769, -7987, -1292, 11711, 1054, -12858, -1669, 9732, 349, -3540, 3956, -1270, -7715, 5408, 11546, -5727, -11861, 4405, 7856, -3791, -1338, 3355, -6114, -5819, 10027, 6786, -11335, -7139, 8537, 3609, -4786, 2148, 1489, -8022, 655, 12880, 416, -12788, -512, 9122, -605, -3518, 3729, -2756, -8170, 5907, 10755, -7148, -11372, 4910, 6821, -3522, -5, 3382, -6009, -4109, 11018, 6477, -10876, -5819, 8645, 3197]
1563C197p401O765k339q772R007J1423j2764j1302J2134Q194r475j052O189o673
1577b869m154J3698L494j6527k537J4466L25r311L905K304r390K814J3605n619
1591D204j4694N981J1713n450n537O433k249p649Q923Q872j1798q534J1107N705
1605G027q583RM774o473k841J1685K083j4107j255J2173p39o827L798J424p645
1620e497K666J1329n161j1284N730Q648n975k896N387k871o077P267O773r990
1634a951n855R042L419o704Q06M010n920j467R507O00j0410M32Q632j437m986
1649b282L534Q18o420K813P919m908p774M617N841m484j799L846k065m176N824
1664A304M212p015l107O191J692m570J148K813m371j253O333K28p159N94N886
$$ y = [3197, -4204, 2561, 222, -8550, 457, 11880, -884, -12186, -52, 8142, -1333, -2385, 3804, -2869, -7023, 6675, 10169, -6358, -8895, 5571, 5896, -3415, 490, 2794, -6596, -3782, 9823, 4204, -10490, -4509, 7204, 1754, -3783, 2650, 401, -7248, 1675, 10547, -1251, -9785, 1322, 7027, -1556, -1547, 3227, -3246, -6087, 5598, 7681, -6426, -7681, 4492, 3753, -3074, 724, 2148, -5497, -2831, 8498, 3337, -7947, -2217, 6431, 456, -2440, 2947, 76, -6001, 1266, 8039, -1951, -7806, 1236, 4655, -2049, -1243, 2767, -3153, -4620, 4887, 5487, -4923, -4491, 4141, 2704, -2282, 1252, 2070, -4350, -1537, 6382, 1474, -6300, -1683, 4158, -326, -2125, 1721, -344, -4520, 1304, 5516, -1499, -4606, 1585, 3277, -1293, -145, 2668, -1703, -2956, 3377, 3605, -3554, -2960, 2926]
1679B926j758l709L140M33l889J717N191l152m658L440L072l142o39K972j686
1694B58k612L195K710m501k137M301O31l473R02J952k580n66L663j76l711J094
1710a050L141j852j566K305M20k967J308K734k197k444K011J698k191m89J941
1725H02j258j290K026J124k140n10K176k26j521Q46J198j308m45J557k34j502
1741g05J43J615j129p28J120k73j012L93J253q36o08J144L58j052Q7Q27j51p92
1759c46Q72K33q47l24O82M49j046K53M08p03m08J032j62o12J32O18n01j97M44
1778b3N91n55r4Q16m07n68N50Q2o74j24O01l75l39K36L73k53m40P04k3n29N78
1799A27L82n91P4L85J4o65N39L67o73m09J006k04r41L40O52m90n92O96r4o24N82
$$ y = [2926, 1168, -2541, 599, 1032, -2857, -1140, 4051, 899, -3759, -319, 2753, -389, -1028, 1944, 258, -2354, 841, 3551, -950, -3087, 1214, 1845, -1628, -726, 1226, -1354, -1920, 1743, 1567, -2144, -1050, 2091, 239, -1327, 978, 1398, -1569, -261, 2473, 276, -2168, -157, 1541, -650, -1139, 802, -456, -1746, 280, 1404, -736, -1246, 930, 704, -817, 29, 1227, -81, -526, 1031, 797, -705, -562, 1053, -76, -804, 316, 43, -969, -576, 677, -159, -767, 377, 735, -317, -230, 597, 446, -346, 526, 759, -88, -412, 270, 719, -327, -74, 334, -369, -777, 255, 93, -519, -387, 231, -270, -467, -23, 568, 13, -81, 735, 328, -240, 310, 392, -282, -406, 195, -180, -519, -283, 90, -163, -603, 101, 78, -451, 127, 509, -82, -8, 377, 391, -274, 265, 632, -41, -450, 556, 352, -589, -249, 403, -87, -679, 17, -77, -701, -119]
1820a19P00o14l09O55N7m61K81M85n81o42Q54N66j116n2Q68q08n53Q80J34r67
1840g42j13J257n4j116P31L73p94K57J407m60j523R31J069q45j384J041M43j385
1858i07O21J147j156j325J847Q28j817P4J523j022p73K101L70k473LK609n93k414
1876a357J402N16j465K54K434j563k968K363K221k188q41J828m40j781J974K116
1892B505l158j810L625J173l346O99J494j961j141L676k00m389J018M136j423
1907H98k533J895J036l263J307L728k618m002L331L261l290r84K755j341k778
1922b598L763K307n301k073N329P67l733R04K086l136k45M750j98o190J339N639
1938C410j840k773J813M83l707K461M543m173m990M190L876l741j283L264k449
$$ y = [-119, 581, -33, -342, 313, 370, -91, 190, 675, 94, -548, 306, 872, -244, -296, 572, -236, -789, 91, 225, -742, -855, 402, 348, -768, -37, 336, -458, -201, 1206, 746, -777, 154, 1223, 378, -1006, 35, 478, -907, -286, 861, -295, -1620, 227, 1055, -762, -688, 835, -187, -960, 1141, 1511, -962, -959, 1650, 1057, -1357, 45, 561, -904, -650, 1784, 221, -2747, -384, 1837, -351, -1192, 636, 196, -1585, 389, 2505, -653, -2463, 1162, 2335, -1011, -312, 1182, -779, -1920, 1756, 1556, -2833, -1815, 2321, 898, -1635, 260, 1296, -1967, -660, 3068, 450, -3552, -221, 3040, -250, -1234, 1521, 180, -2598, 1165, 3472, -1829, -3902, 1427, 2194, -1539, -635, 1451, -1685, -1930, 2820, 2622, -3568, -2229, 3410, 1570, -1203, 610, 1093, -2614, -153, 4390, 217, -4773, -583, 3293, -448, -1731, 1533, -916]
1953i16k367N231K435o783j887O369Q31m416J174K257m056q1O525j652p147J770
1969b713O338k417l573K932k60m272L855O004o003n271N457M019m718n60L376
1984B194l338k370O432K030p832j759P270K39n134K092J851m938Q84P395k511
1999B505q217L531O382l103k930L385j077m700N256N274o965n628O398L955m914
2014h48n14L066l890j733P035J785q473j357P761J37m738K281J012m845J611P567
2030E857k937q652L695O180l219k844L477j909m362N628N214p353m652O639L271
2045D033n055L18K949m260j320P287P25q388m41P049m14m226K246O50n112K350
2061a609P055l778p479L754N702l184k061L149j919l616N298M322o803l745O006
$$ y = [-916, -3283, 1948, 4383, -2400, -4287, 2082, 2913, -1503, -329, 1928, -2128, -2209, 4316, 2664, -4483, -2713, 3625, 1208, -2365, 567, 307, -3965, -110, 5894, -109, -5380, 77, 4096, -622, -1182, 2194, -1144, -3514, 2918, 4948, -2884, -4643, 2627, 2866, -2268, -176, 1675, -3263, -2379, 5016, 2505, -5712, -2181, 4201, 1098, -1832, 1553, 476, -4224, 1032, 6306, -659, -6287, 111, 4066, -848, -1362, 1704, -2186, -3919, 3116, 4901, -3572, -4929, 2832, 2969, -1769, 512, 1524, -3321, -1710, 5857, 2920, -5732, -2037, 4143, 924, -1920, 1557, -352, -4714, 914, 6128, -1225, -5877, 762, 4033, -1022, -704, 2245, -2015, -3335, 3952, 4677, -3711, -4152, 2897, 2483, -1743, 503, 1153, -3959, -1609, 5446, 1668, -5811, -2057, 3645, 461, -1600, 1549, -370, -3986, 1312, 5634, -1169, -4914, 1092]
2076A092K279m457P65K317m365j038O863J60p768Q05N968j262k924K673K1m515
2092c386K777N450l694n666L749L983l253p94K400k300k622M733K840n777k712
2107d272N291J415l478R55J580l576q9N330l95n562N49M831j457k405K311m35
2123E93l590K573M110l297m325L355K682k469n46K217j785k088L962K024m430
2138a014j719M026M06k785J410J136k926j28M146j119l659Q04L216j379j390J889
2154I14q43k149J969K729k481k410K281J763j890k88J641j451j562K667J075l035
2170a070r13K802J80j944R53P23j834K25K569n45k716J159J793q29j119J169j06
2187D97j681J121J956j973j756J794Q96j509nJ174p61j029J612O14j683jJ585
$$ y = [1092, 3371, -1086, -321, 1996, -2369, -3407, 3456, 3616, -4152, -3347, 2621, 1359, -1565, 1108, 1129, -3386, -609, 4841, 1147, -4519, -770, 3213, -40, -834, 1566, -734, -3356, 1377, 4217, -1560, -4272, 1019, 2434, -1044, -89, 1491, -2085, -2174, 3156, 2761, -2801, -2252, 2579, 1122, -1283, 1028, 593, -2997, -424, 3686, 389, -3936, -581, 2101, -368, -914, 1303, -482, -2570, 1392, 3416, -1014, -2733, 1293, 1699, -1086, 324, 1460, -1466, -1594, 2552, 1433, -2226, -1422, 1794, 415, -975, 914, 71, -2078, -109, 2620, 139, -2271, 10, 1773, -117, -405, 1236, -215, -1777, 890, 1965, -1070, -1983, 819, 999, -945, 8, 731, -1103, -878, 1691, 1146, -1570, -411, 1382, 553, -566, 603, 497, -1184, -63, 1893, -80, -1836, -42, 854, -655, -660, 514, -247, -1276, 336, 950, -733, -734, 851]
2204H51k70j019P05L15r19J33J177p22j250M15J153q14l84J006j62j177J079N77
2222F94j060k56P61O52j032J56N30k65m07M96N22j012k97Q14m5p37L86M00n28
2241b28j37P77j57q77M19N88l66k22K80L46m57J46L74n04k3L01K19r08K77K05
2261E3j48m85M23K02n98L59M22j07k41J80K40k38q4J45M49j023N73K22k56k08
$$ y = [851, 581, -438, 267, 582, -337, -204, 973, 251, -999, -584, 569, -245, -629, 377, 215, -962, 117, 694, -366, -622, 139, 791, -241, -85, 445, 180, -227, 269, 791, -221, -518, 296, 251, -486, -100, 300, -228, -365, 412, 255, -622, -203, 385, 19, -203, 77, 423, -34, 112, 486, -18, -41, 260, 479, -429, -152, 53, -95, -580, -157, 45, -553, -194, 228, 121, -120, 60, 300, 62, -22, 123, 572, -451, 122, 344, 88, -120]
$$ [...]
8191c34
##END NTUPLES=NMR FID
##END=
