##TITLE=1H_Pr Q-5_2
 200.13MHz, CDCl3,
 8 sc
 
 5.2.2025
##JCAMPDX= 6.0         $$ Bruker NMR JCAMP-DX V2.0
##DATA TYPE= NMR FID
##DATA CLASS= NTUPLES
##ORIGIN= UXNMR, Bruker Analytische Messtechnik GmbH
##OWNER= pz
$$ XWIN-NMR		Version 3.5
$$ Wed Feb  5 16:42:20 2025 Russian Standard Time (UT+4h)  she@DPX200
##.OBSERVE FREQUENCY= 200.1313
##.OBSERVE NUCLEUS= ^1H
##.DELAY= (6, 6)
##.ACQUISITION MODE= SIMULTANEOUS
##.ACQUISITION SCHEME= undefined
##.AVERAGES= 8
##.DIGITISER RES= 18
##SPECTROMETER/DATA SYSTEM= spect
##.PULSE SEQUENCE= zg30
##.SOLVENT NAME= D2O
##.SHIFT REFERENCE= (INTERNAL, D2O, 0, 14.3821)
##AUDIT TRAIL= $$ (NUMBER, WHEN, WHO, WHERE, WHAT)
$$ ##TITLE= Audit trail, XWIN-NMR		Version 3.5
$$ ##JCAMPDX= 5.01
$$ ##ORIGIN= Bruker BioSpin GmbH
$$ ##OWNER= she
$$ F:/spectra/data/she/nmr/H-C/1/audita.txt
$$ ##AUDIT TRAIL=  $$ (NUMBER, WHEN, WHO, WHERE, WHAT)
(   1,<2025-02-05 16:41:20.06 +0400>,<she>,<DPX200>,
      <created by zg, POWCHK disabled, PULCHK disabled
       configuration hash MD5:
       00 E9 B6 7A A2 85 ED C7 34 08 36 98 17 FE 4E 26
       data hash MD5: 16K
       89 85 15 BF 71 64 5B EF 7B 34 19 F7 87 DF D1 BE>)
$$ ##END=
$$ 
$$ hash MD5
$$ B3 77 49 72 4E 08 93 4B 1E 97 9C FB BA 57 84 0D
##$RELAX= 
##$RELAX= 
##$RELAX= 
##$RELAX= 
##$RELAX= 
##$RELAX= 
$$ Bruker specific parameters
$$ --------------------------
##$DU= <F:/spectra>
##$EXPNO= 1
##$NAME= <H-C>
##$PROCNO= 1
##$TYPE= <nmr>
##$USER= <she>
##$AMP= (0..31)
100 100 100 100 100 100 100 100 100 100 100 100 100 100 100 100 100 100 
100 100 100 100 100 100 100 100 100 100 100 100 100 100 
##$AQSEQ= 0
##$AQ_mod= 1
##$AUNM= <au_zg>
##$AUTOPOS= <>
##$BF1= 200.13
##$BF2= 200.13
##$BF3= 200.13
##$BF4= 200.13
##$BF5= 200.13
##$BF6= 200.13
##$BF7= 200.13
##$BF8= 200.13
##$BYTORDA= 1
##$CFDGTYP= 0
##$CFRGTYP= 5
##$CHEMSTR= <none>
##$CNST= (0..31)
1 1 145 1 1 1 1 1 1 1 1 1 1 1 1 1 1 1 1 1 1 1 1 1 1 1 1 1 1 1 1 1 
##$CPDPRG= <>
##$CPDPRG1= <>
##$CPDPRG2= <>
##$CPDPRG3= <>
##$CPDPRG4= <mlev>
##$CPDPRG5= <mlev>
##$CPDPRG6= <mlev>
##$CPDPRG7= <mlev>
##$CPDPRG8= <mlev>
##$CPDPRGB= <>
##$CPDPRGT= <>
##$D= (0..31)
0 0.7 0 0 0 0 0 0 0 0 0 0.03 0 0 0 0 0 0 0 0 0 0 0 0 0 0 0 0 0 0 0 0 
##$DATE= 1738759279
##$DBL= (0..7)
120 120 120 120 120 120 120 120 
##$DBP= (0..7)
150 150 150 150 150 150 150 150 
##$DBP07= 0
##$DBPNAM0= <>
##$DBPNAM1= <>
##$DBPNAM2= <>
##$DBPNAM3= <>
##$DBPNAM4= <>
##$DBPNAM5= <>
##$DBPNAM6= <>
##$DBPNAM7= <>
##$DBPOAL= (0..7)
0.5 0.5 0.5 0.5 0.5 0.5 0.5 0.5 
##$DBPOFFS= (0..7)
0 0 0 0 0 0 0 0 
##$DE= 6
##$DECBNUC= <off>
##$DECIM= 32
##$DECNUC= <off>
##$DECSTAT= 4
##$DIGMOD= 1
##$DIGTYP= 9
##$DL= (0..7)
0 120 120 120 120 120 120 120 
##$DP= (0..7)
150 150 150 150 150 150 150 150 
##$DP07= 0
##$DPNAME0= <>
##$DPNAME1= <>
##$DPNAME2= <>
##$DPNAME3= <>
##$DPNAME4= <>
##$DPNAME5= <>
##$DPNAME6= <>
##$DPNAME7= <>
##$DPOAL= (0..7)
0.5 0.5 0.5 0.5 0.5 0.5 0.5 0.5 
##$DPOFFS= (0..7)
0 0 0 0 0 0 0 0 
##$DQDMODE= 0
##$DR= 18
##$DS= 0
##$DSLIST= <SSSSSSSSSSSSSSS>
##$DSPFIRM= 0
$$ [...]
##$SUBNAM0= <"">
##$SUBNAM1= <"">
##$SUBNAM2= <"">
##$SUBNAM3= <"">
##$SUBNAM4= <"">
##$SUBNAM5= <"">
##$SUBNAM6= <"">
##$SUBNAM7= <"">
##$SUBNAM8= <"">
##$SUBNAM9= <"">
##$SW= 18.0517328524113
##$SWIBOX= (0..15)
0 0 2 0 0 0 0 0 0 0 0 0 0 0 0 0 
##$SW_h= 3612.71676300578
##$TD= 16384
##$TD0= 1
##$TE= 0
##$TE2= 300
##$TE3= 300
##$TEG= 300
##$TL= (0..7)
0 120 120 120 120 120 120 120 
##$TP= (0..7)
150 150 150 150 150 150 150 150 
##$TP07= 0
##$TPNAME0= <>
##$TPNAME1= <>
##$TPNAME2= <>
##$TPNAME3= <>
##$TPNAME4= <>
##$TPNAME5= <>
##$TPNAME6= <>
##$TPNAME7= <>
##$TPOAL= (0..7)
0.5 0.5 0.5 0.5 0.5 0.5 0.5 0.5 
##$TPOFFS= (0..7)
0 0 0 0 0 0 0 0 
##$TUNHIN= 0
##$TUNHOUT= 0
##$TUNXOUT= 0
##$USERA1= <user>
##$USERA2= <user>
##$USERA3= <user>
##$USERA4= <user>
##$USERA5= <user>
##$V9= 5
##$VALIST= <valist>
##$VCLIST= <CCCCCCCCCCCCCCC>
##$VD= 0
##$VDLIST= <DDDDDDDDDDDDDDD>
##$VPLIST= <PPPPPPPPPPPPPPP>
##$VTLIST= <TTTTTTTTTTTTTTT>
##$WBST= 1024
##$WBSW= 4
##$XGAIN= (0..3)
0 0 0 0 
##$XL= 0
##$YL= 0
##$YMAX_a= 168695
##$YMIN_a= -182837
##$ZGOPTNS= <>
##$ZL1= 120
##$ZL2= 120
##$ZL3= 120
##$ZL4= 120
##$ABSF1= 10
##$ABSF2= 0
##$ABSG= 5
##$ABSL= 3
##$ALPHA= 0
##$AQORDER= 0
##$ASSFAC= 0
##$ASSFACI= 0
##$ASSFACX= 0
##$ASSWID= 0
##$AUNMP= <proc_1d>
##$AZFE= 0.1
##$AZFW= 0.1
##$BCFW= 1
##$BC_mod= 2
##$BYTORDP= 1
##$COROFFS= 0
##$CY= -3
##$DATMOD= 1
##$DC= 2
##$DFILT= <>
##$DTYPP= 0
##$F1P= 0
##$F2P= 0
##$FCOR= 0.5
##$FTSIZE= 0
##$FT_mod= 4
##$GAMMA= 1
##$GB= 0.15
##$INTBC= 1
##$INTSCL= 1
##$ISEN= 128
##$LB= 0.25
##$LEV0= 0
##$LPBIN= 0
##$MAXI= 10000
##$MC2= 0
##$MEAN= 0
##$ME_mod= 0
##$MI= 1.114404
##$NCOEF= 0
##$NC_proc= 0
##$NLEV= 6
##$NOISF1= 3.799351
##$NOISF2= 2.8
##$NSP= 1
##$NTH_PI= 0
##$NZP= 0
##$OFFSET= 14.38212
##$PC= 1
##$PHC0= -103.1898
##$PHC1= 4.792209
##$PH_mod= 1
##$PKNL= yes
##$PPARMOD= 0
##$PSCAL= 0
##$PSIGN= 0
##$REVERSE= no
##$SF= 200.129724274929
##$SI= 16384
##$SIGF1= 3
##$SIGF2= 2
##$SINO= 400
##$SIOLD= 16384
##$SREGLST= <1H.CDCl3>
##$SSB= 0
##$STSI= 0
##$STSR= 0
##$SW_p= 3205.1282051282
##$SYMM= 0
##$S_DEV= 0
##$TDeff= 0
##$TDoff= 0
##$TI= <>
##$TILT= no
##$TM1= 0
##$TM2= 0
##$TOPLEV= 0
##$USERP1= <user>
##$USERP2= <user>
##$USERP3= <user>
##$USERP4= <user>
##$USERP5= <user>
##$WDW= 1
##$XDIM= 8192
##$YMAX_p= 0
##$YMIN_p= 0
$$ End of Bruker specific parameters
$$ ---------------------------------
##NTUPLES= NMR FID
##VAR_NAME=  TIME,          FID/REAL,        FID/IMAG
##SYMBOL=    X,             R,               I
##VAR_TYPE=  INDEPENDENT,   DEPENDENT,       DEPENDENT
##VAR_FORM=  AFFN,          ASDF,            ASDF
##VAR_DIM=   8192,          8192,            8192
##UNITS=     SECONDS,       ARBITRARY UNITS, ARBITRARY UNITS
##FACTOR=    0.0002768,     1,               1
##FIRST=     0,             0,               0
##LAST=      2.2672688,     0,               0
##MIN=       0,             -182837,         0
##MAX=       2.2672688,     168695,          0
$$ Real data points
##PAGE= N=1
##DATA TABLE= (X++(R..R)), XYDATA
0@%%%%%%%%%%%%%%%%%%%jNj2J6j6J6j6J6j9K6l1L2l5M2m8N2n9O7p3Q1r1J01j13
42f0J24j35J51j68J85k02K20k42K67k95L25l59M00m45M95n54O25p11Q15r46J120
63F10j356J694k217L109m909R823m7403j42188J46916J70830p4991j32934K7059
76d5957Q0813Q96k9640r380k3758p811N4848M2771n5454p2271L2878Q0337j2081
89C6191p7144n727O4848K1189l5403j9399O066l96R710K4057r632l7056O032M0953
103B4289j034l8726o079K5440M866j0673N024L130j7191n077K2720R873k2443
116e881j3075K2069J8881j7319k0996J0810J6492r438r239J5034N548k3050n922
129a6086K7947N822l4583r787L7182J7962k9986k2131J8641J9265j0044j2326
$$ y = [0, 0, 0, 0, 0, 0, 0, 0, 0, 0, 0, 0, 0, 0, 0, 0, 0, 0, 0, 0, -1, 4, -8, 8, -8, 8, -8, 8, -11, 15, -16, 16, -19, 23, -25, 27, -32, 35, -38, 43, -48, 53, -60, 64, -71, 80, -88, 97, -105, 115, -127, 140, -155, 170, -189, 211, -234, 261, -293, 332, -379, 436, -510, 610, -746, 948, -1269, 1840, -3069, 6754, -40649, -182837, -35921, 134909, 59918, -73016, -45957, 34856, 35752, 6112, -3268, -27026, -34837, 20011, 62782, 7328, -64943, -32065, 48272, 36191, -40953, -46680, 18168, 39357, 3954, -15445, -9379, -9775, -65, 23992, 14360, -22696, -16664, 24289, 23255, -15471, -21550, 3890, 8756, -1917, 3107, 6237, -10954, -16031, 6689, 16562, -5881, -18956, 3113, 21994, 4675, -16321, -5511, 10981, 1543, -7696, 7338, 12886, -10164, -16086, 11861, 17683, -16900, -26687, 10495, 28457, -1529, -23660, -5019, 14246, 4202, -8124]
141h124N475P866j364j006J055m980o816N315J0533l555j1280K294J1436l246
155C603j2306J709J0720j073n727M318M198p299l326P442K921p486r68P703J005
170E434p236j870M634l94m808R55O956N51p325j668O508M77n980Q31Q082j002
186D145p265L140O512o451q165P374R689p302r185O526Q222p093r597M649Q968
201D167l13o185m73M375M84k769k92R36J47J982L018l053o056J389O918j898p912
218e535J721Q697o58p914j085M401J003j427J286O46j817N58L017o61n144m03
234c315N791K750m233l957K135K926k055k598P35J693N8P30R46k556k699K978
250f71M213k268l912K366M752j610m929k5K916K49j531K50P41j031r65J004N22
$$ y = [-8124, -2649, 5217, 3853, 2847, 3902, -1078, -7894, -2579, 7954, 4399, -6881, -4587, 6849, 3603, -8703, -6994, 3726, 2653, -3074, 1244, 5442, -1857, -5183, 2259, 5180, -2306, -3274, 4429, 5434, -1802, -3672, 962, 568, -4240, -3285, 3671, 4222, -3103, -4771, 1737, 2214, -3766, -2935, 5147, 4145, -3120, 20, 6532, 81, -8084, -710, 8979, 1677, -7508, -982, 7240, 147, -9450, -4801, 4167, 3854, -2331, -2804, 1571, 2055, -714, -1006, -70, 77, 2059, 5077, 2024, -4032, -2643, 4275, 2377, -5535, -3814, 4883, 4225, -3689, -4774, -373, 630, -797, 489, 1135, -682, -124, 2893, 2232, -2912, -3315, 2476, 5226, 993, -2964, -829, 2097, 42, -2556, -1821, -128, -70, 660, 1606, -950, -3649, -671, 3542, 1274, -2638, -272, 4480, 2870, -2059, -2084, 832, 1081, -450, -200, 541, -490, -1455, -451, 71]
267G1j645p2K321J397j880j106J104N57j006J49K050m72j905M99J651j787k609
284b683R21K959r3k506j50K028j19j464j05J392M20L23J49K2j184l71J361J00
302A000j445k29J445M86j778j378J043P17o04k6J404k70q07J27P78l95p82J079
320C65J303n97r99j73O91k55j446M93J045k31o15j43Q5l25P0L94K87j94O03L78
340G36Nq15j24Q09M8n69q7O11K17j043n79l9L96K37r1J04J88n28K52M64k51k09
362b68P71P09k45o95n8L18l04k77L23p7n05QJ53l19k50l33O70N65j64j63R0K13
384A62K41k85R0L42j14M10n4o36o02J55J09j05j13K0N04j52l22j74mL91J2O13
406D88K41k10l70o8J18J42l4k46j17J37K35o53o77K10K02P66p3n55j41P65J43
$$ y = [71, -1574, -1646, 675, 2072, 192, -914, 190, 747, -259, -110, 1940, 1468, -437, 62, 1713, -74, -2683, -1762, 1197, 1104, -1402, -1552, 476, 357, -1107, -1212, 180, 600, 923, 1072, 1094, -90, -461, 900, 1000, -445, -674, 771, 1257, -521, -1899, -856, -139, -743, -769, 635, 365, -442, -315, 463, 68, -714, 365, 1668, 1071, 72, -101, 590, 335, -1111, -618, 427, 196, -419, -562, -477, -802, -732, -338, -51, -245, 358, 736, 741, -74, -198, 611, 659, 90, 3, 614, 831, -212, -791, -830, -434, -197, -288, -184, 4, -524, -272, 192, -59, -268, 503, 1212, 967, 272, 214, 532, 228, -49, 274, 197, -308, -300, -147, -466, -716, -1049, -379, 186, 22, -141, -51, 162, 403, 118, 208, 550, 436, 846, 792, 156, -446, -291, -182, -287, -400, -380, 124, -28, -350, -524, -528, -137, -125, 488, 729, 519, 149, 81, 199, 341, 307, 61, -56, 81, 316, -337, -1014, -804, -602, 164, 91, -464, -605, 160, 303]
427C03N3l49K12J58K55N40o78p66M8R70m39r15M3N21J28l52q19P6Q59M92k96k31
449a87P12j10pj55K01l73M5M33J08o79k23M45l87r09M01P73P5m66n15K10R33K26
471E51r01j25J082Q45q90r72M22Q21l58o31j90L36K26J40n11j086M06P01K33L06
491D05p47p62P36J439J07j855Q4J382M07o75q06m4P5J22q4l20L57J50o45J63O08
512I7k41n60L32J112r7q02K57M22P0m97o6k28L01M05k8n02q41p1N95J135j66j684
534a057n64J753J514j180j717N35J609J56o23o15l7P95J59n94o91L15L66N3J8
553A95p42q26P00J585k55j774k82J785J015p59j175J10J024P53q23r22L43M50
571D02m77j94K49o8m32p1O64k66m85K95N28J36j48m6K33L67l37l35jL14O1m61
$$ y = [303, 356, 7, 219, 377, 632, 1172, 494, -272, -224, 746, 307, -608, -565, -44, 84, -268, -1087, -1011, -152, 340, 44, -187, 525, 415, 408, 253, 454, 81, 126, 559, 667, -12, -235, 210, -177, -1086, -685, 88, 163, -303, -818, -608, 325, 551, -350, -475, 607, 1452, 562, -410, 12, 833, 475, -156, -346, -10, 216, 356, -155, -1241, -835, -134, 99, 405, -342, -1104, -368, 1071, 1178, -677, -593, 789, 1196, 521, -285, -329, -254, -132, -216, -536, -179, -29, -674, -511, 97, -144, -704, -372, 740, 643, -159, 98, 520, 590, 93, 27, -201, 100, 505, 477, -25, -866, -937, -342, 793, 627, -1057, -1621, 132, 1646, 466, -1251, -716, 893, 1049, 426, -189, -226, 569, 728, 134, -557, -242, 124, 177, 195, -547, -1373, -673, 912, 657, -1117, -1399, 386, 1401, 642, -533, -423, 601, 1354, 531, -391, -48, 402, -75, -269, -20, -88, -520, -591, 73, -193, -678, -383, 145, 281, 133, 87, 320, 687, 350, 15, 14, 328, 389, -72]
593g2L91L05j214o52J323O18j137p73O78J060k16j18k91O3K99L63j35k19J97l19
613A51l11K01k4k51NL85j94n09J79M53r0j94J43k82M96M95k62q62M14O23r5m95
635b4M04n6o88k47P16K59n62k37q9J61M32K01m72q6J21M89J44J12n43j33N38K99
657G39p71l03M14M66q20l60L13L00j49l8j92M0L68M69m03n05J00N29L04o1k52
678A88k66J01J76r2j31j52R7n6k7j50k49L20L17J70n81L0P09J20n96J06O3L8K84
701D19l61J48l17l5l8Q7r2j01j64R6P4J48M5J17k43L54r0J97n3j73L66k5k58k52
725a51L02N6l43K1m5J86l91K08K6j07K65M2K1l9O8J25J59j61J56j14O3k78J9j20
749c2J45j26k64k47L25j6o3J19J16j68mJ55K93n8J95J23m07O0J1J35k35k22K6
$$ y = [-72, 319, 624, -590, -1242, 81, 699, -438, -1211, -533, 527, 311, 193, -98, -35, 264, 627, 492, 273, 470, 151, -160, 41, 17, -234, -229, 156, -38, -547, -368, 85, -5, -199, -56, -338, 158, 653, 391, -471, -57, 566, 471, -24, 380, 324, -364, -611, 105, 364, -198, -435, -524, -363, 69, 270, -202, -288, -167, 322, 466, 578, 35, -98, 440, 739, -32, -335, 79, 545, -275, -635, -322, -22, -171, -209, -401, -361, 7, 476, 73, -432, -332, 197, 501, 440, 188, -78, 23, 199, 107, -24, -176, -79, -135, -162, -312, -561, -241, 76, 246, -335, -305, 404, 524, -72, 34, 97, 135, 419, 58, 206, -111, -146, -184, -97, -189, -290, -454, -358, -284, -136, -91, 26, -217, 137, 47, 244, 191, 18, 384, 359, 101, -151, 151, 207, -136, -115, -160, 26, -365, -157, -131, -238, 27, 69, 90, 51, 119, 244, 403, 242, 398, 284, 347, 69, 88, -32, 113, -13, -277, -524, -199, -215, -278, -159, -43, -211, -215, -60, 233, 175, 370, 493, 86, 146, 157, 292, 57, -165, -139]
772a39O7j58J79j24j74K18J44j96O6k0J41L7K77j31m14N64j4j13j63P7o9L3j76
795h8k65j01L91ol3j06j2K76j17N0J90l1o7J46p4k90L53j12L9p9j69o7M8K37l41
820b28Q2J01j28j53N7l1M2L59m8N2J7j0M67m34k28J99nl57J32K9j9k28J54N0k7
845a55Lj09J38Q0K78k89J73k8m3J55L7k00j1L2j30J75p1r2j89K54k49J30RJ90
869H8k11Q6J38J8Q0p9q7pM27k67J63l67K9p9K23m30O1Q3P4k5k27L6J36J07K9K1
895B0n4N2k8K20j8Mj67J44q2j6k59N8j37K74j37J23l4j74P2J39k5n8R2K7L08k75
921F9J03k54L52k07Q9k25q3K33k60k6K30k84R1l0L55l83L6L13M0m8j94L49p2p1
945A23J16l51N1J98q7j47j97K62l8q8q3P1Q4N7R4r6K22J5o4M7j38K29o3j42J11
$$ y = [-139, -72, -230, -51, -175, -349, -131, 13, -183, -117, -137, 4, 41, 318, 187, -227, 337, 323, 210, 47, 124, 55, 88, -88, -353, -454, -63, -69, -102, -208, -220, 56, -61, -11, 179, 148, 81, 227, 153, -137, 216, 104, 143, 64, -105, -172, -124, 113, -228, -146, -45, -173, -326, -269, -300, -258, 101, 53, 105, 122, 112, 579, 145, -83, 116, 111, -246, -114, -85, -104, -332, -178, -128, -155, -152, -261, -123, -43, 235, -54, 119, 91, 48, 203, 240, 40, 29, 61, -69, 106, 35, -57, -246, 8, -241, -111, -102, 88, -123, -37, 101, 119, 199, 120, 33, 26, 453, 186, 349, -18, 11, -68, 155, -275, -214, -131, -57, -82, -309, -273, -137, -30, -1, 20, -34, 18, -10, 210, 192, 196, 29, 173, 91, 75, -184, -126, -263, 11, -126, -3, -37, -211, -139, 0, -25, -83, 9, 36, 344, 69, 172, -82, 270, 63, 152, -73, -156, 77, -183, -209, 21, -263, -172, -202, 153, -230, -194, 119, 159, 111, -83, 266, 194, 123, 239, -112, -61, 137, 50, -97, -294, -32, -70, -158, -241, -170, -86, -29, 65, -31, 191, 206, 142, 189, 51, 280, 217, 75, 186]
970A86n6k47R2J51j26l4j39K11j81l6J12j82K42m5L6j44L16j87k1L78j62j61j14
993a11J7J45j3N3l53J37r8L19k83k11L83J61r8n1L41k46m2J82o4l65K92m8k53
1016b06M92k31j47R5J02k34l66M03K49n0l10K05K31k27P7M08l22j81J6L7L5j53
1038g7J19l83J68P6j7J5K49O7k95j32L19p1k52N00J6m17O0L46j81j67O6O9j38
1061f0L02n7m20j96K47J04J3K30l2k24j57M61j03k3o3j80L32j2K8m94J75J77l07
1084b59J00J06J17j79k73M15Lk75L23r0p9n1K63J02l04N1%J33l6N1j87MJ99k3
1108A11l43M17l6j78j18M5L2j07L17J1j89J14R0n0k49L54J89o28L39j63J09k91
1130b24J34k16ML05J17k54J9J9J68l60O06n5m76J05L28J42l40J58j98j46m5J62
$$ y = [186, 130, -117, -25, 126, 0, -34, -173, 38, -143, -179, -67, -249, -7, -52, -16, -160, 156, -31, -52, 326, 164, 3, -111, -94, 51, 38, 91, -262, -125, -223, 96, -187, -398, -15, 146, 48, -3, 338, 92, 50, 232, 168, -197, 95, 47, -206, 286, 55, -92, 3, 105, -129, -495, -92, 157, 107, -203, 2, 233, 6, 83, 491, 169, -12, 4, 41, 76, -77, 42, -341, -173, -97, -114, -99, 150, 217, -78, -210, 109, 38, -214, 286, 302, -115, -55, 291, 110, -57, 9, 78, -60, 242, 185, -235, -431, -184, -80, -67, 163, 131, -93, -250, 211, 108, 85, 22, -158, 174, 162, 190, -304, -129, 48, -259, -159, -53, 64, -115, -388, 27, 30, -245, 78, -12, -91, -142, 121, 223, -81, -30, -30, 103, 67, 118, -69, -65, 134, 111, -232, 185, 149, -29, -147, -102, -70, -177, 140, 151, -38, 76, 166, 116, -133, 221, 410, -218, 121, -42, 67, -224, -90, -306, -302, 3, 120, -134, -115, -96, 72, -288, 318, 263, -213, -108, 220, 362, 22, 180, -18, -164, -209, -47]
1152d7q8j61M42l86J45K69j81j50q7M18k96J5K75j41j07R7L4j9j19J13k27l1P1
1175a61M06k28j21o6L25j97J3K73k14k06M38j93j04K39j31j08J12J22q5k92L66
1196A88j48k76j3J69J35k37J67j78J77J64l7l9j43J5K46j48P5j18L7j05j31M9
1218a51j48N08k80k67J77Q6pJ39k2M5k73Q5K43J2p1P4q3k25O8J71p4j20j0L0m
1243i7M3N4J7j20J1K00k56n4M81m23K62P3j57j04L41j53k73J80j91P7n4K57l39
1266b25L68k48J61k52o9L06Q9n2K47l26j50K05L2n8k94K51M6j16J22o2l33K10
1288a48R8m4q9J93l4j1J44j27J47l2j95K04J53k57l7%j0L9N8J40j52q1M7j75K41
1313G2j72m7J32j24j2J68M3J2j31J61k74K69M7Jm26K14J13j76J64l23K18J50k24
$$ y = [-47, -135, -296, 146, -240, -95, 174, -7, -157, -244, 174, -122, -107, 168, 27, -80, 17, 51, 32, -87, 26, -201, -232, -161, 245, 17, -104, -170, 155, -42, -29, 244, 30, -176, 262, 69, -35, 204, 73, -35, 77, 199, 114, -178, 188, 40, -236, -249, -80, 55, -182, -15, -193, -16, 148, 111, 72, -71, -56, 190, 42, 117, -1, 36, -69, -200, -151, -299, 209, -71, -338, -161, -75, -82, 57, 35, 80, -193, -108, 135, 147, 76, 150, 67, -158, -90, 81, 7, -113, -123, -93, -97, -54, 0, 17, -103, -92, 108, -148, -202, 279, -144, 118, 191, 34, -70, 271, 118, -155, 25, -166, -89, -143, 114, -225, 143, -105, 56, -196, -265, 41, 130, 78, 325, -1, -151, 54, 86, 28, -266, -15, 31, -85, 37, -25, -358, -148, -50, -94, -183, 10, -24, -35, 109, -18, 129, 97, -98, 106, 259, 2, -35, -35, -45, -6, 52, 192, 40, -41, 6, -169, 72, -100, -147, -15, -139, -151, 17, 60, 72, -59, 102, -172, 97, 144, 145, -281, -67, 46, -130, 34, -289, -71, 79, -145]
1336a45J04R2j73J51j00K83j98J54j14j6j71L47k63j39J32p5J57q2J19k23J96
1357C6j1P3m2j21K33j89j7N8j5L3j77K31P2J49l89l9j2J09n8k71M02q5j37J2L72
1382B17N3l61K02R9J9p3j6j64m9J89k29R9Q2j04nK35j91r5K22j38J32j36l14K75
1406e1K43j06j5Mj22J1J35J01k11%K11l4k44J90l96K21j51K60j95J83k28N6L67
1429B29k53O8k0Nn9K14l51K88J72l86J91N0k01P1k5l6R1j68J62R1j96J46k24P2
1453f9O9K0J23j23p4Q7o4j4R5k04K11Q1j50j18L52k76Q0Q8p8k5j11J15J62K7j80
1478B4j3mJ17j15O3j03J53j23k14L61P7j35k13j25P4J83M1j08J79m16N16n9j55
1501EK8l5M9j70Q3o2J07r5jl0j96M10k64L3J67n0L50l91K39j24j0K1p7l1K7K30
$$ y = [-145, -41, 51, -122, 29, -71, 212, 14, 168, 54, 38, -133, 214, -49, -188, -56, -131, 26, -56, 63, -160, 36, 25, 98, 56, -65, 168, -21, -38, 20, 5, 38, -139, 92, 164, 313, -76, -115, -127, -18, -76, -347, 55, -30, -167, -155, 217, 270, -91, 111, 210, 229, 156, 140, -24, -73, 116, -113, -14, 68, -36, -41, 194, 3, -92, 130, -8, 124, -12, -326, -51, 192, 86, 71, 75, -47, -36, 99, 200, -11, -11, 200, 166, -78, 112, -284, -63, -214, 46, -149, 34, -194, -138, 229, -24, 44, 24, 29, -30, 184, -167, 121, 293, -93, 98, 148, -53, 18, -7, -43, 48, -120, 42, 133, -63, 83, -141, -69, 0, 20, 143, 20, -54, 33, -31, -45, 50, -154, 57, 138, -12, -130, 222, -54, 26, 114, 36, 11, -100, 15, 177, 204, 24, 11, 7, 124, 9, 72, -31, 122, -1, -215, 146, 223, 88, -125, -250, -176, 7, 48, -60, 119, -297, 219, 160, 5, 33, -2, 47, -123, -40, -102, 5, -90, -91, -121, -317, 93, -171, -138, 29, -21, 329, -62, 177, 53, 43, 64, -13, -44, -17, 213]
1527B13j04q1J49n1l87J49K40k94J93Q3mp9k7m8J24q0k9J81j39J01j05l32M07
1550H0j26J86l05J06Q2j7k57L65k52J95j64J41K17k16P6j93K76J1j52j23K31l62
1572b01K13P2L2k21l0J92j69m5K82k63K14l51K89m0Q7M0j82O7Q7J32k03j60J4
1595a44K33k95L05j99J11j62J41j01J74NJ41k15q2K09n0M6O1K4l11J22K43r7k26
1618f7r4j9J17K5R7r2k05M23j31J12j23J16k27P7k0J52j75k8J03j8P6n3k62K41
1642B5j85J40M9O8k45J91n2k48J83P0p5J37L3l9O3j77J31n4j38J72j08K16p6j35
1666e4p6J47j79QJ9J41K4K7K42l43J70j25n4pl4Q9P2j14O8R3k90J48k1q5J07n2
1692g9J08k2j56L04J2p9m4L9K24k00n0m3j19J90p6Mm0p3J17l5J51l9n0M3O5r6
$$ y = [213, 109, 28, 177, 126, -261, -112, 128, -166, 27, 110, 106, 27, 0, -48, 76, -4, -33, 148, 9, 110, 5, -327, 80, -46, 140, -165, -59, 23, 6, -251, 114, -138, 57, -107, 34, 251, 35, 111, -82, 194, 205, 53, -70, 161, -201, 12, 84, 116, -105, -135, 57, -112, -157, 125, -138, 76, -275, 14, -26, 61, 101, -81, -14, 73, 205, 2, -158, -144, 89, -206, 99, -100, 11, -151, -10, -111, 63, 68, 209, -6, -88, 121, 71, 117, 178, 202, -109, 13, 256, 159, -67, -161, -180, -63, -38, 59, -33, -238, 185, 54, 166, 43, 159, -68, 9, -11, 141, -34, -62, 41, 23, 99, 46, -216, 25, -160, -20, 29, 97, -148, 43, -9, -257, -74, -4, -79, 58, 91, 52, 115, -62, 69, 15, -123, 49, -59, 157, 81, -54, -130, 17, -162, -154, -135, 6, 30, 57, 299, -44, 126, 1, -53, -60, -94, -5, 67, -47, 21, 114, -176, -28, -49, -134, -27, -79, 29, 7, -149, 155, 167, 88, 44, 83, 307, 107, 57, 14, -105, 85, 9, 13, -27, -100, 17, -18, 133, 94, 44, 87, 152, 56]
1718E6O6P0k09K6L5K79n15K29j86J11j89J11k8Q4J56j30J51j23j62J82R8k07P
1741h8RO3Q3J00j02j4J54j62K8R0k41L7J32Ol77J15q2J00l5J14J08no9K7q1K3
1767f7J98L5j4K6j74l2j42K15J5k57J52J24J54l72N6K33j40j6O3n1J32j79R1p7
1791b7o4J29o7L4oJ68j84rJ9p4lnm2O1O1r3J44J11k82R2J07P3j11M5J1L1k10R5
1819Dm3j25K5j6J87j20L7J9q4k17L49k9R7L64m73M3j18M34k41%N3pj86k9l1o4
1845a71K41j8P5j12J5O5m1O8Q0k81k9J68j71Q3O1J7j00O9p2o9N9N9m3j33J11N7
1871a2J7J3J05%n4j24P2J6k15J19R4pj11J66j99k38L29J01l10Q4L5L8P9oK71k70
1897gPQ7M5JJ10k39K01j93R3r5j06J29j9n0p2l7J46O6n4M1K9j56K57r0r8K8N3
$$ y = [56, 122, 192, -17, 9, 44, 323, -192, 37, -149, -38, -227, -116, -144, -60, 96, -34, 117, -6, -168, 14, 112, -95, -88, -79, -16, 67, 167, 65, 51, 205, 43, 71, 161, -80, -43, 89, 95, -282, -167, -249, -149, -184, -70, 38, 33, -36, -9, -90, -67, 131, 166, 152, 178, 4, -28, -170, 45, 60, -197, -45, 79, 233, -139, -83, 150, 10, -6, 57, 6, 138, -41, 50, -27, -91, 38, -29, 5, -1, 167, -17, -26, -7, -81, -84, -89, -131, -70, -9, -102, 42, 153, -129, -37, 70, 143, 32, 77, 88, 119, -91, 4, -39, -164, -139, -155, 32, -88, -51, -32, -116, -333, 16, -13, 84, 448, -25, 18, -100, 334, 93, 93, 146, 139, -47, -76, -107, -171, 70, 52, 127, 15, 30, 95, 54, 122, 202, -79, -108, 60, -111, -28, 33, 50, -50, 19, -53, -122, -63, -4, -47, -180, -69, -12, 5, 18, 123, 123, 69, -55, 17, 33, -182, -63, 31, 24, -87, 79, -120, -358, -29, 72, -238, -154, -119, -81, -2, -8, 263, -7, 0, 87, 132, 133, 243, 4, 205, 12, 105, 10, -96, 33, 14, -36, -108, -145, 1, 67, 13, 54, 83, -73, 184, 94, -4, 24, 77]
1924G7j70K75j37j09R6q8oj88L01K0j14l9N8P0q4J10J03j02oP1j59N0o1L78l25
1949B1q0R7o8M6L4o8R5l08J75N0Q8r9k5j6j57M19j75p1k2kJ22r6j16R8Q2o1p4
1976a11K39J0j61R4j83Q3K35j11n4j50K31J8k18j0J40j35Q5r3J77l09K40j1N1
1999E7j62K60k02j74K66k07m6K01l1J81j78Q1q4j19L12l7l0j29J15j85r6J36K9
2022d2J4J3K15l51J41J52j18n0J25J4p1p2k28L46J18j93j54J25p2L36l71P2J26
2045G5j24J56k33L33j46k16L24l12J24M0Q6k23J44J06q4o1m44N25p0j8oQr9K27
2069A12M0l6j48J8k0J78p6P0k75J78J4K9l03J03J65q2J14k35J63k17J73k6mO9
2093Do7J2J26l21K11m3K05j96M8Q3Q1j62l6N1o5J44j01j28J4J04j94L05k24L60
$$ y = [77, -93, 182, 45, -64, 32, -56, -62, -250, 51, 71, -43, -82, -24, 46, -38, 72, 175, 73, 67, 138, -21, 29, -32, 346, 21, -59, 38, -30, 16, 50, -18, 77, -231, -56, -6, 82, -17, -42, -58, -215, 204, 29, -42, -64, -66, 56, -40, -156, -58, 24, -37, -111, 128, 138, -23, 71, -112, -29, 206, 95, 41, -109, 122, 140, -78, -88, 52, -83, 2, -91, 86, -223, 17, 6, 57, -105, 155, -47, -221, 45, -162, -208, -7, -38, 143, -35, 46, -38, -157, 155, 118, 88, -41, 74, -111, -207, -71, -42, -28, -15, 200, -151, -10, 142, 24, -26, 99, 113, 42, -30, -258, 88, 206, 13, -141, -16, -88, 248, -123, -51, 75, -49, 107, -126, 207, 61, -155, 169, -143, -19, 21, 107, -116, 28, 134, 50, -11, -455, 70, 0, -18, -24, -16, -115, 112, 152, 116, -32, -14, -34, 144, 68, 138, -137, 41, 55, 84, -219, -116, 49, -33, 81, -154, 9, -208, -35, -61, -65, 4, -63, -51, 75, -246, -35, -78, 127, -69, -21, 62, 143, -19, -55, -4, -69, 75, -26, -154, -140, -36, -230, 75, -149, 211]
2117B11j42J89j82j14Q7k6k7M8L8m1M8Q6k56j58J10K77l31K30j81j01K64q8P8
2140A9k94K55Qr1K3j3K5L6K0Or0O0MP0j20J80j16Q2j6j54J25qJ46j92P0R3q5j35
2168i2N3J82l60L18J7q0j97J91K3k29K4J35j70J11k0k08L42m3j92L52j16j1j10
2191h0P9m3p2M5K25j09Rj41N2J94l02N7K32l04L47N7j04j24K30j62k93M64k70
2214a3j59p4K81J45J56m83K08j79J14j46J94k05J82Jk16Q3K14j09J18K6j25j18
2236a05Q7M2N2r3O6J2o7q8J09J01j1p3J0p8MJ0n1N6L7j13K31nj86O5M8K1j84o4
2264a67K22k43J50L2l1l36K69J76l46J32J19J4j32J85L4R4j37O9j26J44j68L30
2286B84l37Kr8J26K8r5p4N5K63k43J48kJ78j84%J67j68j76R4O7n2J7J43O1J58
$$ y = [211, 69, 258, 76, -38, 49, 23, -4, 44, 82, 41, 89, 175, -81, -239, -129, 148, -183, 47, -134, -235, 29, -59, 19, -275, -20, -12, -103, -80, -93, -68, -32, -12, -6, -96, -36, -32, 38, -82, 98, -18, 64, 48, -106, 19, 11, 157, -35, 35, 128, 43, -92, -39, 143, -217, 101, 118, 38, -159, 32, 55, -174, -150, -15, -185, -74, -94, -302, 40, -3, -195, 157, 41, 30, -80, -1, -44, -116, -71, 154, 45, 54, -87, -35, 159, -143, -86, 146, -158, 189, 246, 142, 18, 248, 86, -207, 257, -13, -172, -246, 35, 180, 336, -147, 61, -118, -4, -150, 44, -161, 21, 22, -194, -111, 103, -6, 112, 138, 13, -105, -18, 24, 76, -17, 49, 61, -6, -94, 15, 116, 105, 32, 42, -36, -32, -22, -73, -17, 20, -93, 138, 133, -53, 12, 60, 81, -103, -167, 55, -188, -38, -6, -37, -373, -104, 72, -274, -142, -23, -9, -141, 44, 78, 172, 35, 104, -22, 122, -46, 284, -53, -51, -149, -23, 5, -90, -164, -109, 154, -89, 59, 57, 235, 51, 51, 218, 50, -126, -32, 35, -17, 0, 143, 204, 362]
2311C62m60J30j15m4N2J03k49K57k4J45j10r8K08K1j31j57q2m9L6L08J34k49j4
2334b6r1P2QpJ4o1J05j10L09j66k30P3j07L53j92J56R1j17j78K16n6j55j92J25
2358a66N8J26j28P6m5Q9J23l2J6q4J84j14k67K64J12l76J52K19j56k54M28k07
2380A8k40K20n5k4O0J53r9p6R2o7l8K54j9j54J08K13k86k58O6J61pj1l6P0M9j3
2406H1n1j73L25j99J89j48J0j35K56o3O5j02N5Mr3k99J82Jk9r6K18m6q8J30Q6
2431H0J54l10L4j65L40l9n1j54k2J3J03L9q7J57J49k94J38q8K9P5j62J81q1J46
2455A85k69P6J48L9q6o8k00R5J4k24J68L12q6j68r5L84k49k4Q9M2L9j85P3j64
2479a54N5K60k02j85K49j15R5k40M89j97l9J77k09m8Q0k21J22J1J01o3M8O9k12
$$ y = [362, -98, 32, -83, -127, -75, 28, -221, 36, 12, 157, 47, -51, 157, 178, 47, -110, -192, -241, -205, 103, 237, -12, -26, -117, -45, -37, -44, -30, -91, 14, -96, 213, 47, -183, -110, -217, 136, -56, 100, 191, 74, -104, 112, 56, -99, -291, -166, -108, 18, -110, -34, -79, 10, 133, 101, 117, 33, 217, 103, -164, 100, 212, -164, -12, 207, 51, -203, 225, 18, -222, -2, -57, -81, -21, 132, 33, -43, 49, -18, -56, 198, 179, 25, 133, 346, 60, -198, -132, 29, 22, 11, -25, 45, 94, 81, 30, -143, 182, -17, 172, 24, 34, -101, 155, 92, 157, 55, 110, 114, 21, -278, -96, -95, -124, -220, -2, -48, -136, -6, 80, 234, -76, -42, -207, 133, 94, 43, -111, -133, -120, -17, 22, -65, 92, 241, -53, 85, -3, 26, 101, -61, 120, 39, 185, -84, -8, 140, 179, 93, 25, -175, -80, -66, -290, -122, 190, 104, -64, -159, 225, -24, -48, 41, 83, 122, -63, 10, -154, -99, 161, -41, -226, 23, -92, 3, -237, 252, 55, 16, 193, -16, -64, 16, -205, -83, -72, 29, -34, 14, 83, -129]
2502a29K15q9m5OJ16l00N2N2J64j21Q3j50J48k3kJ95k19OL4l4J30j35J14M7kj71
2528e8Q1O0j23jK09J08l12k49K89J07j65j28j60M25j15j31K5k1K61j38K3r3J01
2551ek4M7j72K26j2r2R7k97P4K76Qk53K30k47O0K7n1L8R4J91M4l37R4R5J11k07
2577A5p6K58l43J78j60L86l41L11q6q6m4N0J03k06J49M6k77K99q0l05K35n9J43
2600A10j64L2L8J34l3l3Kmk25J43mJ9O2k2p9K14p1j45N9k9N5n6j17n0K70j41J28
2627I3m1n3J33j92J0O2j6j7l2J10Oj20K44r3j42r9Q3J55l16O3L08k44p2N5JJ71
2653E7n3K42j20Kj36K61m50K24N0j85O5J54N4j67j55K16o4ML4k36M3j9O2K06o0
2678B9j26Q5k2K22j70l07J57L29l48J94j01j7o1M1J16j50K17P9l68K51j61j0L47
$$ y = [-129, 86, -3, -48, -42, 74, -226, -174, -122, 42, -79, 4, -146, 2, -21, -23, 172, -47, -41, -7, -41, 89, -46, 68, 115, 113, -58, 23, 83, -40, -41, 168, 276, -36, -285, 4, 111, -54, -182, -342, 83, -32, -163, -138, -159, 102, -36, -13, -106, -5, -29, 18, -154, 72, 60, -32, 65, -232, -158, 118, 126, -127, 103, -144, -84, -57, -108, -70, 24, 215, 259, -78, 16, 111, 222, 15, -61, 197, -146, 32, -128, 258, -83, 228, 142, 56, 12, 62, 165, -41, 108, 154, -123, 176, 96, -209, 26, -33, 110, -54, -22, 16, 150, 117, 84, 86, 82, -143, 0, -4, 15, 77, 55, -24, 190, 119, -26, 33, 4, 59, 3, -114, -164, 106, -35, 93, 52, -1, 132, -60, -50, 12, -4, -21, -53, 57, 63, -57, 187, 94, -48, -147, -64, 91, -225, -162, 146, -98, -170, -115, -114, 57, 4, 246, 126, 128, -8, 253, -197, 27, 77, -108, -43, 111, 165, -2, -157, 59, -5, -1, 33, -203, -160, -179, -117, 89, 29, -97, -12, -34, 188, 18, -289, -132, 197, -151, 43, -58, -75, -136, -95, 21, -129, 88, 167, -201, 50, -111, -121, 226]
2701B26l77L90k77J06Pj39m0%j88J11L76j33L4k85K08j33R6M6K1J44j79L1k2n3
2725c0j16J19J56o4l7M8j44j4P3j39J88J4j60J06R4k68J36j80K62N1N5k97L7K39
2749A29qJ33l04Q9k9m1K3O6j1n1k17K57lj58P4J54j14K4P4m3j07j31M09k64J0
2774c9j2r9J71M1M7k27q5J46J16n2n4K62j12j35J60q1k00J43m3O8J12Q4m0j70
2798AJ80k25J12j52R0p8p1J30j31O5jJ4J93j40j8p6N2k4K37j80K9j97L09k44p7
2823b02R8K9m3K11k64J74l2K03k34N9P1k20J40o5m5J16r8M7N7j11Q3J27j65J99
2847A35j58q0j12L51k47KJ20P3o0K66j92k31o0K32O1k46J37J34N7q8n8j42K72
2870A66r1j01l3Q2k13L44r5l0j2O3j11j7lJ16p9K4K05k54n3l7K15j37n0R0l0j67
$$ y = [226, -151, 239, -38, 68, 75, -64, -104, -104, -292, -181, 195, 62, 96, -189, 19, -114, -18, 28, 49, 193, 14, 45, 23, -30, -146, -27, 129, 65, 28, 76, -68, -82, -9, -148, 40, 54, -106, 0, 94, -174, -38, -218, 44, 95, 150, -147, -110, 129, 121, 254, -50, 39, 10, -31, -8, 58, 47, -4, -221, 36, 33, -125, -51, 103, -11, 13, 87, 44, -63, -194, 215, -49, -39, -51, -150, 21, 62, 109, -118, -203, -57, 59, 7, -47, 215, 103, -32, 128, 47, -153, -10, -53, 15, 127, 211, 171, 1, 181, -44, 68, -84, 6, -72, -143, -13, -144, -79, -80, -66, 127, -13, -31, -107, -55, -79, 158, -22, 7, -190, 119, -125, -202, -104, -75, -118, 93, -171, 3, -29, 174, -60, -1, 70, -150, -10, -75, -120, -4, -102, -55, 2, -109, -26, 101, -64, 135, -23, -103, -215, 136, -111, -109, 11, 84, 24, 290, 98, -133, -193, 39, 100, -146, -9, 125, 182, 94, 36, -106, 166, 75, -26, -59, 23, -190, 154, 59, 29, 17, 80, -31, -48, -51, 65, -14, 10, 215, -39, -92, -129, 86, -51, -101, -11, -41, -208]
2896b08J52R4J14k16K02l34K75j26N0M9Op0K0r0M8o8J34j84K67p9l14j6M35k07
2920f6o7O2j54K33J06j22Oj15j1K23Rk32P7mm7J6J3M4P9j34p2J75L4n2r9J34j59
2947a23K56j31j01J74j6j07J62kk69K66j80L30j37j76Pl5l1L13r1P9k76Q1qk9
2971d4m8M4k16K72J34j15R4j59pJ6K3NJ03l04K35O4P7j46K2J0k13J97r7J81r2
2996C6j11Q6j75P0J0J89r0N4R3k28q5r3J69O9O3K42m40J73K5j1k32J06J34p1K1
3021Do2L53l71L3J01j23j15K98L2l65J46o3K54j91k2M7J17p8R5LM9j46o4K9J06
3046F7j43j56L05k04k2O2Q0J12m0J64l69M0O8O5J84k98J32k25J19R2K5k1j49K76
3070A64j85J20L8l17L25j12p9J45m9K07k95K1N1J20k18J00K4k55K28jj72K87k76
$$ y = [-208, -56, 38, 152, -64, 138, -196, 79, -47, 3, 52, 58, -12, 8, -82, -34, -102, 32, -152, 115, 36, -278, -294, 141, -66, -133, -71, -225, 8, 114, -8, -2, -117, -128, 95, 104, -128, -51, -55, -102, -86, -73, -29, 50, -84, -156, 19, 53, 1, -98, 36, -123, 133, 2, -99, 75, 59, -48, 114, 112, -157, 109, -71, 259, 122, -54, -47, -82, -113, 200, 109, 188, -88, -7, -15, -44, -92, -48, -264, 8, 142, 27, 121, -38, -45, -29, -6, -1, 102, -202, 33, 97, 174, 28, 50, 60, -153, 44, -53, 128, 36, -75, 11, -164, -94, -84, 105, 15, 69, 162, -66, -151, -244, -75, -6, 57, 299, -141, 32, 57, 46, -186, -80, 54, -17, 4, -58, 295, -76, -43, 58, -65, -180, 118, 150, -215, -69, -132, 122, -69, -91, -44, 73, -5, 90, 93, 142, -4, -68, -39, 67, -76, -232, 73, -131, -153, -91, -11, 101, 61, 225, -144, -104, -36, 29, 213, -85, 47, -178, -59, 33, 58, 37, -112, 164, -21, 99, 137, -180, 145, 33, -46, 99, 50, 257, -38, -17, 34, 154, -64, 36, 60, -195, 33, 32, -140, 147, -129]
3093a29M3J82O1j78r4L40l44J43K9Q7O1q0k50J64j31K05j65K9l5R6j67M42l7j16
3117A56j78Jj39L11nK7k15oJ26j60M8J74m7j61J69j36n5N7J83l65J19K46J49m58
3141a59m3K21N9o2j40L15k40L6P2O8l03J74j37K23j81r0J55j55M87l26R8l18J67
3164g9J68O1N1j15l6j18K31o9lj19J28k3j5J78k64l8K69j98J02L0j83J25j43m
3188f4J06p6j95Q5M11j88j07M6R0m1j23J49q7n4J89l87K92j39J97k06K13l29J52
3211f6K16j59j70L13J02l27K46j08K0n8p3j8J14qMj60J74j16j23K66QJ63j91q
3235D1j27O5PK3j07J40J04j66r1M2K62k86n9J62J4j45J71M7N8j65n0%K2K5L4M8
3261F9J79k28o9J88mo3j59M2j84K11j38J1J66k3j12k6O6P5J05k28J36l7J06k06
$$ y = [-129, -86, 96, 157, -21, -115, 225, -119, 24, 53, 140, 201, 121, -129, 35, -96, 109, -56, -27, -62, 34, -133, 309, 272, 156, -22, -21, -160, 151, 146, 173, -42, -48, 78, -82, -34, 140, 93, -68, 101, -35, -90, -33, 150, -215, -96, 150, 299, -159, -202, 19, 78, 16, -124, 191, -49, -13, 59, 127, -176, -2, -139, 84, -97, -187, -32, -187, 300, -26, 72, -246, -79, 89, 150, 201, 86, 50, -68, 163, 94, 91, -28, 100, 77, 62, 240, -24, -62, 207, 9, 111, 141, -42, 83, -60, -64, 42, -34, -229, -144, 267, 79, -28, 18, 108, 67, -56, 93, 6, -48, 141, -246, 46, -93, 104, -102, 111, -218, -66, 150, -9, -179, 134, 236, -91, 155, 47, 67, 9, -64, -82, 32, 24, 28, -132, 42, -74, -197, 69, 77, 240, 49, 41, -86, -21, -14, 9, -98, 42, 146, -20, -111, -69, 193, -93, -152, 10, 24, -121, 50, 97, 155, -10, -60, -60, -38, -13, 21, 69, 248, 20, -49, 139, 135, 72, -87, -45, -229, -18, -156, -145, 21, -2, -114, -140, -74, 1, 106, -122, 14, -23, 83, -123]
3285a23J32K7O5q1l3K4j69J78J39p6j37M30j79l09K01j09J21Q2l01J49J21j99
3307d7n9O2J16j39Q1q8j58L22Q1l72K00O6K0l20K54j22q8J90k60L21m9J48J83
3330C42m12M0J8o9J4j59J63J45m2J18o9p4mL1O3k41O6J9R2m5J23K4j19j25J01
3355@nJ11k12J12j35J43p8J18j80P7m6P1L2j21L32k46R1j92J21L3N1J5r9R0n6
3380B7lK31k72J59o4j48K32j90j49L21l20K18n4k4J9P6O3j83j50j8J50M6j3J43
3404I7k71M4J20J67p5Pn2lq7k1j03K81j52MR1j0PL9j17M1j11J17k62J86M5j55
3430a73J65J05k77K28J5j11n1M7k05J77Q3Nl0M9J29l39j3K36r9j4l4K9K36n9m
3455I5O4q9j54K38n0k52K90m0j10J18j09j5j25O3Po0Q0K7l6j09J23M8l4kJ61o6
$$ y = [-123, 9, 36, 101, 20, -13, 11, -158, 20, 159, 83, -54, 376, 197, -112, 89, -20, 101, 183, -118, 31, 152, -47, -106, -44, 72, -67, 14, -74, -232, 90, 171, -201, -1, 65, 85, -235, 19, -103, -191, -1, -261, 60, 11, 159, 342, -70, -30, -12, -81, -67, -226, -63, 82, 40, 158, 89, 15, 11, 42, 105, -136, -70, -51, 41, -4, 119, 143, 24, -101, 0, -5, 106, -106, 6, -129, 14, -64, 54, -126, -49, -95, -24, 8, -113, 219, -27, 64, -128, -7, 26, 77, 92, -7, 83, 27, 24, 255, -17, 142, 78, -70, 162, -28, -177, 144, -176, 42, -12, -36, -17, 59, 122, -61, -211, -229, -79, -33, -46, 97, -174, -130, -10, 157, 82, 89, 37, 34, -53, -74, -177, 104, -48, -44, 47, 37, 44, 83, -34, 7, -104, 13, -249, -63, -18, -173, -8, 97, -180, 48, 63, -48, -99, -52, -257, -80, 3, 8, -22, 27, 156, -183, -196, 40, -59, -73, -107, -78, 158, 99, 95, 159, 70, -84, 154, 104, -148, 142, 102, -8, 110, 1, -14, -139, -76, -69, -129, -49, -22, -58, -167, -44, 4, -30, -32, 129, 63]
3481F3j9j55O5k32K97J07j05Q9p1J92l10K15k72P0LN3Q4k25L80l50q3J38MK1K98
3506B57l55J37o1r3J37J21K27m13P6k6j86J38J99j79j66K60k63j7K25Q2j44M7
3528Cm3J6J12j77K00Jj55r6K00j7j23KJ00K0L0p3J24r0J06P8o8l5q1N5n1J18k13
3555e7J75k47L57m62L43J5k65K09o7K7o5J24j54n0J77K18l37j50K84o2M6j05K
3578d4Q7m8J08j33Q4r7ko3K60j3j24j4J4j78K81R1Mo6k18m9O3J5Q7o6nj1P3m1
3606eO8p8j02J31j07Q5k4j58L03j37r6J44k42K92l06N14k1l49J61j59R5K70k67
3629A2j94J93Q0n7r7Q6Q8j48p5R6J25J93l19J34J41j30k42J81Q4j16L2k6j43m2
3653a44R1j58J50M7M7rN1j72K04j80J06j20J10p0j4J33o6j43J80Q9k31k25L90
$$ y = [63, 44, -111, -46, -278, 19, 126, 21, 110, 39, 231, -79, 136, -136, -66, -63, -10, 74, -151, 229, -121, -204, -66, -62, -41, 257, -98, 39, -22, -115, 22, 143, 370, -43, 33, 7, -179, -41, 158, -21, -187, 73, -190, -207, 18, 100, -44, 3, -40, -24, 88, -89, 111, 112, -43, -139, 61, 44, -79, -77, 23, 43, 73, 0, 124, 34, 140, 218, 150, 115, 34, 89, 38, 156, -57, 118, -129, 228, -234, 109, 124, -141, 68, 1, 28, -37, 87, -67, -117, 60, 278, -59, -209, 75, 13, 59, -46, -44, 43, -5, 103, -30, 54, -43, -45, -108, 152, 139, 15, 1, 15, -163, 118, 209, 213, 147, -71, -120, -57, -42, 45, -21, -26, -37, 36, -5, 63, -15, -117, 14, -93, -8, -32, -190, 113, -24, -120, 24, -218, 74, -232, 282, 261, -88, 73, -86, 9, 279, 12, -182, 11, 91, 34, -63, 23, 111, -37, -112, -16, 109, 302, -17, 117, 258, 128, -114, 67, 151, 35, 67, 41, -102, -144, -53, -211, -61, -14, 33, 24, 75, -97, 107, -73, 33, -87, 23, -47, -61, 72, 6, -137, 43, 132, -99, -324, 66]
3676F6P9q8l5j08J47j24J58k03K4J27j28J32J10j86K31l24M3n7K19j3M6N9r1Q3
3700A67n10M49m9M3p4n7K62l98M0L00k7j43k8O1o5O2j15L24l68K1k42K55N2L2
3724hN5r9K42k15J45J72l40K31k07J71O9k56N8j33L9K43l37P5J79m4j74J97n9
3747DkL2k45K82k2Pj61N7r6O5j8J79j93J01R6k56L55k49j09J40j49J65o2J92J45
3772B58k75kp8M4j5j41K45j39J78J7j03J85k36o7j83K98M6o2j30L14J4j15k49
3795a96J78O3r0K3J49p9J37k00L0%Kj68J65O4l65O57m06PJ81k40p6K74j42K1L7
3820B6k3q4K2K53k74J31k51K59q0M4k9j64J42O5O9k17K16Op6K1m8m9J10k8j68
3845a27L27l55J23mJ3J32K0j92n7J69r7k08J67L46j49j11q3J46j38R4M2J46m04
$$ y = [66, 145, 57, 22, -86, 61, -63, 95, -108, -84, 43, -85, 47, 157, -29, 202, -122, -79, -136, 83, 70, 116, 175, 84, 167, -343, 106, 57, 100, 26, -31, 231, -167, -127, 173, 146, 3, -25, 36, -29, 33, -82, 242, -126, -105, -347, -92, -40, -8, 47, -52, 190, -25, 120, 292, -48, 183, -24, 147, 216, -40, 18, -115, -76, 167, -170, -95, 84, 40, -134, 63, 4, 2, 34, -211, 71, 49, 56, -105, -48, -144, -79, -97, 82, -111, -10, 86, -170, 185, -64, -173, -33, -182, -17, -79, 113, 258, -17, -19, -97, -53, -68, -209, 36, -103, 75, 92, -11, 174, -62, -129, -312, -14, 32, -30, -160, 154, 168, 53, -196, -18, 45, -45, -22, 127, 48, 185, -15, 15, 15, 17, -151, 14, 78, -287, 370, -36, -29, 152, -88, -164, 110, -32, -11, 26, 3, -81, -59, 194, -80, 51, -200, 59, -21, 23, -6, -170, -28, 37, 106, -111, 105, 111, 35, 56, 8, -41, 69, 41, -127, 200, -155, -32, -36, -23, 109, 129, -63, -120, 49, -48, -256, -89, 257, 108, -3, -86, 60, -78, 16, 58, 204, -200]
3868b00K57j06kJ97o9k26L5J97j43j92L0J73N6P6j39M2Pp0P7M0k3l2j71K02l0
3893a4J43o5k12O1q7J80l4j6J07p6J75k16L2Q0l8l8j7J33M2p7q2P0k80K29j4n2
3919f6J81j69K94l42O9K04k88L8j2M0j44Q5NK38j26J7J07L0j94p6M5kO8j14K54
3944A42j10j05K35k27k18K45r4N8NJ27j38j03K73m1j58nR2p6N9J2Q6L3j37mJ32
3969H3k72M01r2k67J26J07r4k80M15J48j11m10J35K18m0j92J44K6j33P9p5L0k4
3992g8lO2q3Q6M0p9jj4J40L0p0j29O9K38j55r2p8m2J15j5k8K01j04J50m17K50
4018gO3J43m05L00J6Q8j89P6k37K97l79L87k05Pj12K54j34O6L5Kl3R1k11L9J16
4043F8j08j19L2J71J26j87l8K33l24K93j06j69L72j20k52O8J54k30L8L14r9k9
$$ y = [-200, 57, -49, -51, 146, 77, -149, -114, 83, -60, -252, -222, -49, 7, 83, -56, -14, -7, -77, 0, 40, 17, -15, -186, 16, -14, 129, 64, -148, -87, -174, 6, -28, -44, 63, -13, 162, -54, -22, 58, 20, -18, -35, 98, 140, 63, -19, 51, -229, 0, -14, -66, 115, -54, 240, -102, -33, 171, -117, -79, -91, -51, -195, -110, -105, 133, 7, 24, 131, 161, -33, -109, -64, -66, 2, -112, 142, 32, -73, 162, -65, -283, -38, -132, -74, -69, 58, -80, -183, 90, 49, -109, -114, -22, -98, -39, -27, 59, 92, -45, -49, 83, -189, 212, 120, -147, -21, 86, -8, -288, 127, 275, 164, -246, -111, 107, 67, -125, 19, 45, -88, -9, -84, -54, -78, -81, -19, -102, -16, 24, -55, -56, -70, 70, 100, 30, -99, -30, 208, 53, -39, -117, -159, -44, -59, -87, 114, 10, 160, -257, -7, 56, 199, -206, 94, 110, 198, 9, 85, -152, 145, -234, 153, -52, -45, -157, 97, -37, 29, 64, 66, 33, 124, -87, -48, 68, -40, -159, -127, 44, 170, -17, -55, 178, -146, 147, 41, -128, 244, 124, -128, -60, 94, -136, -98, 216, 117, 88]
4065H8k27K05j90Q6N0k67L33j60J62K0j21K1M4r4K60r6j49K1L3R3o8k77J05j17
4089b45L39r1q4m2J30J08%j13O1J56k50J6K3j7q1J38o0j84N9J43J02j93k1J51
4113D5Mj2P5j5n3j7j93K12p5J37k08K51o8q8j48O0J62j23K5M3M2j25JR7j82K68
4139A15J14k39J5O3j85o4L42l61K17R7p9k68P9R0j5R9O8o2N2j13K9K50m82K51
4163A3j44L0P5l9j46L21k83L4K02j94Q5R9j22J4L7J96j92N5N4q0J76j85j37lK08
4188G4j70J0kJ48l0J07q1j91J80M7k03j80M02j89J87m7jj39j70L10jj3j29j9N1
4213d9M3J3j09K30j93k11L82l11J47M3j4J28k52K51j02J36k72J62J13l30L66k52
4235h1J5J6LO1m0J19k23Q7l9q9K34j13Q6j02K31Q2k53J99q9k80pJ34kK72p9k3
$$ y = [88, -139, 66, -124, -38, 12, -255, 78, -82, 80, 100, -21, 0, 44, -50, 210, 114, -35, -14, 19, 112, 44, -233, -128, -245, 94, 3, -81, -123, 7, 115, 115, 2, 63, 219, -31, -15, 8, -9, -90, 48, -12, -196, -137, 6, 108, -85, -106, 45, 49, 37, 112, 97, 44, 27, -166, 46, -29, 108, -100, 151, 83, -5, -153, -93, 69, -54, -29, 14, 56, -69, -68, 29, -153, 115, 229, -10, 5, 68, -117, -181, 161, -200, 17, 114, 35, -233, -154, -64, -79, 20, 88, 26, 78, -35, -6, 244, -238, 13, -131, -101, -26, -65, -211, 110, -173, -139, 63, -131, -46, 53, -69, -55, -18, 178, -14, 41, 95, 15, 191, 6, -131, -134, 74, -96, -86, -88, 60, 30, 137, 56, -135, 45, 92, -111, -291, 111, -78, 109, 62, 61, -78, -248, 62, 61, 48, -81, -100, -49, -6, 7, -102, 128, -65, -276, 106, -205, -58, -15, -29, 99, -153, 98, -4, 132, -140, 22, 135, -195, 171, -81, -66, -50, -47, 14, -26, 93, -130, -43, -82, -171, 63, -50, 36, -66, 165, 247, -6, 193, 104, -176, -183, -49, -51, 221, 142, 119]
4261A19k2k42N3l7K13O6k92N1Q1K9J14p1j15QJ0J6k05J83J99j10M0j65K2J55p5
4286B5pJj79R0n8K15j00r8K06j13K1j4j35K70k34J38q3Qn9R2M6K9K3N1q1k06J10
4313d2Q6l32M34j33j21J81q0L08k74j05p8J39O8qk86L76j49m7p7K36k07K29j48
4336c0J68O4k84K57Q2l43K46p9j58J92j46k1r6Q0p2J05N2k60J00J20R5j12M2q9
4360h7K05m19J71K91j38qq6J12o7j16K20j99qJ66K0k49N9J58q8K37j41J28j79
4383a8o2kR4L6Qk32L35j98J11j40L96j85j28l9L3m7K11l60K52Qj63K15j15J4k45
4408b21L79j83k3J32o3K2Oj67P6K47k66M4J15Q8l51K37p6k05K54n8J5M1P5l53
4432b35J48P4o7K98j25N1ol2n6j68K60j83P0O6p5M6j97K7P9q4J3o0N9J94j7k84
$$ y = [119, 97, -145, -92, -129, 84, 150, -142, -91, -10, 19, 133, 62, -53, -45, -35, -19, -224, -41, 158, 48, 88, -77, -55, 100, 25, 18, 19, -160, -70, -128, 87, -13, -111, 95, -18, 3, -11, -146, 124, -110, 28, -55, -47, -106, -14, 32, 61, 84, 135, 54, -152, -42, 44, -288, 146, 13, -108, 73, -7, 301, 27, -78, -156, -17, 51, 43, -243, 133, -16, -63, -140, 96, -111, 118, -30, 138, 202, -82, 175, 257, -86, 160, 81, -77, 115, -31, -52, -148, -68, -140, -35, 17, -243, -143, -23, 72, -40, 2, -87, 118, -301, -130, 161, 23, 15, -71, 41, -26, -142, 78, -121, -129, 37, 57, -192, -133, 25, -63, 174, 33, 161, -18, -80, -82, 12, 48, 56, -176, 159, -39, 72, -68, 328, 143, 15, -24, 9, -38, 173, -187, 65, 73, -90, 125, 10, 24, -221, 158, -25, -48, 84, 21, 43, 49, -118, -42, 205, -61, -17, 98, 186, -165, 72, -4, -209, 45, -13, 2, 43, 118, -235, -87, -13, -80, 218, 93, 144, 138, 106, 50, -118, 142, -41, 29, 95, 20, 66, -131, -104, -25, -109, -96, -156, -97, 97, 80, -204]
4458b04J21L06n60M64j55j77J03K9R3K20j28k38R6O4j53J44q7J90j26l39K44P
4480h6L3o8K4L47k34j08J4J63k22K24K09k76j28j38M39k79J12q5J43k89R4PJ71
4503F7K1l4J23k96J57J18j03K2n0o5J15j27K20k10K0o6J04P7m5p4M6JJ05j85K5
4528c4j20Q5j23J97K6q5J91k36J64J12k9J5j98J12q1J4k47L13q5m9J81j4k27R8
4552b0j00K33j7j0j99O6J44l8Nl20J23K60k08J36J05j86J04p3Oj6k5%j21K25j
4577G3j42l3J20R7l00K45O5j21J7Q%K09p4l08K78k27K2j07r1O8K36m4J22%j9J26
4603B20k32J02j43K44k34p6K08j41M4l2Qj0J80j40j55R6J31j91J68o3O4N8j41
4626c5J11k02J12M1j11K8m6JJ87j36J02Qp0J35k3nk31J46j56J11J04%Q4r8q8O9
$$ y = [-204, -83, 223, -337, 127, -28, -205, -102, -73, 20, 240, 112, -126, -30, 34, -119, 25, -62, 128, 2, -337, -93, -86, -53, -121, -97, 250, 16, -92, -78, 85, -137, 87, 296, 20, -108, -246, 193, -86, 26, -59, 84, -205, -111, -104, 67, 88, 54, 177, -119, 38, 156, 53, 75, 25, -40, 75, -52, 168, -42, -22, -88, 16, 93, 48, -26, 20, 21, 126, -59, -34, -154, -69, -192, 5, 31, -54, 137, -99, 65, 177, 148, 163, -35, 77, -4, 10, -237, 76, -9, -58, 123, 109, -118, -20, -120, 113, 96, 86, -113, -47, 97, 59, 64, -256, -133, 127, -81, 55, 160, -26, 78, 5, 11, -5, -30, -30, -151, 74, 73, -69, -102, 18, 115, -185, 60, 125, 4, 21, 29, 29, 238, 164, -144, 134, -93, -71, -178, -269, -201, 35, -9, 113, 113, 94, 220, -12, 90, -53, 191, -43, -119, 89, -52, -8, -40, -32, -42, 138, -2, -157, -61, 70, -121, 47, -16, 48, 106, -35, 76, -126, -14, 27, -84, -56, -102, -101, 86, -50, 52, 60, -10, 125, 102, 97, -134, 12, -144, -33, 71, 71, 155, 57, -31, 38]
4652C8N5j63p0k5K87k10J23K8M7pMk30J72L8j72Q3KJ95k84P0N2p8P2J03j91j13
4678a74K32p3k04L09L1q6l95K74N6Q3k02J30K39k62J55k26K45K3k28K36k03k01
4700b41J86M5j14j8J22p6l5R8j49L75k04P6j34k9J65l63J37k3J43Q8k01R4j85
4723b43L10K2Q7j90J66l4o3o3L2J5q7J09k43K77l13K92K9r0j54Q0k7J17j18L9
4747e0O9n3K00k89J92j71M7L1q2j08O9m8J93oj71K87k11K12j64L7p3J83o8J04
4771A30J25m16J06q7P1J08L8j05L7j19J62k2j75N4P4o7J69r9O9p1j24L68j93k7
4795Fm9O9J06k38P7j1M0m3J2K3J04n7J22j2j96LJ3J57K5j95K91k13k4K0r7q2J7
4822a32J27N7j6k2L2nq7l4K6J84j66l0J28qJ24J2l63J36K00r7j19L5r6P2J45j48
$$ y = [38, 93, -70, -140, -165, 122, -88, 35, 63, 110, 103, 107, -123, 49, 87, -85, -2, 0, 195, -89, -19, 33, -45, 27, 130, -61, -174, 58, -15, -219, 90, 121, 35, -360, -86, -30, 53, -149, -19, 220, -42, 113, -113, 132, 155, -73, 163, -40, -241, -55, -10, -124, -142, -20, -96, -131, -33, -182, 193, -11, 65, -69, -98, 67, -296, -159, -182, -39, 49, -152, -58, -243, 67, 89, 176, -14, 152, 118, 55, -8, 24, 39, -48, 61, -182, 95, -218, 74, 103, 13, -141, -61, -88, 29, -89, -50, 19, -34, 166, -123, 69, -102, -55, -24, -106, -214, -145, -193, 0, -6, -177, 110, -101, 111, -53, -16, -89, 94, 26, 130, 255, -161, -55, -142, -71, 37, 75, -30, 7, -112, 50, 28, -147, -93, -19, -86, 83, -16, 53, -18, -142, 226, 33, 6, -43, 26, 132, -106, -29, -40, 0, -43, -31, -8, 96, 39, 161, 149, -47, -44, -31, 126, 151, -44, 247, 34, 10, 30, -67, -149, -132, -5, 52, 36, 14, 46, 41, -46, -80, -54, 130, -36, -66, 62, 54, 178, 190, -173, -37, 163, 66, -53, -18, -114, -42, 103, -45]
4848d5m6K04j28J2J29k59J60j36K84j80q8j22L80l50J59J57o3l7O9J17r9j57J06
4871F7p0p3r4J05J18o9J65j02o2J3k6j11P6J75k3j32Q3j71J41m4j06J38K46k33
4895A1j11k4J47J26J9k67j1J09j33K09O7k24j0M5j04Q2R4LPJ23j77r0k1J87J13
4920A70J7k35RK06j65k4k1P4j73K00R5j79m0J00Nj99K33P5J76n48J46K08k96L79
4944B13j31j81J43m6J80j46%N9k26K85k91J56p2M6Q2m3j87K80j10n0L2K03j43
4967E3L5j9p4J46k29J12J29j64r5M4p2nJ75j35R9q2K05k31p2J36J0J08j27K39
4991A86j85n1m6J09l8o0J77j10K5oj6Q2q3Nj1R2l1M3o5k4J53j25J56k0m1k87J22
5018d9J86o4M8n9J21j00l8o7j5R9k16J54M1pK5m2K17l89K0l7OJ04j93K94o8M9
$$ y = [-45, -91, 113, -15, -3, 126, -133, 27, -109, 175, -5, -93, -215, 165, -185, -26, 131, 68, 31, 100, 217, 118, -39, 67, -3, -76, -170, -65, 53, -16, 149, 47, -15, -2, -28, -139, -63, 112, 89, -43, 40, -131, 10, -34, -140, -2, 244, 11, -100, -124, 23, 149, 168, -99, -110, -1, -134, 75, 142, -82, -92, -47, -151, -69, 25, 28, 35, 158, -19, -109, -130, 57, 170, 187, -48, -39, 167, 2, -22, -43, 31, -142, 58, 153, -26, -66, 34, 39, -160, 73, 148, 324, -224, -78, 130, -166, 213, 82, -99, 44, -2, 178, 32, 32, 91, -135, 150, -141, 15, -57, -11, 71, 28, -159, 121, 11, -39, -7, 196, 53, 88, 69, -5, 141, -88, 24, 153, -11, -106, -62, -134, -139, 36, -99, 0, -82, 123, -108, -180, -44, -34, 74, -53, 186, 1, -50, -96, 13, -25, -85, 92, -18, 7, 1, -15, 67, -16, -11, -22, 70, 39, 82, 17, -7, 146, 21, 177, 157, 116, -171, -49, 137, 73, 121, 62, 183, 83, 45, -22, -37, 62, -154, 0, 41, 34, 59, 17, 234, -155, -135, -172, -166, -62, -255, 39, -29, 20]
5044B0j5J7k40J70j7J02o0r8R6p5O0l4J82j91q1J36J17J24k96K43j95O4r7nn1
5069a24K74l8j13j85J05J62k9jl7o7P1k0L7J96l05P3J30j79J62l07K84j99J72
5092F2m0J39l45k3J48J98o1j37J53j65j62K50L4j65Q7l5Q3k12K22NR4k8l0j2k2
5117C8k34J01k4p2K27m9J8q5L6J9NL7j69K84j48K4l0j38Qj21J71jM9J57Jj84P
5144g3J17k8jJ19j79%R5q3J36J13j61j30K04l5p3j00L88k08j95K3J91m6r2m0J90
5169A32j06r6J04j99j12L47O0n4R4L1o6l30L83k61k7L33j24p3nL0R9k07L07l07
5193d7K67j92kL7r3JR0j18Q0k31M2K18j24J72j75k4K75r0n9n1J45j64K8J37j10
5218A2P3j65j52K93k06P3k0J17J28m2l7j99J35k5r7K6k0K09J0o0j52p9L8J84J46
$$ y = [20, 5, 22, -218, -48, -65, 37, -23, -121, -25, -100, -40, -74, 108, -83, -164, -28, 89, 213, -83, 160, -35, 29, -68, -73, -124, 150, 112, -1, -186, -81, 81, 52, 51, 14, -53, 18, -2, 35, 231, -74, -1, 129, -50, 112, -195, 89, -110, 62, 22, 161, -184, -207, -59, 139, 78, -59, 94, -71, -233, 17, 51, -114, -27, -62, 21, -191, 31, 36, 130, 102, 72, 60, 38, -196, -95, -119, -191, 36, -13, 5, -80, -44, -25, -20, 17, -152, 132, -16, 8, -22, -160, -152, -273, -102, -103, -54, 103, 104, -80, -73, 44, 16, 15, 134, -45, -45, 50, -33, 103, 216, 55, -75, 129, 94, 21, -79, 309, 101, -94, -71, 120, 74, -18, -58, 132, 26, -70, 34, -165, -277, 70, 130, 76, 170, 201, 135, -195, 188, -73, -100, 233, 109, 36, 31, 61, 160, -47, 260, -47, 220, 28, 26, 63, -30, -29, 61, -57, 23, -208, -166, 52, -72, 100, -75, -99, 176, 86, 27, -24, 121, -43, -15, 122, 12, 85, -80, -232, 61, -145, -72, -92, 25, 153, 111, 74, -125, 10, -15, -112, -86, -106, 103, 113, 53, -99, -178, -140, 44, 190]
5243A90j18j13N6k2P1q0j9O9J6j48O5J95k76N2L0m3%k5P2J08k79K00q9j06K59
5268F5J9n0P8k31RK86j49l4m6k1J23m0nJ9K08m6k10L3O2k04J84k7l7o1m2L15n4
5295A44k66R0Q8j93R2L1N9K8j74J42p2o9M9J71j42P3l2j56J85N1P0k13k4R6j4
5320A4j7m1j97K37J12Nnj38Q6j66j5J10k7l4J20L1jk01J61L1l41L88l4J08j2j29
5346D5p9Q2j34J23R4k31J51j20J54k09K18o9j54J56J63l70J88K6l39K38N3Q2o0
5369Hj30NM90k71k12K25m2L1k18J64oJ48np7n7k6J15o9n9P2n5J4j12J93k76J69
5395A9%j43L60l18J7J23J62j26l3J95l8l91J08m4J37Kn6r9J20K01j10j17Q8j31
5419g4j48R6P0N0J3j18J2J07n5MJ26O0l4j96j1J88j77M4j30J36j6O2om3j9Q9J19
$$ y = [190, 72, -41, 15, -7, 64, -16, -35, 34, 50, -98, -33, 162, -114, -62, -32, -75, -75, -100, -28, 80, -199, 1, -88, -194, 65, 84, 34, 112, -119, -110, 176, 27, -7, -53, -74, 49, 9, 4, 23, 231, 185, -25, 8, 70, -134, 50, 23, -14, -75, -117, 198, 144, -122, -32, 56, -137, -45, -14, 45, 73, -101, 41, -31, -100, -51, 120, -22, 51, 19, -137, 48, 99, 169, -44, -68, 28, 14, -3, -44, -241, -4, 108, 113, 108, -30, 56, -110, -125, -15, -42, -76, 44, 75, 74, -127, 34, 65, -276, 112, 78, 186, 174, 45, -34, 48, -86, 37, 131, -100, 51, -69, 85, -124, 94, 25, -129, 27, 190, -180, 8, 34, -305, -67, -14, 68, 8, -122, -117, 373, 102, -110, 115, 73, 104, -114, 50, 44, 192, 187, 110, 53, 27, 142, 73, 14, 86, 31, 45, -67, 126, -150, 19, 19, -124, 236, -82, -65, 58, 220, 94, 61, 256, 218, -173, -65, -109, 28, 30, -26, -125, -5, 196, 86, -31, 57, -74, -222, -126, -56, -6, 7, -111, -99, 8, -47, -43, 83, 143, 109, -87, -98, 90, -87, -43, -173, -37, -53, 9, 3, -40, -59, 30, 149]
5446A49k32J52l5J68k75O4P0M6j66O7Oj33J69j17K43l15J73L9l43Q2J98P3j3j46
5470g6J54N3p9r3o4K90k4L6p9J56m14K62Jn3j21J48J8j05k78J95K78k16K0j8N7
5495D8J56l11J90O0n7n2P2k9j04j21M7r9J38K90j69R8l66k5R9J88jj1o5j3q4J5
5521a06l0L98j28l3j3j87J17NJ18j60r7J92j73J02j07Q4P4R1r5j27J65q5o9o9
5545a33L3J73l9j40O6J31L9k93J80j6L3n8q8K16L3j19j73mn0J47P2k4jJ20j15
5570a0J68n6j75J16k7j31J03N4J12j13Pj54K53l02j7L28j77J5K29k14Ok01J44
5593d2N7J03J7r3l35M12r1J00j19j0K0j52j16K09K70p0j04K11p7o6q7l5K4j3M1
5618E4Rj79J19rL8j07J40j31l2j12M35k22j44J07j5O8j57K26k51L9l4J34Q0q5
$$ y = [149, -83, 69, 34, 202, -73, -9, 61, 107, -59, 8, 14, -119, 50, -67, 176, -139, 34, 73, -270, -188, 10, 83, 70, -76, 78, 131, 52, -41, -105, 185, 161, 197, 118, 274, -140, 122, 123, 70, -51, 97, 115, 10, -268, -73, 205, -11, 9, -9, 48, 204, -107, 83, 143, 86, 34, 106, 77, -27, -148, -101, -200, -62, 228, 59, 157, -209, -234, -135, 53, 52, 41, -24, -37, -121, -106, -136, 262, 134, 101, 88, -99, 18, 23, 141, -19, -116, 76, -97, 5, -102, -18, 56, 147, 52, -75, 90, 5, -64, -133, -100, 73, 34, -106, -40, 91, 130, -163, 17, 1, 34, -24, -112, 104, 137, 18, -155, -159, -209, -62, 10, -14, -15, 105, -10, 158, 102, -73, 43, 16, -115, -12, 42, 154, 41, 48, -106, 147, -155, -172, 156, -21, -6, 223, 9, 15, -186, -42, 15, 118, 135, 42, -293, 119, 28, 128, 9, -1, 19, -133, -249, -40, 230, 160, 56, 267, 190, 124, 37, 2, 26, 13, 54, 63, -116, 3, -6, 32, -75, 65, -66, -98, -210, 225, 3, -141, -34, -49, 19, -138, 88, -163, -124, -158, -24, 56, -29]
5642b9k4J04l2q1R7L0j14K29l19j13M41l10J59J30k22j20M11k44q5K40k69K40
5664A19j27J57l48J27O5n6K04k93l6K95n0J2j16p2L56j61n3N0k42J52n6j9J05
5687A3p0l2M7P4J27k01J14o9mp5K18k21J3NQR8l7p4J79j81J87p6j70J54k42K35
5713B0m7j0L07k93J42l9k86P8J44J23j7lk2j12J06j70J41p3P7J80j60j6K0J30
5737B20j62O5k11J05k15J71m7L1J02R6r7p4j45M03k42J0L7k5R2N3k05o3P5nj96
5762b27P4L38k05R4qj26k5j2N6P3j38K53j65lL7K8o1N8M8m6L8K7j02n6J41k40
5788a49J35k1J07j46J93Lr4Q0j08K52k47k8M4J40j39k34L71o0L4k22K12j83p1
5811a31J19o7J21j92J71j29J42J24j28j9o7J97j74n2l3P4m4p5L58J15l14m2J08
$$ y = [-29, -53, 51, 19, -62, 35, 65, -49, 180, -139, -252, 189, -121, 38, 168, -54, -174, 237, -7, -92, 148, -121, 119, -8, 149, -199, -72, -7, -63, 141, -152, -188, 107, 57, 69, -47, -119, 237, 76, 23, 73, -169, -17, -73, -92, 13, -57, -89, -42, 32, 159, -42, 72, 3, -1, -76, 142, -79, -66, -61, -53, 45, 8, -66, 113, -68, 119, 43, -127, 27, -215, 20, -27, -37, 270, -23, 119, 80, -206, -128, 16, 139, 122, 119, 97, -15, 91, -79, 62, -11, 66, 246, 86, 70, 90, 220, 58, 123, -88, 17, -198, -27, -74, -43, 59, 155, 58, -16, -161, 242, 0, 10, 47, 22, 114, 167, -38, -101, -26, -31, -227, -153, 185, -20, 74, 66, -60, -85, -97, -41, 32, -106, 147, -18, -21, 16, 44, -17, 41, 89, 43, 81, 108, 6, -50, 91, -149, -14, -35, 72, -74, 119, 122, 28, 108, 0, 252, 5, -23, 21, 161, 22, -212, 159, 99, 133, -89, 123, -60, -131, -12, -79, 42, -150, 21, -108, 34, 158, 30, 11, -56, 141, -33, -85, -118, -44, -88, -163, 195, 310, -4, -46, 62]
5834F2k11J07J4kR4K19k39j8j32J87j4j00N0q4m2p6J71J92j49k9pL6k30L01j78
5859g8J98r6k6q8rL0j1P8J0k9j39L05j16j25j6n7L3O9M7Q2nl6r6l3k8K14j26P2
5887B4J24k2j43q4L14l70K94rN9r4L8R9k60M3P0j23j55K45j0J09mL0k14K54k50
5912c5J29j55o8J16J27j84l2K92k61K09k49K91j13r4P6k10J97k39J33J72rm2Q8
5935A39r0Q5j47J70l39K37R7k6l48K40j09J61N1q2K4k01q0J29J0J93j31K01k58
5958g4j52J2K09Q6k32J39J52l67K88K6pj61m7J87K47m51Q9J88L9k9l80J84K19
5981A65k28j7R6j70J15l6J38R9j38o5P4mQ8l9k2J04j65l8n6K53l41K30k65K90
6005F8K54k52j52M4m3R2j81L56j68j4J50k19J10n9q7k9K95k65J87j41M5K1O4l1
$$ y = [62, -149, -42, -28, -30, 64, 283, 44, 26, -106, 81, 67, -33, 17, -67, -109, -185, -14, 178, 29, 0, -7, 29, -201, 100, -78, 120, 24, -2, -90, -99, -69, -80, -2, 8, -21, -160, 145, 29, -96, -112, -169, -136, -67, -20, 62, 57, 21, -75, -108, -136, 78, -48, 24, 148, 126, -17, -101, 213, -157, 137, 128, 187, 93, 131, 230, -30, 13, 83, -40, -195, 50, 40, 149, 145, 175, -39, 215, -35, 94, -61, -129, -13, 114, -70, -102, 190, -71, 138, -111, 180, 67, -27, 49, -161, 36, -203, -70, 102, 93, 51, 139, 49, 134, -13, 157, -182, 55, 152, 126, -222, 18, -91, 70, 121, 39, 63, -138, -218, -89, -79, 114, -17, 184, -74, -226, -214, -5, 81, -151, -12, 140, -227, 61, 87, 80, -81, -128, 59, 306, -145, -56, 132, 171, 142, -238, -54, 165, -63, -80, 16, -154, -39, -75, 63, 162, 24, -41, 33, 29, 117, 78, 56, 160, -5, -43, -99, 154, -187, 43, -222, 68, 322, 70, -82, -38, -81, 11, -170, 186, 18, 4, 154, -65, 45, -14, -101, -130, 165, -100, 87, -54, -9, 12, 76, 45]
6029D5j08K69j78rp5K68k90M6%NP1k19R3M8J07P7o0k09j04J51K14j37j34K43M0
6054A54jj84J00j14M9L8k8j15J72n8J23k18J27r8J54j20J31Q6l08L34k77J84O1
6077A92l48J23j98J38J35J82l64J30o9m5J34K19l66R5K15m93L75q5L1k72K45K28
6099B02j31j56J81p7n9O1O8j36R6J31M9k62Kj58K88Qr5j31PK62k38J18j68K7O8
6124d3J34j21L6m6l0n1J73j75K61j21P9J8P8j54k19K54j46J57n6j6m1J52j44o5
6148h6R8r5%J44k7j82K54l6j3j13j7J56O9N8k11j99OJ27J7O0k04L70p6l30Q9K6
6174a15J85q1l6L14l59K24J0k30k72L37R4m1k28J90j8j0l3j8J20J97m18O8K55
6197A35n4j99j00K93m0P0l10J07l2J04J79j10j65K08q4R9j97Pj19J38j10J59j63
$$ y = [45, -63, 206, 28, 19, -56, 212, -78, -32, -32, -27, 44, -175, -82, -34, 73, 150, 90, -119, -223, -72, 142, 5, -129, 114, 154, 153, -31, 69, -45, 4, 42, 14, -101, 71, 13, 136, -82, 45, -53, 101, -19, 112, 198, -110, 224, -53, 131, 192, -156, -33, -231, -93, 42, 224, -140, -10, -79, -124, 10, 229, -137, -42, 173, -320, 55, -30, 1, -271, -26, 202, 71, -85, 96, 19, -40, 21, 89, -47, 49, 180, 229, -33, -31, -189, 99, 107, 12, -119, -112, 150, -88, 30, -138, -111, -43, 91, -30, 6, -40, -70, -121, 52, -123, 138, 17, 96, 114, 192, 38, -181, 73, -73, 84, 28, 12, -29, 123, -21, -86, 12, -83, -83, 61, 34, -148, 106, 70, 57, -56, -73, 83, 152, 210, -1, -200, -194, -67, -50, 10, -194, 176, 100, -230, -141, -115, 70, -11, -47, 267, -92, 132, 142, -88, -360, -23, 71, 30, -198, -8, -26, -36, -69, -87, 33, 230, -188, -120, 135, 81, -118, -218, 75, 35, 105, -205, -98, -130, -26, 153, 43, -122, 86, 2, 101, -96, -89, -208, -70, -180, -21, -184]
6220a84L94r1j7k01J07j26l0K86m3j03O0O3n8n5O6R3j05rj18M9J0N2n0j05J45
6245C0j0j21J79p8J64k07qM2J13j58N8j3k0J08r8J76l49J65P7j81K36j84M8J05
6269G4l74L04O3j17P6k45K17N1M4k25L01j25O5j8j41k5J8J89r6Nj46K14L7k27
6293h1O3pK0O3M8n0Kk02K37J14n7K7o2k69J58j02P2n7J76L6j60j45R5J21L9r2
6319a3j3n4J05j81o4qK20L9P8j08J58j51m8o4J69n7o2l8R2Lj6N6o5N1r8K00O9
6346B00k07J74j46J05j3O3k06j66K48J7q9o3l8K88j58J64k34Q1K34l76K84k25
6368f3K90k33j2R1k52K25l0j22J43P7l2j87pJ57n2lQ1j37J33k51MK60j15j2R6
6393D9Q0k44n9M42n0j90k58L78m3j19j82R1K5L7j36J28J58k1k42MqK23k6k09K33
$$ y = [-184, 210, 119, 102, -99, 8, -118, -148, 138, 95, -8, 52, 115, 57, 2, 68, 161, 56, 47, -71, -22, -12, 40, -10, -115, 30, 20, -101, 78, 0, 164, -43, -51, -9, 104, -54, 4, -9, -29, 79, -19, 157, -192, -27, 50, -131, 105, -79, -31, 74, -300, 4, 67, -50, 26, -219, -2, 49, 93, -132, 169, 44, 109, 91, -50, -75, -57, 132, 36, 41, -105, 109, 146, -81, -18, -25, -5, 58, 106, 56, 58, -144, 93, 207, 150, 177, 115, -154, 4, -98, -26, -83, 93, 129, -31, -176, -81, 40, 79, -13, -26, -80, 25, -156, -220, -228, -8, 31, 109, 1, 159, 8, -40, -104, 65, 8, -54, -92, 0, 3, -13, 43, -22, 29, -69, 131, 200, -7, 167, 21, 126, 113, 176, -30, -196, 52, 69, -20, -83, -121, 167, 9, 173, -61, 20, 254, -122, 162, -63, 227, -6, -18, 73, -179, 46, 16, -106, 37, 114, 82, -105, -112, 45, -7, -10, 71, -66, 67, -184, -180, 80, -35, -47, 49, 129, -115, -174, 268, 218, 28, -230, 148, 105, -14, -196, -105, -80, -43, -179, -51, 107, 86, -156, -152, -160, 63, 37, -172, 61]
6418F1J7J6j22R8k36L09k99L18k87K41k39J72k37L82k98o1K68p2J0RlL0k2j44
6442h9K53q6q5qK04k31mJ10J48l60j8L11j92l1J61j81j1K06j40j3L0J64j6k82
6466a60J41j39j21K27Q4j41RJ25j2L6j3j08J36l25K39J00m5o2Q6O1j16M1n5J9
6490GJ18n3k78L07j63K86k49K33k27n6j23Q5J24k2J27l12K01O9k03J60O7n4m7
6513cmQ6Q3n2k92L00p3r6j2NjL8L1M5j42J59m8j19J14oo5J12q9J21%k52J44k16
6541b32K27%m1J13j51K24j44M7l3k07J08K01r3o8K8j17K45L3j48j30l4kJ41O5
6565C2J77k79J71Om0j11R3Q9j4J44l19J18J8j90n5K15p2J66l9k48J78op7p1l1
6590a45L40k96J24j63K75n7N0j06r9L1O3p7R1J39l4j95k60L44J74Mk47N6J09j32
$$ y = [61, 78, 94, -28, 70, -166, 143, -156, 162, -125, 116, -123, 49, -188, 194, -104, -165, 103, 31, 41, 50, 47, 77, 55, -89, 164, 78, -7, -15, 189, -42, -46, 64, 212, -148, -166, 145, -47, -78, 83, -98, -109, 97, -43, -56, -26, 138, 122, -160, -19, -158, -279, -52, 32, -109, -100, 25, 13, 49, 36, -72, 64, -261, -22, 78, 33, -29, 57, 118, 2, 43, -12, 7, 125, 72, -206, 101, -62, 224, -25, 208, -19, -75, -198, -113, 11, -11, 116, -196, 5, 74, -129, 31, 98, 44, -3, -7, 79, 162, 110, -182, 118, 45, -51, -63, -58, -59, -21, 10, 55, -87, 72, 24, -95, 19, 13, -52, 60, -29, 92, 92, -160, -16, -232, -5, -5, -46, 67, -84, 140, -4, 43, 10, -197, -89, 112, 19, -49, -21, -138, 107, 140, -8, -138, -172, -174, -33, 32, 209, -70, 101, 107, 67, -44, 49, 138, 124, 268, -51, 67, 85, -105, -160, 55, -17, 149, 110, -138, 40, 34, -43, -114, -145, 195, -101, 23, -140, 135, 78, 128, 22, -77, -46, 17, -60, 31, 170, 136, -59, -319, 25, 199, 203, -44, 12, 121, -11]
6614a1o3L3J16j61L98l65j1J87j40j3L3j28K44n2r8p9P4j77K30O1N5k1k52J73
6638C3j15K62l26K15j83m7J68q6L20j53j73P2Q4J22k15J17j93R9N7j09J97j88
6660d2l1J4q6J01m1k0L60k37P3j57J20o1j37K89k82N8Q3N4j69J91k7r0r8J19j01
6685a17L2N6J31k2k47K03J20m62O4L78k71K16P7Q6k53L2L2Q6j89K1o5P7J23r7
6709A1o1j4L7n3L8J58m3K00k21M4P6l02L3L52j20j3j59l8M2J01m9K7L1k2Ok02
6735a41L41j47J1k24K23K07l99K23M5kk05J54K6k90J67R4Q0k40J41K2k41J67l6
6758b4K09l12P1M9j28MK59k31M2K08k51o7K31n8k9k1K2R7j35J6p0K11k3R3l07
6783a44L26N3k27L7J58k44P0J8j84O3q2L77k03R2k29Q6J98j34k1j94K15j2J7n4
$$ y = [-11, -74, -41, 75, -86, 312, -53, -64, 123, -17, -30, 3, -125, 119, 67, -31, -110, -36, -213, 17, 78, 133, 112, -140, 33, -82, 180, -146, 69, -114, -161, 7, -79, 241, 88, -85, -13, 71, 193, -22, 95, -98, 1, 58, -51, 146, -42, -73, -59, -145, -44, -85, -105, 255, 18, 91, -66, 54, -7, -144, 145, -137, -79, 4, 58, -111, 80, 53, -37, -135, -16, -117, -85, -29, 102, 80, -167, 36, 156, -306, -242, 136, -135, 81, 158, 244, -9, 23, 55, 141, -48, -27, -92, -15, 108, 11, -50, -64, -27, -80, -42, 116, 73, 273, 52, 96, 172, -130, -97, 255, 135, 122, -37, -75, -33, 68, 19, 46, 77, 55, 61, -141, 200, 53, 64, -160, 63, 270, -129, 94, 139, 137, -68, 86, 112, -178, -11, 83, 163, -77, 64, 86, -155, 12, -24, 185, -127, -56, -7, -135, -131, 128, -103, -61, 147, -104, -171, 60, 2, -27, -48, -26, 71, -64, -48, -118, 93, 70, 163, -144, 182, 235, 8, 45, 203, -41, 29, 47, -137, -74, -156, 221, 18, 110, -119, -33, 165, 31, 10, -184, 31, 19, 36, -18]
6807a8k77K41p9K85l15R4P7j8j03J86o1l5m9K48k64j0J94j44J53k9j91J6N1r6
6831a44K08j80m3K07j29n7O4n4K16j33n3J04MK23j27j92N0K1n1mJ9r1K54j50m1
6856g9j03J77Mr3N0P%J25j11m7P9j98k7J69j15K24o4J43j20OR7j5R0j83j36J74
6882E4J57j97j23Q8J4R3j69l0L4K30k25R0j95K30l5j51J05L6J70k8j81P1J17k13
6906e8qJ79j06j10P5j44K53J7k72L40k79J17Q0o1J32k78Q8lP7J57k37N8j26K31
6930A22k54J70k8l8K08j95N8j21J90q6j76M4K5J44R2l97J88nJ9K32j8J18o3l30
6954a01K12j08J05j52Q9j49J54j51L34l47J54j50J22k6m8J41j09J76k84L42k81
6975g7N1J45Kk29n0Q1j4J9q6P8P9%j1K5k0O4OR1j12N2j13j24k9J75Po7J33j56
$$ y = [-18, -295, -54, -133, 152, -163, -69, 8, -10, -113, 73, 12, -23, -72, 176, -88, -98, 96, -48, 105, 76, -115, -99, -48, -144, 64, -116, -159, 48, -81, -138, -74, -128, 88, -45, -98, 6, 10, 233, 106, -86, -36, -15, -66, -70, -51, -142, 112, -38, -79, -182, -5, -1, -94, -44, -37, -37, 88, -23, -70, 9, -189, -216, -47, -162, 62, -2, 141, 21, 27, 124, 109, 199, 16, -120, 54, 211, 14, -109, -21, -7, 86, -83, -113, -79, 151, -74, 16, -179, 51, 16, -135, -30, 6, 176, 148, -33, 38, 155, -58, -66, 113, 7, -103, -28, -172, 81, 98, -174, 166, -113, 4, 84, 23, 155, -123, -35, -38, 39, 196, -41, 17, -109, 122, -132, 38, 10, -28, 180, -15, 43, -78, 112, 26, -150, -106, -81, 63, 155, -242, -54, -59, -40, 192, 174, 292, 229, -101, 111, 3, 108, -44, 45, -104, 50, -101, 233, -114, 40, -110, 12, -14, -62, 79, -30, 146, -138, 204, -77, -26, 119, 121, -108, -158, -77, -91, -72, -158, -80, -1, -1, -12, 13, -7, 57, 63, 154, 42, 94, -19, -143, -172, 3, 10, -57, 76, -80]
7003h0R9J1k0L0j29M9j49J65n5J3O7P5r6j78L5J07K06k47o6L01k60L6J54r8M6
7028A6q4j72K66p4P0J59k98NK21j20j31K2P9p2n5O8J92n8k20K93Lo5m7p9j1L7
7054e5N6L6%l4j90J00R2j9kj0J76k74J81l8L5n6J48o9M5j85K7k1J68j4j47J76
7080A26l4l04p1M8K86k22J11L4J2R3p6J14k86Q3K15L9k56J39n3J5J88k13J13J4
7104A15M5k22j36K85j29K73j04j93R7r5k0j2L5P7j35Q4R4j7j87K03p5r4J05O6
7128F0j30J11q4l8K24M3k26j7J83kj38P9q6J35o6k50N0J41P0j28q1O2JJ99om6
7154F0m8K18k24J02p0L5p3j21K26O5l25J38M6J56k86J30k9q2pJ89j06j44J76O8
7178I4rr6J31jj82R1L1j36J82k15K16j31J2p3K47j35j36K26l8o5N2n3j07J5M7
$$ y = [-80, 19, 30, 10, 40, -89, -40, -189, -24, -79, -66, 1, 76, -20, -198, -163, -56, 150, -97, -163, 138, -122, -86, 68, -30, 16, -68, -240, 26, -48, 22, 181, -117, -112, 109, -11, -142, -120, -41, -113, -168, -100, 92, 34, -186, 107, 110, 45, -2, -81, -92, -55, 1, 37, 37, 3, -187, -87, 5, -14, -16, -26, 150, -124, 57, 19, 54, -2, 146, 77, 122, -63, -36, -57, 111, 97, -50, 126, 92, -212, -283, -235, 51, -171, -60, -26, -14, 79, 3, 117, -169, -86, 129, 168, -88, 51, -2, 13, 201, -12, 101, 115, 160, -62, -198, 87, -42, 231, 127, -66, 31, -64, -84, -96, -61, 16, -119, -35, 59, 42, -145, 58, -17, -111, -6, 60, -70, 41, -43, -81, 143, 186, -40, -57, 126, 124, -14, 65, -21, 114, 48, -202, -152, -11, 59, -69, -150, -88, -87, 112, 106, 60, 12, 230, 6, 108, 38, 73, 0, -121, 105, 170, -155, -17, 29, 185, -101, 29, 0, -82, -89, 100, -6, -150, 26, 94, 85, -11, 120, 119, -63, 28, 59, -77, 105, -110, 106, -25, -13, -86, 161, 26, -110, 116, 78, 13, 65, 12, -95, -80, -33]
7203c3j9M09l63J6O5j42j21K54L6m8j1j41J13l1n5j9R7p7M9J12p8j84J65j24k1
7228a51K45o5j22o5R9jJ57l4j74K58k03J49Qn0J50k25O8L8q7j24K13j43%k5J29
7253D5j66l4K31j39o2J46J12oj86J6J15j87j2l5J50J26j53M7r7mJ25o1j27l2J48
7278d0J19r6k11K89k3p2n8P2jn1J18o1k1k6J57n2P7j43RO5j42J75l3r8J76j22
7304GMN0q0Q3J03J0k32J9R5j05N4j38L12l29K15p7L3J66k99J60P2k73O5K3J31
7329F9P9n7k00K5P2N9o3J6j8R9j71J21J4J36j58r2k2J42k7r0m8L3QM6K00j57J17
7356A33j09n7j04P2L0J63n1q8j18J88J75l91J13N9j21R1j2K52j76j3R2j69Q3k37
7380a95J68j1Q4M3k99J70P6K0J70j99Qq4Q8R9p4n5l0R5j17P9j8M7OKk76K87k49
$$ y = [-33, -52, 357, -6, 10, 75, -67, -188, 66, 102, 54, 43, -98, 15, -16, -71, -90, 7, -70, -21, 91, 13, -171, -6, -130, -151, 94, 29, -93, -158, -59, -60, 97, 63, -111, 147, -56, 93, 101, 51, 201, -24, 44, 82, -5, -129, 84, -59, -59, -84, 45, -121, -155, 76, -63, -125, 21, 133, 127, -59, -43, 72, -115, -127, -162, -12, 114, -39, 8, -89, -93, 32, -29, -156, -188, -40, 79, -17, -228, 61, 38, -34, -92, -20, -21, -72, 46, -15, -36, -62, 95, 43, 120, -23, -14, 51, -91, 84, 51, -47, 129, 7, 11, 61, -19, 64, 167, 177, -55, -36, 59, -46, 8, -130, 182, -147, 68, -9, 24, 190, -109, 51, 123, -150, -85, -62, 69, 148, 91, -109, -84, -12, 47, -16, 0, -18, 81, -90, 31, 45, 181, 23, -69, -91, 51, 24, -66, -114, -81, -73, -27, 173, 16, 133, 24, -33, -137, -65, -35, 128, 77, -11, -129, 59, 234, -157, -44, 15, -106, -15, -27, 225, 49, 36, 128, -41, 42, -195, -27, -38, 46, 89, -210, -40, 36, 56, 226, 27, 35, -49, 39, 138, 64, 9, -21, 74, -43, 36, 18, 65, 71, 73, -203, 84, -165]
7407a65K43J1r0J30j40L3P2k36K34pl3l2j48j76M18q1k8J35p3l3o2KL8M0J80l11
7433g9K2L49j14j96J61j37j05J06K88l31kq5l6K42j85J66J41j47J09k04k15K58
7455Fl5Q1q5j3J78l8j91J21j73K32M5Q5l32J01J87j72k6n5K59q8m4Lj53J28j26
7480a05N3j32M54r2k59p8J4J62J40p7p1j19J00J77k45K64j85j18M1J55J7k35K27
7503H8k11J71r1Q6O1j11j2K43j61O7pk66J55O9j52Ll3N2N1k4R6Nj6Q6J3j98rj31
7531a76L70k10N2k45R3K42k39L0J06j26j8P8Q2j49j78L20Nr8Q2p6Lj9J47k7o8
7556a9n4J3K00j83Q2P1j06J45k56K78j63O2pk55J27r6J07L44k83m8Mp5q9K83N6
7581A38Nq6Q6n10M20j89R0J95j93K90nk20qk2k09K5qJ58J2J29o6o6r7J23l5qj34
$$ y = [-165, 78, 89, -1, 129, -11, 22, 94, -142, 92, 85, 52, 20, -128, -304, 114, 33, 5, 140, 67, 34, -28, -26, 12, 52, 232, -79, -57, 292, 178, -18, 143, 6, -99, 7, 295, -36, -38, -123, -159, 83, -102, 64, 205, 58, 167, -37, -252, 6, -29, 52, -33, -46, 132, 94, -97, 24, -149, 83, 128, 213, -119, -18, 169, -3, -29, -84, 175, 87, 43, 46, -107, 21, -105, -52, -184, 270, 178, -81, -159, -145, 17, 157, 80, 9, -110, -10, 167, -78, 186, 1, -117, -76, 79, 96, -139, 88, -123, 48, -43, 43, 104, -7, -19, 224, 63, 130, 123, -143, 12, 81, -71, -68, -101, -49, 2, -22, 74, 79, 63, 149, 162, -36, -45, -176, 194, -16, 36, -209, -116, 126, -113, -83, 23, -103, -121, -43, 39, -110, -288, 32, 37, -61, 21, -55, -52, -71, 76, 49, -19, -73, -60, 140, -43, 39, 110, 4, 149, -107, 171, 8, 70, 63, -192, -65, -161, -54, 290, 7, -41, -37, -112, -201, 82, 138, 143, 57, 143, -367, 53, -136, -46, 149, -44, 246, 241, 21, 13, -9, -218, -193, -201, -43, -31, 98, 32, -34, -131, -8, -43, -51, -185]
7608a85J47K9qqm3L2m3k2J88j76j6K32k93K91j54K60j44P3o5j08J56k53J56r9
7632e3k1p5N6J16q4J61q8q5K19Lk62Q6K00j52J03j6k30J29m1KR0N8J50l27J09
7657D8J14k29j89J80p0Q0J68J31k40M1j9j93J0J33l1L8J88q0j13J9j60L97j71
7680E2k10K7J11k43L13M4k58L05l29L72k41l1%J28L5Ll05L18O1j78r5J43q9N1
7704a6K46j62j2j75J58J33O8k97K2q5j8K27ON9j48j16J42l1q2K42N8l01K0J67
7728A05j83P6q5N0J62j22L49l30N8n7K1j10K5j8J33K82l38o3J8O3K34l32J90q7
7752D1N3L7l7j68J7L8oOM3q7r0J80m8P9q8m5K23j75O4N1o7j10NJ20kK40k09j65
7780a00O3K9L2j48J42o2R3L8j69K6j7K9Q9j07M7L2j9j2k54J45J03K19k36lJ24
$$ y = [-185, -38, -9, -17, -25, -68, -36, -79, -101, 87, -89, -105, 127, -166, 125, -29, 231, 87, 160, 95, -13, 143, -110, 46, -53, -74, -149, -93, 23, -61, 100, 12, -73, 146, 149, -113, -27, 173, 21, 124, 108, -122, 7, -34, -32, 58, 116, 266, -61, 48, 162, -67, -256, -76, -146, -66, 102, 233, -7, 34, 15, -178, -168, -35, -66, -28, 160, 80, -33, -14, -174, 223, 52, -158, -131, -20, -263, 50, 94, -164, 141, -188, 184, -57, -88, -88, 40, 75, 78, -227, 91, 152, -26, -121, 22, -67, -16, 230, 68, 56, -119, 39, 172, 240, -57, -35, -120, -138, 89, 95, 154, 6, -110, 32, 1, -81, 161, 219, -82, -62, 105, -78, -2, -87, -37, 125, 3, 352, 22, 80, 23, 44, -66, -41, -59, 74, 356, 18, -45, -27, 36, 270, -62, 128, 41, 94, 131, 94, -74, -57, -19, -25, -19, 24, -63, -153, 27, -21, 58, -30, -75, 148, -27, 37, 88, 21, -89, -84, 36, 34, 274, 65, -100, -37, -8, 24, -124, 18, -44, 49, 87, -82, -56, -73, -44, 45, -62, -15, 17, -2, -14, -268, -123, -20, 199, -37, -40, 84]
7805H4k8O6j35j86J89r8o6Q2L7J84j34K1j42K28j7R5l58K45ql3J07l6k2q5k33
7830b43J97K07j73j19k6K42k9j3R3j59J93j02P3k43J17K29l26O3j88O4K30k85
7852a98M2J9J51Qj04q7J07n2Q3M8n0M1j80K44j5lrm0l8J00O4O5n5J2k37k7J58
7879D7p2l7J39j48K97k58J49j06k34J58J82j26ok14J29J48j9Or5n7J61j85R8p0
7903a13P0j56J35K00j81J9J57Mk60j11L76n4j27N3q3n1NJ92j89P1K01q6q9M8m5
7928a4J7j50J42Q9k44R4k9J49l7Oj06K7J19j64K41m6j20L60m05MM5K40l09O0q2
7953a13P4L24l77n9K49j05j70K19O6j13K39j91RP0j51K9J02o0R5j91r7j58M23
7976A14p8JJ28k57K03j77l9r9J32J64k06J38j17m8j36M59j77k29M82j08j68o3
$$ y = [84, 56, 122, -13, -199, -10, -108, -174, -92, -55, 129, -5, 16, -126, 102, 85, 180, -178, 67, 59, 26, 133, 97, 75, -10, -243, -46, 161, -12, -131, -157, 85, 56, 43, 136, -23, 170, 68, 141, -102, 15, 244, -82, -19, -207, -143, 87, -198, -156, -137, 14, 22, -82, -169, -62, -114, -31, 17, -33, 8, -172, 72, 57, 54, 45, 5, -33, 67, 131, 196, 141, 153, -84, -111, 47, -25, -62, 77, -71, 226, -32, 117, 11, -223, -65, 117, -9, -15, -229, -100, 48, 29, 35, -60, -117, 44, -141, -43, -113, -43, -199, -64, 136, -45, -26, 131, 135, -125, -236, 140, 86, -41, 12, -71, -122, -117, 75, -114, -43, 158, 72, -17, 31, -14, 3, -147, -5, 84, -160, -66, -95, 54, 17, 23, -83, -56, 63, -101, 140, 94, -26, 334, -71, -67, -22, 218, -91, -31, -113, -39, 285, -92, -151, 98, -7, -177, 42, 108, -5, 234, 43, 52, 122, -29, 0, 102, 42, 137, -54, -151, -309, 114, 36, 37, 165, -92, 111, -66, -105, -204, -72, 92, -114, 24, -93, -141, -277, 182, 5, -224, 258, 150, -18, -81]
7998h1J82l1k2L1j16J57J9j16j44L3J45j2J22l50J87r0K12k48J34p0p7J73K7J80
8022B45o2k13L16k18J54j52o1J87j60j22J59J15j05n3l0m6J49O4o0j10J78k50
8044g5l9n9K49J56l25J97j65N5R4q8J6P5j78kJ70j63J89J18k61K05r0j24Q6L6
8068G7L5j31J63q8j88j19K38l29L05J29q0J2p9K55k44J8J09j78J38P1j35M4o6
8091d3Q3l7N1J37r6l04K32L18k82k10j49K11K8M3J41j57J18r7j9o4M1J27Oo5j94
8116a81K11m7k5J12q5Ll9j6J39o2j06M7j34J97P3j43O8k42K20m9J55k07j43K22
8140c2L2J8Q8j84K32r4k86L38j78l5K57q7M2j41j71J83J15j25k51K43k5l7K50
8163A52k50m1J94j69K01m3O3J59j91k00J53p6J62r3N8j29m0K64j88Q7l8M8q1l0
$$ y = [-81, 101, 70, 48, 79, -37, 120, 139, 23, -121, -88, 57, 45, 167, -183, 4, -86, 126, -122, 12, -58, -135, 38, 65, 245, 183, -30, 286, 68, 222, 70, 9, 196, 36, -86, 73, 188, 83, 30, 0, -46, 103, 167, 107, -3, 175, -75, -114, -173, 76, 232, -93, 104, -61, -6, 88, 0, 16, 91, -87, -89, 81, -82, 107, 225, -36, 169, 79, -45, 41, 77, 112, -19, 144, 56, -132, -251, -13, -342, -37, 92, 12, 24, -55, 200, -44, -26, 83, -95, 43, 114, -21, 23, -43, 40, 3, 54, 191, 95, -209, 23, 341, 59, -151, -300, -89, -61, -18, 123, -34, 84, -13, -32, -96, -55, 72, 78, 13, -181, 30, -17, -42, 70, -15, -12, -51, -67, 72, 10, -96, -49, -183, 14, 87, -56, 12, -230, -10, -59, 96, -111, -254, -32, 0, 18, 106, -78, 154, 60, -226, 112, -66, -101, 156, 69, 111, -30, -201, -18, 97, -28, -279, -36, -61, -98, 152, -98, -139, 55, -114, 87, 44, 107, 266, 75, -125, 28, -48, 114, 21, 79, -50, -90, 174, -14, 73, 35, 83, 2, -28]
8187b8j92K51j76K02
$$ y = [-28, -220, 31, -145, 57]
8191E7
$$ Imaginary data points
##PAGE= N=2
##DATA TABLE= (X++(I..I)), XYDATA
0@%%%%%%%%%%%%Nj3J6j6J6k4L2l2M0m8N6p2Q8j03J19j36J52j76K05k31K63l00
34a59L37l79M27m81N40o02O69p44Q26r15J014j122J237j364J504j657J827k012
52a054K218k448K702k987L312l683M110m612N208n932O833p989R538j1727J5083
67H572k0939L4054j19568N0588K15988j28056j37166L6738J18066j8630m8561
78h914j4578P717J8M7020K1558n4969o2578M6988P5031k0374q3216L957O9895
91B7555J5708n2874k1453J8951J2895L613J4222j1418l1169P607M1082l983l9777
104a9041k351L3612O238j7914j957M985j2275m044K0674P532k2835j0883K2129
117C870J6063k0592k0567J4647J9652q288j2407J2220P060j8902n634K5180M846
$$ y = [0, 0, 0, 0, 0, 0, 0, 0, 0, 0, 0, 0, 0, 5, -8, 8, -8, 8, -16, 16, -16, 24, -24, 32, -40, 48, -55, 64, -72, 80, -96, 109, -122, 141, -159, 178, -201, 226, -255, 285, -317, 352, -392, 434, -481, 533, -589, 648, -716, 788, -869, 958, -1054, 1164, -1284, 1418, -1569, 1743, -1940, 2170, -2442, 2766, -3166, 3667, -4322, 5216, -6511, 8572, -12367, 21687, -97881, -47293, 168695, 40639, -96527, -59789, 58277, 39647, -8914, -23492, -15775, -15757, 31263, 52821, -2148, -64726, -17738, 57293, 36919, -46297, -42340, 27555, 43263, -9611, -31064, -12113, 782, 4395, 18617, 7199, -23970, -16363, 24719, 20736, -19041, -21392, 12220, 18458, 544, -1413, 3572, -8703, -12747, 7927, 15459, -7376, -18259, 3870, 19933, -659, -21226, -6579, 13073, 4785, -7622, 4598, 11658, -7244, -12878, 12302, 17148]
130A7148l1522p754L6627J3759l5127k1066K4414K0811j3705j5672P789J0425
142F127k645m742J063j556l356N917R094m457j1760K468J1248l504j2277K698
156e682J1672r62q844K216M457o175l487Q039L322o517j400P707P63p488j517
171c896N709R10m606R70N655o55p683j892O419R70o063Q55O875q89p397K259O983
188D524m345p163P585R306p232r695O634Q392o976r172N520R367k519q084p06
203d564M957M14l124j09J912R49J009J217k773m364K944O575j414p137J527Q217
219F236j523q972p18N980J049k873J39J116k265J40K652m87l969Q49N779J754
235D887m673l474L017L313j833k900J185K236m73r99q8j982j828K916L476k338
$$ y = [17148, -14374, -22128, 14499, 28258, -6869, -27935, -3521, 17290, 3585, -12087, -4298, 6127, 3482, -1260, -197, -1753, -5109, 808, 9902, 5445, -6315, -3847, 7401, 3897, -8380, -5682, 5990, 5028, -3816, -1600, 2857, -3318, -6805, 1234, 4556, -1961, -3361, 4346, 5109, -2379, -3896, 1813, 2723, -1883, -913, 4742, 4087, -3596, -5488, 931, 1901, -4162, -3307, 3568, 2679, -4718, -2459, 4524, 179, -6984, 601, 9907, 2675, -7020, -386, 8006, 1030, -8142, -2622, 6745, 4226, -3858, -4564, 393, 807, -2317, -2426, -514, 435, 1444, 2661, -112, -4476, -1532, 5043, 3629, -3508, -1981, 6236, 4713, -4259, -4977, 1003, 2052, -821, -682, 434, -1831, -1691, 961, 474, -3495, -2646, 3133, 4887, 214, -3260, -243, 3070, 1237, -1663, -478, 1758, 1285, 286, 198, -1784, -3612, -696, 2780, 442]
251D42m018K380M305j729m495R42M090N47k200r3J241j073r66L46N07p39n67J510
269D30P68k218j236J192J242o76n5J943j31j718N40J500p88k234J357K862p68
286B010l035j28J742k95j906K13J297M60l72m35J51q08M37J330M94j196j32K013
304A840O0k055r96J355R80j238k89N41K0j354m5N60p4l35Q85J117n06r74L63O81
324E36k7n99M99Q65p9j210j05J31m79k80M55L75n49k04M71j98o43K82J105M50
344G96m73k47R15p0j034l16Q39K29k14j71j74m40j30l87N32k11l95Q24O13n79
364i3m81K05P61N6j90N57l2l95J03J5l95m61N9L65N2k68n88Q4K42Kj12J92L37
387A5K42J25N1k90l17L45M09L53o63P6q6o2o17k87N4J10J81M25j01l07o9o5M98
$$ y = [442, -3576, -1196, 3109, 1380, -3115, -2173, 1917, 2464, 264, 171, 1412, 339, -627, -281, 226, -513, -1080, 430, 1198, -1020, -2256, -1064, 178, -498, -553, 1390, 1259, -459, 81, 1581, 793, -1441, -84, 2778, 2010, -1025, -1153, 589, 294, -1612, -1399, -102, 358, -14, -449, -298, -1106, -669, 661, 1155, -41, -173, 1840, 1900, -155, -1151, 204, 1184, -54, -343, 198, 218, -1136, -1181, -621, -695, -1030, -145, 972, 466, -508, -145, 536, 509, -90, 409, 1274, 1195, -15, -120, 11, -468, -748, -293, 82, -467, -671, -200, -398, -1041, -759, 346, 796, 323, 76, 991, 921, -113, -429, 410, 639, 425, 254, 80, -360, -490, -877, -345, -556, -951, -127, 486, -93, -574, -369, 392, 448, 258, 815, 783, 388, 491, 506, 111, -350, -291, 74, 126, -142, -730, -646, -404, -402, -514, -322, 15, 257, 382, 433, 143, -174, 171, 580, 933, 270, 346, 260, 198, -419, -706, -652, -542, -361, 64, -37, -344, -413, -478, 20]
410B0M34m4j99L41J70J00p11l42J30L46L96m91q68q7M80m5l10m1M41K22L53K81
432E76p69l45M69R37j9p33QQ05j79p15q41J74Q92j17l44l87N3M01m94J19M32k62
454c39K71O27K97o90j04M89k98k51L97K03k8j055k49K41O11j48r65k31J561K88
474F27j035q37J040R84j91m07k02M87J30J54o91k61K08K83J33m28o07l53M47J247
494G28m44j473Q0J878N30j382n01L23N41K90j69k24M20k09l47j54L63k22j048
513a020L55J077l93j173N53P10n0l86L79K71n9M35K31p16p17M3R18P26o49j612
533a077k40J775Q03j526j654J032J673j64p11o29M47P29M7k65m45N14N50l62j60
552C37o69m69N39J273o47j885Q7J817O38j146j137O40J163N23p44q70L84R69m76
$$ y = [20, 454, 410, 211, 552, 722, 822, 111, -231, -101, 245, 641, 150, -718, -805, -325, -370, -680, -721, -280, -58, 295, 576, -193, -538, -69, 868, 849, 116, 124, 929, 750, 35, -806, -632, 260, 143, -201, -588, -535, -134, -628, -509, -77, -339, -68, 559, 856, 166, 62, 551, 253, 2, 399, 602, 574, -481, -730, -489, 122, -26, -991, -1222, 339, 627, -408, -1245, -205, 779, 588, 181, -21, 466, 596, 750, 59, -202, 6, 289, 422, -6, -613, -966, -519, 728, 284, -1189, -1109, 769, 1299, -83, -584, -261, 280, 570, 401, 177, 597, 388, 41, -113, 250, 28, -1020, -665, 412, 19, -1154, -601, 109, 59, -327, 52, 323, 264, 699, 930, 214, -503, -460, 458, 1184, 535, -1077, -1317, 458, 1261, -265, -1919, -887, 786, 622, -89, -718, -271, 458, 505, 240, -205, 309, 859, 497, 337, -332, -801, -262, 1011, 364, -1521, -1434, 383, 1021, -125, -1262, -622, 541, 1064, 320, -550, -166, 803, 327]
571C27k75M62K52j098Q4M87L1q16J97L65l40j37K07j07L52j18r9L2M64M20n05
592A85Q0L84r17l81J259O01j478p34Q97O58n40m78j73K53M25M2k15O8K09j81k2
613e8K91J46l8l66L94j6p48L26L26j54m27K15j80L2M18n00k94K72Q07m19k72K91
635D6N29o37n9O74J63n00k34k81J76K47O5n18m01N75J20M8j35j44j22O21J85l73
657D5l09Q07M59q71l66M55N9j46m39k0R8P0K88k50n71Q4O36J76m7j04j68J28J87
680B01N6j0k32L08j54jNj01n2Pj98l44NL26L05m93J56J54L63j33k21K37PK54j86
705B59J44m84Q6L8q8J24j67p7j16k1Mj23K98K57k91J64J17j1j05L93j47q7J73
728C40p6k5k45J8R5j38j18R4M2j61J78n2j48J33P6O3J41M6r8m2J41K31l69j2K27
$$ y = [327, 52, 514, 766, -332, -248, 239, 270, -546, -349, 16, -324, -461, -254, -361, -9, -127, -226, -194, 270, 690, 185, 265, 649, -268, -649, 610, 1211, -267, -1001, -104, 554, 14, -464, -637, -384, 41, 83, -132, -64, 145, -36, -58, 233, 379, 341, -25, 369, 353, -395, -69, 257, 103, -324, -109, -289, -257, 161, -339, -633, -361, 446, 27, -245, 46, 575, -62, -121, 553, 716, 216, -18, -299, -123, 124, 189, -329, -730, -155, -35, 13, -122, -266, -388, 233, 418, 45, -264, 543, 1002, 131, -235, 220, 279, 133, -306, -326, -228, -158, 130, -120, -691, -607, 29, 205, 158, 54, -114, 14, 201, 257, 247, 15, 323, 169, 168, 173, 72, 20, 27, -171, -515, -510, -184, 121, -372, -216, -62, 301, 168, -53, 184, 191, 445, 259, 403, -81, 5, 43, -45, 79, -88, -165, -281, -302, -298, -421, -123, 134, -157, 7, 124, 113, 8, 401, 254, 167, 340, 264, 239, -6, 12, 107, -31, -149, -55, -13, -174, 4, -48, -196, -63, 13, 76, 217, 263, 165, 123, 264, 495, 126, 114, 341]
753C41k28l17M9oJ07j87l7J82m21K84J75P9M0LJ2K72k60j59K99O0Oj14k20%Q8
778D8l24q8M01l07M5P7l59L82o4K52K42k53J32K36j54k87j6K30j60K59l63j68
800b39O4K12j23l85L87j09m3J31MJ02J46K99l60J70O1j32p7j65K0j41J96Q1k41
823a42j27OP7j42J37M3R7j84L77m1j68o1L07J37j67q6j8p5j08K50r7j43m1N7q7
848a99QQ4K5k21N7J33O3J14J35K4p1N1p7QJ7J49l33JJ14m6k76k04K02p1RL2J33
875a39lJ44R5P4j37J04K1M1j85J34k51J90p4j03K2m6J37k12q9J05j5J01J25j04
899f5K68l75K64K8Q6j95j39L47r1L6n5m6n39K88N6j31K3k2J02K03k40K25K0k0
923B8M2J43o5P0m7p2j08M8r5r4K3j00r9m1M83k29j45K12N6O5J43j18r5R3J95J76
$$ y = [341, 113, -204, -155, -161, -54, -241, -278, -96, -517, -233, -58, 21, 61, 64, 76, 348, 88, -71, 228, 288, 294, 180, -40, -40, 48, -276, -364, 37, -270, -225, -148, -507, -125, -189, 63, 305, 52, 184, 420, 266, -21, -37, 193, 33, 292, -71, -239, -175, 37, -86, -471, -84, -193, -236, -105, -101, 1, 147, 446, 86, 256, 317, 185, 108, -57, -37, -178, 18, 99, -142, -269, -263, -186, -328, -191, -148, -51, -235, 142, 101, -67, -128, 179, 316, 149, 63, 45, -30, -138, 112, 15, -128, -169, -112, -199, -191, -107, -82, -303, -246, -113, -50, 64, 199, 223, 152, 203, 126, 134, 151, 300, -33, -32, 82, 36, -240, -444, -242, -313, -304, -272, -139, -142, 2, 97, 171, 34, 138, 159, 200, 15, 149, -102, 88, 14, -89, -67, -113, 24, -188, -277, -172, -187, -86, 39, -65, 203, -172, 92, 120, 206, 11, -128, 219, 128, 164, 109, 63, -476, -188, -132, -263, -240, -262, -160, 43, -197, 28, 48, 28, 70, 213, 148, 218, 171, 99, -9, 39, -56, -150, -127, -227, -326, -367, 116, -113, -258, -46, 10, 75, 218, 100, 5, 98, 293, 469]
949D69l02j17J98m0k12k59J17J63L4l07L2n3L20k4j83Q9J37l31K65K50j54N2J76
972C20M1k53j52o1p3K10r4Q2j99OQ6j8n8L2L1j9K64J8j68J16K83n0l78K13k35
997e6n5K22Q4n40l4L95J27k86j33L46j30N2K18J02n53J63K82J9n7j68J60J12k19
1020E1J0l39J64M77l50l73N4K77l53J81L68q0j45J63J77k24O5K3j25J41j2l11
1042a61J44J23n6j40L5L94m54k14K34j43m0L60J68l96J46K65j25p9K26j44l65
1063b22K28JK47k20j34k3k42Q9K18j5L8K2mj3Q1J77P3l24K67L0n76N10K35n65
1087a22p6J82o4Q9l43K37j21oL80j13j09j54J56o5J82J79k16R4Q5M3j43n7K12
1110B50l75j74J96K24k68Q8K2r8J2M10k12j99J25J9L3L9N1O7l62K53J19k31J6
$$ y = [469, 167, 50, 248, 208, -4, -263, -146, 17, 51, -256, -224, -277, 43, 19, -164, -75, 62, -269, -4, 246, 92, 144, 320, 361, 108, -44, -105, -178, 32, -62, 20, -179, -173, -87, -105, -163, -131, -100, -119, 145, 163, -5, 111, 394, 344, -34, 179, -56, -111, 111, 195, -345, -379, 16, 143, -143, -276, 70, -60, -8, 210, 312, -241, -78, 204, 223, 166, -2, 158, 270, 51, 61, -278, -114, 363, 13, -360, -306, -29, -382, -201, 167, 87, -58, 105, 282, 58, 123, 146, 21, 162, 150, -161, -17, 106, 50, -90, -55, 339, -115, -329, -95, -238, -278, 82, 250, -146, 0, 265, 140, 61, 287, 143, -222, 6, 7, 254, 34, -100, -123, -365, -276, -58, -73, -35, -13, -17, -30, 51, 228, 301, -23, 244, 274, -302, 208, 443, -122, -198, -16, -80, 9, -334, -97, -218, -224, 156, 43, -66, -220, -64, -129, 53, 232, 16, 110, 195, 238, 95, 38, 250, -125, -299, -103, 121, -147, -59, -37, -135, -123, 287, 75, -124, 1, 20, 53, 92, 143, 210, -152, 101, 220, -11, 5]
1133EK39j29l25J42%j68K35j59j72n2M05J08k65K22k0r0J36M7k7j39p7K4K00j77
1157c7J59k07o3K2J12j10J22P9K8j77O7P8K6k2J84p9j23K92l26j74K42k28O5K1
1181d9N2pk49K78R2j27j42L17j91m6L2M14l21J78l28K54k34K33j37Rj38J26k29
1204b13K31l00K12j57L75L7l21J96J5j87J22N0O3L1j36q8j97N4L63k39p4J08N
1227e0j15K2K53r6j66J35J74j15J55l85K87k38J40q0K48j06j23R6j21J51N2l78
1249b60K1J89j44J65R1j21mP4O4n1rJ94l7k69L40k14k7J10j86k5r5R9J42j49J34
1274C2j37k40K89K54j07jL4o2lP8N6j98M%N8Rol9J27k59j35M22l04K11j08O1J02
1301A38Mn8j81K25L1K7M4j00m55J67L61k98j88L44j80j20J53n4J73r0L0L8K9P5
$$ y = [5, 244, 115, -210, -68, -68, -236, -1, -160, -332, -384, 21, 129, -136, 86, 66, -24, 112, 159, 132, -7, -84, -60, 140, -37, 122, -85, -148, -126, -14, -124, -2, 77, 105, -72, -5, 73, 99, 77, 261, 182, 59, 351, 25, -149, 93, -135, -70, -49, 3, -4, -253, 25, 117, -10, -152, 165, -26, -72, -40, 374, 53, 231, -97, 157, -77, 156, 19, 28, -110, 16, -213, 18, -282, -70, -227, 148, 185, -136, 60, 75, -112, 10, 60, 123, 154, 18, -70, -267, -213, 150, -89, -163, -55, -50, -165, -143, 110, 14, -152, -17, 157, 42, 197, -188, 99, -139, 1, -79, 169, 63, -60, 36, -85, 66, 118, -260, -239, -50, -194, -29, 62, -59, -63, 11, 75, 24, 15, 209, 172, -97, 243, 29, 2, 112, -74, -99, -194, -95, 47, -102, 32, -105, -345, -56, 198, 91, 90, 124, 62, 59, 137, 193, -5, -1, -1, 57, 66, 60, 21, 148, -111, -246, 176, -128, 83, -25, 36, 138, 142, 84, -97, 128, 159, 186, 230, 130, -325, -158, 203, -95, -283, 61, -119, -239, -86, -140, 33, -57, -27, 11, 40, 115]
1325A15p6N7j20J09M6j23j60K23J5j4m4J5m5j53R1J64j03l5P2k19K69R1np7m3
1350E0J01r8q6O4j2p8M2J26k40L25k72l12L55j37J27J10n5j19mK2N7j0K78j65
1374F9p7j48K95k27P7m6J49L6l40J20q7n1J73J95q8j45M8P8K34j88%J10k84K45
1398A48k50o8P2Q9j26K84l69J24K4P9M7%l0K83k54k28K95J3n2j73J71M0j12j71
1422a64K45j65K7k47L96p4k49K58j52J18qN6j71j0K97P8j72N6kq8J1O1p1j6r0
1447g6j24L34k19R3OQ2j76j28q9M35J29l03J54L9k63K54N9k31j00R3K1k0j84K87
1471G3l24O0Q6Nn2K25r1N8k21K15J02M8k70m7J13j69L59k23R9J02k11j03O3J86
1495H3k36N9J34P6l6o6K70k23m4lpQ2Kl37L79j04K68k08k14K2J3j17r9K93QM5
$$ y = [115, 39, 96, -24, 85, 131, 8, -152, 71, 86, 72, 28, 43, -2, -155, -64, 100, -3, -38, 34, -185, 84, 175, 170, 93, 50, 151, 53, -33, 31, 19, -59, -17, 109, -131, 194, -78, -390, -35, -172, -45, 65, 10, -109, -113, -91, -34, -44, 234, 69, -8, -156, 139, -88, -11, -57, 92, 128, -212, -92, -179, -230, -57, 138, 50, -95, -47, 31, 265, 77, 77, 187, -97, 148, -102, -170, -98, -9, -135, 149, -220, -96, -72, 7, 54, 54, 24, 307, 53, -175, 120, 133, 81, -92, 79, 119, 7, -164, 81, -84, -57, -304, 92, 18, -231, 27, -125, -7, -15, 41, -130, -140, 157, 235, 63, 119, 117, 29, 40, 101, 30, 14, -76, -200, 134, -85, 8, 14, 96, -80, -208, -297, 138, 267, -36, 118, 157, -106, 148, 207, -24, -124, -31, -10, -30, -214, 73, -251, -191, -105, -100, -152, 73, -18, 40, -181, 34, 136, 184, -86, -133, -20, -189, 170, -53, 46, 148, -63, -166, -103, 83, -153, -94, 40, 116, 80, 14, 284, 61, 17, 14, 7, 89, 91, -246, 133, 29, 297, 89, -125, -103, -90, -207, -306, -13, -5, 40]
1521D0j2J03o9J67q3j53L0o4K70m40K37rj75jJ25K7k23L09O6M1j02j21L08j34
1545A37J73j72j03J27K5pl95L31j17l9L6N8j66L9j95r5K24Q7j7PJ40M5k58J36
1569AJ24N3l7j51k09K60m1j79K76m4k2j94J19j92N7K41k59J13J86q3k03J09K34
1592A59j19n4N0J57l18K09J9k80J2K05l27K19q6m2R8J58p5k29K42J2n0n6K57q6
1616G5j05J69L0j29J3k12J29N2l3P9l40M27k42l5J26MM1k71K1J77KJ52o9R3j57
1641cmR9p4p5K70n9k93J76j31j18J31l7R1M4P0k6k68J83J04r2LK3R6k25K64j92
1667d3Q8k52K38j12q4j1L69j38n8j32P8L2L8n6L4R5J27k02n3K43j85J09k23m7
1691a45K32l61K17Qm3p2O1J6K13r1J42j15j09R1q2J78j75Rl6J6J19r6J73n2j70
$$ y = [40, 28, 131, 62, 229, 146, -7, 23, -41, 229, -211, 26, 17, -158, -159, -34, -7, -230, 79, 145, 186, 84, -37, 271, 137, 310, 138, 35, 162, 187, 180, -215, 116, -1, -40, -4, 54, -112, -73, -268, -363, -139, -52, -69, -62, 78, 123, -135, 1, 125, 178, 141, -10, -219, 41, 0, -179, 97, 53, 31, -163, -44, -236, -179, 62, -197, -84, 102, 19, -184, -75, 159, 40, -14, 36, 193, -125, 84, 103, -177, -165, 40, -287, -68, -154, -196, -98, 60, -15, -244, -2, 10, -40, -96, 161, 75, -30, 139, 169, 40, 53, -159, -30, 22, -11, 68, -272, 155, -87, -122, 4, 8, 49, -222, -201, -24, -22, 130, 61, 154, -3, -7, 92, 18, -57, 213, 154, -139, 37, -94, -212, -81, -118, -27, 17, 87, 61, -207, -24, 80, -12, -9, 14, 110, -115, 149, -43, 45, -207, 31, -81, -165, -176, 193, 55, -3, -135, -57, -25, 13, -43, -9, 86, 213, 11, -42, 201, 16, 125, -98, -145, 87, -274, -57, -49, -92, -164, -103, -87, 126, 35, 177, 62, -47, 44, -38, 140, -35, -26, -62, -46, 73, -23, 150, 98, -72]
1716g2J90l5k16O2J22O1L8r4k46J85j01K39J13k49q7P7J35j38J44n6j52l8K66
1739A48k03j12K25QN1j77n7J4N7J06n6q7K73k98r4L03Mk0qj31J09j8p5j20J20
1764c8qL4J13l15K97p5o1O8J04k69J16J26n2k5p0mJmJ7r8M2M3J92j86M3k2n8J80
1792I1j76QJ44J17k79M3K9j69K87J39k68j36K26m7j19J29K9J05k76K71l17L1K71
1815A33j94K98l50N6J3J87p3m9J6r8k7j38L07k29J09R0n6R2O9k26o2J49m9J56
1839A24o0J9k3Q8N8j96K14j25p3k61L48j29j12j4n7Q4J49M0j10J82J47m71K09
1862C1L4j26J5M2k09qJ22p4J21Q8O1J8j63Or3K21Q4k09J11j05j39K65Q8r9k47
1887a65J73Rj58K95j34q5j5L7L35m68L34K1L9l51J23J04k28L3J79j52J14j03J85
$$ y = [-72, 118, 83, -133, -71, 51, 112, 150, 56, -190, -5, -106, 133, 246, -3, -90, -13, 122, -16, 128, 72, -80, -118, 148, -55, -167, 58, 66, 117, -60, -117, -103, -46, 60, 4, -83, 190, -108, -202, 101, 105, 85, 77, -54, 55, 37, -38, -158, -38, -46, -12, 101, -214, 83, 8, -53, 15, 119, -150, -34, 92, 40, 15, -55, -59, -58, -62, -45, -143, -101, -58, 134, -52, -9, -31, -89, 91, -85, -77, 67, 184, -95, -52, -23, -192, 95, 234, -34, -170, 56, 9, -110, 19, 48, 153, -123, 148, -169, -138, 133, -61, 237, -113, -57, -44, 143, 70, 21, 37, -61, -88, -226, 81, -148, -39, 51, -5, 87, 156, -70, -132, 17, -32, 124, 64, 83, 60, 148, 206, 10, 224, 99, 26, -235, 113, -16, -128, -142, -199, -115, 34, 74, -36, 146, 293, -178, 31, 65, -61, -46, -4, -213, -221, -99, -173, -52, 36, 97, 115, -48, -42, -135, 86, 170, -39, 72, -33, -172, 93, 181, 82, -165, 8, 17, -141, 154, 20, -65, -80, -43, 292, -176, 158, 179, 218, -133, -10, 94, -134, -101, 78, -74, 40, -63, 122]
1910A22j32o0K22j26k59J65J41k69R0J72k3r2Q6P4j18n9l8O6N8R4k59L62J8k41
1934fQ0j82LJ3j2j46J85J73J83m68J79m2n9NM8R7J88k00J18k56J61j03p9J36p9
1959f3JP9k5j08K6m4ok2R0K4P1j4k9j37L15k25K13L8j10l47K86j35J94j54J55
1984G3J7j43J36j55r6k8M54l03M2J0J28j33k3O1MJ01k95N2J41K3P9j97n5J98K8
2009A19l04K18Nm6OP6K8j66O6K43l7l52K08j9j49kO8K13l48J52p1J33L4q4J83
2034A74k65k9L27o6k11K94k15R6j72J87j84K18k58N6K4K3j44K65j03j34K24j94
2056h7N7J55j44K1j19J41j51J40q9p5pJ9K21p8j41L8P2m7J64j76M7J55j28K5l0
2081a7j60N28l93M2LMpq4j0L04l90J65K38m9l5k5K4q5J47k3o8k37J82j46O0P0
$$ y = [122, -10, -70, 152, 26, -233, -68, 73, -196, -106, 66, 43, -49, 37, 111, -7, -66, -104, -38, 20, 114, -145, 217, 235, -6, 74, -108, -105, -92, -104, -250, -65, 108, 291, -177, 2, -40, -99, -94, -46, 51, 239, 39, 157, -99, 62, -41, -120, 16, -63, -62, 17, -8, -116, -90, -134, -140, -162, -72, -48, 23, 9, -20, -157, 158, -67, 146, 184, 74, -273, 13, -122, 72, -82, 73, 90, -53, 83, -72, -168, -196, 258, -45, -3, 7, 135, 2, -21, 40, 44, 145, -150, -98, 43, 66, 145, -52, -107, 91, 119, -185, 33, 38, -8, -2, 74, 102, -64, 2, 245, 208, -144, 64, 45, -104, -106, -38, 175, -173, -21, -92, 41, 75, -9, 174, -91, -120, 207, 141, -70, 224, 9, 105, -67, 120, -64, 154, -104, -48, -24, -1, -145, 120, 17, -117, 107, -87, -30, 125, -19, 2, -117, 24, -127, 13, -76, -151, -158, -139, 82, 4, -137, -99, -27, -74, 90, -86, -39, 116, -12, 13, -17, -177, 351, -42, 0, 3, 7, 0, -84, -94, 210, -180, -15, 223, 174, 139, 114, 138, 53, 200, 177, 109, -128, 54, -92, -32, 38]
2107C8J06l5j86J39m3j2k9L0j35P4J30m1j84L03k7k49N3P2m0k9PJ41r0J32j20
2132Ej30J41Q7j41n5k7J30j82K51j3j39J15n1l1m4J48J19j44J1mQ8k22J62J09
2156A83k66K72m29K05J13k65P4J33m02O35k06M3j19J34k91L56k3Q2j65q0Q2p8
2178a2L5k8k24M35k83J09j45J35j99O1J56j44J48n4P5r9Q9M2n2p5n8K84k97k2
2202a23J34k7Q3Mj4p0J14p4k81M36j37J8j79J76O5k4k60L33j42k82L61j23j51
2225a63O7k1J65R6l88L57l4n3n8q7J10l0N7M0p5Pn3O6K05j22M1l10Q3L7R9K12
2251B48q2k65J52NK02k61pm3j42N0K00J91m63L38k79J38J4N0k21K36j19Q6J6j22
2275g8r8K08k57J81J9P3j09mK23l99J70J48op2j58K81J50j85j29M5J2l8j0l1J11
$$ y = [38, 144, 109, -77, 62, 19, 7, -22, 8, -127, -53, 77, 36, -148, 155, 128, -121, -68, 4, -36, -65, -58, 83, -7, 125, 5, -125, 16, 103, -38, -93, -120, 10, -172, 79, 66, -73, 42, -9, -40, -84, 64, 183, 39, 50, 46, 134, -88, 74, 183, -83, 189, -240, -35, 78, -187, -113, 20, -382, 253, 47, 90, -29, 105, -186, 170, 147, 229, 64, -16, 66, -12, 23, -5, -229, 206, -77, 32, -113, 22, -177, -116, 40, -104, 44, -10, 65, -34, 55, 97, 45, -30, -88, 196, -101, -123, 11, -16, 67, 71, 57, -13, 101, 27, -254, 182, 45, 63, -116, 60, 125, 101, -159, 174, 32, -250, 111, -12, -163, -96, -117, 48, 144, -244, 113, 79, 26, -32, -119, -9, -39, 18, 58, -17, -10, -63, 3, 208, 86, 127, -183, -100, -63, 36, 248, 166, -99, 53, 58, 260, -1, -8, -51, -193, -143, 57, 248, -215, 123, -156, -18, -4, 46, -175, 61, -58, 28, 44, -78, -176, 32, -225, -44, -25, 48, -61, -65, 158, -241, -71, 77, 71, -1, -159, 122, 272, 87, -42, 3, 15, -23, -33, -64, 47]
2300D7P6j40j9J07Nr3l15L01K0l9M5J1j25j38L48o8p6k4K3J72r6m9N3l7k98M55
2326A46k31j4n5K29O4j58M4j35M8J83j09N2p9l2J1j97J85QJ1L4l2J74j72k85J77
2351a33K5J96N4k98J02J26J34j84l4J0K23j85J2r1J45pJ76j68n13N73k9j48J53
2374A39k44K28j1r9j23J32N3j60K9j01J60K07l21J67k24n2j4J68j2L4p7J77r7
2397d1oJ82j9k10N9q0J26m2j45o9L57k03M2Q3j2J63l12L12j50K29k26J52j63m5
2421a8Rq7M6r0K26P2om33L20M9l5Ok04j05K64J05k29J31p4M9%M8j36J30%k4k35
2448b21J8L28O5k93Q5K0J66k9J92m04J94j62K92k92P0J87l04J22O4j2m5p5m6J19
2472C9R7K5k82N5k5n9O2Q9J12j0j17K97m67K42O9j55K70j78N3l3j91K29j01J34
$$ y = [47, 123, -17, -36, 71, 76, -17, -332, -31, -11, -50, -5, 6, -119, -257, 91, 23, -53, -77, -54, 118, 22, -27, 26, -11, -309, 146, -85, -99, -154, 75, 139, -19, 25, -110, -62, 121, 12, 64, -15, -47, -36, -233, -48, -40, -29, 5, -27, 147, -25, -310, -133, -108, 88, 142, -156, -54, 72, 206, 22, -12, -2, 221, 36, 48, -43, 102, 95, 271, 103, -410, 163, 134, -14, 139, -105, 123, 112, 13, -110, 22, 75, -85, -56, -157, 3, 210, -111, 56, -168, -220, -234, -66, -78, -44, -121, 56, -41, -47, 135, 116, -94, -35, -115, 11, -31, -176, -245, 112, -91, -49, 34, 22, 185, -127, 185, 35, 264, 38, 190, 27, -18, -9, -96, -50, -140, 86, 158, 152, -281, 39, 88, 53, 59, -145, -250, 14, 119, -110, 21, -53, -4, -4, 44, -92, 38, 38, 14, -221, -203, 125, 190, -103, -18, 2, 168, 139, 331, -73, 121, -41, 251, -41, 29, 216, -88, 34, 98, 86, 41, -34, -80, 39, 136, 161, -121, -66, -91, -150, -88, 1, 113, 103, -14, 283, -184, 58, 127, -28, 242, 64, 117, 84, -107, 122, 21, 155]
2496A55j95j07J67j03K04j14o5j04L55q9j05p5J23J06j65J01m3j69Q8M1M7jN2
2519A04j5k00L32l48J1l1J34Q6K9k35N1J79j21K4L8p8J11j22R3m9o1O9p1k19K06
2544h3L1k05M64j04k3o7J60k58K64j39j99L55j90J10m7N7R3k40J96j01J03Lk04
2567b4J79k48J04r6p8M16k92K22j53l42M08j95J3L9n6J13o4K27j72J07j51Pl5
2590g1p7O2K85j29j96K9J50R0qj49o5qo2R3r7J24K31k21J24l16J22J52j08J67
2614A22k77J87K0r8K02j01OJ34l75P8m5K89j13J09j85J46J36k26Q4k94L49k06
2636e8k9j1K25k20Q2j34J37J88k65P7Q0k63J80k25K73j29J28j61J17o3l0M1J81
2659A21N0k51J3J2j01m1J58J97k44j22J19Q0K22l49R3j03K00j03jN8J70r5k85
$$ y = [155, -40, -147, 20, -83, 121, 7, -58, -162, 193, 104, -1, -76, 47, 153, -12, 89, 46, -123, -35, 6, 53, 52, 104, 89, -111, 221, -127, -116, -147, -13, 73, 102, -133, -82, 97, -24, 0, 38, -40, 71, -51, 42, -7, -68, 1, -70, -289, -83, -52, -257, 207, 103, 80, 13, 173, -85, 179, 40, -159, 196, 6, 116, 69, 126, 219, -21, 175, 74, 177, 180, -24, 155, -93, 11, -85, -163, 253, -39, 183, 30, -312, 96, -99, -86, -47, -103, 10, -54, 173, 1, 108, -43, -36, -71, -148, -86, 199, 70, -126, -97, 53, 143, 135, -14, -79, -87, -149, -56, -153, -29, 202, -19, 105, -211, -89, 63, -45, 122, -155, 32, 52, -46, 156, 55, 61, 195, -180, -102, -147, 142, 29, 138, -47, 99, 235, 9, 93, -201, 148, -58, -87, -98, 127, -93, -11, -145, -8, 180, -85, -8, 72, -191, -11, -236, 37, -92, 36, -125, -8, -71, -101, -60, 121, 171, -80, -67, -55, -156, -197, -39, 158, -86, -208, -89, -9, 213, -136, -43, -146, 54, -49, -50, 8, 178, 83, -202]
2682b02K26RK0L7J2k10l5J22l7O4J01j95Q4O4j69k1J50K8P1m5l7O0n0j76K18r1
2708bn6o6l0K07j63n4K5K4j71J63J97r6JR8k6j76mJ56L7k67K29M7k47J10L1J78
2734A45j01k9j33OjK28j63J34k00m5K78J9k71Q8J07p5J15mP3j56k8O8J28j76m5
2759c8J2O2k4j61L92m22L4K49o9r8O1J2K70k05O6k00j3p3J50q1j5n7K99k7j49
2784b5M7p5P8M9j13J20j1j29J09J79k44j56J74q1J56j11j59J61JK8k34J45K25
2807A34o8k62J95J18Jj77J51k13O6O7O2j90Q2P9J9J3l7j41m2J81k37L37k03J33
2831F8k19K67n6o4L29k11r8j28k0K5pn7N5J45J8J9j94K76j74k07M20l1k76K07
2855H7j12k6J81j63j23J72j13K16m9k86L06pm7q9J50J07Q7n10J96q4M5OJ20j15
$$ y = [-202, 24, 33, 53, 90, 102, -108, -143, -21, -58, 6, 107, -88, -4, 60, -109, -130, 20, 48, 119, 74, 37, 97, 47, -129, 89, -2, -58, -124, -154, 53, -110, -164, -139, -115, -286, -123, 74, -22, -21, 77, 51, -125, -129, 27, 64, -203, 26, 73, -174, -64, -33, 145, 44, 15, -118, -112, -113, 115, -48, 86, -114, -159, 119, 138, -133, -45, 62, -13, 102, 98, 171, 15, -13, 55, 183, 7, -38, -26, 36, 12, -149, 243, -179, -145, 104, 35, -63, -2, 10, 280, 75, 141, -59, -72, -145, 5, -76, -91, -148, 151, 124, -25, 22, -53, 25, 74, -39, 81, 70, -59, 50, 229, -15, -171, 3, -78, 78, -33, -192, -31, -30, -2, -236, -91, 134, 66, -196, -1, 117, 118, -59, 92, -121, -55, 12, 74, -116, -34, 45, 64, 77, 40, -101, -143, 38, -199, 138, -65, 68, -151, 116, 60, -4, 325, 114, 16, -112, -132, -107, -114, -171, -116, 29, 47, 66, -128, 148, -26, -233, 187, 156, -120, 87, -25, -51, 130, -33, -156, 16, -97, 119, 70, -216, 90, 83, 36, -53, 97, 204, 291, -219, -23, -107, -62, -56, 64, -51]
2879e1Q2M2N6j61p5K26k31kK42j20J40p1q0P7k52J80P5n5l94J66K10N9J59k74
2903e2K60p6j50Nk39K91k95M08p2j28j1K0P0J0j06J34k03L27l17Q4q9K01m3kO1
2928H8Q0O0j79J5j64O3R1j10K24j88j89K50j23J3R0P7j57J39j29K52p6N4j06k22
2952a47L25o2j49p7l0J65j10L0J06l0N4r4NN9k48J23M1O1k5j81K02N9n0j61J79
2977D5k11J95l7O7j31K53k21J0K07m1m6p2J03j09l3l9l7m6J87o5j76R1P3Q7L0
3002H4l6p8J3k33J79J27m5J11k41L04j31j22J12Q9r0N7j38k1j37L23k08K20k91
3025a52j07J47J06q8j50L96j97KJ30K0N4j63k1p4Q3k2O7p2p9L61j79r0J00L5k8
3050G9p8j92J57q3O1Q5j81J16K51j71n2p5P3R0Q6p6m4r5o8L73j05Rl49j18o3N27
$$ y = [-51, 31, 73, 129, -32, -107, 119, -112, -114, 128, 8, 148, 77, -3, 74, -178, 2, 77, 22, -372, -206, 4, 63, 222, -52, 208, 132, -18, -13, -252, 39, -256, 152, 80, -48, -59, -39, 31, 41, -65, 69, -134, 193, -124, -40, -129, 72, 29, 27, 88, 168, 228, 49, 64, -100, -37, 54, -56, 168, -20, -209, 41, -82, -69, 21, 98, -59, 80, -49, 203, 127, 181, 75, -147, 178, 116, -33, -110, -140, 25, -85, -55, 51, 21, 75, -19, -14, 45, -203, -80, -39, 22, -3, -184, 18, 77, 27, -134, 45, -166, 29, -8, 59, -72, 181, -40, -30, 177, 136, 90, 18, 121, 12, -21, -60, -97, -143, 44, -21, -197, -106, -33, 54, 84, 48, -30, -17, -250, -71, 56, 11, 122, -119, 185, 54, -68, 44, 133, 43, 100, -38, -59, -196, 127, -81, 139, -152, -259, -112, -6, -94, -244, 152, -45, -43, 87, 107, 161, -2, -23, -97, -14, -36, 31, -41, -120, 241, 62, -28, 72, 107, 79, 1, -191, -34, -117, -56, 29, -152, -36, 215, 44, -8, -83, -10, 80, 166, 90, 46, -49, -117, 256, 151, 160, -189, -307, -370, 157]
3076A57j90Mm7J33k20J80l7O0o5R0J00j51M4j8j95j5K02k9k4j3k3K40k06nR2l3
3102C1j34K75k04J24l7j41M3P7j6j23K5R2JJ38j24m9PJ24j55MK1R7M0j40r0K35
3128A21j22Oj6J02k34J70P9l5n8j11K16o0j07o9J2J6M3J32m7j26j1l9K07M9k13
3153i5M8M3QK7Qj61j2J00O7j87K30K6N8j80j89J78q5K33q4j26N7o2J94J09k41
3178c6O3j84J19q8J10R7L9q8L6lj97L22l73J99%k81K3L38r8j7%J2j4K8p0N7k8
3205c4p4J68r6P9N1j02l2R3l1O3J54k83n4jJ25j96J33J96j57n5Qr5N1P1K5M6k83
3232b30J25R1r8mR4R8Q5k40J69l3Qk28l9Q5Q6M1j37r4L70R8k87j31J50p3j1J05
3258@k93J69J89l3q7K2RQ1j14L8m4m8l9R6J64j88l1l7J34l9N8J72k83Q1p3K90
$$ y = [157, -33, -29, -76, 57, -163, 17, -20, 40, -25, 65, 165, 14, 58, 40, -155, -170, 32, 3, -21, -34, -57, 183, -23, -28, 64, 31, -103, 172, -32, 92, 55, -86, -43, 34, 18, -105, -80, 12, 13, 151, 27, -22, -15, 109, -46, -42, -21, 76, 116, -24, -114, 121, -1, 5, -11, 91, -143, 27, 106, 71, 13, -98, 118, 58, -49, -118, -106, -90, -47, 85, 38, -88, -99, -138, 69, 118, -95, -47, -4, 4, 31, 39, -122, -134, -34, 33, -154, 76, 102, 160, -20, -209, -31, -116, 117, 33, -93, -36, -98, 96, 205, -36, 27, -157, -38, -126, -16, 81, 120, 32, 68, 65, -132, 190, -183, 16, 16, -265, -242, 96, -2, -19, -19, -7, -21, 7, -63, -6, -34, -108, 60, -36, 43, 94, -8, -40, 53, 22, 85, 239, -44, -98, -99, 26, -170, -37, 159, 2, -53, -45, -140, -89, -18, 7, 53, -230, -105, -14, -112, -116, -22, 76, 161, -79, 90, 57, 65, -163, -202, -117, -31, 10, -127, -221, 149, 247, -40, -171, -21, -94, -105, 0, -293, -124, 65, 32, -55, -33, -24, 57, -57, -19, -63, -111, -150, -54, 110, -78, -109, -146, -12, -51, 7, 179, -104, -23, -96, 194]
3284A94m87K51R3N6r9l5Q3j6q3l5K78k84K7j43J76j26J88R4k03k1J65j50J06j02
3308g3J02J78k17l8r8R2Q6L5pr8k5j33J05J26o5M7O1k00P0j11R2J59L0Jj70p1
3334a22L06l79J74j2R0j34P9K3j92K21j43J42j02L8R7j06M3k41M00k47r4J74R
3357B4J7NK32l57J67j68j45M31k71M7K14k02l9l9j1J01L2J7p7l2O3M0q2J6j25
3382a42J97j65j13J50J65q6j22J31J1j14OJ02j42O8M5J93m1K6n9j0J3m48L46o5
3406e4J41K39k72r8M8P3q6J4N7k06J59j07l2Q6J75q9j6j58J68nj46J48Q7j93p9
3431a46Q5k3K16j07M1n3j15J19j6l9J02j73P6n4J21R1j21L9J66l26q3J90k6p0
3455a06q7oJ33m0P2K1k50K95j6m2J38r0N9j38k8K03j94P1j28J19J27k09P5q2J4
$$ y = [194, -293, -42, 51, 107, 8, -27, 56, 40, -43, -78, 200, -84, -57, -200, -24, -150, 38, 132, -71, -92, 73, -77, 29, -73, 29, 207, -10, -48, -146, -54, 32, 67, 60, -38, -63, -196, -91, 35, -30, 17, 78, -122, -52, -163, -71, 88, 118, 119, -51, -122, 184, -195, -21, -33, 57, -77, 2, 25, -167, 54, -89, 53, -49, -11, 86, -20, 23, -218, 182, -65, -159, 15, 24, 41, 46, 278, -79, 88, -80, -225, 206, -65, -18, 196, -6, -45, -84, -95, 6, 38, 55, -22, -54, 9, 49, -33, -17, -142, 55, -110, -223, -73, 92, 6, -116, 15, 26, -88, -82, 20, -122, -54, -9, 184, 143, 169, 110, 100, 113, -335, 11, -54, 87, 326, 54, -44, 4, 77, -9, 5, 62, -144, 15, -92, -124, -38, 137, 48, 32, -126, 42, 37, -109, 39, 126, -67, -146, -61, -84, 132, 25, 66, 13, -102, 17, 1, -38, 64, -109, -33, -87, 34, 125, 4, 43, 209, -117, -200, -10, -36, -106, -193, -199, -66, -106, -34, -13, -263, 32, 16, -26, 112, 22, 81, -57, -85, 118, -76, -5, -133, -14, 113, -96, -21, -103, -89]
3480h9O9K92l69K57k16j34J27J44j24J58k8J3M3K9k64J19lL6j50P3J19Q2j91L6
3504B9j7o0J17Q5k12J07N7o4r3K29l34K4K30j97J18k16J54r8J00K6p5j11L5K1
3528a45J08j15M9P9J23j61K13Pk81J55O3j20R4k5q8N4n6J52j62n3L05m24Q4K45
3552A01qn8k7j62m8K21K00l47k2j11K06j63L92l49Q1m2O9Q4j91L44j24J11j7n0
3576I0m0R9k47j3K03M5j82J5K6O7k16k6L61m9j62O3k1M0J04r8J24k03n5K06M4
3601A75k08K54j33j18J24J81k46J40K0j61m7J18r9m5M9J4n7J57O8l87K93r8P6
3624G0j43J54l2j43J3RN9J29k11K3K9mj18K84j84J15k15J67l5j60K72j57K05j12
3648A5j13K15k3j54l4K8J3K05k53K78k57Q3K5J27j72P6j52L2j37K6L52j32O2p5
$$ y = [-89, -20, 272, -97, 160, -56, -190, -63, 81, -43, 115, 87, 100, 143, 172, -92, 27, 24, 60, -90, -17, 102, 184, -7, 29, 12, -48, 69, 154, -58, 49, 106, 42, -51, 178, -156, -132, 98, -99, 19, -197, -43, -141, -41, -15, -90, -201, -166, -145, -37, -152, -103, -24, 99, -62, 151, 158, -123, 32, 95, -25, 69, 44, -44, 10, -46, 106, -56, -109, 196, -228, -144, 101, 93, 35, 8, -154, -202, 19, 219, -128, -150, -261, -55, -218, 174, -175, -94, -136, -67, 17, -174, 170, 46, 157, 140, 90, 50, 149, -98, -111, 92, 137, -45, -30, -4, 63, -153, -179, 182, 133, -29, 34, 13, 53, 157, 59, 183, -20, -75, 131, 175, -33, 221, 88, -30, 94, 275, 29, 169, 189, 28, -19, 99, 0, -45, 4, 18, -39, 118, 186, -201, 92, -6, 70, -73, 81, 49, -94, -81, -72, -13, 116, -95, -72, -43, -47, -165, 119, -65, 50, -165, 2, -33, -193, 79, -78, 127, 15, -98, 117, 94, -60, -94, -66, -53, 152, -101, 177, -80, 3, 28, 155, -17, 59, -93, -61, -198, -172, 180, 48, 110, 35]
3672C5K04k68j36Q6k11M14l50J97o6j74K04L6J63k29j3L5J36j43O2j05KN5J02
3695C6j83K87k90K10l0N4N1r9Pl23L0J66J63p0j69J68J61l71L3L46j67J16n4k31
3719a59Q6J69j49K12j70p6J43L0J09m33M86l52J89o6K24l97K8J66p8J54k16J93
3741I3k7j0k35J40J85k15J6l0K39J2k79k7N9K79k87J47n8J20j86oq7m4K47M8N9
3766A53j90Q6J33k24K05k22N8L4J53j92m4K04k2j25j25J22p0o2J08N5ok39K36
3789B6Q7k06J2K83qj92J3nO9j55N5J30j73j45J91Q3m0M2M0l3j84J83r4J23L2k14
3815h0K05o9P7m6m0k12K19q6J37l67J98J4o4r0L39k13K66k72Ok8P8k1Rn0J77j14
3841b7p4J08j03K30l33J62q8K56j56o0m1J26qP1j61K43m2j65O8K9j40J05k6J43
$$ y = [35, 239, -29, -165, -79, -290, 124, -226, -29, -95, -269, -65, -29, 134, -95, -108, -73, 63, -80, -18, -123, -121, -66, 36, -147, 140, -150, 60, 30, 84, 135, 36, 43, -280, -250, -84, 79, 9, -160, 8, 169, -202, -169, 177, 10, 126, 72, -159, -73, 96, -53, 159, -11, -87, 56, 86, 195, -238, 248, -104, 85, 19, 243, -154, -126, 40, -38, 116, -100, 93, 66, 56, -179, -39, 146, -69, -53, -83, 156, 168, -111, -138, -79, 200, -87, 60, 2, 122, -64, -70, -157, -201, 46, 94, 153, -37, 49, 182, -42, 163, -59, -1, 33, 186, -6, -50, 154, 132, 7, -118, 4, -66, -128, -20, 35, 29, -210, 26, 113, -93, -81, 202, 194, 2, 15, 10, 79, -76, -21, 109, -64, -209, -18, 65, 25, 67, 107, 74, -110, 73, -21, 102, 134, -80, 125, 56, 133, 87, 47, -165, 54, -32, 105, -262, -64, -50, -114, -204, 135, -78, 188, -84, -78, -106, -28, -49, -40, -90, 87, -27, -101, 7, -96, 134, -199, -37, -125, 131, -25, -85, -126, 0, -8, 63, -98, 145, 103, -62, 6, 35, -105, 0, -26, 117]
3865A17J70l97K58n42L74J9K07m71J95L9N4r8n8J86L3J9l8k0j06j2R7k43K38N
3889B6j06J79k16K09j59O7o8Q8q4J7J4K21k77J99j55R1j04M6m7J59k8j11K52l60
3913a47o6J89R1L0j57K39M8m13K1J91N1j77j9J72j6j31l5K98j94k48K88J82l64
3936a67J75m9lj80J60k8M3J14K2K6k96N8L41l19j17J04K09j41J47m6n4J47j77
3959c1mQ5k9J69l43L68k62j18J62p0k5N3J83r1p9J74P7k18J26k31N6m2j83M43
3983A70m4j08k7l1J92p6l96J02K56%m7j00P5K6L5O2l17K47P5k15K30j19l9K39
4007A90j63p1J59j86K30o8k70K16n4N8j20K24j70j87K27J06j07L3k12L03j98J27
4029F7k40K66L7j48Q1j74K36M3j50k5k3M0M3qK5j74p0k8K92lj49J47j9j6r4o8
$$ y = [117, 287, -110, 148, -394, -20, -1, 206, -265, -70, -31, 23, -75, -133, 53, 86, 105, 67, 47, -59, -71, 26, -217, 21, 26, -80, 99, -117, 92, -67, 0, -68, 20, -64, -47, -33, 188, -89, 110, -45, 46, -58, -12, -59, 100, 72, -39, 213, -147, -213, -24, 67, 97, -60, 179, 227, -186, -165, 26, 77, -100, -119, 53, 37, -94, -129, 169, -25, -273, 15, 197, -167, 8, -41, -44, -224, -64, -92, -49, 65, 87, 113, -183, -125, 216, -103, -220, -116, 93, -48, 99, 53, -1, 146, -31, -35, 50, 21, 190, -153, 215, -47, -165, -3, -73, -98, -45, 138, 47, -32, 142, 219, 1, 127, -104, -48, -90, -273, 170, 126, 18, -9, -40, 152, 76, -320, -218, 38, 38, -9, -109, -34, -8, 27, 89, -228, 19, 94, -121, 109, -10, -49, 190, 27, -44, 115, -71, 159, 91, -179, 37, -17, 41, -79, 145, -25, -212, 15, 121, 14, 47, -165, 138, -60, 67, -173, 93, 130, -18, 63, -111, 125, 168, 18, -7, -30, 10, 53, 45, 70, -104, -174, -202, 90, 87, -62, 85, 66, 50, -44, -112]
4055a12L8O5L02l68Lr1J39J17l28K07j89J49j6L9J05M1o5M3M3n8j3qj77J26R0
4080H2m9M3r3J10j50Q2KnL0M8j46qK9j76N4M14l84J26o8m6k39L02P7k51P2O2o8
4107a50M3J58O3j22p8l2R6j08L84J15l10m1%j09Q5J14j52r3K4L1m6KJ87J47k22
4132a4p0mJ07k17J42J03j53K18l55M32k18J81q2j24J89j11mK9r3J14J4k36J21
4155c1j9r5N9J85n5rm7O2j23K86j15Rj15j08J98j4m6N0j58M9J25j48J58nj5R0
4181A68l40J18N8j80O3J50J40j4j31l4Q4J89k42l4J28N6L1j86J90k10r4R3k08
4204b05K25j22j89L31q3pm4J58P1r3r1J46J0j18p4K43k37R1P3j94K68j46p2J55
4228I6r1l0j9J21p0J23j24K98j05j11p1R2k03J55k35J89j50J02P5p5P4j70J61
$$ y = [-112, -74, -9, 293, -75, -72, -163, -24, 93, -235, -28, -217, -68, -84, -45, 60, 101, 36, 79, 122, 64, 51, 43, -134, -8, 82, 33, 76, -17, 93, -57, 25, 27, 22, 52, 100, -46, -54, -25, -201, -147, 267, -117, 9, -59, -105, -344, -42, 35, -216, -144, -82, -150, -107, 51, 114, -8, -86, -118, -22, -130, 254, 369, 59, 18, 18, -91, -6, 108, -44, -137, -113, -82, -128, -126, 61, 208, -14, -84, -88, 19, -198, -56, 47, -106, 112, -243, 189, -29, 152, 70, -54, 135, 24, 20, 49, -44, 70, 84, -152, -31, -50, -145, -86, 99, 44, 35, -12, 50, -73, 213, 98, 107, -8, -116, 82, 68, 22, 72, -86, -37, 88, -60, 98, 93, 78, 168, -172, -54, 4, -176, -113, 37, 177, 163, 32, -2, 82, 271, 29, -5, 123, 179, 210, 24, 214, 4, -90, 3, -205, 20, -102, -291, 40, -43, -50, -94, 64, 135, 42, -49, 97, 107, -11, -85, 158, -79, 12, 85, -109, 159, 13, -59, 96, 5, -25, -44, 77, 7, 130, 6, 304, 199, 88, 17, 109, -94, 61, -174, 15, -135, -33, 42, -33, 41, -129, 32]
4251C2k44K42J02Ol38J75o9J28j88J3J67J38j28m4m0JK6j04pK17l47R6L45j73
4275FM6k04L65L9l77J28L8K7k8j49O0J06R0k01N9n1J10J5q5m1K19j53Q9l00K25
4300C3qj52J31N3m4j10J87j22l4L9M3j36J60l9N2O1q0L5j71K12r3j48J58j16l5
4325a24K19k8lj17K80m94K86q2o0J14q2J08j34N5q2q6J12L44k97o7R7QJ64r4J8
4350E5j09J59j10J82k13R4j32J01l8m8N2j90P4m1J31K0J23k07K0mK49q1k91J60
4374d4P7j81K88j92l4o0Q6N1R8j11q4j6J29J17Rl4kj29O0J08l2k05mN9j07J33
4400b0J11j76M7Q5j40J31n2l4qJ5j07K04j06j2j03K19q8q1K30j56q3J83j86K68
4424A41j3j90L2j56J42N1J06l2n4m3l6R9j01k4L20k16O7k41J48k8n3J04j32N1
$$ y = [32, -212, 30, 132, 138, -200, -25, -94, 34, -154, -141, 26, 164, 36, -8, -48, -47, -21, -125, -132, 85, -262, -166, 179, 6, 52, -152, 213, 252, -125, 3, 41, 68, 40, -109, -49, 57, 147, -54, 5, -46, 64, 79, -6, -47, 172, 19, 108, -192, 33, 25, -127, 4, 57, 13, -97, 90, -32, -66, -27, 16, -120, 40, 1, 53, 114, 34, 69, -102, 110, 17, -131, 27, -89, -124, 95, 67, 64, -53, 227, -267, 19, -63, -123, -9, -91, 17, -117, -62, -144, -230, -118, 226, -71, -138, -41, -33, 131, 37, 55, -54, 105, -5, 177, -36, 58, -74, 27, -11, -59, -7, -197, -123, -164, -33, -13, 110, -97, -77, -81, 168, 87, -204, -44, 33, -148, 140, -52, -86, -146, -60, -9, 89, -22, -106, -122, 7, 124, 133, 99, 97, -32, 28, 136, 104, -101, -105, -46, -153, -20, 91, -85, -38, 47, -93, 38, -14, -48, -56, -41, -148, 56, -50, -62, -165, 54, -34, -115, 115, -41, -124, 59, -127, 141, 128, -62, -30, -186, -44, 7, 113, 81, 27, -16, -52, 47, -54, -78, 242, 26, 93, -148, 0, -28, -81, 23, -109, -58]
4448e8O0R9q3l9j29j4P3J57k3J4j32J58j20qnp3P4M5k3J71j33l3J61j96K74j29
4474H8q6N3NQ0j53L9r7R7n2N8P1j55k7m7R5M3r1j20P1J4K76j65J14n8j08j23K57
4501G9l01L46m6j93N3Mk8j03P4K47k45RO9L03k09j44m4K24r6M0j5q8K9q9M5KN
4528g2J44p6L37n14J70L0R4J68j29J0k55J07N5kn3k9j42O2K58K3j87M2o2J72l62
4553b11L04l19L31L5j88l4N5J8L7n9J5K27j6j42J2j7j47J03o3J44k43K67n8J50
4577B01l68K79j9m9Q5j00j9O5L1J34k78j0J02l0N2j41J8p3J96j65J30j00O2j11
4601a08K22J64k04k07J54R1kj86K74j57M3m2k60K65K9m9j04J77j71P6K9r4J00
4624D0q4m1M9J32k16q7K85j01M3k30K76j26j6O3Nj56Q6k4J55j27qL7j17O4K41
$$ y = [-58, 2, 101, 18, -21, -150, -164, -91, 66, 43, 57, -75, 83, -37, -45, -50, -123, -49, -4, -27, 144, 11, -22, 139, -57, 217, 88, 2, 55, 60, 140, -13, 26, -71, 26, -26, 32, 103, -52, -79, -126, -31, 12, -79, -199, -128, -114, 162, -3, 111, 53, -55, -178, 79, -222, 124, 78, -115, -62, -58, -86, -189, -115, 132, -113, -104, -35, 268, 59, -85, -129, 95, -1, 39, 24, -64, -35, -124, -79, -77, -72, 72, -4, 333, -181, -11, 19, 113, 281, 152, 162, -93, 14, 69, 67, 14, -15, -157, -95, 163, 186, -1, 41, -21, 151, -211, 93, -226, 105, 140, -48, -82, -27, -9, 28, -31, -16, 211, 195, 53, 65, 48, -99, 4, -59, 85, -158, 109, 51, 201, -167, 112, 93, 44, 129, 29, 10, 75, 106, 240, -38, -48, 54, 24, 76, -65, -47, -120, 76, -89, 41, -59, 3, -108, 114, 278, 74, -133, 21, 112, 110, -76, 198, 41, 84, 42, -218, 47, 76, 27, -77, 100, -71, 5, 34, -60, 40, -44, -85, -36, 96, -120, -207, 78, -23, 20, -210, 66, -60, -76, -13, -8, -164, -78, -102, 53, -74, -82, -45, -162, -98, 143]
4649A43j04p6N8P9P9q6J8l09K56N1L1Jn0j7m3j52O0k16L73r8k3oj55K16L7N1j49
4676c1j83P2J79j66K55l7M5j30K35j22j19j02K59j29k1j4O0k5R5k39j6J55j98
4699a77L16k11J74j14P0Rk04L0O1R1lj07Nj17M5K27r9k2q5Q4O4l06J71J44n1J21
4725A16O9j07j95J53J54n7j01q0K3l3J42k04K64P7k71J69L3k5m8J13k52Q8l4j95
4749b01J19J37k51J91j9q7q9J21o5M4P4pJ40p5K1k02L69k96m6J34n9L5k05K80
4773F3k31J62o9J21j57J87N1j69J61l3J1n0L7j08j30N9p6J63q8j3K81l83K28n3
4797c6K2mp6j04M68l20q0J57mm8j20L7J36J98l06K5Q8l60O14k20j23N0q5N7M6
4822A2J15n6rj92J49j75N16k58o7K0l61L56Pj27N0j3k3n6J38K5L2j21j29K70k65
$$ y = [143, 39, -37, 21, 100, 179, 93, 111, -198, 58, 109, 140, 141, 91, 74, 31, -121, -61, -277, 96, -2, -25, -31, -186, 30, 67, 118, -31, -214, -142, 37, -129, 126, 89, 134, 4, 239, 117, -2, -104, 155, 26, 5, -9, 51, 26, 121, -118, -134, 21, -177, 139, -72, 102, -12, 58, 67, -137, -107, -46, 45, 42, -65, -60, -177, -132, 95, -4, -26, -111, -27, 37, -269, -98, 46, -5, 116, 185, 78, -117, 36, 190, 133, 32, -48, -25, -58, 84, -120, 144, 221, -50, 119, 152, 127, 79, 192, -60, 28, -6, -201, -82, 55, -196, -5, -24, -111, -200, -79, -144, -100, -26, -33, 107, 32, 53, -149, 220, -76, -122, 12, -47, -12, -217, 63, -168, -6, -75, 46, -111, 76, 127, -42, 119, 86, 97, 47, 84, -24, -154, -95, -171, -8, -96, -109, 172, -211, 17, -36, -14, -18, -94, -198, 270, -50, -130, 27, 23, -25, -145, -108, 28, 226, -80, -55, 33, -327, 287, 67, -56, -6, -91, -34, 12, 127, 71, 62, -130, 19, -156, 360, 102, 35, 55, -306, 50, 57, -70, -20, -33, -56, -112, 26, 51, 83, -38, -167, 103, -162]
4847a62L86j07l29rJ45N0K7m4J20m1j69K15j24L77m25%K62l22k2K03j60l8Q6L4
4871d7j29J78J4j86K42k22J7L18p3j48J17J41p8L9j36q0J43r2J4L0j53m4K32M
$$ y = [-162, 224, 117, -212, -221, -76, -26, 1, -43, 77, 36, -133, 82, -42, 335, -90, -90, 172, -150, -172, 31, -129, -167, -81, -47, -176, 2, 16, -170, 72, -150, -133, 185, 112, -36, 81, 222, 144, 183, 47, -33, 110, 18, 32, 62, -91, -135, 97, 101]
$$ [...]
8191f6
##END NTUPLES=NMR FID
##END=
