##TITLE=1H_Pr Q-5_1
 200.13MHz, CDCl3,
 8 sc
 
 5.2.2025
##JCAMPDX= 6.0         $$ Bruker NMR JCAMP-DX V2.0
##DATA TYPE= NMR FID
##DATA CLASS= NTUPLES
##ORIGIN= UXNMR, Bruker Analytische Messtechnik GmbH
##OWNER= pz
$$ XWIN-NMR		Version 3.5
$$ Wed Feb  5 16:48:59 2025 Russian Standard Time (UT+4h)  she@DPX200
##.OBSERVE FREQUENCY= 200.1313
##.OBSERVE NUCLEUS= ^1H
##.DELAY= (6, 6)
##.ACQUISITION MODE= SIMULTANEOUS
##.ACQUISITION SCHEME= undefined
##.AVERAGES= 8
##.DIGITISER RES= 18
##SPECTROMETER/DATA SYSTEM= spect
##.PULSE SEQUENCE= zg30
##.SOLVENT NAME= D2O
##.SHIFT REFERENCE= (INTERNAL, D2O, 0, 14.3821)
##AUDIT TRAIL= $$ (NUMBER, WHEN, WHO, WHERE, WHAT)
$$ ##TITLE= Audit trail, XWIN-NMR		Version 3.5
$$ ##JCAMPDX= 5.01
$$ ##ORIGIN= Bruker BioSpin GmbH
$$ ##OWNER= she
$$ F:/spectra/data/she/nmr/H-C/1/audita.txt
$$ ##AUDIT TRAIL=  $$ (NUMBER, WHEN, WHO, WHERE, WHAT)
(   1,<2025-02-05 16:47:36.45 +0400>,<she>,<DPX200>,
      <created by zg, POWCHK disabled, PULCHK disabled
       configuration hash MD5:
       00 E9 B6 7A A2 85 ED C7 34 08 36 98 17 FE 4E 26
       data hash MD5: 16K
       4E D4 80 F7 D7 3D D3 AE EB 19 2F 2A 7F AC D2 E0>)
$$ ##END=
$$ 
$$ hash MD5
$$ 53 C7 6B 1D AA 9F A8 17 D7 CE E2 C6 85 A2 EC 3A
##$RELAX= 
##$RELAX= 
##$RELAX= 
##$RELAX= 
##$RELAX= 
##$RELAX= 
$$ Bruker specific parameters
$$ --------------------------
##$DU= <F:/spectra>
##$EXPNO= 1
##$NAME= <H-C>
##$PROCNO= 1
##$TYPE= <nmr>
##$USER= <she>
##$AMP= (0..31)
100 100 100 100 100 100 100 100 100 100 100 100 100 100 100 100 100 100 
100 100 100 100 100 100 100 100 100 100 100 100 100 100 
##$AQSEQ= 0
##$AQ_mod= 1
##$AUNM= <au_zg>
##$AUTOPOS= <>
##$BF1= 200.13
##$BF2= 200.13
##$BF3= 200.13
##$BF4= 200.13
##$BF5= 200.13
##$BF6= 200.13
##$BF7= 200.13
##$BF8= 200.13
##$BYTORDA= 1
##$CFDGTYP= 0
##$CFRGTYP= 5
##$CHEMSTR= <none>
##$CNST= (0..31)
1 1 145 1 1 1 1 1 1 1 1 1 1 1 1 1 1 1 1 1 1 1 1 1 1 1 1 1 1 1 1 1 
##$CPDPRG= <>
##$CPDPRG1= <>
##$CPDPRG2= <>
##$CPDPRG3= <>
##$CPDPRG4= <mlev>
##$CPDPRG5= <mlev>
##$CPDPRG6= <mlev>
##$CPDPRG7= <mlev>
##$CPDPRG8= <mlev>
##$CPDPRGB= <>
##$CPDPRGT= <>
##$D= (0..31)
0 0.7 0 0 0 0 0 0 0 0 0 0.03 0 0 0 0 0 0 0 0 0 0 0 0 0 0 0 0 0 0 0 0 
##$DATE= 1738759655
##$DBL= (0..7)
120 120 120 120 120 120 120 120 
##$DBP= (0..7)
150 150 150 150 150 150 150 150 
##$DBP07= 0
##$DBPNAM0= <>
##$DBPNAM1= <>
##$DBPNAM2= <>
##$DBPNAM3= <>
##$DBPNAM4= <>
##$DBPNAM5= <>
##$DBPNAM6= <>
##$DBPNAM7= <>
##$DBPOAL= (0..7)
0.5 0.5 0.5 0.5 0.5 0.5 0.5 0.5 
##$DBPOFFS= (0..7)
0 0 0 0 0 0 0 0 
##$DE= 6
##$DECBNUC= <off>
##$DECIM= 32
##$DECNUC= <off>
##$DECSTAT= 4
##$DIGMOD= 1
##$DIGTYP= 9
##$DL= (0..7)
0 120 120 120 120 120 120 120 
##$DP= (0..7)
150 150 150 150 150 150 150 150 
##$DP07= 0
##$DPNAME0= <>
##$DPNAME1= <>
##$DPNAME2= <>
##$DPNAME3= <>
##$DPNAME4= <>
##$DPNAME5= <>
##$DPNAME6= <>
##$DPNAME7= <>
##$DPOAL= (0..7)
0.5 0.5 0.5 0.5 0.5 0.5 0.5 0.5 
##$DPOFFS= (0..7)
0 0 0 0 0 0 0 0 
##$DQDMODE= 0
##$DR= 18
##$DS= 0
##$DSLIST= <SSSSSSSSSSSSSSS>
##$DSPFIRM= 0
$$ [...]
##$SUBNAM0= <"">
##$SUBNAM1= <"">
##$SUBNAM2= <"">
##$SUBNAM3= <"">
##$SUBNAM4= <"">
##$SUBNAM5= <"">
##$SUBNAM6= <"">
##$SUBNAM7= <"">
##$SUBNAM8= <"">
##$SUBNAM9= <"">
##$SW= 18.0517328524113
##$SWIBOX= (0..15)
0 0 2 0 0 0 0 0 0 0 0 0 0 0 0 0 
##$SW_h= 3612.71676300578
##$TD= 16384
##$TD0= 1
##$TE= 0
##$TE2= 300
##$TE3= 300
##$TEG= 300
##$TL= (0..7)
0 120 120 120 120 120 120 120 
##$TP= (0..7)
150 150 150 150 150 150 150 150 
##$TP07= 0
##$TPNAME0= <>
##$TPNAME1= <>
##$TPNAME2= <>
##$TPNAME3= <>
##$TPNAME4= <>
##$TPNAME5= <>
##$TPNAME6= <>
##$TPNAME7= <>
##$TPOAL= (0..7)
0.5 0.5 0.5 0.5 0.5 0.5 0.5 0.5 
##$TPOFFS= (0..7)
0 0 0 0 0 0 0 0 
##$TUNHIN= 0
##$TUNHOUT= 0
##$TUNXOUT= 0
##$USERA1= <user>
##$USERA2= <user>
##$USERA3= <user>
##$USERA4= <user>
##$USERA5= <user>
##$V9= 5
##$VALIST= <valist>
##$VCLIST= <CCCCCCCCCCCCCCC>
##$VD= 0
##$VDLIST= <DDDDDDDDDDDDDDD>
##$VPLIST= <PPPPPPPPPPPPPPP>
##$VTLIST= <TTTTTTTTTTTTTTT>
##$WBST= 1024
##$WBSW= 4
##$XGAIN= (0..3)
0 0 0 0 
##$XL= 0
##$YL= 0
##$YMAX_a= 755515
##$YMIN_a= -788650
##$ZGOPTNS= <>
##$ZL1= 120
##$ZL2= 120
##$ZL3= 120
##$ZL4= 120
##$ABSF1= 10
##$ABSF2= 0
##$ABSG= 5
##$ABSL= 3
##$ALPHA= 0
##$AQORDER= 0
##$ASSFAC= 0
##$ASSFACI= 0
##$ASSFACX= 0
##$ASSWID= 0
##$AUNMP= <proc_1d>
##$AZFE= 0.1
##$AZFW= 0.1
##$BCFW= 1
##$BC_mod= 2
##$BYTORDP= 1
##$COROFFS= 0
##$CY= -3
##$DATMOD= 1
##$DC= 2
##$DFILT= <>
##$DTYPP= 0
##$F1P= 0
##$F2P= 0
##$FCOR= 0.5
##$FTSIZE= 0
##$FT_mod= 4
##$GAMMA= 1
##$GB= 0.15
##$INTBC= 1
##$INTSCL= 1
##$ISEN= 128
##$LB= 0.25
##$LEV0= 0
##$LPBIN= 0
##$MAXI= 10000
##$MC2= 0
##$MEAN= 0
##$ME_mod= 0
##$MI= 1.114404
##$NCOEF= 0
##$NC_proc= 0
##$NLEV= 6
##$NOISF1= 3.799351
##$NOISF2= 2.8
##$NSP= 1
##$NTH_PI= 0
##$NZP= 0
##$OFFSET= 14.38212
##$PC= 1
##$PHC0= -105.1826
##$PHC1= 8.992209
##$PH_mod= 1
##$PKNL= yes
##$PPARMOD= 0
##$PSCAL= 0
##$PSIGN= 0
##$REVERSE= no
##$SF= 200.129724274929
##$SI= 16384
##$SIGF1= 3
##$SIGF2= 2
##$SINO= 400
##$SIOLD= 16384
##$SREGLST= <1H.CDCl3>
##$SSB= 0
##$STSI= 0
##$STSR= 0
##$SW_p= 3205.1282051282
##$SYMM= 0
##$S_DEV= 0
##$TDeff= 0
##$TDoff= 0
##$TI= <>
##$TILT= no
##$TM1= 0
##$TM2= 0
##$TOPLEV= 0
##$USERP1= <user>
##$USERP2= <user>
##$USERP3= <user>
##$USERP4= <user>
##$USERP5= <user>
##$WDW= 1
##$XDIM= 8192
##$YMAX_p= 0
##$YMIN_p= 0
$$ End of Bruker specific parameters
$$ ---------------------------------
##NTUPLES= NMR FID
##VAR_NAME=  TIME,          FID/REAL,        FID/IMAG
##SYMBOL=    X,             R,               I
##VAR_TYPE=  INDEPENDENT,   DEPENDENT,       DEPENDENT
##VAR_FORM=  AFFN,          ASDF,            ASDF
##VAR_DIM=   8192,          8192,            8192
##UNITS=     SECONDS,       ARBITRARY UNITS, ARBITRARY UNITS
##FACTOR=    0.0002768,     1,               1
##FIRST=     0,             0,               0
##LAST=      2.2672688,     0,               0
##MIN=       0,             -788650,         0
##MAX=       2.2672688,     755515,          0
$$ Real data points
##PAGE= N=1
##DATA TABLE= (X++(R..R)), XYDATA
$$ [...]
1846C19o27Q43N3p71l67M65K13m70l56Q41L42o15n53M33P13k17o63N28P56j044
1866a77M2Q33k54r48M8R50M19j382j65J115n07p66N68K55m56P9M64K90o41j01
1886c34R00J51o66o2R8L99j94n32m9N79p20L0M66mo87l9R88M27j260m56J640R9
1908G74j144L65L95j35k19L06j63l13l77O66K10p29j00L8M19L82o37k60K88N7
1928a77O51j30m29K05L84k31K32q43J91M26k76j31L53o24O4K68Q1M5p40P3J040
1949D32j57m50R2K00M46k60q61L58Q54q79k14Q50n1p13j55M95L81q10m12J238
1969C84k6n52j9j83O57L95r20J42N69j41J23n60K88K42p58j75J002l2j407L70
1989f01P70N04j210m13R90P04n39r1o4J66J93m93RN78n69j14M54J84l04r20N60
$$ plain form
1846 319 -308 535 588 -183 -550 -85 128 -342 -698 143 485 -130 -683 -250 463 246 -417 111 867 -177
1866 -177 -135 698 444 -504 -456 494 913 -469 -634 481 -26 -792 -224 31 -425 -346 118 408 -233 -334
1886 -334 566 717 51 -11 87 486 292 -240 -289 290 -430 -400 66 62 -625 -664 324 751 -509 -965 675 774
1908 774 -370 -5 390 255 36 342 179 -134 -511 155 365 -364 -464 -426 -7 375 -262 -522 -234 -177
1928 -177 474 344 -85 120 504 273 505 -338 -147 279 3 -128 225 -399 -335 -67 14 59 -681 -608 432
1949 432 275 -175 -83 117 563 303 -558 -200 654 -225 -439 411 360 -353 -508 -13 368 -442 -854 384
1969 384 358 -194 -213 -396 261 656 -264 -122 447 306 429 -131 157 399 -359 -534 468 436 -971 -601
1989 -601 169 673 -537 -950 40 744 205 114 50 216 409 -84 -75 503 -66 -180 274 458 154 -766 -206
2010b06M84J8j062O33K49J12j75j67l0J06L79o91M74K4K44k60L7L36n65n14J89
2031c85O70P4q44j23J044o8j019j04Q67N90p46l08R13L04j194J22R99l73j006
2050e87L34Q34j7j014k61M25P32r42m8K79O72l4p74N10N29p26l68Q85k6o17N1
2071a63J015k02j142K33K47l10m59R77l48o51J246J11q59k26Q97N8j43l88R16
2090H09m66m90M02j11J26k06n71P84M34j023m77N50Q10n11j105J089R49j646J40
2109e13J330q2j323K70R02Q9j063l4J001m04k34j97L6K08l71k81P53L12p03K08
2129i6M28n0l96J31L70M8n49J94P95j235J45Q09o83n55P41j9k48n22L21P76o92
2150b87j34O28K38n27P4K44K20rn88K72M94m37p24K07Q89n12q73N92J091j243
$$ plain form
2010 -206 278 296 -766 -133 116 228 53 -114 -144 -38 341 -350 124 148 392 132 169 505 -60 -574 -385
2031 -385 285 359 -485 -608 436 368 -651 -755 112 702 -44 -352 561 865 -329 -207 792 419 -587
2050 -587 -253 581 564 -450 -711 -286 446 -496 -544 -265 407 373 -401 109 638 -88 -456 429 403 -214 -163
2071 -163 852 650 -492 -259 -12 -322 -781 196 -152 -803 443 554 -305 -531 366 424 281 -107 809
2090 809 343 -147 255 144 270 64 -507 277 711 -312 -789 -239 571 60 -1045 44 993 -653 -513
2109 -513 817 735 -588 -318 584 673 -390 -424 577 173 -61 -258 -222 -14 -385 -666 87 399 -304 -96
2129 -96 332 282 -114 17 387 435 -114 80 875 -360 -215 594 -89 -644 97 78 -170 -692 -371 405 -287
2150 -287 -421 207 445 -82 -8 236 456 447 -141 131 625 188 -536 -329 560 48 -825 -233 858 -385
2170c85p75J494M35j071m62J244M4r28K00P81m17o09Q10J56o11K02l49K61k93
2189b73k11M87j86p9J78p4K71j52l51O56J46m31j46P06pq68j00J006k30r86J73
2210d71J083n75r02N96P80o37l62K87O30m23l84P20J96n00j97L09K48K36j032
2229c98N64M77q07l35P16O5o64k51P03K71p32K90O20n98j92K02N13o03o9K44O51
2250F67r75j57N49L39o11k24K56K95l29n23Q58J43q71Q7Q28n1j45j85O09j14q31
2271c85J9R69n94k93N57n16j35J87r8K58O4l79P3K73J35m05J38K91K27m93l6M96
2293C53m69q3L40L7o76K59N29k78r66P66N11l41l10L65K38j40l40L2N35l27j26
2314i1K54K76n83O6K22L62l96n33L53K67l06j79K90k14O3J3M48J50n47K13K72
$$ plain form
2170 -385 -1160 334 769 -302 -764 480 524 -404 -204 577 160 -449 361 517 -94 108 -241 20 -273
2189 -273 -484 3 -183 -262 -84 -158 113 -39 -390 266 412 -19 -165 541 534 -334 -434 572 342 -644 -471
2210 -471 612 37 -865 -269 511 -126 -488 -201 429 6 -378 342 538 38 -159 150 398 634 -398
2229 -398 166 643 -164 -499 217 282 -382 -633 70 341 -391 -101 519 -79 -271 -69 444 -159 -228 16 667
2250 667 -308 -465 84 423 -188 -412 -156 139 -190 -713 145 288 -583 -496 332 281 136 -49 560 446 -385
2271 -385 -366 603 9 -284 273 -243 -378 -191 -289 -31 33 -346 -273 0 135 -270 -132 159 386 -107 -143 353
2293 353 -116 -199 141 178 -498 -239 290 12 -954 -188 323 -18 -328 37 275 135 -205 -173 362 35 -91
2314 -91 163 439 -144 -78 144 506 110 -423 -70 197 -109 -288 2 -212 -149 -136 312 462 -85 128 400
2335D00n12J6N17j89ok3j11om48O1O46l99l59N06Q9K86m53o90J104K10p87J03
2357d5N27l58j87j8M72k87l60L14L88l94k09j63J16L66l55j31J39M96j41j26p3
2378b9J53J92j69J65k30j32J44N36q29J82L8N7l10K56M1j02n15M91O82o57j67
2399b03N53qm75J97j3K02j99J59J32k28k88M2J12Q6j83n74M55N82k75l30j34N86
2421A96J29m39K85o3m3K49J82j74l82R7p7N1Q8l35M3L5J66K1j70k31L30K42k61
2444f1Q6j64N53J9n04K92mj67j60L9J28J76p77O24M10o15m76O92%o2J88l41M67
2467C43n1l68j38L15J57L5m44J21R3n30J79L53k93k63J49L58N7k84K5M28k42m1
2489d1J78l04K77K78l58kJ16m4j80k37L53J92q59N39N86o21j25L04j72L03l45
$$ plain form
2335 400 -112 -96 421 232 226 203 92 86 -362 -301 345 -54 -413 93 182 468 15 -675 429 639 -148 -45
2357 -45 482 124 -63 -81 391 104 -256 58 446 52 -157 -320 -204 162 -193 -324 -185 311 170 44 -29
2378 -29 124 316 147 312 82 -50 94 630 -199 -17 21 78 -232 24 65 -37 -552 -61 621 -36 -203
2399 -203 350 342 -133 64 51 253 54 213 345 117 -171 -129 -17 69 -114 -688 -233 349 74 -256 -390 196
2421 196 325 -114 171 108 65 314 496 322 -60 37 -40 11 99 -236 -193 -158 8 29 -141 -372 -42 200 -61
2444 -61 25 -139 414 433 -71 221 217 50 -110 -71 57 233 -544 80 490 -125 -601 91 91 29 217 -124 343
2467 343 292 -76 -214 101 258 293 -151 -30 63 -467 -288 65 -228 -491 -342 16 73 -211 -186 242 0 -41
2489 -41 137 -167 110 388 30 28 144 100 -80 -317 36 228 -631 -92 494 -127 -252 52 -120 183 -162
2510a62j0M03q1j6K6J8q9Q6m34L29L18m01j60J97j42p9k34K27L07J10Nn27j0Q57
2534E38m01J4%J47l00n2J91j10P3l70K07L95m10m65L06K58M3k59j34M58q1j91
2556a43K07l8K13n7K63j53j81l23K27L34l01l30L36m9j90L00m24J04j48L11J01
2577E9J13m1j91M9k13J85M9J42k5k76M02k00j87k93K09M2j23k65P84J24p79r2
2599e27P38j4j30m30N79L35q80M41N39l39n67J30N7J88l54N2K07L39p10J54O9
2620a23N1j94o2P31j41m42p0O16n03k9N17l42m7J96p4K89q46J77N08m62j47K13
2642a84o5K11j44p1N23l99k24N13K40j34l72L30K95n24n64O86K82r28K67L16j01
2663d7r8j18L68k5l19j11O00n5k53L4J72k73L18n93N21q4j58Q4K17j68j23k13
$$ plain form
2510 -162 -172 231 150 134 160 178 89 175 -259 70 388 -13 -173 24 -118 -197 -431 -204 103 213 218 -309 -319 538
2534 538 137 151 151 298 -2 -54 137 27 100 -270 -63 332 -78 -543 -237 21 64 -195 -329 129 48 -143
2556 -143 64 26 239 182 445 292 111 -212 15 349 48 -282 54 5 -185 115 -309 -205 -353 -42 59
2577 59 172 131 -60 -11 -224 -39 10 152 127 -149 253 53 -134 -427 -218 -176 -299 -564 220 344 -435 -527
2599 -527 211 197 67 -363 216 551 -329 112 651 312 -255 -125 -68 120 -234 -182 25 364 -346 -192 -123
2620 -123 -72 -266 -328 403 262 -180 -250 366 -137 -166 351 9 -38 158 84 373 -473 -296 212 -250 -397 -184
2642 -184 -249 -38 -182 -253 270 -129 -353 160 400 266 -106 224 519 -5 -569 117 399 -529 -262 54 -47
2663 -47 -145 -263 105 80 -239 -350 250 195 -58 -24 148 -125 193 -400 121 37 -121 -37 180 12 -111 -324
2685c24N46k87j05K82J22k64NL35r8n15K47M84j22m58K34M48n06l09J28L83k89
2706f3k16K64J13l21j54N65p9p7j63M73Q6k57l17J82L06j66p4m9M1k40N4JL71
2729B80n73o7N95P3n92J28M3J37p8J22K12j91k11K32P3m41J94%M18o05j96N20
2751G3q9l76J3L76K83m87J26N05k25l70J63N13k46k87J46L2j8m71P8K92Km41K47
2774a61L61l02l60L30M77l82j89N01K2m99M29L48m44l06K51M1j80k8J61k76k36
2795d42M8L22K26j37k49J78J86j01l01K30N02m31j63N41o9rp29M40J70m15j33
2816c36M65j16j54m9L76j53j55J6K64j31q4L24k6j45k96K24M30o46k27K53L1K39
2838A04k64l9K00j61l03N76J0l88K04M12j7l02k25Q08n88j17J49J36j27o1J84
$$ plain form
2685 -324 222 -65 -170 112 234 -30 -25 310 212 -303 -56 428 306 -152 82 530 24 -285 -157 226 -63
2706 -63 -279 -15 98 -223 -377 188 109 32 -131 342 428 171 -146 36 342 176 102 53 94 -146 -92 -91 280
2729 280 -293 -360 235 308 -284 -156 -113 24 -54 68 280 89 -122 110 183 -258 -64 -64 354 -251 -447 73
2751 73 -16 -392 -379 -3 280 -207 -81 424 199 -171 -8 505 259 -28 118 150 132 -339 -261 31 33 -408 -161
2774 -161 200 -102 -462 -132 345 -37 -226 275 297 -202 227 575 131 -175 76 117 -63 -91 70 -206 -442
2795 -442 -394 -72 154 17 -232 -54 132 31 -270 -40 462 31 -132 409 340 331 -398 42 212 -203 -336
2816 -336 129 13 -141 -190 186 33 -122 -106 158 27 -57 267 241 96 -200 24 454 -192 -419 -166 -135 104
2838 104 -160 -199 1 -160 -463 113 123 -265 -61 351 334 32 -193 615 27 -90 59 195 68 7 191
2859A91J2j86n23M68J9j73l80L13L79j6m79L24L14l73j87L61K25m31j69L23K42
2880B54o3m65O64m77j49J80R3m13M22p8J56l24K50j22K16R8l15J12k7K59l75J05
2902Ak9r9j99M14o7j27K1J12J49m36J34L99k0n28N79l4m6m7j12K37k41l89K37
2925i1M20m80P4k14M02K5k89Q1j14K46k05p3M39k26J95m4O2j21l82L56N0j58O8
2948B1r6r8J56J51j7j52j63J61L9r8j44K67K5m1j91J60L90k58j78K06l13J30j18
2971a61J34J58m65K30K78Kk47j0J52O4l4N4j09R9N2j41J22l70J62l9k0K86j42
2994E5k71J47l2j58K5N2J69r9L6j17O7Q9M12n90M95j07j40J6l8j7l8J31m47L13
3018d7j0j07k7L45k4m4j65O2K9J03k25L10m0J76j23j96J72m25jJ60K4N3k1L7k9
$$ plain form
2859 191 203 17 -506 -38 -19 -192 -572 -259 120 104 -375 -51 263 -110 -297 64 289 -142 -311 12 254
2880 254 191 -274 390 -87 -236 -56 37 -376 46 -32 124 -200 50 -72 144 242 -73 39 12 271 -104 1
2902 1 -28 -127 -326 88 21 -106 -85 27 176 -260 -126 273 253 -275 304 270 224 177 65 302 61 -328 -91
2925 -91 329 -151 -77 -291 111 136 -153 -72 -186 60 -145 -218 221 -5 190 146 208 87 -295 61 111 -47 21
2948 21 -75 -173 -17 134 117 -35 -198 -37 2 -96 -240 27 52 11 -180 -20 370 112 -66 140 -173 -43 -161
2971 -161 -27 131 -334 -104 174 176 -71 -81 71 135 101 155 46 145 197 56 178 -192 -30 -69 -89 197 55
2994 55 -216 -69 -101 -259 -234 -182 -13 -112 -76 -193 -126 -37 375 -215 280 173 33 49 11 -6 -44 87 -360 -47
3018 -47 -57 -164 -191 154 130 86 -79 -17 12 115 -110 200 160 336 213 17 189 -236 -237 -77 -53 0 -21 16 -13
3043a3L07m40J81J41k91l0L82k50L19k27q4K98l88q5L11k71J9K46l77p8m7L39
3065c8j01r5J15j37M7L44K29j66k63J48Q2R4L55m13n57J51QK68k18J70J20n86
3087d43J95K79J69n92K97J04P1j73k0J88J04j83j20J54J35J3m03N5L37k50j47
3108b30k65P75j29l13J13K80J04m81M61p5q9j53L91l66K4l13K91N9j58J80l13
3129b07R5K74J7J2j26L2m0q3Q2P8R0l41J04K09j0j51r8M8K50j48r1j21K71l44
3153a98n9J63p8L76m97J13M94l78J24JK42k27j82n9M03k10j20n4J89J64n06q2
3175c81P02p50J57K08L14o19M26j04R4O5K8j59P7k43L46R5j02J89l13j79j43N19
3197B27k73j30J43K33l22M03l55p1K58K58m87O3K16j51j06J18K7R9n38J01L81
$$ plain form
3043 -13 294 -146 35 176 -115 -145 237 -13 306 79 -5 293 -95 -180 131 -140 -121 125 -252 -330 -377 -38
3065 -38 -139 -234 -119 -256 -209 135 364 198 -65 83 165 259 614 201 -356 -205 -197 71 -147 23 143 -443
3087 -443 -248 31 200 -392 -95 9 80 -93 -113 75 179 -4 -124 30 165 178 -225 -170 167 -83 -230
3108 -230 -495 280 151 -162 -49 231 335 -146 315 240 151 -2 389 23 47 -266 25 84 -74 106 -207
3129 -207 -112 162 179 191 65 97 57 -26 56 134 224 -117 -13 196 186 35 -63 -15 235 87 -4 -125 146 -198
3153 -198 -257 -94 -172 204 -293 -180 314 -64 60 61 303 76 -106 -165 238 28 -92 -146 43 207 -299 -381
3175 -381 321 -429 -272 -64 250 -369 57 -47 47 112 140 -19 58 -185 161 256 154 343 30 -149 -292 227
3197 227 -46 -176 -33 200 -122 281 -74 -145 113 371 -116 -53 163 12 -94 24 51 150 -388 -287 94
3218I4J25o11L25J27j23j15J90Q5o3k21J53K64j00l64J6L87J14k77n8J90l09R3
3240g8K06k70m8j4L00k49J92R9j23j7m6K05kk40M54o11O30j83m15L24j67on8N7
3264f0J47k33k75M20M7J62n60O40k37q2j33M81j48k05K32j94L3j03q2K66J5Qm08
3287b69M47l5j71j89J61J38k48K35m6j02J42m2J14J03m52M56K9r4k62L10j77j88
3309a40J28J93l13k7L6J87o5J11ll6J0j85M6K04j86J91K2l24K47J24j13K1j42
3332a4j39R7P6j27P9K1M9l99K86K9K22k88Q9K9m0L2k9J23P9Jn15J58J73M5j05
3357f8K26q2m6L1R9l25L52j83j16L88l53L83l82p8K09m0p5oj43L78k43J84l22
3380b12J57J22m7k6J44j22j19L27p0j06k0J50L6j38j78Q8j04J33j11J04j81j84
$$ plain form
3218 94 219 -392 -67 60 -63 -178 12 97 34 -187 -34 230 130 -234 -218 169 283 6 -52 138 -171 -78
3240 -78 128 -142 -190 -204 96 -153 39 138 15 -2 -48 157 155 -85 369 -242 388 205 -210 114 -53 -59 -117 -60
3264 -60 87 -146 -421 -1 46 208 -352 288 51 -31 -164 317 169 -36 196 2 35 -68 -150 116 131 139 -269
3287 -269 178 143 -28 -217 -56 82 -166 69 23 -79 63 21 135 238 -214 242 271 177 -85 225 48 -140
3309 -140 -12 181 -132 -159 -123 64 -1 110 107 71 81 -104 -58 146 -40 151 173 -151 96 220 107 128 -14
3332 -14 -153 -56 20 -107 -28 -7 42 -357 -71 -42 180 -108 -19 10 -30 2 -27 96 175 176 -339 -181 -8 37 -68
3357 -68 158 76 30 61 160 -165 187 4 -112 276 -77 306 -76 -154 55 15 -60 -66 -209 169 -74 110 -212
3380 -212 -55 67 20 -6 138 16 -103 224 154 48 28 178 214 76 -102 -14 -118 15 -96 8 -173 -357
3402c57L79L36l57j47M90l5k44P7k64J76Q0m76k9L84k82P5K48j40q0p7K23J11
3424I1j14j74J53J56M6o6k58M02o6j97O6j6k65K43Q8j48K14j19k73J41K16k60
3446a40J43oR1O2j68j83J23K50j15J35j79m3M05k95lj84m8L70k30j63n3Q7K09
3469F5j61r7K09j30M42k20j4k43K24L9o1J47o1o0J9J30j75J30n97J58J37J33N4
3492F8j2j94L3J85k05J19r8N1l9R3l08N28j57l32K13J17n5J1L7j87J15R7o5p2
3516e7K33k49L15j87M54m57p3N7L39m44k3K72j31q4R5k29r8Q2n1J3L73k68J79
3539F1O8m09K46m2K43j57L54n32L38j48k61J68J8k5j1j84J26K78j88J5l07M39
3561I0K31n30J44j6R9j53L88k59Oj63L00q4j56LJ14j06R6o9J0K3m9K11j77j11
$$ plain form
3402 -357 22 358 1 -146 344 309 65 142 -122 54 134 -342 -371 13 -269 -194 54 -86 -166 -243 -20 91
3424 91 -23 -197 -44 112 158 92 -166 236 170 -27 39 23 -242 1 89 -59 155 36 -237 -96 120 -140
3446 -140 3 -3 88 150 -18 -201 -78 172 57 192 13 -30 375 80 77 -107 -155 215 -15 -178 -231 -144 65
3469 65 -96 -193 16 -114 328 108 94 -149 75 114 53 200 139 79 98 228 53 183 -414 -256 -119 14 68
3492 68 56 -138 -105 80 -125 -6 -104 -53 -92 1 -307 221 64 -268 -55 62 7 18 55 -132 -17 80 15 -57
3516 -57 176 -73 242 55 509 52 -21 36 375 -69 -92 180 49 -35 60 -169 -267 -185 -236 -223 150 -118 61
3539 61 129 -280 -34 -76 167 10 364 -168 170 22 -239 -71 -53 -78 -89 -273 -147 131 -57 -42 -349 90
3561 90 321 -209 -65 -81 18 -135 253 -6 0 -163 137 53 -103 -100 14 -92 4 -65 -55 -32 -81 130 -47 -158
3585a58K58J78m96J08L12l60J68k44J56J56j10L7k90K61J34j38k92R9N37l31j37
3606a52K72J76l24j6K25J9j82J37J17k25J33j41p7p3J04k58L4K62k53J49L23l68
3628a18R8j66p5L22J66j77J63N0k64k95M65n5J29k51q6K98k17Q6p3k05P2J15J47
3651A29r6K49j58k84L2J80Q3Pr5j14K84j43l83J32n2L22k69lK14j05L16k81M04
3674C69j72m18K66J23j36p5J07j44m8O3LK99k85j13R9N6N8j3q5J24j73J26k19
3697a88R1k6M30k04l08L67m2J58n77M67K62l94k71L39j5m78K16o6L58j43J09j67
3719h2M2l66L77j90K60K87m78j86K06L8j09K50j0o2jj56K38j19j0K01M4j44q4
3742e4O3N8p9J98k29L44n53K85rj23J59J27l10K04j14n8K01j60Q3p2LJ62j6Mk27
$$ plain form
3585 -158 100 278 -218 -110 202 -158 10 -234 -78 78 -32 5 -285 -24 110 -28 -320 -221 316 -15 -152
3606 -152 120 296 -28 -44 181 200 18 155 272 47 180 39 -38 -111 -7 -265 -231 31 -222 -73 250 -118
3628 -118 -20 -186 -261 61 227 50 213 263 -1 -296 169 114 243 -8 -94 204 -13 73 0 -205 -133 -18 129
3651 129 33 282 124 -160 -128 52 135 142 47 -67 217 74 -309 -177 -229 93 -176 -179 35 -70 246 -35 369
3674 369 197 -221 45 168 32 -43 64 -80 -128 -65 -62 237 -48 -161 -62 -6 52 39 -46 78 -95 31 -188
3697 -188 -97 -123 307 103 -205 162 120 278 -299 168 430 36 -235 104 89 -389 -173 -239 119 -24 85 -82
3719 -82 -40 -406 -29 -219 41 328 -150 -336 -130 -92 -201 49 39 -23 -24 -180 58 -61 -71 130 174 30 -54
3742 -54 9 67 -12 186 -43 301 -252 33 24 -99 60 187 -123 81 -33 -91 110 -50 33 -39 -36 126 110 114 -113
3767a13J56L2N7k21K93l31J61J63k84J67j5k41J4L23k62L8m1J9j03Q5j9J08K23
3790B09j39j10M3K61l14K97n7j9k91j60L37l60R8M48k49J06l0oN7j63r2L42k88
3813h0j58N3L39LJ09l15K77k18K8j00k3J22L4r4q9K16o9j68J86P1l27K65k46K77
3837I3P5k71J05L5K0j58m8j16J73Q1l3J8j68J82O8j6M1J7l2oL0qk61M33k77J1
3863a2j04K65k64Q1J93l26K18l20K07r7M67m23k7L35l15L31r9j47p5L0j38J39
3885h1K68k43K02l11J96o8j66J40O9j16M4k1M5J71k71R1k8K81J02k8k69J02q8
3908B1j02M05k16R7o3j06J63l47J27K22k06J21l21L24j42J85k71k6L00k76k53
3929c64M01j27j32N94l50l7R1R5k03p4J33j44J68NK31n23L05k35K78J73k78j07
$$ plain form
3767 -113 43 75 132 -89 204 -127 34 197 -87 80 65 -176 -162 161 -101 -63 -104 -85 -188 -103 -122 -14 209
3790 209 70 -40 3 264 -50 247 190 171 -120 -280 57 -303 -205 243 -6 100 70 64 121 -42 -134 208 -80
3813 -80 -238 -185 154 157 266 -49 228 10 38 -62 -85 37 71 -23 -112 104 35 -133 53 124 -203 62 -184 93
3837 93 168 -103 2 37 57 -101 -149 -265 -92 -11 -44 -26 -194 -12 56 40 81 98 66 60 90 82 -179 254 -23 -12
3863 -12 -116 149 -115 -34 159 -167 51 -269 -62 -159 308 -115 -142 193 -122 209 110 -37 -112 -82 -220 -81
3885 -81 187 -56 146 -165 31 -37 -203 -63 6 -110 -66 -87 -42 129 -142 -51 -79 202 304 276 7 109 21
3908 21 -81 324 108 205 142 36 199 -148 -21 201 -5 116 -205 119 -23 162 -109 -135 165 -111 -364
3929 -364 37 -90 -222 372 22 -15 76 171 -32 -106 27 -117 51 56 287 -236 69 -166 112 285 7 -100
3951a00J64j03j84J71K54r7k31J70J83k71J58k23K48j73M3K55l72K30j64O9Mk50
3973b19M8M03j60r6j94K31j26J97k13O5J56k52J35j76M75m57L85k49L0Q1n1M11
3995D24l84k36L98J5k31q0j36L56j33m0j54J37O1K9k50K91J48l04J5R0j45l5J31
4018c3J0j40K86m02L00k16K41k67O6J90M7p7N5o0O0j24J00N5J39k55K6M30k42
4041A89P8r2k83L09j07q2j11J41j49p4L09k38p2K39M6k81J94J24j93j95K53p2
4063f7j84L69j24k12K24o5P4k7k1J2Q7l94J41K02j89J96J5M7j74Q7K03n3qj52
4087a3Q4q9J10l12N3K98l32R0K21j81o4J43r4j13M36r0k17qQ8l26K27J26j03P4
4111HNPk98L90k78K00O0P4J18k82N9k4lJ48l01J36n0L5j59K61k54K3L23m76M5
$$ plain form
3951 -100 64 -39 -223 -52 202 105 -126 44 227 -44 114 -109 139 -34 9 264 -108 122 -42 27 31 -219
3973 -219 -171 232 72 -24 -218 13 -113 84 -129 -64 92 -160 -25 -201 274 -183 202 -47 -17 64 13 424
3995 424 40 -196 202 217 -14 -94 -230 126 -7 -47 -201 -64 -3 26 -224 67 215 -89 -74 16 -129 -164 -33
4018 -33 -23 -163 123 -279 21 -195 46 -221 -155 35 82 5 60 0 60 -64 36 91 230 -25 1 431 189
4041 189 267 175 -108 201 94 12 -99 42 -107 -181 128 -110 -182 57 103 -178 16 140 -53 -248 5 -67
4063 -67 -251 118 -6 -218 6 -59 15 -12 -33 -21 66 -328 -187 15 -174 22 37 84 -90 -3 200 147 139 -13
4087 -13 71 -18 92 -220 -167 131 -201 -111 110 -71 -135 8 -86 -199 237 147 -70 -78 10 -316 -89 37 -66 8
4111 8 13 20 -278 112 -166 34 94 168 286 4 63 39 36 184 -117 19 -31 4 -155 106 -148 -125 198 -278 -233
4136b33K15k5l6j31J76rj87K22K07k55J08m0j27K35K40n50L0P9L1K5j91M21j33
4159G2k9Q7k31k05K28P0q6J8R9L4N0K31k78J06l03L44j67qj63J2K70jj91L28n27
4184b40M30J10m63K90k33r1J52L07l41p5l9K19L55n51L88m02L96l67K98j08o0
4205b5O9j81Q0L07l19L5j5J40j11j00l0Q4P3j44J71O2l60K89L9j06J75k73P2R6
4229B8k56L88k56j7J16Ok0j2J30j35J76k73K13j79L45m16J53N6n1J78j09m5Q4
4252A04J04k13M0m5kJ09K01k19k17K61j95j57L67j15l4k30L39m19L55l9P8M5l86
4275b68L71j7J62m81L67J1o5N2M8j21o0LR5j74j51K30n0K0lj23K49q1j26K46p4
4300F0l7L4j08O0R8l80M06j4j20k71K28L8l7L2k66O53k32l75J26l5J16K39k34
$$ plain form
4136 -233 -18 -43 -79 -210 -34 -43 -230 -8 199 -56 52 12 -115 120 360 -190 -160 -81 -50 -25 -216 205 72
4159 72 43 130 -101 -306 -78 -8 -94 -76 23 57 107 338 60 166 -137 207 40 32 -131 -119 151 150 -41 287 -240
4184 -240 190 300 -163 127 -106 -197 -45 262 -79 -154 -193 26 381 -170 218 -184 212 -155 143 35 -25
4205 -25 44 -137 -57 250 -69 -34 -49 91 -20 -120 -150 -66 7 -137 34 96 -264 25 64 -42 133 -140 -68 28
4229 28 -228 160 -96 -113 3 9 -11 -23 107 -28 148 -125 88 -91 254 -162 -9 47 -4 174 65 20 104
4252 104 208 -5 35 -10 -12 97 298 79 -138 123 -72 -229 138 23 -11 -241 98 -321 34 -5 73 118 -268
4275 -268 103 86 248 -233 134 145 80 132 180 59 -1 2 97 -77 -228 2 -48 -28 -31 -154 95 14 -112 134 60
4300 60 23 57 -51 9 107 -273 133 119 -1 -272 -44 -6 -43 -11 -277 376 144 -231 -105 -140 -24 215 -19
4323a9K23k90J64Q2j32O8N3q5o2J83j40m0m15N96n71J58J91J22k49j11K36l6Q1
4346Gk00J35J26j3j20k6j15J63K61k87M48k29j16K10o3j87k82j8K43q0k0p0K75
4369D2J31k38%J99j74m5K1J42J42k73k04M6M6J80Q8j89K23l00r0K60K1l42O42
4392C28j74MPj67j72J58J63l66L81j57r7k6K79m18J89q5P0L99k61j52J8K14Pj51
4416ij45K20n5K40k22Lk88L30j62J32j09J13M2QL9k89j80N75j85k43J49J78J7
4439A59k53J97j69K30k53Q8L7j56J51j03j96K25j07J91k04L08j63L3L45m99J01
4460c8k42K79K2q5J50k35Q9L09j11k20R4qj23K08k96K01Q3%P5J78k43q7j06J19
4484A3p8Q7l30K45J21J06j14K9L4p2m3r1K88j94J09k1L0q7j24k7L65k75jJ28l3
$$ plain form
4323 -19 204 -86 78 160 28 96 149 64 2 185 45 5 -410 186 -385 -227 -36 86 -163 -274 -38 -74 7
4346 7 -193 -58 68 55 -65 -91 -206 -43 218 -69 379 150 34 244 181 -6 -288 -306 -63 -143 -163 -233 42
4369 42 173 -65 -65 134 -40 -85 -64 78 220 -53 -257 -211 -165 15 103 -86 137 -163 -253 7 28 -314 328
4392 328 154 158 165 -2 -174 -16 147 -219 162 5 -92 -118 161 -257 -68 -153 -83 316 55 -97 -79 135 142 -9
4416 -9 -154 66 11 251 29 32 -256 74 -88 44 -65 48 90 98 137 -152 -332 243 58 -185 -36 142 159
4439 159 -94 103 -66 164 -89 -1 36 -120 31 -72 -268 -43 -150 41 -163 145 -18 15 360 -139 -38
4460 -38 -280 -1 21 -64 86 -149 -60 249 138 -82 12 4 -119 89 -207 -6 77 77 152 330 87 0 -106 13
4484 13 -65 22 -308 -63 58 164 50 79 113 41 -2 -93 195 1 110 89 119 32 -92 -119 246 -29 -30 98 65
4509F5j90K46R4k09r1K22K3k34M8J8k9j47L07k23J15j03R1l79L62R5P6l68j3K03
4533b1J00l0J43l73J96R9j59k9o6Q1j00l6K36j87Q8L04r5k14J63j43j58mJ57K48
4557B00n36N28k34n9J01q9J66j04J94j40n5r7q1o6L69n8K3j62J70j04N3j04J02
4580A7j16m4P7j0JK81l9k90n9L97k30J36j70N9p5J57l8J30pj59J4J92j14l8J09
4605A81m6M6k44nJJ00Q0J65j19j25P7l2j33kPJ16J25j07Q4M7m38J19K02j25j69
4630a95O2R9K6j08J29J02r8L38m26R4j4p3K08j34Q4k56L3M0K52l86P3K23l08K04
4654c1l2J50q2L6J99l07J28j59OJ17O6j26J1j77J11q9J03J02mO6Kj27j42J82k9
4679b6j96L57p9pJ02Rq2k64M12l60J07k9R9K4j3j00n1J60k39R9J07j90L29l96
$$ plain form
4509 65 -125 121 215 6 -85 137 160 -74 -26 -8 -37 -184 123 -100 15 -88 3 -376 -14 81 157 -211 -224 -21
4533 -21 79 49 192 -181 15 114 -45 -74 -140 -59 -159 -195 41 -146 -58 246 151 -63 100 -43 -201 -205 -48 200
4557 200 -336 192 -42 -101 0 -89 77 -27 167 27 -28 -125 -206 -272 97 39 62 -100 70 -34 19 -85 17
4580 17 -99 -143 -66 -76 -75 206 167 -123 -182 215 -15 121 -49 10 -65 92 54 184 177 18 32 224 110 72 181
4605 181 135 181 -63 -68 -67 33 113 278 159 34 111 79 -54 -56 -49 67 192 85 169 216 -222 -103 99 -26 -195
4630 -195 -133 -34 -8 -116 13 115 17 355 -71 23 9 -64 144 10 94 -162 -129 -89 163 -223 -150 73 -235 -31
4654 -31 -63 87 5 41 240 -67 61 -98 -92 25 91 -35 -24 -201 -90 -179 -76 26 22 88 90 -37 -179 3 -26
4679 -26 -222 135 56 49 151 160 78 -186 226 -134 -27 -56 43 67 54 -46 -97 63 -176 -77 30 -160 169 -227
4703b27J55p5NL71k98J27J95m23P8k65L88j58K52k33n8K10J4j74l0J77K36k14
4725E3j21K89J12k61l11K85j07Q7j20J05j9R8j39L09m25j33K15n3R9K45k18J06
4747I6J6m22J57J18J8K02j55RQ8Pj30J93l0j06j64r2J41K07p5m7J38l75m7N73
4771C20m14J02J21k54L93l40L5j16M46o50J86J92J04p9j64O3p5L06l68L33k26
4792h5j30K08K51j88N3Mj34J28k01q8M71j58l87L27j89L54l82O1O1j4q2j25M60
4815B15j06j94O6q3P5k34O0L93R0m76lQ4J81J02k90M36m97J00N43n96m5L27m9
4838I9j31K27l30K24r1J64p6Mj4l07L17R8j17K5J16l24J93o6n1o2Q4q2l31K97
4862a34J6m8K9Q8o2K29j81O5Moj69J11K59k39j42M63n60M16j82R5j56jo7K32O6
$$ plain form
4703 -227 -72 -147 -142 229 -69 58 253 -170 -92 -357 31 -127 125 -108 -166 44 58 -116 -146 31 267 53
4725 53 -68 221 333 72 -239 46 -61 26 -94 11 -8 90 -49 260 -165 -298 -83 -136 -37 208 -10 96
4747 96 112 -310 -153 -35 -17 185 30 39 127 134 4 197 167 61 -103 -195 -54 153 78 31 169 -206 -253 320
4771 320 -94 8 129 -125 268 -72 -37 -153 293 -357 -171 21 125 46 -118 -55 -130 176 -192 141 -85
4792 -85 -215 -7 244 56 109 113 -21 107 -94 -182 289 131 -256 71 -118 236 -146 -85 -24 -38 -120 -245 215
4815 215 109 -85 -19 -102 -27 -261 -201 192 282 -194 -197 -113 68 170 -120 316 -181 -81 462 -134 -179 148 99
4838 99 -32 195 -135 89 -2 162 86 90 76 -231 86 184 67 92 208 -116 77 11 -40 -102 -18 -100 -431 -134
4862 -134 -118 -166 -137 -49 -111 118 -63 2 6 0 -169 -58 201 -38 -180 283 -277 139 -43 52 -104 -105 -172 60 126
4887A26l45K22q6j24L70J02l91o5L7L42j5j37r3J27j93L95j76j87l3QR7L8j8j58
4911a57K37Ln2j5q1J5MK96q3j95J37L0k65R3p9K35j93J87J13m53K25O0p9O9j32
4936h0j57K11kj8J81k63k6K3j46J57L8R6q2J47j4L1L8m37J53R5J06N0k21L78l05
4961d7j0J49j37k06L86l76K24n9J04J0J56j78m9j45N2L36j40k68j18L63m8mJ25
4984A20j19K76j96k33L13l26J10J96K6n32O02l43K41l1j84J71l44K98k6j4M8n4
5006ak09P9K7N5m3J51r3r2K95j14j61L31k11M0n5J58K8k3j54R2j7j03MJ24k14
5031a06J64j44J93k2J52j16r2q5p4J52J28r4j76N4R8m0J52j98J99j81J07J76k12
5054C5J2j69K46m87L24p1M8Q5k03Q5m1M54k53l0k66J46M2L01l40j05O6J95lj85
$$ plain form
4887 126 -219 3 -83 -207 163 265 -126 -191 -154 188 173 36 -57 70 -123 272 96 -91 -124 -116 -19 19 1 -157
4911 -157 80 83 31 16 -65 -50 -46 250 167 -28 109 139 -126 -33 -112 123 -70 117 230 -223 2 62 -17 52 -80
4936 -80 -237 -26 -28 -46 135 -128 -154 -131 -277 -120 -82 14 -68 79 65 96 134 -303 -150 -55 51 101 -120 258 -47
4961 -47 -57 92 -45 -251 135 -241 -17 -76 28 38 194 16 -33 -178 -126 210 70 -198 -316 47 -1 -5 120
4984 120 1 277 81 -152 161 -165 -55 141 167 -365 237 -106 135 104 -80 91 -253 45 19 5 53 -1
5006 -1 -210 -131 -104 -49 -92 59 -34 -126 169 55 -106 225 14 54 -1 157 185 162 8 100 83 -20 -16 108 -106
5031 -106 58 -86 107 85 237 121 29 -56 -130 22 150 56 -120 -66 32 -8 144 -54 145 -36 71 247 35
5054 35 47 -122 124 -363 -39 -110 -62 23 -180 -95 -136 318 65 35 -231 -85 -43 258 -82 -187 -121 74 71 -114
5078a14K2J51k5n5K82l49K9M5qj55K54J65j57l83J40j25K12m2K90l46J24jj08
5101a54m6L80j67j62L13m54M92l64J09P0k4J56o6K80k93k27J15j2O2K4J69L8n18
5124b79K99q4K80j40j33L3J21K24n50L46M8j77j64L08k19K80j35l7j54K69l08
5145a72r3J92j20J47L6Q5j8l08L81j70l6J26O4qq4J09K3j36j26j35L37k74n0L97
5169A67J24l97L82n18L53j56j02J86o4j78L11J55l63P4K05l24n6K2l1NL00j89
5191i4n8L16j63J41j99l7K53l35M35j22j36j63N0J32L1M6M4l08j3K00J6Q5L8j92
5215c3M9M6l38M35q3k93K84K61M8n47M51j98k89O1K70r1k63K68q4j22M6o5pJ45
5239d9J50p5p4K49r7L5M4j95j25n5L30n5j62o7L42j79N0j20K41N5l18J61k69J30
$$ plain form
5078 -114 -92 59 34 -21 261 -88 -59 -14 -22 -177 77 242 85 -298 -158 -283 -71 -113 177 -169 -45 -46 -154
5101 -154 -200 180 13 -149 164 -290 202 -162 -53 17 -7 149 83 363 70 -157 -42 -54 8 32 201 239 -279
5124 -279 20 -64 216 76 -57 -24 97 321 -229 117 165 -12 -176 132 -87 193 58 21 -133 136 -172
5145 -172 -265 -73 -193 -46 -10 75 57 -251 130 -40 -76 50 114 106 22 131 154 18 -108 -243 94 -180 -230 167
5169 167 291 -106 276 -242 111 -45 -147 39 -25 -203 108 263 -100 -26 179 -145 -201 -179 -210 -205 95 -94
5191 -94 -152 164 1 142 -57 -94 159 -176 259 137 1 -162 -112 20 51 97 141 -167 -180 20 36 121 159 -33
5215 -33 16 62 -276 159 76 -217 67 328 376 -171 280 82 -207 -146 124 33 -230 38 -46 -168 -122 -187 -194 -49
5239 -49 101 26 -48 201 104 139 183 -12 -137 -192 138 83 -79 -146 196 17 67 -53 188 243 -75 86 -183 -53
5263e3J26J6k40L87n12L39J27o4j82Q0lM0pj29nJ0q2P4J39j73J29j34J79k78L47
5288A31k01K0j09K03j94R0j5l1J72j4l43K71L1j5M6M9J13l38K24l20J93O3J54
5311A80m76M77j74p7J15r5Nn4j73L03j01M0j7pk95K42K04p3l56K68M6J34j81l3
5335i8Q1j10O9K64j23j48J18n1k19M64l11n8n7L18j4q8N1O2j01k17J69J79k63
5358h3M3j77N9Q6J24M9k85M4J61J28j94j3N3j44J85j28J20j21K06l17K52J49k53
5381e6J14m13L02K6j01K79O6j80j17N3j07K27k9R1j48k1J05k72M52l28nJ61r8
5404AM5k58K10j3k31J84j23l4L71m30K52%JP5J06L9m20K96j55Ok50M28q8k43K92
5429F1j31J83j73K5L28L2k79j36N8P6K33n32M89l5r3j4k33L11k16k03K43l19K59
$$ plain form
5263 -53 73 89 -151 236 -276 63 190 126 -56 24 21 61 54 -75 -80 -70 -152 -78 61 -112 17 -117 62 -216 131
5288 131 -70 -50 -159 44 -150 -60 -75 -106 66 52 -291 -20 11 -4 42 91 204 -134 90 -230 -37 26 180
5311 180 -296 181 7 -70 45 -50 -45 -99 -272 31 -70 -30 -47 -54 -349 -107 97 24 -332 -64 -18 116 -65 -98
5335 -98 -17 -127 -58 206 83 -65 53 2 -217 247 -64 -122 -179 139 125 37 88 150 49 -168 1 180 -83
5358 -83 -40 -217 -158 -72 52 101 -184 -140 21 149 -45 -58 -5 -149 36 -92 28 -93 113 -204 48 197 -56
5381 -56 58 -355 -53 -27 -128 151 217 37 -80 -27 -134 93 64 155 7 -14 91 -181 271 -57 -62 99 1
5404 1 46 -212 -2 -15 -246 -62 -185 -219 152 -278 -26 -26 -25 50 156 195 -225 71 -84 -78 -328 100 12 -231 61
5429 61 -70 113 -60 -35 293 325 46 -90 -32 44 277 -255 234 199 106 92 -141 170 -46 -249 -6 -325 -66
5452f6j15L48j72k9J03k14N6n4K32J50k38KJ68k45k9K50m5L02m14K00k32oK46
5475A98k04j0j6l4J74l49M86m02K87j30n8J4p2m6J82K7j12l4J82P6n2p2J26l62
5499b01K91q1l5j72Q3K26k36lK03j70K62j8k62M61m22L36l28j11L24k56l8Q8K65
5522B06l72L39k06L04j44j35J32j55M8JJ26k46m0R0K74j52j97J89j1k28N0K89
5544A62k18Kk45L30J41j41K17p28N20rq0J06k05J76j37J22J0j12L8K42k95L20
5566B16J65l98j12l3L7J41m1J09K06l52O6L7P0N5j75K8oj45K34k02J40j46M95
5589C89m97L12j33K7K33k45j87k27L73j28K30k3j85J95k11l8N81o99K68m8k5M7
5611Ij37K21o0KJ7J98l29J93J3k36k13J82K1O0K20k72J68j16Q0J7j40L9O9J3k16
$$ plain form
5452 -66 -181 167 -5 -34 69 -145 -89 -143 89 239 1 3 171 -74 -103 147 102 404 -10 190 -42 -48 198
5475 198 -6 -16 -32 -66 108 -241 245 -157 130 0 -58 -44 -116 -162 20 47 -65 -99 83 159 107 35 161 -201
5499 -201 90 9 -26 -198 -115 111 -125 -128 75 -95 167 149 -113 348 -74 262 -66 -177 147 -109 -147 -59 206
5522 206 -166 173 -33 271 127 -8 124 -31 17 18 144 -102 -142 -52 222 70 -127 62 51 -177 -127 162
5544 162 -56 -54 -299 31 172 31 248 -480 40 31 -49 57 -148 28 -109 13 23 -89 -51 191 -104 216
5566 216 381 -17 -129 -162 -125 16 -25 84 290 -62 4 41 111 166 -9 19 13 -132 102 -100 40 -106 389
5589 389 -108 204 71 98 331 86 -101 -328 45 -83 147 124 -61 134 -77 -115 466 -233 35 -13 -38 9
5611 9 -128 93 33 35 52 250 -79 114 127 -109 -322 -140 -119 -59 161 -111 57 -59 21 38 -102 -63 6 19 -197
5636a97R4K23K0j85P7j11R8N9N9l19K89mj27o5L68j68k01o4J8R3p0n7K49Pj96
5661a10L17l16N37m27Q0j07oJ84k2O9j16J62l03L5N3J9p5k20L12l39J31J5k57
5684c84N03k03J64P9O5k22J7Q2k49J96k5Q1j77j71J50k2J74j56K05j66J02p9n3
5707h9J13r0m2J31K47n06N74k89Q3J89k40J28j68j32J6K51o3j96j01J67j95J38
5729g4J13r5J26k64K57k40J10K11j91J5J35J5M9l16p0O7J43P2J74j71p7Q7O4p6
5753F4Q5j93j60N2J80J1r1M22k49M8j67j35J14j10K97j2m37M51q2r1O1%j26J75
5777A07l01J77l8J59k5k45Q7p1q3K54K8k61J62r5P9j52N40k37L16m74J70k25j02
5800b30K12J01j89K04N4l87J90J92r3K74l30l22J16J62J81m6J9J7J16j06k76K73
$$ plain form
5636 -197 -103 120 140 -45 32 -79 19 78 137 -182 107 103 -24 -89 279 111 -90 -154 -136 -43 -113 -170 79 86 -110
5661 -110 207 -109 428 1 81 -26 -32 152 130 199 83 245 -58 -23 30 49 -26 -246 66 -273 -142 -127 -384
5684 -384 119 -84 80 159 224 2 19 101 -148 48 23 104 -73 -244 -94 -116 58 -98 107 -59 43 -36 -89
5707 -89 24 -66 -108 23 270 -236 338 49 132 321 81 209 41 -91 -75 176 113 -83 -184 -17 -212 -74
5729 -74 39 -56 70 -194 63 -177 -67 144 -47 -32 103 118 167 -149 -219 -152 -9 63 237 66 -11 76 140 64
5753 64 149 -44 -204 -152 28 39 -52 370 121 169 2 -133 -19 -129 168 156 -281 170 88 -3 58 58 -68 107
5777 107 -194 -17 -55 104 79 -166 -79 -150 -233 21 49 -212 -50 -145 -66 -218 322 85 401 -73 97 -128 -230
5800 -230 -18 83 -106 98 152 -235 -45 147 54 328 -2 -324 -208 -46 135 89 108 125 241 135 -141 132
5822A32J43l07r2K67q3L1j89K2n6j15K39J84k22k07K19M6n8q1m0K48J83j17J15
5845B62l01N0j24J07M5L7L1Q0l43J94q8nK44k3Nj76J04R1k34J53kk20K70k39L30
5870B48j16l39q9K97J96l35J82m9K11j99j47L9L75k22j21J56K6l38J96j98L87
5891A60J23m58J96O4j12N1j28L32l50K76p7j44r5K10J69l06J47k53J65j24J61
5912Gk13R0r7K33N1J8P7O7m42J15LK2o5P8J37K8j6j01k13L15k61L43m14L56M9
5937A67j92Jm7J07K98l72J27l03M47m25J1K33m5r7J72j52K5k33K68P1j32Q5J63
5960A77j92K55k73K1J01N2r3j90J09M0R8j21n17M84n3O5L9k51J02P9J32n2k5R
5984dJ32j43O7j39k6Q5rj12L84k72m55N55k05K40j51O0P7p8j05L15k13k37R8M4
$$ plain form
5822 132 275 -32 -124 143 60 91 -98 -76 -132 -247 -8 176 -46 -253 -34 12 -46 -127 -167 81 264 147 262
5845 262 -39 11 -113 -6 39 76 107 187 -156 38 -50 -55 189 166 171 -5 99 190 -44 109 107 -113 157 -82 248
5870 248 132 -207 -296 1 197 -138 44 -5 206 7 -140 -101 274 52 -69 87 113 -225 -29 -227 160
5891 160 283 -175 21 85 -27 24 -104 228 -122 154 77 -67 -162 48 217 -89 58 -195 -30 -154 7
5912 7 -206 -116 -213 20 71 89 166 233 -209 -94 -91 -69 -134 -56 81 109 93 -8 -221 94 -167 176 -238 118 167
5937 167 -25 -24 -71 36 334 -38 89 -214 233 -192 -181 52 7 -90 82 -70 -45 -278 -10 61 -71 14 177
5960 177 -15 240 -33 -12 89 141 48 -142 -33 7 105 -16 -533 -49 -102 -37 2 -249 -147 -68 64 12 -13 -4
5984 -4 128 -15 52 -87 -113 -28 -37 -149 235 -37 -492 63 -142 98 -53 7 84 6 -99 216 3 -234 -136 -92
6008i2L09m86P5L95j18k68j47qL76P2k52M0J39j31J53n2r5o9k1J95m06L94Oj79
6032a70J75J81l45J49q4L15k31j89K00k4n7p3K57m42J98L2L09k20P4l7P3m28K98
6055c9Q7k13j37L12k47J01J74j72J03rj28q5K94N7oj20k7K67L8k33j32L83k99
6078c1R6k28N1K57j68J86k8n6k73M54k95MJ60k07o0J34m6mQ3J01k10K26J40m70
6102a84M01j31J83k15N2k8J26k28J35k68J1J96K11k53Q9p2K35l35k8OK00l50j8
6125b65K58q4K81k06n1k59O06m80J61j8J93K8j29P8m1l44J49k54K76k6K50K5l09
6148a61K8J2nj80M93j51m6J99j11%J69m8k74M17n76M06j66K4r9k79L75k7k06K29
6172B3J57M1k99k58L99q0K1M9Q1nk34K43n9J30j02j74Q7N1j58P2o3K88O2m83L78
$$ plain form
6008 -92 217 -269 -194 201 83 -185 -332 -340 36 108 -144 -104 35 -96 57 5 -90 -159 -180 15 -391 3 9 -170
6032 -170 5 186 -159 -10 -94 221 -10 -199 1 -23 -80 -153 104 -338 -140 -108 201 -19 55 18 91 -337 -39
6055 -39 48 -165 -302 10 -237 -136 38 -134 -31 -40 -168 -253 41 98 92 -28 -55 212 250 17 -115 268 -31
6078 -31 65 -163 -112 145 -23 163 135 79 -194 260 -35 -31 129 -78 -138 -4 -50 -54 29 130 -80 146 286 -184
6102 -184 217 86 269 54 106 78 204 -24 111 -157 -146 50 261 8 97 25 260 -75 -103 -97 103 -247 -265
6125 -265 -7 -91 190 -16 -67 -326 280 -200 -39 -57 136 164 35 113 72 -272 -123 -377 -101 -127 123 148 -161
6148 -161 -133 -121 -126 -306 187 36 -10 189 78 78 247 199 -75 342 -234 172 6 30 -69 -348 27 0 -206 23
6172 23 180 221 -78 -336 63 -17 4 53 134 129 -105 138 79 209 107 -67 20 71 -87 -15 -78 210 272 -211 167
6197A67k35R7L7j02J57k48P8M5j09J12J48k31L1j7K22o1m9k86L02j97N2J8Rj55
6221b15M4N26l77J79q4j40L7l0L0J21K3O6j76j18M7Q4k2P0l1j74O9J84L2j23N3
6246G5k5p5m3J58o2O6k36J84J8%p4m1J44k16Q2R9j50l5N0R7Q9j62M4q6p0K35L7
6273A03j87R2j76N3K75r3Qr2J66k21j46R3M2j7R2m6k0R8j4j74J69N9M5m2j49j40
6299b22K47p6K13l51J1K32l8Nr1j57K1J62n0O1q7LJ52j56K04l9l8M9p8K16l00
6324a07rM9Q4J87l74L5K16n04K40K05j50N4j13K02J19R1r0o5J79l89J27J13m38
6347c38L18k25O8O4J29P7j30Q3j35r1L11K11k76k13j72M13k57J51j5L1k01O8M24
6370B95m59J08j1J84O3l14K36k20J70k0Q2rj98J47rQ9k24K47l1P1P8k35l10K32
$$ plain form
6197 167 -68 29 66 -36 121 -127 -49 -4 -113 -1 147 -84 -53 -70 152 91 42 -244 58 -139 -87 -69 -60 -215
6221 -215 -171 355 -22 157 73 -67 -30 -60 -30 91 114 180 4 -114 -67 17 -5 65 34 -140 -71 113 145 22 75
6246 75 50 -25 -68 90 28 94 -142 42 60 60 -14 -55 89 -127 -45 54 -96 -131 -81 16 105 -57 -13 -99 -169 66 103
6273 103 -84 8 -168 -115 160 67 75 -17 149 -72 -218 -125 -83 -100 -8 -54 -74 24 10 -164 5 64 109 67 -82 -222
6299 -222 25 -51 162 -189 -178 54 16 21 -70 -227 -206 -44 -94 -33 -120 -117 35 -121 83 44 6 55 -23 193 -107
6324 -107 -116 -67 17 204 -170 -135 81 -423 -183 22 -128 -74 -187 15 134 225 135 70 249 -140 -13 100 -338
6347 -338 -20 -245 -177 -113 16 93 -37 46 -89 -180 131 342 66 -147 -319 94 -163 -12 -27 4 -197 -129 295
6370 295 -164 -56 -67 117 180 -134 102 -118 52 32 114 105 -93 54 45 134 -90 157 126 197 275 40 -270 -38
6394c8q1J94j52Q5Kj48K57k84K01J2k73L65k32N0R6m3j57J03q4R7L56n7j69q9
6418A1J75n7Qj98L40k61p7J93n6L4N4l7l5N3lj53r9O6L28l76J80j60L7rl9J13
6444C2J24l09J10q5j1K31l1j21o6M1n0j33L28p4j45MJ36J49k79J13J11j7l0J23
6468A51k93J04N0J10LL8k21k97L90j48j09M91l84r7K46l6P5k76K97j05K4K8j11
6491g0J51j51J17l07p1K06L70j9j99k66M72k83l79L55L3L50l72J31M1qp6j26N41
6514D40m68n1L2ok2nj82M55k98J99k7LJ47j55Q0j20L8K7J8j12R5j76O8J97k30
6539e3Q4l9l54L52k25J60R8j19N1O2j55J56P3P6j57q6P8L6J23j07q9m3K3K08m
6564A49l41j2K8K22J35l20j8J72j0n0PM1k30J13J59k0L7j36K52l42M62j54k14
$$ plain form
6394 -38 -119 75 -77 8 10 -138 119 -165 36 48 -225 140 -92 -42 54 11 -146 -43 -127 -30 326 269 100 11
6418 11 186 129 137 -61 279 18 -59 134 78 112 166 129 94 147 144 -9 -108 -42 286 -90 90 -70 -33 -42 -81 32
6444 32 156 -153 -43 -128 -139 92 61 -60 -126 -85 -135 -268 60 -14 -159 -155 -19 130 -149 -36 75 58 28 151
6468 151 -142 -38 12 122 125 163 -58 -355 35 -113 -222 269 -115 -212 34 -2 73 -203 94 -11 13 41 -70
6491 -70 81 -70 47 -260 -331 -125 245 226 27 -239 233 -50 -429 -74 -41 309 -63 68 109 101 25 -101 440
6514 440 -28 -79 -47 -53 -75 -80 -262 193 -105 94 67 70 217 62 142 22 60 87 105 -7 88 -88 -20 177 -53
6539 -53 31 -8 -362 -10 -235 -75 23 -96 -45 17 -138 18 91 167 10 -76 2 38 161 54 -35 -78 -55 153 149
6564 149 -192 -204 -176 46 181 -139 -157 15 5 -45 -38 3 -227 -114 45 25 62 -74 178 -164 298 144 -70
6587g0q8K27O5J0r7J4j69k8K4rK05Ok2k3q3J78j91l1J34m9R7j3L6j23l0O6k22
6614a86R4K6M9J90j15l0j1J12j14N8r0J65j2j19O2k35R5M9j53K08j6r6k25N18
6638B24K0j46J10l12J60l2L3j7k43K27Q1Lj08r4J40j99K93k30J47o8K2lq1l7J62
6663E2J55j3k31n1Q4o4R1R8Qo5k1q7K48j92K25j29j47J50n05L16J91k93J38J95
6687A53k06J23O9Mk27P3l0Lj00r3L43k13J38K46l05k2j40L61l49K01m4k47K74
6710A2j64J72j59R9k3P8j96K43O6k76L78j69n1J68k31K89r9j66J04o2n1K00j15
6733D7j35J1Q4j07r0J37j34o6J0L23j07J13n7j52J33P2j16ll3M0o8K15j76j36
6757a95P8J31K07O4k31l0O8l43J22J97k15P4Q0QJ61k59M5n2R9%jl41K09J01J58
$$ plain form
6587 -70 -158 69 134 144 47 61 -108 -136 -112 -121 84 90 68 45 -38 140 -51 -82 52 3 100 87 123 0 -30 36 -186
6614 -186 -92 -66 -17 173 58 28 17 129 15 73 -17 148 136 17 79 -156 -61 -12 -165 43 27 -69 -294 224
6638 224 244 98 208 -104 56 24 57 40 -203 24 105 108 0 -94 46 -153 140 -90 57 -11 11 8 -73 -110 52
6663 52 207 194 -37 -88 -4 -68 23 121 129 64 43 -44 204 12 237 108 -39 111 -394 -78 113 -180 -42 153
6687 153 -53 70 139 143 -84 -11 -41 -38 -138 -231 112 -101 37 283 -22 -44 -184 177 -172 29 -15 -262 12
6710 12 -152 20 -139 -40 -63 15 -181 62 128 -148 230 61 10 178 -53 236 137 -29 75 13 -38 162 47
6733 47 -88 -77 7 -100 -190 -53 -187 -253 -243 80 -27 86 29 -123 10 82 -34 -37 -70 -30 -98 117 -59 -195
6757 -195 -117 14 221 285 54 24 92 -251 -129 68 -147 -73 7 15 176 -83 -38 -90 9 9 8 -333 -124 -23 135
6782A35l37J17m0L61r8l74M90l15O7n3n4q2J15J10j3M1k49M37m24K01%R6j04J33
6806A60j76M51q98L09Q7j29L59k0K7k10J05l0j80j35m8L20L79n80L74j17N5j76
6828g3N3L5j99L21J7J96j97k02n7K74q3l82K81o3K80j4m31QR4K88Pl89L58J02
6852B24Ll8r9R7l73L16k53P8P0pK36l56J0K27j62j20J82NJ4q8N8k21M8N47m60
6877f2Q5o0j05L23j85k6J7J16r5k34K3P5j03M89j23k2P7j83q1J57j76p6M85k52
6901F4k39K94k1j56L73k11k85q4L70j70K10k86J90k68K73k08L23j52j37J25O7
6922G2l2j96L42n2j0k06n0q4K15J39k68K67k34K59R7n32M45j05j05M9Ok1J9R6
6946A11q1qk67N07l00M6M2j77L31j83k4J90q8k35R7J52j39%J62j24k38K98j2L6
$$ plain form
6782 135 -202 -85 -125 236 138 -236 254 -61 6 -47 -101 -183 -68 42 29 70 -179 258 -166 35 35 131 27 160
6806 160 -16 435 -463 -154 -67 -196 163 143 170 -40 65 35 -145 -280 -328 -8 371 -209 165 48 103 -73
6828 -73 -20 15 -184 137 154 350 153 -49 -106 168 85 -297 -16 -79 201 187 -244 -236 -142 146 153 -236 122 224
6852 224 227 189 90 187 -186 130 -123 -45 25 18 254 -102 -92 135 -27 -147 35 40 54 -34 24 -197 -149 398 -62
6877 -62 23 -37 -142 181 -4 -30 -13 103 8 -226 -203 -128 -231 258 135 113 190 7 -74 83 -93 -169 316 64
6901 64 -175 119 98 -58 315 104 -181 -265 105 -65 145 -141 49 -219 54 -154 169 17 -120 5 72
6922 72 40 -156 186 134 124 -82 -132 -216 -1 138 -130 137 -97 162 259 -273 172 67 -38 11 17 -4 15 111
6946 111 30 22 -245 262 -38 8 50 -127 204 21 -3 187 99 -136 -39 113 -26 -26 136 12 -226 72 60 96
6970I6%L8Q4j33mn7K35k37N1J07j16J64L7j93j82k4J32q9J87j62j87M37O0j61
6994H3k02q7N60m7l92K8K22j5k12R0p6J23j58J7J50%k33K91l30J51K2mP1k23K10
7019C9J24l00j1Q9jJ42j70R1j12J70j4p9K47k0m66J51R6j38K7j89N13k15J10p5
7043Ij30J03O1J98k50P0j04K46j77L5P5k76J69j3J33j32o6j00K14q1j86K22j86
7066a66P2L59l20J84o6j79L50l35l3K98l09K01k7K8J5j19R5QK26ol01Q1j21J43
7090G8k50J00K62Q2j12j59r4J64k90K14M6K29l17N5k02L6L66l56n0J13M56l15
7112E6L8j23Q9q5Q7l71M44k59K21q7Q2r1K87k47P6j21j98K50j62j67K24o1J35
7135A7J45k33N5k51J31o0K14n9J21j50Q5k15Q9Q6j8r6L68l49K50k6j65P3j30l6
$$ plain form
6970 96 96 134 218 85 81 24 259 22 73 180 64 228 265 72 -110 -134 -2 -91 96 -66 -253 184 244 83
6994 83 -119 -206 354 307 -85 -57 165 150 -62 28 -48 75 -83 -66 84 84 -149 142 -188 -37 -15 -19 52 -171 39
7019 39 163 -137 -148 -59 -60 82 -88 3 -109 61 47 -32 215 195 -271 -120 -24 -162 -135 -324 189 -26 84 9
7043 9 -121 -18 43 241 -9 61 -43 203 26 61 136 -140 29 16 149 17 -49 -149 65 -16 -202 20 -166
7066 -166 -94 265 -55 129 63 -116 234 -101 -134 164 -145 56 29 57 72 -47 48 56 282 276 -25 56 -65 78
7090 78 -172 -72 190 272 160 1 -93 71 -219 -5 41 270 -47 8 -194 -158 208 -148 -198 -85 371 56
7112 56 94 -29 60 -25 62 -309 135 -124 97 10 92 1 288 41 117 -4 -202 48 -114 -281 -57 -118 17
7135 17 162 -71 -16 -267 -136 -196 18 -41 80 -70 15 -200 -111 -25 -43 -139 229 -120 130 104 -61 12 -118 -154
7159a54J8rK57j5J1N5N3k97R7j09J99l6J02j65M4K8k95J95j8j56O2J10j01j7K1
7184a20L41l00M41l36j64L97k68J72k33o2M02l48j28M18l55K52J29o7l07J19m8
7205f5K1K61k69P8k3p8K30N4j66J00J41n77K83j66J3K91N3j49kO6o4R0p2j10j97
7230b57K11k5J73R4Q8k94j59rJ01K21K4l36O8M3K62j26n6j76J82J95Kk00j13K45
7254A58k73K04k80M22j00j95L2j26L43k83j75J14J42nO6j59Km7J1M86p8k5k58
7277b4J83k40J75J3k11J07l5j11K42jj69J69j3m1q0j75K38N5L1J02l4j20j42n5
7301a36Q4m6J31j94O9J16n9jJ03J93j50M%k17k56M38J50l02n0p4L6J74n9N8K8
7326D0K9j58J77KJ51j40Ql5m3m4m8j02j5K18j49J45k05K47j10M3j43P9J23k24
$$ plain form
7159 -154 -136 -145 112 97 108 163 216 -81 16 -93 106 70 172 7 51 79 -216 -21 -39 -195 -133 -23 -124 -141 -120
7184 -120 221 -79 362 26 -138 259 -9 163 -70 -132 270 -78 -206 212 -143 109 238 171 -136 -17 -65
7205 -65 -44 217 -52 26 3 -75 155 209 43 143 284 -293 -10 -176 -163 128 181 32 30 96 32 122 50 -60 -257
7230 -257 -46 -71 102 196 284 -10 -169 -178 -77 144 168 -168 -100 -57 205 79 23 -153 29 224 226 26 -87 158
7254 158 -115 89 -191 231 131 -64 -32 -158 185 -98 -273 -159 -17 -22 44 -115 -113 -160 -149 337 259 234 -24
7277 -24 159 -81 94 107 -104 3 -32 -143 99 98 -71 98 85 44 -36 -211 27 82 113 215 181 61 -81 -136
7301 -136 -52 -98 33 -161 -92 24 -35 -36 67 260 110 114 114 -103 -359 79 229 -73 -123 -197 -161 13 -46 12 40
7326 40 69 -89 88 90 241 101 109 74 31 -13 -61 -163 -178 40 -109 36 -169 78 -32 11 -132 -53 70 -154
7350a54J14J77jR9k16j92J92j9n5J06M3l93L13m5K01j83R0j23r3L48j31j99J57
7373C6J73m18J75K0j28K00R1K86l79m5O9n6j39L9J43k84J32J46k15j7O3m0K36
7396H8j12P3Nj9k05L62m05M32q5k01P6n4J82p4Mn5j03r0P3K1J36j98j50M40j01
7421D0o0nL35k64j36Q0J50l3k07o1O5M80l71K08j76j21Q5J87N5k30m2j08K73J48
7445B92ok81k37k8J56K14mJO4l87L05j32kL00j05k03k13LL34k64L00l01J27K48
7469A81j60P2J3Q5l25K36j11j68J54r4K25p3l57K57M36k51j32O0O6k32n8m9J95
7492c0L56l52j24L06o3J95l39L3J2R9Q6l34K29j14N9j58j11J57n8j09L04j07k4
7515h7r5L56k45j05L58%j45j07K38j98j8J70j45M0j6J27o3Jj42J73p6K62j42j99
$$ plain form
7350 -154 -40 137 136 235 19 -173 19 0 -55 51 94 -299 14 -31 170 -13 77 -46 -139 209 78 -121 36
7373 36 209 -209 -34 -14 -142 58 149 435 56 11 80 24 -115 -76 67 -217 -85 61 -154 -171 -108 -148 88
7396 88 -24 49 54 35 -170 192 -213 219 134 -67 9 -45 137 63 67 12 -91 -181 -108 -87 49 -149 -299 141 40
7421 40 -20 -25 310 46 -90 -10 140 107 -100 -161 -96 384 13 221 45 -76 9 196 251 21 -21 -129 144 292
7445 292 286 5 -232 -260 -104 110 106 107 171 -216 89 -43 -45 255 150 -53 -266 -263 71 -193 107 -194 -67 181
7469 181 21 93 106 191 -134 102 -9 -177 -23 -117 108 35 -322 -65 371 120 -12 48 114 -118 -176 -225 -30
7492 -30 326 -26 -150 156 93 288 -51 -18 -6 93 179 -155 74 -40 19 -139 -250 -93 -151 -260 44 -63 -87
7515 -87 -182 174 -71 -176 182 182 37 -70 168 -30 -48 122 -23 17 1 128 65 66 -76 97 21 283 141 -58
7539e8J82k11J12q4q9n1K28K4j3j23J71q7m1K93l56J04m8P6j42%j6N9P9j8K3o
7565HJ65k66Q5l8k09L64j88J59J37k60L4K41l20k65O1K48N0J67j00j45O1q5J55
7588E9r9P7j41J80k83M9L53j78K74k46k43J86j09J32q2J64j66K0K2p7J16np0K4
7612d3L15j80qp3L51l37J4q4p9K28j85k3K83k06j89J53JK20M5j5l95Q1k07N30
7636A97m74J97K06n7k27j14J22R9o9j25J72L89k81j58O33k47l5l2or0k4J77n9
7659A94l88J90j67J59j52P1K07j55o3J46m7J19k01J71r3p9l3k11Q2K48k45M26
7681A79j89n1L99n36K23j47j00M95j34k49P5K36Ql97L3M19l56K27k76p0l9Q7Q1
7704h2K01k75J35n2jO0j02N3pJ36J6r6J63k86J21P1N6k84qL60r1l21K83j30L23
$$ plain form
7539 -58 124 -87 25 -59 -148 -199 29 53 40 -83 88 1 -40 253 -103 1 -47 29 -113 -113 -129 -70 9 -9 14 8
7565 8 173 -93 -8 -46 -255 109 -79 80 217 -43 -9 232 -88 -353 -292 -44 6 173 73 -72 -11 -96 59
7588 59 -40 37 -104 76 -207 -158 195 17 291 45 -198 -12 -121 11 -71 93 -73 -53 -31 -108 8 3 -67 -43
7612 -43 272 92 84 11 362 25 39 -45 -124 104 -81 -104 179 -27 -216 -63 -62 158 203 188 -207 -126 -333 197
7636 197 -277 -80 126 69 -158 -272 -150 -51 -120 -245 -73 316 35 -123 510 263 228 196 190 100 76 253 194
7659 194 -194 -4 -171 -12 -164 -93 114 -41 -104 42 -5 114 -87 84 -9 -88 -121 -332 -250 -2 -247 179
7681 179 -10 -61 338 -198 25 -122 -222 273 139 -110 -35 201 209 -188 -155 264 -92 135 -141 -211 -250 -163 -82
7704 -82 119 -156 -21 -73 -74 -14 -116 -63 -70 66 82 -14 149 -137 -16 55 111 -173 -181 179 88 -233 50 -80 243
7729B43r3N1J1k02j25m2R5J27R9r0K7l6P7j0m03P5J19J69k91J23L33k09j09k8
7753h9J1jR1j25L18m98J01J12J85J29o8j31k81L54m2K36l15L6K48k31J5J97l96
7776a44K63k86K09jnj3J17j01j98m7K40m7J59n5J08m38K83k8L5Q1o7k1l5j79N0
7801a20J55L1r2k13K75j45q5K64j16k04M81j75j59P1L6J34n5k3L1M3k0m4j70K12
7825A12L84n65R4k93L41p4R2J76m34J34Q2j51j33N00l33O8j25K52k5r9l3l7Q1
7848A4k32K11Q0k54L62k80L0j67K18l1j84K29N2j66K02j0j23J28q9jJ34r6N3j31
7872e1oj71jM1L92J19l22p1p2K88Kk95R2k7M3KJ08k5J45m34K04KJ36n7J30p3j35
7899c6p4J26J20Oo2k05K42L2L33k53j59k49J14J3l02L52j0k7J94k51l5J93n5m7
$$ plain form
7729 243 150 201 212 10 -115 -157 -62 65 164 74 101 65 142 132 -271 -196 -77 92 -199 -76 257 48 -61 -89
7753 -89 -78 -79 12 -113 205 -293 -192 -80 105 234 166 35 -246 108 66 302 -13 23 271 40 55 252 -144
7776 -144 119 -167 42 41 36 23 140 39 -159 -206 34 -13 146 91 199 -239 44 16 51 132 65 44 9 -170 -120
7801 -120 35 66 -26 -239 36 -109 -194 70 -46 -250 231 56 -103 -32 4 138 83 60 91 134 114 70 -100 112
7825 112 496 -69 25 -268 73 -1 91 267 -167 -33 49 -102 -235 265 -68 0 -125 127 102 3 -30 -67 14
7848 14 -218 -7 73 -181 181 -99 -69 -236 -18 -49 -233 -4 48 -118 84 74 -49 79 -10 -11 123 27 80 -51
7872 -51 -57 -228 -229 -188 204 323 1 -70 -142 146 148 -147 -55 -82 -39 -37 71 46 191 -243 -39 -37 99 42 172 99 -36
7899 -36 -110 16 136 142 80 -125 117 149 482 229 70 -179 -65 -52 -354 -2 -12 -39 155 -96 -131 62 7 -40
7923d0n9J73l14L88j88J43j49K8N1k44K03J45k18J22J74j27j12m2j12K27j87N5
7945h3k08N6J27Q5J66j42J9k16J71j75K38J18N4j46r4j44n9J99k0O0Q6P4k64J1
7969h7M27k72J73J6p1j68j60K65k9k68K63j77J28Q7j92M8j66R0L3N1p3K41j62
7992cR8k66J65L5o1M1n2J21Q9N3j41J23m13K17J75k18M9k57R4K76K4n3j48k5O0
8017a7o4o0j97P19l27j70l0O5K21m09L38j96j3K4L50l48n3L12l70J36L10m04J57
8040b6j34J20J82k16K90j55k85J7L29k03j2J35j66k7R7M02j20j27j67n1L93l76
8062a00%j68L87l07K46j7K08N9k57j2r5l1J86k11k0R0MR8k75K02R6j78J86k26
8086a35L5J47l4j38oJ75k83L37j66Q6OJ0L8j01j23K38j52J12Q1l78K22j26R5L3
$$ plain form
7923 -40 -99 74 -240 148 -40 103 -46 -18 33 -211 -8 137 -81 41 215 88 -24 -66 -178 49 -138 -83
7945 -83 -291 -235 -108 -23 143 1 20 -196 -25 -200 38 156 210 64 -30 -174 -233 -34 -54 6 92 166 -98 -87
7969 -87 340 68 241 257 186 18 -142 123 94 -174 89 -88 40 127 -65 -17 -183 -93 -60 -9 -82 159 -3
7992 -3 95 -171 -6 29 -32 9 -43 78 167 220 79 202 -211 6 181 -37 12 -245 -151 125 149 96 -52 -77 -17
8017 -17 -81 -141 -338 381 54 -116 -146 -81 140 -269 69 -127 -140 -116 234 -114 -167 145 -225 -89 221 -183 -26
8040 -26 -160 -40 142 -74 216 61 -224 -207 122 -81 -93 42 -124 -151 -54 348 228 101 -66 -117 276 -100
8062 -100 -100 -268 119 -188 58 41 249 308 51 39 -56 -87 99 -112 -132 -42 -38 60 -215 -13 83 -95 91 -135
8086 -135 -100 47 13 -125 -131 44 -239 98 -68 18 24 34 72 -29 -152 86 -66 46 127 -251 -29 -155 -60 -27
8110b7kj94M07j90J54j94r5j14R4M76j13k5r3p2N9K00M0j74q6J19Q1m21K79j51
8134d2M4P7l30L38r1k9oJ18J10j69QJ07l01K96j01j96J08P5K09l61J46N0k3j10
8158g3Q1q5r7J11j07K93R2l39J28k85L47r6O5j64K42K58m18K20k58K92q8Qj56
8181b9j89K37J21k79L97k37j77M8K63q5
$$ plain form
8110 -27 -29 -223 184 -6 148 -46 -141 -255 -161 315 202 177 84 12 71 271 311 137 51 170 251 -170 109 -42
8134 -42 2 79 -251 87 -4 -33 -39 79 189 20 28 135 -166 130 29 -167 -59 16 225 -136 10 60 37 -73
8158 -73 8 -77 -174 -63 -170 123 215 -124 4 -281 66 -30 35 -129 113 371 -47 173 -85 207 119 127 -29
8181 -29 -218 19 140 -139 258 21 -156 -108 155 70
8191G0
$$ Imaginary data points
##PAGE= N=2
##DATA TABLE= (X++(I..I)), XYDATA
0@%%%%%%%qQqJ6k4L2m0M8n6P2q9J13j42J71k03K38k80L29l85M49n22O02o91P95
31D25r10J036j174J326j495J682j888K113k359K629k923L244l596L981m399M856
47B548n357N906o510P171p898Q705r601J0601j1725J2998j4455J6139j8109K0456
61A0869k3307K6852l1406L7500m6122N9338q2366J33724m52274K14586R08121
72G55515n86008o16035J78316M90394n8924j23726m8977j19628q1498L40562K15657
83C45648l14899l95691J88719M45891L8351m41195k09015K96229L17755j16891
93A54902k80328m8598J64325R1344J0305m7834j57070n9569K46753J52505k34282
104g547j91702J85268J61934j41276q5421J26095l9551j53040J51187K06026k08029
$$ plain form
0 0 0 0 0 0 0 0 0 -8 0 -8 8 -16 16 -24 24 -32 40 -49 64 -78 93 -110 128 -152 177 -208 241 -281 321 -370 425
31 425 -485 551 -623 703 -792 890 -998 1115 -1244 1385 -1538 1706 -1890 2091 -2308 2548
47 2548 -2809 3097 -3413 3758 -4140 4565 -5036 5565 -6160 6838 -7617 8522 -9587 10869
61 10869 -12438 14414 -16992 20508 -25614 33724 -48642 85082 -367192 -152606 755515
72 755515 169507 -446528 -268212 222182 163258 39532 -9445 -129073 -210571 129991 345648
83 345648 30749 -364942 -176223 269668 308019 -133176 -342191 -45962 271793 154902
93 154902 -125426 -174024 -9699 81645 91950 44116 -112954 -172523 74230 226735 -7547
104 -7547 -199249 -13981 147953 6677 -78744 47351 7800 -145240 5947 211973 3944
115C944k60680J92714L00124j38954k93126R5832K46275p5213j57247R6569P8801
126H9039j57965o0931K27395R7229k74008j55755K71148K00470k22475k27644
136b13497J45077K23418p5923j76661M5042R7655n6390j9465R5903k2154j43812
147a00807K5205J97539N286k23685m0266J97268M7096j40419l0115Q1140j1529
158F713m5591O9051L3767j26680l0908J61466L1209j55442k1724J29055J2432
169F3348j00598M364Q1612l4791p9069N6486Q3056n1364q8966K1744R3215P583
181E6620r2582k1126P4035P698n0778K6652N2337o3243p9476R6401J21338j16117
193A1759j49975J11646J54710p9844j31362L7850Q1251k0043j9479K6887m5377
$$ plain form
115 3944 -256736 -64022 236102 97148 -195978 -100146 146129 70916 -86331 10238 89039
126 89039 -68926 -129857 97538 194767 -79241 -234996 36152 236622 14147 -213497
136 -213497 -68420 154998 79075 -97586 -52544 45111 -11279 -30744 65159 43005 -100807
147 -100807 -75602 121937 127223 -96462 -136728 60540 107636 -32783 -62898 18242 6713
158 6713 -38878 30173 63940 -62740 -93648 67818 99027 -56415 -78139 50916 63348
169 63348 -37250 -32886 48726 13935 -65134 -8648 74408 23044 -65922 -44178 49037 56620
181 56620 -35962 -57088 16947 24645 -26133 519 52856 -10387 -89863 6538 127876 11759
193 11759 -138216 -26570 128140 48296 -83066 -45216 36035 15992 -3487 23400 -21977
204b1977n2471R2314Q6273r5402j14507N8606J27353m940j13190l4155P3594N1199
216E2697k0377m6115k3077J8153L7279K4898k2733p1618q104R7562L9614r6451
228a8272o9499P3878Q8878m6089q2825K8058N5247j7797j3907J7755j6617k7656
240b8846K9994M6520l6320o6608L6569P1897l5124o3941K6274M9677j8157l7275
252b5340K0265K8340k9433j5028L7281K617l5508L893L0118L12k6180l444K4912
265A2805j105k5353M920J9942k285k0005n738K6206R328l7356o362M3424L921
278B2342l8875K81L6469j998l5883J1203L3083k7834k3771L9983R548m4807l352
291b3611M1345K686l9975k239L5779j353k4465O051Q218m075O649J597q606j309
$$ plain form
204 -21977 -74448 17866 104139 8737 -105770 -47164 80189 75249 -37941 -72096 1498 52697
216 52697 32320 -13795 -36872 -18719 18560 43458 20725 -50893 -58997 38565 78179 -18272
228 -18272 -87771 -13893 74985 28896 -53929 -25871 29376 11579 -2328 15427 -1190 -28846
240 -28846 1148 47668 11348 -55260 -18691 53206 18082 -45859 -19585 30092 11935 -25340
252 -25340 -5075 23265 -6168 -21196 16085 18702 -16806 -12913 17205 17517 -8663 -12107 12805
265 12805 11700 -13653 -8733 11209 8924 -11081 -16819 9387 18715 -18641 -25003 18421 22342
278 22342 -16533 -16252 20217 18219 -17664 -6461 26622 -1212 -24983 15000 24548 -20259 -23611
291 -23611 17734 20420 -19555 -21794 13985 12632 -11833 -5782 2436 -1639 5010 6607 -1999 -3308
305c308L181P038M013j1693j1098Q719J9968n207l4719L514M0161q366l4317J3436
319h678K2109j3552r427J6452K461k2219N524L1638j2620l2436J5531K3521j1501
332F803j6467J436J1002M161q503m471J914K069L720k677k520M507l661K365J1902
347A1580r870j3847J4924J3070j2964j3315R108J2783j0125j0133J0160j495q688
360h812J0905M034j3652k853J2190Q537p966j2244O572J2532k241o632m324K020
374a934Q129j994m276R79p036j134J3283J333j3605p108R916J5021n461j6476
388a0363Q59J0505O669J225j0713o718Q659P851J612p276j4538K823J7776L613
402A1984j2975j3961L454J7306M765q453j2479p115J9408K3378j7806k8369P902
$$ plain form
305 -3308 -127 6911 10924 -769 -11867 -3148 16820 11613 -23106 -19592 20569 12203 -22114 -8678
319 -8678 13431 -121 -9548 6904 9365 -12854 -7330 24308 11688 -20748 -5217 18304 6803
332 6803 -9664 -8228 2774 6935 -1568 -6039 -4125 -2056 1664 -1013 -3533 974 -2687 -322 11580
347 11580 1710 -12137 2787 15857 2893 -10422 -1314 11469 1344 -8789 1371 -124 -8812
360 -8812 2093 6127 -7525 -10378 1812 10349 2383 -9861 -3289 9243 7002 370 -3954 -1934
374 -1934 6195 4201 -75 904 -6132 -7266 6017 7350 -6255 -13363 -3447 11574 6113 -10363
388 -10363 -9504 1001 7670 8895 -1818 -8536 123 7974 9586 2310 -12228 -9405 8371 11984
402 11984 -991 -14952 -11498 5808 10573 2120 -10359 -17474 1934 25312 7506 -20863 -12961
415a2961K6216N803j7308j2468K364P844J2747K928k4862j4110K1853J9461n960
428A1547k0099j6063J3869L2126L065l5837k1419L1299L4803k0828l1170O983
440a1724J4219O633P487j1843k4913R32L0195J4118k6538k4778J1279K4269J3034
453B2370j2939l6113j594M6367J6999l7983k4925K0900K5279m645j3392n138q472
466a3286N809K4875M32k8234j2725J4132K4524O811k7878k7060J7710M1787K099
479B8996m4554j5806L7692J8777k0562j1337K320k555M733J7864L632k9638k2484
492c2922K9104L6031j5891m2202p878M0532L1887k7791m0403Q067L2196J0843
504B1573j4781j6555m85Q487J0768R992j3417k9499O60L5541K2414k9248m4946
$$ plain form
415 -12961 13255 19058 1750 -10718 -8354 -510 12237 15165 -9697 -23807 -1954 17507 11547
428 11547 -8552 -24615 -10746 21380 24445 -11392 -32811 -1512 33291 12463 -18707 -11724
440 -11724 2495 9128 16615 4772 -20141 -19209 10986 25104 -1434 -26212 -14933 9336 22370
453 22370 9431 -26682 -28276 18091 35090 -2893 -27818 -6918 18361 13716 324 -4814 -13286
466 -13286 -7477 17398 17830 -10404 -23129 -8997 15527 22338 -5540 -32600 -14890 26897 28996
479 28996 -15558 -31364 6328 25105 4543 -6794 -4474 -7029 -2296 15568 19200 -10438 -32922
492 -32922 -3818 32213 16322 -25880 -33758 6774 38661 10870 -29533 -21466 10730 21573
504 21573 6792 -9763 -10248 -1761 9007 18999 5582 -23917 -23257 12284 34698 5450 -39496
517c9496J3921N2712O956m3448k7025K2655L7644J076k9824j5259J1790J9853
529A1555O059j2569j4354o413N852K8001J2348l9693l4058L4333N0807j8115o0078
542c6325j394N5079J7554l2008k1579N473J5515J0719k669j0695j1448q94K0476
555G804J8466j5142l7491o854M6568K9709m4774m1847L0768M1821q905l1418q483
568a9778J3145J3120R339l346k3877q907K4551J7397r031k1208j5404J3288L4106
581B3395M903m0448k7220L3530M3276k0659m5714L955L3559J2776j1084j7755
593g486o664J0064J5307M453j4828j8231N060K3239J3413j7336l4120K420M2404
606A7695J1558l7577k1471K5524K6904j2573k2178L967R195j970O698N294j3163
$$ plain form
517 -39496 -25575 27137 34093 -9355 -36380 -13725 23919 24995 -4829 -20088 -8298 11555
529 11555 17614 5045 -9309 -15722 -9870 18131 30479 -9214 -43272 -8939 41868 23753 -36325
542 -36325 -37719 17360 34914 2906 -18673 -13200 2315 13034 10365 -330 -11778 -12672 7804
555 7804 26270 11128 -26363 -33217 13351 43060 -1714 -43561 -12793 29028 20123 -11295 -19778
568 -19778 -6633 6487 15826 12480 -11397 -20304 4247 21644 12613 -8595 -23999 -10711 23395
581 23395 28298 -12150 -39370 -5840 37436 16777 -28937 -24982 8577 21353 10269 -7486
593 -7486 -14150 -4086 11221 15674 846 -17385 -12325 10914 24327 6991 -27129 -24709 17695
606 17695 29253 -8324 -29795 -4271 22633 10060 -12118 -8151 1044 -926 5772 11066 -2097
619b097j0725J1368J6770n786k0491j848J4670O815k664j0478p326R387J1441
632I036n141r111m58M880K121J786M502n053j2714O505J5806m642j4727j882R522
647D30Q781j875j1670q321P015J5795k174j8994J198J6045o15n069K143n847n972
662i130J1202J3954j0480k1015Q736K1136o014j5904j42N444M927L507o069q561
676h409K355J0897K602j0133l619N459K298L883K049j0979m963J3323N431j0215
690b1p727M998O159k047q44p05o185K149R713l117q093K750N163Q37r45j541k071
707a527o56M213M519o146n240M745L239j525k330l512J133M227J14j295k062r24
723c027L404J426o47q97l105K636O400l512m717J009J976J776r66m139l53K445
$$ plain form
619 -2097 -12822 -1454 15316 9530 -10961 -12809 1861 8676 6012 -4466 -11792 -2405 9036
632 9036 3895 -5216 -5674 -794 1327 3113 7615 2562 -10152 -3647 12159 7517 -7210 -9092 430
647 430 9211 7336 -4334 -12655 -5640 10155 7981 -11013 -9815 6230 5615 546 2689 -3158 -9130
662 -9130 2072 16026 5546 -15469 -6733 14403 8389 -7515 -7657 -2213 2714 6221 152 -8409
676 -8409 -6054 4843 7445 -2688 -6307 -848 1450 5333 7382 -3597 -8560 4763 10194 -21
690 -21 -7748 -2750 3409 1362 518 -187 -6372 -4223 5490 2373 -5720 -2970 2193 3030 2085 544 -1527
707 -1527 -2183 2030 6549 403 -4837 -92 3147 1622 -708 -4220 -3087 1140 1254 -41 -2103 -3027
723 -3027 377 1803 1156 259 -2846 -210 6190 2678 -2039 -1030 946 2722 1756 -2383 -2736 -291
739b91J386n35l586L75L304q44M22Q03m328K574N720k545m551J450L229K08k916
756a25j105J177k90K332m03o433J036O778k129m898J552L060J143j383j77m40
772c05j780M200L230o682j770N946J23l293m23j001j38K392J650l622m171M727
788i17N846n966l262M709J155q79J333j904j187K287J793j666l974J483M257k984
804A24k402K268j196m27K607j641k027J454K381L18k600j1K947p02m06J256l269
821a326Q56L949k246l299J151J698k34k008o88K180r01r5K093j695p09J641o3
838C04P27L74k620J011K950r41j884j133J008J162j140j65M35l021J308M347k758
855c6l320J533K479J087j117j555J99N55K592J128m959j519M284J414r38l073
$$ plain form
739 -291 1095 560 -3026 -2651 653 -191 231 1034 -3294 -720 5000 2455 -2096 -646 2583 2791 -125
756 -125 -1230 -53 -343 1989 1586 -4847 -3811 2967 838 -4060 -2508 552 1695 312 135 -305
772 -305 -2085 2115 5345 -1337 -3107 2839 2962 -331 -754 -1755 -1893 499 2149 -1473 -5644 -917
788 -917 4929 -1037 -4299 410 1565 686 2019 115 -1072 1215 3008 1342 -2632 -1149 3108 124
804 124 -2278 -10 -1206 -1633 974 -667 -2694 -1240 1141 1459 -1141 -1152 1795 1093 687 1943 -1326
821 -1326 -470 3479 1233 -2066 -915 783 549 -1459 -2147 33 -868 -963 1130 -565 -1274 367 304
838 304 1031 1405 -1215 -204 2746 1805 -79 -1212 -204 958 -182 -347 88 -2933 -1625 2722 -36
855 -36 -3356 -1823 656 1743 626 -929 -730 -175 2417 3545 -1414 -2933 1351 2765 1827 -1246
871a246k594L029L855k184l895q20L505L270k398j478j32j163L864L598n408m294
887d491L873N302j084n482j209L727K86m73M65l334j494L731K993o26n029l349
903f194P436N433n597n513K409N558K57m099m46J008k480L383L987n525n804L027
919c160O953O32p039m181N331N620k25m838m452M236N754j239l064k439p28N110
935B271L332m916n144N32N528K431l864k703j812J278Q193J164j1963l436J2274
950C165O664q326q560M963P323l000k657K049k749k532M839M042k664q845k301
965h589J1603O637j0873r712P329J3078l249j3176J855R209j530l248L741j291
979A784n785J173Q127M41j0257l836R382N543m090o810k586P159O488m821o522
$$ plain form
871 -1246 -3840 -811 3044 860 -3035 -3855 -350 2920 522 -956 -1088 -2251 1613 5211 -197 -4491
887 -4491 -618 4684 3600 -1882 -3091 636 922 449 914 -2420 -3914 -183 2810 2184 -2845 -6194
903 -6194 1242 6675 1078 -4435 -2026 3532 3789 -310 -756 252 -2228 1155 5142 -383 -6187 -3160
919 -3160 3793 4425 -2614 -6795 -1464 4156 3931 -907 -5359 -1123 4631 3392 328 -2111 -2839 2271
935 2271 5603 687 -4457 -3925 1603 4034 170 -2533 -4345 -3067 5126 6290 -5673 -9109 3165
950 3165 9829 1503 -7057 -2094 5229 2229 -428 1621 -1128 -3660 1179 5221 2557 -6288 -8589
965 -8589 3014 9651 -1222 -10934 -3605 9473 6224 -6952 -5097 4112 2582 -666 3075 1784
979 1784 -4001 -2828 5299 5740 -4517 -8353 1029 6572 2482 -4328 -6914 245 6733 1912 -4610
994d610M00N859M363l708m954R25K516J193N30k006j702k266J448P937n31j2538
1010g144k643J3187O246j0556j0222R178J1664o257q536L551M132k433j341M028
1024B854K224q688m181J1747O008j3164r425J0928J2854p044j3979M708J1116
1037E958l209n262K242O42j449J294M605j595o736j07O192J786l492m565j441
1052e137O189M929n330n858R87N881K416m449m185L053M334J656l997k964L286
1067H11M14l335L342L590o776m900Q414P293r770j1092R182J2652p487r764N539
1082a887O682l742l930L214L202n245j801Q096J579q759l656O909O161n682q141
1097g000M253P489k547n133R74J970n61M0K800q05m799J775O360j809n213O74
$$ plain form
994 -4610 -4210 1649 6012 2304 -2650 -1725 791 1984 2514 508 -1194 -3460 -2012 5925 5394 -7144
1010 -7144 -9787 3400 9646 -910 -11132 -1954 9710 3453 -5083 -1532 2600 167 -1174 2854
1024 2854 5078 -3610 -7791 3956 9964 -3200 -12625 -1697 11157 4113 -9866 -5158 5958
1037 5958 2749 -2513 -271 371 -1078 216 4821 3226 -3510 -3617 2575 4361 869 -3696 -5137
1052 -5137 1052 5981 651 -5207 -4220 1661 4077 -372 -4557 -1504 2830 4486 489 -2475 811
1067 811 1225 -2110 1232 4822 -1954 -6854 1560 8853 -917 -12009 -2827 9825 2338 -7426 -1887
1082 -1887 4795 1053 -2877 337 3539 -1706 -3507 4589 6168 -2591 -6247 662 6823 1141 -7000
1097 -7000 -2747 4742 2195 -2938 -1964 6 -555 -515 2285 1480 -3319 -1544 4816 3007 -2206 -1532
1113a532K748N36j484m41L14k058Q29M479k181o348J458O636R38o387j288O452
1129B671Q09n845J492M227l513k990M404M127n468n816N429N536n209n172L843
1144a475L901j284l441J023L046k022k316L766K153m144k476M643L797n363m917
1159e109O100L492o502j588N664k80n372J858M964k625n765M096N538m595l019
1174c143M148K025k789j099J328J309k328n09K908j93k961p53K348J507k734k793
1190c729M043K705m718q89L820N29l062j93M527p30n279K857M438m029l885M298
1206G03K385l698k821L359K602m050j621M317M35l293o1K970P20k575j296M438
1222B514J98m976R23L825j059l267K62L813j096m302K026L661k850k357K280J966
$$ plain form
1113 -1532 1216 1752 268 -173 141 -1917 -1088 3391 1210 -5138 -3680 2956 3894 -2493 -3781 2671
1129 2671 3480 -2365 -873 3354 -159 -3149 1255 5382 -86 -5902 -473 5063 -146 -5318 -1475
1144 -1475 2426 1142 -2299 -1276 1770 -252 -2568 1198 3351 -793 -3269 1374 5171 -192 -5109
1159 -5109 991 4483 -2019 -3607 2057 1777 -3595 -1737 3227 602 -5163 -1067 4471 -124 -3143
1174 -3143 1005 3030 241 -858 470 1779 -549 -1058 1850 1657 -1304 -2057 291 1798 -936 -3729
1190 -3729 314 3019 -1699 -2588 1232 1761 -1301 -1494 3033 2303 -2976 -119 4319 290 -3595 703
1206 703 3088 -610 -3431 -72 2530 -1520 -3141 1176 1611 -1682 -1743 1227 1947 -628 -1924 2514
1222 2514 2712 -2264 -1341 2484 1425 -1842 -1580 2233 1137 -3165 -1139 2522 -328 -2685 -405 1561
1238A561j042k362J351K930k199k131K814J193j821j507J819J818k982k437M089
1253A094R03m138Q5L984j079l240Q12L369q28l348K540K822l298j163L349m86
1269A378j716n44J747O99k314p54K281n6k039m67J733J225j823j318K694J064
1285A790k962r5K870l33k219j74L333k31m639J919L163k066k734J873J644j039
1301A00k147J533J701j616q49J970J10j000m0M34J390j199j327J551M74j332r6
1318c43N74j93l87k71R94o40j503J766R68j661k44J248M10l80m87M35P84j167
1336i7o9J392r81j074Q0J424L13k164j331L155R07k550q24K205L70j404K40J273
1354H65j14k086K188J058k146m69J312k82r2m32p51P86q2N25o80p86Q70P21o40
$$ plain form
1238 1561 519 -1843 -492 2438 239 -1892 922 2115 294 -1213 606 2424 -558 -2995 1094
1253 1094 1997 -2141 -2056 1928 849 -2391 -1579 1790 962 -2386 154 2976 -322 -1485 1864 1378
1269 1378 -338 -882 865 1564 -750 -1504 777 721 -1318 -1785 -52 1173 -650 -1968 726 1790
1285 1790 -1172 -1267 1603 1270 -949 -1123 2210 1979 -2660 -741 2422 356 -2378 -505 1139 100
1301 100 -2047 -514 1187 -429 -1278 692 802 -198 -238 196 1586 387 -940 611 1085 -247 -343
1318 -343 231 38 -349 -620 374 -266 -1769 -3 965 -696 -940 308 718 338 -149 286 1070 -97
1336 -97 -166 1226 245 -829 -749 675 988 -1176 -2507 648 1555 -995 -1819 386 756 -648 -408 865
1354 865 751 -1335 853 1911 -235 -704 608 326 234 -198 -949 -163 -245 280 -400 -1186 -316 405 -235
1373b35K47L56q71P82J137j131n25K03Q32k47m64L91j027r98J801R34k614p91
1391b220K218O25l99j319O38J018N7K0n46o07R66P95j070P0m1r75O81R42m92j569
1411a208o16K066J173k132r73J262J102N76j318j203J654J220j215n59O66k27
1427B68l38j52J303p69k153J090J920o69j250q23O50K005L43k431K18J491L66
1444A069r14r39J388K10j122Q27R94k021p59P92R94L55j897o44J367J599m62k731
1462a894K01L493K86l492O51K420n85j499N90J303j367k030K271J659k174j721
1478a888J428J094N85k331j732K679J727j015j716Q93J869j156j561J481J011
1493A368k208P1K179J47k267r23J033J721q76j599Q3J268J794j085k634J286K211
$$ plain form
1373 -235 12 368 -503 279 1416 285 -240 -37 795 548 84 475 -552 -1550 251 1185 -1429 -2220
1391 -2220 -2 623 224 -1095 -457 561 618 638 92 -515 451 1246 176 246 205 -770 -89 853 361 -1208
1411 -1208 -1824 242 1415 -717 -1690 -428 674 1250 -68 -1271 383 1603 388 -171 495 268
1427 268 -70 -222 1081 312 -1841 -751 1169 500 -750 -1573 -923 1082 1425 -1006 -788 703 1069
1444 1069 155 -784 604 814 -308 519 1513 -508 -1267 -475 519 874 -1023 -1667 -300 1299 837 -1894
1462 -1894 -1693 1800 2086 -1406 -755 1665 1080 -419 171 1474 107 -1923 348 2007 -167 -1888
1478 -1888 -460 634 1219 -1112 -2844 -165 1562 547 -1169 -276 1593 437 -1124 357 1368
1493 1368 -840 -769 1410 1557 -710 -1633 -600 1121 245 -1354 -1271 -3 1791 706 -1928 -642 1569
1510A569j181r85Q52J133r31j039J434P45k237j359K090J387j396k297P02L212
1526A699m02l194J17K230Q13j560n24J799M19k242L74K138j118j926K23K322N13
1543A681k746q80K264P95j919n40Q33R95j83n39O92k78p15P43P68o64l30Q8O45
1562G10K20p00o56p56M53J602m82j951O49J779p04p31k65P77J028j199K32J005
1580A011l65o96K72N46k44j698J41K154r5k139p0J669L13j532p01J875n2j323
1598i34J300J058j157j292J081J359m86j940M71J992q65j526P04J78o10k35P80
1615a22O79q41n19J661j2j696L09J154j1o3l21J20K43n21p8M03r15K45M62l03
1635a26J13r59N04J054p87j155J316J52k95j15J113L57j887L45J956j015k117
$$ plain form
1510 1569 388 -597 255 1388 457 -582 852 1597 -640 -1999 91 1478 82 -2215 -1513 1699
1526 1699 1297 -1897 -1780 450 1263 -297 -821 978 1397 -845 -471 1667 549 -1377 -1154 1168 1681
1543 1681 -1065 -1945 319 1114 -805 -1345 -512 483 300 -239 453 175 -540 203 971 307 -23 65 710
1562 710 930 230 -426 -1182 -729 873 391 -1560 -911 868 164 -567 -832 -55 973 -226 6 1011
1580 1011 646 -50 222 768 524 -1174 -1033 1121 1026 -1113 -1183 486 799 -733 -1434 441 389 -934
1598 -934 366 1424 267 -1025 56 1415 929 -1011 -540 1452 587 -939 -235 -57 -667 -902 -122
1615 -122 557 -284 -803 858 846 -850 -541 613 602 539 218 338 581 60 -18 385 -530 -285 177 -126
1635 -126 -13 -972 -468 586 -201 -1356 -40 112 -183 -298 815 1172 -715 -370 1586 571 -1546
1652a546J385J485q14j217M72R58j194j008J357J136j575m51J698Q6l65j497Q62
1669b28J408o70r32L50J227o11j297K69J323j097j405J913N10j591j81J571L84
1686I43j609J0J307j54j100J194P55j441j28P27J47p00m78P82no24k9O02m14n40
1706g55M65J43N14p93j39J449l07r66K57J129J92j343l76J908o80j985P91J317
1724H21j096r20J094N11k77j159Q09R08l02j480J164P11l91o61L64J082r88j062
1742h72J039K03j241M84O62kr93j25R66q6j070J274M86j017K90N71j38q2m08M59
1762D00K11m66o72N37K72k02n11o9P26q61k14J434k64r64J1J321J32j463K53J419
1782A030o16j304R86O29p91l44O95K1q19l25P17M09j028r7Q30J40J05m50J31P35
$$ plain form
1652 -1546 -161 1324 510 -707 -235 723 -471 -1479 -122 1014 -561 -1012 686 772 407 -1090 -228
1669 -228 1180 510 -422 -72 1155 544 -753 -484 839 -258 -1663 250 760 -831 -1012 559 943
1686 943 -666 -656 651 497 -603 591 1346 -95 -223 504 651 -49 -527 255 250 -374 -403 199 -215 -755
1706 -755 -290 -147 367 -426 -565 884 577 -389 -132 997 1189 -154 -530 1378 698 -1287 -496 821
1724 821 -275 -1195 -101 410 133 -1026 -217 691 389 -1091 73 784 393 -268 96 1178 190 -872
1742 -872 167 370 -871 -387 275 273 -720 -845 121 35 -1035 239 725 -292 -2 569 431 349 -59 400
1762 400 611 145 -527 10 282 80 -431 -500 226 -635 -849 585 321 -643 -632 689 821 -642 -389 1030
1782 1030 414 -890 96 725 -66 -410 285 306 -513 -838 -121 288 -740 -837 -7 133 238 -212 -81 654
1802F54l47n33Q76K85j032m38Q14M77j088o23J303J48j491R29L12m02l31J77R00
1821E90p49p78R65Q72q99k66M81L68l45n65L68M66p42l10J298o28q62L67R31n75
1841a3o61J7J505m44p81N01P40q10j53M73N71q61n05M78N88p63o40K73P53k09
1861E9j147P32Q02o30q10J151N95j253M13J034r2j062k23J259l82j161O07M40
1879C32p32J74M02k80l97k64J102m8o68J23O15j04M09m47r3M11o57k37Q54k86
1899B09n73o1Q40J95j265m89J288M24j256J73P98P5k87MO30m34n61R57j30n81
1919d4Q0k25L89N4m66k08L47j86M17k04k54r9P73j76l22J8j4Q08m05l59O45lj126
1942e60J082j02o28l23J28Q84rj224J52N92J04j73p50O92Q93j002K38L98k06j2
$$ plain form
1802 654 307 -226 650 935 -97 -535 279 756 -332 -955 348 496 -995 -66 246 -156 -487 -310 590
1821 590 -159 -937 28 900 1 -265 216 584 239 -326 42 508 -234 -544 754 126 -736 -369 562 -13
1841 -13 -674 -657 848 404 -377 124 864 54 -99 374 945 84 -421 57 645 -118 -758 -485 268 59
1861 59 -1088 -356 446 -184 -994 157 752 -501 -88 946 854 -208 -431 828 446 -715 -108 332
1879 332 -400 -226 176 -104 -501 -765 337 289 -379 -256 359 255 664 217 124 535 -122 -359 495 209
1899 209 -364 -425 415 610 -655 -1144 144 568 -688 -515 283 358 71 75 705 271 -290 667 537 -44
1919 -44 36 -189 200 254 -212 -420 -73 -259 158 -46 -300 -399 374 198 -124 -106 -120 688 283 -76 569 566 -560
1942 -560 522 420 -208 -531 -403 481 472 -752 -600 -8 96 -77 -827 -135 758 -244 -6 392 186 174
1962A74k51L88L53o80o67J235j79j026j02K90O62K68p76p6M38N3P5n08K33N73
1982D77j49m92J082n48o49j80O28R8o10m35P57M91p76l57N04j32L82l84j38R42
2002E11k28m93N83J65n67l30M86K13j40p51L92N51k34k54n82L21L99l9Jk04L09
2023A09L05o56K40J96rp18P94L20K1p93j87R25O7j342k50J551r1p28n40R72O3
2044B49q93j33J179j90q62Q41N12j09n64n15M30O97q10l55L68L71k16q94N67P43
2064D16p34p64J425Lo96M04N78l49p53L4Q26m91Q0O24o83j58J78M05p29j87L87
2085a84L68l68j3N46j7p76L83L96j74R4o00P44L82r75l69O63L06n28q52O89Q71
2106E86r01p53J397K31j204P1R37N5p23m3J072r7j117N53J14L27l95m93K22N65
$$ plain form
1962 174 -77 311 664 -16 -683 552 373 -653 -755 -465 197 465 -311 -387 51 104 179 -329 -96 477
1982 477 328 -164 918 370 -279 -459 169 267 -343 -778 -21 470 -306 -663 -159 -291 91 -293 -431 511
2002 511 283 -210 373 538 -29 -359 127 340 200 -551 -159 392 158 -96 -678 -357 42 3 4 -200 109
2023 109 414 -242 -2 194 185 -533 261 581 602 -191 -378 547 614 -728 -978 573 482 -246 -786 186 249
2044 249 -644 -777 402 212 -650 191 703 594 30 -485 -55 642 -168 -523 -155 216 0 -894 -327 416
2064 416 -318 -1082 343 346 -350 54 632 283 -470 -436 390 -101 -21 603 -80 -238 -60 345 -384 -571 -184
2085 -184 184 -184 -197 349 332 -444 -61 335 161 255 -345 399 781 -194 -563 100 406 -122 -974 -285 586
2106 586 -315 -1068 329 560 -644 -573 364 419 -304 -347 725 628 -489 64 178 505 110 -383 -161 404
2126D04q62Q1K66J26m74Q6P02k23p9J15N90j052k4R26k78o17M90L93l52o69J93
2147b58P68q13m03R16L88o58k34q9M64l79l11M22P42k98n65L96N03j75p72N19
2167A63M64q91n62R52M00p85l07Q54J90j009k52J191j96p05O31O14j077K91J96
2186A62J80m62n5L32K61p41p9QO37n18m7k0M53q02R1J035j1r66R8Q28M09j033
2208b40K4J273q16o04L62Q63p97n43K72Q92p80o28P84J82j86n58M35M90j20n57
2228b52N74L03n52l65O18o4l47o5Q4L23n77k62P63l45m00M98K38m27L1M3N31m42
2250i2l11P42L99r02J50jM57l07m93M64N61j248q8R19k65m52J63N68R7n63M4R52
2272G94n49l60P41j42n14o4k65M93p2k93j17N29o15M42k33j01J78m75Q69K93o90
$$ plain form
2126 404 -458 -377 -111 15 -459 -373 329 106 27 142 732 -320 -344 582 304 -313 177 570 218 -451 -258
2147 -258 510 -303 -706 210 598 -60 -294 -383 81 -298 -609 -187 555 257 -308 88 591 416 -356 163
2167 163 627 -264 -826 126 526 -259 -566 288 478 -531 -783 408 212 -493 138 752 -325 -34 162
2186 162 342 -120 -175 157 418 -323 -402 -394 243 -275 -322 -342 111 -691 -600 435 424 -542 -444 384 793 -240
2208 -240 -216 1057 241 -363 -1 862 65 -478 -206 686 -94 -722 62 244 58 -500 -65 425 305 -252
2228 -252 322 625 73 -292 326 262 -85 -150 -66 257 -320 -582 181 -164 -564 -66 172 -255 -224 -181 350 -92
2250 -92 -403 339 738 -164 -14 -15 442 135 -358 106 667 -581 -669 250 -15 -467 -304 264 361 -202 -158 794
2272 794 245 -115 626 484 -30 -94 -359 134 62 -231 -348 181 -434 8 -225 -326 -148 -623 246 539 -151
2293a51j53P23n6l59j07N46J48q61J36O88n72q17P37L62n26k72K83L24m2m07L73
2314cJ10j80R7J48K00j34n05K51N78l51l33j8L08k61j36K32j28l17K32K85m22
2335c47O3P10l98k53M00O2j4k23r7J96J14j91l8K98L2q48M5L48N61q34j37J043
2357D92m97l06L53K27Mj92j61O50l70n12J97L21k87O8k29J12L90j03m24qK09Q3
2379A7l8k42O19n61M18J02l42%K07r9J31m22L45J55r22N58Q01j259j92J036Q9
2400D01p92K61J00J86k68J03K69l2l30K13J23l3j53k10K15L92n36k46L27K29k60
2421d1n71M83K48j69J4L38k92j28k4M63k71J00p4j70M65m24K33m74l09Q52m84
2442b35m90M79K22K35j55n18N61K8J21k76k6K50j88k94Q56K5n97l48N51o4j77
$$ plain form
2293 -151 -304 419 363 4 -103 443 591 -270 -134 554 -18 -835 -98 264 -262 -534 -251 73 31 -376 -3
2314 -3 107 -73 24 172 372 238 -267 -16 562 211 -122 -140 168 -93 -229 3 -125 -442 -210 75 -347
2335 -347 -284 426 28 -225 175 237 223 0 -97 99 213 22 -16 282 314 -534 -489 -141 420 -414 -551 492
2357 492 -5 -311 42 269 273 81 -80 570 200 -312 -115 206 -81 -13 -242 -130 260 157 -267 -275 -66 17
2379 17 -21 -263 356 -205 213 315 -27 -27 180 81 212 -210 135 290 -632 -74 727 -532 -724 312 401
2400 401 -391 -130 -30 156 -112 -9 260 228 -102 111 234 201 48 -162 53 445 -91 -337 -10 219 -41
2421 -41 -612 -129 119 -50 -36 302 10 -118 -142 321 50 150 76 -94 371 -53 180 -294 -603 249 -235
2442 -235 -725 -246 -24 211 56 -462 99 127 248 -28 -54 196 8 -286 570 595 -2 -350 201 137 -40
2463d0n20L65M33m66Q3J1k8nN45l77M9K03m38J83L86l46j19k9L65j40m41JN17
2486A92K6l10n4k58N17J59m72J57L80j45k37J71p1R2o29L41P51m27o56L29K30
2507H6l86L28l87L27L04l61J42j67K99J9n67P22j76j05m7K50k94K73j88k12K84
2528A44l4j71k04J91P9p8l28J7M82j70p1L43r9M9k44O0J67j17j38K58Q8Q8p25
2551d13L03L4K36o20J98K35J39j37k39M90k90k28K80O69n05J84k9k06n8K93k52
2572H4o5m4q3L89m53P9M12l94p8O3J28J95j05l63N57j52j09K4j37K57j73l11M19
2595A40K35o47J76J62J00p25O72kJ69o77L37O04m35k33K21Q8%J7l24K76j15k35
2617a96l1K05p6n2q2M75p7m94J67M90l77N5R7J08j21O7K57k06l13J2K52p8m04
$$ plain form
2463 -40 -560 -195 238 -228 -145 -134 -162 -167 378 1 50 253 -185 -2 384 38 -81 -110 255 115 -326 -325 192
2486 192 218 -92 -146 -404 113 272 -200 -43 337 192 -45 126 55 147 -482 -141 610 183 -473 -144 86
2507 86 -300 28 -359 -32 272 -89 53 -114 185 204 -363 359 183 78 31 281 -13 260 72 -140 144
2528 144 110 -61 -265 -74 5 -73 -401 -384 98 -72 -143 200 101 150 -94 -34 133 16 -122 136 224 312 -413
2551 -413 -110 -76 160 -460 -262 -27 112 -25 -264 226 -64 -292 -12 657 152 336 307 101 43 336 84
2572 84 19 -25 -108 281 -172 -93 319 -75 -153 -90 38 233 128 -235 322 170 61 85 -52 205 32 -279 140
2595 140 375 -272 -96 66 166 -559 113 111 280 -397 -60 544 109 -124 97 185 185 202 -122 154 39 -196
2617 -196 -227 -22 -98 -150 -232 243 166 -328 -161 329 -48 7 104 212 91 158 415 209 -104 -92 160 82 -322
2640c22L99R9l29N2j34L10l12r2K80K61m72L11N39l39k36l42M54K06k95j26L96
2661C08Pq36K75L83j00l27k26N36J7k21rM53k49l7l36P47o2k81R3K47k65l24R4
2684a13L15k40l02L18k4J04k63M36j73n52L72N11j81m35J24K42k5k33L87j69l38
2705b39L78K09j96k90k56L33K09n60R2K48M69m99k86O99J11p04M3L61n7J54l91
2726a72L30j6n23K71K42l15K36j31L1J8ok26M77j47k67L26J29j32k40o5K92k4
2748H8o63Q26k58l07J10N66l31k85m7L79j73m35M0Q37n61K70Q2J34%l95l1O44
2770D90j08n66J70J50j76l09L82J88m07k05M05L61p43N9N20p6k31J23J68J82n45
2791a68L96K1k78r0K22N1l28m0J86K53k74m22J97K56j20J92k00L50l55o9K66K99
$$ plain form
2640 -322 77 176 -153 -101 -235 75 -237 -329 -49 212 -260 51 590 251 15 -327 127 333 38 -88 308
2661 308 315 -521 -246 137 37 -290 -516 20 37 -184 -193 260 11 -26 -362 385 323 42 135 382 117 -207 -113
2684 -113 202 -38 -340 -22 -46 58 -205 231 58 -494 -122 389 208 -227 -103 139 114 -119 268 99 -239
2705 -239 139 348 152 -138 -394 -61 148 -412 -320 -72 397 -102 -388 311 422 -282 -239 122 65 219 -172
2726 -172 158 142 -381 -110 132 -183 53 -78 -47 -29 -35 -261 216 69 -198 128 257 125 -115 -180 112 88
2748 88 -575 251 -7 -314 -204 362 31 -254 -301 78 -95 -530 -490 347 -214 56 138 272 272 -123 -154 490
2770 490 382 -184 -14 136 -40 -349 33 221 -186 -391 14 375 -368 -309 211 135 -96 27 195 377 -168
2791 -168 228 249 -29 -119 103 154 -174 -214 -28 225 -49 -471 -274 -18 -138 54 -146 204 -151 -220 46 345
2813C45o42J56N29k14j72p6K34P8m49l4K68J49k32J1j8J64m14L31L60j42k42N0
2835D0K25k18J52l51M31j61l60L01O7j94j33J51K34l97j52N81o1m41K72K40l77
2856a51K20j3L55l20L6k82M35j38k99mJ33l0o3L9J67Mn67N78j4k15P6N32M7o92
2880a66j1M60L1k53J08K78n36K64l93J5QJ09J59k91J43k02K34M1R6J33N9O1j47
2903B00k42M31k00m45J28M06k24k75j23M78k16l08K33K26j50K95k37K38N0m83
2923b18M67k5k09k42L81J09l36o3j69L73n8k35K24J52n0l20O1l5M57l90L24Ql00
2946i4M30n69K32J54p6j3k41J13j5Q4j55q3L51q9k31j38L15L22l11p9J87j15k53
2969b74J79N45j41l42k4M75m41m22K55N5J22o2M2j12K91L6m82M81mQ6O4j89o4
$$ plain form
2813 345 -297 -141 388 174 2 -74 160 238 -211 -245 23 172 -60 -49 -67 97 -317 14 374 232 -10 40
2835 40 265 47 199 -152 279 118 -242 59 126 -68 -201 -50 184 -213 -365 216 155 -286 -14 226 -151
2856 -151 69 56 411 91 127 -155 280 142 -157 -161 -28 -58 -121 -82 85 89 -478 100 86 -129 -53 479 526 -166
2880 -166 -177 283 314 61 169 447 -89 175 -218 -203 -195 -86 73 -218 -75 -277 -43 -2 94 227 286 347 200
2903 200 -42 389 189 -256 -128 278 54 -221 -344 134 -82 -390 -157 69 -81 214 -23 215 265 -218
2923 -218 249 224 15 -227 154 263 -73 -136 -305 68 10 -225 -1 151 101 -219 -158 -193 264 -126 198 206 -94
2946 -94 336 -233 -1 153 77 64 -177 -64 -79 5 -150 -233 118 29 -202 -340 -25 297 -14 -93 94 -21 -274
2969 -274 -95 450 309 -33 -57 418 -23 -445 -190 -135 -13 -75 -33 -145 146 182 -300 181 177 263 327 138 74
2992G4p5k59K27J67r2o6K76k92K32j56P9k39Q0K45l77J81M8L39l55m0N33m31r8
3015AJ88k84L38n02L16K11j95n8j92LK89j19r2J28J19l92N7J75J14j54j56L08
3037A03M6l90K40L84n88L26l53JK88K6m9p4J89q0P1k11J32j2K5L2K58m12J99j81
3061c0J61r0J30j36o3j23L22k51j28M24q0l46J91K95j58o7k13R6J24j17M5l7R9
3084D8J72j08k24K26j36m05L41J50j61l83N49j39L57n47K72J40l33J69K4O2R6
3105A70j20j2j22J16P7l48M61k3j07l18J97K64m29K66j35P8k14N32n96M45P0j76
3127G6k41M8K73j02m85M62j16L4l1k11J37K9J98M50m62OJ07j30J19J74j02l85
3149a52J30m8K65m20Q2K25j25l09j0Q20m18j07lK26j32j17mL96l29N3K90j86j27
$$ plain form
2992 74 -1 -260 -33 134 42 -24 252 -40 192 36 115 -124 -44 201 -176 5 53 392 37 -3 530 99 1
3015 1 189 -95 243 -259 57 268 73 15 -177 -174 115 -4 -96 32 151 -241 -184 -9 105 -49 -205 103
3037 103 149 -241 -1 383 -205 121 -232 -231 57 83 34 -40 149 69 140 -71 61 49 74 106 364 -48 151 -30
3061 -30 131 41 171 35 -28 -151 171 -80 -208 216 136 -210 -19 276 118 51 -162 -66 58 -59 -14 -51 48
3084 48 220 112 -112 114 -22 -427 -86 64 -97 -480 69 -70 287 -260 12 152 -181 -12 12 74 170
3105 170 50 38 -84 32 109 -239 222 199 92 -226 -29 235 -194 72 -63 15 -199 333 -263 182 252 76
3127 76 -165 -117 156 54 -431 31 -85 -51 -82 -293 -156 -127 71 521 59 65 172 42 161 335 233 -152
3149 -152 -22 -70 195 -225 -143 82 -43 -352 -362 458 40 -67 -70 156 24 -93 -97 299 -30 23 313 127 0
3172@j58j84N37o7l79j05L25o0K08p5P3j7j58j53r5O00R8n11J69K3J78m24Q4K18
3196A27k49L06l46K5J33J91k69P9Q7j5j12k59M74p3rJ6p6Qj10l8M29k42j12M2
3220GK12l61j57J59M47j27l32j28J80K53k85l41N41J15l99L40R2j2l02J20J22
3241A44R6m3j57l0O5j52J05j81J75j11M6L9O9J79l37J14j72J32qK36n40L69K15
3264B53k62k47K77Q8n23L74J47l64K90r5J82n3m8k96N46n9m99K82J67j98k23J88
3286g3K1J91k5m8j58O7j75k3J80R8l33J31K56n1j32j36L58l4k7J97j73k12J10
3309IL37k33k14K68k47k67K76P6j70K37j81L56l47J6j46K50J36O2j09j97K98q7
3331A23m04O6L59j10r6J09k46q9K32J2J84l13r0K18L09n9k03j48J76q7k7j61K88
$$ plain form
3172 0 -158 -342 195 128 -251 -356 -31 -91 117 42 115 98 -60 -213 -308 292 390 -121 48 71 249 -175 -91 127
3196 127 -122 184 -162 -137 -4 187 -82 -3 84 69 -43 -302 172 99 90 106 30 38 -72 -110 319 77 -35 7
3220 7 219 -142 -299 -140 307 180 -152 -280 -100 153 -132 -473 68 183 -216 124 216 204 -98 22 144
3241 144 240 197 40 10 75 -77 28 -153 22 -89 -43 -4 65 244 -93 21 -151 -19 -27 209 -331 38 253
3264 253 -9 -256 21 109 -414 -40 107 -257 33 -62 120 67 19 -277 269 210 -289 -7 160 -38 -261 -73
3286 -73 -52 139 114 66 -92 -25 -200 -223 -43 55 -278 -147 109 58 -74 -210 148 114 87 284 111 -101 9
3309 9 346 113 -101 167 -80 -347 -71 5 -165 72 -109 247 -100 -84 -230 20 156 218 109 -88 210 123
3331 123 -281 -215 144 34 -62 47 -199 -288 -56 -44 140 -173 -263 -45 264 205 2 -146 30 -57 -84 -245 43
3354D3J6K57k22k16qK72J37j92k83K34l7nJ51j46Q4q3J90o1j08l3J12k21L09o6
3378A24j39j01J96j22k43P7M27j54r3J06j02K51o31P01l03j81K66J74l66K4O2
3399b7j5J38k75K91o6l99J23M23l42J90j32l1K44r9K50k75K06o9j74k8o3M1o8
3422a57K23j45l94O31j72L1j18J08J6R8q3K4j32J2L91k20p0k01J04K62K08j20
3444B96k86j01o4J94j5j71k0N1Q0J63j22j22K75J13k76j44L23l61N43j87k21J06
3466E4j2M6J25n6l97j67K29J80K15l01M9L7j54K46k30K64k37L44J1n01M46n5j28
3489HJ1KP6j32l62L46R3k79M52k34J14Q5l14L35m94K03K6K47j93m3j99O59p53
3512c46K43J35lJ22n36M63J61m87r9K36n3L90l15J08J25p0j15J25m7Q9L7p8K68
$$ plain form
3354 43 59 316 94 -122 -130 142 279 87 -196 38 1 -4 147 1 85 2 192 131 23 -10 102 -119 190 124
3378 124 -15 -116 80 -42 -285 -208 219 65 -28 78 -24 227 -404 297 -6 -187 79 253 -113 -89 -27
3399 -27 -42 96 -179 112 46 -353 -230 193 -149 41 -91 -122 122 23 273 -2 204 135 -39 -67 -130 -89 -157
3422 -157 66 -79 -473 158 -14 17 -101 7 23 121 38 62 -70 -58 333 113 43 -158 -54 208 416 296
3444 296 10 -91 -155 39 24 -147 -167 -116 -36 127 5 -117 158 271 -5 -149 174 -187 356 169 -52 54
3466 54 42 88 213 157 -240 -407 -178 2 217 -84 -35 2 -152 94 -136 128 -109 235 246 -255 191 136 8
3489 8 19 21 97 -35 -397 -51 42 -237 215 -19 95 180 -134 201 -293 -90 -64 183 -10 -53 -252 407 -346
3512 -346 -103 32 29 151 -385 78 239 -248 -347 -111 -164 226 -89 19 144 74 -41 84 37 126 163 85 353
3535C53l93J63J01l58p9M42l27j21o4R6J04L25r3j04R5j61L75m87K60J5R1k29
3557DK06L3Nk86j56K10j55K25q2n7K7p7K32j46k2M5n1L30j36q9J36j72k35N43
3581C32j76k51j2n6j56J95K94l13O4m2L6J70j34Q4n2N5p4Nk0o8q4L54j50k9J07
3606G9q7q9j29K51n7r0J85j60N3q4J79R0k91L53p0j11J80j89J95q9M7k09j51k4
3630b18K94J04K2j17K3r8p5j31M0M61n35K56L2kj22J86k25L14j59K6o6N7j16R8
3654D9k34K35R8R6j79J26Rj14l2P5nk33J07p4J71K2q2J92l80Q9Q8O1J0K2k77J73
3680A3J25k20R8j36J44J09k72K20R8l84J58q7j21K60k12J63n0o3J63L8m9J30o5
3703F0l09K77J3N5k86K14m9O4P7k06K64l5k95J33j55L64n24L72M7Q8j81j17K80
$$ plain form
3535 353 -40 123 224 -134 -213 229 -98 -219 -283 -187 -83 242 149 45 140 -21 354 -133 127 142 233 4
3557 4 210 243 248 -38 -194 16 -139 86 4 -53 -26 -103 129 -17 -39 6 -45 285 149 60 196 24 -211 332
3581 332 156 -95 -107 -163 -319 -124 170 -143 -79 -121 -85 85 -49 35 -17 38 -36 -31 -51 -119 -203 151 1 -28 79
3606 79 -8 -97 -226 25 -32 -122 63 -97 -44 -128 51 141 -150 203 133 22 202 13 208 119 166 -43 -194 -218
3630 -218 76 180 202 85 108 10 -65 -196 -156 305 -230 26 58 56 -66 120 -105 209 50 76 10 67 -49 49
3654 49 -185 50 148 244 65 191 200 86 54 129 124 -109 -2 -76 95 117 35 227 -153 -64 24 85 95 117 -160 13
3680 13 138 -82 16 -120 24 133 -139 81 179 -205 -47 -134 -255 5 -207 -44 -94 -157 6 44 -5 125 60
3703 60 -249 28 41 96 -190 24 -25 39 116 -90 174 139 -156 -23 -178 186 -338 34 81 169 -12 -129 151
3726A51m86R7R7K87j08Rj99L98R6l41J24k16L76k58J00q5r0R7o6j0N3K28m68O13
3750C99m23QJ76K4j28j79R9J22k50q9K92K1n5l5l2o4O1O0J38O1k50J3J98j31L0
3775F6j97M31j65J43O4k51j10q4j35k8K47l03K63j28J51LK83k08p9O2M5K40k71
3798C9l36M06j48n1K02l05K12K89l20J07k88L4J54j05L83k96N4L7p5K4Q2J39l82
3821a44K21R1k28P4J89o6k22K12o0lJ04l15J79r1J19r5RJ8J50j51o4J30K10j04
3845A63q3n7j69p7L52Pj89J22n7J98l33J39j17l3p0K50r2J38R5k60K87j34l32
3868b52K27L6P6k83J96mj76m3K79k41M84n05P8K70l70K94K91n01N9M3K13m3l61
3891b33J71N1J39k36Q3J1M8K8Q0l4j63j60J16K75l9j09J0J89o8m04K76J94Lk39
$$ plain form
3726 151 -335 -238 -141 146 38 47 -152 246 342 1 125 -91 285 27 127 42 -48 49 -17 -27 26 254 -214 399
3750 399 -24 -16 160 184 56 -123 -24 98 -152 -241 51 72 17 -18 -50 -114 -53 7 145 206 -44 -31 167 36 66
3775 66 -131 300 135 278 342 91 -19 -103 -238 -266 -19 -322 -59 -187 -36 -33 250 42 -37 25 70 310 39
3798 39 -297 109 -39 -90 112 -193 19 308 -12 95 -193 -159 -5 -110 273 -23 31 68 -7 17 99 238 -144
3821 -144 77 168 -60 14 203 137 -85 127 67 64 168 -147 32 -59 60 -35 -26 -8 142 -9 -73 57 267 163
3845 163 80 23 -146 -223 129 136 -53 69 12 210 -123 16 -101 -134 -204 46 -46 92 187 -73 214 80 -252
3868 -252 -25 11 87 -196 0 -4 -180 -223 56 -185 299 -206 -128 142 -228 66 357 -144 -85 -42 171 128 -233
3891 -233 -62 -11 128 -108 -25 -14 34 62 142 108 -55 -215 -99 176 137 28 38 227 159 -245 31 225 228 -11
3915a1J9J02n8j26l2O0r7P5j13J25j87J68O2j34rK68q7j24pK47J61m60r8L96P5
3940B15j6m10J25L19l62o3K42j24J04j97L96J79n41K46J62l54J74l09K14K46j64
3961H2n36L65Lj30K31l38N28m19j05M70n5%k06L16J1m79K92m1p1J0L01k51k43
3984b65l6K29J49l44L66J43n69Q1J38J54K3J34k36k27N05m15L57m57J68K58j85
4005b9K83m79J15K43j56J04j06l0L5j64mN24m11J23K7J31k18P6O3R2k98Q4j6j
4029a2p8L22m62J79K2j08L77n06Q1l3J08K41l10R2L01l12M9O7Q3M7j92N6k14K79
4053G7j33M0K35k58K40J67jn28J67PL2J97j22K8m34L16j70L65j22k20l7J16R4
4076E6j36O3N4N2l8lP3j8j35m8K75k38j29N86o35K16J58l71J41n9j04K07k3K6
$$ plain form
3915 -11 8 110 52 -74 -106 -46 -143 -68 -181 -56 -243 -75 -13 -147 -156 112 25 -99 -106 141 302 -158 -256 140 215
3940 215 199 -211 -86 233 -129 -192 50 -74 30 -167 229 408 -133 113 275 -79 95 -214 0 246 82
3961 82 -454 -89 -86 -216 15 -323 205 -214 -319 151 96 96 -110 206 217 -262 30 -11 -82 -72 229 -22 -265
3984 -265 -301 -72 77 -267 99 242 -327 -246 -108 46 69 203 -33 -260 245 -170 187 -270 -102 156 -29
4005 -29 254 -225 -110 133 -23 81 -25 -55 -20 -184 -188 336 -75 48 75 206 -12 64 127 219 -79 5 -11 -12
4029 -12 -90 232 -230 -51 -29 -137 240 -266 -185 -218 -110 131 -179 -87 214 -98 -49 18 101 148 -44 12 -202 77
4053 77 -56 -16 219 -39 201 368 367 -161 6 13 45 242 120 148 -286 30 -140 225 103 -117 -154 -38 56
4076 56 -80 -17 37 89 51 48 121 103 -32 -80 195 -43 -172 414 -221 -5 153 -218 -77 -136 -240 -33 -56 -30
4100c0J96J22l24R8j26J37J19j76o9K6j03J75J60k57j01M30k74K24k95l9N3J44
4122I0p7J07k29N0L02l06L2j79J63J53j89L8j72J95M6J43j56j01Q7j36P6o4l9
4145a66J9K32j02K23Q2k87R4j19k7J12k51K04q2L10k37j89K47j62L30Jk32M9J91
4168B40l88K3Q9K05m29J54K37j24P2j21j22L28j46j05J38j26O5M5j89K3J12J25
4190A06r4j34o8K39p6K44l05K27k6p2k32J36L76l68O6J90n40n7O55n05K93J55
4212B10j80j97n3J23J46J79o8j46N4k9k96L24J23k69N6j25J29k4k62L97J38k49
4234a9J19J79m1m18P5j95O04j12k2n7K64o53P6Rn1M6L11k20rK61j31j17m6J80
4258C3Q6k94J73M8m41N56j77j15M4J59j15J36j38K57k44K28l01L5J49k62L23k23
$$ plain form
4100 -30 166 288 -36 62 -64 73 192 16 -53 -27 -130 45 205 -52 -153 277 3 227 -68 -107 -54 90
4122 90 13 120 -109 -59 243 -63 -31 -210 -47 106 -83 -45 -217 -22 24 167 11 -90 -3 -139 -63 -127 -166
4145 -166 -147 85 -17 206 288 1 95 -24 -51 61 -190 14 -68 242 5 -184 63 -99 231 232 0 49 240
4168 240 -148 -125 -36 169 -260 -106 131 7 79 -42 -164 164 18 -87 51 -75 -10 35 -154 -131 -19 106
4190 106 12 -122 -190 49 -27 217 -88 139 113 41 -191 -55 321 -47 19 209 -331 -388 267 -238 55 210
4212 210 30 -167 -220 -97 49 228 160 14 68 39 -257 67 190 -79 -23 -148 -19 -43 -305 92 230 -19
4234 -19 100 279 238 -180 -105 -300 304 192 170 113 377 -276 -200 -191 -242 -196 115 -105 -114 147 16 -101 -147 33
4258 33 119 -175 -2 46 -395 161 -16 -131 -87 72 -43 93 -45 212 -32 196 -105 -70 79 -183 140 -83
4280h3J62j60K07R9n3m57K09J06K32q2k89j74M62k59j94M51Q0q6j98R2j26L75
4302C14l51m3K46j05O9j27q6k58O64l52J76l15L90K14m56K23q1j30l7L95j26l22
4324i8j6J21K02J17k75l39K15J2L46j54j73m7K44j05j33J58l43K49j08J74J9j8
4346D8o4Q5j16M0J3k6mJ13Q3j51j71N1j07M15r1O2l69K26J80j29J51j36J75l08
4370c0M40k34P2m63J87L7K68j02k06N6J16j66k2J33j21k05J82p3J03j5KN0J4J32
4394A55j30m8L10k38n1mK4p4J31J35j42m3J79j0m23K24P0j44J50j37m8K66k82
4417a30R8k21P9P7N8m4Q6kk43M06k7j77k92J10K21K88k58k44O8j15K38j71K17
4440B2K16m84L69j17j05K82j35J48lk19R6o5J56o1q1J23q1J46j45K12n3m20J72
$$ plain form
4280 -83 79 -81 126 225 172 -285 -76 30 262 180 -109 -283 179 -80 -274 177 257 171 -27 65 -61 314
4302 314 -37 -80 166 61 130 3 -83 -341 323 -29 147 -168 222 436 -20 203 122 -8 -45 350 224 -98
4324 -98 -114 7 209 326 51 -288 -73 -61 285 131 -42 -89 155 50 -83 75 -268 -19 -127 47 66 48
4346 48 -16 69 -47 -7 6 -20 -24 89 172 21 -150 -99 -206 209 118 180 -189 37 217 88 239 103 278 -30
4370 -30 410 176 248 -215 -28 9 277 175 -31 25 141 -25 -47 86 -35 -240 -58 -131 -28 -43 -41 9 23 155
4394 155 25 -23 287 49 -2 -6 18 -56 75 210 68 25 204 194 -229 -5 65 -79 71 -66 -114 152 -130
4417 -130 -32 -253 -174 -97 -39 -83 3 1 -242 164 137 -40 -332 -222 -1 287 29 -215 -147 -262 -24 -195 22
4440 22 238 -246 123 6 -99 183 48 196 193 -26 70 5 161 100 19 142 61 207 62 274 221 -199 -27
4463b7M37k87k92J34k43N95k04j01J49p4j02k8L83l40L1j31J65M0k27L67l13N2
4485a6m0l3P0j42J35M00l60L1k54m7J76q5l7MJ20R6j62K51k07J10K85l11j06O9
4509e3K21k39J20l2rj49L12k30J61j89l8P1r0K82k53J01Mj50J67J8n8j26L00j18
4533B3j52P7O9k99K07J77k70o7J98K92k1m06K55j41K20j92K44l29O3k6J37J86
4555B45j42l09J31J11K57k85k00L00j77L64l73J9j35L88k34j31J42J00O2k04K77
4576B06q6r6r9K32j12J8J52q3j3K5k67K50j20j77J45J79r5j11K43j52m0j80K99
4599A18N0j83k60L31J72m13K03J46l33R7o3M0L2k0J02l9J65m6J49l55O4J25k81
4622a99R3O6K80L5l45K71j39j7R8K38l24J38j34l46L94l58K40R4L6l24k4M15n5
$$ plain form
4463 -27 410 123 -169 -35 -278 317 113 12 161 87 -15 -43 340 0 31 -100 65 105 -122 245 -68 -16
4485 -16 -56 -89 -19 -161 -26 374 14 45 -209 -256 -80 -165 -202 -198 -78 18 -144 107 -100 10 295 -16 -122 -53
4509 -53 168 -71 49 17 8 -141 171 -59 102 -87 -125 -54 -144 138 -115 -14 -10 -160 7 25 -33 -159 141 23
4533 23 -129 -52 17 -282 -75 102 -168 -235 -37 255 234 -172 83 -58 162 -30 214 -115 -52 -78 59 245
4555 245 103 -206 -75 36 293 8 -192 108 -69 295 -78 -59 -194 194 -40 -171 -29 71 133 -71 206
4576 206 120 24 -75 157 45 63 215 132 119 144 -123 127 7 -170 -25 154 59 -52 191 39 -1 -181 118
4599 118 168 -15 -275 56 228 -185 18 164 -169 -72 -135 -95 -63 -83 19 -20 145 99 248 -107 -43 82 -199
4622 -199 -106 -40 240 275 -70 201 62 45 143 381 57 195 61 -285 109 -249 -9 85 121 -203 -227 188 133
4645A33j01M7p4k24J66p6p3L26m33L98j27k16J15J22R6k87L53O5k56j21q6K53
4667@k98J74K16O0k4j30j36L55j19k56J94J41k18j10nO7n5m0J54k56L52J8j44
4690f0k62M78p1k9j03M0l62K46O8K11N1l76o1J46N7O9J01K49j52k08J08r7J54
4713A97j64j84K16k18K19L6l03J66k00K03P3J90l62q5K37J44lk78K2K89J07k07
4735I5j31m2J16P7l73M51l55J70j06L9r2Q8K56l34K53n6q0j06RK99j41J91j78
4758E0k06l0M05l50k4L82k84o5J05l7J89j52R8j94O1P3k6M6j7K1Rq3m1L9J0l4
4784e5K99j62P9R6m29J97M1k6n3l8j90L71p9N5J03j15J30j74j61J56j52K39P1
4807B03j93K5l65L79N6m3q6O8J29n5m13K75J41j14P2o5j35K44j40K57n03N22l00
$$ plain form
4645 133 32 79 5 -219 -53 -129 -202 124 -309 89 -38 -254 -139 -17 79 -208 145 210 -46 -167 -253 0
4667 0 -298 -124 92 152 128 -2 -138 217 98 -158 36 177 -41 -151 -156 -89 -144 -184 -30 -286 66 84 -60
4690 -60 -322 156 85 56 -47 -7 -369 -123 -55 156 207 -169 -230 -84 -27 42 143 392 240 32 140 43 197
4713 197 33 -151 65 -153 66 102 -201 -35 -235 -32 41 231 -131 -216 21 165 162 -116 -94 195 302 95
4735 95 -36 -78 38 115 -258 193 -162 8 -98 -59 -151 -63 193 -141 112 56 -24 -130 -121 178 37 228 50
4758 50 -156 -186 219 -131 -155 227 -57 -122 -17 -54 135 -17 81 -113 -52 21 -5 41 24 45 54 -29 -70 -31 -21 -55
4784 -55 244 82 161 257 -172 25 66 40 -13 -51 -241 130 51 106 209 94 224 50 -111 45 -107 132 203
4807 203 10 35 -330 49 105 62 -24 44 173 118 -295 -20 121 7 79 14 -121 123 -17 240 -263 259 -41
4830d1nl9k43M71k71K06j9j36J92k00K07j62j11M11k24k01N18k76j85J80j87J01
4852a4k40L93j76M1J95k08j33J35J34l56K08J35O9J17m31M5J53K8Mk34K02k0l22
4875b75K88k39M60k19J89k80j46J87O1J49O3k99R8j4k51J88j6J51l26J0j18L64
4897B5j75J69o1J6j0oJ61r3m3j84N98j73k84j61M01j79Njo2K46l22L51m03Q3J20
4922A8J26n9L4j28q0M09j41m25J68J73j00k37L7J74j01K55j35o5Q8MJ71j48K1
4945E9r2j08j67Q8R7J38r0J20l54L74J56l10K66J14k29k92L84m37K33k06M37k67
4967h6j01K00l6N3k6r9K7j38K94n6q9K90k06L4j05J86q8r5M07l21Q1j6Q8j23J8
4992I3j63J6K59m6j19J08j54j24J97lN8j81K11k12K69n7J1k24q0M8J41l51M77
$$ plain form
4830 -41 -46 -85 -328 143 -128 78 59 -77 115 -85 122 -40 -151 260 36 -165 353 77 -108 72 -115 -14
4852 -14 -254 139 -37 4 199 -9 -142 -7 127 -229 -21 114 183 300 -131 -86 67 95 99 -135 67 47 -275
4875 -275 13 -226 234 15 204 -76 -222 -35 26 175 238 -61 37 23 -228 -40 -56 95 -231 -221 -339 25
4897 25 -150 19 -42 -26 -36 -42 119 26 -17 -201 397 224 -60 -221 180 1 6 5 -57 189 -133 218 -185 -102 18
4922 18 144 85 119 -9 -89 320 179 -246 -78 95 -5 -242 -205 -31 -132 123 -12 -77 11 15 186 38 59
4945 59 -33 -141 -308 -220 -123 15 -75 45 -309 65 221 -89 177 291 62 -230 154 -283 -50 -256 181 -86
4967 -86 -187 13 -23 30 4 -95 -68 -206 88 32 -57 233 27 61 -44 142 54 -41 366 45 126 110 198 75 93
4992 93 -70 -54 205 159 40 148 -6 -130 67 64 122 -59 152 -60 209 152 163 -61 -141 -93 48 -303 174
5015A74l60j93L57K45k77J37k5k5q4Q5Mr0J18j66k28L17q7M12l45pK27j69j55
5038a35L82l0n49K07K23k40K94k89M7J55j49J11j77mJ21N00o01K05lq4P8k66K61
5061E7j75J56J44k90K51l69K50J8j85j8J25R9l01K27K66k27J34j11KJ64m62j02
5083c47M29Q0l18K00j52r6P6J3j02L91k87j6J99k5j03p7J55L3p1j26J1J80L9j3
5107G3o08O27j03k22M5O7L05k44L40l85R8k78N09k08r7L33k83j89L52k77J52P4
5129H1K41k65j54M5L6J0j9j60K09J62k94j88J28J65j36J86k46K66j5L0j50k1J90
5152A01J54l79Q6J06j32J21m8R8j30j64L2J36j24K8K27k03Q9N8LJ66l43J80n2
5175A0j37K22r9O3l2O8Q1l13K09j67M6k0k18K87J53m38K04lJ19J07l01J33k19
$$ plain form
5015 174 -186 -379 -22 223 -54 83 58 33 -51 34 38 -52 66 -100 -328 -11 -98 314 -31 -38 189 20 -135
5038 -135 247 217 -332 -125 98 -142 152 -137 -90 65 -84 27 -150 -154 -33 467 -134 71 68 -16 62 -204 57
5061 57 -118 38 182 -108 143 -226 24 42 -143 -161 -36 63 -238 -11 255 28 162 51 53 217 -245 -347
5083 -347 82 162 -156 44 -108 -204 -128 -115 -217 174 -113 -129 70 45 -58 -135 20 53 -18 -144 -133 47 86 73
5107 73 -535 92 -11 -233 -188 -121 184 -60 280 -105 -7 -285 224 16 -81 252 -31 -220 132 -145 7 81
5129 81 322 57 -97 -52 -16 -6 -25 -185 24 186 -108 -296 -168 -3 -139 47 -199 67 52 82 -68 -89 101
5152 101 255 -124 -38 68 -64 57 9 107 -23 -187 -155 -19 -143 -115 112 -91 -2 56 59 225 -118 62 10
5175 10 -127 95 -4 59 27 95 176 -137 72 -95 -49 -69 -287 0 153 -285 -81 -84 35 142 -159 -26 -245
5198b45J85K17r6k51J24rj84J55O2J3k6Q7J36l97J40M7j25M64n13N28j99k53K14
5221G4N4j67j31O7l4j68K53j48J92N2J29k32k5K38j01J24m56L52M1l66R3K63r6
5244HK18j87J0j47L01j47m52P43l70n4J34j12JJ5q1n2K78R6k66L3K13j65J34K5
5268A76j33nj2k39K18k9l8K4R8k98J68L21j56R1J6k70J38q2J32j35J51q8L1j31
5292e2J33l06J23J45Q5k90J76N8K15m62J34K22k46J66m8J37l36J74j94Q7k44J89
5314a34o1L30l01O7J60l59m8M06j32L33k34K79l43o0n9K84k45l0R7P4l25K03M1
5337e7J07N9j21r6M6R0j65L1R8j88J45Q9m19L02R3k83K23p1o3L94l05k38O20l12
5361b1J04Kj67K3J21J05n4k56K34j17j78J66L86l08K5k85J71M45l14N9M9k43M73
$$ plain form
5198 -245 -60 157 61 -190 -66 -75 -259 -104 -42 -29 -55 32 168 -229 -89 -42 -167 297 -216 312 113 -140 74
5221 74 128 -39 -170 -103 -137 -305 -52 -200 -8 44 173 -59 -84 154 53 177 -279 73 114 -252 -159 104 8
5244 8 226 39 49 -98 203 56 -396 347 -23 -77 57 -55 -54 -39 -120 -172 106 202 -64 -31 182 17 151 176
5268 176 43 38 26 -213 5 -24 -62 -38 60 -238 -70 251 95 186 202 -68 70 -12 120 -15 136 48 79 -52
5292 -52 81 -225 -102 43 128 -162 14 72 287 -175 -41 181 -65 101 53 190 -146 28 -166 -79 -323 -134
5314 -134 -195 135 -166 -99 61 -298 -346 60 -72 261 27 306 -37 -97 -156 128 -117 -147 -50 24 -301 -98 -57
5337 -57 50 109 -12 -108 -62 28 -137 -106 -8 -196 -51 38 -381 -79 14 -269 -46 -117 -180 214 -91 -329 291 -21
5361 -21 83 85 -82 -59 62 167 113 -143 91 -26 -204 -38 348 40 65 -220 -49 396 82 141 190 -53 420
5384D20l74K50l25l0r2R5n2J4m7M65k48j1p5k28J92P7l6Rr5K8K1K1mn1j8L8L39
5411B83j98NL9j44n6J99q2o4m1QJ77K1o5J29m20K79K14l49O3J25j06j11M3r2O1
5436h2m6L8J12n6J89k8R2nk29J53j69L2L24k40j47j3K97l01J52k71J33j07J68
5459dp7pJ90l72K55j66J68k4Lp7m7J60l12L57N5k22Q7L8l43M38j48L5J22j96K94
5484B07m69K69K9K2j82K12L9k7J98k91j99K47J73o0j15J70j74j43K15K7j29PJ15
5507A41l02j6J64J77j76J03J98l06r8K00k0N6l9l0p0q6k21M91j01l09J82q0j2
5530a54K57j72L6K38k7o1k49J95P6j94M20j48k94J76Lj48j27J22K13k40LO4k7
5553c8R2j75k40M78j71Q2k3K8l4k2J21O8j49N0o6k5p0O2N1j14m9J94L3o3k7L16
$$ plain form
5384 420 46 296 -29 -59 -151 -56 -108 -94 -141 324 76 65 -10 -238 -46 31 -5 4 -91 -63 -42 -21 -25 -76 -94 -56 283
5411 283 85 90 129 -15 -71 128 46 -18 -59 -51 126 147 82 211 -209 70 284 -65 -2 123 17 -94 -51 -143 -82
5436 -82 -128 -90 22 -34 155 127 219 214 -15 138 -31 1 325 85 -62 -75 222 -79 73 -198 -65 -172 -4
5459 -4 -81 -88 102 -270 -15 -181 -13 -37 -34 -111 -158 2 -310 47 102 -120 -33 5 -338 100 -48 -13 109 -87 207
5484 207 -262 7 36 58 -124 88 127 100 298 7 -192 55 228 168 53 223 49 -94 121 148 19 26 141
5507 141 -161 -177 -13 164 -12 91 289 -17 -115 85 65 121 82 52 -18 -104 -325 166 65 -244 -62 -142 -154
5530 -154 103 -69 -33 205 178 117 -132 63 139 -55 365 217 -77 99 102 -46 -173 -51 162 -78 -75 -11 -38
5553 -38 54 -121 -361 117 -54 28 5 33 -1 -23 98 166 17 67 1 -24 -94 -32 19 -95 -144 50 83 20 -7 309
5579C09l14k28M10l52K4Q1K9p2J44k30J0K69k32J98j16L79pl86J49J58k46K9j57
$$ plain form
5579 309 -5 -233 177 -175 -151 -70 -41 -113 31 -199 -189 80 -152 46 -70 309 302 -84 65 223 -23 6 -151
$$ [...]
8191F4
##END NTUPLES=NMR FID
##END=
