##TITLE=1H_Pr Q-5
 200.13MHz, CDCl3,
 8 sc
 
 5.9.2025
##JCAMPDX= 6.0         $$ Bruker NMR JCAMP-DX V2.0
##DATA TYPE= NMR FID
##DATA CLASS= NTUPLES
##ORIGIN= UXNMR, Bruker Analytische Messtechnik GmbH
##OWNER= pz
$$ XWIN-NMR		Version 3.5
$$ Fri Sep  5 16:20:02 2025 Russian Standard Time (UT+4h)  she@DPX200
##.OBSERVE FREQUENCY= 200.1313
##.OBSERVE NUCLEUS= ^1H
##.DELAY= (6, 6)
##.ACQUISITION MODE= SIMULTANEOUS
##.ACQUISITION SCHEME= undefined
##.AVERAGES= 8
##.DIGITISER RES= 18
##SPECTROMETER/DATA SYSTEM= spect
##.PULSE SEQUENCE= zg30
##.SOLVENT NAME= CDCl3
##.SHIFT REFERENCE= (INTERNAL, CDCl3, 0, 14.3821)
##AUDIT TRAIL= $$ (NUMBER, WHEN, WHO, WHERE, WHAT)
$$ ##TITLE= Audit trail, XWIN-NMR		Version 3.5
$$ ##JCAMPDX= 5.01
$$ ##ORIGIN= Bruker BioSpin GmbH
$$ ##OWNER= she
$$ F:/spectra/data/she/nmr/H-C/1/audita.txt
$$ ##AUDIT TRAIL=  $$ (NUMBER, WHEN, WHO, WHERE, WHAT)
(   1,<2025-09-05 16:18:37.39 +0400>,<she>,<DPX200>,
      <created by zg, POWCHK disabled, PULCHK disabled
       configuration hash MD5:
       00 E9 B6 7A A2 85 ED C7 34 08 36 98 17 FE 4E 26
       data hash MD5: 16K
       3C 33 92 7B 13 32 27 C2 0B FA 89 3C 54 9A 16 0F>)
$$ ##END=
$$ 
$$ hash MD5
$$ D0 05 7F 27 F6 B2 90 AE 4F 6B 72 55 C0 6A 61 4A
##$RELAX= 
##$RELAX= 
##$RELAX= 
##$RELAX= 
##$RELAX= 
##$RELAX= 
$$ Bruker specific parameters
$$ --------------------------
##$DU= <F:/spectra>
##$EXPNO= 1
##$NAME= <H-C>
##$PROCNO= 1
##$TYPE= <nmr>
##$USER= <she>
##$AMP= (0..31)
100 100 100 100 100 100 100 100 100 100 100 100 100 100 100 100 100 100 
100 100 100 100 100 100 100 100 100 100 100 100 100 100 
##$AQSEQ= 0
##$AQ_mod= 1
##$AUNM= <au_zg>
##$AUTOPOS= <>
##$BF1= 200.13
##$BF2= 200.13
##$BF3= 200.13
##$BF4= 200.13
##$BF5= 200.13
##$BF6= 200.13
##$BF7= 200.13
##$BF8= 200.13
##$BYTORDA= 1
##$CFDGTYP= 0
##$CFRGTYP= 5
##$CHEMSTR= <none>
##$CNST= (0..31)
1 1 145 1 1 1 1 1 1 1 1 1 1 1 1 1 1 1 1 1 1 1 1 1 1 1 1 1 1 1 1 1 
##$CPDPRG= <>
##$CPDPRG1= <>
##$CPDPRG2= <>
##$CPDPRG3= <>
##$CPDPRG4= <mlev>
##$CPDPRG5= <mlev>
##$CPDPRG6= <mlev>
##$CPDPRG7= <mlev>
##$CPDPRG8= <mlev>
##$CPDPRGB= <>
##$CPDPRGT= <>
##$D= (0..31)
0 0.7 0 0 0 0 0 0 0 0 0 0.03 0 0 0 0 0 0 0 0 0 0 0 0 0 0 0 0 0 0 0 0 
##$DATE= 1757074716
##$DBL= (0..7)
120 120 120 120 120 120 120 120 
##$DBP= (0..7)
150 150 150 150 150 150 150 150 
##$DBP07= 0
##$DBPNAM0= <>
##$DBPNAM1= <>
##$DBPNAM2= <>
##$DBPNAM3= <>
##$DBPNAM4= <>
##$DBPNAM5= <>
##$DBPNAM6= <>
##$DBPNAM7= <>
##$DBPOAL= (0..7)
0.5 0.5 0.5 0.5 0.5 0.5 0.5 0.5 
##$DBPOFFS= (0..7)
0 0 0 0 0 0 0 0 
##$DE= 6
##$DECBNUC= <off>
##$DECIM= 32
##$DECNUC= <off>
##$DECSTAT= 4
##$DIGMOD= 1
##$DIGTYP= 9
##$DL= (0..7)
0 120 120 120 120 120 120 120 
##$DP= (0..7)
150 150 150 150 150 150 150 150 
##$DP07= 0
##$DPNAME0= <>
##$DPNAME1= <>
##$DPNAME2= <>
##$DPNAME3= <>
##$DPNAME4= <>
##$DPNAME5= <>
##$DPNAME6= <>
##$DPNAME7= <>
##$DPOAL= (0..7)
0.5 0.5 0.5 0.5 0.5 0.5 0.5 0.5 
##$DPOFFS= (0..7)
0 0 0 0 0 0 0 0 
##$DQDMODE= 0
##$DR= 18
##$DS= 0
##$DSLIST= <SSSSSSSSSSSSSSS>
$$ [...]
##$SUBNAM0= <"">
##$SUBNAM1= <"">
##$SUBNAM2= <"">
##$SUBNAM3= <"">
##$SUBNAM4= <"">
##$SUBNAM5= <"">
##$SUBNAM6= <"">
##$SUBNAM7= <"">
##$SUBNAM8= <"">
##$SUBNAM9= <"">
##$SW= 18.0517328524113
##$SWIBOX= (0..15)
0 0 2 0 0 0 0 0 0 0 0 0 0 0 0 0 
##$SW_h= 3612.71676300578
##$TD= 16384
##$TD0= 1
##$TE= 0
##$TE2= 300
##$TE3= 300
##$TEG= 300
##$TL= (0..7)
0 120 120 120 120 120 120 120 
##$TP= (0..7)
150 150 150 150 150 150 150 150 
##$TP07= 0
##$TPNAME0= <>
##$TPNAME1= <>
##$TPNAME2= <>
##$TPNAME3= <>
##$TPNAME4= <>
##$TPNAME5= <>
##$TPNAME6= <>
##$TPNAME7= <>
##$TPOAL= (0..7)
0.5 0.5 0.5 0.5 0.5 0.5 0.5 0.5 
##$TPOFFS= (0..7)
0 0 0 0 0 0 0 0 
##$TUNHIN= 0
##$TUNHOUT= 0
##$TUNXOUT= 0
##$USERA1= <user>
##$USERA2= <user>
##$USERA3= <user>
##$USERA4= <user>
##$USERA5= <user>
##$V9= 5
##$VALIST= <valist>
##$VCLIST= <CCCCCCCCCCCCCCC>
##$VD= 0
##$VDLIST= <DDDDDDDDDDDDDDD>
##$VPLIST= <PPPPPPPPPPPPPPP>
##$VTLIST= <TTTTTTTTTTTTTTT>
##$WBST= 1024
##$WBSW= 4
##$XGAIN= (0..3)
0 0 0 0 
##$XL= 0
##$YL= 0
##$YMAX_a= 307093
##$YMIN_a= -319544
##$ZGOPTNS= <>
##$ZL1= 120
##$ZL2= 120
##$ZL3= 120
##$ZL4= 120
##$ABSF1= 10
##$ABSF2= 0
##$ABSG= 5
##$ABSL= 3
##$ALPHA= 0
##$AQORDER= 0
##$ASSFAC= 0
##$ASSFACI= 0
##$ASSFACX= 0
##$ASSWID= 0
##$AUNMP= <proc_1d>
##$AZFE= 0.1
##$AZFW= 0.1
##$BCFW= 1
##$BC_mod= 2
##$BYTORDP= 1
##$COROFFS= 0
##$CY= -3
##$DATMOD= 1
##$DC= 2
##$DFILT= <>
##$DTYPP= 0
##$F1P= 0
##$F2P= 0
##$FCOR= 0.5
##$FTSIZE= 0
##$FT_mod= 4
##$GAMMA= 1
##$GB= 0.15
##$INTBC= 1
##$INTSCL= 1
##$ISEN= 128
##$LB= 0.25
##$LEV0= 0
##$LPBIN= 0
##$MAXI= 10000
##$MC2= 0
##$MEAN= 0
##$ME_mod= 0
##$MI= 1.114404
##$NCOEF= 0
##$NC_proc= 0
##$NLEV= 6
##$NOISF1= 3.799351
##$NOISF2= 2.8
##$NSP= 1
##$NTH_PI= 0
##$NZP= 0
##$OFFSET= 14.38212
##$PC= 1
##$PHC0= -1561.591
##$PHC1= 11.79228
##$PH_mod= 1
##$PKNL= yes
##$PPARMOD= 0
##$PSCAL= 0
##$PSIGN= 0
##$REVERSE= no
##$SF= 200.129724274929
##$SI= 16384
##$SIGF1= 3
##$SIGF2= 2
##$SINO= 400
##$SIOLD= 16384
##$SREGLST= <1H.CDCl3>
##$SSB= 0
##$STSI= 0
##$STSR= 0
##$SW_p= 3205.1282051282
##$SYMM= 0
##$S_DEV= 0
##$TDeff= 0
##$TDoff= 0
##$TI= <>
##$TILT= no
##$TM1= 0
##$TM2= 0
##$TOPLEV= 0
##$USERP1= <user>
##$USERP2= <user>
##$USERP3= <user>
##$USERP4= <user>
##$USERP5= <user>
##$WDW= 1
##$XDIM= 8192
##$YMAX_p= 0
##$YMIN_p= 0
$$ End of Bruker specific parameters
$$ ---------------------------------
##NTUPLES= NMR FID
##VAR_NAME=  TIME,          FID/REAL,        FID/IMAG
##SYMBOL=    X,             R,               I
##VAR_TYPE=  INDEPENDENT,   DEPENDENT,       DEPENDENT
##VAR_FORM=  AFFN,          ASDF,            ASDF
##VAR_DIM=   8192,          8192,            8192
##UNITS=     SECONDS,       ARBITRARY UNITS, ARBITRARY UNITS
##FACTOR=    0.0002768,     1,               1
##FIRST=     0,             0,               0
##LAST=      2.2672688,     0,               0
##MIN=       0,             -319544,         0
##MAX=       2.2672688,     307093,          0
$$ Real data points
##PAGE= N=1
##DATA TABLE= (X++(R..R)), XYDATA
0 0 0 0 0 0 0 0 0 0 0 0 0 0 0 0 8 -8 8 -8 8 -16 16 -17 24 -24 32 -37 40 -48 56 -64 72 -81 92 -104 116 -132
36 -132 148 -164 182 -204 228 -252 276 -307 338 -373 410 -453 498 -549 604 -666 735 -812 899
55 899 -997 1110 -1244 1399 -1583 1812 -2098 2469 -2966 3675 -4759 6599 -10303 20572 -108568
70 -108568 -319544 40056 186652 -10577 -30875 43672 -104766 -90890 172991 144321 -181618
81 -181618 -144386 116321 61006 -50316 38114 -10550 -147137 15100 208973 -2861 -207102
92 -207102 -24729 113154 -14505 -6580 87174 -69951 -141670 107087 166047 -91930 -139533
103 -139533 70362 62178 -61264 43174 74596 -126247 -91128 160819 96233 -145713 -76389
114 -76389 86475 14787 -33273 80604 24655 -144703 -19757 167080 31065 -118577 -21061
125 -21061 47319 -9657 26934 67383 -62424 -106576 68575 107827 -64260 -74906 38556
136 38556 -655 -28518 71615 42864 -105617 -55320 111199 49053 -86128 -15361 45471
147 45471 -35978 -5011 90486 -11827 -118545 6981 104268 -13586 -78507 20217 21949
158 21949 -49663 28262 74103 -55165 -82477 54979 68841 -40033 -30902 31006 -15388 -26852
170 -26852 64413 35079 -85609 -34470 70334 15750 -42103 5863 6804 -44301 10357 77397
182 77397 -14805 -86201 14989 66022 -17600 -25723 29201 -6117 -32792 34891 47145 -41857
194 -41857 -48717 39119 28632 -32871 1248 20977 -31314 -15756 47245 13542 -50772 -13925
206 -13925 40475 3627 -24160 18005 11537 -28281 6994 35341 -11108 -29744 10852 17926
218 17926 -14705 -6230 17975 -11050 -23778 20384 18194 -25680 -11720 16890 -1406 -11529
230 -11529 13978 14205 -20154 -11007 27718 7694 -22613 2417 14548 -9907 -6676 12935 1023
243 1023 -17578 -1519 16515 -4559 -16064 6714 5089 -9749 4023 10194 -4874 -6790 7688
256 7688 10333 -5149 -5247 7514 -477 -6453 6895 3123 -8609 -768 4499 -2753 -6657 -207 4914
271 4914 -3830 -2986 8606 571 -6846 4748 5667 -3054 -1040 3904 2820 -2697 -378 6153 -2914
286 -2914 -7128 3472 1208 -5931 -2030 1044 406 -1677 -1574 2797 567 -1426 3502 659 -1412
301 -1412 2886 426 269 2777 -732 -430 301 -869 -333 -3897 -2011 2234 -2822 -2480 3239 -477
317 -477 -1940 867 1298 2074 -600 -155 4478 671 -716 2182 -216 -154 648 -2520 -260 -22 -2594
334 -2594 -567 -1124 -737 853 -1933 156 2346 -1919 87 3300 952 1034 702 1259 2084 -1780 -376
351 -376 2123 -2984 -1442 1945 -1822 -1951 -420 -769 -586 -2380 938 2600 -2912 687 5445 -1024
367 -1024 -1734 3335 2057 -1300 -809 2819 1412 -5145 -57 4071 -4818 -2921 3406 -1871 -3916 1467
383 1467 2756 -2424 -3351 5102 3620 -5669 2337 7739 -4682 -3540 7282 1719 -7142 -784 7205
398 7205 -2068 -8565 4470 4281 -10351 -1323 9590 -3802 -8149 6300 6333 -6129 -2069 9602
412 9602 -509 -9350 8169 8983 -11495 -3989 12149 -1726 -11263 4245 7728 -9319 -7566 11752
426 11752 1419 -14758 4797 12312 -9954 -6216 13444 2775 -12022 3231 13586 -6932
438 -6932 -10518 13015 5339 -16495 1574 13920 -9376 -11228 11660 5211 -15671 -1624 16566
451 16566 -5077 -15046 12521 10371 -15951 -693 18367 -4522 -15376 9702 12708 -13193 -7037
464 -7037 16412 -1723 -17795 8752 12245 -16756 -7319 17568 467 -17366 5367 15868 -11415
477 -11415 -10317 19217 3917 -20743 6017 19856 -10687 -14128 13476 6899 -16670 234 17033
490 17033 -10824 -16973 17145 10583 -20680 -2720 18475 -5429 -13842 14795 11246 -20268 -4910
503 -4910 25144 -1266 -21549 10251 13771 -16899 -5146 19455 -4181 -22531 8967 19393
515 19393 -16010 -12896 19531 1269 -20154 11004 18330 -17267 -12788 22012 8297 -20660 1462
528 1462 18378 -12533 -12395 22013 4426 -27024 924 23150 -7207 -17721 11506 7423 -18496
541 -18496 2636 23733 -10831 -22015 16483 16104 -15772 -3884 16247 -6500 -15755 16324 14820
554 14820 -23400 -11320 22488 1650 -18936 7152 10196 -17018 -4849 23070 763 -24569
566 -24569 4301 21065 -9142 -9984 16947 -114 -19648 8707 20374 -12738 -17987 13765 9734
579 9734 -15818 358 14188 -13306 -13230 20577 9949 -21491 -5160 18473 -367 -11598 11147
592 11147 6795 -19655 -1261 24480 -2577 -21509 5023 12116 -9160 -3806 12640 -6070 -18186
605 -18186 11291 18290 -14424 -12500 13992 3419 -10724 7946 10443 -14305 -8727 19332 7643
618 7643 -18392 -2133 13282 -6717 -6941 12574 12 -17389 2536 17129 -5145 -14324 7352
631 7352 7112 -10150 3216 13741 -9270 -12909 12982 11695 -10833 -6461 9186 -1053 -8861
644 -8861 8899 6976 -14910 -5463 14128 1474 -11361 1541 6295 -5916 -1606 11508 -406
657 -406 -13899 3877 12685 -4807 -6238 6049 -42 -7454 4647 8967 -8156 -10635 8355 6451
671 6451 -8649 -1417 6566 -4465 -4439 8654 3637 -9196 -2564 9888 1247 -6667 3632 3325
685 3325 -7334 565 8693 -3102 -8900 2666 5904 -4084 -3472 4876 -1064 -6285 4923 6153
699 6153 -6268 -4056 6215 2323 -3455 1114 3628 -3829 -2709 6442 1499 -7371 -178 4529 -2279
714 -2279 -2290 2592 -163 -4824 740 5491 -1377 -4720 3208 3311 -2981 450 3286 -1585 -2043 2659
730 2659 2667 -2759 -2291 2928 -7 -3241 1374 963 -3142 -505 2361 -87 -2258 163 2623 -463
746 -463 -993 2932 263 -2523 1617 2225 -1419 -1540 868 787 -1580 -913 1394 -983 -2516 1359 787
763 787 -1739 162 1217 17 -454 939 1081 -852 -381 2217 108 -1463 943 400 -1394 -480 280
780 280 -374 -1210 -702 1139 -459 -1194 1184 159 -583 832 512 -156 550 434 790 -147 -448 808
798 808 -726 -914 880 -487 -1505 140 1 -516 -491 -42 820 -600 -408 1285 282 -159 816 259
816 259 106 187 -212 194 -169 -324 157 -554 -747 484 -807 -793 423 -269 -300 39 384 848 -211 458
836 458 1373 -382 -460 1055 204 -425 170 -145 -262 -347 -291 150 -1310 -352 851 -1110 -621 1138 142
855 142 -456 579 1008 158 -920 859 1773 -859 -334 1215 -739 -724 809 -24 -1123 -1099 763 191
873 191 -1261 196 1115 -1359 65 2297 -513 -1394 1002 1538 -195 -775 1138 323 -2169 592 1680
890 1680 -2172 -2000 1417 360 -1484 43 981 -1129 -1497 2305 1521 -2643 5 2878 -672 -619 1907
907 1907 174 -2257 447 2887 -799 -3374 1198 1910 -2573 -65 2012 -2062 -2507 2546 2510 -2046
923 -2046 -1687 2629 873 -1851 1888 1894 -3373 -708 3682 17 -3378 51 1732 -1534 -1344 2833
939 2833 -574 -4713 1562 4613 -1962 -2852 2155 1406 -1768 1292 3165 -2275 -3426 3911 3028 -3681
955 -3681 -764 2308 -1735 -1421 3058 849 -4883 -1297 5004 218 -4235 1501 2006 -3223 751 4517
971 4517 -1462 -4656 1802 4583 -2017 -2659 2705 -531 -3638 3201 2841 -5016 -3167 4010 1711 -3397
987 -3397 -269 2649 -2608 -1677 5750 947 -5965 214 5492 -737 -2949 1933 762 -4249 1103
1002 1103 5271 -2832 -5869 2936 3413 -3168 -610 2789 -1982 -2806 4379 3493 -4887 -2533 5378 883
1018 883 -3583 2252 1784 -4679 -625 5576 -63 -6210 162 4514 -2259 -2165 3642 -781 -4985 2818
1034 2818 5079 -2907 -3684 3277 2237 -2923 935 3662 -3714 -3412 5251 2106 -5167 -1067 3574
1049 3574 -1210 -2677 3143 1434 -5306 -525 6373 -794 -4886 2347 2860 -2833 -84 4050 -1390
1064 -1390 -4365 2780 4293 -3867 -3058 3775 -576 -3617 2385 2425 -4120 -2213 4724 1626 -4526 339
1080 339 3830 -2107 -1558 4586 86 -4623 1059 4257 -1431 -3352 2065 1062 -3599 587 3867
1095 3867 -2784 -3634 3517 2175 -3144 -651 2973 -928 -2973 3037 2850 -3717 -1440 4287 -17
1110 -17 -3051 1338 1563 -2853 -1114 3104 -176 -3968 1018 3241 -2384 -1825 3047 135 -2771 1749
1126 1749 3074 -1884 -2390 2963 1733 -3307 18 3097 -1983 -2320 2728 959 -3157 -624 2820
1141 2820 -566 -2719 1938 1631 -2977 -23 3403 -690 -2203 1879 1703 -1707 -762 2589 -304 -2920
1157 -2920 1248 2065 -2511 -1044 2452 -477 -2507 884 2019 -1453 -1596 2211 917 -2442 587
1172 587 2483 -1411 -1174 1862 390 -1646 -8 1292 -1057 -1836 1372 895 -2360 276 1850 -1175
1188 -1175 -1166 1474 646 -1116 -411 1872 75 -1462 1268 967 -1308 -80 1334 -474 -1203 302 837
1205 837 -874 -845 1276 -124 -1677 535 1148 -1024 -292 1273 500 -777 -108 1355 -383 -959 975
1222 975 437 -1213 232 659 -698 -862 229 440 -515 -386 999 6 -664 1173 891 -969 22 1027
1240 1027 47 -497 170 755 -417 -703 810 -28 -1226 99 586 -661 -243 264 257 -189 42 723 -185
1259 -185 -346 989 212 -508 539 370 -310 -438 -6 208 -397 -612 408 -126 -559 301 277 -536 197
1278 197 352 122 -104 -68 470 0 -235 541 113 -235 398 247 -370 -65 -124 -144 -555 -316 239 -252 -298
1299 -298 456 43 -364 376 332 150 -2 71 444 -132 -228 563 -254 -588 204 46 -396 -5 -120 -11 -49
1320 -49 -43 335 -285 -254 696 -125 -395 516 382 -146 79 34 147 -241 -213 459 -516 -336 347 -220 -350 405
1342 405 0 -319 -103 114 175 -296 -89 781 -271 -149 648 183 -355 210 314 -107 -442 -41 445 -576
1362 -576 -160 552 -286 -501 845 136 -46 -2 317 305 -373 610 807 -682 -69 1079 -309 -657 242
1381 242 331 -638 -505 305 225 -1009 13 820 -420 -304 764 -103 -405 475 515 -326 -552 664 239
1400 239 -818 103 710 -1016 -490 776 143 -1165 -219 721 -131 -603 565 363 -935 362 1287 -367
1418 -367 -777 653 415 -769 -83 658 -514 -1134 890 614 -1180 -469 1002 -245 -482 522 495 -716
1436 -716 -532 1409 488 -1172 196 990 -516 -247 991 -375 -1185 232 820 -753 -1158 495 334
1453 334 -908 584 1012 -799 -664 1241 797 -861 -280 670 -256 -348 1041 474 -1163 -58 1290
1470 1290 -448 -890 60 543 -727 -225 1202 -487 -1531 775 1175 -720 -342 764 -242 -537 1049
1487 1049 919 -1250 -968 1715 433 -1291 348 460 -739 -323 1140 273 -1605 -122 1391 -192
1503 -192 -824 746 143 -1206 708 1438 -811 -1357 983 1017 -656 -435 802 -716 -1169 1406 708
1520 708 -1596 -689 1180 210 -775 392 720 -1109 -112 1993 62 -1586 503 1010 -614 -365 816
1537 816 -338 -1325 561 1412 -1237 -1243 1180 355 -692 444 761 -895 -431 1379 949 -1324 -484 1130
1555 1130 -272 -498 932 31 -1694 286 1233 -317 -1344 321 603 -845 -183 1149 -689 -1178
1571 -1178 1023 970 -775 -603 698 77 -578 619 686 -1404 -614 1314 75 -1191 -52 467 -551
1588 -551 -191 914 -42 -1338 378 1252 -425 -799 509 130 -565 363 713 -680 -977 843 773 -1160
1606 -1160 -365 635 -649 -457 745 270 -1061 -332 1071 267 -755 508 601 -592 190 1280 -184
1623 -184 -787 306 764 -567 -579 552 -271 -890 470 872 -755 -346 732 114 -361 3 593 -364
1641 -364 -273 945 452 -1065 389 658 -480 -363 360 -4 -749 -27 625 -422 -779 387 523 -521
1659 -521 -53 691 -576 -147 558 443 -264 -485 666 195 -328 557 256 -877 -312 930 72 -558 -75
1678 -75 297 -149 -86 391 263 -441 214 535 -283 -397 608 87 -250 -66 169 -253 -505 136 205 -553 76
1699 76 393 -337 -247 219 392 -188 114 626 181 -390 201 276 -245 45 227 -90 -82 -10 205 -88 -321 195
1721 195 124 -323 298 76 -379 -205 295 224 -115 -86 358 17 -335 369 168 -350 137 393 -252 -45 -60
1742 -60 28 -175 -68 195 -31 -262 302 271 -218 224 160 190 -42 114 408 -108 -283 472 -36 -246 126 -11
1764 -11 -1 -55 103 177 -172 10 103 -260 -138 216 -15 -260 201 63 73 -79 234 -25 -217 -258 84 -284
1786 -284 -179 304 -73 -162 -14 27 156 -108 -94 296 325 116 254 123 -221 163 61 -134 -100 93 64 -218
1808 -218 -217 100 -217 -142 267 -7 -246 247 26 70 -60 104 232 -109 123 157 76 -111 47 59 102 -83 -201
1831 -201 -152 -261 249 -5 -152 105 150 -215 -41 169 -71 -87 -5 200 -69 -123 77 168 -241 -133 31 -355
1853 -355 -231 -20 77 -60 -308 109 84 -154 259 153 -106 -168 277 92 -43 103 84 -157 -346 315 123
1874 123 -341 76 243 -284 -110 330 7 -138 19 206 98 -69 188 173 -397 -53 63 14 -174 70 46
1895 46 -234 129 127 -241 -222 179 207 -195 81 431 -9 -244 98 210 -89 -71 69 80 -177 363 113 -122
1917 -122 -87 95 30 -236 66 252 -244 -80 361 -109 -315 112 153 -64 -31 247 -191 -195 135 404 -103 -154
1939 -154 72 -44 -299 -102 103 -245 -85 -98 118 -156 -58 280 -77 -46 269 167 -39 102 191 1 -135
1960 -135 141 266 -289 -303 272 -135 -354 193 195 -203 166 85 -106 -52 154 302 -166 -16 344 -196 -202 135
1982 135 101 -268 -409 62 259 -240 -88 319 -297 -99 352 -44 -129 90 292 -215 -273 162 224 -201 281
2003 281 320 -229 -232 183 -3 -486 -180 123 -78 -224 -14 36 -286 26 223 -184 -62 188 78 -355 -99
2024 -99 213 227 -205 71 201 -173 97 83 -21 -190 158 86 -152 -168 154 80 -264 -8 331 -67 -143 235
2046 235 102 -294 -116 319 81 -371 65 198 -226 81 179 -258 -267 165 9 -109 -94 190 -2 -264 351
2067 351 70 -298 -167 235 168 -305 42 -31 -107 -248 134 -35 -253 72 189 -226 64 125 -53 -18 238 275
2089 275 11 -275 161 88 -284 89 116 -238 -297 102 128 -169 -210 45 -116 -339 -108 139 -276 94 245 -148
2111 -148 -234 70 162 -90 -203 246 -189 -327 73 178 -232 86 121 36 106 -20 275 10 -144 190 107 -125
2133 -125 233 154 -164 -96 129 -44 -158 -183 41 90 -83 152 -86 -277 -13 29 -93 -84 -152 120 -60 -95 297
2156 297 62 -217 -41 52 -204 113 125 -291 -340 61 95 -118 -148 -29 0 -67 -136 288 -24 -190 243 96 -56
2179 -56 -148 84 -54 -180 73 21 -35 132 -47 -87 215 167 -46 -41 -135 62 -225 -102 524 17 -105 -24 100
2202 100 64 -57 -43 231 -94 24 147 -125 -164 12 -135 -34 77 -9 68 140 146 93 36 -46 206 21 -177 -212
2226 -212 -73 -85 110 -97 -92 19 -15 228 -13 11 79 168 -86 41 113 -196 -93 183 45 -4 -48 137 221 -117
2250 -117 133 -13 32 -97 190 105 71 -112 174 -102 -14 9 -7 -40 -61 41 -49 -79 81 35 -210 105 52 -107
2274 -107 -32 10 -19 68 -29 -106 -272 -145 -15 108 126 10 125 -118 -37 300 -52 21 72 -164 -74 -21 82 -27
2298 -27 72 62 141 181 -202 122 -145 -108 -149 -55 49 -237 47 81 12 38 293 20 54 -19 4 -123 -72 240 -14
2323 -14 -280 226 31 -137 -190 -76 -6 -51 287 270 78 -168 132 263 -186 62 4 17 -115 -47 34 -34 -57 220
2347 220 -5 -95 149 6 -106 44 131 82 -239 -11 -13 18 -130 -33 -50 -35 224 211 -57 56 170 42 -84
2370 -84 -212 -114 -25 -220 6 169 -20 -152 166 -90 -55 14 10 -291 -35 285 -112 -21 44 -179 -185 85 -83 -86
2394 -86 -65 -167 0 86 186 57 125 13 82 -21 56 103 92 15 -140 136 -91 -90 -121 153 24 -63 86 141 -165
2419 -165 197 194 83 -50 -183 49 -5 116 156 143 -89 188 115 -100 151 -115 50 -271 84 283 5 -139
2441 -139 145 -46 -23 -20 253 -196 137 109 218 214 112 93 -257 -35 27 61 -218 68 -113 -7 -56 202 34
2464 34 -198 -45 216 -19 12 -192 4 13 130 -9 -117 -263 176 65 -225 -180 -35 -256 -132 92 100 -219
2486 -219 76 -66 -184 59 -28 97 -66 -219 26 38 -72 64 139 -50 -83 76 87 -274 -74 75 -214 -310
2508 -310 -78 101 -18 -54 119 71 -101 -21 32 -149 24 106 85 138 -17 -5 4 -33 62 0 -138 -55 -128 27 91
2533 91 -29 85 161 -52 94 8 -88 168 -89 -145 106 47 -95 -266 159 -24 -260 37 255 -219 -367 -52
2555 -52 117 -131 39 -164 -102 -45 44 120 -150 120 35 107 -369 -13 129 -25 63 21 -148 -49 76 -146 57
2578 57 -102 -42 74 40 -62 144 -158 179 86 -264 123 107 223 -40 102 123 87 -85 28 6 -80 203 181
2601 181 110 66 -228 -6 85 2 242 38 -27 25 384 10 -80 -22 -122 -126 -17 154 30 -75 181 -5 -58 231
2625 231 113 -27 -146 128 246 -167 -60 119 -181 -122 -127 236 -27 23 278 60 -141 -286 109 -61 218
2646 218 82 49 -197 -20 -35 -127 166 85 -25 -106 174 238 -81 -167 45 -59 -174 -163 67 -3 116 -148 85
2669 85 -58 52 62 -112 -151 148 -31 132 120 -34 -2 -258 -6 318 -34 -65 -129 127 195 85 1 -11 -13 66
2693 66 -31 -293 -185 61 -53 119 -125 -76 210 -43 9 228 89 82 30 -92 -181 90 -56 26 -142 -32 372
2716 372 -220 61 -80 -68 24 -28 58 -101 -156 -169 -164 -70 -15 -199 25 191 -63 -224 -133 -118 82 -80 68 93
2740 93 -20 113 188 418 231 94 -84 -169 -151 11 94 117 2 -53 -176 175 42 -112 12 110 -156 -25 -56
2763 -56 95 -5 -30 -68 -13 -49 -260 193 -68 -119 317 69 -102 -24 -147 -112 -49 18 235 -266 88 80 91 -70
2787 -70 201 -2 -18 -37 110 103 -32 0 123 -11 23 188 88 127 34 104 -52 126 82 20 132 -55 135 -161
2811 -161 -81 135 45 10 -129 162 71 31 39 223 28 -8 134 -72 76 49 -63 -72 -93 -150 53 -13 -102 -40 90
2836 90 -157 -61 6 -111 -118 -77 -98 244 -119 34 -52 -37 66 -36 -105 48 -25 10 22 0 39 -86 34 -122 -1
2861 -1 -220 98 42 -31 -85 -95 -67 -6 159 -32 9 156 37 -70 11 121 225 -215 -167 30 114 -123 -74 9 -122
2886 -122 38 53 -85 -74 -186 -83 23 -102 -136 126 -29 57 176 -7 9 158 148 12 -118 161 75 28 -167
2909 -167 -19 -15 -187 69 81 1 6 34 143 16 68 -110 -196 2 -45 -50 -29 108 -243 -151 190 133 -90 -75 25
2934 25 -43 -94 233 142 -11 55 123 -109 -185 -130 116 -65 -75 -188 -67 -50 288 59 -226 -223 -7 -72 81 302
2958 302 48 -52 -84 122 -142 36 156 204 89 2 132 17 -129 146 145 -150 -109 53 77 -2 35 96 110 59
2982 59 17 126 -83 58 17 81 -56 43 -57 -169 93 -112 36 24 75 -239 -160 -49 24 -159 61 -6 149
3005 149 -134 -100 -51 -132 -19 13 121 -72 38 -122 92 -15 46 223 -73 -209 351 58 -176 -133 48 -51
3027 -51 -70 117 -9 -157 -9 89 19 -57 57 69 -92 93 57 112 -106 76 -48 -121 -85 216 149 89 -17 103
3051 103 55 -17 291 163 -25 124 -37 124 6 -48 184 -62 56 3 18 -95 -59 92 -27 74 40 -115
3073 -115 -84 -28 91 -58 88 -63 57 14 -2 16 66 76 -132 61 -109 -67 -41 -210 119 52 148 -157 68 58
3097 58 22 -144 -31 -76 53 48 99 -199 -133 -29 -234 -88 -55 132 104 -122 37 -28 7 -16 134 53 177 -61
3121 -61 -128 211 165 -139 -181 27 73 -47 -58 -31 118 -36 173 11 -19 32 -50 -41 215 151 -190 -112 126 -22 96
3146 96 -143 105 -30 -39 22 -91 -51 50 -175 -29 21 -18 -45 251 34 -79 150 87 229 80 40 -30 -183 -74
3170 -74 112 -64 -9 155 -118 -141 -26 77 136 -216 181 135 34 -89 -63 31 -209 -65 -89 35 108 -52 82
3193 82 -120 -33 -3 103 -116 29 55 20 -183 172 -43 -19 87 -109 -104 23 53 -143 4 179 -74 60 -82
3216 -82 91 79 -47 132 -26 -76 15 -21 -117 -19 -255 25 -17 57 53 226 120 63 166 -57 -42 12 56 36 9 -59
3242 -59 -16 -175 -18 -72 174 179 -95 88 -96 60 37 -150 136 110 107 -154 60 -103 -95 -16 11 -39 -65 93 183
3267 183 -117 122 124 -125 -89 93 -73 12 -39 -118 -130 -60 -40 -11 4 -67 112 115 78 15 145 74 14 -107 -29 27 37
3294 37 177 -66 -18 67 257 -144 -181 224 84 6 -220 125 2 -132 61 -78 -122 -36 12 65 116 -92 58
3317 58 170 -68 -15 32 -93 202 -126 -34 -59 -216 -332 15 98 -144 -69 59 -16 -279 11 -138 -140 16 -101
3340 -101 27 7 4 -3 271 -80 57 -10 -58 98 -102 -28 -232 -124 -26 220 99 12 -15 91 126 357 -125 -163
3364 -163 -50 -214 50 15 -4 117 -16 -13 114 -78 -102 188 -141 -17 -223 -80 -122 -9 68 -142 92 161 155
3387 155 -219 116 62 7 98 105 -85 -69 -185 -46 -106 -231 -101 164 -154 -128 -119 -80 174 -114 49 77 -75 -90
3411 -90 32 -192 -127 85 -34 -159 -168 17 45 -61 48 137 -59 -67 200 -2 -190 27 182 -74 -2 44 -26 10
3435 10 112 -263 129 -11 230 303 103 52 22 -156 48 66 -229 -173 113 103 -290 -233 -18 19 28 19 -7 137 -36
3460 -36 -141 -153 124 103 -67 -307 -136 -143 -108 53 -39 29 94 107 279 -15 -68 70 266 53 204 89 -57 -50
3484 -50 40 16 -167 -101 190 103 -208 117 88 -159 -156 64 -1 -243 -217 50 197 28 61 39 -184 -71 126 54
3508 54 -6 51 55 -89 -70 -32 61 155 80 130 -21 112 199 83 -3 -16 -157 -50 60 222 -33 65 18 73 171 -26
3534 -26 145 -59 52 128 81 -91 30 8 -107 -114 141 -32 150 205 -38 97 -51 43 -218 10 -34 -1 21 -79
3558 -79 -165 -64 55 -208 52 -23 20 -48 -43 123 32 109 -14 -143 -182 9 -19 92 62 -14 -189 -105 -14 -53 -182
3583 -182 88 80 29 -40 27 126 -17 43 125 -41 -81 96 -10 -145 115 159 81 8 -6 -64 -141 11 90 114 171 113
3609 113 76 -13 -27 354 -4 -75 -139 96 -155 -86 5 -97 29 53 -18 23 51 -14 -32 -21 -137 -187 165 -31 66
3634 66 62 116 -104 135 -252 -178 -110 -74 37 46 105 -95 249 -51 -68 -240 11 -28 114 -1 -140 -71 6 182 214
3659 214 -52 -169 -17 -80 143 57 -123 -24 186 -87 73 -5 -103 -162 -131 -152 -7 142 -151 72 -20 -164 -18
3682 -18 45 -72 43 292 110 -44 -38 70 2 -160 -82 181 -42 -207 177 106 -61 70 -15 215 28 22 143
3705 143 197 -81 -68 54 -174 -13 -79 -152 58 89 40 94 27 289 74 -77 64 116 -29 -105 -5 -122 86
3728 86 213 182 -221 68 84 -8 -145 -85 -68 87 109 102 -19 -105 49 31 -28 109 55 140 -65 61 124 -28 -25 -138
3754 -138 -65 -12 -104 40 80 105 272 22 282 148 136 36 90 217 -176 115 1 -193 30 -53 151 -110 29
3777 29 69 -6 -46 18 5 -133 -182 -39 -6 -164 -5 64 74 117 -64 -127 61 -41 -84 -49 14 -239 8 -110 -168
3802 -168 -103 -71 -10 175 107 58 -49 -91 105 12 66 -101 -91 -281 -145 -308 -178 -142 14 -103 -49 -34 43 168
3826 168 -169 34 -178 103 -242 -121 49 -90 110 -48 62 -11 -105 4 -60 -120 -59 -8 200 -66 15 13 13 175
3850 175 29 78 -94 11 118 45 -60 -121 57 -128 -15 228 -93 40 22 -126 82 -18 -234 -33 36 -208
3872 -208 -53 -114 29 87 89 223 -100 -48 157 61 79 220 223 24 -3 -6 -161 -67 -135 -112 -111 64 -85 -253 201 -5
3898 -5 -180 -85 212 216 20 232 -104 -37 -72 -104 -45 157 23 59 122 -215 -1 -132 55 128 91 150 105 -29 -180
3923 -180 237 -112 -62 263 -26 28 40 -82 101 236 105 -72 42 -201 0 -113 -65 -149 82 94 -144 -199
3945 -199 -15 -57 -127 206 82 -32 233 -39 94 170 -68 -42 193 -32 90 -155 -86 98 80 166 119 19 28
3968 28 194 -51 190 -45 413 3 -95 -25 -31 -87 -11 -14 0 20 -61 38 -161 -4 4 -47 -30 25 -93 -114 -112 237 -20
3995 -20 -71 56 -33 87 190 31 153 191 -69 -95 -139 -117 92 118 136 132 -119 -224 -154 111 16 -32 61 2 -42 -38
4021 -38 3 -168 -13 -180 175 44 60 -13 -50 -60 44 -31 -14 21 -136 -139 73 -14 265 -24 -47 36 -158 -127 -166
4046 -166 -141 -60 -172 -208 98 110 -295 85 215 -20 -175 -44 -20 85 -67 -69 1 126 109 -101 59 102 -39
4069 -39 -110 -34 -19 -6 -15 -37 -32 -78 50 30 114 82 -212 170 -16 -3 77 -17 51 -26 172 66 -77 231 -38 -93 127
4096 127 25 -30 202 -30 -131 -16 -86 151 -176 214 -234 -5 153 84 -31 77 243 -117 176 1 7 44
4118 44 -39 153 103 -158 -105 -112 61 176 101 156 25 -44 -38 10 118 -87 -2 123 233 -127 -364 26 -116 101
4142 101 -51 3 -128 88 105 111 58 180 -190 -214 2 11 138 65 -187 -1 -92 -38 -45 112 -7 -207 -104 -158 -56
4167 -56 22 81 25 -3 5 -1 -4 9 135 -97 1 -37 -100 10 76 -12 -34 126 -99 -23 -11 124 154 -30 -47 115 -112
4194 -112 106 -26 -79 -101 109 46 107 112 -55 194 -30 16 -179 -127 -10 -46 -6 -16 -69 76 156 -285 -75 129
4218 129 -282 -99 -69 -126 55 -58 9 -48 -29 -225 -50 186 79 -100 32 -119 87 -38 19 174 91 7 193
4241 193 78 -315 -143 -32 -12 33 121 124 -170 -93 -59 -52 -218 -5 56 -192 -142 -123 14 101 238 22 2 194 61
4266 61 -83 49 53 -42 -86 0 155 -193 -167 -188 -78 -146 58 10 -42 -151 -62 -43 -69 -42 -48 62 -75 4 55 38 -170
4293 -170 -89 76 -246 -78 -45 94 -158 9 8 -8 -238 -60 12 33 -93 103 8 -57 212 -62 -217 -202 114
4316 114 -78 30 2 135 151 -64 4 -98 -130 -30 101 188 -188 -9 -104 -133 -43 -71 -134 75 11 -74 1 -216
4340 -216 148 52 1 32 95 -114 -86 -165 -12 -148 149 34 -107 136 145 -122 21 -292 129 141 50 183 -22
4363 -22 -168 -156 -228 -237 -147 23 71 -134 124 79 7 -6 30 -66 112 20 -53 -28 90 161 170 -61 -258 206 -85 5
4389 5 25 -64 -29 -169 87 29 -52 -78 190 -20 173 -134 64 -41 49 -34 0 7 55 122 104 70 19 71 -113 -106 1
4416 1 136 -2 -80 -105 131 -121 -99 -205 -141 67 57 -55 132 -124 -116 -99 -240 41 -89 -87 6 68 -21 -44 -131 -99
4442 -99 60 -130 -16 63 -28 -51 71 -9 41 23 224 57 50 31 -66 -175 -160 161 23 -105 -127 64 167 17
4466 17 210 131 -67 -10 42 -45 -32 78 117 141 -161 63 -69 108 -16 -146 -58 -32 -186 -23 97 31 167 41
4490 41 63 278 -168 -86 154 -68 4 -28 20 -104 -273 -140 120 41 -138 51 -63 -30 -97 -37 -255 -163 -122 -39
4514 -39 50 -187 -57 -250 80 -118 -237 153 51 106 26 -2 219 96 113 -23 -68 -18 -27 78 39 -118 264 27
4538 27 80 114 31 -103 75 -65 -64 140 44 -127 32 37 -216 -62 -77 219 97 113 -97 -30 197 -277 140 -10
4562 -10 -50 110 -97 43 -83 -190 -72 99 -24 -2 -142 38 111 -41 -214 -173 72 -125 115 -80 199 157
4584 157 45 134 -69 -38 8 -62 14 291 -108 -109 142 25 -1 -13 -13 -6 76 70 -106 1 33 70 -148 -97 -102 198 -72
4611 -72 -46 -110 50 90 49 149 -108 197 0 90 -13 -72 -79 98 73 -130 32 37 25 -7 -72 90 71 -133 16
4636 16 -47 -122 10 -161 -224 -2 -72 275 -74 -46 88 242 33 -129 1 54 112 28 -93 147 -23 18 -98
4659 -98 63 39 -73 102 109 75 13 69 -120 -15 -206 -18 -16 163 35 -160 -151 11 3 -26 -135 202 -148 -74 -107
4684 -107 -171 45 -126 85 -94 -51 -127 154 -100 71 169 29 -175 -187 68 -28 -39 60 103 22 31 24 -154 -160 22
4709 22 149 31 67 122 116 -60 -87 -5 -132 -105 222 18 8 -15 -47 -73 86 -66 143 -162 67 -255 -320 134
4733 134 75 48 -28 49 -25 -47 -8 -58 194 -63 -49 -282 29 20 -12 5 -80 -33 -98 21 -54 8 106 -105 -38 16 63
4760 63 235 161 31 -122 -45 63 152 -2 -11 138 3 -12 184 16 -86 2 -71 -104 -97 -179 213 -161 64 91 -89
4785 -89 -228 -255 116 -248 -233 -141 109 -67 -8 -11 74 -44 -76 180 -17 -176 90 -95 122 -384 -63 56 116
4808 116 0 130 53 -93 -98 10 33 -140 -105 -221 -169 -44 -153 38 116 145 -229 50 -277 -28 48 28 12 -185
4832 -185 43 -25 -16 -35 132 42 84 -169 -21 251 101 -83 37 -45 5 148 -19 46 50 -25 96 14 -33 -162 -172
4857 -172 185 -16 -68 57 -83 -1 -76 -128 -89 12 66 201 71 121 104 -31 -24 115 -89 -94 -97 129 -120 -70 71
4882 71 -103 -48 -280 3 114 18 12 -63 96 -64 17 -18 2 137 13 -150 -6 -151 -76 86 -46 121 -115
4905 -115 -235 189 197 -140 -96 -13 23 49 62 -10 -9 15 -15 82 -87 32 -167 9 -17 16 -65 -276 -102 74 138 116
4931 116 -62 -4 79 -113 -154 195 58 50 -29 -34 71 -251 -10 -70 45 -232 204 1 -63 -59 162 70 -22 -23 -41 74
4957 74 -106 -21 33 -2 12 3 62 -137 -250 152 -49 -56 -28 79 172 71 -19 0 -44 10 -188 97 95 -41 45 42 -35
4984 -35 50 -54 -99 111 -49 44 -38 156 213 -186 -27 -28 -124 25 -134 14 131 43 -53 -100 36 49 -102 14
5008 14 44 -31 -167 73 58 70 -63 -46 72 61 26 -56 168 -66 -244 14 16 -163 149 -94 17 -4 41 -112
5032 -112 56 83 52 -152 -180 -138 -165 40 -46 -153 106 -36 -38 58 11 -43 -119 6 59 -46 34 -18 -2 93 70 -140
5058 -140 59 4 -43 -125 89 -52 -64 108 -94 37 135 -185 8 1 25 -5 -62 -127 189 57 90 90 202 140 72
5083 72 -221 3 117 55 12 217 -176 60 -161 -43 120 76 161 41 32 -13 -43 177 98 3 126 -168 -28 246
5107 246 242 17 0 -144 -60 -5 -50 48 -98 -65 -141 86 148 31 45 94 -5 -44 101 -201 -73 -56 -173 -42 96
5132 96 -77 -57 7 310 110 70 -120 214 120 68 -43 -3 38 -70 4 195 76 78 -22 39 150 101 -24 -228
5156 -228 81 27 -192 15 -64 -152 -98 -92 -81 -75 84 64 41 80 15 122 -220 135 116 -165 52 -153 111 -45 121
5181 121 -95 -40 -124 35 -5 -67 47 -207 155 -72 35 183 81 -19 -63 -23 -31 48 -44 174 -12 -54 157 -29
5205 -29 108 28 -36 -40 -36 42 -120 58 -77 32 -23 -46 -47 -105 33 69 145 -82 -112 108 -188 175 -60 -11 196 10
5231 10 -1 0 -111 13 68 -127 -153 12 202 40 178 -56 57 3 -75 38 33 41 204 -94 38 15 -62 -196 -5
5256 -5 -86 28 90 -275 136 40 31 -19 -54 -176 -46 -206 -81 38 -66 52 -3 -77 62 34 -82 -11 119 -56
5280 -56 28 203 -28 175 124 -71 30 -87 -188 -4 151 -67 -81 -42 -78 -45 83 -95 -169 -132 -37 -147 -200 85
5304 85 10 6 -22 -25 -14 17 85 25 -28 -27 -34 71 111 -117 86 -176 108 21 98 13 -151 100 23 -314 193 108 -26
5331 -26 120 -221 86 -43 -75 234 -57 -57 -11 221 23 35 -42 58 -47 27 72 -165 -26 -235 143 -204 138
5354 138 22 -38 89 1 -65 -72 -112 25 158 -19 -117 30 -21 -132 -99 -90 202 89 -176 27 -94 -66 -43 -131 82
5379 82 59 39 99 -122 2 -137 17 -115 -65 100 -27 -75 60 75 -216 8 186 -1 -175 26 18 -118 -51
5402 -51 0 -98 168 -171 41 -116 -161 52 36 109 33 -125 -179 51 -86 193 -109 85 230 5 1 63 -233 -58
5426 -58 -65 -28 3 -172 139 -192 8 133 8 20 2 60 -45 -59 -70 82 64 -69 49 -2 -212 197 42 -93
5450 -93 44 112 12 83 53 241 38 203 126 38 40 -252 -112 110 61 -89 33 2 -64 -117 -150 31 83 54 -101
5475 -101 215 -48 29 4 -1 -105 180 -90 137 -141 -53 79 -102 -117 -33 -77 -37 -60 -107 128 -103 -150 180 328
5499 328 -40 -325 -41 -2 -5 100 136 59 -102 -122 1 -60 110 18 15 15 -193 26 95 178 93 -95 -14 49 -123 154
5525 154 229 -80 2 88 -41 -105 -24 146 -84 128 -16 22 -58 -172 -164 -38 -127 -82 71 -179 49 183 191 -48
5549 -48 -28 70 -61 -67 47 63 -44 -112 -175 -73 -195 -21 -177 -47 147 32 -17 129 4 -54 118 -180 -97 43
5573 43 6 -41 58 144 -249 101 42 -50 -80 -18 114 79 -29 191 -110 -27 22 -92 -115 225 -19 -9 -163 149 -88
5598 -88 -177 -126 -104 156 64 16 108 89 -12 143 119 -33 95 31 151 -51 -67 -245 30 -21 -98 -241 -243 -55 -47 -59
5624 -59 -59 125 12 104 156 41 -96 314 -126 180 -35 -71 -139 -49 70 62 29 6 -111 -28 -63 88 -16 89 -55
5649 -55 102 -110 -117 13 54 -19 -71 200 -19 89 -55 -136 44 -47 43 -102 118 -83 -101 59 94 -54 216 193
5673 193 82 75 -145 -37 157 -75 -47 -133 23 91 -61 -184 58 -81 -30 -5 16 68 13 -237 -211 -30 -165 -6
5697 -6 59 177 -81 16 96 -114 65 130 -36 174 -6 9 -38 185 82 62 -14 -4 -131 -165 82 134 70 2 158
5722 158 -3 -75 -65 119 87 25 190 -157 167 15 -7 40 -174 -43 203 -30 -9 -280 -210 107 -130 22 53
5745 53 -63 -159 70 -8 161 -56 198 68 221 -257 -50 -48 195 50 0 -55 -253 95 12 -5 197 -110 231
5768 231 131 -94 -30 30 94 -67 164 -120 6 -153 99 -82 93 -92 -120 -81 148 47 -47 -222 -86 -77 -126
5791 -126 201 39 -18 31 -151 -69 64 -85 120 -172 39 -155 -57 48 -226 4 160 247 -42 4 -285 82
5813 82 51 -101 60 59 -54 12 -79 -173 90 22 96 -38 30 225 -78 -85 128 36 100 -107 239 199 166 -41 238
5838 238 215 -63 134 19 95 -153 162 132 111 -133 -8 -94 -59 -7 20 82 -76 160 96 7 -69 -7 -51 -203 177
5863 177 30 -169 -264 28 10 -83 43 -253 169 268 -34 64 145 4 45 -59 -128 -65 -30 -38 3 60 -161 -102 -94 68
5889 68 -7 181 50 64 -147 -157 -27 103 58 9 -88 69 -66 36 10 -108 217 -219 -44 16 -38 180 138 3
5913 3 169 133 108 48 -84 152 16 23 -148 -201 109 164 -16 92 262 -43 61 40 -62 82 -63 -88 -194 204
5937 204 209 -53 71 64 23 -154 161 -110 24 -161 -44 -83 72 -122 197 -170 133 22 36 -170 72 56 -83
5960 -83 -90 272 -237 4 41 -58 45 -4 -9 -70 211 -87 54 -70 -33 -16 -22 -25 -31 81 81 -13 -246 -141 -230 -95 -22
5987 -22 -167 29 21 -80 258 -18 -5 98 53 -54 -56 -21 -1 6 -153 90 -24 -42 -97 22 -73 236 216 -121 74
6012 74 -17 -20 55 -14 -50 105 -136 146 -61 -28 77 5 97 -54 127 144 30 -43 122 -60 70 -32 1 164
6036 164 109 -50 47 198 10 23 63 15 73 104 -57 17 197 -14 72 47 -28 272 83 -47 36 -147 -101 -87 -177
6061 -177 -256 43 193 94 133 -34 -233 -17 -65 15 -217 -133 76 40 -86 233 3 25 54 21 32 -82 -135 -17
6085 -17 -94 37 10 -64 -16 -233 169 -194 -60 23 -154 15 -111 -32 -44 -87 -85 -74 -86 -125 101 -64 127 -46 -76
6110 -76 103 79 -74 -66 55 147 81 37 -145 -109 45 -45 63 26 -179 -35 12 -10 -80 -33 4 -175 158 -114 -155
6135 -155 107 -292 -24 -94 -52 34 45 139 106 4 -60 -9 124 -24 -18 38 242 89 -29 45 -228 -59 78 -5
6159 -5 -129 -6 15 -77 -136 -45 -103 93 -5 -52 -38 -9 -35 132 58 -23 -14 144 -166 -70 87 -92 58 58 -57 185
6185 185 -27 -98 140 -73 161 81 75 -2 -62 46 -351 -56 -62 239 78 -62 -125 -50 -56 -112 -87 -169 -80 -67 -26 -11
6211 -11 -44 -20 116 129 36 53 14 -68 158 193 -75 72 142 110 55 -61 27 166 143 -48 -148 248 -20 27 -232
6236 -232 -49 -2 119 -45 286 41 23 -201 -175 -65 -142 2 37 -47 52 120 179 200 46 211 149 96 -35 130
6260 130 72 -87 -203 -1 26 214 -126 140 160 211 -118 -147 -18 -71 -21 73 257 -28 -34 33 -146 216 48 -4
6284 -4 -48 -161 38 12 55 -124 28 -38 113 -12 104 179 16 67 76 55 33 -166 50 -51 -52 -14 -12 -213 82 24
6310 24 89 182 -96 11 37 -95 169 -36 35 -15 -389 29 -52 -20 35 -44 -70 136 -76 -114 -90 3 -246 158 -18
6335 -18 -98 -47 139 53 137 -196 -145 53 -146 -287 -42 -41 118 -10 9 63 98 -15 39 31 -66 29 74 117 -65 -79
6361 -79 -261 94 16 109 163 51 -65 10 106 -91 -1 -29 -5 -9 23 96 -100 145 -3 156 -62 -13 -23 -151 0
6386 0 -189 -29 81 125 67 -100 -104 -82 2 30 -73 144 -68 -109 29 146 115 114 -43 44 113 200 70 -42 47 -225
6412 -225 211 31 115 -76 114 -39 39 110 35 131 170 4 124 -109 -80 -209 57 46 -167 33 -239 8 296
6435 296 -3 -138 -34 179 -111 -135 -134 -103 18 -104 60 254 -193 -176 10 150 267 -146 62 -19 80 119 -70
6458 -70 107 -59 295 -137 28 116 -19 59 -6 -165 -112 -71 165 85 37 273 -209 67 -3 86 -98 35 -119
6481 -119 -48 43 -165 253 127 83 -89 21 192 -236 -41 59 112 220 82 100 140 -17 173 87 -154 27
6503 27 -127 -30 107 -73 94 -30 79 13 24 -78 -81 31 98 -6 -130 -5 -112 -34 -84 85 266 120 -19
6526 -19 69 -48 32 40 73 -149 100 183 138 25 -48 -28 108 -83 -304 -97 207 -178 -29 137 28 -52 -201 48
6550 48 39 43 -145 47 -2 66 -48 138 71 97 54 133 171 -32 -5 -197 54 10 141 271 63 140 113 -111 10
6575 10 98 52 66 58 -146 133 35 -94 -7 80 -27 89 72 -24 -68 116 101 -79 -58 19 10 -8 11 -141 -77 -117 -81
6602 -81 53 -58 250 229 -85 -78 99 -97 60 -56 95 68 -176 -15 -62 101 59 103 11 -8 38 -19 -123 -14
6626 -14 -159 220 67 26 3 112 -4 12 261 -31 -93 6 177 109 143 -19 59 -46 -74 36 -92 -20 -127 -159
6650 -159 199 15 104 114 202 -121 -37 92 240 144 22 -111 23 -96 -50 -28 84 128 27 -55 175 120 66 56
6674 56 99 -7 -169 162 78 4 -67 102 -87 45 106 27 121 -164 -57 -92 -91 164 13 -164 -74 -41 87 -4 18
6699 18 22 67 55 171 137 110 58 20 293 13 152 47 179 46 -233 -88 34 76 133 168 123 -173 -207 -16 1
6724 1 -23 -56 181 27 -117 -57 -88 -89 138 -187 101 -24 -5 31 185 51 115 76 -138 92 -153 11 18 -181 -22
6749 -22 233 56 92 99 -102 -88 -76 181 124 26 175 -104 -50 -37 -93 268 76 -110 -36 102 -66 12 -37 -79 -141
6774 -141 -67 18 -36 -52 -29 -22 31 167 196 21 23 58 -7 162 -52 137 -5 -45 65 14 164 -51 -30 43 108 -3
6800 -3 -165 99 147 128 -51 10 -105 -190 -56 63 81 -144 70 -30 -215 -148 29 -56 160 -83 203 77 111
6823 111 96 -216 181 -11 119 107 207 44 53 278 167 164 -87 -56 104 -105 -49 -58 -36 32 13 51 179 -61 119
6848 119 64 -161 -238 -14 128 -193 -17 37 155 5 45 174 126 8 -243 170 -34 -74 -244 -58 63 212
6870 212 32 151 -103 9 -58 -86 35 26 150 -96 -22 0 70 -11 -68 27 119 1 15 50 20 -36 57 158 -146
6895 -146 -44 75 52 -28 -228 -1 63 -42 235 -33 -111 -261 272 -8 -158 -6 -111 145 -167 42 61 -25
6917 -25 -4 -60 27 43 -74 -88 -68 5 -64 -13 -119 116 166 -32 -75 -67 67 -26 -20 13 -168 -45 -17 -66 -2 -113 26
6944 26 59 -50 -27 100 88 74 215 -99 -59 100 106 192 234 70 192 -4 44 56 -30 9 57 140 232 -54 -74 -160
6970 -160 -137 27 91 -8 -13 -125 -71 148 -48 173 115 31 48 91 -144 -8 -42 70 156 -19 -57 88 87 -21 18
6995 18 138 -63 -178 261 171 1 61 -6 140 59 1 42 -69 18 -51 -266 81 23 21 166 -12 -127 48 44 -4
7020 -4 25 -45 102 -42 45 -177 -139 25 -9 243 -22 -59 -49 95 -118 -136 7 -77 75 -50 29 -29 -28 81 248
7045 248 45 33 -149 125 34 -5 21 125 132 101 146 -155 -85 18 82 63 -40 65 -252 -135 -106 -82 76 25 8
7070 8 54 -6 14 13 -108 -16 -194 -2 -137 44 203 -158 -3 28 -50 -58 94 -100 -34 75 12 -101 220 185 89
7095 89 6 27 68 143 53 -200 11 -146 -14 -45 -5 11 9 19 44 126 228 113 198 -55 118 -36 -104 133 136 49
7121 49 -152 -10 21 69 181 67 -137 118 -195 -53 -112 97 -132 -45 -6 69 -165 25 -90 167 203 -82 -10
7144 -10 -27 94 -104 -116 -94 -179 137 -171 -158 53 89 49 23 8 49 -46 -83 46 -76 38 -123 21 -71 151 69
7169 69 -247 -59 118 117 188 -48 65 -131 104 55 35 -157 96 33 139 57 -182 10 -221 -8 94 207 22
7192 22 66 -39 -187 24 -120 51 189 -48 -32 -90 23 58 102 104 119 31 39 76 -117 256 201 -134 162 125 -37
7217 -37 263 33 250 -45 62 -87 -140 -78 22 -66 -123 -89 -153 92 110 21 -70 24 34 17 45 177 -84 29 -34
7242 -34 24 93 -75 257 -159 137 -98 131 -103 207 16 16 -121 72 -68 30 158 190 22 55 -49 -75 10
7265 10 -84 -103 85 7 81 2 -53 93 -100 -113 -88 170 -59 -276 -26 138 -90 -168 -12 100 2 -106 60 32
7289 32 -93 -6 -62 37 -163 -149 -92 2 186 109 -154 -12 39 -121 8 241 -117 -35 -65 -73 62 148 128 83 -173
7314 -173 -5 166 185 132 124 17 278 -50 11 24 60 31 -101 -38 65 71 -181 -137 44 9 -140 227 91 -118
7338 -118 -49 -220 226 -149 45 -69 -15 -45 56 18 30 -42 -29 2 122 -62 -7 21 -85 28 -49 181 26 -106
7362 -106 -272 154 78 36 265 -26 21 180 -54 91 -81 9 -28 -34 -178 107 72 -24 -63 188 -30 15 10 -115
7386 -115 -85 -104 194 -34 -24 244 59 -125 -15 125 44 218 -93 -23 86 133 -52 8 135 -188 -19 115
7408 115 69 116 -61 17 -122 -60 -126 75 -11 145 75 42 -56 -63 209 -188 -77 174 139 23 173 -68 166 17
7432 17 114 -137 117 44 0 -114 -1 103 -217 -32 2 -31 -148 121 -162 -182 21 13 -75 -74 31 3 -235 -63
7456 -63 117 26 89 138 -59 138 -46 -56 -72 -132 -21 -12 -14 41 -197 122 3 -167 -47 101 -78 67 44 -13 45
7481 45 24 -121 -64 128 8 69 -24 -15 -73 193 78 -70 98 -130 -21 -89 118 0 -101 31 -168 -126 78
7504 78 -63 43 -88 111 -26 -19 88 -17 -58 -175 98 -2 -46 -72 46 -21 218 172 42 63 49 -110 169
7527 169 -96 -3 152 133 -1 42 67 -5 33 -3 187 -87 292 -51 92 83 72 -85 174 89 -99 90 -45 18
7551 18 -135 60 -35 119 -176 4 95 -96 -261 -72 103 -79 29 222 73 130 -20 -18 175 -171 8 -72
7573 -72 -231 -32 -115 -107 -16 -206 -258 -93 72 -77 32 -27 124 -85 232 14 -168 83 109 15 94 -79 -168 -168
7597 -168 239 48 -10 -41 -52 -169 -185 -77 -72 -39 183 149 -48 -25 -3 -132 -110 -77 31 52 110 124 -219 -109 13
7622 13 21 -56 0 -153 0 -246 47 -22 153 113 -69 56 -94 166 110 0 -95 -21 105 -8 -188 -105 33 168
7646 168 74 36 -127 230 -17 -59 75 -1 -87 -124 -123 4 -18 -18 -44 114 -218 89 78 50 116 -51 -83 165 -77
7671 -77 -51 187 74 9 -51 77 -69 141 34 -44 15 2 24 17 24 37 -151 56 -26 -31 -77 -71 -58 13 -119 55 159
7698 159 -171 43 -173 -7 -34 115 61 147 -25 -104 -105 46 66 -91 -15 49 -6 -88 112 -79 83 -155 -87 21
7722 21 53 -20 92 -54 -111 31 120 -96 140 201 -198 163 86 172 121 84 182 14 -38 159 14 50 -59 129
7746 129 2 -129 43 -174 112 255 1 4 -139 -222 35 -47 115 37 217 -86 -62 -6 -142 143 91 76 33
7769 33 262 178 101 -118 101 23 -30 209 105 69 -84 -51 126 79 159 -30 134 44 -113 -151 -216 18 259 -116
7793 -116 -22 61 26 142 -15 22 -98 -65 59 29 -229 171 -51 -43 -294 -6 -204 76 99 121 287 23 -87
7816 -87 -41 145 -88 254 53 271 58 81 105 -96 69 -250 83 1 -126 89 -1 -87 133 -256 51 14 -102
7839 -102 195 -32 126 -16 -277 -24 78 87 28 -114 73 3 -56 -136 -3 -47 -16 208 -178 116 230 -20 311
7862 311 -62 -27 66 90 -131 -20 6 221 -258 188 116 -62 11 -77 5 68 -58 35 -79 -125 -13 -115 106 144
7886 144 -104 154 104 -113 224 41 21 31 -22 236 -149 131 96 118 -1 -94 82 -34 -29 -145 235 24 67
7909 67 2 116 63 -8 -68 210 -31 0 -176 48 204 71 24 141 77 126 64 -78 -11 111 -9 -19 -34 -8 -190
7934 -190 -19 51 -71 12 71 27 -108 57 -8 -199 -160 20 -41 10 238 162 90 -81 -9 15 18 -80 104 -5 74
7959 74 -79 83 -211 -45 156 -37 186 -31 -35 8 139 -21 52 -340 -58 -126 -71 20 9 -83 168 167 65 -103
7983 -103 -8 76 -165 51 95 -181 34 -104 66 -87 39 67 71 -34 -74 153 83 -9 -114 -90 -163 -17 -53 -24
8007 -24 -56 118 145 35 203 -75 81 -64 -145 -154 112 -128 21 92 209 -15 14 159 46 64 -64 26 -220
8030 -220 -68 -115 -293 79 39 88 -62 -31 83 -20 -87 -194 93 133 210 130 -23 -171 86 160 43 191 122
8053 122 -46 16 92 64 220 -83 10 4 27 3 -247 -90 238 94 128 -10 110 71 94 -40 78 31 -36 174
8077 174 59 17 39 118 -43 -50 -38 203 -195 97 -9 88 10 -83 106 -26 -74 65 27 46 -77 -44 -201 74
8101 74 -77 292 53 32 -25 67 -48 -132 148 -9 66 27 -153 139 -122 108 8 188 111 144 95 45 -25 -108
8125 -108 39 -41 60 4 -16 15 -20 54 -10 -111 36 -9 -158 76 18 -94 71 25 -213 -69 -60 10 83 -55 130
8150 130 17 -65 237 59 99 49 82 39 -73 -150 71 -143 -85 82 -214 116 34 121 -101 -7 -201 -92 8
8173 8 4 114 44 186 60 27 57 57 -9 147 -3 -30 -172 -10 7 27 -184 -114
8191a14
$$ Imaginary data points
##PAGE= N=2
##DATA TABLE= (X++(I..I)), XYDATA
0 0 0 0 0 0 0 0 0 0 0 0 8 -8 8 -8 8 -16 16 -24 25 -32 40 -48 56 -71 80 -96 112 -128 145 -168 192 -219 249
33 249 -281 320 -360 404 -452 504 -567 628 -699 774 -858 948 -1049 1156 -1274 1404 -1547
50 -1547 1705 -1877 2070 -2284 2523 -2790 3098 -3448 3855 -4334 4908 -5612 6494 -7641 9197
65 9197 -11437 14962 -21339 36514 -152477 15601 307093 -35252 -126679 11967 -7857
76 -7857 -87790 125664 133194 -165689 -172824 144563 135019 -67733 -35177 23668 -75678 16785
88 16785 160409 -1736 -201677 -28894 155213 27692 -51812 31855 -44377 -96060 94597
99 94597 147055 -96993 -141379 77859 97542 -46217 4260 57996 -90854 -69801 156006
110 156006 82301 -159206 -80856 111362 40297 -52331 40956 15297 -126995 -13650 163572
121 163572 16809 -150022 -17197 86420 1876 -552 45600 -51808 -96293 74048 116785
132 116785 -77365 -98946 56401 37612 -40211 35499 36595 -100650 -57958 113161 56881
143 56881 -106937 -39781 73207 -6593 -25671 68552 -186 -108359 6042 117694 -5789
154 -5789 -97425 13598 54617 -32231 -10 60281 -44551 -85266 52141 77461 -45578
165 -45578 -52273 33862 13647 -24714 41154 31911 -75034 -32354 82398 30795 -53401 -5747
177 -5747 22279 -24017 4387 58801 -16323 -85759 13193 76653 -18046 -46132 21379 6921
189 6921 -29003 24775 41837 -39623 -47004 43702 41493 -34757 -12219 28616 -17776 -17724 40556
202 40556 10963 -53933 -17015 44613 7640 -34356 6985 16670 -25137 -1927 33427 -9908
214 -9908 -32891 13930 27066 -10330 -10921 17454 -1641 -21881 15835 21074 -25804 -17628 19461
227 19461 3491 -15836 5831 11429 -17945 -12994 24694 11251 -25349 -1812 20933 -4548
239 -4548 -7514 13965 5490 -13812 -1443 17175 -1898 -18207 4314 9653 -9587 -1855 8750
252 8750 -6697 -9729 6058 8303 -5417 -6801 7829 4648 -5688 5685 6468 -6888 -690 7531
266 7531 -735 -5820 262 4173 -3497 -6015 4799 507 -9601 1726 5560 -5178 -3069 3668
280 3668 2884 -1301 66 6473 462 -6001 4338 4495 -5239 -1447 3299 261 -1991 -3024 519
295 519 -834 -4400 486 412 -3118 2185 1408 -832 2343 529 -261 2281 1147 1048 -192 -732 3178
312 3178 -748 -3277 2298 -761 -4227 -312 20 -701 -1816 -1950 2826 1068 -2022 2157 1423 -138
328 -138 2098 -298 865 2684 -758 193 449 -1094 -75 -2056 -2062 1424 -2352 -2309 2149 -597 -1666
345 -1666 257 595 1807 -212 -251 3781 -100 -952 3605 143 -1511 778 224 -785 -1750 -1071 1051
362 1051 -3452 -2384 4029 -1534 -3970 2771 1877 -1684 -583 2895 2967 -2638 285 6119 -1791 -3480
378 -3480 4293 19 -4542 940 2059 -2844 -4168 2258 2526 -6573 -1355 7138 -3229 -4986 7361
393 7361 3630 -6295 -139 8244 570 -7112 3704 7073 -7801 -3833 9543 -2845 -10264 4155
407 4155 6159 -7006 -5118 7385 775 -9848 4803 10538 -9232 -5714 13455 1998 -11026
420 -11026 3651 9948 -6410 -7961 10211 4341 -14623 372 12847 -8817 -10311 11256 3895
433 3895 -13275 246 13268 -4437 -11473 10900 9631 -13931 -848 16470 -5085 -12624 10588
446 10588 7961 -14208 -4421 15211 -2314 -17320 7781 12129 -15282 -5876 17458 -1863 -16411
459 -16411 8033 14950 -10577 -9345 15981 3772 -16995 5911 15511 -13154 -10403 16735 2508
472 2508 -18939 1311 15913 -9141 -14247 15233 7337 -20520 1219 21553 -7748 -16066 13353
485 13353 11833 -14171 -3216 17361 -5314 -17609 14209 13567 -20688 -7843 18912 -2307 -17050
498 -17050 9324 12128 -17935 -8241 23355 2155 -23404 6754 19303 -12946 -8570 19228 666
511 666 -21242 6652 21036 -13288 -17420 17443 6483 -21107 4332 18676 -15444 -16094 20261
524 20261 11300 -21325 -3261 20391 -6180 -14582 18885 9073 -24765 -1180 25819 -4402 -21237
537 -21237 8776 12144 -15787 -3022 20612 -7889 -24483 13685 19569 -16471 -9791 16702 -473
550 -473 -15079 12440 16142 -19706 -13194 24046 7031 -21408 2614 14112 -13115 -8076 19495
563 19495 1980 -25136 724 23205 -6782 -15847 13485 5067 -18204 5763 21377 -10455
575 -10455 -18740 13945 14711 -14366 -5077 14969 -7506 -14487 16936 10855 -22441 -8479 19495
588 19495 2253 -15441 5489 9469 -15315 -3360 23780 -227 -22925 4613 17708 -6658
600 -6658 -7646 10921 -1542 -15736 8666 18253 -14016 -16700 13719 7787 -12830 2146 10315
613 10315 -11391 -9112 17815 9109 -18883 -4617 17239 -1538 -9562 10321 3372 -15355 1235
626 1235 17210 -4413 -16945 5370 10466 -9517 -2296 11787 -7128 -13595 11821 13145 -11672
639 -11672 -8636 10824 3396 -8354 5552 8349 -12403 -6599 14950 3455 -13518 -724 8040
652 8040 -4394 -4552 8240 16 -13457 2302 13858 -4171 -9445 5865 3584 -5896 3514 8797
666 8797 -6428 -9792 8150 9031 -8778 -4581 7321 -2358 -6187 6365 3438 -9827 -3359 9718
680 9718 2004 -8417 1844 5930 -5239 -595 8873 -1624 -8462 3284 7812 -3296 -5074 4025
694 4025 590 -6447 2659 5910 -6451 -5491 6305 3114 -4822 -687 3712 -1939 -2699 5686 2911
709 2911 -6508 -546 6514 -1027 -3581 2264 494 -4173 -70 4543 -1449 -5973 2025 3682 -3234
724 -3234 -1588 3214 -891 -2292 2573 2923 -2019 -2107 3509 1661 -3090 705 1795 -2584 -1037 2537
740 2537 -304 -3178 -442 2109 -642 -2069 1531 961 -2533 1210 2971 -1228 -1521 1738 1574 -662
756 -662 -608 1817 88 -2307 1033 1261 -2133 -858 978 -761 -914 58 745 -374 -836 1770 801
773 801 -1459 978 1389 -719 152 1183 -147 -942 -408 1291 -137 -1806 261 296 -1485 -192 307
790 307 -689 57 481 581 323 -130 1066 495 -555 1294 683 -1051 473 477 -594 -482 -495 351 -694
809 -694 -1247 541 131 -1117 312 382 -272 297 6 351 586 202 882 169 -361 817 -346 -953 360
828 360 24 -849 -265 -254 63 -577 -600 701 -315 -935 1078 625 -459 541 546 360 216 125 308 -568
848 -568 -720 1140 -374 -1491 676 42 -1066 57 278 -177 -701 357 1507 -502 -705 1679 253
865 253 -729 1080 612 -1011 -647 875 499 -972 -561 929 -1297 -786 1541 -702 -2239 765 1569
882 1569 -581 -964 1191 1015 -1164 287 2476 -1487 -1980 2098 1125 -1662 -181 720 -1016 -1681 1217
899 1217 1246 -2892 -1007 2685 -191 -1646 1722 661 -1821 539 2988 -167 -3055 1178 3070 -1781
915 -1781 -1168 2200 -1448 -2583 2099 2185 -2700 -2608 2026 1623 -2193 737 2101 -2585 -882 4151 731
932 731 -3280 280 2771 -391 -1594 2076 414 -4123 633 4587 -2150 -4174 1638 1835 -1909 -73
948 -73 2478 -1629 -3244 3600 3547 -3736 -1685 3565 -94 -1817 2383 839 -4145 -1049 4741 376
964 376 -5383 305 3033 -2702 -563 3974 -1256 -4729 1874 4866 -1416 -3519 2642 1476 -3020
979 -3020 2017 3453 -4321 -3293 4559 2440 -4327 -1466 2641 -1601 -2385 3966 1257 -6135 -153
994 -153 6069 -212 -3683 1734 2241 -2871 275 5034 -1600 -5812 2801 4522 -3408 -2429 2644 -1130
1010 -1130 -2943 3169 2904 -4930 -3217 5175 1795 -4187 1076 2838 -3313 -834 5465 348 -5762
1025 -5762 195 5419 -1112 -3902 2823 220 -4713 1719 5061 -3302 -4910 2940 3264 -2852 -509
1040 -509 3667 -2015 -3214 4894 3187 -5384 -1620 4547 182 -3185 1788 1840 -4801 -1212 5778 -343
1056 -343 -5996 1713 3683 -2763 -1174 3516 -513 -3857 2470 4831 -3116 -3259 4358 1382 -3738
1071 -3738 1293 3078 -3822 -2548 4467 1602 -5048 -895 4235 -1349 -2789 3833 1139 -4608 546
1086 546 5007 -987 -3476 2117 2446 -2680 -332 3796 -1784 -4003 3002 2616 -3482 -1608 2758 -265
1102 -265 -3129 1876 2854 -3579 -2088 4452 781 -3340 1120 2766 -1993 -1638 2938 708 -3925 282
1118 282 3656 -1829 -2746 2426 515 -3087 628 2932 -1713 -2814 2372 2393 -2966 -529 3531 -939
1134 -939 -2677 2597 1569 -3091 -819 3057 -144 -2974 803 2191 -2651 -1293 3189 -431 -2837
1149 -2837 1503 2012 -1727 -1126 2125 352 -2566 1148 2940 -1974 -1661 2601 254 -2615 326 1776
1165 1776 -1228 -1864 1555 1042 -2534 -94 2384 -1193 -1569 1896 805 -1704 282 2091 -458 -1586
1181 -1586 1258 1519 -1786 -393 1828 -950 -1904 1100 839 -1569 -835 1390 123 -1615 595 1437
1197 1437 -1212 -471 1773 -71 -1086 647 1088 -735 -913 988 435 -1671 -100 1107 -866 -736
1213 -736 1004 153 -946 -157 1105 -36 -952 843 1141 -929 -132 1230 -378 -661 468 269 -624
1230 -624 -598 569 -38 -1153 95 625 -1062 -391 834 -203 -486 301 956 -179 -576 944 599 -948
1248 -948 255 725 -752 -356 365 -124 -441 -638 360 -148 -795 436 424 -903 201 853 -259 -224 579
1267 579 509 -169 -265 553 21 -897 222 393 -554 -185 113 -128 -572 -159 63 -69 -642 294 343 -234 303
1288 303 563 -172 67 332 -16 -350 -157 219 -110 -651 335 4 -923 47 262 -107 -214 24 391 145
1308 145 45 623 93 -381 409 249 -418 307 225 -20 -208 -4 178 -258 -518 429 26 -449 222 293 -171
1329 -171 97 323 398 51 -234 647 33 -419 290 -53 -550 76 -106 -192 -14 -159 28 -185 -143 476 -183
1350 -183 -361 472 -104 -398 110 385 -76 -362 143 580 -333 -301 643 -217 -568 257 182 -346 -237 45 -127
1371 -127 -321 339 579 -577 -188 1024 58 -552 533 508 -149 -225 486 220 -682 -86 732 -397 -778
1390 -778 547 -186 -436 191 377 -226 -493 511 588 -479 -82 1017 -567 -224 1130 334 -1236 -11
1408 -11 767 -30 -671 371 359 -956 -153 1202 -341 -850 603 669 -286 -82 790 126 -922 981 1007
1427 1007 -1093 -657 1051 98 -1041 237 221 -867 -388 762 371 -1261 -56 1235 -361 -380 1028
1444 1028 -13 -1230 303 1292 -187 -1256 641 717 -997 111 901 -1127 -1118 957 729 -1172 -524
1461 -524 914 82 -695 876 769 -1224 -80 1617 -114 -1204 300 691 -442 -173 915 -342
1477 -342 -1612 621 1567 -864 -725 901 134 -611 562 927 -795 -1133 1491 1040 -1109 85 826
1494 826 -506 -406 901 52 -1526 -87 1428 -169 -1240 328 535 -1233 318 1370 -959 -1420
1510 -1420 1074 1544 -632 -478 1239 -120 -1050 946 935 -1543 -831 1260 439 -1134 -99 603 -733
1527 -733 -313 1300 -46 -1604 545 1315 -657 -658 679 58 -1059 581 1527 -729 -1597 777 850 -1060
1545 -1060 -153 558 -749 -804 1188 698 -1015 -891 1397 77 -677 938 202 -1164 282 1409 -263
1562 -263 -1529 90 909 -764 -461 831 -537 -1434 1095 1114 -1201 -744 742 347 -641 347 811 -741
1580 -741 -601 1386 314 -1235 248 709 -513 -378 642 167 -1252 -17 1431 -226 -1250 651
1596 651 534 -518 445 641 -421 -766 863 1199 -885 -470 596 -85 -657 542 185 -1137 -452 940
1614 940 183 -857 56 607 -548 -200 1059 -80 -826 490 758 -351 -498 384 144 -661 239 842
1632 842 -620 -697 620 208 -794 -209 426 -524 -535 699 317 -976 187 1109 -45 -573 484 250
1650 250 -446 279 525 -16 -776 259 451 -530 -134 462 -347 -227 471 157 -401 -361 639 445 -486 292
1670 292 563 -384 -9 658 58 -602 -69 566 -281 -483 326 222 -780 239 506 -190 -260 216 103 -213
1690 -213 159 458 115 -551 597 317 -336 -47 337 -173 -242 -11 242 -362 -393 397 -53 -511 161 446
1710 446 -205 -69 350 23 -149 180 135 -173 -431 384 60 -339 211 160 -350 -130 57 125 -352 138 372
1731 372 -98 -77 99 277 -146 34 234 -69 -46 -85 15 -46 -295 8 -147 -169 60 109 -326 18 77 -76
1753 -76 -98 113 178 -145 -147 225 313 -408 -36 298 -75 51 -136 57 -138 -120 113 22 -237 43 -56 -232 235
1776 235 -119 -101 -52 -130 -122 174 -76 383 155 -293 269 151 -256 -223 345 -194 -118 -188 -39 -73 -81 359 39 -254
1800 -254 197 34 -138 109 119 -14 -76 -29 209 -190 -117 75 -196 -216 71 -33 -126 -155 -109 -17 -69 -18 250 -92
1824 -92 -130 265 52 28 149 -23 -169 50 190 33 -236 -32 290 -74 -131 150 -33 -162 3 225 107
1845 107 199 -21 25 -58 8 166 -117 -40 27 189 42 -160 135 -125 -233 -48 360 -146 94 124 -14 -172
1867 -172 76 331 87 -275 124 215 -96 58 230 -207 -287 189 -70 41 -103 159 -76 -232 153 296 -345
1888 -345 16 109 -64 -88 228 204 -245 -9 126 53 -132 118 75 -150 -97 137 -206 -147 -27 26 -60 -134 112
1911 112 18 -205 75 314 -116 -4 242 -189 -39 18 100 -46 -196 348 212 -364 -197 80 -248 -217 347
1932 347 221 -287 -16 65 74 -37 294 -43 -191 198 292 -71 -190 266 -71 -211 -266 189 7 -149 143 158
1954 158 -251 111 280 65 -150 289 418 -12 -142 329 111 -247 125 759 -248 -103 249 -89 -397 -50
1974 -50 385 -35 -310 365 243 -248 -46 420 -161 -136 354 85 -237 -126 411 -204 -459 -50 75 -304 -51
1995 -51 92 -240 -167 337 246 -321 -120 359 47 -209 260 282 -222 -229 220 -38 -322 63 149 -199 -220 39 189
2018 189 -181 -139 1 -304 -11 132 84 -459 -34 497 -126 -28 132 71 -15 49 396 -155 -400 5 261 -498
2040 -498 -213 107 -96 -198 324 11 -214 -47 332 -78 -173 -19 -98 -284 -103 600 -245 -117 -57 229 -121
2061 -121 -44 202 -180 -463 73 103 -178 -106 287 35 -179 115 11 -76 -146 257 185 -260 45 229 -205 -119
2083 -119 268 -120 -320 -52 -22 -29 -379 148 271 -106 154 334 -52 -202 262 295 -32 -58 -95 49 -183 156
2105 156 300 -173 -17 189 24 -114 -4 53 -46 -55 -36 88 -149 165 186 -54 -69 279 -76 -167 -180 91 101
2128 101 -316 93 142 -161 -18 118 -91 -62 238 -75 -49 133 104 -4 -175 32 197 -152 70 60 -89 55
2150 55 77 -74 -269 105 -39 50 -190 58 196 -375 -113 120 -64 -175 -41 182 -117 -152 300 102 -296
2171 -296 -57 -114 -55 -81 91 6 209 -50 166 -38 -71 120 -2 -57 154 85 -249 -23 68 4 20 -22 -93 2
2195 2 26 103 -80 -175 166 10 110 42 -84 72 -3 159 11 -134 -51 204 54 -4 38 -39 -67 26 -74 122
2219 122 69 -62 225 47 -204 -129 -23 90 -64 -91 -39 166 38 17 -167 -172 -31 -18 -8 -145 -303 -4 -126
2242 -126 39 -56 77 -188 326 83 -112 112 7 87 3 23 51 64 -134 -33 -8 68 42 -178 -119 21 214
2265 214 116 63 -165 -90 -254 -198 164 -129 8 72 62 99 94 76 91 89 -23 218 -239 -104 185 -75 -50 -67 -102
2290 -102 -58 13 -94 61 -108 -94 217 -129 14 82 -171 -9 17 58 -9 233 89 15 -92 -87 -170 -55 33 -49
2314 -49 43 98 149 103 42 0 92 -11 -42 55 41 -192 -299 116 171 -48 -91 91 -5 -120 3 118 73 61 78 -25
2340 -25 -104 52 112 -147 -350 -28 286 -175 -139 84 -75 46 101 7 212 -40 -154 349 -171 -18 -125 -186
2362 -186 -76 113 -157 125 -50 -141 51 -85 -100 -97 -117 -134 -142 -207 -182 -253 -161 -15 81 126 37 -65 102 108 -45 80
2388 80 170 -9 -62 -169 -70 15 -15 76 -155 -91 114 -144 -26 86 232 -136 -57 29 214 -67 169 233 20 10
2412 10 317 -25 -208 48 116 111 -108 -37 -262 -103 0 -22 -99 -146 75 41 -144 58 152 30 -59 173 252 -87
2436 -87 -5 40 -79 4 48 133 -133 -84 175 -37 -66 54 -5 -203 45 195 8 -130 135 6 -84 -34 47 -128
2460 -128 46 -74 -279 -62 -34 115 -229 38 45 32 -231 38 196 117 -114 27 194 -21 168 -91 -124 22
2482 22 44 -57 107 -153 85 -55 -299 -66 106 87 -167 252 33 25 -172 38 184 -21 66 272 -223 -69
2504 -69 95 57 55 -4 46 -166 218 13 178 162 19 220 -140 -90 116 -156 235 35 186 -142 -105 123 131 -134
2528 -134 -70 29 -53 -231 4 -65 -222 -72 -6 -80 29 83 78 -191 130 -38 -191 -27 46 147 -220 -149 175 -4
2552 -4 -85 23 252 -124 -92 305 76 141 102 93 172 -185 152 -21 -52 203 55 -105 -126 0 139 87 78 -172 -32
2577 -32 -15 360 -55 -264 -124 63 92 31 19 68 -78 8 -40 37 -172 80 83 -205 91 -7 -76 201 -14 44 143
2602 143 96 -32 -122 -209 50 133 -137 117 188 -145 -115 -42 318 -180 -150 170 -64 28 -157 172 -169 -125 201
2625 201 105 -130 -82 147 -11 -153 151 166 57 108 -18 -39 48 -69 -2 -149 -2 112 -10 54 150 39 30 -207
2649 -207 -14 -19 334 58 117 33 -90 50 -126 53 171 139 256 -27 108 10 172 38 -35 82 -102 -17 64
2672 64 -105 11 -19 -34 76 216 135 -86 20 290 -79 -59 -268 -205 54 70 -69 169 -28 129 -48 193
2694 193 -41 -19 16 0 265 117 49 -72 -92 167 56 23 -110 -168 -94 105 -40 -125 -151 155 -19 40 -67 213
2718 213 -209 106 31 -3 111 -16 147 56 38 51 -28 -258 100 61 -208 -92 119 -86 -192 -51 157 -162
2740 -162 2 212 34 -151 -50 -115 12 -78 42 -125 -159 19 -160 -16 -183 -93 33 -187 -53 72 -54
2761 -54 -15 72 14 153 147 112 -23 -38 -191 34 -49 189 9 -143 247 -24 -214 -126 136 47 -25 -136 123 -99
2785 -99 52 -130 -140 -4 -231 -100 267 98 3 230 -2 -234 57 142 25 70 101 20 -151 -192 151 -118 -24
2808 -24 114 163 -114 9 -34 105 -81 -92 -36 133 -163 91 78 -121 74 70 237 -35 -138 -152 18 -27 -102 87
2832 87 -185 3 -19 -179 40 -85 -108 -18 -19 157 -112 -42 -124 5 42 244 23 -106 157 0 -39 22 -98 -57
2856 -57 31 146 -183 40 96 -4 108 -71 87 -43 -16 18 -90 -120 -173 -135 143 110 -140 150 70 -9 73 104
2880 104 123 -96 -54 -10 10 -76 64 117 -121 -113 -122 -491 -65 -53 -53 -210 44 64 -62 -33 -13 -26 -11 15 62 -29 85
2907 85 -49 -47 -91 223 -62 -27 52 194 16 47 -284 -133 208 -70 -83 12 26 -58 157 -204 -14 -67 -22 -185
2931 -185 -95 89 203 -152 -80 -51 42 5 -168 -84 -55 92 5 188 -303 192 113 -85 67 58 -161 -38 26 -3
2955 -3 -190 29 75 174 -72 -105 -56 57 67 300 24 22 119 -30 -37 -107 -95 -28 -105 18 -104 23 -213 104 -69
2980 -69 -260 45 -46 -26 -3 107 34 14 12 -222 -203 -45 28 272 -122 110 -74 20 70 25 -124 -265 -60 340
3004 340 -161 -353 -5 -135 -176 43 26 -68 23 214 138 -47 18 86 -81 13 -26 -75 55 160 -67 -141 -107 144
3028 144 76 -60 46 -96 -141 -164 131 102 -8 -134 -48 74 103 227 51 40 -233 44 143 -109 87 -35 154
3051 154 -70 -15 0 -271 219 215 -109 -87 -81 18 192 236 194 194 -268 107 -4 -65 111 100 251 -59 50 153 -227
3076 -227 -15 310 -37 -97 233 247 134 195 330 -165 140 92 15 55 -68 102 75 -142 -144 29 25 -68 48 -38
3100 -38 -7 21 198 -179 -100 165 28 30 171 138 -47 173 -104 -93 -71 -4 -53 -191 133 -92 188 -27 217 153
3124 153 147 -42 42 165 -156 7 360 89 -145 -12 -312 34 -219 130 106 12 40 -10 36 142 -79 -69 -91
3147 -91 -85 142 -36 -137 156 30 -166 89 216 193 -34 100 -122 -81 139 219 -9 -24 -173 -14 76 14 98
3170 98 39 -194 174 38 73 -73 -30 61 -34 -22 13 -176 -15 209 -126 -174 45 -173 187 -103 1 -12 -101 151
3194 151 138 -56 52 -6 -6 -46 7 157 14 -118 63 128 -133 -89 -114 160 -18 83 0 194 -112 -196 39 -34
3218 -34 20 -16 -136 -29 -32 -62 -234 16 -108 -134 17 -109 -137 27 -160 -65 -201 -68 330 77 102 3 159 209
3242 209 30 -97 19 -35 -129 324 -116 -47 60 -38 -109 -117 190 59 86 190 33 -75 -66 57 -143 -22 62 128
3266 128 -41 -1 15 143 23 -77 48 -59 66 -24 73 21 124 27 83 -189 203 18 196 114 -25 -39 1
3289 1 -108 186 -30 -84 -42 8 -32 216 103 -16 42 77 -162 -35 86 5 38 105 -26 -145 -58 234 21 -155
3313 -155 -43 -29 -168 -37 -338 -135 -114 -142 199 -128 42 31 332 -110 84 132 -57 287 -89 142 -30 90
3335 90 237 -162 -19 269 124 -7 -139 143 -26 30 -84 102 34 37 118 26 -84 136 -37 -99 185 139 74
3358 74 -2 -86 132 -6 -139 36 3 -85 46 -13 8 -58 56 31 35 -18 66 53 -257 -54 -130 -65 -134 2 49 20
3384 20 39 -78 -163 -140 -77 129 -147 -36 56 168 162 31 -137 -33 48 -25 -117 7 250 -43 -4 58 -126 88
3408 88 13 -114 56 -55 144 326 68 20 188 56 22 -2 39 -103 -105 -1 33 -44 41 62 -56 56 -55 -129
3432 -129 -82 -152 78 22 -141 -8 -78 93 -78 4 121 -2 94 -37 -31 -7 152 7 -61 -84 195 -275 2 98
3456 98 328 -49 -183 38 253 60 130 175 69 54 32 153 -86 26 -50 96 -56 -85 1 -143 -60 38 -19 -14
3480 -14 -149 138 -84 -159 -152 8 71 4 -38 -150 -35 -115 40 -152 19 -37 -103 -81 -116 -105 31 152 -40 -317
3504 -317 -117 4 51 -13 -97 -81 -57 79 31 19 -20 107 -70 -150 123 112 -163 -67 -66 186 -95 13 24 13 49
3529 49 90 -156 21 283 31 69 2 -25 -50 -50 71 -2 13 91 -154 -78 -83 92 -25 213 -183 75 135 -12 -60
3554 -60 174 203 -33 54 163 -130 219 -31 -176 -61 56 51 -183 -120 38 148 -86 52 -57 160 145 -35
3576 -35 160 198 92 -114 128 -53 222 -54 56 114 -108 101 -76 -184 23 -168 91 -22 -9 178 150 -77
3598 -77 8 266 -152 -52 47 -4 51 46 136 141 -138 0 3 -90 14 56 33 -141 9 -67 130 86 37 10 15 -141 97
3625 97 78 140 -62 -25 -23 182 -138 11 -62 -142 158 126 67 -82 110 51 -233 -178 -109 124 -89 -78 28 106 -135
3650 -135 -140 55 60 143 5 -128 50 71 57 89 -90 -91 33 -47 3 -99 172 -45 226 -37 4 38 119 -151 -39
3675 -39 -113 85 67 -129 82 63 31 83 139 114 -187 -173 -116 -79 -39 138 -42 66 -9 140 -29 22 139 132 25
3700 25 4 -32 -113 -15 259 21 -22 244 -105 -274 73 100 19 15 29 -156 -163 -147 -78 -50 105 -62 -109 -49 -67 65
3726 65 33 219 -3 -3 -145 -186 86 -29 48 -82 6 -70 132 -34 -51 53 20 -89 -10 67 -36 51 202 21
3750 21 -153 -64 105 59 -82 2 -98 14 -25 -75 -106 136 -118 -31 -156 -65 -46 -90 12 166 9 55 68 132 360
3775 360 -229 -64 -22 92 88 -64 -86 13 -87 -7 -13 57 46 131 -5 51 132 95 105 85 173 -16 174 -105 103 -14
3801 -14 158 4 133 271 0 -69 3 -186 104 -113 108 -41 63 -22 143 -90 103 -207 -78 63 23 -112
3823 -112 106 -55 69 -148 -184 31 -152 229 -122 6 -30 -47 -95 127 -84 63 -9 13 -180 25 -62 23 97
3846 97 63 -77 181 -156 -25 140 -193 96 -144 229 -24 -206 -43 -54 61 -36 -9 52 -61 46 -136 32
3868 32 101 -69 -87 116 -38 100 -33 -120 -30 8 44 -173 -80 103 188 94 189 6 -137 22 139 -22 -21 -159
3892 -159 -34 -77 64 -87 -49 -142 -5 -183 12 -80 -77 99 2 -69 44 47 57 -12 65 56 -59 -119 93 52 -11 -130
3918 -130 -61 -42 132 -30 -118 -31 51 -7 15 46 140 -33 -16 -33 -17 173 15 -6 308 160 -14 -195 -64 -139 137
3943 137 -47 85 -22 -115 53 3 -30 -229 196 -26 -1 -3 2 -107 113 31 37 74 -17 59 -196 30 -89 146 -140
3968 -140 63 -51 -75 76 -54 211 150 -80 197 73 47 -21 -32 59 150 -276 28 32 165 -186 123 -69 107
3991 107 59 14 208 -178 102 -93 39 -143 -91 -7 69 -65 142 133 76 -34 -33 72 203 37 -79 -170 -48 -85
4015 -85 59 -19 -42 23 -93 -41 -33 27 -58 65 67 -163 -204 42 -76 -61 42 -87 182 13 -45 -8 107 57 44 45
4041 45 -54 -69 -73 -9 59 -53 -6 76 85 2 -115 -51 -339 -17 -128 -48 -110 -6 12 -53 -26 -96 6 -9 146 82 65
4068 65 77 81 -156 -110 54 9 121 -3 -126 94 112 -22 -79 209 -40 -9 170 -127 -2 -117 -129 208 32
4091 32 -38 75 -316 -220 187 -106 -130 -122 10 77 -246 36 -5 -276 8 -191 8 130 86 -215 -121 -197 -93 -78
4115 -78 -82 -82 -164 -154 -5 85 -35 -55 62 148 134 -129 203 118 -9 112 72 -107 -72 94 55 -103 -246 204 -107
4140 -107 -28 -131 -38 91 -103 -12 -46 4 88 -54 -38 -323 -94 -46 -218 85 87 -75 50 -4 90 131 185 -141 215
4165 215 -209 167 -173 -150 -76 -17 -15 24 13 319 -29 245 94 27 -192 -50 -18 279 134 -57 147 101 96 91 -64
4190 -64 -26 44 -191 -124 111 -45 -99 -92 -78 30 -110 -1 28 38 26 135 26 17 -88 -184 59 175 -65 -1 133
4215 133 65 18 -2 -22 117 -42 62 -144 127 109 43 -53 -172 -50 -185 100 95 78 99 -104 52 -31 -237 229
4239 229 -117 -85 -27 89 -135 224 -107 -95 20 206 98 -23 -36 33 274 -161 -58 -102 104 316 -12 7
4261 7 -7 131 141 -86 -194 110 -183 67 132 -158 -126 27 183 112 32 -1 -89 -136 84 -26 -51 154 52 -183
4285 -183 -139 44 -12 -138 -26 5 -51 72 -60 72 -51 -123 32 100 -66 -59 89 -223 -23 119 32 -14 80 251
4309 251 45 -31 -41 85 6 238 -148 18 -10 -86 -25 61 -62 125 36 -95 90 -213 120 39 -51 280 9
4332 9 -55 10 -82 150 206 -137 93 153 122 -81 226 -13 109 -17 45 275 -109 -161 71 151 -147 -9 63 42
4356 42 73 77 45 -155 167 166 -162 -175 142 115 -112 72 101 -125 7 -25 141 0 -5 175 -29 41 45 109 -76 93
4382 93 -96 -89 -13 -86 51 -95 109 315 82 -127 -5 -105 -86 -111 -16 -28 -44 109 -47 -43 157 15 -179 54
4406 54 7 -147 59 43 201 -102 -99 -98 -122 -169 -236 -207 -4 49 -38 -33 80 -199 -60 87 137 -102 82 -232 -35
4431 -35 -12 15 -50 -118 -10 83 -198 -133 39 146 68 63 215 149 -45 -98 65 -176 181 -46 95 -12 6 -207
4455 -207 97 -62 -41 1 78 -67 41 -34 106 -34 -4 -11 119 69 -41 -191 -39 -108 -125 81 -41 -102 -18 27
4479 27 -322 43 -41 -94 73 62 -111 -6 -106 61 156 161 197 1 67 73 -3 -36 -101 -19 55 -123 -264 74 69 113
4505 113 189 240 48 4 52 26 -81 41 -111 -21 -65 6 -160 -97 75 -119 -64 -107 75 -49 -75 99 -83 -45
4529 -45 -243 83 -115 -82 -115 113 -171 -12 -59 89 -73 -143 -35 -105 11 307 -174 -130 168 -42 -39 91 102
4552 102 0 -118 80 117 69 -45 -57 37 34 -68 45 -2 -51 -48 7 -84 15 -29 -44 -164 -7 160 40 120 -105
4577 -105 -181 -50 371 -110 -6 -239 12 -59 14 86 248 48 -117 45 221 -63 -69 -169 -169 80 -55 -109 -160
4600 -160 59 -8 116 110 -31 3 -55 154 -234 108 78 -207 -75 -36 102 116 53 151 -139 -133 75 111 -70 17 41
4625 41 37 21 123 -32 -30 81 -48 14 78 -140 160 133 86 117 74 -111 80 111 215 -218 -5 -173 -158 94 -48
4650 -48 95 76 -14 188 -91 -27 -111 -76 -67 40 -24 -85 -120 -29 -35 -50 -63 -11 108 56 197 20 -42 -123 60 99 175
4677 175 85 -37 62 7 -79 36 -182 -41 -151 143 50 -99 -11 58 -74 -157 -177 -92 -185 11 -73 15 -21 -50 46
4702 46 -232 67 157 18 -12 -150 -26 86 -63 69 21 206 23 -124 -52 -126 87 19 202 163 8 -4 48
4725 48 22 -12 -198 76 88 138 69 -247 -30 -27 -38 -36 15 -105 3 15 43 -67 76 36 -130 97 -72 206 114
4750 114 80 -157 -121 -190 -288 -91 -139 50 63 102 54 5 -113 221 -66 -15 -87 21 73 -17 113 -20 -109 -20 135
4775 135 -15 -21 36 -289 -125 -123 14 17 89 83 18 92 169 52 136 -41 -282 -46 103 74 -60 80 -6 -78 2 148
4801 148 -107 135 -67 -85 -113 2 26 105 -87 7 148 64 -111 -86 42 37 -26 -37 -158 74 32 244 125 14
4825 14 -65 27 178 79 69 123 127 -106 96 -106 -15 -134 -61 -34 -120 99 -183 -86 -58 -142 21 -47 -74 -17 -58 -80 111
4852 111 87 146 -196 236 -121 51 23 -86 48 -107 63 -86 59 42 -177 -149 -249 123 31 -148 -72 -147 280
4875 280 -35 6 36 -37 60 112 37 2 -48 55 -2 106 32 55 -31 10 -46 28 27 81 94 -52 132 173 268 -29 39
4902 39 26 26 71 -36 109 -24 48 24 56 67 3 60 31 56 39 143 2 66 17 139 32 174 23 -142 -78 59
4928 59 54 -95 -4 -19 91 -195 -67 -104 -41 98 -118 107 133 85 125 16 190 -26 93 -47 -145 -142 -25 75
4952 75 -251 32 -27 29 87 -43 59 118 -64 -62 -27 -100 -114 -70 95 -28 -229 -217 -59 -48 -104 113 -16 167 37
4977 37 -12 -61 -122 -56 181 -274 -145 12 -229 103 34 123 129 198 -23 -6 -27 -132 -66 117 -31 6 -42 -30 -318
5002 -318 -31 -141 -174 -203 61 -70 54 83 174 -63 34 -32 -218 -8 -11 258 -157 40 -35 -103 -9 -83 153 -53
5026 -53 -11 -35 65 19 -70 11 -129 39 56 139 16 -110 -14 -55 -56 38 -15 63 85 -73 -89 -188 39 34 131 -248 13
5053 13 25 5 13 65 -123 233 130 -77 -177 149 -12 -27 -58 -238 67 3 -102 270 -28 -218 130 114 -66
5076 -66 -8 -71 -57 167 -37 -118 -4 48 -40 -53 -111 123 -37 221 -214 -11 -28 -69 -226 -53 -6 86 122 -151 -47
5101 -47 -126 -20 -104 -33 64 6 7 -162 -133 -300 -39 -99 124 -1 143 -158 42 37 94 27 -157 142 20 160 113
5126 113 -10 -200 -178 -61 -142 20 49 109 -112 -39 96 3 -179 -390 197 -11 56 31 44 -143 -67 -3 -109 114
5150 114 -41 -100 131 100 -51 108 46 80 -170 119 84 40 -9 -95 18 -88 46 71 3 92 113 91 -26 81
5174 81 -219 -97 24 100 -53 -140 -80 -41 4 -109 210 -233 2 -219 48 -27 -213 -60 32 63 -34 -3 170 23
5198 23 256 -228 -52 94 91 199 -73 8 -129 50 25 223 -88 -58 -5 -141 -96 -70 17 78 22 28 53 72 -179
5223 -179 131 -116 85 -109 -77 -39 -153 112 -144 101 -66 -10 -260 82 3 -45 86 143 -36 -153 -125 -117 -176
5246 -176 49 -82 65 -67 101 90 -1 90 -27 199 -46 55 -10 -12 18 -137 60 24 4 -67 -111 132 -154 47
5270 47 -165 -234 -11 -178 -146 -42 207 143 19 -41 86 23 -48 133 89 -71 95 -111 -24 -24 99 72 120 1
5294 1 -156 140 -101 78 -197 70 113 18 -203 -141 264 -88 -90 -217 -55 138 269 -71 -89 117 -242 -146 -85
5317 -85 100 0 -80 83 -103 69 3 65 -49 191 -26 75 -27 102 -17 -50 162 24 -191 -28 8 -71
5339 -71 -50 21 99 84 -19 -88 164 32 150 92 -104 -76 70 -56 86 -9 -11 173 -23 80 16 86 75 126 87
5364 87 -245 -178 -139 39 178 200 70 82 -125 -42 -128 -62 -178 -79 -216 138 141 -34 115 -40 4 36 -26 -32 13 169
5390 169 23 -56 158 -2 49 27 40 -163 -33 130 47 -108 -55 38 75 169 35 82 -95 3 -13 -137 107 -30
5414 -30 -224 -103 1 -185 -19 -18 54 -217 -66 167 23 -74 -46 -4 -135 216 99 -52 13 129 63 -80 -58
5437 -58 -211 -98 -79 206 152 123 -149 -17 -212 -32 62 -38 -13 -78 -46 -93 -175 -69 237 -110 91 -45 208
5460 208 -56 66 146 -76 -90 94 -77 97 -30 66 -29 74 182 -107 12 -110 -24 -61 -4 -204 285 113
5482 113 -70 135 -90 -106 24 95 -250 -155 35 -244 145 -53 -76 -16 -265 73 -37 -123 127 -48 19 17 -38
5505 -38 -39 -180 14 54 -335 -18 114 -112 -61 51 -81 31 65 -176 98 -85 52 -17 -275 126 -152 15
5527 15 -27 -53 -45 -116 -78 -52 -62 -38 51 22 -18 64 -241 58 -154 -185 -26 -91 3 -189 2 -5 -97 -52 160 -14 80
5554 80 39 -178 125 69 40 63 139 -188 43 35 63 -198 -97 -63 -27 61 110 32 79 153 -32 72 -187 -64 5 -112
5580 -112 101 28 -80 -137 -69 216 45 -97 46 86 -76 75 50 129 18 39 119 -126 -76 9 140 -60 14 11
5604 11 -50 -89 -42 54 -134 112 51 -59 80 -182 -49 -25 181 -53 -60 65 -56 143 66 78 18 -26 22 11 74
5629 74 -85 41 -77 66 -57 -73 144 129 28 25 20 -74 -93 1 43 -71 8 9 64 46 61 -9 4 106 199 -114 -3
5656 -3 -34 58 -42 -107 26 96 77 -48 -1 68 9 -92 -32 78 8 56 0 -15 7 128 167 -20 -5 119 -66 74
5682 74 -91 -47 -165 -117 -325 85 -102 -28 40 10 -161 -191 -83 66 100 -148 -132 49 15 165 5 82 15 136
5706 136 -56 117 76 95 33 55 -102 -177 -101 5 -45 -45 34 -128 53 39 30 70 137 54 14 -99 -36 2 63 124 -167
5733 -167 11 -9 56 21 -114 68 -22 -50 -70 -18 -94 32 2 -181 -186 -26 -59 -138 20 -138 -98 108 -28 -30 -10 164
5759 164 0 -37 -271 32 -108 12 -191 -72 28 -41 57 211 1 20 -66 -1 -70 -90 102 -11 11 -192 70
5782 70 -120 -163 -172 -26 158 70 -33 -145 -251 -41 12 139 122 119 151 253 115 -154 -52 175 12 -141 89
5805 89 -65 -81 71 125 -50 1 -81 -239 -117 58 68 43 -46 -185 187 -156 -88 -73 99 131 -24 -168 -99 -111
5829 -111 83 -38 -61 82 89 132 70 -250 103 54 -27 -86 -61 -181 -160 -99 -123 -43 45 -37 -154 45 -109 -52 103
5854 103 18 -32 5 33 -178 89 11 -210 84 -41 -80 43 -33 16 11 -34 72 75 205 -127 162 -146 115 47 -164
5879 -164 23 -30 147 -53 -84 70 -25 77 -71 -61 -175 113 -229 -5 -82 -78 74 70 -106 -140 41 243 -122
5902 -122 77 35 76 91 -165 -42 21 -22 -100 133 130 119 -43 148 -143 -42 -75 -90 78 -4 59 -77 56 87 51
5927 51 131 196 120 -5 49 -212 163 129 188 159 156 73 -33 -56 0 48 101 -47 -84 -10 -62 282 -50 237 220 52
5953 52 -75 31 -97 42 -161 -66 -73 29 32 -24 -3 16 80 88 -133 -52 -39 -70 41 109 63 -44 67 104 120 -4
5979 -4 163 -51 -11 -20 168 13 -81 0 51 20 -78 44 58 -33 -62 -44 107 19 -25 -107 -25 -58 -37 32 -41 -99 -44 142
6007 142 87 81 -39 14 31 -23 -58 -88 224 -117 102 -91 37 104 36 168 116 323 -9 -119 -20 -37 -46 -49 -6 -4 -78
6034 -78 -102 1 148 47 -73 16 83 34 -71 67 -184 -90 -132 16 -42 -104 52 -78 -38 -192 303 -14 113
6057 113 -60 -77 -285 53 -39 193 -113 -25 38 -114 140 -98 5 28 122 -25 -98 8 -8 73 217 -189 54
6080 54 162 -196 26 -150 20 -29 -29 11 206 94 14 -91 -121 -43 37 -230 -5 -4 -215 49 5 120 -11 -7 -76
6105 -76 118 37 -23 14 63 -88 179 -6 61 -39 71 -177 103 147 -118 128 -176 89 -61 117 27 105 -219
6128 -219 -57 -228 -256 85 29 133 37 -14 39 26 60 86 -16 -7 159 -124 -44 161 -33 81 78 25 -27 10 -84 224
6154 224 -80 101 -21 -38 -153 189 -83 -69 160 6 207 49 -128 -18 146 83 187 -138 -2 -16 -112 99
6176 99 -43 148 20 191 32 -24 65 -163 -31 58 -187 -125 -175 31 90 -188 34 -22 187 -150 99 -53 -85
6199 -85 -133 -151 -135 -91 -107 -314 123 -193 168 1 -105 -105 -99 64 16 -27 -59 231 112 44 -24 156 -143 204 38
6224 38 -53 84 20 20 -108 -99 -128 144 -28 -191 12 -104 -46 28 -5 -90 201 156 64 -12 93 92 -268 128 54 -36
6250 -36 70 -92 119 -24 -8 49 112 63 -30 2 -114 -89 -149 -169 -94 113 -8 139 161 -64 40 177 -64 -24
6274 -24 -169 217 -216 78 6 -37 -103 -112 86 -260 190 -63 60 133 25 -58 -48 90 -8 -117 140 62 -142 41
6298 41 -69 87 -132 -245 83 -8 -90 -6 -229 107 63 -3 5 -119 65 75 -141 72 201 -129 -73 28 26 -77
6322 -77 -75 76 -92 -29 -73 -29 -31 0 21 20 -44 71 -124 30 -211 -88 4 -145 41 112 189 77 158 -59 -50 37 -79
6349 -79 86 -62 -111 4 35 -60 85 202 130 173 -153 -140 -16 -65 29 -42 41 181 4 -45 -49 56 18 -40 5 76
6375 76 -15 76 75 -29 47 -17 -198 99 142 76 27 -128 135 199 27 -272 2 -201 -9 179 150 -154 -91 76
6399 76 -21 -2 -191 133 125 72 226 -25 -8 -208 -170 92 157 14 87 -46 83 32 70 100 53 65 88 67 -48 -94
6425 -94 4 40 207 -199 50 2 50 -127 -147 63 -32 -200 -52 127 -75 57 -112 -26 -55 178 -130 -77 -48 -90
6449 -90 22 -104 -209 68 30 44 30 51 102 -109 -82 -20 80 -110 45 -173 78 -205 -145 66 -38 48 -46 -80
6473 -80 12 74 142 -22 -82 216 0 67 144 96 -97 56 83 103 14 -16 43 18 -145 -128 -49 40 -55 -46 50 -29 105
6500 105 8 -123 -4 -141 60 -46 -2 18 -146 -87 19 -180 -28 77 -209 97 -144 12 168 -63 -113 45
6522 45 122 148 73 -42 105 202 75 27 92 -6 -60 -27 -96 -87 -100 -165 -39 -7 -50 52 -43 75 56 243 -206 147
6548 147 2 131 -25 118 -122 -17 91 81 142 269 41 91 -1 140 96 -81 -120 -36 178 -245 91 85 -27
6571 -27 -63 136 -20 -99 6 -162 49 64 -101 -39 -92 149 83 -16 159 -8 99 -74 4 59 -6 24 -35 -305
6595 -305 44 -65 128 -70 54 110 -66 68 -14 87 -128 41 -40 81 90 58 -139 -165 136 -119 -151 -145 165
6618 165 -64 -39 -12 162 176 153 115 -26 33 35 48 251 61 -70 94 42 53 -22 -105 157 46 30 144 125 -2
6643 -2 62 201 176 33 56 -184 134 -206 86 58 135 -8 -9 82 -9 -97 38 70 299 8 -93 -180 -35 36 30 -27
6669 -27 194 246 55 91 11 -176 -112 -189 -35 -82 281 165 -61 -98 -14 74 -42 -97 -12 61 151 -138 -93 296 -29
6694 -29 -186 -68 -69 -25 78 -110 21 -140 -51 -126 143 71 7 -171 146 -55 18 -35 -108 86 -27 -71 71 85
6718 85 15 -40 -102 94 -46 -50 28 86 122 279 20 -46 80 -102 43 144 -78 -9 20 -81 7 -52 -57 54 -3 58
6744 58 -41 94 -106 -210 43 29 23 32 -3 112 161 118 -34 -97 -23 78 -47 -76 134 41 106 -51 68 -128 97
6769 97 -60 -237 -14 111 35 134 17 64 -148 -209 -4 -107 255 40 48 41 -19 -1 -60 17 -65 63 48 58 104 254
6795 254 -15 -205 46 158 -211 10 -131 34 20 11 4 100 75 -114 -91 97 132 46 210 -35 101 -240 28
6818 28 22 111 132 -168 25 -151 -15 88 7 -108 -90 -191 30 40 123 50 37 -107 -60 -9 -165 -232 0 72 36
6843 36 -89 24 256 -18 114 13 -48 -78 101 70 -60 -143 37 -38 150 85 -64 -211 -47 -175 -199 155 -117
6866 -117 -134 -68 91 -12 163 131 -42 71 -60 78 -78 200 -37 93 95 117 98 112 -71 -308 -127 -89 133
6889 133 -15 -232 -78 109 -71 124 -197 96 -16 11 3 -39 -179 -87 185 -137 -118 -174 83 -76 -117 -163 -33
6912 -33 247 -108 -56 -23 152 91 -30 29 -76 189 -130 -70 63 -1 72 -60 57 9 80 59 43 40 -80 52 -74
6937 -74 91 161 91 -10 -2 -37 -38 -45 62 -3 -71 34 189 -75 -13 10 -6 43 -90 -235 67 97 -48 -38 93 44
6963 44 -27 106 -54 -65 -39 -3 110 66 135 238 -78 35 108 -17 -114 17 -168 -118 -93 163 -93 -56 -3 -2 59
6988 59 176 79 -36 24 -94 31 -33 115 -145 -62 -113 -40 92 -264 -153 -49 100 -49 10 -203 -17 124 -15
7011 -15 43 -95 -11 -6 83 -243 -114 52 74 -92 -113 42 49 -92 -130 129 -68 -58 -127 75 127 -115 -44 -106 -3
7036 -3 41 -61 -123 -92 141 56 -215 -161 -12 181 111 -28 302 -71 17 19 124 32 -28 37 -69 73 -20 -81 50
7061 50 -98 99 7 -111 94 -277 46 190 -119 -134 -37 9 122 -183 142 5 68 -37 -103 62 45 -112 -29
7084 -29 34 63 30 -78 74 -147 -128 115 -14 -130 11 26 -62 45 76 34 -64 -342 93 -18 60 196 -37 -80
7108 -80 -39 116 -16 -74 -136 -96 -137 95 -24 -283 107 149 -6 1 -118 -137 63 251 -81 -209 0 60 19 -50
7132 -50 191 201 -167 -38 72 38 -61 205 -65 72 -82 148 65 104 139 -266 -35 -41 97 36 104 -85 98 -115
7156 -115 39 52 90 -17 230 115 -172 -64 -180 27 66 63 -132 -22 -83 120 -40 18 -217 104 -194 -187 148
7179 148 -25 35 55 108 -285 100 14 -140 57 341 110 -105 -1 121 58 59 -8 -43 -103 -357 59 65 189 145
7203 145 -179 -31 203 4 31 -118 -103 15 -36 -72 -3 -100 -74 58 110 -65 131 -189 -274 167 -66 -42 113
7226 113 38 -124 43 -134 -205 -25 -31 -246 192 -58 -64 -15 120 -95 -79 -138 -238 66 -27 -51 154 119 58 -136
7250 -136 -21 -173 -63 -51 -22 -141 -295 -47 2 16 68 22 -10 90 -28 -165 54 -82 -89 166 -38 67 126
7273 126 133 -20 -174 209 -6 -89 115 215 -22 -80 -240 -34 -173 -4 -105 74 7 3 -113 -60 -14 121 -19
7296 -19 10 148 -60 -32 32 -67 134 23 110 126 -120 -47 266 130 -132 -23 204 7 129 93 81 -146 -52 -46
7320 -46 -116 14 -111 9 -117 -53 32 19 -220 -73 -128 56 -49 2 -119 -89 142 42 47 79 -179 -74 -43 66
7344 66 -107 151 135 50 29 -68 118 -51 -65 112 110 -118 -253 -5 40 44 145 -54 74 75 61 90 -130 33 226
7369 226 -103 23 -181 -92 52 -134 85 -32 105 54 -115 -156 81 -117 -34 273 -102 129 8 -101 -106 103
7391 103 96 88 -72 106 66 -101 -18 37 27 -67 5 -76 -151 -96 62 224 29 -3 -51 61 66 1 147 30 -81 -159
7417 -159 -38 46 -81 146 71 -22 26 -17 -160 64 64 80 -142 48 -51 -217 55 107 88 130 69 -252 -133 -72 -15
7442 -15 -170 114 -157 76 146 56 -72 -20 -149 60 -180 -162 18 59 -129 -128 173 6 30 122 54 22 -70 87
7466 87 -80 47 -94 178 182 -165 126 -88 -107 -105 -36 -5 39 1 169 91 63 36 3 110 78 -78 100 -42 -88
7491 -88 -3 41 -138 62 -10 36 30 -87 -316 -79 -136 -37 118 143 -64 -45 169 154 159 32 -152 -98 27 181 -116
7516 -116 -59 7 94 108 -81 -201 -24 -59 -97 102 -42 -61 118 370 104 -201 -101 84 18 22 4 -157 -36 -193
7540 -193 223 -136 164 142 -47 188 229 240 -166 128 -38 90 1 156 -54 -37 -56 79 -195 125 -310 66
7562 66 -135 43 -97 -217 64 148 135 116 -6 21 -93 -150 -93 -87 1 141 -80 36 88 -78 41 -201 -141 -46
7586 -46 58 -188 -20 49 -2 38 -202 59 87 104 -72 115 108 -122 26 75 -104 -62 -159 -11 -105 29 -44 15 87
7611 87 -79 -4 112 177 248 -40 -59 -63 82 30 99 100 -106 -245 -265 -91 29 76 215 82 18 -7 101 223 -18
7636 -18 169 70 -163 -67 -67 140 8 87 33 40 24 -145 -184 -179 5 -19 -18 -134 43 -148 -101 20 -232 3 -128 112
7662 112 96 162 150 -78 -19 30 170 -123 22 63 -30 -38 1 -9 -80 -44 -186 5 -108 -116 -222 72 5 37 -25 -176
7688 -176 239 309 -75 153 111 22 151 28 204 -26 -64 -111 114 64 -130 -250 -25 87 45 1 35 91 -81
7711 -81 37 -267 -39 136 146 119 -93 21 140 102 103 -161 66 -196 65 2 -111 -79 52 -171 160 141 146 -61
7735 -61 -58 162 78 -182 -70 0 155 35 -160 62 129 9 -47 97 33 -40 -38 47 -23 -39 119 68 67 64 -12 -181 99
7762 99 1 117 167 173 75 2 101 48 -184 -52 -161 69 33 -23 -9 -207 185 -217 87 -48 -47 42 152 -113 -79
7787 -79 -92 -146 171 86 54 250 -160 -103 155 58 -294 -117 -30 174 -40 -218 -14 -176 60 4 -33 -69 38 -163
7811 -163 -76 30 -7 67 -182 -4 102 -174 -126 -336 183 -42 142 14 25 111 291 -22 -168 -8 38 -90
7833 -90 2 -239 18 116 235 209 114 28 -6 50 -72 122 102 -1 94 98 93 59 26 20 -40 39 -123 -55 115 -33 -107
7860 -107 109 14 -35 0 93 10 181 -41 -124 14 -75 -137 30 -7 18 35 137 91 -18 30 13 281 170 165 -179
7885 -179 1 -16 -82 23 196 128 -19 -112 63 49 3 7 87 -79 -181 85 -136 21 -105 52 -92 -105 86
7908 86 53 -1 11 69 161 -138 -137 -27 -97 -132 -78 129 33 126 -166 5 89 83 78 -265 78 -47 -86 -25 -74 47 -139
7935 -139 -25 191 -128 19 -29 193 -230 3 131 -130 -56 39 -29 -11 -32 133 57 -125 -113 119 61 48 -47 127
7959 127 150 72 -30 94 -96 120 42 5 74 -78 142 25 27 133 -20 -195 115 -154 36 -63 162 118 153
7982 153 27 36 92 -58 178 42 -14 -54 -183 -18 -33 -18 38 -175 -72 90 -14 -24 -104 -92 26 41 -9 -150
8006 -150 103 -16 90 -4 -28 297 -41 70 1 23 -71 -54 173 87 -67 92 -62 66 -148 109 -43 -46 -81
8029 -81 75 -167 -16 113 23 136 20 -51 2 -186 -69 -142 -435 -47 -170 120 77 -155 -174 126 -27 163
8051 163 -187 6 8 76 -78 63 170 113 -24 -79 87 80 -127 -115 5 -138 -31 4 101 -140 -276 -202 -75 60
8075 60 146 26 18 -54 210 89 76 14 -63 -108 -30 -128 -182 -247 38 118 6 83 -74 89 -127 200 80 65 105 33
8101 33 71 -83 118 55 -32 -34 -50 115 -11 25 119 -61 -108 -64 -147 -166 40 132 45 -56 19 29 -121 -78 68 -70
8127 -70 -14 -33 194 109 17 -46 -280 -263 -112 8 241 107 45 -118 106 236 -109 36 61 74 -125 -26 77 -3
8151 -3 -74 -100 -29 -52 -98 58 -50 -25 172 82 146 -209 26 -46 -52 137 2 -45 44 148 35 212 3 -139 -25
8176 -25 173 -149 -138 -83 -74 57 53 291 -127 -32 -99 -188 29 -47 -87
8191h7
##END NTUPLES=NMR FID
##END=
