##TITLE=1H_Pr Q-31
 200.13MHz, CDCl3,
 8 sc
 
 31.1.2025
##JCAMPDX= 6.0         $$ Bruker NMR JCAMP-DX V2.0
##DATA TYPE= NMR SPECTRUM
##DATA CLASS= XYDATA
##ORIGIN= UXNMR, Bruker Analytische Messtechnik GmbH
##OWNER= pz
$$ XWIN-NMR		Version 3.5
$$ Fri Jan 31 14:00:38 2025 Russian Standard Time (UT+4h)  she@DPX200
##.OBSERVE FREQUENCY= 200.1313
##.OBSERVE NUCLEUS= ^1H
##.ACQUISITION MODE= SIMULTANEOUS
##.ACQUISITION SCHEME= undefined
##.AVERAGES= 8
##.DIGITISER RES= 18
##SPECTROMETER/DATA SYSTEM= spect
##.PULSE SEQUENCE= zg30
##.SOLVENT NAME= D2O
##.SHIFT REFERENCE= (INTERNAL, D2O, 0, 15.4296)
##AUDIT TRAIL= $$ (NUMBER, WHEN, WHO, WHERE, WHAT)
$$ ##TITLE= Audit trail, XWIN-NMR		Version 3.5
$$ ##JCAMPDX= 5.01
$$ ##ORIGIN= Bruker BioSpin GmbH
$$ ##OWNER= she
$$ F:/spectra/data/she/nmr/H-C/1/pdata/1/auditp.txt
$$ ##AUDIT TRAIL=  $$ (NUMBER, WHEN, WHO, WHERE, WHAT)
(   1,<2025-01-31 13:59:13.67 +0400>,<she>,<DPX200>,
      <created by zg, POWCHK disabled, PULCHK disabled
       configuration hash MD5:
       00 E9 B6 7A A2 85 ED C7 34 08 36 98 17 FE 4E 26
       data hash MD5: 16K
       E9 E4 C0 F6 49 3A 90 5E F3 DD B4 E4 FD 9F 89 C4>)
(   2,<2025-01-31 13:59:16.14 +0400>,<she>,<DPX200>,
      <Start of raw data processing
       efp BC_mod = 2 LB = 0.25 FT_mod = 6 PKNL = 1 PHC0 = 236.0128 PHC1 = 31.79223 SI = 16K 
       data hash MD5: 16K
       A7 8C 7E 4D CC 64 D4 59 85 21 93 E4 83 68 5C 43>)
(   3,<2025-01-31 13:59:37.92 +0400>,<she>,<DPX200>,
      <pk PHC0 = 3.774289 PHC1 = -6.000001 
       data hash MD5: 16K
       99 30 77 77 8D 0C 15 12 08 A8 9B 0F 8B 8F E2 99>)
(   4,<2025-01-31 13:59:41.48 +0400>,<she>,<DPX200>,
      <abs ABSG = 5 
       data hash MD5: 16K
       FF 9A B7 8C C8 BD E5 FC 72 15 D9 4E F6 E6 CF D0>)
$$ ##END=
$$ 
$$ hash MD5
$$ D1 46 4E 54 07 2E 8A F0 B3 95 1E D8 10 0D F4 87
##$RELAX= 
##$RELAX= 
##$RELAX= 
##$RELAX= 
##$RELAX= 
##$RELAX= 
$$ Bruker specific parameters
$$ --------------------------
##$DU= <F:/spectra>
##$EXPNO= 1
##$NAME= <H-C>
##$PROCNO= 1
##$TYPE= <nmr>
##$USER= <she>
##$AMP= (0..31)
100 100 100 100 100 100 100 100 100 100 100 100 100 100 100 100 100 100 
100 100 100 100 100 100 100 100 100 100 100 100 100 100 
##$AQSEQ= 0
##$AQ_mod= 1
##$AUNM= <au_zg>
##$AUTOPOS= <>
##$BF1= 200.13
##$BF2= 200.13
##$BF3= 200.13
##$BF4= 200.13
##$BF5= 200.13
##$BF6= 200.13
##$BF7= 200.13
##$BF8= 200.13
##$BYTORDA= 1
##$CFDGTYP= 0
##$CFRGTYP= 5
##$CHEMSTR= <none>
##$CNST= (0..31)
1 1 145 1 1 1 1 1 1 1 1 1 1 1 1 1 1 1 1 1 1 1 1 1 1 1 1 1 1 1 1 1 
##$CPDPRG= <>
##$CPDPRG1= <>
##$CPDPRG2= <>
##$CPDPRG3= <>
##$CPDPRG4= <mlev>
##$CPDPRG5= <mlev>
##$CPDPRG6= <mlev>
##$CPDPRG7= <mlev>
##$CPDPRG8= <mlev>
##$CPDPRGB= <>
##$CPDPRGT= <>
##$D= (0..31)
0 0.7 0 0 0 0 0 0 0 0 0 0.03 0 0 0 0 0 0 0 0 0 0 0 0 0 0 0 0 0 0 0 0 
##$DATE= 1738317553
##$DBL= (0..7)
120 120 120 120 120 120 120 120 
##$DBP= (0..7)
150 150 150 150 150 150 150 150 
##$DBP07= 0
##$DBPNAM0= <>
##$DBPNAM1= <>
##$DBPNAM2= <>
##$DBPNAM3= <>
##$DBPNAM4= <>
##$DBPNAM5= <>
$$ [...]
##$SPNAM4= <gauss>
##$SPNAM5= <gauss>
##$SPNAM6= <gauss>
##$SPNAM7= <gauss>
##$SPNAM8= <gauss>
##$SPNAM9= <gauss>
##$SPOAL= (0..31)
0.5 0.5 0.5 0.5 0.5 0.5 0.5 0.5 0.5 0.5 0.5 0.5 0.5 0.5 0.5 0.5 0.5 0.5 
0.5 0.5 0.5 0.5 0.5 0.5 0.5 0.5 0.5 0.5 0.5 0.5 0.5 0.5 
##$SPOFFS= (0..31)
0 0 0 0 0 0 0 0 0 0 0 0 0 0 0 0 0 0 0 0 0 0 0 0 0 0 0 0 0 0 0 0 
##$SUBNAM0= <"">
##$SUBNAM1= <"">
##$SUBNAM2= <"">
##$SUBNAM3= <"">
##$SUBNAM4= <"">
##$SUBNAM5= <"">
##$SUBNAM6= <"">
##$SUBNAM7= <"">
##$SUBNAM8= <"">
##$SUBNAM9= <"">
##$SW= 18.0517328524113
##$SWIBOX= (0..15)
0 0 2 0 0 0 0 0 0 0 0 0 0 0 0 0 
##$SW_h= 3612.71676300578
##$TD= 16384
##$TD0= 1
##$TE= 0
##$TE2= 300
##$TE3= 300
##$TEG= 300
##$TL= (0..7)
0 120 120 120 120 120 120 120 
##$TP= (0..7)
150 150 150 150 150 150 150 150 
##$TP07= 0
##$TPNAME0= <>
##$TPNAME1= <>
##$TPNAME2= <>
##$TPNAME3= <>
##$TPNAME4= <>
##$TPNAME5= <>
##$TPNAME6= <>
##$TPNAME7= <>
##$TPOAL= (0..7)
0.5 0.5 0.5 0.5 0.5 0.5 0.5 0.5 
##$TPOFFS= (0..7)
0 0 0 0 0 0 0 0 
##$TUNHIN= 0
##$TUNHOUT= 0
##$TUNXOUT= 0
##$USERA1= <user>
##$USERA2= <user>
##$USERA3= <user>
##$USERA4= <user>
##$USERA5= <user>
##$V9= 5
##$VALIST= <valist>
##$VCLIST= <CCCCCCCCCCCCCCC>
##$VD= 0
##$VDLIST= <DDDDDDDDDDDDDDD>
##$VPLIST= <PPPPPPPPPPPPPPP>
##$VTLIST= <TTTTTTTTTTTTTTT>
##$WBST= 1024
##$WBSW= 4
##$XGAIN= (0..3)
0 0 0 0 
##$XL= 0
##$YL= 0
##$YMAX_a= 300879
##$YMIN_a= -352763
##$ZGOPTNS= <>
##$ZL1= 120
##$ZL2= 120
##$ZL3= 120
##$ZL4= 120
##$ABSF1= 15.52102
##$ABSF2= -2.530829
##$ABSG= 5
##$ABSL= 3
##$ALPHA= 0
##$AQORDER= 0
##$ASSFAC= 0
##$ASSFACI= 0
##$ASSFACX= 0
##$ASSWID= 0
##$AUNMP= <proc_1d>
##$AZFE= 0.1
##$AZFW= 0.1
##$BCFW= 0
##$BC_mod= 2
##$BYTORDP= 0
##$COROFFS= 0
##$CY= -3
##$DATMOD= 1
##$DC= 0
##$DFILT= <>
##$DTYPP= 0
##$F1P= 0
##$F2P= 0
##$FCOR= 1
##$FTSIZE= 16384
##$FT_mod= 6
##$GAMMA= 0
##$GB= 0
##$INTBC= 1
##$INTSCL= 3.241238e-09
##$ISEN= 128
##$LB= 0.25
##$LEV0= 0
##$LPBIN= 0
##$MAXI= 10000
##$MC2= 0
##$MEAN= 0
##$ME_mod= 0
##$MI= 1.114404
##$NCOEF= 0
##$NC_proc= -7
##$NLEV= 6
##$NOISF1= 3.799351
##$NOISF2= 2.8
##$NSP= 0
##$NTH_PI= 0
##$NZP= 0
##$OFFSET= 15.42957
##$PC= 1
##$PHC0= 239.7871
##$PHC1= 25.79223
##$PH_mod= 1
##$PKNL= yes
##$PPARMOD= 0
##$PSCAL= 0
##$PSIGN= 0
##$REVERSE= no
##$SF= 200.130018437844
##$SI= 16384
##$SIGF1= 3
##$SIGF2= 2
##$SINO= 0.751879
##$SIOLD= 32768
##$SREGLST= <19F.Aceton>
##$SSB= 0
##$STSI= 16384
##$STSR= 0
##$SW_p= 3612.71676300578
##$SYMM= 0
##$S_DEV= 0
##$TDeff= 16384
##$TDoff= 0
##$TI= <>
##$TILT= no
##$TM1= 0
##$TM2= 0
##$TOPLEV= 0
##$USERP1= <user>
##$USERP2= <user>
##$USERP3= <user>
##$USERP4= <user>
##$USERP5= <user>
##$WDW= 1
##$XDIM= 16384
##$YMAX_p= 309444897
##$YMIN_p= -766210
$$ End of Bruker specific parameters
$$ ---------------------------------
##XUNITS= HZ
##YUNITS= ARBITRARY UNITS
##XFACTOR= 0.220516191357247
##YFACTOR= 1
##DELTAX= -0.220516191357247
##NPOINTS= 16384
##FIRSTX= 3087.92016822557
##FIRSTY= 0
##LASTX= -524.796594780208
##MAXY= 309444897
##MINY= -766210
##XYDATA= (X++(Y..Y))
$$ [...]
6195F213132j5753r6189O31j19338j5992K471R3589K51934k11073J11324m1286
6184F173450N7740k9500L1814Q5234j69025O2804J17868K05887J98163l04483
6174F429952j26916k09608K94393J95487n5811O6445J33874k27766K30504o5721
6164F664833k09979K12994J24784J94525R1177J93086j53190j37395j14110l54186
6154F512539j10750R7008p0845p3223O2165R0559m3185n0921k25335j3969k9813
6143F144230K23231j08992l15687P1416O1756M3297j1045J32748M9968K5826L9802
6132F356550K18125L3106p5290K71849M30215j94642J8249K25283j39154k93142
6122F851149l07969j10859M9488J74228M282K6588k31570k73336j13659N1395
$$ plain form
6195 6213132 6197379 6101190 6101821 5982483 5966491 5968962 6062551 6314485 6103412 6214736 6173450
6184 6173450 6231190 6201690 6233504 6318738 6149713 6212517 6330385 6536272 6734435 6429952
6174 6429952 6303036 6093428 6387821 6583308 6527497 6593942 6727816 6500050 6730554 6664833
6164 6664833 6454854 6667848 6792632 6987157 7078334 7271420 7118230 6980835 6866725 6512539
6154 6512539 6401789 6498797 6427952 6354729 6416894 6507453 6464268 6413347 6188012 6174043 6144230
6143 6144230 6367461 6258469 5942782 6014198 6075954 6119251 6108206 6240954 6290922 6316748 6356550
6132 6356550 6574675 6607781 6532491 6804340 7234555 7039913 7058162 7283445 7144291 6851149
6122 6851149 6543180 6432321 6481809 6656037 6660319 6686907 6455337 6182001 6068342 6119737
6112F119737N65K3192O6545k33856j97262J60650J22491J63896P4651j37747R123
6101F171985j16810r5510J27160m2444P2990j25253j1739j28853J46199K01582
6091F199307m15716p0098r4819K05218J57498j05365m60013L8573L29293J99043
6081E982921j9140P4091l05135k40114J25936J51338J11203l53517k2772j05258
6071E399553n5527J21405J36382p6576j05660K71968j08585j62240J40265N5160
6061E616145r2804O5847q1987o7235K2324n177l4528r6570J76232j84906k06208
6050E111133M7077K28915P757P4734j89728j53192K6303k8269P3554J58729q2643
6039E274370K9951N3741R6876m5662j48300k40428l01223L46488M1360q6925m4985
$$ plain form
6112 6119737 6120302 6143494 6210039 5976183 5778921 5939571 6062062 6225958 6300609 6162862 6171985
6101 6171985 6055175 5959665 6086825 6044381 6117371 5992118 5980379 5851526 5997725 6199307
6091 6199307 5783591 5713493 5618674 5823892 5981390 5876025 5416012 5454585 5783878 5982921
6081 5982921 5963781 6037872 5732737 5492623 5618559 5769897 5881100 5527583 5504811 5399553
6071 5399553 5344026 5465431 5601813 5525237 5419577 5691545 5582960 5420720 5560985 5616145
6061 5616145 5523341 5589188 5507201 5439966 5462290 5457113 5422585 5326015 5502247 5317341 5111133
6050 5111133 5158210 5387125 5394882 5469616 5279888 5126696 5152999 5124730 5198284 5357013 5274370
6039 5274370 5304321 5358062 5454938 5409276 5260976 5020548 4719325 5065813 5107173 5020248 4975263
6028D975263l6336P78n1280J99022J04371r0416O4799k20616o6123j58587k67780
6017D453095J72739n9686j07994q770K60862j34970K06701J53256j20455j23264
6007D691514K0558p0270J48591q910j87595K0308L76706j11070R3862K00912l93316
5996D781290j64352K07912J67809m6437k82408M3744P071k13876J5709K82261
5986D798723K45087k81365p2665k1216M4844Q645j61959k71693o4958K98458r2490
5975D429411q845r0439j49139L70889P7772j51076P0660j17000j23679K47282
5965D555836k23217j34124K98010P542j99117L377j01277L14279q0165L0062r5045
5954D376161m1977L4192R7511j21612j80420l2952j55924J56860L56819r9778
$$ plain form
6028 4975263 4938927 4939705 4888425 5087447 5191818 5101402 5166201 4945585 4879462 4720875 4453095
6017 4453095 4625834 4566148 4458154 4449384 4710246 4575276 4781977 4935233 4814778 4691514
6007 4691514 4712072 4641802 4790393 4781483 4593888 4614196 4990902 4879832 4973694 5174606 4781290
5996 4781290 4616938 4824850 4992659 4946222 4663814 4707558 4714629 4500753 4516462 4798723
5986 4798723 5043810 4762445 4689780 4668564 4713408 4722053 4560094 4288401 4223443 4521901 4429411
5975 4429411 4420566 4330127 4180988 4551877 4629649 4478573 4549233 4432233 4308554 4555836
5965 4555836 4332619 4198495 4496505 4504047 4304930 4308307 4207030 4521309 4441144 4471206 4376161
5954 4376161 4334184 4368376 4465887 4344275 4163855 4130903 3974979 4131839 4488658 4388880
5944D388880n1317k3160p5395M8050j12672L7945Q2454k18185j24974J71460J95946
5933D319032k54227q227K45835j09213L167K70342k1470k71030J39439j57081
5923D156567j12554L66984q9873k15585j46415q9961r4482K51859J49735k27745
5913C948530Q6789K35015J90469p1466p6312L275j13923j18795M766J95443J44132
5902D427923Q7789j83226k90767J73331K18703k76343J74502P5412q8009K7603
5892D346918k29902j53806o1224k36688K29085K61266j74614J6755J14487J85919
5882D298196O451k1519j11720j18255J76080l26250j18071L59681p7392J03837
5872D171038J18426j92393j46722J93595j79680j6328L25743j92242j0563K52312
$$ plain form
5944 4388880 4337563 4314403 4239008 4287058 4174386 4212331 4294785 4076600 3951626 4123086 4319032
5933 4319032 4064805 4056578 4302413 4193200 4196367 4466709 4445239 4174209 4313648 4156567
5923 4156567 4044013 4410997 4321124 4105539 3959124 3869163 3774681 4026540 4176275 3948530
5913 3948530 4035319 4270334 4460803 4389337 4313025 4316300 4202377 4083582 4088348 4283791 4427923
5902 4427923 4515712 4332486 4041719 4215050 4433753 4157410 4331912 4407324 4319315 4346918
5892 4346918 4117016 3963210 3901986 3665298 3894383 4155649 3981035 3997790 4112277 4298196
5882 4298196 4304647 4283128 4171408 4053153 4229233 3902983 3784912 4144593 4067201 4171038
5872 4171038 4289464 4097071 3950349 4143944 3964264 3947936 4273679 4081437 4070874 4323186
5862D323186j49689l11993J64124J81546L5291O2291k93553n478j61161K69444
5852D114008L0828k81168R3414J35686j20818r9888J70264J16152j07910Q6028
5842D136596J70730o0637j8151j51771o691O3879k1945p9102r2655J57636r6289
5831D001600K6809o6711K89167j43466j13278k00362K56852j46784n8510K48563
5821D093880n1050P2627j10238M9418n8955J53842Q2062P2296P9030J1296K55861
5810D650069K0888J3844L40884r4232l91534M3420n5451K70312j19000k11156
5800D468044K45443j85593m12038K1695K72235k01502K5263R6008J33397j25150
5790D337802Q2874j13032R9233N4841j79949J80524P1195J73466J16777p971K2248
$$ plain form
5862 4323186 4173497 3861504 4025628 4207174 4242465 4304756 4011203 4005725 3844564 4114008
5852 4114008 4144836 3863668 3957082 4092768 3971950 3872062 4042326 4158478 4050568 4136596
5842 4136596 4307326 4246689 4228538 4076767 4070076 4133955 4112010 4032908 3940253 4097889 4001600
5831 4001600 4028409 3961698 4250865 4107399 3994121 3793759 4050611 3903827 3845317 4093880
5821 4093880 4042830 4115457 4005219 4054637 3995682 4149524 4231586 4303882 4382912 4394208 4650069
5810 4650069 4670957 4684801 5025685 4931453 4539919 4583339 4527888 4798200 4679200 4468044
5800 4468044 4713487 4527894 4115856 4137551 4409786 4208284 4233547 4329555 4462952 4337802
5790 4337802 4420676 4307644 4406877 4461718 4281769 4462293 4533488 4706954 4823731 4815760 4838008
5779D838008p2725J65849J72682o2445o5885o7277k05137k21635R7360j91613
5769D387182J27524J70561q7250R4613l20674J72750N5513l1711k3870j00626
5759D444012M5496K05032k1051j91038k4369J88128P8969M3278k35416O6125j3795
5748D585371J59535O7154R1753j3828J34897k5813j29406r5729J397K14286r8057
5737D891560N2448k32131J66273J78228j90404j1943N7498P55l71770J78150J51303
5726D869967J65887n6770p5676J00152o5558l5505R6423K79992R2998L5429l8306
5715E369033p437l4229J18419J67240n40K3249p4245l7265O7184R2520j06696
5704E577233j54476P4813j23493j69583J78406R1422r7072M8288j17157k59535
$$ plain form
5779 4838008 4765283 4931132 5103814 5041369 4975484 4908207 4703070 4481435 4578795 4387182
5769 4387182 4514706 4685267 4598017 4692630 4371956 4544706 4600219 4568508 4544638 4444012
5759 4444012 4489508 4694540 4673489 4482451 4458082 4646210 4725179 4768457 4533041 4599166 4585371
5748 4585371 4744906 4812060 4903813 4889985 5024882 4999069 4869663 4773934 4775331 4989617 4891560
5737 4891560 4944008 4711877 4878150 5056378 4865974 4854031 4911529 4912284 4540514 4718664 4869967
5726 4869967 5035854 4979084 4903408 5003560 4938002 4902497 4998920 5278912 5371910 5407339 5369033
5715 5369033 5361596 5327367 5445786 5613026 5612486 5635735 5561490 5524225 5591409 5683929 5577233
5704 5577233 5422757 5497570 5374077 5204494 5382900 5474322 5377250 5425538 5308381 5048846
5694E048846j10156j3907J68301J41206K01903l4652L8397l5351j05596n6579
5684E242412J34272J82111j46799N14530L8586m6503J57873J72572j35193j18589
5674E995272O2665k14916q8958J21469k76445K65048p4484k71434m6500L24491
5664E796208p0030P7288J99961j89880j45909k9996L8190j53518R8299K08666
5654E829279k10219K41936L42365j20999j72536K82145R2240Q295k355r5449L8873
5643F233575l6231J51780J64692Q8442k08632J02623j3083k38377m8532J78847
5633F375104N0218N9326k1007r117K33626p5931K03184o2669j22446J73319O7393
5622F871000R0027J79777j27004q0683P0984N1080M9580n5391l6131J66878Q1746
$$ plain form
5694 5048846 4938690 4924783 5093084 5234290 5436193 5401541 5439938 5404587 5298991 5242412
5684 5242412 5376684 5558795 5411996 5926526 5965112 5918609 6076482 6249054 6113861 5995272
5674 5995272 6057937 5843021 5754063 5875532 5599087 5864135 5789651 5518217 5471717 5796208
5664 5796208 5726178 5803466 6003427 5813547 5667638 5637642 5675832 5522314 5620613 5829279
5654 5829279 5619060 5860996 6203361 6082362 5909826 6191971 6284211 6292506 6290151 6194702 6233575
5643 6233575 6197344 6349124 6513816 6602258 6393626 6496249 6483166 6244789 6196257 6375104
5633 6375104 6425322 6484648 6463641 6454524 6688150 6612219 6815403 6752734 6630288 6803607 6871000
5622 6871000 6961027 7140804 7013800 6933117 7004101 7055181 7104761 7049370 7013239 7180117 7261863
5611G261863l8414M0640K22565M32975j13017k64503K60587L55873k75574j63627
5601G719368J27029K76226O3655J08631n1147l1383K29988J60558j81246n5097
5591H366582L21509N801K22966J32133M6645P9691m5901j75753j9975N22310K26932
5580I682940K17126j00345Q2992L72691Q2195q1509J35532K72763K35837P2490
5570A0972712Q3886J70462L54506j9332M6446K85413K2591J09488j49793K61325
5560A2137704M21815L73353J33097K02935N77075J51010L14255N74304L36628
5551A5222176L23142L32324L65400O02825N29847O54637M90107P22816P60615
5542B0003889J037806J062106R90172J512022J464364J827816J559183J374668
$$ plain form
5611 7261863 7223449 7264089 7486654 7919629 7806612 7542109 7802696 8158569 7882995 7719368
5601 7719368 7846397 8122623 8186278 8294909 8243762 8212379 8442367 8602925 8421679 8366582
5591 8366582 8688091 8693892 8916858 9048991 9095636 9175327 9129426 8953673 8933698 9456008 9682940
5580 9682940 9900066 9799721 9882713 10255404 10337599 10256090 10391622 10664385 10900222 10972712
5570 10972712 11056598 11227060 11581566 11562234 11608680 11894093 11916684 12026172 11876379 12137704
5560 12137704 12559519 12932872 13065969 13268904 13845979 13996989 14311244 14885548 15222176
5551 15222176 15545318 15877642 16243042 16845867 17375714 18030351 18520458 19243274 20003889
5542 20003889 21041695 22103801 23093973 24605995 26070359 27898175 29457358 30832026
5534C0832026J529589J991174K132392K694539L297877L782040M539643M617866
5526E5417146M119395K466185K43642l37471q73583m145778n444807m013594k412155
5517D5018980k006658r23412l42350k53988K09593J019466J423838J698003J745080
5508D7588552K537848L170772L630685L838943L857864L647229M094987N164666
5500G7531546O024438P290323R512702J1885417J3493020J3320851J1275730M424428
5492A54758455k523936k167394n054548j5448007j9451201j3925960r743529p006085
5484G9437795n229162m024453l236319j947045j569858p51114m0768N80185J422670
5475F4641931K081247K649046K925327K908894K974120L345533M236030N470318
$$ plain form
5534 30832026 32361615 34352789 36485181 39179720 42477597 46259637 50799280 55417146
5526 55417146 59536541 62002726 62246368 61908897 61035314 56889536 51444729 47431135 45018980
5517 45018980 43012322 42088910 41746560 41492572 41702165 42721631 44145469 45843472 47588552
5508 47588552 50126400 53297172 56927857 60766800 64624664 68271893 72366880 77531546
5500 77531546 83555984 90846307 100359009 112244426 125737446 139058297 150334027 154758455
5492 154758455 152234519 150067125 145012577 129564570 110113369 96187409 86443880 79437795
5484 79437795 74208633 70184180 66947861 65000816 63430958 62679844 62639076 63219261 64641931
5475 64641931 66723178 69372224 72297551 75206445 78180565 81526098 85762128 91232446
5467I1232446P250492R662167J1765417J3028754J2996718J0089305K243263l463617
5459A54804945k907485p050039j8300437k0571880j4451635j0371864p640424
5452G3511181o160995n042644m207328l541225k703093k077045j810188j043472
5444D6925191j115353q01626l38556J5480m3323K42830N34644N98946J184000
5435D7202233K135165K603262L555739L823669L944276K411523l40004j525611
5427F3810252j532270l574796o974322o717660n206676l878631l069345k580045
5419C0276507k237173j807966j706548j312890j115396r37808p07906r31868j031734
5410A8487218o53354l87444o26599p35152n11012n72760n73427m10660k37982
$$ plain form
5467 91232446 98482938 108145105 119910522 132939276 145935994 156025299 158268562 154804945
5459 154804945 151897460 144847421 126546984 105975104 91523469 81151605 73511181
5452 73511181 67350186 62307542 58100214 54558989 51855896 49778851 47968663 46925191
5444 46925191 45809838 45008212 44669656 44685136 44641813 44884643 45419287 46018233 47202233
5435 47202233 49337398 51940660 55496399 59320068 63264344 65675867 65335863 63810252
5427 63810252 62277982 58703186 51728864 45011204 39804528 35925897 32856552 30276507
5419 30276507 28039334 26231368 24524820 23211930 22096534 21158726 20450820 19518952 18487218
5410 18487218 17833864 17446420 16819821 16084669 15573657 15000897 14427470 14016810 13778828
5401A3778828k99511l47513k72873k93645k53332k77150l90357o8831Q215o1394
5391A1522437k60514m97646j72799p2653k10724j53108l58377l14546k03652j77140
5381I101278j01304P253K5458j54583r306p6632j08758l24443k05232Q483j94161
5370G968053R9254j00868Q855J67588k03625N846L5150j92278j30734j5123M2278
5359G684396q816M7800J84789k99651m40168J47765J65797m3207J33668o5415
5349G506958j43440J32612l17336n1648L1953q6000K04879O7837k45361J29617
5339G230071j986o3698J77866Q0531n3073j29575j30238K80726O0977k3260k08677
5328G219664k9453o7181J8517k02O002j02172J23395K19079Q2010P1582p8016
$$ plain form
5401 13778828 13479317 13131804 12858931 12565286 12311954 12034804 11644447 11575616 11583831 11522437
5391 11522437 11261923 10764277 10591478 10518825 10308101 10154993 9796616 9482070 9278418 9101278
5381 9101278 8999974 9007227 9032685 8878102 8868796 8792164 8683406 8358963 8153731 8162214 7968053
5370 7968053 8067307 7966439 7975294 8142882 7939257 7945103 7980253 7787975 7657241 7642118 7684396
5359 7684396 7675580 7723380 7908169 7608518 7168350 7316115 7481912 7438705 7572373 7506958
5349 7506958 7363518 7496130 7178794 7127146 7159099 7073099 7277978 7345815 7100454 7230071
5339 7230071 7228085 7164387 7342253 7422784 7369711 7240136 7109898 7390624 7451601 7428341 7219664
5328 7219664 7190211 7123030 7141547 7141345 7147347 7045175 7168570 7387649 7469659 7541241 7463225
5317G463225m42551r0083J42166j07587j17765O8990J65709J77447K05426j0444
5307G454533o09652K1121J11375o0924J46827J36233k23867j49618M3852Q6580
5297F956460J26932j03675p585N8732k02326Q9679J50256k06223R2205K71525
5287G225980p3091j70126R7734m9904J1123j08870J50669J13077J95149k49744
5277G141997j98436j56847M04385m4802K55379q655K0946j00776k09416J32411
5267G236186N0024q8825k09543k09089J68298K07412J38365K71390n1999l14369
5257G197850K77982j73J43241k0934k19015k9918J61703k8752j29934k64336K70603
5246G358317J66052O1626k28530r5148L8166l3150K60896J25891J78732j35176
$$ plain form
5317 7463225 7020674 6930591 7072757 6965170 6847405 6916395 7082104 7259551 7464977 7454533
5307 7454533 6844881 6866002 6977377 6916453 7063280 7199513 6975646 6826028 6869880 6956460
5297 6956460 7083392 6979717 6972132 7030864 6828538 6918217 7068473 6862250 6954455 7225980
5287 7225980 7152889 6982763 7080497 7030593 7041716 6932846 7083515 7196592 7391741 7141997
5277 7141997 6943561 6786714 7191099 7146297 7401676 7393021 7413967 7313191 7103775 7236186
5267 7236186 7286210 7197385 6987842 6778753 6947051 7154463 7292828 7564218 7512219 7197850
5257 7197850 7475832 7475659 7618900 7597966 7378951 7349033 7510736 7481984 7352050 7087714 7358317
5246 7358317 7524369 7585995 7357465 7262317 7300483 7267333 7528229 7654120 7832852 7697676
5236G697676j83278P5543o5229j04013K4085N0727N83594J6610J29419l9769j89438
5225G995927j38226J26322L6620J33627J1910j63320j55052J63141K4465N8217
5215H093631j3179J02030M8414m1898O6117R416J31240M2118K71535k57813L42859
5204H794470P1375o9143q0893L4493J55078M5017K5051O1073M25308r8451J10116
5193I473494n5419M7134K02710J61735L52355o0018K26119L81103j05716P9896
5183A0703393M0680J72260L9577r8106j94591j35756J52219J00464j20489K84881
5173A0944532J82571O7681j28276k65056J41042j1235j23161o2714k35727m0847
5163A0468810J40254J44170K31564k927j19175Q0003q8659p5204K07897P5597
$$ plain form
5236 7697676 7514398 7589941 7524712 7420699 7444784 7495511 8079105 8095715 8225134 8185365 7995927
5225 7995927 7857701 7984023 8020643 8154270 8166180 8002860 7847808 8010949 8035414 8093631
5215 8093631 8080452 8182482 8230896 8188998 8255115 8264531 8395771 8437889 8709424 8451611 8794470
5204 8794470 8865845 8796702 8715809 8750302 8905380 8950397 8975448 9036521 9461829 9363378 9473494
5193 9473494 9418075 9465209 9667919 9829654 10182009 10121991 10348110 10729213 10623497 10703393
5183 10703393 10744073 10916333 10955910 10857804 10663213 10527457 10679676 10780140 10659651 10944532
5173 10944532 11127103 11194784 11066508 10801452 10942494 10931259 10808098 10745384 10509657 10468810
5163 10468810 10609064 10753234 10984798 10981871 10862696 10942699 10854040 10778836 10986733 11062330
5153A1062330J05223k3923p4458J41924O4813L37131k85053K81092K04900J30768
5143A1944747L11772P8691j56274J36102R0582j24083r2716K1360J28098J67135
5133A2505414r4106J68886q0420n691K17864K06095O5774o3692K63580R8453M00148
5122A3682305j06725Q6602K92978J9534J24075j98323M6184L21654L20215K83976
5112A4872475j96071L98626K72480L3184J35584K57146O0273R0376J96241J4788
5102A6135102K06333L34335M15267J12424p4209L79704M23670K68877L47639K16969
5092A8766111J81776L87068M7177N32580O30545J52079K94958M72144K68853N72275
5082B2305566L37146N91522O86975P76152M25174J16522N56745P11732O42363
$$ plain form
5153 11062330 11167553 11143630 11069172 11211096 11275909 11613040 11327987 11609079 11813979 11944747
5143 11944747 12256519 12335210 12178936 12315038 12405620 12281537 12188821 12210181 12338279 12505414
5133 12505414 12411308 12580194 12499774 12494083 12711947 12918042 12983816 12920124 13183704 13282157 13682305
5122 13682305 13575580 13662182 13955160 13974694 14098769 13900446 13946630 14268284 14588499 14872475
5112 14872475 14676404 15075030 15347510 15380694 15516278 15773424 15833697 15924073 16120314 16135102
5102 16135102 16341435 16675770 17091037 17203461 17129252 17508956 17932626 18201503 18549142 18766111
5092 18766111 18947887 19334955 19382132 19914712 20545257 20697336 20992294 21464438 21733291 22305566
5082 22305566 22642712 23234234 23921209 24697361 25122535 25239057 25795802 26507534 27149897
5073B7149897R55967R48398O10431Q19410O88600Q92213J051640R66992J191363
5064C5274911J133457R10092J541004J598553J091461J380721J296646J424763
5056D5651608J663098J668285J638060J751511J567931J864753J779012J760943
5048E9345201J196336Q15007J195221Q59226Q16760M04919L45090J49829J7591
5039F5145180O1967K14723M8475M5707J15947M25361O47376M21820P75818P85720
5029F8688094R79421J085743J608508J513872J377595J750394J911348J779146
5021H0694121J984066K216162J789841K422636K172237K239967J935371J810943
5013I7265344J458768Q25889N21130j54039l00882o43758j257651j552785j984414
$$ plain form
5073 27149897 28105864 29054262 29664693 30484103 31172703 32064916 33116556 34083548 35274911
5064 35274911 36408368 37318460 38859464 40458017 41549478 42930199 44226845 45651608
5056 45651608 47314706 48982991 50621051 52372562 53940493 55805246 57584258 59345201
5048 59345201 60541537 61356544 62551765 63410991 64227751 64632670 64977760 65127589 65145180
5039 65145180 65207147 65421870 65470345 65516052 65631999 66057360 66704736 67126556 67902374 68688094
5029 68688094 69667515 70753258 72361766 73875638 75253233 77003627 78914975 80694121
5021 80694121 82678187 84894349 86684190 89106826 91279063 93519030 95454401 97265344
5013 97265344 98724112 99550001 100071131 99917092 99616210 98972452 97714801 96162016 94177602
5004I4177602j768769k107836j951709j907978k080632j827032j227190j313641
4996G9992815j388051j231449n31931l83818l99613j48125J01880j63830P5453
4987G5923331O11836J87208K46167N14704R97006O65418P77884N51016L73613
4978H0848183M32126M84188k11839n21926n68764m48590j295056j543021j332945
4969G5842356j219050j425864j391239j222105j501527j213528j087035p32041
4961F6049967q02713q64324n60446l97702j42583l78959j21939m08281j16852
4952F2256168p6152L73910J46874K04694L8822J30148L66655M50725M96314N53350
4942F4941508N65509M96412P23604N15920Q11338P99138J268845R13752P61028
$$ plain form
5004 94177602 92408833 90300997 88349288 86441310 84360678 82533646 81306456 79992815
4996 79992815 78604764 77373315 76841384 76457566 76057953 75909828 76011708 75847878 75923331
4987 75923331 76535167 76722375 76968542 77483246 78480252 79145670 79923554 80474570 80848183
4978 80848183 81280309 81764497 81552658 81030732 80461968 80013378 78718322 77175301 75842356
4969 75842356 74623306 73197442 71806203 70584098 69082571 67869043 66782008 66049967
4961 66049967 65247254 64382930 63822484 63424782 63282199 62903240 62781301 62373020 62256168
4952 62256168 62180016 62553926 62700800 62905494 62944316 63074464 63441119 63891844 64388158 64941508
4942 64941508 65507017 66003429 66727033 67242953 68054291 68853429 70122274 71036026 71797054
4933G1797054P34992P61915P42538Q89612Q77145O72253P13081N49886K85170
4924G8023646K27363N33383M80946j76980N110j52020k10191J442M49630K08791
4914G9391120Q27Q4984J14453J30510M05285O46555M20066K96990N39971P12463
4904H2743224K90565K34719O91109J66395m247j31940j71418l34081n08977o33642
4894H2341707q94098j066788j007582j020080j349650j340725j211210j219115
4886G3232459j143253j253706j211505j257628j061499j042318q59861j293563
4878F4109126q59448q53549j090843j051060j001231j086215j100459j049917
4870E6016404j225455j226753j433220j042925q54423j093249j038138p94266
$$ plain form
4933 71797054 72532046 73293961 74036499 74926111 75803256 76475509 77188590 77738476 78023646
4924 78023646 78251009 78784392 79265338 79088358 79093468 78941448 78731257 78732699 79182329 79391120
4914 79391120 79391947 79476931 79591384 79721894 80127179 80773734 81193800 81490790 82030761 82743224
4904 82743224 83033789 83268508 83959617 84126012 84121765 83989825 83818407 83484326 82975349 82341707
4894 82341707 81447609 80380821 79373239 78353159 77003509 75662784 74451574 73232459
4886 73232459 72089206 70835500 69623995 68366367 67304868 66262550 65402689 64109126
4878 64109126 63249678 62396129 61305286 60254226 59252995 58166780 57066321 56016404
4870 56016404 54790949 53564196 52130976 51088051 50233628 49140379 48102241 47307975
4862D7307975p94827o10862q21708p21011o31070o33662k52910m19674n42374
4853D1879877m39786j11596k02800p6531m95925l51474J08366j74969l2274k3327
4843D0079561P8424K10627Q8335j83806K19825J96121K12341M88037N58698L54016
4833D2302179O24886N48735N87603O98889R41116O33224J037500J178349R93244
4824D9545725J155479J119833J143638J056895J120510J007247P43261N81389
4816E7473977J03835L61618k21720m47830m25646l77929o16034m77127o65977
4807E4707167n77283n43547o99629k30164k201R8183M39127K40853L89510O52898
4797E4474914N13782N57429J057526Q37738J089695J137744J296670J180128Q72575
$$ plain form
4862 47307975 46513148 45902286 45080578 44359567 43728497 43094835 42841925 42422251 41879877
4853 41879877 41440091 41328495 41125695 41049164 40553239 40201765 40310131 40135162 40102888 40079561
4843 40079561 40157985 40368612 40456947 40273141 40492966 40689087 40901428 41389465 41948163 42302179
4833 42302179 42927065 43475800 44063403 44762292 45703408 46336632 47374132 48552481 49545725
4824 49545725 50701204 51821037 52964675 54021570 55142080 56149327 56892588 57473977
4816 57473977 57577812 57939430 57717710 57269880 56844234 56466305 55850271 55373144 54707167
4807 54707167 54129884 53586337 52886708 52656544 52654343 52752526 53191653 53432506 53822016 54474914
4797 54474914 54988696 55546125 56603651 57441389 58531084 59668828 60965498 62145626 63018201
4788F3018201P51126J065229N20235Q09909M12579k14988o81521j016410j163241
4779F3501119j514404j403128j849407j537390j610179j954973j776124j282700
4771E0572814j496328j235164j144406o53700q39046p76794m69927k51452m77801
4762D3228196n5185L1321K5160K03041N19486K64537N68374L78408N35655K64320
4752D5963313O00338K92915j67324m45752n32229n00588j052537j316664j230526
4743D1610946j385173j332194j473087j470387j300986j139573q79760j025743
4735C1604043q90695o01954n67177p11275p32091p21152l77144n33159k40892
4726B6228504k55402l52509m50995k9895k56028l18394J20650k12151l24707M7280
$$ plain form
4788 63018201 63769327 64834556 65354791 66164700 66577279 66362291 65680770 64664360 63501119
4779 63501119 61986715 60583587 58734180 57196790 55586611 53631638 51855514 50572814
4771 50572814 49076486 47841322 46696916 46043216 45204170 44427376 43957449 43705997 43228196
4762 43228196 43173011 43204332 43229492 43432533 43952019 44216556 44784930 45163338 45698993 45963313
4752 45963313 46563651 46856566 46689242 46243490 45711261 45210673 44158136 42841472 41610946
4743 41610946 40225773 38893579 37420492 35950105 34649119 33509546 32629786 31604043
4735 31604043 30713348 30111394 29544217 28832942 28100851 27379699 27002555 26469396 26228504
4726 26228504 25973102 25620593 25169598 25139703 24883675 24565281 24685931 24473780 24149073 24196353
4716B4196353L3861m10529k51662o4868J47603j75655J0565k72001k51664j3925
4706B2948078j79114j9960k954k13080J4263l54465j50485j5914k388k65561j46524
4695B1611896k59188j69687K38310m64174j17255l94176p4831K79720j78414j41264
4685B0330937l55451m40946L0982j05274Q7592j10595l69230j63387n87720k09781
4675A8107127K92465l71392l1844l92796p8970K9718j72734l32053l3614l38837
4665A6677070j67540m2864l41249k75797k37688Q4274k82020k49256m3387J69909
4655A5291452j96824R122k8781l13335K8687l00993l6330j81033k88141K68083
4645A4251907k12848j39128k1194K75146l87964l39457n6330J18567J15637r4189
$$ plain form
4716 24196353 24230214 23819685 23568023 23503155 23650758 23475103 23485668 23213667 22962003 22948078
4706 22948078 22768964 22749004 22746050 22532970 22547233 22192768 22042283 22026369 22023981 21758420 21611896
4695 21611896 21352708 21183021 21421331 20957157 20839902 20445726 20370895 20650615 20472201 20330937
4685 20330937 19975486 19534540 19565522 19460248 19547840 19437245 19068015 18904628 18316908 18107127
4675 18107127 18399592 18028200 17996356 17603560 17524590 17554308 17381574 17049521 17015907 16677070
4665 16677070 16509530 16466666 16125417 15849620 15611932 15696206 15414186 15164930 15121543 15291452
4655 15291452 15094628 15103750 15074969 14761634 14790321 14489328 14452998 14271965 13983824 14251907
4645 14251907 14039059 13899931 13878737 14153883 13765919 13426462 13370132 13488699 13604336 13510147
4635A3510147K1560j74234j20644K0853j9394p1682k55024j42597P1286j97996
4625A2642275L04561J81578o33k4730j57722J7732O5536J8017l25681l4274k03281
4614A2483378L1440P6278m1943K02415k59965L0652O5332J16055n5325j03012
4604A2545305J16334j37675r3490J71546P2613M0300J7255J68832J27524J20884
4594A3149428j96274R989q1156j10964K69526J77623k23683J21620K80973j62831
4584A3234251J67420L08942M1204k5344J77088O4150n4479J64635L24827l3024
4574A4369670j19796q973J58958L72970J66194P8297q112J96104J87334J99323
4564A5591969N72381L03989j51981J75534M41652M83638L13095L25019J95623
$$ plain form
4635 13510147 13531707 13357473 13236829 13257682 13238288 13166606 12911582 12768985 12840271 12642275
4625 12642275 12946836 13128414 13127781 13103051 12945329 12963061 13028597 13046614 12720933 12686659 12483378
4614 12483378 12514818 12591096 12549153 12751568 12491603 12522255 12587587 12703642 12648317 12545305
4604 12545305 12661639 12523964 12430474 12602020 12674633 12714933 12732188 12901020 13028544 13149428
4594 13149428 12953154 12963143 12881987 12771023 13040549 13218172 12994489 13116109 13397082 13234251
4584 13234251 13401671 13710613 13751817 13726473 13903561 13967711 13913232 14077867 14402694 14369670
4574 14369670 14249874 14240901 14399859 14772829 14939023 15017320 15009208 15205312 15392646 15591969
4564 15591969 16164350 16468339 16316358 16491892 16933544 17417182 17730277 18055296 18250919
4555A8250919N13562N10579J48590M98634Q16663M62788L74682P06592O89087
4546B2972096P82548J021539P51326Q65914O37310P34687Q99241Q86812J027288
4537C0578761P13084J085888P35121Q97584Q57412N73997M95047N90787Q55807
4528C7383488O75907O82458P30237M17489M75761Q93613N72812R84768R08903
4519D3725436N10243Q24881J010023P28185R68796J084850M82219N77333L48373
4510E0260339N96350J39291K45144O9933j37438n61838n82003p00845o02749r99570
4500D7726614j016279q32216r91584j150776r42976j065084p83200o91359m92970
4491C9760170n71210q11781n14805n43625j73128m25801k54157o66550m54969
$$ plain form
4555 18250919 18764481 19275060 19423650 19922284 20738947 21201735 21576417 22283009 22972096
4546 22972096 23754644 24776183 25527509 26393423 27030733 27765420 28664661 29551473 30578761
4537 30578761 31291845 32377733 33112854 34010438 34867850 35441847 35936894 36527681 37383488
4528 37383488 38059395 38741853 39472090 39889579 40365340 41258953 41831765 42816533 43725436
4519 43725436 44235679 45060560 46070583 46798768 47767564 48852414 49334633 49911966 50260339
4510 50260339 50856689 50995980 51241124 51311057 51173619 50611781 50029778 49328933 48726184 47726614
4500 47726614 46710335 45878119 44886535 43735759 42792783 41727699 40944499 40253140 39760170
4491 39760170 39188960 38377179 37862374 37318749 37145621 36719820 36465663 35799113 35344144
4482C5344144l96809n24415m38205n65672n51485r15420p79860r24490q83839
4473B9363949j168325q66050p49831j019082q25601r33601p63410j048196j060194
4464B0929659l82561l27211m56975p45629o10060q1428l26105l41140p03644n79927
4454A6374979l43104l55275l21480l85648l87847r8902k42310k11952j93706r5333
4444A3739422k31615j80296l10574k3328k25549j96143l32682O3534M2353Q4247
4434A2429369r3231j06290j88521l39711n2160j08620m3916K6620M2802j59998
4424A1406344m368n3830j64332j08174Q5702k44344j90042K03800k030P5264r6368
4413A0907622k18612J83903N4779O8810j5723j9372m25648J63529m3488l28050
$$ plain form
4482 35344144 34947335 34422920 33984715 33419043 32867558 31952138 31172278 30247788 29363949
4473 29363949 28195624 27329574 26579743 25560661 24735060 23801459 23038049 21989853 20929659
4464 20929659 20547098 20219887 19762912 19017283 18407223 18325795 17999690 17658550 16954906 16374979
4454 16374979 16031875 15676600 15355120 14969472 14581625 14482723 14240413 14028461 13834755 13739422
4444 13739422 13507807 13327511 13016937 12993609 12768060 12571917 12239235 12302769 12345122 12429369
4434 12429369 12336138 12229848 12041327 11701616 11649456 11540836 11496920 11523540 11566342 11406344
4424 11406344 11401976 11348146 11183814 11075640 11161342 10916998 10726956 10930756 10928726 11003990 10907622
4413 10907622 10689010 10872913 10927692 10996502 10980779 10961407 10535759 10699288 10655800 10327750
4403A0327750J74698k63445K5677M68822j73634k09177Q7486p6650M4328P5489
4393A0481344o9079k1361q8090K3939J46029j23730k37644N9461R0168J40837
4383A0401874J84949k3581K9482L2980r5726J33664J62921K28413P4725j30119
4373A0999582k18531m237K74009J99347P2126k08158j06644K27034j51209r117
4363A1074202Q4553k02308K04103K17988M083j5491m693J58006L21555K28200
4353A2070198M5423j03136L1188Q6993j36673j05735M80813K21211J66004K63004
4343A3019290j1491L4045J47436K81662Q3440J68642K22574Q8136M93453L64117
4333A4891304J14889J49608M8207M12535L21066M96960K72893J91552N81533L37291
$$ plain form
4403 10327750 10502448 10239003 10264680 10733502 10559868 10350691 10438177 10361527 10405855 10481344
4393 10481344 10412265 10390904 10302814 10326753 10472782 10349052 10111408 10170869 10261037 10401874
4383 10401874 10586823 10563242 10592724 10625704 10529978 10663642 10826563 11054976 11129701 10999582
4373 10999582 10781051 10776814 11050823 11250170 11322296 11114138 11007494 11234528 11083319 11074202
4363 11074202 11158755 10956447 11160550 11378538 11382621 11367130 11362437 11520443 11841998 12070198
4353 12070198 12115621 12012485 12043673 12130666 11993993 11888258 12369071 12590282 12756286 13019290
4343 13019290 13007799 13041844 13189280 13470942 13554382 13723024 13945598 14033734 14527187 14891304
4333 14891304 15006193 15155801 15204008 15616543 15937609 16434569 16707462 16899014 17480547 17817838
4323A7817838P25997M01398M88545L87190N44267J46270K46755Q06633N17519
4314B2082412N52436L22467L80439J82119K98830J88387J13286J57446j24922
4305B4152900N0457J69194M8822M41868K63374L3769N49902O71774O66203N23711
4295B7571974O03821Q61219N67350Q83656J181443R32274J100219R50379J028289
4286C5680624J193310J233494J137965J260551J286906J126717R24948P64505
4278D4609020Q64038N48855K52697j72414l48887n37959p20606q67560o91990
4269D2935194m52993m86603l75889j56931K84619K898q2093k8177O57038P51498
4259D3048561Q11261J021309P12667J029853R19834J225093J096076J094597J271786
$$ plain form
4323 17817838 18543835 18945233 19433778 19820968 20365235 20511505 20758260 21564893 22082412
4314 22082412 22634848 22957315 23337754 23519873 23818703 24007090 24120376 24277822 24152900
4305 24152900 24203357 24372551 24421373 24863241 25126615 25160384 25710286 26382060 27048263 27571974
4295 27571974 28175795 29037014 29604364 30488020 31669463 32601737 33701956 34652335 35680624
4286 35680624 36873934 38107428 39245393 40505944 41792850 42919567 43844515 44609020
4278 44609020 45473058 46021913 46274610 46102196 45753309 45215350 44494744 43627184 42935194
4269 42935194 42482201 41995598 41619709 41462778 41747397 41750295 41668202 41640025 42297063 43048561
4259 43048561 43859822 44881131 45593798 46623651 47543485 48768578 49864654 50959251 52231037
4250E2231037J545605J218920J401213J258564J132508Q00085O26471J28372k24480
4241F0118295k33644p05632j264197j627824j527491j248347j341940j473724
4233E0695496j117763r83301r26250q09892m62187m49209k48312q0631k0600j17931
4223D5479420N0309N7231M19418O99875K83524M47324P60461O79158Q84135O40029
4213E0400884N24600O13354L24113J73256j4570n11840o67714q50131r77527j438648
4203D7575777j346598j358602j452417j278926j139020q90421r57221r48408j111011
4194C7093153r04857o71621p12610n55845m28846k64937n11221r2967q2183l60308
4184C2507758q2737m05754J41498J39827N9983L673n002M7011r1796m8526k25139
$$ plain form
4250 52231037 53776642 54995562 56396775 57655339 58787847 59587932 60214403 60342775 60118295
4241 60118295 59884651 59179019 57914822 56286998 54759507 53511160 52169220 50695496
4233 50695496 49577733 48594432 47668182 46858290 46396103 45946894 45698582 45617951 45597351 45479420
4223 45479420 45529729 45586960 46006378 46706253 46989777 47437101 48197562 48876720 49760855 50400884
4213 50400884 50925484 51538838 51862951 52036207 52021637 51509797 50842083 49991952 49014425 47575777
4203 47575777 46229179 44870577 43418160 42139234 41000214 40109793 39152572 38204164 37093153
4194 37093153 36188296 35516675 34804065 34248220 33819374 33554437 33043216 32950249 32868066 32507758
4184 32507758 32425021 32019267 32160765 32300592 32360575 32364248 32359246 32406257 32314461 32265935 32040796
4173C2040796n15963n36979n19686q17999o16827m26034m92199q08099o30218
4164B6676792l11273r32169n22685m01542m67169j65582k75470l74841o95981
4155B2530080l55141j24780m17660l27699j43836k23687q5478j65549m32183k24328
4145B0029739j69415O6503j77577n7238j56880l5578Q1143n2273k12583k05402
4135A9110439J4398k18347l48295l46966R3462O314j62274l38362k65698J94452
4125A7739123J41232l46686N6145j10416k55820l89807n3985O2134j27841m09859
4115A6304220O0462R024K2663J26910k86366N3100l5959o9027j70959r2197L91658
4104A6313529J70859k46845L7305O9563m1183k27232O2425L07039O3237J23919
$$ plain form
4173 32040796 31524833 30987854 30468168 29650169 29033342 28607308 28115109 27307010 26676792
4164 26676792 26365519 25433350 24910665 24509123 24041954 23876372 23600902 23226061 22530080
4155 22530080 22174939 22050159 21632499 21304800 21160964 20937277 20851799 20686250 20254067 20029739
4145 20029739 19860324 19926827 19749250 19692012 19535132 19499554 19580697 19528424 19315841 19110439
4135 19110439 19124837 18906490 18558195 18211229 18304691 18311005 18148731 17810369 17544671 17739123
4125 17739123 17880355 17533669 17589814 17479398 17223578 16833771 16779786 16841920 16714079 16304220
4115 16304220 16364682 16373706 16396369 16523279 16236913 16290013 16254054 16185027 16014068 15921871 16313529
4104 16313529 16484388 16237543 16274848 16344411 16303228 16075996 16138421 16445460 16508697 16632616
4094A6632616p599r43Q556l4950K48706m3024K02469J51749k79269J78417N7826
4083A7114554J03606M03269R9993k74593K65420L53884r4291O8037R8915l0012
4073A8108782K0282K33139J63186O6844R5853K22741K80390M49370L66538M765
4063B0011890J72896L57237L78918L37515L52980n4589L38454O88317L86709N51774
4053B3522101K44026N81370L83187Q0710K65790M53672O62978M38816O89525N31520
4043B7853695M32556L78653L21062P95886N24778L86446N63122N63116N36564
4034C2355878P51479P60966Q33627O66530Q39313L42460O48703Q01172P31720
4025C8731848R57595P49932J015007J231938J030537P84122J182033J174756J175507
$$ plain form
4094 16632616 16625017 16624074 16632630 16597680 16846386 16803362 17005831 17157580 16878311 17056728 17114554
4083 17114554 17218160 17621429 17721422 17446829 17712249 18066133 17971842 18039879 18138794 18108782
4073 18108782 18129064 18362203 18525389 18592233 18688086 18910827 19191217 19640587 20007125 20011890
4063 20011890 20184786 20542023 20920941 21258456 21611436 21556847 21895301 22583618 22970327 23522101
4053 23522101 23766127 24347497 24730684 24811394 25077184 25530856 26193834 26632650 27322175 27853695
4043 27853695 28286251 28664904 28985966 29781852 30306630 30693076 31256198 31819314 32355878
4034 32355878 33107357 33868323 34701950 35368480 36207793 36550253 37198956 38000128 38731848
4025 38731848 39689443 40439375 41454382 42686320 43716857 44500979 45683012 46857768 48033275
4016D8033275J379729J546302J269184J410639J459223J506185J894775J910326
4008F0409638J847975J452901J443560J772164J712095J837718J748495J266545
4000G3491091J874931J834740J853114J967077J882268J769423J646577K195110
3992H8514331K355247K008655K518740K524271K333736K733904K362079K486281
3984A07837244K523755K227157J676198J289918J407931J343413J009597J215272
3976A20530485J154111R12955R88259R18625O19951P03995P34642L53108L44294
3967A27260425J36376j40032j11605n41394o47492j034129q55198p70322p40012
3958A22556617o29321o67073o45829o17574r88569j291088j048259j653657k002555
$$ plain form
4016 48033275 49413004 50959306 52228490 53639129 55098352 56604537 58499312 60409638
4008 60409638 62257613 63710514 65154074 66926238 68638333 70476051 72224546 73491091
4000 73491091 75366022 77200762 79053876 81020953 82903221 84672644 86319221 88514331
3992 88514331 90869578 92878233 95396973 97921244 100254980 102988884 105350963 107837244
3984 107837244 110360999 112588156 114264354 115554272 116962203 118305616 119315213 120530485
3976 120530485 121684596 122597551 123585810 124504435 125124386 125828381 126563023 126916131 127260425
3967 127260425 127396801 127256769 127145164 126603770 125956278 124922149 124066951 123296629 122556617
3958 122556617 121927296 121260223 120614394 119996820 119008251 117717163 116668904 115015247 113012692
3949A13012692k250423k004114j823966j869245j770822j379815j562362j640782
3941I8711163j379004j393394j629071j382392j272054j525975j337894j541443
3933H7249936j250579j453247j676740j492596j644784j810585j292189j434897
3925G5194319j605025j531896j593419j366756j432408j468850j689612j763024
3917F2743329j057309j241133j413315j164064j089800j174072q31928r19679
3909E3852029j074129o85992j054912q05643r25380j028461j028169q80022q87707
3900D5481614r52564q66904o38882p74264q76170r52351q65762j111091r73788
3891C7469838m68735p56562p71077o55977n41813n33133p54545p68876n14653
$$ plain form
3949 113012692 110762269 108758155 106934189 105064944 103294122 101914307 100351945 98711163
3941 98711163 97332159 95938765 94309694 92927302 91655248 90129273 88791379 87249936
3933 87249936 85999357 84546110 82869370 81376774 79731990 77921405 76629216 75194319
3925 75194319 73589294 72057398 70463979 69097223 67664815 66195965 64506353 62743329
3917 62743329 61686020 60444887 59031572 57867508 56777708 55603636 54771708 53852029
3909 53852029 52777900 52091908 51036996 50231353 49305973 48277512 47249343 46369321 45481614
3900 45481614 44529050 43662146 43023264 42249000 41372830 40420479 39554717 38443626 37469838
3891 37469838 37001103 36244541 35473464 34817487 34275674 33742541 32987996 32219120 31704467
3882C1704467l93017m22673p56149p19756o97621l83413l59254m88376l87907
3873B7096301o17247j99066l84876n02742k72866k87163m75026m38224j97931
3864B3721160j54894n62458m43738n13867n32775n7411k79023l59740k54934k47006
3854B0315314j21711j91546k09810j05972m39601k13474j77041k09458l45958
3845A8300743j76630r9701m07504j59406P7184k26423o0254m94210k58017j4039
3835A6481743j09687m49725m3983p880k84402l10317k1909J86433k75063k13893
3825A4951317l94352k21518M3012J18647j98967j34161J06755l8050m6357p1416
3815A4114910k1184k05335k18829k79358q1030J24770k18716Q455j01551k4348
$$ plain form
3882 31704467 31311450 30888777 30132628 29412872 28715251 28331838 27972584 27484208 27096301
3873 27096301 26479054 26279988 25895112 25392370 25119504 24832341 24357315 23919091 23721160
3864 23721160 23566266 23003808 22560070 22046203 21513428 21456017 21176994 20817254 20562320 20315314
3854 20315314 20193603 20002057 19792247 19686275 19246674 19033200 18856159 18646701 18300743
3845 18300743 18124113 18024412 17616908 17457502 17534686 17308263 17248009 16753799 16495782 16481743
3835 16481743 16372056 15922331 15878348 15870468 15586066 15275749 15253840 15440273 15165210 14951317
3825 14951317 14556965 14335447 14378459 14497106 14298139 14163978 14270733 14232683 14186326 14114910
3815 14114910 14093726 13888391 13669562 13390204 13309174 13433944 13215228 13223683 13122132 13097784
3805A3097784P1014k13300p3840j66432j71095K82384m4276k03722J55994k46989
3795A2487522l04158m2533r0801n9299p5438J25324J157N2452M3317J5778j08303
3784A2045018k12713K6115j53987j20279K04086K00255k45159j48715P9235k03438
3774A1470418L9729j17109M9596m528m011j82487N9918J34075J86954r7959k29071
3763A1305525K4451j32435J03907j56971j09179j47433P5010n227q2687q7862
3753A0787099J76678L26830j05066m08969l3513M26144l21231j71359J00501K9730
3743A0806844j22336J27063O4511K2464j86469J8973K09984K9664K8341J98551
3733A1197590J60292L0618J8064o5537p187k05689q8063j64724j57322k45853
$$ plain form
3805 13097784 13168798 12955498 12881658 12715226 12544131 12826515 12782239 12578517 12734511 12487522
3795 12487522 12183364 12140831 12050030 11990731 11915293 12040617 12041774 12094226 12137543 12153321 12045018
3784 12045018 11832305 11858420 11704433 11584154 11788240 11988495 11743336 11594621 11673856 11470418
3774 11470418 11510147 11393038 11442634 11438106 11434095 11251608 11311526 11445601 11632555 11534596 11305525
3763 11305525 11329976 11197541 11301448 11144477 11035298 10887865 10962875 10957648 10874961 10787099
3753 10787099 10963777 11290607 11185541 10776572 10743059 11169203 10847972 10676613 10777114 10806844
3743 10806844 10684508 10811571 10876082 10898546 10712077 10731050 10941034 10970698 10999039 11197590
3733 11197590 11357882 11388500 11406564 11341027 11333840 11128151 11040088 10875364 10718042 10472189
3723A0472189J85948M9102l14219J49347r0618L0229j74896L9852J13102P454
3713A0467490k0865J79161J34652L5856j27483r6748J14228K76012R4272k5375
3703A1031200L65499K18286K00498j37764o0316p5129k14645j91527j45033j34632
3693A0856437r9483k82549J59363k70402M2551K07253J0118l32026m6292L03565
3683A0548535n6390k72983l6321J10983j42839p9446j15786Q9848J78841q5299
3673A0139143n8625J81905Q1882J88131n0410j37650l8579R6790L13108J667m35458
3662A0281904l80222J3864J3582L22139l18918j87089K3094K43927J94609m15076
3652I791814k29465J78882J23929k1062q2893j57728j19399O8083j28332n0550
$$ plain form
3723 10472189 10658137 10707239 10393020 10542367 10451749 10481978 10307082 10346934 10460036 10467490
3713 10467490 10446625 10625786 10760438 10796294 10668811 10572063 10686291 10962303 11056575 11031200
3703 11031200 11396699 11614985 11815483 11677719 11617403 11542274 11327629 11136102 10991069 10856437
3693 10856437 10756954 10474405 10633768 10363366 10405917 10613170 10623288 10291262 10244970 10548535
3683 10548535 10492145 10219162 10182841 10293824 10150985 10071539 9955753 10045601 10224442 10139143
3673 10139143 10080518 10262423 10344305 10532436 10482026 10344376 10305797 10402587 10715695 10717362 10281904
3662 10281904 9901682 9915546 9929128 10251267 9932349 9745260 9768354 10012281 10206890 9791814
3652 9791814 9562349 9741231 9865160 9844098 9761205 9603477 9484078 9552161 9423829 9373279
3642I373279J52413K70920Q0371k5841q7864m3090j06447l5932J08381R3670J52207
3631I932067k36913M2434Q0851l847j96459J54964l516L04090j74620l32430n9040
3620I507581L2124J68241m5876K76948p0375j8215J29214p7205K3158k34038k3968
3609I667589K18613J23435K14383j52409J83582j2191j71837R1275p2617j38766
3599I951057J22547j30678l56005J44253L12843K04790L2637Q232K84814k99682
3589A0274808p3480L01907L3869J30019J06926L1866l13892K24073L0452J92788
3579A0939336L66496k0331j85171J49774J56128L96822J92839N5544J68085J81334
3569A2400856M75535K85478J74785J5589J32873l2043J19327L8489j25536J36495
$$ plain form
3642 9373279 9525692 9796612 9876983 9851142 9763278 9720188 9613741 9577809 9686190 9779860 9932067
3631 9932067 9695154 9737588 9818439 9814592 9618133 9773097 9769581 10073671 9899051 9566621 9507581
3620 9507581 9539705 9707946 9662070 9939018 9868643 9850428 9979642 9902437 9925595 9691557 9667589
3609 9667589 9886202 10009637 10224020 10071611 10255193 10243002 10071165 10162440 10089823 9951057
3599 9951057 10073604 9942926 9586921 9731174 10044017 10248807 10281444 10289676 10574490 10274808
3589 10274808 10201328 10503235 10537104 10667123 10774049 10805915 10492023 10716096 10746548 10939336
3579 10939336 11305832 11285501 11100330 11250104 11406232 11803054 11995893 12051437 12219522 12400856
3569 12400856 12876391 13161869 13336654 13352243 13485116 13453073 13572400 13610889 13485353 13621848
3559A3621848l5178m8165k58214j32695L3792j16724Q9573K16330j23046l0270
3549A3217251J45911J85317K13703K65191J50912L36476M67081L62933J35980
3540A5480755M41140P08923K10670N09850L54560K18029L51288K92033K7095p8691
3530A8515652K97950p8310j23741n29493k70357O7061J29883j55497k89618j81996
3520A7381534k20639k22205J64073K78706J26340K26003Q533K33938M78745J96798
3510A8651826J01846O20325O06624L22631M19802J45816K48185M41122P4618J50235
3500B1783030M16619k2616J7015p2823J50966J07568K47777Q1863l20118L2078
3490B2421359J02968M96311O13769K74586M4361J19794J85375M52387N66108M96379
$$ plain form
3559 13621848 13586670 13538505 13280291 13147596 13181388 13064664 13154237 13370567 13247521 13217251
3549 13217251 13363162 13548479 13762182 14027373 14178285 14514761 14981842 15344775 15480755
3540 15480755 15921895 16630818 16841488 17351338 17705898 17923927 18275215 18567248 18594343 18515652
3530 18515652 18813602 18735292 18611551 18082058 17811701 17878762 18008645 17853148 17563530 17381534
3520 17381534 17160895 16938690 17102763 17381469 17507809 17733812 17742345 17976283 18455028 18651826
3510 18651826 18753672 19373997 19980621 20303252 20723054 20868870 21117055 21558177 21632795 21783030
3500 21783030 22199649 22177033 22194048 22121225 22272191 22379759 22627536 22709399 22389281 22421359
3490 22421359 22524327 23020638 23634407 23908993 23953354 24073148 24258523 24710910 25277018 25773397
3480B5773397O44038Q51224P69103R93078J053630J000347R74682R43288J027194
3471C4029981J405822J083445J421361J504428J908819K318849K800626K677794
3463D9151125L250084L937249M618199M669347M779924M849353M750802N515448
3455H5521531O514187P871247J0040732J2740516J4950890J5672621J4200937
3448A67512661P674791k46590j105584k149963j3036260k0012551j6083455j0876671
3440A11676378p535303n076180l539136k717871j172413n6762R20514J534243
3432I4033470K366379L701254N214034O513375P070929O792785O781704P595845
3424A40069775Q503476J0526318J3904726J8649669K3839864K8206658K8968181
$$ plain form
3480 25773397 26417435 27268659 28037762 29030840 30084470 31084817 32059499 33002787 34029981
3471 34029981 35435803 36519248 37940609 39445037 41353856 43672705 46473331 49151125
3463 49151125 52401209 56338458 60956657 65626004 70405928 75255281 80006083 85521531
3455 85521531 92035718 99906965 109947697 122688213 137639103 153311724 167512661
3448 167512661 175187452 174940862 173835278 171685315 158649055 138636504 122553049 111676378
3440 111676378 104141075 99064895 95525759 92807888 91635475 91578713 92499227 94033470
3432 94033470 96399849 100101103 105315137 111828512 118899441 125692226 132473930 140069775
3424 140069775 148573251 159099569 173004295 191653964 215493828 243700486 272668667
3417B72668667K6148035J0628195n290083l233623o868097l3107166m2877188
3410B18068740l1203641k2677362j5715774j2397605j0094961q566527o644243
3403A10768627n126640l917187l434276k376834j497014l06026O09424J212791
3395I5932865J283194J390216J694262K709042L728523N286875P685466J0534735
3387A30245178J2393640J2598633J0184926K423682l401731k746698o443163j7840408
3379A37414059k0836289j5533790j1530002q602539o919867n792631m793720m375033
3371E9030188m054975l658884l038674k414983k380213k052680j821595j644255
3363C7963929j894790j417323j300893j299647j304731j316331j052330r15963
$$ plain form
3417 272668667 298816702 309444897 304154814 300921191 294053094 260945928 218068740
3410 218068740 186865099 164187737 148471963 136074358 125979397 117412870 110768627
3403 110768627 105641987 101724800 98290524 95913690 94416676 94110650 94720074 95932865
3395 95932865 97216059 98606275 100300537 103009579 106738102 112024977 119710443 130245178
3387 130245178 142638818 155237451 165422377 167846059 164444328 161697630 155254467 137414059
3379 137414059 116577770 101043980 89513978 80911439 73991572 68198941 63405221 59030188
3371 59030188 54975213 51316329 48277655 45862672 43482459 41429779 39608184 37963929
3363 37963929 36069139 34651816 33350923 32051276 30746545 29430214 28377884 27461921
3355B7461921j032324p85219q73332j028692p78933l24972r01414n65489p73207
3346B0398339o12934l63227p49461n76299l31679k59693n98167p00780j75439
3337A6030660j90634k79873n58977m18890q0236l35590l05789k30794o1239m94548
3327A3074090l55564j73624j74145k10498Q4690j31992P6046j12031l63643j74506
3317A1538823k29765L0481l6846n32652k87406k87920r9638k44128O1850j09529
3307I803270p551k14450j0371j43606n9419j64387k53233o4307m7172m45812o5578
3296H327384R0454q4619J5278k18233J14552j40000M133r0572k08279Q9673p8096
3285G821675q0724k8569j1990J23905l03373j26655j9660l25262j06215j6773
$$ plain form
3355 27461921 26429597 25644378 24771046 23742354 22963421 22638449 21737035 21171546 20398339
3346 20398339 19785405 19422178 18672717 18096418 17764739 17505046 16906879 16206099 16030660
3337 16030660 15840026 15560153 15001176 14582286 14502050 14166460 13860671 13629877 13568638 13074090
3327 13074090 12718526 12544902 12370757 12160259 12244949 12112957 12189003 12076972 11713329 11538823
3317 11538823 11309058 11339539 11302693 10770041 10482635 10194715 10095077 9850949 9912799 9803270
3307 9803270 9795719 9581269 9570898 9427292 9367873 9203486 8950253 8885946 8838774 8392962 8327384
3296 8327384 8417838 8333219 8348497 8130264 8244816 8104816 8108949 8018377 7810098 7899771 7821675
3285 7821675 7740951 7712382 7700392 7824297 7520924 7394269 7374609 7049347 6943132 6926359
3275F926359L16655l5368l56065l89457p9693O6255k13539K11932J42903k13063
3265F376919j63417l7427J5943M8891k17847Q1843Q6135k38264m00590J21087
3255E673273K97055J26746l8503n11654k74043K29410J81513K6279o3735l4964
3245E611377m5710J85949k28605k51634l2389j85260J95951j4006j62242J73873
3235E247304J06461R1657J1805k53682k14571j99659l69203J68816Q3499q4064
3225D588363P0805j54372o435J1269l1440L1690J41518j02837P281J70756J31903
3214D858501j47818k42644k64012j58847L17380k0853O631m9510l16023J25660
3204D108465J00541Q8750j26938k46505K00469j037p7986L8659k00328K01384
$$ plain form
3275 6926359 7243014 7207646 6851581 6462124 6382431 6448686 6235147 6447079 6589982 6376919
3265 6376919 6213502 6176075 6192018 6240909 6023062 6104905 6191040 5952776 5552186 5673273
3255 5673273 5970328 6097074 6058571 5546917 5272874 5502284 5683797 5710076 5646341 5611377
3245 5611377 5565667 5751616 5523011 5271377 5238988 5053728 5249679 5235673 5073431 5247304
3235 5247304 5353765 5445422 5457227 5203545 4988974 4789315 4420112 4588928 4672427 4588363
3225 4588363 4659168 4504796 4498361 4509630 4478190 4509880 4651398 4548561 4555842 4726598 4858501
3214 4858501 4710683 4468039 4204027 4045180 4362560 4341707 4348338 4298828 3982805 4108465
3204 4108465 4209006 4297756 4170818 3924313 4124782 4123745 4045759 4084418 3884090 4085474
3194D085474l0327r5175p2764J96850k5931k58416J629M5936J10626J35090j44787
3183C948205j50774r6439m3379K01664o5256m0161J89457M15618m9109l40905
3173C968921o233J2625l73186j06427K26066o106J40847O1936j09292J36378P3834
3162D019363J37436L60603k06305j66315L81347j06309j54098j17986P8690j37498
3152D088928K0904N2015l13340m3692J19457K15599r4049K21964o8047m85696
3142C714043Q8476K28466K02737m10426J48633P3499j29032K072M4503J66848
3132D129819L49509J61751j28377J84441J3066k16963L3559r6626j90861k01392
3122D037926j72113p6276k32202J57389N6812n3236p2880k1102j33759j11391
$$ plain form
3194 4085474 4055147 3959972 3887208 4084058 4058127 3799711 3801340 3847276 3957902 4092992 3948205
3183 3948205 3797431 3700992 3657613 3859277 3794021 3753860 3943317 4358935 4309826 3968921
3173 3968921 3962688 3975313 3602127 3495700 3721766 3715660 3856507 3918443 3809151 3945529 4019363
3162 4019363 4156799 4517402 4311097 4144782 4526129 4419820 4265722 4147736 4226426 4088928
3152 4088928 4109832 4161847 3848507 3804815 3924272 4139871 4045822 4267786 4199739 3714043
3142 3714043 3802519 4030985 4233722 3823296 3971929 4045428 3916396 3918468 3962971 4129819
3132 4129819 4479328 4641079 4512702 4697143 4710209 4493246 4526805 4430179 4239318 4037926
3122 4037926 3865813 3789537 3557335 3714724 3771536 3718300 3645420 3624318 3490559 3379168
3112C379168o4404L15835j07277k57660J27844J18699k5371j53644J20177o60
3102C452707K8184k5463o202N1424J31267M1045j30709j08168J36241r5552j14836
3091C359938j29855K38111l7826k31805M0949k5715k2292k42264p2850M8702K16112
3080C141205J88145k82358k03256R302k70455j5893J01695m1087m0385J99699
3070B786612j05333o466k973j36922K00065N9059M1906J29316j63599O3839R7471
3059B962975l19592k52035r639k32841R9986k5011m2907K135M2868M3885L7573
3048B307397l6390j64994J27101O478m6904r2063k4008o4481j10197J08003O5020
3037B074962Q4195K1790k18912J22451K73881k42457k73046j8971j6435n7500
$$ plain form
3112 3379168 3314764 3630599 3523322 3265662 3393506 3512205 3486834 3333190 3453367 3452707
3102 3452707 3480891 3455428 3449226 3500650 3631917 3672962 3542253 3434085 3570326 3474774 3359938
3091 3359938 3230083 3468194 3430368 3198563 3239512 3213797 3191505 2949241 2876391 2925093 3141205
3080 3141205 3329350 3046992 2843736 2853038 2582583 2566690 2668385 2627298 2586913 2786612
3070 2786612 2681279 2674813 2671840 2534918 2734983 2794042 2835948 2965264 2801665 2865504 2962975
3059 2962975 2643383 2391348 2381709 2148868 2248854 2223843 2180936 2183071 2225939 2269824 2307397
3048 2307397 2271007 2106013 2233114 2239592 2192688 2100625 2076617 2012136 1901939 2009942 2074962
3037 2074962 2159157 2180947 1962035 2084486 2358367 2115910 1842864 1823893 1807458 1749958
3027A749958j9204J66690j43108j7876K71905j8703l31199j79869l5558L19543
3017A762579J60076j34312o4221k58996j43891K79838j8362J84907J34672n7837
3007A844453K34374j75848j07378o5683J63499j38757Q5933J63235L5443k98849
2997A740422o6642K97759j60701J5882j64406K0423r2676M2442Q3766J4221o9467
2986A661023k88933K01548K44510K92162J64973l34820l93908J79783J17317k65265
2976A578390J56121o144j94399J34936k9828r216Q9495j39719k39640N0712q486
2965A382222J86113M2101k22026J70545m7112o4326K0786j51123j3451M8794j82508
2954A170015J26451K62919L2286J09831k16082r993M0160j06175J344K91151j3733
$$ plain form
3027 1749958 1730754 1897444 1754336 1736460 2008365 1989662 1658463 1478594 1443036 1762579
3017 1762579 1922655 1788343 1724122 1465126 1321235 1601073 1582711 1767618 1902290 1844453
3007 1844453 2078827 1902979 1795601 1729918 1893417 1754660 1840593 2003828 2039271 1740422
2997 1740422 1673780 1971539 1810838 1826720 1662314 1682737 1590061 1632503 1716269 1730490 1661023
2986 1661023 1372090 1573638 1818148 2110310 2275283 1940463 1546555 1726338 1843655 1578390
2976 1578390 1734511 1728367 1533968 1668904 1639076 1629860 1719355 1579636 1339996 1390708 1382222
2965 1382222 1568335 1610436 1388410 1558955 1511843 1447517 1468303 1317180 1303729 1352523 1170015
2954 1170015 1296466 1559385 1591671 1701502 1485420 1475427 1515587 1409412 1410756 1701907 1688174
2943A688174j89180K28744l0200j41388N973j18413N2232j61418j20382M8910
2933A263052R2357r267m5231K41611o7200j19350l5551K28852j00884j44428m6544
2922A257417q1589K00498J65604k02219J769q8201j86309p2478K60299L64359
2912A619150r1724l17052L888R200K16092J992q6386j75931r2077j23252Q3630
2901A047530R9695L186J95741j71203q496O0037j81087J66147j0624j0761k1600
2890A168565q5660j17991L8098J59477K48630j05359p4764J4223j43074J84344
2880A286489l965J84153o6406j02975k46218J27807J20516q9180O2114j00041
2870A172294m8545O24r1343J41554j11011p3084m3473J76662J05235l05096J84863
$$ plain form
2943 1688174 1498994 1727738 1697538 1556150 1562123 1443710 1495942 1334524 1214142 1263052
2933 1263052 1355409 1346142 1300911 1542522 1475322 1355972 1320421 1549273 1448389 1303961 1257417
2922 1257417 1175828 1376326 1541930 1339711 1341480 1253279 1066970 994492 1254791 1619150
2912 1619150 1527426 1210374 1214262 1223462 1439554 1441546 1355160 1179229 1087152 963900 1047530
2901 1047530 1147225 1150411 1346152 1174949 1166453 1226490 1045403 1211550 1200926 1190165 1168565
2890 1168565 1082905 964914 1003012 1162489 1411119 1305760 1230996 1245219 1102145 1286489
2880 1286489 1282524 1466677 1400271 1297296 1051078 1178885 1299401 1210221 1272335 1172294
2870 1172294 1123749 1124373 1033030 1174584 1063573 990489 947016 1123678 1228913 923817 1108680
2859A108680j2451J7981j7022k20018K6105K2484k2254K63029j09186K086J43237
2848A202671j55971K0980J56255Q2343j19039J28578j87388o1086j77679J97278
2838A086942K09511N8741n5736Q7914k1647p9678j39100m9469R2150P247r854
2827A187021m3829j18519K10846n4857j25490J43773q0935J31407o8451q9110
2817A091856R0856l0142j37639m6436k71869K12209n1569M8091J86396K8569j08290
2806A012032p5858n0288l9452j4042j14991J54970O2695R1231R4757j36551k88999
2795F95504Q2007L08689K34776j66238l41986Q8620J17066K3627J2161q3705L7930
2784A008451m5452J19903n3707J30694j86181l769J2492k05917J65712P3672J19388
$$ plain form
2859 1108680 1096229 1114210 1097188 877170 903275 925759 903505 1166534 1057348 1059434 1202671
2848 1202671 1046700 1067680 1223935 1306278 1187239 1315817 1128429 1067343 889664 1086942
2838 1086942 1296453 1355194 1299458 1387372 1365725 1286047 1146947 1097478 1189628 1196875 1187021
2827 1187021 1143192 1024673 1235519 1180662 1055172 1198945 1118010 1249417 1180966 1091856
2817 1091856 1182712 1152570 1014931 968495 696626 908835 857266 905357 1091753 1120322 1012032
2806 1012032 936174 885886 846434 832392 717401 872371 935066 1026297 1121054 984503 695504
2795 695504 777511 1086200 1320976 1154738 812752 901372 1018438 1042065 1054226 970521 1008451
2784 1008451 962999 1082902 1029195 1159889 973708 969939 982431 776514 942226 1015898 1135286
2773A135286n6254j51519J29529J16504m9564j37956k53776j34407J75099R8389
2763H71331j16533K10730k24209M6853m4144j49433n166K50899J26825J05429
2753A072582p8704j12414L505j60961m473J00638Q4363j11060J70461J5048j48002
2742H30983r103K38625k30470j50351L15848O9059j07071j43492j57758r7368
2732E58902J16057J02577K53474J11345j97178O4229N5627k24545K7473K97470
2722A165431K04015m03959j58792k80995K31795j62794m8463K18868Q2915L55866
2712A203887j73234M2444M4977r7836j78972r5407P9686j25570q7760K57602J11379
2701I81196q9185j28843r7884N9117k6972k2363J03879p7709r3874J78336K28006
$$ plain form
2773 1135286 1079032 927513 1057042 1173546 1123982 986026 732250 597843 772942 871331
2763 871331 754798 965528 741319 788172 744028 594595 589429 840328 967153 1072582
2753 1072582 993878 881464 884969 724008 719535 820173 904536 793476 963937 978985 830983
2742 830983 821880 1060505 830035 679684 995532 1064591 957520 814028 656270 558902
2732 558902 674959 777536 1031010 1142355 945177 1009406 1065033 840488 867961 1165431
2722 1165431 1369446 965487 806695 525700 757495 594701 546238 765106 848021 1203887
2712 1203887 1030653 1073097 1118074 1020238 841266 745859 825545 699975 612215 869817 981196
2701 981196 892011 763168 665284 724401 697429 675066 778945 701236 607362 785698 1013704
2690A013704p5278Q6032j18340j29784K39147j2734k0499o1525k1872J29077R1301
2679A119229j21370k34125m5187p4732J91842k43804J46446j60274L964J32545
2669G14534r0294R6850J20217j02196m4987j37887M6217K56128Q3375P0890j96927
2658H15920J04823p9523k29632q277J3499K54900j4603k85422J18148j08334J09656
2647F91155P4985r3838J28122j03304r5303J22975p6231J8277o498P7241J5943
2636G53524k54018r6802K9019J48206J00018P3814J35857n9614k01255n279L16981
2625I40451J76965k09553k91891j3526J36950R8746j76971j81047j00454J57626
2615E37296k2825J47035J58949j21128j36646K00217L1468k0652j36206k93438
$$ plain form
2690 1013704 938426 1024458 906118 776334 1015481 1002747 982248 920723 898851 1027928 1119229
2679 1119229 997859 763734 718547 643815 835657 591853 738299 578025 581989 714534
2669 714534 624240 721090 841307 739111 694124 556237 602454 858582 941957 1012847 815920
2658 815920 920743 841220 611588 603311 616810 871710 857107 571685 689833 581499 691155
2647 691155 766140 672302 800424 697120 601817 724792 648561 666838 660340 737581 753524
2636 753524 499506 402704 431723 579929 679947 753761 889618 830004 628749 623470 940451
2625 940451 1117416 907863 615972 602446 739396 838142 661171 480124 379670 537296
2615 537296 514471 661506 820455 699327 562681 762898 794366 773714 637508 344070
2605C44070K67772R3764J0341O1729j17627k14747Q3445K56762k62582k20769
2595C02158r217K38551L93186q8616n2875k48991J06758j40059j10957K17397
2585F07335M5476j61887K58209J52279j94091j70625j71977J84089K42566P980
2575G99354P5254m78528m0854L80639J0027Q5427k98648q955K68156r326j02709
2564F79837K0032m1036k94196j13856K50806J44459J3543O7813P5637J9979m92340
2553C30678J06249K86672m941O3210j56707j26183k849j43437J84710K49318j13376
2542F73344O6066l9603K23716j62665k36725l2411J75120j28116j0276J43295
2532F71745r844j98462j12677L41043O4707q1034l4174J4592n9377o1762q5554
$$ plain form
2605 344070 611842 705606 715947 777676 660049 445302 528747 785509 522927 302158
2595 302158 292941 531492 924678 836062 783187 534196 640954 500895 389938 607335
2585 607335 652811 490924 749133 901412 707321 536696 364719 548808 791374 799354
2575 799354 874608 396080 355226 735865 745892 831319 532671 523716 791872 782546 679837
2564 679837 699869 658833 364637 250781 501587 646046 659589 727402 803039 823018 330678
2553 330678 436927 723599 718658 781868 625161 498978 496129 352692 537402 786720 673344
2542 673344 739410 699807 923523 760858 524133 491722 666842 538726 528450 671745
2532 671745 661901 463439 350762 691805 756512 675478 641304 655896 596519 534757 449203
2521D49203M0895L01952k06271r5322q6754K12487k0504j62740l2354r5794k21369
2510H3429J98435N0917J12430R5850j51796K77511k90369O3716K97349o8632j36359
2499E32481j53426J29048j09049p2018p2409K9465J93633K44431R9933j22809
2489F99280j13900J16880j50186q0924P983n1162J0974k46845M2249K7061J70005
2478D31415K2403o5851j61397K23530K11727R2353R8917j66521L1192j20466k16120
2467C81182R1947p1605K28783M2991j8600L4872j10768J75280j82841k67048L73626
2456F77819j23107J87831K58685k25770j14396Q0998j93341N4337J02263K5491
2446G30810J27953k34348j89967M1629K87469R3523l9403j26072J3695M2528j37486
$$ plain form
2521 449203 490098 792050 585779 490457 403703 616190 595686 432946 400592 304798 83429
2510 83429 281864 332781 445211 541061 389265 666776 376407 440123 737472 668840 532481
2499 532481 379055 508103 399054 327036 254627 284092 477725 722156 822089 699280
2489 699280 585380 702260 552074 471150 479133 427971 438945 192100 234349 261410 431415
2478 431415 453818 387967 226570 450100 661827 754180 853097 686576 717768 597302 381182
2467 381182 473129 401524 630307 673298 654698 689570 578802 754082 571241 304193 677819
2456 677819 554712 742543 1001228 775458 661062 742060 548719 603056 705319 730810
2446 730810 858763 624415 434448 476077 763546 857069 817666 691594 705289 747817 610331
2435F10331M4444k0963K126k708J44019J64247k5417k608K3761k5292j06542l4551
2423G70847J22506K2041Q4271J59603J93073m09224j84519K59308l01479l0008
2413F86419L42426j3103j06511K4648K19910J33594K6580J88530p8419J81673
2403A605747K17261J05397M147J41187J69655P0163M9081L92253M83726K74833
2393C513450N140J33210K95005O22254M70529K25362N29983N10405R79639R25454
2383H210431R59485L96989k26324j74825m20782r25851j180753r59109r87110
2374D692151r3722m52890o24245q0301l71780j18660j88805l16713k11178P2335
2364B306192K30142k91805n8187p8260l2033j11129k83597j92643N7086j10127
$$ plain form
2435 610331 654775 633812 635938 633230 777249 941496 916079 913471 937232 911940 805398 770847
2423 770847 893353 915394 999665 1159268 1352341 943117 758598 1017906 716427 686419
2413 686419 1028845 1015742 909231 933879 1153789 1287383 1313963 1502493 1424074 1605747
2403 1605747 1823008 1928405 1932552 2073739 2243394 2313557 2362638 2754891 3238617 3513450
2393 3513450 3518590 3651800 3946805 4569059 5039588 5264950 5794933 6305338 7284977 8210431
2383 8210431 9169916 9566905 9340581 9165756 8744974 7819123 6638370 5679261 4692151
2374 4692151 4598429 4145539 3521294 3440993 3069213 2950553 2761748 2445035 2233857 2306192
2364 2306192 2536334 2244529 2186342 2108082 2076049 1964920 1681323 1488680 1545766 1435639
2354A435639N6986K18136m09561k06614J73467j33129k75984j73301j6992K20494
2344H89141m0312n7015j01536N2622j02269q7903J33233m0349J15194L18673J21005
2333A200484m3917n9613Q3157m4628j46769j47343J66326J13172l52207n7665
2323G10997J58479K15762K32280K6306J36324P9899l21418J9828L0980Q8495O9611
2312A447543k68211j89293n6210j10484K11840r6918j07769K07404k41222o8578
2302G28102m879O1111n1305Q323J03561L7673r3121k95800Q9601j76231L481P530
2290D18046K2650N2914J6400k48058k600q3699N1385N36748N75l04049K8796M3001
2278E32109p1470j62932p3704L36821o742K3435o5189J38287m1923K6492J62646
$$ plain form
2354 1435639 1492625 1710761 1301200 1094586 1268053 1134924 858940 685639 668647 889141
2344 889141 848829 791814 690278 742900 640631 552728 685961 645612 760806 1079479 1200484
2333 1200484 1156567 1096954 1180111 1135483 988714 841371 1007697 1120869 768662 710997
2323 710997 869476 1085238 1317518 1343824 1480148 1560047 1238629 1258457 1289437 1377932 1447543
2312 1447543 1179332 990039 933829 823345 1035185 938267 830498 1037902 796680 728102
2302 728102 723223 784334 733029 741352 844913 882586 789465 493665 583266 407035 410516 418046
2290 418046 440696 493610 510010 261952 259352 175653 227038 763786 764361 460312 489108 532109
2278 532109 460639 297707 224003 560824 554082 577517 512328 650615 608692 635184 797830
2267G97830j84752l74732K63424J48495k88837k27603L16917q5456o7582k071
2257B95633Q1891j86837o7560J94960O5640J85697k15226J45251k79697M2463
2247B62215O3057r0178J09727j02556Q1531J586N9928k1263k99467J68157J2493
2236B45230j93410R7340j6681J1234K02278L8061R5188o1258q6688J24419j92732
2225B62981j18723j9903K8759o8462J53460K33075M6188l06083p2779L21644J75036
2214F35193N3170K5495j86786L6899j473q925k48995q9240J20245j54689N9048
2203B39942J66933j75089J75500m4756j49912n3831k40894l8875K41705K81369
2193D02092J067R4251r4867j11643k46605J23580P8555j42839l927Q2538K21933
$$ plain form
2267 797830 613078 238346 501770 650265 361428 133825 450742 365286 297704 295633
2257 295633 377524 190687 123127 318087 383727 569424 354198 499449 219752 262215
2247 262215 325272 235094 344821 242265 323796 325382 385310 364047 64580 232737 245230
2236 245230 51820 149160 132479 143713 345991 384052 479240 417982 331294 455713 262981
2225 262981 144258 124355 153114 84652 238112 471187 517375 211292 138513 460157 635193
2214 635193 688363 713858 527072 563971 562498 553573 304578 215338 335583 180894 239942
2203 239942 406875 231786 407286 362530 212618 158787 -82107 -120982 120723 402092
2193 402092 403159 497410 402543 290900 44295 167875 246430 103591 99664 182202 404135
2182D04135n2839j31962j57391n8227K02299J06677j57869j40071J82047k66310
2172f9511n7768L21988q3623j91051R8091K64700M8100n4636R9029J7928J1985
2161D05232k10030j90846L4370O5840l2459K29127J79373o6475N4063o0521j32728
2150B74946j26271j35153K06026R8000K10411k60720p3137j1098j08879K97719
2140C71844j01580J71755l07256k10097M47153J57386j27802L6478p9253l14691
2130D3937Q0468R4350O8305l0496J6791Q9381k18977k9275L28085l79855J92641
2119B55355o11k09189J53008K8525O8127k90959R8280J49203j52753K71978k7840
2108C43124k37355J60463K19198j21709k86542J32694O1973m432l8431p9634M4687
$$ plain form
2182 404135 351296 219334 61943 3716 206015 312692 154823 14752 196799 -69511
2172 -69511 -127279 194709 111086 -79965 18126 282826 330926 276290 375319 393247 405232
2161 405232 195202 4356 38726 104566 72107 301234 480607 414132 468195 407674 274946
2150 274946 148675 13522 219548 317548 527959 267239 194102 183004 74125 371844
2140 371844 270264 442019 134763 -75334 371819 529205 401403 437881 358628 43937
2130 43937 124405 218755 287060 256564 273355 362736 143759 114484 442569 62714 255355
2119 255355 254744 45555 198563 227088 295215 4256 102536 251739 98986 370964 343124
2108 343124 105769 266232 485430 363721 77179 209873 271846 267414 228983 149349 194036
2097A94036j74697P0486N8182J38913J9581j27905P7082P8491j24080J02053m3979
2086B68163o5016L7841K79765q2593l09740k45351J14137J25143m986J87943r3524
2075B11782R1923k59393J62013J06270j65257J49712j6008n0120J91406o9387
2065C52941j04536j81810J5213o1916p6560k0587k0726j05675P5728J75477n975
2054D1574q0347K30525k60383J35186P0915n2084j00844K64575P6290j21348J9146
2043B23205m876r1055L0007Q4831o6311L9341K1440r22k4531J02344R1707n3711
2031C51469K9371k59810q69M21883K9061l57250o6086m8495k1818J18539q8166
2020A07829j76967o4022J79233K51359r1784j78716R9768n4376J13481L8337l59794
$$ plain form
2097 194036 19339 89825 148007 286920 306501 178596 255678 334169 210089 312142 268163
2086 268163 203147 240988 520753 438160 128420 -116931 -2794 122349 117363 305306 211782
2075 211782 303705 44312 206325 312595 147338 297050 281042 230922 422328 352941
2065 352941 248405 66595 81808 19892 -56668 -77255 -97981 -203656 -127928 47549 41574
2054 41574 -38773 191752 -68631 66555 137470 85386 -15458 249117 325407 204059 223205
2043 223205 218329 127274 157281 242112 175801 215142 236582 235660 211129 313473 405180 351469
2031 351469 380840 121030 120161 542044 571105 213855 147769 99274 77456 195995 107829
2020 107829 -69138 -133160 46073 297432 205648 26932 126700 72324 185805 224142 -135652
2009a35652J64523P002j62883J16264J0794K57491K3598j6787j17726j31798K7941
1998D2767L4563M9628L46J04741p1391j72132K87794k4676l1381l9621l84633
1987b03995K34676o2557J5802N6629R9487K27077k33470m844N4597R0013j4723
1976B58692j21916o9083J01776J13601J64859k88720l08908o1217N11278k42213
1966E8149L3906Q8048m1810J8656k98053m1456L34734L2133M6505o2298k9978
1955A38536j76759k46129K48621L6917p5618N3335o6798P1330j6457J57459j6223
1944A08214k2690K45561j43485p7587j65470K42443K79472p498k50176j55637
1934E3147O3372J0306l9860J7018j39984q5729J42062L16653J27683l85801J06830
$$ plain form
2009 -135652 28871 35873 -127010 -10746 48 257539 281137 264350 146624 14826 42767
1998 42767 77330 126958 127304 232045 160654 -11478 276316 251640 220259 180638 -203995
1987 -203995 30681 -31876 -16074 40555 140042 367119 133649 128805 183402 273415 258692
1976 258692 136776 67693 169469 283070 447929 159209 -149699 -210916 300362 58149
1966 58149 92055 180103 138293 156949 -141104 -182560 152174 184307 230812 168514 138536
1955 138536 -38223 -284352 -35731 1186 -74432 -21097 -87895 -16565 -33022 124437 108214
1944 108214 85524 331085 187600 110013 -55457 186986 466458 458960 208784 53147
1934 53147 116519 126825 86965 103983 -36001 -121730 20332 336985 464668 78867 185697
1923A85697j66839L05212K9119l20296N4006L12688q2599J2825J58542j52848
1913C35507n8899k77445O2301L62618j04255j73464o3389k4608j07903r303K07394
1902A48554j21663k5595K03610r4264l90522K54231K06m6556k2905j96884l6613
1891c28401J89341J3032J99640j17101k53577J94572K95703P8611j90017j92968
1881a11165k03778J26607J37656L3768j520j90436K55535J0428N5259R7417j83508
1870B6263R6232l8915k45562J44481j4389j0975l5949R0929J0672j7561N8659
1859F3885L8067j14859J8830l7871P7179j46534K15227J66447j16336k9918l78526
1848b44409K61578K19612P0975K39257j79536m26776j16257J80999J06799J90446
$$ plain form
1923 185697 18858 324070 353189 32893 86899 399587 316988 329813 488355 335507
1913 335507 276608 -837 61464 424082 319827 146363 82974 58366 -49537 -58840 148554
1902 148554 26891 1296 204906 110642 -279880 -25649 -25443 -71999 -94904 -291788 -328401
1891 -328401 -139060 -126028 73612 -43489 -297066 -102494 193209 271820 81803 -111165
1881 -111165 -314943 -188336 -50680 -16912 -18432 -208868 46667 57095 112354 209771 26263
1870 26263 122495 83580 -161982 -17501 -31890 -42865 -78814 12115 22787 5226 63885
1859 63885 101952 -12907 5923 -31948 45231 -101303 113924 280371 164035 134117 -244409
1848 -244409 17169 236781 307756 547013 367477 -59299 -175556 5443 112242 302688
1838C02688k05812o7399p9877R7011L4958n3468N2897j99545O0442M80672n0137
1827C72430k30867O3330l2200j14097p6595J02231j80133j9753J42983o234j63844
1816a42749N2668N6823j65201J18693J96333J45381N8587N1189l75478j34026
1806a37780K40442k9469L3716k61939J38458J44813J05166k17973J28547l02018
1796a58037J43250K49710k72490j91427K90388K69284j16846r4152l10386k3158
1786b13864J43187j9200j6480J49504j41462J19144K0408O2140j85631k04089
1776b86343L15767R7104P321J21661q4509K7129j02273K0859l284l174J72J5276
1764A25706l5051j7362J15590k4593j36614N1859N4538k11835N9046J41912J31688
$$ plain form
1838 302688 96876 29477 -50400 46611 81569 28101 80998 -118547 -58105 422567 372430
1827 372430 141563 204893 172693 58596 -17999 84232 -95901 -115654 27329 21095 -142749
1816 -142749 -90081 -33258 -198459 -79766 116567 261948 320535 371724 -3754 -137780
1806 -137780 102662 73193 106909 -155030 -16572 128241 233407 15434 143981 -158037
1796 -158037 -14787 234923 -37567 -228994 61394 330678 213832 119680 -190706 -213864
1786 -213864 -70677 -89877 -106357 43147 -98315 20829 41237 103377 -82254 -286343
1776 -286343 29424 126528 133849 255510 171001 198130 95857 116716 113432 110258 110430 125706
1764 125706 90655 73293 188883 164290 27676 79535 134073 -77762 -18716 123196 254884
1753B54884Q2668j84547O668K20075j60324K31040k76387j79610P0918K08997
1743B74382j19199j42138k9996J52455M5884K4013j3456L9999K2915k13915J1136
1732E2080j03510j24129M15089J26227j36853q5321K9746j22054k67453R0447
1722a25731J99094P8089j92993J6086N9485N199j77997n5828J58827M6843j2831
1711a757L78577j65592j87316J47906O1781l5879j00730J94437p6029j63383j91456
1700a39441J53639R3484o6594j87188O5494M08963N3678l15400j55974j57497
1690b46836o7503N6217j22592J43115k7940O153L63816K2352k11675l4107M6602
1679g2398k8584J62946K98770n54694o822J72558N8119j94827K90920J0304J0456
$$ plain form
1753 254884 337552 153005 159673 379748 219424 450464 174077 -5533 65385 274382
1743 274382 155183 13045 -16951 135504 181388 205401 191945 231944 254859 40944 52080
1732 52080 -51430 -175559 239530 365757 228904 143583 173329 51275 -216178 -125731
1722 -125731 73363 151452 -41541 -25455 34030 39229 -138768 -194596 -35769 11074 -1757
1711 -1757 376820 211228 23912 171818 233599 197720 96990 291427 215398 52015 -139441
1700 -139441 14198 107682 41088 -146100 -80606 328357 382035 66635 -89339 -246836
1690 -246836 -314339 -258122 -380714 -237599 -265539 -259386 104430 126782 -84893 -119000 -72398
1679 -72398 -100982 61964 360734 -193960 -200782 -28224 29895 -164932 125988 136292 146748
1668A46748p2561J28757J65112k52440j42538r9558j0490L13482K3983m0369j32977
1657B7149j34828K12307j66002j61178J09930O2707k37544M8296R0743j75050
1647c23470J20565O2550K33359Q4793l43805K70859M8905O0707j78421k56530
1637b20488n3280K18149M3186J02074k73686j5144K96493R1883L5443J3422k21624
1626A6428m4367K12405J0507J05169j59615M5258j52232p0630J75383l0483N3681
1615A61504P7851r0681O5335k10069l0486K2957j41014O5837m934k23389q9450
1604c96539P872L12824J29321j15621n3261K4167j48953O2244J28753L1431J28601
1593A10839k00427j05684M1537K58143j85516j37029J54315q996n4760q0458j57420
$$ plain form
1668 146748 74187 202944 368056 115616 -26922 -126480 -136970 176512 200495 160126 27149
1657 27149 -107679 104628 -61374 -222552 -112622 -49915 -287459 -239163 -148420 -323470
1647 -323470 -202905 -140355 93004 177797 -166008 104851 153756 214463 36042 -220488
1637 -220488 -273768 -55619 -12433 89641 -184045 -199189 97304 189187 224630 238052 16428
1626 16428 -27939 184466 194973 300142 140527 185785 33553 -37077 138306 107823 161504
1615 161504 239355 148674 214009 3940 -26546 -3589 -144603 -78766 -83700 -307089 -396539
1604 -396539 -388667 -75843 53478 -62143 -115404 -91237 -240190 -177946 -49193 -17762 110839
1593 110839 -89588 -195272 -153735 104408 -81108 -218137 -63822 -72818 -127578 -208036 -365456
1582c65456j6380M09715J43492j16508N4764J46908j94485j42534J5475N1468
1572a3541K15444j13259j43043k4699J964K59497j20201J19003J36206l66513
1562d9142j49793q5957L56496q654K7477J99053q9194p4198L8972j86811N9676
1551C7925j47948o5677K47308m346j7552J37136J68392j75294j54264P0041K8693
1540A24414r4940j94399k0138N0681K50445q6004m9366q4694n8057L776J84417
1529B6135O5162N5828j1947k86587P1758K7881q7895J166l0049K38078K00700
1518B70230j44641J40786j00067O8041k3440k09740J60543J8319l13736J33328
1508c77N1435N735L5663k04008K77031L424k34897j55225j3513L03412j13632
$$ plain form
1582 -365456 -381836 27879 171371 54863 109627 256535 62050 -80484 -65009 -13541
1572 -13541 201903 88644 -54399 -79098 -77134 182363 62162 181165 317371 -49142
1562 -49142 -198935 -284892 71604 62950 90427 289480 200286 126088 165060 -21751 37925
1551 37925 -110023 -175700 71608 67262 49710 186846 355238 179944 25680 95721 124414
1540 124414 29474 -164925 -185063 -134382 116063 30059 -19307 -104001 -162058 -158282 26135
1529 26135 91297 147125 135178 -151409 -79651 -51770 -139665 -138499 -168548 69530 270230
1518 270230 125589 266375 166308 234349 210909 1169 161712 180031 -133705 -377
1508 -377 51058 56793 92456 -111552 165479 168903 -65994 -221219 -234732 68680 -44952
1497d4952m0985R4348q629j8451k8134o6518K35746P5746k34441j60161j5312
1486b11743L9484o641p4823K43060M1284k2405m3910n7990p2807m6852j16269
1475c29612M6785J85852k41489R8365K42632R2425k13324m6020j98281K01119
1465a61548R4736J23252j85606K7951J76661j07143n6119j4985j20723j62738
1455c86262K10733J1237R7870J77042K4366k21610p6000R065J6289j40765K22097
1444e5938J34237k7056j97306N5042O1945j03279L0387M9770j1906N0273p253
1433b1084n4078K8733k77702J28114J02278o2670r8397K43213j4988j5051k4596
1422f6228q0198R5361o750K77460M008P0156l25631j81008J2944L04864J83938
$$ plain form
1497 -44952 -85937 8411 -218 -18669 -46803 -113321 122425 198171 -36270 -196431 -211743
1486 -211743 -172259 -178900 -253723 -10663 30621 8216 -35694 -93684 -166491 -213343 -329612
1475 -329612 -282827 -96975 -338464 -240099 2533 94958 -118366 -164386 -362667 -161548
1465 -161548 -66812 56440 -129166 -101215 75446 -31697 -87816 -102801 -223524 -386262
1455 -386262 -175529 -164292 -66422 110620 134986 -86624 -162624 -153559 -137270 -278035 -55938
1444 -55938 78299 51243 -146063 -91021 -29076 -132355 -101968 -52198 -64104 -13831 -21084
1433 -21084 -75162 -46429 -324131 -196017 -93739 -156409 -254806 -11593 -26581 -41632 -66228
1422 -66228 -146426 -51065 -57815 219645 223653 293809 -31822 -212830 -199886 104978 288916
1411B88916j88675n8534J72851K4004l08425k86700L25390O4012J49370Q0231
1401B62440K8392J1415j38260j51822j54239J40873j27381k79766J01748K21406
1391h5194O8737K02838k94443k53043l8756j97665N1686J41257J58789M9437n6131
1380b52488K29013P4343r5265M652J05615j52379P5724o3543J1841o7419O8463
1369f1443K69198r840m8709k13813k07780O2112K43232q7834J44382l38481j06505
1358c55481R7757n1500J52810m1068K35362k00985J2627o3415J22457r7460J50834
1347c8062J89208m835k36388j36076K69065J20225k65987M1941J73631j61539
1337d8817J4746j77038r6737N985J71023J54797k4503k70412J46583J37744k4839
$$ plain form
1411 288916 100241 41707 214558 238562 -69863 -356563 -31173 32839 182209 262440
1401 262440 290832 302247 163987 12165 -142074 -1201 -128582 -408348 -306600 -85194
1391 -85194 -16457 186381 -108062 -361105 -399861 -597526 -545840 -404583 -245794 -196357 -252488
1380 -252488 -23475 50868 -44397 -39745 65870 -86509 -10785 -74328 -62487 -129906 -61443
1369 -61443 207755 197915 149206 -64607 -272387 -210275 32957 -54877 89505 -248976 -355481
1358 -355481 -257724 -309224 -156414 -197482 37880 -163105 -150478 -213893 -91436 -188896 -38062
1347 -38062 151146 146311 -90077 -226153 42912 163137 -102850 -60909 112722 -48817
1337 -48817 -34071 -211109 -307846 -301861 -130838 23959 -544 -270956 -124373 13371 -11468
1326a1468J18772k5000k25834j45240Q3608O9242R3322j50939o6702J7708k02647
1315d45178Q5964K82086n4523M6678L993k2900J0658j22586J75730J84535j81623
1304c7166k27885L6462K61923R1877q8815j27117k8461j89101q8906J84462o0829
1293b73556N2470J66893r9194j21176K65064J65238j31203j53744J87531l1934
1283B6389Q4751r7147J1606N4176l01604m7185M3814l1435q9396q5913J07502
1272c24442M0210q0349N9139K35735K60555n8410k65706L1125J11053j95040J03906
1261h2224R5537n3832Q9304J3908N0450k4737M790k15351J66240J87677p4984
1250A56778J14867m6160k27244l17724J80184J29843j94835j07912j75354L44108
$$ plain form
1326 -11468 107304 82304 -143530 -288770 -205162 -135920 -42598 -193537 -260239 -242531 -445178
1315 -445178 -359214 -77128 -131651 -84973 -80980 -103880 -93222 -215808 -40078 144457 -37166
1304 -37166 -265051 -228589 33334 125211 36396 -90721 -119182 -308283 -397189 -212727 -273556
1293 -273556 -221086 -54193 -153387 -274563 -9499 155739 24536 -129208 58323 26389
1283 26389 111140 13993 25599 79775 -221829 -269014 -225200 -256635 -346031 -431944 -324442
1272 -324442 -284232 -364581 -305442 -69707 190848 132438 -133268 -102143 8910 -186130 -82224
1261 -82224 13313 -40519 48785 62693 113143 88406 93196 -122155 44085 231762 156778
1250 156778 271645 225485 -1759 -319483 -139299 -9456 -204291 -312203 -487557 -143449
1240a43449J80179k15917j58637J39514L30177j45443m502p2547o8671p7858k44521
1229d81675J53601J12420r3214J34881J14844j14959j16921R5306K16814M1835
1219F2932l26591L6548K53811M8814j4448J34973L5877j22300k43885r9996J15148
1208a19117J406q7975J31744J91520J91794L3167k5022q8278j3697K3642m42554
1197b03370J376M02276j16177K33725J4949j72204j9748N6736r3374q8347o1189
1186d5347K13384j52081r6286J51949J56018j32922k33841J4968j3193K71836
1176A34485p1239j28532k09047K76434o8868j38612K54405K48954l86362O3401
1166b4981J48843Q6768l41486J07703N0599j28239K25637m3820j91134J53638
$$ plain form
1240 -143449 36730 -179187 -337824 -198310 131867 -13576 -18078 -90625 -159296 -237154 -481675
1229 -481675 -328074 -215654 -308868 -173987 -59143 -174102 -291023 -195717 21097 62932
1219 62932 -263659 -227111 26700 75514 61066 196039 231916 109616 -134269 -234265 -119117
1208 -119117 -117711 -205686 -73942 117578 309372 342539 317517 229239 215542 239184 -203370
1197 -203370 -201994 200282 84105 317830 332779 160575 140827 197563 104189 15842 -45347
1186 -45347 168037 15956 -80330 71619 227637 94715 -139126 -124158 -137351 134485
1176 134485 63246 -65286 -274333 2101 -66767 -205379 49026 297980 -88382 -24981
1166 -24981 123862 210630 -130856 -23153 27446 -100793 124844 81024 -110110 43528
1156D3528J40679j76319j89697j54155J302Q6548J36806K58166j45421n9116o6985
1145a24664n8246J18148k16428n3217J05701n9767j0562j24980L43797J09135
1135B8917k67411L33001p0726P5694J1244q4947j20154J65863j95614P9255j18604
1124a63482P4415J73631j18520J54072p4426l31637K11954M3460k26728O0834
1114a96427j43287J70792R4415J95421q3996k11364J39499j0940J32738r9633
1104a2782J42296o9672q5625j00266j5027J40747j49115M8365o6758m8366J7701
1093a98502N4639K9803p5355J39753J6653o5097o643k13476J59038J93123J1079
1082D5015J43908j17264J24530J28138j18625k83219k38745M15833J01926k47772
$$ plain form
1156 43528 184207 7888 -181809 -335964 -334662 -248114 -111308 146858 1437 -57679 -124664
1145 -124664 -182910 -64762 -281190 -334407 -228706 -288473 -299035 -424015 -80218 28917
1135 28917 -238494 94507 23781 99475 110719 25772 -94382 71481 -124133 -44878 -163482
1124 -163482 -89067 84564 -33956 120116 45690 -285947 -73993 -30533 -257261 -196427
1114 -196427 -339714 -168922 -74507 120914 36918 -174446 -34947 -45887 86851 -12782
1104 -12782 129514 59842 -25783 -126049 -141076 -329 -149444 -101079 -167837 -216203 -198502
1093 -198502 -143863 -114060 -189415 -49662 -33009 -98106 -104749 -318225 -159187 33936 45015
1082 45015 188923 71659 196189 324327 205702 -77517 -316262 99571 201497 -46275
1072d6275K89803p1429k34755n6531o0132l090K03985K68717j02204r5369j23650
1061c0930K29077o7220j82585j56189j6362K95634J62114j63349k34066R3248
1051g0628K31642J06968k97203k1436r6270l2628K12680J40885k7075j65340o576
1040b4981j49838n4484j27587K8642J16123J54947m4080J44717n1082k42856K06414
1029d4065R747j07470q6929J76987K19514j40554k6270o0919K6427Q6208j00514
1018d7838k21248P2122J25892l8323l7139J43665K20737j33573j52537J2448m0123
1007i5917q6536J52537j80605j28646O7526J65559j05920J45552L5074n6587R46
996h7017j79437j88644L54845L43537j05083o3813K2842q8494K2012j04880k85265
$$ plain form
1072 -46275 243528 172099 -62656 -119187 -179319 -182409 21576 290293 188089 92720 -30930
1061 -30930 198147 130927 -51658 -207847 -224209 71425 233539 70190 -163876 -70628
1051 -70628 161014 267982 -29221 -50657 -146927 -179555 33125 174010 146935 -18405 -24981
1040 -24981 -174819 -229303 -356890 -328248 -212125 -57178 -101258 43459 -7623 -250479 -44065
1029 -44065 -34318 -141788 -228717 -51730 167784 27230 960 -59959 -33532 52676 -47838
1018 -47838 -269086 -196964 -71072 -109395 -146534 -2869 217868 84295 -68242 -55794 -95917
1007 -95917 -182453 -29916 -210521 -339167 -271641 -106082 -212002 -66450 -31376 -87963 -87017
996 -87017 -266454 -455098 -100253 243284 138201 74388 97230 8736 30748 -74132 -359397
985c59397m2779K62088J84120j00235J65549j81477r0408Q2093M3582j58009o7553
974b62426R0271j18454L28347J07200l01408M89233r7669l04979k53173J89803
964a33255Q1365k27419r6662Q6375J51219l16243L78638R5044J0089L3902k4150
953C8903J26156j22811k33121n3303n6893K82427J4442j51160O1997j00010J67769
942b5604j40982J11009Q7554M8223l28991K56499P0396q8900l69820K38584J6010
931a26022k21263J84035J88982J11328R5719k27302q1191J47544O3919j63405
921b7656l51309J66540R0942q3126j29717R4376Q8181J2493j82689M05467N3435
910A36937j01510j10508m3858p937L26480j13953j87630J75887J28900j58976
$$ plain form
985 -359397 -402176 -140088 44032 -56203 109346 -72131 -162539 -80446 -36864 -194873 -262426
974 -262426 -172155 -290609 37738 144938 -156470 332763 235094 -69885 -323058 -133255
964 -133255 -51890 -279309 -375971 -289596 -138377 -454620 -75982 19062 29151 63053 38903
953 38903 165059 42248 -190873 -244176 -301069 -18642 -4200 -155360 -93363 -193373 -25604
942 -25604 -166586 -55577 31977 80200 -248791 7708 78104 -10796 -380616 -142032 -126022
931 -126022 -347285 -163250 25732 137060 232779 5477 -75714 71830 135749 -27656
921 -27656 -378965 -212425 -121483 -204609 -334326 -239950 -151769 -139276 -321965 83502 136937
910 136937 35427 -75081 -118939 -126876 199604 85651 -101979 73908 202808 43832
900D3832M5099R661J5179o5000N2390K14992J4329k46988j88383j05864K64866
889E4113K9217k02415N114J74057k8752J30146j65056O2349j51789L8099J3711
878d1206M4592o3576j3004J67344o0230N5838Q3037q9650l6120J74576j34123
867H7478k5072j83075J61781j27925M54443k44738j85486K7374k753O7816j24402
856i4559j06439R7328O1775j14753j84351J2505K5180J9036J17330j19136J5618
845b70466J00121J12899K6759K00966K08893j53404q2851J39785k96071l40895
835c54264k7452J32043o9724J30979R5884N4235j39457J04185J12380j63265J03788
824b0668P6949P6628k6716K18443L13614k83212k42480p8951k69890L28356m0174
$$ plain form
900 43832 88931 98592 113771 48771 101161 316153 330482 83494 -104889 -210753 54113
889 54113 83330 -119085 -113971 60086 31334 161480 -3576 58773 -93016 -54917 -41206
878 -41206 3386 -60190 -73194 94150 33920 89758 172795 83145 47025 221601 87478
867 87478 62406 -120669 41112 -86813 367630 122892 -62594 -35220 -37973 29843 -94559
856 -94559 -200998 -103670 -41895 -156648 -340999 -328494 -303314 -284278 -166948 -286084 -270466
845 -270466 -170345 -57446 -30687 170279 379172 225768 142917 282702 -13369 -354264
835 -354264 -381716 -249673 -319397 -188418 -92534 -38299 -177756 -73571 38809 -124456 -20668
824 -20668 56281 132909 106193 324636 638250 355038 112558 33607 -236283 92073 51899
813E1899R4986N9808j21108q5291J0612M6426j56215l94545J42815L68796M6631
802F4814r5139l65555L29897p0464J35907J05498n6246o6777k1434j1125o8899
791a19523Q3524O3558p619j14035m5765J01341J83415k6928j06737r9586P1688
780a6667m3644J07572m1900N0536l4716J84347q7615j27794J59896q2370J092
769F8737j97256O311J46868j31906r4962L83268j5816m19970Q3723K1528K3390
758a26085L0180K43874O7038K2077J20232q249k87448m7567l431l7857j03602
747a30838M02258p861P6451m7357l32636j3060l9247K64063O5995j81207r3316
736c6755Q5877j75601J98278K3057J14p1993L8677j44190J12794k86247j8155
$$ plain form
813 51899 146885 206693 85585 294 10906 57332 -98883 -493428 -350613 18183 64814
802 64814 -30325 -395880 -65983 -136447 -540 104958 48712 -18065 -39499 -50624 -119523
791 -119523 -35999 27559 19940 -94095 -139860 -38519 144896 117968 11231 -88355 -16667
780 -16667 -60311 47261 5361 55897 21181 205528 117913 -9881 150015 67645 68737
769 68737 -128519 -122208 24660 -107246 -202208 181060 165244 -254726 -171003 -149475 -126085
758 -126085 -95905 147969 215007 237084 357316 349067 61619 14052 10621 -27236 -130838
747 -130838 271420 263559 340010 292653 -39983 -53043 -92290 171773 237768 56561 -36755
736 -36755 49122 -126479 71799 94856 94970 22977 61654 -82536 30258 -255989 -274144
725b74144j18588J53124J54355j39877O1965L2061J82073k7882J50199j95990
715b2704j24589J31164K46391k09991k74032P7502J15029k4912j29278P6576K01730
704F2886j68637r470J53391L617k67336n3912K98134K49055r3868j89684m5026
693f0850K03941Q9928j88319j99621k3994K12687l7101j22232k78127J68291J84480
682e0917J93278J5705r4638P6895q6147l2716q2297l095K07670K203m0446P5616
670A81111J11414k42392L1165q0301j05941j45201J05344k05108m5402M05711
660A0400k087m5813M3995j8211J68254p0451N3551K7505j36532J1346j81520Q5195
648e4368J19067R2835J22304q0599q4174l127p9381m8899P2275o954r7807l883
$$ plain form
725 -274144 -392732 -239608 -85253 -225130 -163165 -131104 50969 23087 173286 -22704
715 -22704 -147293 -16129 230262 20271 -253761 -176259 -61230 -86142 -215420 -138844 62886
704 62886 -105751 -115221 38170 41787 -225549 -279461 18673 267728 173860 -15824 -60850
693 -60850 143091 233019 44700 -154921 -178915 33772 -3329 -125561 -403688 -235397 -50917
682 -50917 142361 158066 63428 140323 54176 21460 -60837 -63932 143738 145941 105495 181111
670 181111 292525 50133 81298 997 -104944 -250145 -144801 -349909 -395311 10400
660 10400 8313 -37500 6495 -11716 156538 86087 139638 167143 30611 41957 -139563 -54368
648 -54368 64699 157534 279838 199239 115065 111938 32557 -16342 55933 48979 -48828 -52711
636e2711j64065O6530j43929J80032J41446o1756j42938J30047K8681N8956J55457
625A95750J96301j10428k34834j78141Q348L46893q4647k13931j2927N189k0698
614a03125P853k1994j49400R7869K19122L5664J12342l5636l54598j91374K33134
603a50143J75734J97333j29033M9730j00276o0373J16834J5565j73801k3865k4567
592a06862k05183j2945M2423p9016K00358K04713k67070j12715J41658M3010n1769
581b03398j5545J33198q7358K3063K06365M5801q2j14307J53054k10603O4768
570e044j905Q4776J24524j44804l3238j8018P9844J21235J4538m3865k38834l06022
558c66813q5910M08482J55070n4335R2985M3522o3195L38346l065j76456j31016
$$ plain form
636 -52711 -216776 -150246 -294175 -114143 27303 -34453 -177391 -47344 -18663 40293 195750
625 195750 392051 281623 46789 -131352 -123004 223889 139242 -74689 -87616 -82427 -103125
614 -103125 -95272 -117266 -266666 -168797 50325 85989 198331 162695 -191903 -383277 -150143
603 -150143 25591 222924 93891 143621 43345 -17028 99806 115371 -58430 -82295 -106862
592 -106862 -312045 -324990 -282567 -361583 -161225 43488 -223582 -336297 -194639 -151629 -203398
581 -203398 -218943 -85745 -173103 -150040 56325 102126 102044 -12263 140791 -69812 -5044
570 -5044 -6949 77827 202351 57547 24309 6291 86135 207370 221908 178043 -60791 -366813
558 -366813 -452723 -44241 110829 56494 149479 193001 129806 468152 465087 288631 157615
547A57615j83062L2801P4618j59521M001O7237l5656N5518J08140j31093J0995
536A593j34605k2957Q5089J20708J24720j46714K38858O2362k58630p047j73581
525a10204l4975K50663K733k20515R5617J38737m8778n7050j98858N168O2271
514a15191M05255j54045q3041l2900j34340q1621J04986J31660j35362j09495
504b04094J27627J0445j74768P7077j1202K35946P1213j19018n6269J03544r286
493E1215j59677J06171m9596J0680o0693J54682r5823K1208L3988J48268k22021
482f1598K3283N4960J83627n5137m3567J25344M0293l0846j10761k58195J0078
471a22519Q5027p1838J13418J88061K50873j41755j9308Q4278k53037o7428J96671
$$ plain form
547 157615 -25447 7354 81972 -77549 -73548 -6311 -41967 13551 121691 -9402 1593
536 1593 -133012 -155969 -70880 49828 174548 27834 266692 329054 70424 63377 -110204
525 -110204 -145179 105484 108217 -112298 -16681 122056 73278 16228 -182630 -177462 -115191
514 -115191 290064 136019 52978 20078 -114262 -195883 -90897 40763 -94599 -204094
504 -204094 -76467 -66022 -240790 -163713 -174915 61031 132244 13226 -43043 60501 51215
493 51215 -108462 -2291 -51887 -41207 -101900 52782 -43041 -21833 12155 160423 -61598
482 -61598 -38315 16645 200272 145135 101568 226912 267205 236359 125598 -132597 -122519
471 -122519 -37492 -109330 4088 192149 443022 301267 281959 366237 113200 45772 242443
460B42443j37554K376k1157j73153J39376O863l5284j9767K26971m7548j65441
449A8125Q5812q9030J58234N7888k01478q4073q435L2767P5634n7520l06263k5271
437c43610K50140M6512N057j21058j42462J16564k01773P6763K73815p7972Q0403
426c7621q1845K40450K9186l21122J4406j1930j91333L05526J04692J6135o9287
415b743K21560j68079j43105J15221J72218N2577n1211q7456j72493K49956k20800
404c4355N4472j47385j95340K58264K0978j11608J45052j67830j02195J48127
394a31820J79571M6403j82466K5478J32137j62293Q1897J02556r5196J40197q7566
383D8898j01665J12719J63673j55188J43475r4927n5544M5490m1190J9377P3352
$$ plain form
460 242443 104889 107265 86108 -87045 52331 59194 23910 4143 231114 183566 18125
449 18125 103937 14907 173141 231029 29551 -54522 -62957 -30190 45444 -12076 -318339 -343610
437 -343610 -93470 -46958 -41901 -162959 -305421 -188857 -390630 -313867 -40052 -118024 -37621
426 -37621 -119466 120984 150170 -170952 -156546 -168476 -359809 -54283 50409 66544 -2743
415 -2743 218817 50738 -92367 22854 195072 247649 196438 108982 -63511 186445 -34355
404 -34355 20117 -127268 -322608 -64344 -43366 -154974 -9922 -177752 -279947 -131820
394 -131820 47751 94154 -88312 -62834 69303 -92990 -11093 91463 -3733 136464 48898
383 48898 -52767 59952 223625 68437 211912 116985 61441 106931 65741 85118 158470
372A58470j02689J4213o9653Q1982j82276r4315P3410J96285k01101j20315j29123
361c75112K53978L00770j29028k3224K4641k11113J6615m7269J37400J98842j24331
$$ plain form
372 158470 55781 69994 341 82323 -99953 -194268 -120858 75427 -125674 -245989 -375112
361 -375112 -121134 179636 50608 27384 52025 -159088 -142473 -189742 -52342 146500 22169
$$ [...]
##END=
