##TITLE=1H_Pr Q-30
 200.13MHz, DMSO,
 8 sc
 
 30.9.2025
##JCAMPDX= 6.0         $$ Bruker NMR JCAMP-DX V2.0
##DATA TYPE= NMR FID
##DATA CLASS= NTUPLES
##ORIGIN= UXNMR, Bruker Analytische Messtechnik GmbH
##OWNER= pz
$$ XWIN-NMR		Version 3.5
$$ Tue Sep 30 15:38:11 2025 Russian Standard Time (UT+4h)  she@DPX200
##.OBSERVE FREQUENCY= 200.1313
##.OBSERVE NUCLEUS= ^1H
##.DELAY= (6, 6)
##.ACQUISITION MODE= SIMULTANEOUS
##.ACQUISITION SCHEME= undefined
##.AVERAGES= 8
##.DIGITISER RES= 18
##SPECTROMETER/DATA SYSTEM= spect
##.PULSE SEQUENCE= zg30
##.SOLVENT NAME= DMSO
##.SHIFT REFERENCE= (INTERNAL, DMSO, 0, 14.3821)
##AUDIT TRAIL= $$ (NUMBER, WHEN, WHO, WHERE, WHAT)
$$ ##TITLE= Audit trail, XWIN-NMR		Version 3.5
$$ ##JCAMPDX= 5.01
$$ ##ORIGIN= Bruker BioSpin GmbH
$$ ##OWNER= she
$$ F:/spectra/data/she/nmr/H-C/1/audita.txt
$$ ##AUDIT TRAIL=  $$ (NUMBER, WHEN, WHO, WHERE, WHAT)
(   1,<2025-09-30 15:36:28.18 +0400>,<she>,<DPX200>,
      <created by zg, POWCHK disabled, PULCHK disabled
       configuration hash MD5:
       00 E9 B6 7A A2 85 ED C7 34 08 36 98 17 FE 4E 26
       data hash MD5: 16K
       D0 91 ED E2 ED 4E 82 0F 59 82 F5 E9 83 F4 67 C8>)
$$ ##END=
$$ 
$$ hash MD5
$$ 03 A9 93 72 B3 26 7F DF 73 01 BC E9 E4 89 5A DA
##$RELAX= 
##$RELAX= 
##$RELAX= 
##$RELAX= 
##$RELAX= 
##$RELAX= 
$$ Bruker specific parameters
$$ --------------------------
##$DU= <F:/spectra>
##$EXPNO= 1
##$NAME= <H-C>
##$PROCNO= 1
##$TYPE= <nmr>
##$USER= <she>
##$AMP= (0..31)
100 100 100 100 100 100 100 100 100 100 100 100 100 100 100 100 100 100 
100 100 100 100 100 100 100 100 100 100 100 100 100 100 
##$AQSEQ= 0
##$AQ_mod= 1
##$AUNM= <au_zg>
##$AUTOPOS= <>
##$BF1= 200.13
##$BF2= 200.13
##$BF3= 200.13
##$BF4= 200.13
##$BF5= 200.13
##$BF6= 200.13
##$BF7= 200.13
##$BF8= 200.13
##$BYTORDA= 1
##$CFDGTYP= 0
##$CFRGTYP= 5
##$CHEMSTR= <none>
##$CNST= (0..31)
1 1 145 1 1 1 1 1 1 1 1 1 1 1 1 1 1 1 1 1 1 1 1 1 1 1 1 1 1 1 1 1 
##$CPDPRG= <>
##$CPDPRG1= <>
##$CPDPRG2= <>
##$CPDPRG3= <>
##$CPDPRG4= <mlev>
##$CPDPRG5= <mlev>
##$CPDPRG6= <mlev>
##$CPDPRG7= <mlev>
##$CPDPRG8= <mlev>
##$CPDPRGB= <>
##$CPDPRGT= <>
##$D= (0..31)
0 0.7 0 0 0 0 0 0 0 0 0 0.03 0 0 0 0 0 0 0 0 0 0 0 0 0 0 0 0 0 0 0 0 
##$DATE= 1759232187
##$DBL= (0..7)
120 120 120 120 120 120 120 120 
##$DBP= (0..7)
150 150 150 150 150 150 150 150 
##$DBP07= 0
##$DBPNAM0= <>
##$DBPNAM1= <>
##$DBPNAM2= <>
##$DBPNAM3= <>
##$DBPNAM4= <>
##$DBPNAM5= <>
##$DBPNAM6= <>
##$DBPNAM7= <>
##$DBPOAL= (0..7)
0.5 0.5 0.5 0.5 0.5 0.5 0.5 0.5 
##$DBPOFFS= (0..7)
0 0 0 0 0 0 0 0 
##$DE= 6
##$DECBNUC= <off>
##$DECIM= 32
##$DECNUC= <off>
##$DECSTAT= 4
##$DIGMOD= 1
##$DIGTYP= 9
##$DL= (0..7)
0 120 120 120 120 120 120 120 
##$DP= (0..7)
150 150 150 150 150 150 150 150 
##$DP07= 0
##$DPNAME0= <>
##$DPNAME1= <>
##$DPNAME2= <>
##$DPNAME3= <>
##$DPNAME4= <>
##$DPNAME5= <>
##$DPNAME6= <>
##$DPNAME7= <>
##$DPOAL= (0..7)
0.5 0.5 0.5 0.5 0.5 0.5 0.5 0.5 
##$DPOFFS= (0..7)
0 0 0 0 0 0 0 0 
##$DQDMODE= 0
##$DR= 18
##$DS= 0
##$DSLIST= <SSSSSSSSSSSSSSS>
$$ [...]
##$SUBNAM0= <"">
##$SUBNAM1= <"">
##$SUBNAM2= <"">
##$SUBNAM3= <"">
##$SUBNAM4= <"">
##$SUBNAM5= <"">
##$SUBNAM6= <"">
##$SUBNAM7= <"">
##$SUBNAM8= <"">
##$SUBNAM9= <"">
##$SW= 18.0517328524113
##$SWIBOX= (0..15)
0 0 2 0 0 0 0 0 0 0 0 0 0 0 0 0 
##$SW_h= 3612.71676300578
##$TD= 16384
##$TD0= 1
##$TE= 0
##$TE2= 300
##$TE3= 300
##$TEG= 300
##$TL= (0..7)
0 120 120 120 120 120 120 120 
##$TP= (0..7)
150 150 150 150 150 150 150 150 
##$TP07= 0
##$TPNAME0= <>
##$TPNAME1= <>
##$TPNAME2= <>
##$TPNAME3= <>
##$TPNAME4= <>
##$TPNAME5= <>
##$TPNAME6= <>
##$TPNAME7= <>
##$TPOAL= (0..7)
0.5 0.5 0.5 0.5 0.5 0.5 0.5 0.5 
##$TPOFFS= (0..7)
0 0 0 0 0 0 0 0 
##$TUNHIN= 0
##$TUNHOUT= 0
##$TUNXOUT= 0
##$USERA1= <user>
##$USERA2= <user>
##$USERA3= <user>
##$USERA4= <user>
##$USERA5= <user>
##$V9= 5
##$VALIST= <valist>
##$VCLIST= <CCCCCCCCCCCCCCC>
##$VD= 0
##$VDLIST= <DDDDDDDDDDDDDDD>
##$VPLIST= <PPPPPPPPPPPPPPP>
##$VTLIST= <TTTTTTTTTTTTTTT>
##$WBST= 1024
##$WBSW= 4
##$XGAIN= (0..3)
0 0 0 0 
##$XL= 0
##$YL= 0
##$YMAX_a= 752615
##$YMIN_a= -1018350
##$ZGOPTNS= <>
##$ZL1= 120
##$ZL2= 120
##$ZL3= 120
##$ZL4= 120
##$ABSF1= 10
##$ABSF2= 0
##$ABSG= 5
##$ABSL= 3
##$ALPHA= 0
##$AQORDER= 0
##$ASSFAC= 0
##$ASSFACI= 0
##$ASSFACX= 0
##$ASSWID= 0
##$AUNMP= <proc_1d>
##$AZFE= 0.1
##$AZFW= 0.1
##$BCFW= 1
##$BC_mod= 2
##$BYTORDP= 1
##$COROFFS= 0
##$CY= -3
##$DATMOD= 1
##$DC= 2
##$DFILT= <>
##$DTYPP= 0
##$F1P= 0
##$F2P= 0
##$FCOR= 0.5
##$FTSIZE= 0
##$FT_mod= 4
##$GAMMA= 1
##$GB= 0.15
##$INTBC= 1
##$INTSCL= 1
##$ISEN= 128
##$LB= 0.25
##$LEV0= 0
##$LPBIN= 0
##$MAXI= 10000
##$MC2= 0
##$MEAN= 0
##$ME_mod= 0
##$MI= 1.114404
##$NCOEF= 0
##$NC_proc= 0
##$NLEV= 6
##$NOISF1= 3.799351
##$NOISF2= 2.8
##$NSP= 1
##$NTH_PI= 0
##$NZP= 0
##$OFFSET= 14.38212
##$PC= 1
##$PHC0= -1565.823
##$PHC1= 22.79226
##$PH_mod= 1
##$PKNL= yes
##$PPARMOD= 0
##$PSCAL= 0
##$PSIGN= 0
##$REVERSE= no
##$SF= 200.129724274929
##$SI= 16384
##$SIGF1= 3
##$SIGF2= 2
##$SINO= 400
##$SIOLD= 16384
##$SREGLST= <1H.CDCl3>
##$SSB= 0
##$STSI= 0
##$STSR= 0
##$SW_p= 3205.1282051282
##$SYMM= 0
##$S_DEV= 0
##$TDeff= 0
##$TDoff= 0
##$TI= <>
##$TILT= no
##$TM1= 0
##$TM2= 0
##$TOPLEV= 0
##$USERP1= <user>
##$USERP2= <user>
##$USERP3= <user>
##$USERP4= <user>
##$USERP5= <user>
##$WDW= 1
##$XDIM= 8192
##$YMAX_p= 0
##$YMIN_p= 0
$$ End of Bruker specific parameters
$$ ---------------------------------
##NTUPLES= NMR FID
##VAR_NAME=  TIME,          FID/REAL,        FID/IMAG
##SYMBOL=    X,             R,               I
##VAR_TYPE=  INDEPENDENT,   DEPENDENT,       DEPENDENT
##VAR_FORM=  AFFN,          ASDF,            ASDF
##VAR_DIM=   8192,          8192,            8192
##UNITS=     SECONDS,       ARBITRARY UNITS, ARBITRARY UNITS
##FACTOR=    0.0002768,     1,               1
##FIRST=     0,             0,               0
##LAST=      2.2672688,     0,               0
##MIN=       0,             -1018350,        0
##MAX=       2.2672688,     752615,          0
$$ Real data points
##PAGE= N=1
##DATA TABLE= (X++(R..R)), XYDATA
$$ [...]
$$ plain form
1987 885 1479 1132 980 1212 1139 48 425 87 -340 -871 -853 -1099 -1431 -1527 -1034 -954 -942 116 605 329 784
2008 784 1419 1041 1079 1116 1261 497 79 414 -482 -1175 -663 -1024 -1585 -1193 -1155 -756 -924 -346 179 182 678 1361
2030 1361 1279 906 1418 1190 317 560 168 -10 -634 -1144 -929 -783 -1312 -734 -854 -1143 -348 68 28 302
2050 302 536 1178 940 818 1101 1218 469 256 168 -528 -607 -692 -1067 -1328 -1051 -742 -708 -586 -136 467 -8
2071 -8 790 1158 847 1080 1285 1288 486 324 414 -277 -767 -426 -842 -1523 -1053 -867 -895 -1037 -507 -68 -71 508 975
2094 975 1070 988 995 1345 400 282 324 249 -321 -826 -747 -936 -1399 -876 -874 -641 -695 -51 -26 306 705 1126 900 710
2118 710 938 1021 348 573 362 -56 -291 -461 -787 -1160 -1222 -574 -849 -726 -312 100 248 451 821 829 888 1217
2140 1217 955 751 304 188 65 -464 -637 -317 -851 -823 -709 -840 -582 -711 166 101 315 735 886 556
$$ packed form
1987H85N94l47j52K32p3j091L77l38m27n31J8k46l32r6M93Q0J2J058M89k76M55
2008G84O35l78L8L7J45p64m18L35q96o93N12l61n61L92L8L99j68N78N25LM96O83
2030A361q2l73N12k28q73K43l92j78o24n10K15J46n29N78j20k89P95M16m0K74
2050C02K34O42k38j22K83J17p49k13q8o96p9q5l75k61K77L09L4J22M50O03m75
2071hP98L68l11K33K05Lq02j62R0o91m90L41m16o81M70J86k8j42N30M39lN79M67
2094I75R5q2PL50r45j18M2p5n70n05P9j89m63N23KK33n4O44K5L32L99M21k26j90
2118G10K28Q3o73K25k11m18k35j70l26l73o2O48k75J23M14M12J48K03L70QN9L29
2140A217k62k04m47j16j23n29j73L20n34K8J14j31K58j29Q77o5K14M20J51l30
$$ plain form
2160 556 1067 1016 324 554 514 -109 -466 -497 -555 -489 -961 -924 -712 -1062 -442 -154 -91 189 827 794 791 960 1038 876
2184 876 379 153 452 -223 -172 -493 -1040 -723 -893 -999 -785 -791 -494 -47 -39 319 969 830 490 888 776 580
2206 580 596 275 -137 -610 -248 -260 -949 -864 -575 -900 -851 -428 -221 166 357 808 853 587 764 1007 532 576
2228 576 476 124 -195 -260 -638 -785 -958 -774 -408 -757 -555 -177 -67 -138 488 311 812 579 659 880 521
2249 521 433 351 41 -410 -189 -648 -797 -848 -699 -845 -746 -676 -183 -114 136 692 348 657 924 760 535 574
2271 574 323 548 136 -325 -358 -899 -932 -727 -750 -574 -428 -202 63 43 486 536 530 839 957 600 434 797
2293 797 22 -211 -120 -89 -521 -927 -778 -718 -776 -363 -169 -330 -50 186 500 811 838 631 763 629 419 652
2315 652 4 -147 -155 -444 -788 -659 -786 -642 -779 -444 -370 -284 173 553 429 737 730 872 654 521 468 429 -97
$$ packed form
2160E56N11n1o92K30m0o23l57l1n8O6m72L7K12l50O20K88O3K80O38l3lJ69P8j62
2184H76m97k26K99o75N1l21n47L17j70j06K14oK97M47QL58O50j39l40L98j12j96
2206E80J6l21m12m73L62j2o89Q5K89l25M9M23K07L87J91M51M5k66J77K43m75M4
2228E76j00l52l19o5l78j47j73J84L66l49K02L78J10p1O26j77N01k33Q0K21l59
2249E21q8q2l10m51K21m59j49n1J49j46R9P0M93O9K50N56l44L09K67j64k25L9
2271E74k51K25m12m61l3n41l3K05k3J76J46K26K65k0M43N0oL09J18l57j66L63
2293G97p75k33R1L1m32m06J49O0n8M13J94j61K80K36L14L11K7k07J32j34k10K33
2315F52o48j51qk89l44J29j27J44j37L35P4Q6M57L80j24L08pJ42k18j33n3l9n26
$$ plain form
2338 -97 -169 -193 -596 -749 -576 -871 -966 -28 -185 -50 251 348 784 507 1037 890 569 473 667 213 -29 -79
2360 -79 -322 -439 -550 -583 -700 -824 -907 -635 -304 -174 277 382 361 722 360 698 392 377 193 188 -5 -28 -329
2383 -329 -857 -433 -669 -743 -750 -466 -249 39 317 335 447 582 856 739 452 632 295 54 -127 -482 -30
2404 -30 -555 -535 -723 -851 -770 -590 -705 -406 -51 324 599 651 497 726 275 535 705 235 -219 -230 -36 -407
2426 -407 -483 -524 -409 -617 -441 -387 -287 -348 240 410 338 774 831 496 537 650 670 72 -162 184 -344 -484 -369
2449 -369 -527 -591 -501 -343 -450 -279 83 282 399 427 615 817 698 329 644 197 99 -39 -128 -388 -685 -456
2471 -456 -637 -801 -48 113 -444 -185 228 198 606 341 590 549 609 678 283 -149 -24 -179 -388 -478 -484 -746
2493 -746 -796 -664 -286 -252 -493 84 323 248 476 683 670 471 431 605 562 157 179 -411 -457 -498 -564 -796 -625
$$ packed form
2338i7p2k4m03j53J73k95r5R38j57J35L01R7M36k77N30j47l21r6J94m54k42n0
2360g9k43j17j11l3j17j24q3K72L31J30M51J05k1L61l62L38l06j5j84nj93k3l01
2383c29n28M24k36p4pK84K17K88K78J8J12J35K74j17k87J80l37k41j81l55M52
2404c0n25K0j88j28Q1J80j15K99L55L75K75N2j54K29m51K60J70m70m54j1J94l71
2426d07p6m1J15k08J76N4J00o1N88J70p2M36N7l35M1J13K0n98k34L46n28j40J15
2449c69j58o4R0J58j07J71L62J99J17K8J88K02j19l69L15m47r8j38q9k60k97K29
2471d56j81j64P53J61n57K59M13l0M08k65K49m1O0O9l95m32J25j55k09r0ok62
2493g46n0J32L78L4k41N77K39p5K28K07j3j99m0J74m3m05K2n90m6m1o6k32J71
$$ plain form
2516 -625 -348 -246 -366 -139 162 444 265 947 859 386 454 561 326 130 59 -278 -479 -755 -550 -677 -694
2537 -694 -420 -244 -403 31 230 340 362 514 551 547 641 347 397 207 68 38 -458 -715 -440 -610 -508 -647
2559 -647 -439 -373 -293 165 377 106 268 735 577 609 571 346 249 258 -117 -121 -405 -340 -641 -608 -534 -465 -513 -288 56
2584 56 -62 15 239 734 618 344 609 651 324 280 291 -139 -269 -259 -685 -635 -782 -448 -497 -636 -158 86 52
2607 52 461 228 463 448 562 778 661 163 407 64 -145 -386 -451 -697 -752 -554 -224 -273 -169 19 233 118
2629 118 536 411 409 370 468 446 204 309 55 66 -493 -583 -545 -836 -367 -708 -209 -286 -84 52 70 342 507
2652 507 716 389 532 822 152 436 286 -225 -217 -381 -354 -340 -605 -745 -187 -392 -61 53 -14 369 490 670
2674 670 301 384 536 449 515 -136 200 -287 -241 -513 -215 -452 -633 -614 -220 -500 16 116 17 129 448 320
$$ packed form
2516f25K77J02j20K27L01K82j79O82q8m73O8J07k35j96p1l37k01k76K05j27j7
2537f94K74J76j59M34J99J10K2J52L7mR4k94N0j90j39l0m96k57K75j70J02j39
2559f47K08O6Q0M58K12k71J62M67j58L2l8k25r7Rl75mk84O5l01L3P4O9m8K25L44
2584E6j18P7K24M95j16k74K65M2l27m4J1m30j30J0m26N0j47L34m9j39M78K44l4
2607E2M09k33K35j5J14K16j17m98K44l43k09k41o5k46n5J98L30m9J04J88K14j15
2629A18M18j25kl9R8k2k42J05k54J1n59r0L8k91M69l41M99p7K02J36J8K72J65
2652E07K09l27J43K90o70K84j50n11Qj64K7J4k65j40N58k05L31J14o7L83J21J80
2674F70l69Q3J52q7O6o51L36m87M6k72K98k37j81J9L94k80N16J00r9J12L19j28
$$ plain form
2696 320 358 268 499 313 72 44 -83 -403 -154 -417 -776 -227 -482 -624 -54 -317 -129 451 -34 391 398 606
2718 606 413 649 37 119 508 107 10 -634 -646 -635 -443 -543 -361 -229 -242 259 -11 305 468 196 630 482
2740 482 533 644 362 80 -5 -86 -438 -229 -532 -557 -584 -452 -211 -503 -226 -81 273 433 610 459 488 604
2762 604 659 583 192 18 -111 -382 -254 -298 -603 -555 -397 -410 -474 -280 120 183 232 618 629 181 308 654 270
2785 270 334 284 116 -184 -127 -521 -638 -496 -319 -344 -269 -182 -73 -83 176 474 478 252 670 469 412 66 294
2808 294 183 -346 -169 -136 -287 -749 -450 -202 -196 -306 -252 -191 94 92 297 356 462 419 496 -39 95 -99 -90 -67
2832 -67 46 -310 -453 -500 -805 -488 -392 -197 113 -128 320 399 366 563 333 566 338 556 146 186 -100 -153
2854 -153 -113 -330 -277 -776 -707 -699 -295 109 -171 217 179 214 471 382 615 404 263 103 229 25 -148 -68 -591
$$ packed form
2696C20L8r0K31j86k41k8j27l20K49k63l59N49k55j42N70k63J88N80m85M25PK08
2718F06j93K36o12Q2L89m01r7o44j2J1J92j00J82J32j3N01k70L16J63k72M34j48
2740D82N1J11k82k82q5q1l52K09l03k5k7J32K41k92K77J45L54J60J77j51K9J16
2762F04N5p6l91j74j29k71J28m4l05M8J58j3o4J94M00O3M9L86J1m48J27L46l84
2785B70O4n0j68l00N7l94j17J42J77k5P5Q7J09j0K59K98Mk26M18k01n7l46K28
2808B94j11n29J77L3j51m62K99K48Oj10N4O1K85kK05N9J06m3P7n35J34j94RK3
2832f7J13l56j43m7l05L17R6J95L10k41M48P9l3J97k30K33k28K18m10M0k86n3
2854a53M0k17N3m99O9QM04M04k80L88l8L5K57q9K33k11j41j60J26k04j73Q0n23
$$ plain form
2877 -591 -431 -362 -443 -342 -231 -28 -126 -157 70 245 462 240 584 481 527 303 75 267 24 -400 -120 -670
2899 -670 -744 -485 -368 -425 -502 -296 -336 193 -7 378 333 496 276 137 452 363 273 -130 137 -294 -395 -150
2921 -150 -746 -412 -376 -221 78 -37 -76 197 80 121 430 468 652 216 167 293 220 -100 8 -476 -508 -350
2943 -350 -367 -364 -609 -124 -164 -152 -65 411 289 -83 617 707 364 386 -29 301 -105 -92 -32 -423 -736 -609 -282
2966 -282 -324 -200 -341 -125 -150 125 408 205 381 488 284 201 458 158 -322 -210 -166 -405 -385 -440 -355 -223
2988 -223 -180 175 98 28 158 100 56 500 158 400 227 279 90 103 -55 -33 -131 -297 -236 -409 -608 -569 -510 -173
3012 -173 -186 33 131 -3 83 333 211 276 534 258 245 -121 -31 -244 -385 -353 -277 -534 -425 -461 74 -112 88
3035 88 219 166 234 307 333 322 62 280 194 298 -196 -105 -287 -161 -397 -126 -500 -489 -365 -110 -218 -92 233
$$ packed form
2877e91J60O9q1J01J11K03r8l1K27J75K17k22L44j03M6k24k28J92k43m24K80n50
2899f70p4K59J17n7p7K06m0N29k00L85m5J63k20j39L15q9r0m03K67m31j01K45
2921a50n96L34L6J55K99j15l9K73j17M1L09L8J84m36m9J26p3l20J08m84l2J58
2943c50j7Lk45M85m0J2Q7M76j22l72P00R0l43K2m15L30m06J3O0l91l13J27L27
2966b82m2J24j41K16k5K75K83k03J76J07k04q3K57l00m80J12M4k39K0n5Q5J32
2988b23M3L55p7p0J30n8m4M44l42K42j73N2j89J3j58K2r8j66O1j73j99L9N9L37
3012a73j3K19R8j34Q6K50j22O5K58k76j3l66R0k13j41L2P6k57J09l6N35j86K00
3035H8J31n3O8P3K6j1k60K18q6J04m94R1j82J26k36K71l74J1J24K55j08J26L25
$$ plain form
3058 233 304 255 167 319 419 248 302 257 -256 -142 156 -281 -273 -252 -294 -265 -407 -189 -232 62 260 179 394 281
3082 281 465 111 353 144 -200 163 -137 -5 -145 -231 -349 -125 -293 -308 -257 -168 120 108 159 331 402 227
3104 227 156 391 162 203 -85 -116 -63 -378 -382 -120 -328 -236 -347 -238 -267 -388 124 35 -61 627 182 254 195 385
3128 385 77 278 264 -171 -155 -290 -501 -279 -379 -275 22 -299 108 -65 375 292 344 333 337 137 101 286 168
3151 168 159 42 -16 -175 -319 -225 -402 -164 -459 -247 -307 -356 -63 133 221 214 234 496 205 326 353 -128 308 120
3175 120 -29 -116 -95 -550 -257 -357 -338 -263 -178 -19 133 57 357 484 218 359 162 263 194 -166 -218 -171 4
3198 4 -121 85 -365 -480 47 -122 -213 -102 -60 117 157 59 375 173 464 226 267 135 132 59 -220 -302 -363 -381
3222 -381 -366 -314 -229 -210 -249 371 224 104 -31 86 -90 260 541 136 277 9 199 -218 -179 -231 -191 -236 -371
$$ packed form
3058B33P1m9q8J52J00j71N4m5n13J14K98m37QK1m2K9j42K18m3K94J98q1K15j13
3082B81J84l54K42k09l44L63l00J32j40q6j18K24j68j5N1Q9K88j2N1J72P1j75
3104B27p1K35k29M1k88l1N3l15mK62k08R2j11J09k9j21N12q9r6O88m45P2n9J90
3128C85l08K01j4m35J6j35k11K22j00J04K97l21M07j73M40q3N2j1Mk00l6J85j18
3151A68rj17n8j59j44R4j77K38k95K12o0m9K93J96Q8pK0K62k91J21K7m81M36j88
3175A20j49q7K1m55K93j00J9P5Q5J59J52p6L00J27k66J41j97J01o9l60n2M7J75
3198Dj25K06m50j15N27j69r1J11M2J77M0r8L16k02K91k38M1j32lp3k79q2o1j8
3222c81J5N2Q5J9l9O20j47j20j35J17j76L50K81m05J41k68J90m17L9n2M0m5j35
$$ plain form
3245 -371 -198 -119 -315 -3 116 -68 42 18 329 22 37 290 291 344 -43 91 -93 -77 -90 -219 -296 -484 -288
3268 -288 -201 -313 158 104 54 -83 213 415 338 206 312 182 -162 139 -135 -276 -372 -215 -141 -164 -408 55
3290 55 -131 -17 -145 134 202 228 306 355 236 237 50 356 12 -157 -176 -494 -284 -295 -247 -219 -381 89 -59 104
3314 104 107 -70 236 64 111 238 -20 480 -28 263 159 194 103 -11 -125 -280 -106 -154 -214 -157 204 -43 -17
3337 -17 307 308 168 89 7 19 -32 -14 -248 -181 159 30 -283 -39 -141 -98 -94 -91 23 28 120 189 339 256 78 359
3363 359 224 -2 -102 287 -10 -14 -246 56 -149 -188 -97 -49 -40 72 -143 205 96 125 102 205 279 234 110 -218
3387 -218 26 -195 -7 -13 -150 -45 -18 -189 -45 -169 -217 61 19 -188 59 151 110 547 69 270 65 -117
3409 -117 -315 66 46 -193 -210 -136 -141 -90 -23 -284 -126 199 89 -23 29 54 119 183 -7 9 -153 174 142 -151
$$ packed form
3245c71J73P9j96L12J19j84J10k4L11l07J5K53JN3l87J34j84J6j3j29p7j88J96
3268b88Q7j12M71n4n0j37K96K02p7j32J06j30l44L01k74j41r6J57P4k3k44M63
3290E5j86J14j28K79O8K6P8M9j19Jj87L06l44j69j9l18K10j1M8K8j62M70j48J63
3314A04Lj77L06j72M7J27k58N00n08K91j04L5r1j14j14j55J74m8o0N7L61k47K6
3337a7L24Jj40p9q2J2n1J8k34O7L40j29l13K44j02M3MLJ14NR2O9J50q3j78K81
3363C59j35k26j00L89k97mk32L02k05l9R1M8RJ12k15L48j09K9k3J03P4m5j24l28
3387b18K44k21J88oj37J05K7j71J44j24m8K78m2k07K47R2m1M37m78K01k05j82
3409a17j98L81k0k39j7P4nN1O7k61J58L25j10j12N2K5O5O4j90J6j62L27l2k93
$$ plain form
3433 -151 -250 -133 -52 -213 -52 -183 -166 425 -45 -69 117 63 221 -21 308 -48 98 324 79 62 124 -104
3455 -104 -30 -250 -129 38 -157 89 -348 76 55 301 -112 245 82 -162 285 267 -49 2 -87 -36 -231 -316
3477 -316 -27 -126 120 -162 -152 17 149 136 47 51 -2 256 45 60 72 155 37 42 3 -142 11 -244 -137 -18
3501 -18 181 -387 154 24 -61 304 198 -84 361 9 108 121 111 291 6 -278 81 -189 -285 -132 -256 -225
3523 -225 -203 -26 -100 143 -201 131 211 141 -1 181 326 143 63 -64 -69 -197 -137 155 -223 -321 -126 -69 -150 36
3547 36 98 229 141 244 80 16 75 43 -17 -64 -85 -24 -80 -222 -116 -174 -289 -337 86 41 -196 79 63 335 9
3572 9 295 445 146 55 -85 164 -43 144 -264 -319 -150 -407 -180 -117 -28 -59 86 -15 584 -125 188 82
3594 82 -168 355 131 258 38 384 127 267 -142 -22 58 -395 -149 -76 192 -290 92 136 -122 168 179 183
$$ packed form
3433a51r9J17Q1j61J61j31J7N91m70k4J86n4J58k42L29l56J46K26k45j7O2k28
3455a04P4k20J21J67j95K46m37M24k1K46m13L57j63k44M47j8l16N1q9N1j95q5
3477c16K89r9K46k82J0J69J32j3q9Mn3K58k11J5J2Q3j18Nl9j45J53k55J07J19
3501a8J99n68N41j30q5L65j06k82M45l52R9J3j0J80k85k84L59k70r6J53j24L1
3523b25K2J77p4K43l44L32Q0p0j42J82J45j83q0j27nj28O0K92l78r8J95N7q1J86
3547C6O2J31q8J03j64o4N9l2o0m7k1O1n6j42J06n8j15m8M23m5k37K75j6K72l26
3572IK86J50k99r1j40K49k07J87m08n5J69k57K27O3Q9l1J45j01N99p09L13j06
3594H2k50N23k24J27k20L46k57J40m09J20Q0m53K46P3K68m82L82M4k58K90J1M
$$ plain form
3616 183 34 195 67 -175 461 -118 -33 -192 -176 -301 -116 88 -141 -105 -195 19 72 114 138 134 48 77 291 285
3640 285 23 57 264 -146 -194 -124 13 -233 -437 -211 -305 49 229 -243 -139 434 257 241 190 155 360 61
3662 61 181 100 -13 76 -31 -51 -21 -234 -466 -369 -28 66 114 -136 124 354 -165 411 93 39 155 83 427
3685 427 -163 0 55 166 -353 -176 -247 -473 -299 -109 -314 -50 128 49 -62 69 234 48 -54 62 304
3706 304 72 122 -45 -136 -217 -160 -91 -135 -141 -288 -178 -15 53 -50 -73 267 219 300 174 314 63 -21 3 -70 -103
3731 -103 -200 -36 -222 86 97 -125 -347 72 31 72 121 -44 258 338 216 370 214 155 -306 288 -225 -267 -157
3754 -157 -203 -209 -114 -175 -154 -144 -208 2 99 42 208 313 86 27 471 42 230 80 39 25 -14 -253 -166 -66 -165
3779 -165 -52 106 -122 40 74 159 303 192 134 307 173 -92 118 -80 25 126 -191 -141 -395 -283 -283 -302
$$ packed form
3616A83j49J61j28k42O36n79Q5j59J6j25J85K04k29L6r0K14N3M2K4mq6K9K14o
3640B85k62L4K07m10m8P0J37k46k04K26r4L54J80m72J04N73j77j6n1l5K05k99
3662F1J20q1j13Q9j07k0L0k13k32R7L41R4M8k50K60K30n19N76l18n4J16p2L44
3685D27n90J63N5J11n19J77p1k26J74J90k05K64J78p9j11J31J65j86j02J16K42
3706C04k32N0j67r1q1N7O9m4oj47J10J63O8j03k3L40m8Q1j26J40k51q4K4p3l3
3731a03r7J64j86L08J1k22k22M19m1M1M9j65L02Q0j22J54j56n9m61N94n13m2J10
3754a57m6oR5o1K1J0o4K10R7n7J66J05k27n9M44m29J88j50m1j4l9k39Q7J00r9
3779a65J13J58k28J62L4Q5J44j11n8J73j34k65K10j98J05J01l17N0k54J12%j9
$$ plain form
3801 -302 -43 -2 133 2 12 271 260 239 250 264 146 -100 206 -119 -379 -101 -141 -296 -234 17 -193 -84 -225
3824 -225 -77 -83 119 189 397 424 266 214 485 547 -134 118 7 183 -240 -201 -224 -93 -200 -43 -140 -102 -318
3847 -318 112 22 142 59 242 330 400 266 186 86 -143 59 -70 -185 -170 -290 -282 -42 -323 -16 72 11 421
3870 421 -29 144 367 322 445 310 201 443 122 58 -103 -35 -369 -416 -189 -457 -40 -350 -205 -125 -174 144
3892 144 218 104 384 306 212 375 259 137 72 -148 35 -195 -245 -327 -244 -210 71 -232 -211 293 9 314 353
3915 353 239 359 439 334 265 215 159 -389 -103 -158 -377 -335 -377 -238 -216 -156 -222 -96 -3 46 377 377 360 285 347 260
3941 260 163 -68 26 35 -236 -224 -397 -392 -246 73 -279 -60 -194 -110 15 389 341 287 310 481 521 287 83 68
3965 68 -394 -275 -129 -233 -390 -233 -101 -152 -48 -114 -51 -116 391 103 153 375 655 341 95 -145 224 -25
$$ packed form
3801c02K59M1J35j31J0K59j1k1J1J4j18k46L06l25k60K78m0j55O2K51k10J09j41
3824b25J48oK02P0K08K7j58n2K71O2o81K52j11J76m23L9k3J31j07J57r7L8k16
3847c18M30r0J20q3J83Q8P0j34q0j00k29K02j29j15J5j20QK40k81L07Q8o1M10
3870D21m50J73K23m5J23j35j09K42l21o4j61O8l34m7K27k68M17l10J45Q0m9L18
3892A44P4j14K80p8r4J63j16j22o5k20J83k30n0q2Q3L4K81l03K1N04k84L05L9
3915C53j14J20Q0j05o9n0n6n48K86n5k19M2m2J39K2O0o6J26R3M9L31%j7p5O2q7
3941B60r7k31R4Rk71J2j73NJ46L19l52K19j34Q4J25L74m8n4K3J71M0k34k04j5
3965F8m62J19J46j04j57J57J32n1J04o6O3o5N07k88N0K22K80l14k46k40L69k49
$$ plain form
3987 -25 88 -37 -335 -534 -341 -91 -525 -204 -84 -67 163 92 149 421 202 622 146 293 355 259 -29 83
4009 83 -364 -293 -256 -459 -256 -321 -263 -339 -12 -150 -72 154 25 349 411 211 637 335 154 68 199 140 -195
4032 -195 -229 -252 -422 -477 -377 -197 -349 110 137 -148 291 -9 434 603 375 327 466 452 -25 -190 -218 -255 -133
4055 -133 -281 -223 -375 -404 -68 -292 114 -163 27 431 210 257 460 507 264 329 44 -210 -261 -302 -374 -389 -247
4078 -247 -414 -326 -335 -86 -188 -30 13 350 32 168 115 326 604 336 187 88 47 91 -189 -265 -478 -235 -9
4101 -9 -212 -159 -79 -34 -124 156 430 382 536 455 508 314 250 93 -67 -140 -134 -331 -330 -349 -239 -476 -361 40 -256
4126 -256 -308 243 130 206 319 584 231 252 340 348 177 -164 -266 -408 -237 -384 -347 -505 -650 -335 -270 43 -10
4149 -10 117 497 321 441 538 109 252 430 80 -21 139 -201 -464 -290 -528 -407 -317 -364 -211 97 -59
$$ packed form
3987b5J13j25k98j99J93K50m34L21J20J7K30p1N7K72k19M20m76J47O2r6k88J12
4009H3m47P1L7k03K03o5N8p6L27j38P8K26j29L24O2k00M26l02j81q6J31n9l35
4032a95l4k3j70n5J00J80j52M59K7k85M39l00M43J69k28m8J39j4m77j65k8l7J22
4055a33j48N8j52k9L36k24M06k77J90M04k21M7K03M7k43O5k85k54n1m1p2j5J42
4078b47j67Q8rK49j02J58M3L37l18J36n3K11K78k68j49r9m1M4k80p6k13K43K26
4101ik03N3Q0M5r0K80K74m8J54q1N3j94o4j57j60p3Oj97Jj9J10k37J15M01k96
4126b56n2N51j13P6J13K65l53K1Q8Qj71l41j02j42J71j47L7j58j45L15O5L13n3
4149a0J27L80j76J20R7m29J43J78l50j01J60l40k63J74k38J21R0m7J53L08j56
$$ plain form
4170 -59 107 113 346 178 414 134 419 236 353 214 55 -117 -178 -179 -324 -525 -58 -178 -46 -378 -50 -158
4192 -158 319 212 418 270 391 406 248 47 220 -70 -82 -180 -203 -540 -414 -482 -578 157 -217 -298 -115 318
4214 318 286 408 433 138 323 588 440 258 -37 3 151 -447 -328 -271 -627 -153 -313 -162 -186 -9 -82 298
4236 298 336 493 333 619 559 517 10 330 14 -25 -373 -229 -340 -332 -285 -505 -459 -175 -187 -103 155 122 323 463
4260 463 302 323 442 376 385 431 179 -298 -89 -202 -229 -570 -431 -472 -300 -119 139 -247 -17 59 329 445 538
4283 538 297 218 301 335 140 -255 87 -186 -395 -219 -168 -314 -271 -69 -123 162 152 175 421 218 307 385 455 364
4307 364 59 162 71 -164 -300 -448 -261 -437 -242 -362 -185 -408 -154 -5 356 -38 332 284 310 634 504
4328 504 192 218 227 -105 -264 -327 -482 -369 -550 -208 -518 -439 -207 -47 89 112 424 522 342 569 457 248
$$ packed form
4170e9J66OK33j68K36k80K85j83J17j39j59j72o1jj45k01M67j20J32l32L28j08
4192a58M77j07K06j48J21J5j58k01J73k90j2r8k3l37J26o8r6P35l74q1J83M33
4214C18l2J22K5k95J85K65j48j82k95M0J48n98J19N7l56M74j60J51k4J77p3L80
4236B98L8J57j60K86o0m2n07L20l16l9l48J44j11QM7k20M6K84j2Q4K58l3K01J40
4260D63j61K1J19o6RM6k52m77K09j13k7l41J39m1J72J81K58l86K30P6K70J16R3
4283E38k41p9Q3L4j95l95L42k73k09J76N1j46M3K02n4K85j0K3K46k03Q9P8P0r1
4307C64l05J03r1k35j36j48J87j76J95j20J77k23K54J49L61l94L70m8K6L24j30
4328E04l12K6Rl32j59o3j55J13j81L42l10P9K32J60J36K3L12R8j80K27j12k09
$$ plain form
4350 248 187 -117 85 18 -281 -449 -274 -124 -586 -312 -336 -111 69 214 145 271 362 265 730 311 324 300 -211
4373 -211 15 85 -427 -177 -449 -331 -484 -282 -153 -191 26 168 -3 235 185 572 290 173 392 222 89
4394 89 236 165 143 -195 -423 -133 -312 -355 -198 -368 -81 -94 -100 171 395 172 600 404 274 603 146 237 242
4417 242 -63 -240 -268 -690 -408 -639 -295 -411 5 -25 -5 111 147 410 196 428 305 209 12 352 243 93
4439 93 -245 -337 -421 -365 -491 -462 -429 -170 -90 53 -65 210 269 193 488 578 348 305 372 237 -25 9 -112 -313
4463 -313 -304 -247 -148 -303 -363 -121 -262 -245 166 159 312 177 514 562 591 411 309 176 150 -220 105 -449 -252 -719
4487 -719 -335 -274 -314 -115 162 -9 128 318 578 574 166 440 512 376 -186 148 155 135 -383 -653 -452 -397 -205
4510 -205 -243 -198 -187 -136 123 77 372 449 333 522 438 298 350 -45 109 193 -218 -230 -227 -433 -497 -327 -374 -357 -96
$$ packed form
4350B48o1l04K02o7k99j68J75J50m62K74k4K25J80J45o9J26R1r7M65m19J3k4n11
4373b11K26P0n12K50k72J18j53K02J29l8K17J42j71K38n0L87k82j17K19j70j33
4394H9J47p1k2l38k28K90j79m3J57j70K87j3oK71K24k23M28j96j30L29m57R1N
4417B42l05j77k8m22K82k31L44j16M16l0K0J16L6K63k14K32j23r6j97L40j09j50
4439I3l38r2q4N6j26K9L3K59Q0J43j18K75N9p6K95R0k30m3O7j35k62L4j21k01
4463c13RN7R9j55o0K42j41J7M11pJ53j35L37M8K9j80j02j33k6l70L25n54J97m67
4487g19L84O1m0J99K77j71J37J90K60mm08K74P2j36n62L34Pk0n18k70K01N5J92
4510b05l8M5J1N1K59m6K95P7j16J89q4j40N2l95J54Q4m11j2Lk06o4J70m7J7K61
$$ plain form
4535 -96 69 18 484 459 384 420 485 497 11 363 -93 -141 -37 -381 -373 -466 -346 -269 -296 -262 -140 3 124 102 135
4560 135 337 483 111 573 310 281 299 123 -97 -122 -252 -115 -496 -467 -187 10 -367 60 33 134 358 327
4582 327 318 716 774 344 556 225 194 -65 -390 -244 -75 -283 -187 -608 -417 -206 -127 -201 263 214 446 242 359
4605 359 248 -9 346 168 117 75 -199 -247 -229 -493 -463 -325 -315 -412 -122 -229 -254 30 54 180 426 169 589
4628 589 159 310 -25 123 60 -85 -350 -482 -441 -551 -492 -370 -446 129 -15 -15 71 334 194 279 437 225 338
4651 338 223 4 197 -207 -178 -196 -619 -146 -348 -449 -328 -339 -21 -193 418 222 161 48 369 596 212
4672 212 274 125 37 -73 -27 -198 -210 -339 -532 -219 -205 -130 -222 97 39 523 -28 146 407 647 428 384 -32
4695 -32 131 58 -8 -301 -404 -279 -470 -412 -372 -212 -61 55 -12 362 302 134 291 374 236 243 318 -134 49 -440
$$ packed form
4535i6J65n1M66k5p5L6O5J2m86L52m56m8J04l44Qr3J20P7k7L4J22J43J21k2L3
4560A35K02J46l72M62k63k9J8j76k20k5j30J37l81K9K80J97l77M27k7J01K24l1
4582C27rL98N8m30K12l31l1k59l25J46J69k08R6m21J91K11P9p4M64m9K32k04J17
4605C59j11k57L55j78n1m2k74m8J8k64L0J38J0r7K90j07k5K84K4J26K46k57M20
4628E89m30J51l35J48o3j45k65j32M1j10N9J22p6N75j44%Q6K63j40Q5J58k12J13
4651C38j15k19J93m04K9j8m23M73k02j01J21j1L18j72O11j96o1j13L21K27l84
4672B12O2j49q8j10M6j71j2j29j93L13J4P5r2L19n8M84n51J74K61K40k19m4m16
4695c2J63p3o6k93j03J25j91N8M0J60J51J16o7L74o0j68J57Q3j38PP5m52J83m89
$$ plain form
4719 -440 -111 -188 -314 -266 -357 -448 -390 -320 -368 12 49 257 446 415 466 430 525 231 28 -118 39 -19 -136 -59 -288
4744 -288 -492 -295 -333 -42 -253 131 -202 41 188 494 567 333 335 244 323 90 -8 35 -206 -475 -196 -243 -370
4767 -370 -349 -220 -251 -251 -392 48 177 392 346 580 64 303 273 22 44 -173 41 -191 -320 -396 -339 -390 -406 -234
4791 -234 -65 -62 -107 -108 607 299 378 539 365 527 310 198 285 153 -540 -144 -205 -442 -414 -541 -210 -35 -248
4814 -248 -101 -18 269 211 67 132 202 262 251 464 31 -50 32 -216 -283 -254 -531 -243 -577 -169 -221 -200 -177 119
4838 119 365 455 191 75 39 175 256 -5 53 -144 -84 -153 -370 -627 -313 -418 -160 -272 -52 -182 319 -44
4860 -44 71 184 221 332 377 208 -261 142 227 -19 -187 -243 -465 -121 -445 -53 -458 22 -148 -30 224 117
4882 117 301 266 371 36 240 195 179 -118 -219 -403 -118 -111 -599 -350 -317 -482 -171 -232 -209 297 -27 21 290
$$ packed form
4719d40L29p7j26M8r1r1N8P0m8L80L7K08J89l1N1l6R5k94k03j46J57n8j17P7k29
4744b88k04J97l8K91k11L84l33K43J47L06P3k34Kr1P9k33r8M3k41k69K79m7j27
4767c70K1J29l1%j41M40J29K15m6K34n16K39l0k51K2k17K14k32j29p6N7n1j6J72
4791b34J69Lm5jP15l08P9J61j74J62k17j12Q7j32o93L96o1k37K8j27L31J75k13
4814b48J47Q3K87n8j44O5P0O0j1K13m33q1Q2k48o7K9k77K88l34M08n2K1K3K96
4838A19K46R0k64j16l6J36Q1k61N8j97O0o9k17k57L14j05K58j12K20j30N01l63
4860d4J15J13L7J11M5j69m69M03Q5k46j68n6k22L44l24L92m05M80j70J18K54j07
4882A17J84l5J05l35K04m5j6k97j01j84K85Pm88K49L3j65L11o1K3N06l24M8K69
$$ plain form
4905 290 161 259 613 114 516 416 -75 131 -176 -63 -259 -245 -383 -232 -405 98 152 54 335 399 238 425
4927 425 499 257 179 377 170 145 -163 70 -357 -360 -356 -218 -147 -167 -245 -87 -38 216 311 270 297 451 274 213 273
4952 273 180 135 -240 61 -97 -313 -516 -494 -398 -397 -222 -279 4 208 -79 479 321 375 340 272 307 122 250 -9
4976 -9 -108 -51 -244 -214 -466 -275 -456 -82 34 -6 -19 137 351 196 177 506 374 229 218 211 261 -99 -127 -86 -278
5001 -278 -220 -228 -220 -393 75 105 -31 83 328 299 141 256 230 376 341 103 78 153 -173 -302 -245 -415 17 -351
5025 -351 -323 -185 3 -300 123 205 24 141 307 326 325 317 111 0 -44 35 53 -319 -232 -375 -290 -314 -291 -100 -172
5050 -172 -3 158 232 -13 253 274 292 295 166 96 196 -180 -196 -335 -386 -395 -398 -404 -500 -241 -342 -1 35 60 226 330
5076 330 153 364 409 288 147 195 -177 81 -108 -124 -11 -436 -136 -553 -719 -332 -181 10 -223 17 152
$$ packed form
4905B90j29R8L54m99M02j00m91K06l07J13j96J4j38J51j73N03N4r8K81O4j61J87
4927D25P4k42p8J98k07k5l08K33m27lMJ38P1k0p8J58M9K54R5m1K7J54j77o1O0
4952B73r3m5l75L01j58k16k03K2R6JJ75n7K83K04k87N58j58N4l5o8L5j85J28k59
4976ir9N7j93L0k52J91j81L74J16m0j3J56K14j55j9L29j32j45j1pN0l60k8M1j92
5001b78N8qQj73M68L0j36J14K45k9j58J15k6J46l5k38k5P5l26j29N7j70M32l68
5025c51K8J38J88l03M23Q2j81J17J66J9jqk06j11m4P9J8l72Q7j43Q5k4K3J91p2
5050a72J69J61P4k45K66K1J8Lj29p0J00l76j6j39n1rlor6K59j01L41L6K5J66J04
5076C30j77K11M5j21j41M8l72K58j89j6J13m25L00m17j66L87J51J91k33K40J35
$$ plain form
5097 152 281 146 125 336 171 -1 163 114 -176 -195 -43 -122 -205 -222 -316 -113 -241 -81 -147 164 235 150 253
5120 253 364 407 342 114 90 217 -131 -68 -191 -374 -501 -478 -492 -138 -370 -176 -43 126 137 265 254 243 162
5143 162 240 435 -144 90 -45 -154 -213 -42 -61 -586 -359 -168 -118 16 -27 234 55 382 569 224 79 355
5165 355 137 217 287 -95 -101 -134 -225 -410 -566 -228 -159 -339 -264 -156 156 103 327 178 429 223 -7 -116 -42
5188 -42 372 52 -334 86 -139 -545 -149 -293 -372 -335 -283 10 120 64 -200 346 276 109 422 536 377 66
5210 66 226 -20 -269 -194 -58 -467 -395 -109 -401 -47 -181 86 74 -233 205 170 -23 462 472 147 122 57 -86
5233 -86 -3 -65 -411 -158 -234 -290 -402 -74 -109 -303 -43 107 340 279 219 77 304 243 144 -8 384 -57 -316
5256 -316 23 -227 -132 -427 -565 30 -415 -172 -70 -123 220 78 160 477 344 424 398 209 332 244 -202 -16
$$ packed form
5097A52J29j35k1K11j65j72J64m9k90j9J52p9q3j7r4K03j28J60o6L11P1q5J03
5120B53J11M3o5k28k4J27l48O3j23j83j27K3j4L54k32J94J33J69J1J28j1j1q1
5143A62P8J95n79K34j35j09n9J71j9n25K27J91N0J34m3K61j79L27J87l45j45K76
5165C55k18Q0P0l82ol3r1j85j56L38O9j80P5J08L12n3K24j49K51k06k30j09P4
5188d2M14l20l86M20k25m06L96j44p9L7N2K93J10n6k64N46p0j67L13J14j59l11
5210F6J60k46k49P5J36m09P2K86k92L54j34K67j2l07M38l5j93M85J0l25k5o5j43
5233h6Q3o2l46K53p6n6j12L28l5j94K60J50K33o1o0j42K27o1r9j52L92m41k59
5256c16L39k50R5k95j38N95m45K43J02n3L43j42Q2L17j33Q0k6j89J23q8m46J86
$$ plain form
5278 -16 -87 -287 -252 -542 144 4 -386 0 -169 -18 -17 369 164 226 353 202 205 31 252 48 60 -79 -189
5301 -189 -205 -385 10 -232 -194 -252 12 109 142 40 89 344 549 187 135 202 426 -100 -111 -102 -415 -133 -369 -281
5325 -281 -417 -219 -261 36 -196 -141 90 8 54 137 283 84 150 -149 361 179 56 -110 -178 -261 -376 -20 -318
5348 -318 -96 120 229 -277 310 287 125 402 443 388 127 376 164 -18 -17 84 -165 -7 -324 -228 -325 -368 -21
5371 -21 -124 83 -164 309 208 359 383 137 205 283 399 58 -29 -166 -66 93 -277 -325 -326 -162 -342 -154 100
5394 100 4 23 38 172 354 382 57 244 241 36 112 -307 -128 -139 -281 45 -168 -207 -272 -46 -64 31 66 -9 -12
5419 -12 261 419 347 100 178 371 75 -29 -141 -308 -327 -31 -266 -297 -276 -157 -204 44 -39 33 221 190 94 68
5443 68 139 -43 74 116 99 -48 47 224 -269 -483 -79 -192 -218 -288 -193 272 -125 -9 258 133 262 456 81
$$ packed form
5278a6p1k00L5k90O86j40l90L86j69J51JL86k05O2J27j51Lj74K21k04J2j39j10
5301a89j6j80L95k42L8n8K64R7L3j02M9K55K05l62n2O7K24n26j1Rl13K82k36Q8
5325b81j36J98m2K97k32N5K31q2M6Q3J46j99O6k99N10j82j23j66o8q3j15L56k98
5348c18K22K16J09n06N87k3j62K77M1n5k61K49k12j82JJ01k49J58l17R6r7m3L47
5371b1j03K07k47M73j01J51K4k46O8P8J16l41q7j37J00J59l70m8jJ64j80J88K54
5394A00r6J9J5J34J82K8l25J87lk05P6m19J79j1j42L26k13l9o5K26j8R5L5p5l
5419a2K73J58p2k47P8J93k96j04j12j67j9K96k35l1K1J19m7K48q3P2J88l1r6k6
5443F8P1j82J17M2j7j47R5J77m93k14M04j13k6p0R5M65l97J16K67j25J29J94l75
$$ plain form
5466 81 -107 258 380 -7 -35 37 -120 -3 -581 -315 -288 -220 176 -231 184 319 -45 233 13 111 310 116
5488 116 404 355 -239 -200 122 54 -255 -393 -17 -250 -369 -97 -280 -265 264 12 289 78 450 267 104
5509 104 166 166 -79 -53 -83 -116 -124 -250 -120 -161 -157 18 -491 -125 301 -84 176 106 139 243 14 182 210 47 -8
5534 -8 94 160 -422 -160 -293 -312 -329 -55 -169 151 -137 113 51 83 283 203 182 193 321 322 95 81 -273 -133
5558 -133 -102 76 -123 -252 -470 -97 -305 -30 -132 188 160 170 46 59 107 189 142 137 148 65 -32 103 -408 -352
5582 -352 -6 -89 -202 -111 -308 33 87 -43 250 289 392 374 173 147 387 204 148 -226 -18 25 -507 -86 -30
5605 -30 -237 81 -316 77 -127 109 150 186 114 -10 -75 296 203 247 183 11 -205 -109 -205 -170 -140 -219 -181 -246 168
5630 168 -92 -58 158 172 133 423 422 -133 291 309 120 23 -229 -32 -124 -226 -282 -63 -186 126 -23 -122 -65 -28
$$ packed form
5466H1j88L65J22l87k8P2j57J17n78K66K7O8L96m07M15J35l64K78k20R8J99j94
5488A16K88m9n94L9L22o8l09j38L76k33j19K72j83J5N29k52K77k11L72j83j63
5509A04O2%k45K6l0l3qj26J30m1MJ75n09L66M26l85K60p0L3J04k29J68K8j63n5
5534hJ02O6n82K62j33j9j7K74j14L20k88K50o2L2K00q0k1J1J28Jk27j4l54J40
5558a33L1J78j99j29k18L73k08K75j02L20k8J0j24J3M8Q2m7nJ1q3r7J35n11N6
5582c52L46q3j13R1j97L41N4j30K93L9J03j8k01k6K40j83n6l74K08M3n32M21N6
5605c0k07L18l97L93k04K36M1L6p2j24o5L71r3M4o4j72k16R6r6L5L0p9L8o5M14
5630A68k60L4K16J4l9K90jn55M24J8j89r7k52J97r2j02n6K19j23L12j49r9N7L7
$$ plain form
5654 -28 14 107 375 474 346 -112 104 196 -114 -4 18 -114 -98 -522 -96 -281 -37 -64 -125 9 -31 123 40 -68
5678 -68 -6 -3 213 298 48 33 151 -158 36 -220 -249 -360 -296 -55 -138 -111 85 -83 264 203 297 234 262 9 414
5703 414 121 -84 109 101 182 -371 3 18 -238 -403 -26 28 -39 -132 -213 109 15 316 105 280 72 161 -69
5726 -69 193 298 -150 -219 -94 -203 -345 -187 -184 -1 -222 99 -152 74 112 115 35 22 202 86 -136 129 -51
5749 -51 -220 -113 -374 -248 -384 -102 -271 -139 100 67 85 69 155 -39 355 255 214 303 173 -147 227 147 -147
5772 -147 17 -69 -186 -62 -222 -41 -266 -208 91 -65 160 334 386 386 325 -55 299 192 188 31 212 -15 -84
5795 -84 -219 -26 -248 -312 -71 60 67 107 -18 -135 113 100 13 282 315 -9 103 -46 -140 -101 119 -59 -163
5818 -163 -127 -45 -113 -291 13 -116 141 149 23 166 397 223 65 -85 220 -135 -30 304 -20 90 -291 -64
$$ packed form
5654b8M2R3K68R9j28m58K16R2l10J10K2j32J6m24M26j85K44k7o1J34m0J54q3j08
5678f8O2LK16Q5k50j5J18l09J94k56k9j11O4K41q3K7J96j68L47o1R4o3K8k53M05
5703D14k93k05J93qQ1n53L74J5k56j65L77N4o7r3q1L22r4L01k11J75k08Q9k30
5726f9K62J05m48o9J25j09j42J58LJ83k21L21k51K26L8Lq0j3J80j16k22K65j80
5749e1j69J07k61J26j36K82j69J32K39l3J8j6Q6j94L94j00m1Q9j30l20L74q0k94
5772a47J64q6j17J24j60J81k25N8K99j56K25J74N2%o1l80L54j07mj57J81k27o9
5795h4j35J93k22o4K41J31PM0j25j17K48j3q7K69L3l24J12j49r4L9K20j78j04
5818a63L6Q2o8j78L04j29K57Qj26J43K31j74j58j50L05l55J05L34l24J10l81K27
$$ plain form
5840 -64 -374 -84 -52 161 -43 99 182 3 104 329 172 -72 170 90 -46 243 -234 -130 -173 -296 -193 -313
5862 -313 -86 -250 -40 -23 -52 174 95 261 80 365 79 52 266 47 11 12 55 -75 -234 -44 -362 -186 -210
5885 -210 -263 -47 -40 329 41 419 223 98 174 252 286 223 -6 286 211 -181 -92 54 -117 -183 -85 -287 -255 32
5909 32 -54 126 79 -161 171 417 20 38 -57 387 226 -52 172 -92 59 -316 -427 -183 -60 109 -74 -141
5931 -141 29 -234 192 190 -9 111 32 357 92 -16 98 -114 -23 -170 -151 -382 12 -133 -269 -153 -279 19
5953 19 -62 28 288 -49 -31 164 168 -47 -163 75 -28 -167 -155 -193 -109 -192 -52 -155 54 -50 139 -158 99
5976 99 214 -67 -25 404 249 442 248 84 -52 -232 84 -60 -94 -326 -389 -206 -218 -130 132 -116 126 190
5998 190 34 20 116 -121 101 -178 95 66 280 163 -125 -214 32 -185 -87 0 -206 70 148 -15 -80 428 176
$$ packed form
5840f4l10K90L2K13k04J42Q3j79J01K25j57k44K42q0j36K89m77J04m3j23J03j20
5862c13K27j64K10J7k9K26p9J66j81K85k86k7K14k19l6JM3j30j59J90l18J76k4
5885b10n3K16PL69k88L78j96j25P6P8L4o3k29K92p5l92Q9J46j71o6R8k02L2K87
5909C2q6J80m7k40L32K46l97J8r5M44j61k78K24k64J51l75j11K44J23J69j83o7
5931a41J70k63M26kj99J20p9L25k65j08J14k12R1j47J9k31L94j45j36J16j26K98
5953A9q1R0K60l37J8J95Mk15j16K38j03j39J2l8Q4q3J40j03K09j04J89k97K57
5976I9J15k81M2M29j55J93j94j64j36j80L16j44l4k32o3J83j2Q8K62k48K42O4
5998A90j56j4R6k37K22k79K73k9K14j17k88q9K46k17R8Q7k06K76P8j63o5N08k52
$$ plain form
6021 176 -14 248 198 213 113 -198 -58 -78 -126 -310 57 -34 -240 -378 -147 -193 247 -188 75 63 15 184 138
6044 138 238 -150 -54 57 129 38 -124 72 -91 -327 -74 -82 -234 -238 -162 -79 -295 85 179 97 170 299 124 100
6068 100 134 -197 112 -111 94 -263 -206 -135 -195 -150 -245 -328 -205 7 1 62 -38 179 258 297 94 39 147 -42
6092 -42 26 -216 41 -174 87 -72 123 138 17 -35 -101 -62 186 187 -10 202 -20 153 151 -80 151 -77 65
6115 65 -215 -147 -299 -82 -213 -381 -132 -256 -236 -26 261 -63 -79 -3 173 19 113 279 122 36 23 -345 25
6138 25 -260 -234 -278 51 78 -278 -123 -97 140 10 -202 52 171 224 210 196 -82 9 -159 -269 -89 -39 99
6161 99 -21 -133 -225 -56 -51 -56 -261 420 -278 230 154 -133 99 -18 179 -190 -5 -104 -29 -135 -141 72 -44 -200
6185 -200 -196 -154 79 -23 -105 -40 147 250 218 32 63 -72 -251 18 233 -98 -344 -163 -83 -31 -44 39 -164 10
$$ packed form
6021A76j90K62n0J5j00l11J40k0m8j84L67r1k06j38K31m6M40m35K63j2m8J69m6
6044A38J00l88R6J11P2r1j62J96j63k36K53qj52mP6Q3k16L80R4q2P3J29j75k4
6068A00L4l31L09k23K05l57N7P1o0M5r5q3J23K12oO1j00K17P9L9k03n5J08j89
6092d2O8k42K57k15K61j59J95J5j21n2o6L9K48Jj97K12k22J73kk31K31k28J42
6115F5k80O8j52K17j31j68K49j24K0K10K87l24j6P6J76j54R4J66j57q6j3l68L70
6138B5k85K6m4L29K7l56J55K6K37j30k12K54J19N3j4j4k78R1j68j10J80N0J38
6161I9j20j12r2J69Nnk05O81o98N08p6k87K32j17J97l69J85r9P5j06oK13j16j56
6185b00MM2K33j02q2O5J87J03l2j86L1j35j79K69K15l31k46J81Q0N2j3Q3k03J74
$$ plain form
6209 10 -13 -61 136 -95 -1 -244 -17 -131 76 -176 151 202 -127 -13 -206 8 -53 -215 -227 64 -160 -51
6231 -51 116 147 20 54 121 175 280 199 68 185 124 -237 65 -122 114 -169 -167 -291 21 -220 -66 -220 42
6254 42 -43 -116 -131 158 59 101 -103 26 204 -6 11 -15 -58 91 -1 154 -313 90 -306 -91 -116 -135 -13 190
6278 190 150 149 309 189 148 -202 75 -139 -111 -185 -124 -139 -233 -83 24 -175 -269 185 135 -5 -332 -98 281 97
6302 97 -52 -48 126 241 -39 -313 22 117 -22 -202 -124 -23 146 -23 -379 43 258 -48 -118 -19 3 338 53
6325 53 -124 114 -55 -147 71 -122 -110 -96 -306 164 35 152 119 -103 -54 313 98 -31 122 -84 81 22
6347 22 107 -139 -39 -74 -11 39 -14 55 -20 -158 26 -125 -213 231 -18 -171 -89 98 265 -69 142 -314 55
6370 55 -35 -4 -229 1 -112 46 -80 -133 98 -36 -173 127 52 137 158 207 232 206 96 46 19 -30 7 -23 52
$$ packed form
6209A0k3m8J97k31R4k43K27j14K07k52L27N1l29J14j93K14o1j62j2K91k24J09
6231e1J67L1j27L4O7N4J05q1j31J17o1l61L02j87K36k83Kj24L12k41J54j54K62
6254D2q5p3j5K89r9M2k04J29J78k10J7k6m3J49r2J55m67M03l96K15k5j9J22K03
6278A90m0jJ60j20m1l50K77k14K8p4O1j5r4J50J07j99r4M54n0j40l27K34L79j84
6302I7j49MJ74J15k80k74L35R5j39j80P8J01J69j69l56M22K15l06p0R9K2L35k85
6325E3j77K38j69r2K18j93J2J4k10M70j29J17l3k22M9L67k15j29J53k06J65n9
6347B2Q5k46J00l5O3N0n3O9p5j38J84j51q8M44k49j53Q2J87J67l34K11m56L69
6370E5r0L1k25K30j13J58j26n3K31j34j37L00p5Q5K1M9K5k6j10n0k7m9L7l0P5
$$ plain form
6395 52 359 -93 -292 -131 -3 59 -39 -226 -65 -210 -114 49 249 147 100 96 129 268 -209 -122 -149 -10 -110
6418 -110 -139 79 62 -49 -271 -74 138 -335 -119 -68 473 -166 188 328 -217 66 102 74 -109 31 -15 -80
6440 -80 -124 -221 -51 -250 121 -80 -61 37 -121 35 102 207 207 349 -133 236 -26 54 -329 -72 24 -159 104
6463 104 -50 -223 -21 -162 -92 98 93 134 -37 92 -16 305 -217 -300 33 -94 -11 -31 -46 -164 130 -175 -31
6486 -31 33 -73 -88 60 -11 -108 128 -191 129 41 110 -7 -36 163 -4 -138 -22 81 -150 -154 -233 -214 -8 -111
6510 -111 133 -159 66 37 -103 -145 28 -24 44 51 48 188 155 -50 -165 -163 -350 20 -13 -266 -142 -46 -220 102
6534 102 58 128 44 146 285 51 81 304 -129 -24 95 -146 -147 -122 68 -158 106 -145 -14 387 61 126 72
6557 72 76 -213 86 -107 146 -56 161 -76 -79 30 100 -108 -95 123 -57 -24 44 -77 65 66 88 91 64 -54 44
$$ packed form
6395E2L07m52j99J61J28O2r8j87J61j45R6J63K00j02m7mL3J39m77Q7k7J39j00
6418a10k9K18j7j11k22J97K12m73K16N1N41o39L54J40n45K83L6k8j83J40m6o5
6440h0m4r7J70j99L71k01J9R8j58J56O7J05%J42m82L69k62Q0l83K57R6j83K63
6463A04j54j73K02j41P0J90nM1j71J29j08L21n22q3L33j27Q3k0j5j18K94l05J44
6486c1O4j06j5J48p1r7K36l19L20q8O9j17k9J99j67j34J16J03k31mp9J9K06j03
6510a11K44k92K25k9j40m2J73n2O8PlJ40l3k05j15Kj87L70l3k53J24R6j74L22
6534A02m4P0q4J02J39k34L0K23m33J05J19k41jK5J90k26K64k51J31M01l26O5n4
6557G2Mk89K99j93K53k02K17k37lJ09P0k08J3K18j80L3O8j21J42JK2Lk7j18R8
$$ plain form
6582 44 -28 -114 76 -24 -309 118 -63 -175 -234 -445 -56 66 -210 -172 28 127 115 -24 153 -55 55 -26 21
6605 21 120 -98 -136 91 209 189 -190 -111 218 21 -83 -274 245 106 -65 64 -148 213 171 120 127 97 -376
6628 -376 150 -17 -122 -160 -14 89 -51 -225 -21 -144 32 -248 127 23 -4 252 319 23 26 -103 178 -197
6650 -197 -137 123 97 120 -7 4 73 -43 -90 8 -388 117 -131 88 225 70 325 -20 79 134 163 -131 -28
6673 -28 -73 -165 -274 -228 -187 -281 91 85 -145 76 105 -57 -32 -31 -68 83 185 366 51 199 -195 -49 -10 -34 -85
6698 -85 44 51 -121 13 -23 -145 275 188 115 145 -108 247 108 -12 62 -37 -126 79 96 -23 -295 13 -153 -42
6722 -42 -28 121 76 -7 -132 71 -15 162 -21 40 82 94 223 46 -133 111 -3 -125 -133 -82 -5 -92 127 -48
6746 -48 134 145 -79 -110 81 34 -59 229 -2 -3 346 -1 -83 165 84 -158 -146 123 -380 -76 -56 -76 66 -50
$$ packed form
6582D4p2q6J90j00k85M27j81j12n9k11L89J22k76L8K00R9j2j39J77k08J10q1M7
6605B1R9k18l8K27J18k0l79P9L29j97j04j91N19j39j71J29k12L61m2n1Pl0m73
6628c76N26j67j05l8J46J03j40j74K04j23J76k80L75j04k7K56O7k96Lj29K81l75
6650a97O0K60k6K3j27J1O9j16m7R8l96N05k48K19J37j55K55l45R9N5K9k94J03
6673b8m5r2j09M6M1r4L72ok30K21K9j62K5Jl7J51J02J81l15J48l94J46L9k4n1
6698h5J29Pj72J34l6j22M20q7p3L0k53L55j39j20P4r9q9K05J7j19k72L08j66J11
6722d2J4J49m5q3j25K03q6J77j83O1M2J2J29j77j79K44j14j22qN1P7q7K19j75
6746d8J82J1k24l1J91m7r3K88k31jL49l47q2K48q1k42J2K69n03L04K0k0J42j16
$$ plain form
6770 -50 -286 180 -139 165 171 -52 128 -56 198 -229 -82 -65 41 47 -2 143 -27 -283 106 56 -322 -169 -233
6793 -233 -99 173 -2 151 216 187 -63 -29 -100 140 91 0 54 -9 243 147 64 94 -196 67 154 143 -11 -40 121
6818 121 -210 132 133 214 -159 35 -16 -151 -283 -19 -8 -247 99 8 -3 191 -109 156 -12 54 94 119 36 -77
6842 -77 115 -56 -78 130 87 42 -67 -121 -51 47 -378 160 -102 57 -36 61 -40 62 239 27 83 118 22 -322
6866 -322 224 188 -70 261 -21 -104 -174 -57 -55 120 -245 -42 -9 -179 88 270 243 151 147 358 282 -92 65 35
6890 35 -306 -100 -227 4 -30 199 20 16 -29 43 157 64 60 205 107 45 -166 120 215 -69 160 -276 -101 253
6914 253 -133 84 -101 128 -55 -203 -86 211 15 -178 -70 135 177 -59 376 59 45 -42 -80 86 136 173
6936 173 156 101 72 -43 69 14 -227 -2 48 104 262 178 -367 213 93 161 222 -219 -123 3 -51 -166 -116 7
$$ packed form
6770e0k36M66l19L04Ok23J80j84K54m27J47J7J06Om9J45j70k56L89n0l78J53o4
6793b33J34K72j75J53O5k9k50L4p1K40m9r1N4o3K52r6q3L0k90K63Q7j1j54k9J61
6818A21l31L42JQ1l73J94n1j35j32K64J1k39L46r1j1J94l00K65j68O6M0K5q3j13
6842g7J92j71k2K08m3m5j09n4P0R8m25N38k62J59r3R7j01J02J77k12N6L5r6l44
6866c22N46l6k58L31k82q3p0J17KJ75l65K03L3j70K67J82k7r2mK11p6l74J57l0
6890C5l41K06j27K31l4K29j79mm5P2J14r3mJ45r8o2k11K86R5k84K29m36J75L54
6914B53l86K17j85K29j83j48J17K97j96j93J08K05M2k36M35l17j4q7l8J66N0L7
6936A73j7n5k9j15J12n5k41K25N0N6J58q4n45N80j20O8O1m41R6J26n4j15N0J23
$$ plain form
6960 7 41 -78 10 187 250 -70 -101 -51 -7 -218 203 194 84 10 -81 -3 129 96 111 -38 64 22 115 56 28 -333
6986 -333 166 65 -83 164 81 13 -220 79 -197 -77 70 198 50 130 -70 -245 12 -4 -37 -41 203 -22
7008 -22 25 87 255 83 209 28 -115 -113 -239 24 -174 -21 74 0 -60 -33 -199 52 -78 -267 -8 42 41 -41
7032 -41 -145 -79 -43 -56 -70 216 345 -185 -188 -49 -195 319 107 -212 -13 -146 -43 -93 -30 -191 -1 300 -28
7055 -28 81 288 -49 -2 312 -216 212 -26 69 -126 -24 -24 -18 -162 -18 -136 205 -16 -75 -67 175 117 114 -290
7079 -290 -16 -47 156 41 -42 45 -230 -176 72 -97 -339 75 -9 -32 38 180 103 224 154 3 6 169 -128 -10
7103 -10 133 -90 -94 3 -46 -62 -33 -70 -130 -105 -65 -16 -210 -77 148 54 -68 238 -73 116 95 78 -6 -94 -42 -258
7129 -258 -164 -96 -80 -79 -37 153 -156 47 -244 -68 4 84 14 -254 153 -346 -56 -108 23 -113 -314 -120 -22 -93
$$ packed form
6960GL4j19Q8J77O3l20l1N0M4k11M21rj10p4r1P8J32l3J5j49J02m2R3n9k8l61
6986c33M99j01j48K47q3o8k33K99k76J20J47J28j48Q0k00j75K57j6l3mK44k25
7008b2M7O2J68j72J26j81j43Kj26K63j98J53R5p4o0K7j66K51j30j89K59N0jq2
7032d1j04O6L6j3j4K86J29n30lJ39j46N14k12l19J99j33J03n0O3j61J90L01l28
7055b8J09K07l37M7L14n28M28k38R5j95J02%Oj44J44j18L41k21n9QK42n8lm04
7079b90K74l1K03j15q3Q7k75N4K48j69k42M14q4k3P0J42p7J21p0j51LJ63k97J18
7103a0J43k23mR7m9j6K9l7o0K5M0M9j94J33K25r4j22L06l11J89k1j7q4q8N2k16
7129b58R4O8J6JM2J90l09K03k91J76P2Q0p0k68M07m99K90n2J31j36k01J94R8p1
$$ plain form
7153 -93 253 42 -101 -176 -95 135 -116 113 162 35 130 43 77 36 -143 -183 -21 -104 49 135 144 -6 -165 -140 105
7178 105 252 43 34 -224 12 24 -31 180 327 -13 76 62 34 81 131 -85 137 -308 -55 -55 -291 103 304 102
7202 102 12 -65 59 137 35 202 116 0 -34 116 -57 79 -106 -173 1 110 -178 -80 102 272 58 -137
7224 -137 -72 -126 194 -208 58 -291 270 192 104 -216 236 -112 -133 -168 -95 16 -394 106 -57 -40 94 198 -34
7247 -34 -78 45 -3 224 15 -111 237 341 304 -130 25 -69 135 -113 175 211 -151 140 172 -23 73 290 218
7270 218 -123 -12 260 2 -10 -70 175 -77 -76 170 -144 -76 -108 -104 -234 140 55 130 -153 60 99 117 260 -64
7294 -64 157 99 -156 52 65 -282 -96 -377 72 -1 169 35 32 230 -56 59 -56 88 16 -176 -67 -16 120
7317 120 -43 -57 156 173 89 -31 -136 -14 57 -98 155 108 91 -11 27 178 -160 108 -233 97 139 48 -65
$$ packed form
7153i3L46k11j43p5Q1K30k51K29M9j27R5q7L4m1j79m0J62q3J53Q6Rj50j59K5K45
7178A05J47k09rk58K36J2n5K11J47l40Q9j4k8M7N0k16K22m45K53%k36L94K01k02
7202A02r0p7J24P8j02J67q6j16l4J50j73J36j85o7J74J09k88R8J82J70k14j95
7224a37O5n4L20m02K66l49N61p8q8l20M52l48k1l5P3J11m10N00j63J7J34J04k32
7247c4m4J23m8K27k09j26L48J04l7m34J55r4K04k48K88L6l62K91L2j95R6K17p2
7270B18l41J11K72k58j2o0K45k52JK46l14O8l2Mj30L74q5P5k83K13L9J8J43l24
7294f4K21n8k55K08J3l47J86k81M49p3J70j34lJ98k86J15j15J44p2j92J09N1J36
7317A20j63j4K13J7q4j20j05J22P1j55K53m7j7j02L8J51l38K68l41L30M2r1j13
$$ plain form
7340 -65 117 154 7 188 12 52 63 -8 -35 -26 -147 273 67 -175 -195 95 224 211 132 -100 18 75 -178 -57
7364 -57 79 163 -6 -49 -252 -203 -104 -235 20 125 24 91 -39 68 0 2 -151 -331 330 337 -63 37 24 293
7388 293 -69 -95 -77 -8 -63 83 -162 120 -126 -42 -93 1 76 -24 -16 -8 -139 174 130 -39 -80 -168 -75 -210 75
7413 75 -66 -45 -30 -45 -169 135 -127 45 -158 236 -74 25 9 -162 36 80 -27 -85 -17 154 23 8 41 -119
7437 -119 128 -243 -258 -35 180 61 -36 72 154 -288 41 153 -251 -145 -132 3 -136 -102 173 -107 -94 -225
7459 -225 113 -100 77 -320 9 -121 -66 247 -110 155 4 -43 -104 -279 104 103 -100 -70 -101 86 -319 -407 -10
7482 -10 108 259 93 -60 78 -314 81 50 182 -107 175 86 63 180 4 -272 -209 82 191 166 239 -310
7504 -310 91 117 -17 -97 49 -31 198 141 -191 14 -94 -357 40 68 -258 179 4 -39 -66 124 -121 266
$$ packed form
7340f5J82L7j47J81j76M0J1p1k7Rj21M20k06k42k0K90J29j3p9k32J18N7k53J21
7364e7J36Q4j69m3k03M9R9j31K55J05j01O7j30J07o8Kj53j80O61Pm00J00j3K69
7388B93l62k6J8O9n5J46k45K82k46Q4n1R4P5j00QQj31L13m4j69m1q8R3j35K85
7413G5j41K1J5j5j24L04k62J72k03L94l10R9j6j71J98M4j07n8O8J71j31j5L3j60
7437a19K47l71j5K23K15j19r7J08Q2m42L29J12m04J06J3J35j39L4K75k80J3j31
7459b25L38k13J77l97L29j30N5L13l57K65j51m7o1j75L83jk03L0l1J87m05q8L97
7482a0J18J51j66j53J38l92L95l1J32k89K82q9k3J17j76k76O3K91J09k5P3n49
7504c10M01K6j34q0J46q0K29n7l32K05j08k63L97K8l26M37j75m3k7J90k45L87
$$ plain form
7526 266 95 8 140 -50 57 -72 -5 -201 104 -8 6 -81 -28 36 8 -43 11 -246 -122 29 102 254 -89
7549 -89 -93 105 39 295 49 138 -188 -218 235 129 -61 20 -154 188 -224 -86 44 -16 203 81 169 66 221
7572 221 -113 41 0 78 61 163 -60 51 -185 57 -34 -26 -46 66 -362 -174 33 4 -185 51 -62 -124 219
7595 219 -111 99 30 -99 -273 82 -86 -341 -45 -26 3 82 -45 -78 -83 89 85 81 -177 -102 -92 95 239 -83
7619 -83 67 145 -323 225 -11 -61 122 222 -139 -26 192 -101 93 -187 -350 -30 -77 89 -78 -223 10
7640 10 110 21 100 -6 28 261 262 249 2 274 89 -7 280 308 59 -182 -32 31 17 -5 30 -28 -128 79 258
7665 258 -98 11 -107 -90 98 183 -49 41 50 -195 -66 -46 -107 6 154 -42 48 239 260 446 181 -21 299
7688 299 -13 -84 106 -118 85 -174 149 -335 -272 2 77 59 -125 163 152 -36 -31 48 -184 228 17 167 38
$$ packed form
7526B66j71q7J32j90J07j29O7j96L05j12J4q7N3O4k8n1N4k57J24J51P3J52l43
7549h9mJ98o6K56k46Q9l26l0M53j06j90Q1j74L42m12J38J30o0K19j22Q8j03J55
7572B21l34J54m1P8j7J02k23J11k36K42r1Qk0J12m28J88K07k9j89K36j13o2L43
7595B19l30K10o9j29j74L55j68k55K96J9K9P9j27l3nJ72mmk58P5J0J87J44l22
7619h3J50P8m68N48k36n0J83J00l61J13K18k93J94k80j63L20m7J66j67j45K33
7640A0J00q9P9j06L4K33Jj3k47K72j85r6K87K8k49k41J50O3j4k2L5n8j00K07J79
7665B58l56J09j18J7J88Q5k32R0Rk45J29K0o1J13J48j96R0J91K1J86k65k02L20
7688B99l12p1J90k24K03k59L23m84O3K74P5j8j84K88j1j88NP9k32M12k11J50j29
$$ plain form
7711 38 74 -29 -11 -190 -142 103 -45 -244 -54 -52 -23 16 -144 -99 61 49 -72 -78 -46 33 -105 -48 -48 -180 -1 -44
7737 -44 87 -27 -113 181 -23 65 -119 -174 -4 256 43 302 36 -123 23 -223 80 101 -1 99 192 -76
7759 -76 -50 -45 -125 17 -206 13 -48 -102 171 140 54 -59 -94 89 -94 45 200 187 127 66 213 -66 191 16
7783 16 -76 115 170 32 -219 -108 -47 107 137 -58 -210 -30 -191 -228 -144 -94 144 -41 -78 -25 -97 185 199 55
7807 55 -5 -11 -57 22 62 153 265 -95 -70 256 91 0 -55 -134 206 -109 29 110 -29 170 157 -72 160 57 -40
7832 -40 74 14 -67 104 226 -125 214 209 88 -39 -97 -37 -52 333 -153 -25 -17 30 75 7 -40 -173 -206 -188 13
7857 13 -105 -27 57 -42 -21 -73 170 -75 15 -74 7 -29 81 -10 -86 338 -52 -193 0 221 -76 248 -32 -101
7881 -101 -282 179 149 0 -12 72 303 -52 -36 -200 150 -39 -23 154 -249 124 136 -232 -121 -139 -241 -86
$$ packed form
7711C8L6j03J8j79M8K45j48j99J90KK9L9j60M5J60j2j21oL2P9j38N7%j32J79m3
7737d4J31j14q6K94k04Q8j84n5J70K60k13K59k66j59J46k46L03K1j02J00R3k68
7759g6K6Nq0J42k23K19o1n4K73l1q6j13l5J83j83J39J55j3o0o1J47k79K57j75
7783A6r2J91N5j38k51J11O1J54L0j95j52J80j61l7Q4N0K38j85l7N3p2K82J4j44
7807E5o0om6P9M0R1J12l60K5L26j65r1n5p9L40l15J38Q1j39J99j3k29K32j03r7
7832d0J14o0q1J71J22l51L39nj21j27n8O0j5L85m86J28QM7M5o8m7j33l3J8K01
7857A3j18P8Q4r9K1n2K43k45R0q9Q1l6J10r1p6M24l90j41J93K21k97L24k80o9
7881a01j81M61l0j49j2Q4K31l55J6j64L50j89J6J77m03L73J2l68J11j8j02J55
$$ plain form
7903 -86 -48 58 61 -103 -30 -69 -61 -122 -23 -31 144 -140 184 -96 -239 -60 7 -170 58 137 150 31 86 47 -385 -130
7929 -130 -16 -199 154 -159 75 73 -62 -115 -31 57 -126 312 -138 129 55 71 -211 2 -141 -83 192 73 144
7952 144 183 61 98 -136 -221 182 -3 -196 -231 192 268 -95 62 81 121 103 -148 -103 -135 69 -125 16 14 -47
7976 -47 97 44 -217 -180 160 68 -159 194 -95 -186 -13 19 131 103 121 -160 -78 -101 10 162 -176 4 0 -194
8000 -194 -21 -249 57 21 29 90 192 144 138 167 -109 147 -53 69 -435 -121 -12 -325 146 78 -25 -166 80
8023 80 -107 -133 22 171 138 39 -117 103 -147 41 142 -37 -288 379 304 -202 -85 28 55 -72 222 265
8045 265 88 97 136 182 343 16 290 -45 -27 -32 -138 125 101 64 -87 -110 -53 -164 93 53 1 -127 93 231
8069 231 107 71 4 -6 49 198 -126 -125 -55 -7 -128 47 57 25 127 -171 -200 -195 -48 150 286 -95 267 -49
$$ packed form
7903h6L8J06Lj64P3l9Qo1R9qJ75k84L24k80j43J79O7j77K28P9J3j19N5l9m32K55
7929a30J14j83L53l13K34kj35n3Q4Q8j83M38m50K67p4J6k82K13j43N8K75j19P1
7952A44L9j22L7k34q5M03j85j93l5M23P6l63J57J9M0j8k51M5l2K04j94J41ko1
7976d7J44n3k61L7L40r2k27L53k89r1J73L2J12k8J8k81Q2k3J11J52l38J80mj94
8000a94J73k28L06l6QO1J02m8oK9k76K56k00J22n04L14J09l13M71o8j03j41K46
8023H0j87k6J55J49l3r9j56K20k50J88J01j79k51O67p5n06J17J13K7j27K94M3
8045B65j77RL9M6J61l27K74l35J8nj06K63k4l7j51k3N7j11K57m0n2j28K20J38
8069B31j24l6o7j0N5J49l24JP0M8j21J75J0l2J02k98k9NJ47J98J36l81L62l16
$$ plain form
8093 -49 106 227 -7 115 -262 -249 -49 201 -118 -169 200 -5 302 142 -165 -158 -199 352 194 187 93 100 -27 176
8117 176 -105 4 -16 -4 -141 -237 103 223 -93 -271 -12 -48 223 -186 163 25 -138 164 -44 3 191 26
8139 26 -3 -19 68 -101 -7 215 -18 192 173 -36 -233 -11 187 -202 110 -91 50 130 11 4 -119 61 75
8162 75 78 -326 -184 226 -167 6 -122 13 73 10 51 190 106 -28 -117 -137 6 1 163 -198 -44 233 -172 269
8186 269 -215 99 128 -51 -6
$$ packed form
8093d9J55J21k34J22l77J3K00K50l19n1L69k05L07j60l07Pm1N51j58pr4Pj27K03
8117A76k81J09k0J2j37r6L40J20l16j78K59l6K71m09L49j38j63L02k08M7J88j65
8139B6k9j6Q7j69R4K22k33K10j9k09j97K22J98l89L12k01J41Q0j19pj23J80J4
8162G5Lm04J42M10l93J73j28J35O0o3M1J39q4j34q9k0J43nJ62l61J54K77m05M41
8186B69m84L14K9j79M5
8191f
$$ Imaginary data points
##PAGE= N=2
##DATA TABLE= (X++(I..I)), XYDATA
$$ plain form
0 0 0 0 0 0 0 0 8 -8 8 -8 16 -16 24 -32 40 -48 60 -72 88 -105 129 -154 183 -217 254 -297 345 -399 460
29 460 -526 605 -689 781 -885 999 -1127 1264 -1418 1584 -1769 1970 -2187 2426 -2688 2974
45 2974 -3283 3625 -3998 4408 -4854 5347 -5889 6492 -7165 7916 -8762 9722 -10828
58 -10828 12109 -13619 15426 -17642 20426 -24043 28963 -36071 47293 -67722 116841 -481785
70 -481785 -150236 752615 -312247 -621856 17574 257136 -138004 95950 257128 -186963
80 -186963 -256292 432829 319357 -358188 -233785 310740 159925 -137759 -81136 -35534 -142071
91 -142071 37845 140715 -241352 -365663 147663 225296 -188889 -135588 150102 31796
101 31796 -355 250590 153949 -215215 -31422 351029 38154 -319051 15137 124177
$$ packed form
0@%%%%%%Qj6J6j6K4l2M0n6P2q8J08j32J60j93K34k83L37m00M71n51O42p44Q59
29D60r86J131j294J470j666J884k126K391k682L002l353L739m157M613n114N662
45B974o257O908p623Q406r262J0201j1236J2381j3657J5081j6678J8484k0550
58a0828K2937k5728K9045l3068L8068m4469N3006o5034Q3364j15015J84563n98626
70d81785L31549R02851j064862l09609O39430K39562l95140K33954J61178m44091
80a86963o9329O89121j13472o77545J24403N44525j50815k97684N6623M5602j06537
91a42071J79916J02870l82067j24311N13326P7633m14185N3301K85690j18306
101C1796l2151K50945r6641l69164J83793L82451l12875l57205L34188J09040
$$ plain form
111 124177 -286721 -240052 112824 -82808 -364814 -51615 190268 -172853 -252719 240859
121 240859 226011 -229492 -37903 360913 92937 -203097 74015 250586 -55699 -173568
131 -173568 72718 32250 -177778 -40556 40290 -157149 -103762 97077 -9831 -133111
141 -133111 25966 119018 -10727 15980 165063 11049 -123081 147052 214128 -125398
151 -125398 -156322 86770 -6629 -200104 -52532 38597 -220538 -234965 124510 73553 -273847
162 -273847 -80913 263709 57506 -154461 86180 210245 -3538 -11566 172296 25327
172 25327 -160394 69060 160667 -151845 -191528 69028 28673 -150766 -50240 53231 -78269
183 -78269 -69805 135507 65658 -120907 49034 192753 -13844 -61024 136830 74971 -118859
$$ packed form
111A24177m10898M6669L52876j95632k82006L13199K41883l63121p9866M93578
121B40859j4848m55503J91589L98816k67976k96034K77112J76571l06285j17869
131a73568K46286m0468k10028J37222Q0846j97439N3387K00839j06908j23280
141a33111J59077R3052j29745K6707J49083j54014j34130K70133O7076l39526
151a25398l0924K43092r3399j93475J47572R1129k59135j4427L59475n0957l47400
162b73847J92934L44622k06203k11967K40641J24065k13783q028J83862j46969
172B5327j85721K29454R1607l12512l9683K60556m0355j79439J00526J03471j31500
183g8269Q464K05312o9849j86565J69941J43719k06597m7180J97854o1859j93830
$$ plain form
194 -118859 -16451 102429 -96852 -187629 40122 27790 -228011 -121608 111659 -37468
204 -37468 -162735 51198 127096 -59398 -23029 183377 82261 -84289 92327 179617 -66071
215 -66071 -94667 123208 49639 -164554 -71133 74004 -59569 -143045 15279 29622 -103234
226 -103234 -3028 116941 -29560 -70145 123943 121795 -58297 -8368 135867 20926 -97962
237 -97962 37716 59939 -125373 -93989 52786 -61868 -171003 -8958 61221 -102710 -93365
248 -93365 103577 62300 -85180 46267 168922 8354 -43165 124208 103258 -62264 -11239
259 -11239 93887 -31473 -118627 20097 30004 -132974 -80017 68937 -23323 -111487 28614
270 28614 86625 -38360 -22159 114337 55078 -50198 58977 110183 -42373 -51167 79517
$$ packed form
194a18859J02408J18880j99281r0777K27751j2332k55801J06403K33267j49127
204c7468j25267K13933P5898j86494L6369K06406j01116j66550J76616Q7290k45688
215f6071k8596K17875p3569k14193R3421J45137j33573q3476J58324J4343j32856
226a03234J00206J19969j46501m0585J94088k148j80092M9929J44235j14941j18888
237i7962J35678K2223j85312L1384J46775j14654j09135J62045P0179j63931R345
248i3365J96942m1277j47480J31447J22655j60568n1519J67373k0950j65522N1025
259a1239J05126j25360q7154J38724R907j62978N2957J48954r2260q8164J40101
270B8614N8011j24985J6201J36496n9259j05276J09175N1206j52556q794J30684
$$ plain form
281 79517 8056 -123419 -35352 41609 -86625 -120806 26872 13810 -114279 -20559 100160
292 100160 -10515 -54337 95705 104622 -29626 14449 130769 35608 -62730 48592 71512
303 71512 -80634 -67513 50400 -28130 -122390 -16704 40831 -70693 -70796 62613 35552
314 35552 -62263 30476 105351 -5528 -21591 92990 56829 -53848 3072 69411 -38049
325 -38049 -93007 15730 10409 -110836 -59187 40085 -40789 -85661 30594 55180 -40921 -6575
337 -6575 101316 44997 -32587 63837 102273 -18480 -21634 74265 14679 -77738 -12445 32106
349 32106 -64396 -86523 16827 2842 -87252 -19225 59671 -18593 -38087 64931 58541 -25132
361 -25132 18376 90370 16095 -44805 38191 47796 -62351 -47247 30318 -34262 -89943 -10368
$$ packed form
281G9517p1461j31475Q8067P6961j28234l4181J47678j3062j28089R3720J20719
292A00160j10675m3822J50042Q917j34248M4075J16320r5161r8338J11322K2920
303G1512j52146J3121J17913p8530r4260J05686N7535j11524j03J33409k7061
314C5552r7815R2739P4875j10879j6063J14581l6161j10677N6920O6339j07460
325c8049n4958J08737n321j21245N1649R9272q0874m4872J16255K4586r6101L4346
337f575J07891n6319p7584R6424L8436j20753l154R5899n9586r2417O5293M4551
349C2106r6502k2127J03350j3985r0094O8027P8896p8264j9494J03018o390q3673
361b5132M3508P1994p4275o0900Q2996R605j10147J5104P7565o4580n5681P9575
$$ plain form
373 -10368 14744 -64715 -48618 48928 20048 -50921 28223 89305 3566 -7750 81865 54332
385 54332 -25161 16652 60249 -18365 -58252 17582 9382 -84375 -45915 29353 -37021 -73242
397 -73242 15778 33088 -37010 -10903 65642 27599 -23253 46287 71080 -18893 -13409 61562
409 61562 6696 -63026 -6184 21797 -54522 -65846 11042 -5224 -72612 -12837 48992 -20990
421 -20990 -33424 58949 52030 -15880 22495 76583 19858 -20151 42285 42298 -45696 -29032 33748
434 33748 -25483 -73893 -9824 6428 -54538 -38348 26882 -187 -43141 22741 61898 -9416
446 -9416 -10097 66589 39481 -22821 16537 45573 -16714 -38745 14384 547 -65490 -32324 19360
459 19360 -35641 -55769 15553 17593 -33871 1633 55713 17428 -13396 45641 61168 -7330
$$ packed form
373a0368K5112p9459J6097R7546k8880p0969P9144O1082q5739j1316Q9615k7533
385E4332p9493M1813M3597p8614l9887P5834q200r3757L8460P5268o6374l6221
397g3242Q9020J7310p0098K6107P6545l8043n0852O9540K4793q9973N484P4971
409F1562n4866o9722N6842K7981p6319j1324P6888j6266o7388N9775O1829o9982
421b0990j2434R2373o919o7910L8375N4088n6725m0009O2436J3q7994J6664O2780
434C3748n9231m8410O4069J6252o0966J6190O5230k7069m2954O5882L9157p1314
446i416o81P6686k7108o2302L9358K9036o2287k2031N3129j3837o6037L3166N1684
459A9360n5001k0128P1322K040n1464L5504N4080l8285l0824N9037J5527o8498
$$ plain form
471 -7330 153 54617 7935 -42915 4530 17335 -46761 -50209 5636 -9824 -58968 -18301 24607
484 24607 -21227 -24630 40624 27629 -19663 20860 61886 13901 -17063 29495 33405 -26034
496 -26034 -18407 19637 -25103 -54520 -1339 3111 -50623 -33197 21580 2792 -30599 12730
508 12730 41964 -468 5574 57182 26519 -17342 26571 48834 -11567 -32655 12528 4733
520 4733 -46728 -26895 6820 -35773 -47912 11726 8192 -38380 -6845 42037 11973 -12986
532 -12986 31796 43475 -3987 7257 45918 1779 -35560 11648 21132 -39708 -43059 5864
544 5864 -6596 -46367 -15666 16407 -17731 -19294 31036 21777 -11824 20908 48678 12008 -3209
557 -3209 32186 24457 -20427 -5099 22229 -22828 -46834 -882 -19 -44881 -29045 11751 -8817
$$ packed form
471g330P483N4464m6682n0850M7445J2805o4096l448N5845j5460m9144M0667M2908
484B4607m5834l403O5254j2995m7292M0523M1026m7985l0964M6558L910n9439
496b6034P627L8044m4740k9417N3181M450n3734J7426N4777j8788l3391M3329
508A2730K9234m2432O042N1608l0663m3861M3913K2263o0401k1088M5183p795
520D733n1461J9833L3715m2593j2139N9638l534m6572L1535M8882l0064k4959
532a2986M4782J1679m7462J1244L8661m4139l7339M7208R484o0840l351M8923
544E864j2460l9771L0701L2073l4138j563N0330r259l3601L2732K7770l6670j5217
557c209L5395p729m4884J5328K7328m5057k4006M5952Q63m4862J5836M0796k0568
$$ plain form
570 -8817 -30563 10425 30464 -7038 -465 43674 23942 -8306 20937 33283 -5846 -13351 13055
583 13055 -4168 -37434 -12470 7916 -32926 -39941 7599 4856 -27888 -3023 28385 4998
595 4998 -6542 31247 36727 -2459 6234 39045 9566 -19745 6317 9494 -25910 -24595 -1057
608 -1057 -18922 -38634 -7759 8821 -25229 -21575 22865 14802 -11228 16214 35475 7493 885
621 885 30195 22245 -15790 -3144 20102 -14429 -33798 -1564 -3270 -33977 -19228 6642 -12011
634 -12011 -24039 10845 23756 -7764 629 37346 19363 -3915 22636 29001 -5935 -7922 15606
647 15606 -527 -31275 -13369 5187 -26841 -34231 1870 -2526 -26624 -2938 19568 -714
659 -714 -5638 25092 28491 -313 9320 33743 6459 -13296 14003 10200 -24681 -18864 3254
$$ packed form
570h817k1746M0988K0039l7502O573M4139j9732l2248K9243J2346l9129p505K6406
583A3055j7223l3266K4964K0386m0842p015M7540k743l2744K4865L1408k3387
595D998j1540L7789N480l9186Q693L2811k9479k9311K6062L177l5404J315K3538
608a057j7865j9712L0875J6580l4050L654M4440q063k6030K7442J9261k7982o608
621H85K9310p950l8035J2646K3246l4531j9369L2234j706l0707J4749K5870j8653
634a2011j2028L4884J2911l1520Q393L6717j7983k3278K6551O365l4936j987K3528
647A5606j6133l0748J7906J8556l2028p390L6101m396k4098K3686K2506k0282
659g14m924L0730L399k8804R633K4423k7284j9755K7299l803l4881N817K2118
$$ plain form
672 3254 -13534 -31750 -8779 5046 -20444 -15343 19234 8151 -10779 18075 31525 5097
684 5097 3221 27543 19855 -8220 1010 16741 -12678 -26411 1368 -4559 -33330 -18170 2647
697 2647 -12948 -20557 4794 13057 -7311 2361 30615 14460 -2608 23342 26586 -3262 -2193
710 -2193 14994 596 -20331 -8570 1624 -22563 -26093 2270 -4793 -25163 -1739 15060 -2719
723 -2719 -3460 20808 22235 1766 9112 28856 8062 -8068 13614 9089 -20076 -12494 2642
736 2642 -14449 -27675 -9417 255 -19098 -16401 11667 4792 -10644 13521 24678 3216 5761
749 5761 25400 16821 -3324 4063 15637 -6956 -18730 2135 -3898 -28064 -13224 2440 -14923
762 -14923 -18292 3938 8805 -6702 730 23808 12268 -926 20725 22994 -2775 1741 16386
$$ packed form
672C254j6788j8216K2971J3825k5490N101L4577j1083j8930K8854J3450k6428
684E097j876K4322p688k8075R230J5731k9419j3733K7779n927k8771J5160K0817
697B647j5595p609K5351Q263k0368R672K8254j6155j7068K5950L244k9848J069
710b193J7187j4398k0927J1761J0194k4187l530K8363p063k0370K3424J6799j7779
723b719p41K4268J427k0469P346J9744k0794j6130K1682m525k9165P582J5136
736B642j7091j3226J8258R672j9353K697K8068o875j5436K4165J1157k1462K545
749E761J9639q579k0145P387J1574k2593j1774K0865o033k4166J4840J5664j7363
762a4923l369K2230M867j5507P432K3078j1540j3194K1651K269k5769M516J4645
$$ plain form
775 16386 -118 -16726 -5613 865 -19015 -22764 -595 -6426 -23553 -3719 10222 -6231 -3687
788 -3687 17686 15471 2003 10915 25131 8742 -3665 14036 10212 -15092 -7782 4079 -13136
801 -13136 -21555 -6269 -3201 -17652 -12799 7929 1314 -10064 11084 20158 1539 6574 23223
814 23223 12708 -950 7707 12698 -5332 -13370 1886 -4156 -23721 -11521 -75 -15852 -16368
827 -16368 2254 2748 -7829 1166 17923 9787 422 17648 20281 279 4075 15539 580
840 580 -10984 -1429 -24 -15845 -17910 -2223 -6833 -20277 -4468 6468 -7467 -3888 14809
853 14809 11318 1509 11128 20491 7977 -649 12289 9200 -10808 -5228 3663 -12601 -19073 -4999
867 -4999 -4875 -17249 -11996 3873 -1004 -9318 7546 15737 1214 6189 21443 11304 331 9504
$$ packed form
775A6386j6504j6608J1113O478j9880l749K2169n831j7127J9834J3941j6453K544
788c687K1373k215j3468Q912J4216j6389j2407J7701l824k5304P310J1861j7215
801a3136q419J5286L068j4451M853K0728o615j1378K1148R074j8619N035J6649
814B3223j0515j3658Q657M991j8030q038J5256o042j9565J2200J1446j5777n16
827a6368J8622M94j0577Q995J6757q136r365J7226K633k0002L796J1464j4959
840E80j1564R555J405j5821k065J5687m610j3444J5809J0936j3935L579J8697
853A4809l491r809R619R363j2514q626J2938l089k0008N580Q891j6264o472J4074
867d999J24j2374N253J5869m877q314J6864Q191j4523M975J5254j0139j0973R173
$$ plain form
881 9504 12804 -3246 -9115 2387 -2579 -19436 -9884 -346 -14744 -15342 1212 368 -8458 825
895 825 13644 6947 1144 15423 17318 1321 4986 14978 920 -8785 730 -150 -14376 -14014 -3062
910 -3062 -8213 -18420 -4859 3614 -8387 -4635 12113 8177 713 11070 17716 6728 2027 12732
924 12732 8895 -7575 -2845 4511 -9811 -15313 -4110 -5914 -15450 -9954 1355 -3557 -8900 5668
938 5668 12376 670 5041 17554 9813 1997 9988 10470 -2102 -5351 3004 -2589 -16356 -8911
952 -8911 -1670 -12852 -13891 -1107 -2530 -8067 1470 10151 4141 1227 13947 15530 2346 5548
966 5548 13717 2470 -4855 2439 -64 -11852 -11182 -2150 -7581 -16315 -5836 1628 -7591 -4807 8649
981 8649 5491 566 10287 15179 5866 2712 11753 8392 -4986 -1678 4260 -7869 -12519 -3290 -5856
$$ packed form
881I504L300j6050n869J1502m966j6857R552R538j4398n98J6554q44q826R283
895H25J2819o697n803J4279J895j5997L665R992j4058r705R515q80j4226L62J0952
910c062n151j0207J3561Q473j2001L752J6748l936p464J0357O646j0988m701J0705
924A2732l837j6470M730P356j4322n502J1203j804r536N496J1309m912n343J4568
938E668O708j1706M371J2513p741p816P991M82j2572l249Q355n593j3767P445
952h911P241j1182j039J2784j423n537R537Q681o010k914J2720J583j3184L202
966E548Q169j1247p325P294k503j1788O70R032n431q734J0479P464r219K784J3456
981H649l158m925R721M892r313l154R041l361j3378L308N938j2129m650R229k566
$$ plain form
996 -5856 -14391 -9205 -11 -4263 -8002 3531 9195 213 4908 15844 8344 2094 10348 10689 -589
1011 -589 -3239 3584 -1465 -12565 -6998 -1694 -12473 -12220 -1056 -3142 -8478 -459 7226 3180 1330
1026 1330 11148 12182 2414 6818 12899 1565 -4059 3274 1057 -9244 -8992 -3055 -7280 -13350 -5100
1041 -5100 -291 -8675 -4823 7242 3517 -297 8554 12294 6164 4769 10515 6896 -2477 1198 4482
1056 4482 -7371 -10557 -1893 -5221 -12554 -8130 -1941 -5092 -6907 2484 6002 -710 3731 13177 7203
1071 7203 2593 9352 8896 857 -536 2809 -1734 -9351 -5288 -1725 -11162 -11264 -1611 -4123 -7972
1086 -7972 -207 4826 1245 1226 9632 10641 3084 6092 11439 2886 -1934 4145 866 -7470 -6453
1101 -6453 -2749 -7251 -11783 -5323 -1204 -7865 -5059 4874 2079 -751 7644 10274 4364 4324 9501
$$ packed form
996e856q535N186R194m252l739J1533N664q982M695J0936p500o250Q254L41j1278
1011e89k650O823n049j1100N567N304j0779K53J1164k086n336Q019P685m046j850
1026A330R818J034r768M404O081j1334n624P333k217j0301K52N937m225o070Q250
1041e100M809q384L852J2065l725l814Q851L740o130j395N746l619r373L675L284
1056D482j1853l186Q664l328p333M424O189l151j815R391L518o712M441R446n974
1071G203m610O759m56q039j393L345m543p617M063L563r437j02R653k512l849
1086g972P765N033l581j9Q406J009p557L008N347q553m820O079l279q336J017
1101f453L704m502m532O460M119o661K806R933k795k830Q395K630n910m0N177
$$ plain form
1116 9501 7159 -770 1108 4270 -4876 -8314 -1436 -4791 -11589 -6593 -2353 -5858 -6317 891 4096
1131 4096 -958 3215 10846 6029 2815 9896 8441 366 931 3588 -1215 -7234 -3943 -1869 -9368
1146 -9368 -9824 -1641 -4153 -8282 -934 3366 -115 1219 7709 8346 3061 5883 10236 3230 -934
1161 -934 4516 1165 -6026 -4232 -2246 -6811 -9391 -4522 -2342 -7359 -4887 3434 1236 -807 6526
1176 6526 8357 3740 4822 8917 6109 582 1887 4036 -3490 -6080 -1350 -4389 -9789 -5859 -2569
1191 -2569 -6364 -5996 384 2324 -1249 1927 8653 5409 2775 8746 7559 1086 1779 4108 -614
1206 -614 -5053 -3342 -1879 -7545 -7928 -2162 -4255 -7635 -1315 1896 -1052 732 6390 6653 3438 5536
1222 5536 8464 3508 325 4683 1998 -5096 -3224 -1522 -5830 -7813 -4400 -2974 -6459 -4882 2085
$$ packed form
1116I501k342p929J878L162r146l438O878l355o798M996M240l505m59P208L205
1131D096n054M173P631m817l214P081j455q075N65K657m803o019L291K074p499
1146i368m56Q183k512m129P348M300l481J334O490O37n285K822M353p006m164
1161i34N450l351p191J794J986m565k580M869K180n017K472Q321k198k043P333
1176F526J831m617J082M095k808n527J305K149p526k590M730l039n400L930L290
1191b569l795L68O380J940l573L176O726l244k634N971j187o473O93K329m722
1206f14m439J711J463n666l83N766k093l380O320L211k948J784N658K63l215K098
1222E536K928m956l183M358k685p094J872J702m308j983L413J426l485J577O967
$$ plain form
1237 2085 251 -1827 4937 7034 2881 4667 8260 5235 1458 2935 4008 -2135 -4498 -740 -3319
1252 -3319 -8309 -4570 -2691 -5831 -5292 -429 636 -1447 1525 6971 4606 2308 7603 6935 1372
1267 1372 2859 4266 -81 -3499 -1748 -1571 -6441 -7067 -2322 -4419 -7243 -1689 551 -2123 786
1282 786 5213 4789 2665 5202 7724 3664 1046 4592 2097 -3420 -1791 -815 -4897 -6520 -3732 -3123
1298 -3123 -5513 -4451 296 -768 -2073 3593 5290 2231 4253 7222 4655 1931 3149 3550 -1010
1313 -1010 -3162 -388 -2762 -7081 -4211 -2576 -5813 -5165 -1056 -263 -1545 1013 5219 3163 1902
1328 1902 6423 6148 2043 2966 4093 221 -2364 -965 -1184 -5269 -5516 -2379 -4003 -6507 -2129 200
1344 200 -2071 -162 3783 3543 2297 4589 6592 3390 1439 4532 2311 -2584 -932 -604 -4242 -4994
$$ packed form
1237B085j834k078O764K097m153J786L593l025l777J477J073o143k363L758k579
1252c319m990L739J879l140N39M863J065k083K972N446k365k298N295o68n563
1267A372J487J407m347l418J751J77m870o26M745k097k824N554K240k674K909
1282G86M427m24k124K537K522m060k618L546k495n517J629R76m082j623K788O09
1298c123k390J062M747j064j305N666J697l059K022K969k567k724J218M01m560
1313a010k152K774k374m319K870J635l237O48M109P93j282K558M206k056j261
1328A902M521k75m105R23J127l872k585J399k19m085k47L137j624k504M378K329
1344B00k271J909L945k40j246K292K003l202j951L093k221m895J652L28l638p52
$$ plain form
1360 -4994 -3207 -3299 -5250 -4030 -218 -1311 -2013 2676 4096 1310 3730 6247 4001 2252 3639 3401
1376 3401 -276 -1937 193 -2218 -5720 -3358 -2113 -5180 -4225 -1152 -956 -1929 497 3591 2756 2007
1392 2007 5419 5484 1719 3051 4029 326 -1284 -118 -845 -4016 -4488 -2375 -3902 -5707 -2030 -621
1408 -621 -2767 -344 2963 2186 1962 3703 5235 3125 1895 3843 2166 -1228 -215 252 -3504 -4276
1424 -4276 -2603 -3174 -4562 -3506 -990 -1201 -1975 1907 2937 1127 2968 5115 3312 2185 3185 2895
1440 2895 280 -1152 284 -1317 -4762 -3146 -1868 -4836 -4019 -1460 -1682 -1767 318 2684 1852 1767 4374
1457 4374 4366 1666 2894 3915 533 -705 269 -1137 -3253 -3368 -2213 -3121 -4860 -2477 -662 -2623
1473 -2623 -788 2452 1655 1578 3531 4417 3038 1983 3448 2564 -944 2 316 -2558 -3249 -2111 -3019
$$ packed form
1360d994J787r2j951J220L812j093p02M689J420k786K420K517k246j749J387k38
1376C401l677j661K130k411l502K362J245l067R55L073J96r73K426L094q35p49
1392B007L412O5l765J332R78l703j610J166p27l171m72K113j527j805L677J409
1408f21k146K423L307p77k24J741J532k110j230J948j677l394J013M67l756p72
1424d276J673n71j388J056K516k11p74L882J030j810J841K147j803j127J000k90
1440B895k615j432J436j601l445J616J278k968Q17K559k22q5K085K366q32q5K607
1457D374qk700J228J021l382j238R74j406k116j15J155r08j739K383J815j961
1473b623J835L240p97p7J953Q86j379j055J465q84l508R46L14k874o91J138r08
$$ plain form
1490 -3019 -3969 -3058 -1350 -1638 -1911 951 2404 626 2290 4920 3091 2083 3424 2417 409 -351
1506 -351 332 -1174 -3458 -2391 -1877 -4351 -3651 -1170 -2013 -2092 97 1724 1655 1535 3648 3856 1653 2726
1524 2726 3610 803 64 801 -739 -2325 -2690 -1819 -2670 -4085 -2180 -704 -2339 -1006 1669 1096 1261
1541 1261 3085 3816 2706 2036 3091 2356 -155 403 510 -2300 -2876 -1623 -2917 -3741 -2604 -1732 -1792
1558 -1792 -1777 237 1820 576 1984 4106 2783 1987 3319 2402 717 156 436 -644 -2521 -2060 -1563
1575 -1563 -3594 -3082 -1255 -2188 -2193 -83 751 870 1090 2662 3242 1697 2527 3329 1187 70 952 -352
1593 -352 -1847 -1810 -1718 -2671 -3427 -2332 -1264 -2221 -1231 895 654 995 2539 2942 2086 2374 3117 2124 454
1612 454 539 1028 -1571 -2280 -1061 -2265 -3356 -2325 -1966 -1943 -1822 27 904 135 1709 3147 2215 1838
$$ packed form
1490c019r50R11J708k88k73K862J453j778J664K630j829j008J341j007k008p60
1506c51O83j506k284J067N14k474P00K481q43p9K189J627o9j20K113K08k203J073
1524B726Q84k807p39P37j540j586l65Q71q51j415J905J476j635J333K675n73J65
1541A261J824P31j110o70J055p35k511N58J07k810n76J253j294q24J137Q72o0
1558a792J5K014J583j244J408K122j323p96J332r17j685n61K80j080j877M61M97
1575a563k031N12J827r33nK110Q34J19K20J572N80j545Q30Q02k142j117Q82j304
1593c52j495L7R2r53p56J095J068r57R90K126k41L41J544M03q56K88P43r93j670
1612D54Q5M89k599p09J219j204j091J031L59K3J21J849Q77p69J574J438r32l77
$$ plain form
1630 1838 3007 2469 739 612 773 -340 -1767 -1640 -1477 -3196 -3210 -1535 -2020 -2249 -126 298 298 1041
1648 1041 2493 2853 1953 2416 2953 1330 540 1351 15 -1738 -1528 -1347 -2482 -3183 -2002 -1697 -2598 -1416
1666 -1416 417 214 393 2035 2366 1510 2209 2609 1917 576 1059 863 -1175 -1820 -936 -2124 -3378 -2032
1684 -2032 -1914 -1892 -1530 -117 413 -27 1188 2888 1773 1603 2741 2620 1015 964 704 -60 -1418 -1264
1702 -1264 -1376 -2715 -2761 -1315 -1947 -2236 -600 262 66 816 2000 2306 1586 1805 2811 1577 896 1459
1720 1459 316 -1261 -998 -846 -2061 -2500 -1807 -1179 -2298 -1338 304 -54 468 1794 1838 1516 2160 2615
1738 2615 1845 1092 863 797 -689 -1265 -619 -1751 -2735 -1893 -1464 -2135 -1407 -577 77 118 897 2155 1670
1757 1670 1655 2644 2010 935 863 949 -171 -1036 -859 -1173 -2199 -2283 -1188 -1983 -2493 -422 36 181 906
$$ packed form
1630A838J169n38j730j27J61j113j427J27J63j719j4J675m85k29K123M24%P43
1648A041J452L60r00M63N37j623p90Q11j336j753K10J81j135p01J181L05r01J182
1666a416J833k03J79J642L31q56O99M00o92j341M83j96k038o45Q84j188j254J346
1684b032J18K2L62J413N30m40J215J700j115j70J138j21j605n1k60p64j358J54
1702a264j12j339m6J446o32k89J636Q62j96P50J184L06p20K19J006j234o81N63
1720A459j143j577K63J52j215m39O93O28j119R60J642l58N22J326M4l22O44M55
1738B615p70p53k29o6j486n76O46j132r84Q42M29o71P28Q30O54M1P79J258m85
1757A670j5R89o34j075p2Q6j120q65J77l14j026q4J095p95n10K071M58J45P25
$$ plain form
1776 906 1613 1702 1384 1959 2419 1280 1125 1504 233 -960 -860 -911 -2026 -2326 -1755 -1405 -1825 -1464 -115
1795 -115 67 -280 1532 1712 1270 2171 1946 1639 1144 1098 985 -222 -1084 -455 -1084 -2476 -1586 -1697 -2134
1814 -2134 -1696 -534 -131 -142 639 1592 1634 1261 2283 2185 975 1299 1011 2 -562 -615 -1042 -1625 -2283 -1449
1834 -1449 -1693 -2191 -455 -464 -389 714 1294 1163 990 1654 2133 1520 1118 1285 578 -616 -336 -552 -1785
1853 -1785 -1730 -1390 -1538 -1865 -1341 -311 -232 -291 902 1318 1036 1722 1912 965 1141 1226 1224 -365 -680 -144 -836
1874 -836 -2106 -1653 -1188 -2206 -1446 -661 -272 -168 809 1145 1179 1106 1906 1659 891 1446 1232 182 -476 -454
1894 -454 -618 -1355 -1915 -1246 -1528 -1793 -866 -745 -930 376 1176 663 1131 1586 2045 1458 795 1154 432 -364
1914 -364 -321 -310 -1411 -1638 -1269 -1459 -1994 -1413 -433 -151 -329 724 1166 812 1609 2156 1341 1047 1433 928
$$ packed form
1776I06P07Q9l18N75M60j139j55L79j271j193J00n1j115l00N71L50m20L61J349
1795a15J82l47J812J80m42R01k25l07m95m6j13j207q62O29o29j392Q90j11m37
1814b134M38J162M03j1P81R53M2l73J022r8j210L24k88j009n64n3m27n83o58Q34
1834a449k44m98J736rP5J103N80j31j73O64M79o13m02J67p07j194K80k16j233
1853a785N5L40j48l27N24J030P9n9J193M16k82O86J90r47J76Q5kj589l15N36o92
1874h36j270M53M65j018P60P85L89J04R77L36L4p3Q00k47p68N55k14j050o58K2
1894d54j64p37n60O69k82k65R27J21j85J306Q00n13M68M55M59n87o63L59p22p96
1914c64M3J1j101k27L69j90n35N81R80K82j78J053M42l54P97N47q15k94L86n05
$$ plain form
1934 928 59 -338 -364 -852 -1683 -1209 -1202 -1720 -1479 -450 -611 -370 208 1006 889 864 1718 1718 721 831 848 170
1956 170 -114 13 -715 -1330 -1350 -1266 -1351 -1698 -941 -726 -492 317 992 867 939 1250 1796 1284 1222 1152 858 -126
1978 -126 -23 -437 -1068 -969 -1037 -1525 -1271 -850 -693 -703 -591 382 993 532 1156 1531 994 815 1147 711 289
1999 289 -10 110 -531 -1480 -1118 -1330 -1570 -1017 -667 -754 -542 174 582 789 1102 1250 1483 967 1019 1151 470
2020 470 -169 40 -455 -623 -878 -890 -1198 -1311 -911 -478 -606 -34 482 622 839 1228 1212 1085 691 905 1199
2041 1199 76 -111 86 -796 -1264 -987 -1034 -960 -1034 -791 -538 -565 377 608 120 813 1253 945 913 1224 713
2062 713 154 139 197 -316 -930 -793 -1028 -1475 -1080 -781 -896 -551 148 515 561 855 1186 1170 857 1127 1043 305
2084 305 138 125 -289 -1055 -1001 -838 -974 -1352 -809 -544 -498 -193 463 292 480 1353 1311 995 1071 1056 824 117
$$ packed form
1934I28q69l97k6m88q31M74Pn18K41J029j61K41N78P98j17k5Q54%r97J10J7o78
1956A70k84J27p28o15k0Q4q5l47P57K15K34Q09O75j25P2L11N46n12o2p0k94r84
1978a26J03m14o31R9o8m88K54M21J57j0J12R73O11m61O24L75n37j79L32m36m22
1999B89k99J20o41r49L62k12k40N53L50q7K12P16M08K07L13J48K33n16N2J32o81
2020D70o39K09m95j68k55j2l08j13M00M33j28N72N16J40K17L89j6j27l94K14K94
2041A199j123j87J97q82m68K77m7P4p4K43K53k7R42K31m88O93M40l08l2L11n11
2062G13n59j5N8n13o14J37k35m47L95K99j15L45O99L67M6K94L31j6l13K70q4p38
2084C05j67j3m14p66N4J63j36l78N43K65M6L05O56j71J88Q73m2l16P6j5k32p07
$$ plain form
2106 117 251 -185 -913 -715 -961 -1098 -1200 -1007 -703 -379 -479 -170 477 518 703 1117 902 942 965 674 565
2127 565 171 28 -400 -1105 -876 -726 -1249 -798 -498 -605 -705 -39 -56 321 691 890 904 763 863 881 454
2148 454 160 -25 -416 -394 -644 -736 -1104 -1129 -829 -352 -403 -305 399 102 582 965 740 871 965 855 463 114
2170 114 173 -26 -725 -693 -567 -1001 -959 -683 -843 -643 -512 68 211 -94 616 780 662 753 1065 526 524 201
2192 201 -159 -187 -290 -719 -590 -1007 -1082 -490 -585 -461 -85 193 129 383 800 1026 566 607 685 311 10 426
2214 426 -220 -474 -312 -756 -841 -1057 -755 -680 -623 -490 2 48 208 806 721 527 924 716 812 568 461 6
2236 6 -173 -518 -180 -625 -955 -637 -552 -893 -262 68 295 167 308 942 305 730 932 867 378 274 84
2257 84 -134 -481 -350 -398 -657 -923 -650 -855 -708 -386 279 209 281 777 755 319 807 739 522 549 587 -133 -550
$$ packed form
2106A17J34m36p28J98k46j37j02J93L04L24j00L09O47M1J85M14k15M0K3k91j09
2127E65l94j43m28p05K29J50n23M51L00j07j00O66j7L77L70J99J4j41J00J8m27
2148D54k94j85l91K2k50r2l68k5L00M77n1R8P04k97M80L83k25J31R4j10l92l49
2170A14N9j99o99L2J26m34M2K76j60K00J31N80J43l05P10J64j18R1L12n39kl23
2192B01l60k8j03m29J29m17p5N92r5J24L76K78o4K54M17K26m60M1P8l74l01M16
2214D26o46k54J62m44q5k16L02P5N7J33M92M6J60N98q5j94L97k08R6k44j07m55
2236Fj79l45L38m45l30L18Q5l41O31L30K27j28J41O34o37M25K02o5m89j04j90
2257H4k18l47J31m8k59k66K73k05J47L22O65p0P2M96k2m36M88o8k17K7L8p20m17
$$ plain form
2280 -550 -290 -595 -875 -801 -501 -684 -234 -423 210 1 138 605 538 651 705 998 644 451 463 113 -356
2301 -356 -343 -408 -617 -797 -750 -476 -631 -481 -51 210 73 387 726 626 437 1290 719 608 256 -13 45
2322 45 -287 -255 -608 -683 -807 -611 -725 -674 -384 229 -248 549 654 701 574 728 752 533 149 285 290 -240 -197
2345 -197 -455 -461 -690 -799 -629 -618 -374 22 -23 269 477 663 595 977 977 897 458 361 89 -109 -215 -156 -493
2368 -493 -957 -819 -474 -796 -252 11 -166 267 174 574 539 453 878 620 462 715 538 -236 -195 -403 -746
2389 -746 -557 -741 -358 -616 -886 -231 -77 -163 234 618 508 519 601 766 527 93 549 51 -467 -373 -284 -679
2411 -679 -474 -744 -633 -688 -403 -214 -291 208 583 669 383 810 919 491 519 417 191 296 -57 -217 -289 -701
2433 -701 -431 -358 -728 -486 -424 -237 125 51 648 400 302 811 914 536 622 467 98 71 -104 -458 -646 -752
$$ packed form
2280e50K60l05k80P4L00j83M50j89O33k09J37M67o7J13N4K93l54j93J2l50m69
2301c56J3o5k09j80M7K74j55J50M30K61j37L14L39j00j89Q53n71j11l52k69N8
2322D5l32L2l53p5j24J96j14N1K90O13m77P97J05M7j27J54K4k19l84J36Nn30M3
2345a97k58ok29j09J70J1K44L96m5K92K08J86o8L82%q0m39r7k72j98j06N9l37
2368d93m64J38L45l22N44K63j77M33r3M00l5q6M25k58j58K53j77p74M1k08l43
2389g46J89j84L83k58k70O55J54q6L97L84j10J1Q2J65k39m34M56m98n18R4Q9l95
2411f79K05k70J11n5K85J89p7M99L75Q6k86M27J09m28K8j02k26J05l53j60p2m12
2433g01K70P3l70K42O2J87L62p4N97k48r8N09J03l78Q6j55l69k7j75l54j88j06
$$ plain form
2455 -752 -727 -638 -884 -382 -199 -195 449 412 429 482 539 746 479 538 726 27 -132 -144 -103 -505 -627 -815 -481 -311
2479 -311 -744 -265 -61 187 399 543 151 577 942 639 476 529 425 -15 -316 -68 -375 -715 -390 -723
2499 -723 -621 -613 -314 -310 -110 143 404 476 141 912 723 628 533 547 100 165 -151 -220 -629 -808 -311 -487 -803
2522 -803 -438 -24 172 35 102 152 478 737 760 548 549 259 433 -61 -99 -163 -488 -638 -740 -845 -449 -495 -253
2545 -253 -50 -243 290 541 478 405 648 948 403 606 187 365 44 -232 -478 -708 -290 -634 -559 -569 -332
2566 -332 -169 -202 161 551 466 434 658 569 521 503 272 -17 -180 -147 -145 -459 -565 -720 -371 -468 -385 -315 -332 -139
2590 -139 207 285 549 556 355 463 347 514 94 202 47 -92 -751 -654 -590 -666 -901 -541 -387 -467 74 298
2612 298 729 369 384 272 338 425 491 381 64 -124 -254 -41 -603 -540 -452 -542 -436 -433 -578 -153 266 148 325
$$ packed form
2455g52K5Q9k46N02J83MO44l7J7N3N7K07k67N9J88o99j59j2M1m02j22j88L34J70
2479c11m33M79K04K48K12J44l92M26L65l03j63N3j04m40l01K48l07l40L25l33
2499g23J02QK99MK00K53K61P2l35P71j89r5r5J4m47O5l16o9m09j79M97j76l16
2522h03L65M14J96j37O7N0L26K59K3k12Jk90J74m94l8o4l25j50j02j05L96m6K42
2545b53K03j93N33K51o3p3K43L00n45K03m19J78l21k76k46k30M18l44P5j0K37
2566c32J63l3L63L90q5l2K24q9m8j8k31k89j63L3Kl14j06j55L49r7Q3P0j7J93
2590a39L46P8K64Pk01J08j16J67m20J08j55j39o59R7O4p6k35L60J54q0N41K24
2612B98M31l60J5j12O6Q7O6j10l17j88j30K13n62O3Q8r0J06Lj45M25M19j18J77
$$ plain form
2635 325 425 568 561 270 351 433 319 46 -123 -150 -506 -278 -412 -19 -645 -350 -197 -159 -23 456 297 241
2657 241 687 383 690 294 447 19 67 137 34 -280 -539 -507 -326 -563 -479 -328 -214 -288 -142 261 638 284
2679 284 457 313 564 639 404 455 -54 -19 -104 -315 -714 -158 -553 -599 -435 -250 -48 186 55 161 346 536
2701 536 701 317 342 628 190 266 157 -311 -390 -510 -452 -275 -571 -412 -412 -334 -206 -21 322 255 294 587 187
2724 187 490 537 504 275 136 261 -170 -362 -358 -604 -395 -411 -510 -359 -54 59 314 142 417 624 312 500
2746 500 623 69 184 353 -110 -332 -377 -393 -655 -515 -639 -364 -305 -193 -74 295 38 387 464 365 483 296
2768 296 550 272 66 43 -130 -384 -272 -625 -296 -623 -450 -287 -371 33 29 180 90 703 504 223 489 627
2790 627 678 166 169 -36 -413 -449 -416 -630 -718 -563 -364 -58 -349 107 161 166 81 311 386 441 306 373 306 214 -70
$$ packed form
2635C25J00J43pk91Q1Q2j14k73j69k7l56K28j34L93o26K95J53L8J36M79j59n6
2657B41M46l04L07l96J53m28M8P0j03l14k59L2J81k37Q4J51J14p4J46M03L77l54
2679B84J73j44K51P5k35N1n09L5q5k11l99N56l95m6J64J85K02K34j31J06J85J90
2701E36J65l84K5K86m38P6j09m68p9j20N8J77k96J59%P8J28J85L43o7L9K93m00
2724A87L03M7l3k29j39J25m31j92Mk46K09j6r9J51L05J13K55j72K75K07l12J88
2746E00J23n54J15J69m63k22m5j6k62J40j24K75N9J12J19L69k57L49P7r9J18j87
2768B96K54k78k06k3j73k54J12l53L29l27J73J63q4M04mJ51r0O13j99k81K66J38
2790F27N1n12Lk05l77l6L3k14q8J55J99L06k91M56N4Nq5K30P5N5j35O7o7r2k84
$$ plain form
2815 -70 -176 -372 -369 -346 -572 -708 -507 -505 -279 63 242 98 460 468 584 386 584 346 429 48 333 36 -111
2838 -111 -238 -258 -441 -596 -646 -127 -197 -272 -183 91 364 344 662 236 703 499 395 247 298 -26 -87 -547 -235
2861 -235 -433 -499 -507 -453 -429 -364 -88 6 -32 162 359 755 290 466 343 233 -1 47 -186 62 -195 -482 -278
2884 -278 -551 -455 -352 64 -272 176 214 52 172 558 286 513 351 250 431 292 -100 -140 -131 -516 -460 -401
2906 -401 -612 -293 -32 -367 -88 -99 67 290 242 359 494 567 334 94 376 135 223 -233 -279 -418 -518 -154
2928 -154 -417 -378 -4 -84 -63 56 96 330 488 468 404 645 412 252 204 45 -153 -471 -218 -431 -367 -77 -530
2951 -530 -522 -8 -71 -48 286 110 99 421 477 308 467 354 509 120 -236 -87 -323 -472 -191 -347 -423 -262
2973 -262 -243 -352 219 -14 165 522 77 364 397 240 277 359 126 -175 -132 -194 -198 -647 -431 -390 -398 -97 -188 -283
$$ packed form
2815g0j06j96LK3k26j36K01KK26L42J79j44L62QJ16j98J98k38Q3l81K85k97j47
2838a11j27k0j83j55n0N19p0p5Q9K74K73k0L18m26M67k04j04j48N1l24o1m60L12
2861b35j98o6qN4K4O5K76R4l8J94J97L96m65J76j23j10k34M8k33K48k57k87K04
2884b78k73R6J03M16l36M48L8j62J20L86k72K27j62j01J81j39l92m0Rl85N6N9
2906d01k11L19K61l35K79j1J66K23m8J17J35P3k33k40K82k41Q8m56m6j39j00L64
2928a54k63L9L74q0K1J19M0K34J58k0o4K41k33j60m8j59j98l18K53k13O4K90m53
2951e30QN14o3K3L34j76j1L22N6j69J59j13J55l89l56J49k36j49K81j56p6J61
2973b62J9j09N71k33J79L57m45K87L3j57L7Q2k33l01M3o2mm49K16M1qL01r1r5
$$ plain form
2997 -283 109 66 260 382 371 401 303 121 117 285 193 -87 -471 -335 -513 -365 -157 -163 -310 -213 42 -214 20
3020 20 182 308 315 701 469 490 249 38 -38 132 -28 -245 -221 -310 -284 -607 -443 -337 -66 -132 -78 37 405
3043 405 140 431 318 463 419 235 20 -62 207 -286 -354 -409 -478 -520 -263 -525 -11 -162 191 193 216 458 326
3066 326 53 373 359 200 61 75 76 -186 -282 -237 -412 -480 -375 -351 -299 139 -87 37 363 198 625 614 427
3089 427 452 369 136 253 -45 28 -138 -446 -431 -314 -457 -216 -235 41 -95 -109 112 454 519 732 393 356 537
3112 537 44 247 -40 -187 -59 -205 -175 -446 -316 -349 -293 -144 -252 -131 -6 32 311 255 233 470 377 292 317
3135 317 84 -216 -61 -214 -325 -446 -199 -313 -234 65 -290 -366 -210 350 299 357 281 234 225 433 97 451 257
3158 257 -144 -89 -308 -353 -332 -157 -422 -515 -141 -151 24 353 121 211 41 595 321 369 361 249 58 -77 14
$$ packed form
2997b83L92m3J94J22j1L0r8j82mJ68r2k80l84J36j78J48K08oj47R7K55k56K34
3020B0J62J26PL86k32K1k41k11p6J70j60k17K4q9K6l23J64J06K71o6N4J15L68
3043D05k65K91j13J45m4j84k15q2K69m93o8n5o9m2K57k62N14j51L53KK3K42j32
3066C26k73L20j4j59j39J4Jk62r6M5j75o8J05K4N2M38k26J24L26j65M27j1j87
3089D27K5q3k33J17k98P3j66l08J5J17j43K41j9K76j36j4K21L42O5K13l39l7J81
3112E37m93K03k87j47J28j46L0k71J30l3N6J49j08J21J25L8K79n6k2K37r3q5K5
3135C17k33l00J55j53j11j21K47j14P9K99l55p6J56N60n1N8p6m7rK08l36L54j94
3158B57m01N5k19m5K1J75k65r3L74j0J75L29k32R0j70N54k74M8qj12j91j35R1
$$ plain form
3181 14 -80 -25 -217 -237 -307 -424 -277 -6 -168 120 175 303 217 372 203 313 106 436 -50 72 45 -129 -49
3204 -49 -252 -430 -320 -397 -314 -303 -13 104 20 296 299 542 409 251 350 100 234 -66 -96 -12 -204 -473 -495 -324
3228 -324 -204 -76 34 -154 -53 108 158 -4 214 576 231 77 202 307 245 89 88 229 -178 -214 -390 -503
3250 -503 -300 -122 -134 -81 100 134 -76 142 306 505 410 124 -9 -32 303 123 -60 -252 -350 -371 -206 16
3272 16 -102 -245 60 -48 167 65 -7 145 133 39 217 50 179 -27 70 -297 -157 -185 -231 -511 -505 -161 -82
3295 -82 -3 -60 -68 172 166 451 294 397 239 275 376 280 28 -101 -86 -380 -198 -195 -85 -354 -611 -127 -127 -13 174
3320 174 265 201 53 325 222 361 56 127 274 117 -50 -4 -133 -31 -119 -259 -200 -130 -224 53 198 -144 2
3343 2 294 78 246 211 48 174 36 -156 -6 -365 -396 -165 -334 -6 -508 -245 -180 -112 53 300 199 -2
$$ packed form
3181A4r4N5j92k0p0j17J47K71j62K88N5J28q6J55j69J10k07L30m86J22k7j74Q0
3204d9k03j78J10p7Q3J1K90J17q4K76LK43j33j58R9k50J34l00l0Q4j92k69k2J71
3228c24J20J28J10j88J01J61N0j62K18L62l45j54J25J05o2j56jJ41m07l6j76j13
3250e03K03J78j2N3J81L4k10K18J64J99r5k86j33k3L35j80j83j92r8k1J65K22
3272A6j18j43L05j08K15j02p2J52j2r4J78j67J29k06R7l67J40k8m6k80OL44P9
3295h2P9n7qK40oK85j57J03j58L6J01r6k52j29J5k94J82LJ10k69k57M84%J14J87
3320A74R1o4j48K72j03J39l05P1J47j57j67M6j29J02q8j40N9P0r4K77J45l42J46
3343BK92k16J68l5j63J26j38j92J50l59l1K31j69L28n02K63O5O8J65K47j01k01
$$ plain form
3365 -2 482 -36 256 -43 258 106 58 -262 -62 50 -237 -286 -148 -387 -215 -87 -180 -215 -105 17 92 117 293
3388 293 -152 232 361 175 -41 -70 67 -163 -183 -115 -325 -80 29 27 109 -85 -8 155 -58 359 -2 229
3410 229 181 6 49 118 26 154 -350 -59 -172 -138 -122 -332 -89 -113 43 162 163 -75 270 134 234 343 274
3433 274 44 8 -106 -193 -276 37 -203 -369 127 -218 313 -3 -64 356 -27 121 127 205 92 262 82 186
3455 186 79 120 231 -67 -223 -83 -44 -353 -360 -304 -230 -17 -243 35 -91 170 194 212 206 89 -58 113 153 -139
3479 -139 -32 175 -151 -71 -50 -242 -383 -432 -269 -143 99 32 255 64 414 143 299 124 29 -6 -29 35 172
3502 172 -44 -184 -295 -226 -124 -183 74 -4 90 -41 123 202 261 209 45 360 168 25 31 92 1 -76 -232 -40
3526 -40 -352 77 -171 -312 -46 112 331 93 -38 55 231 172 155 132 289 -146 5 -90 31 -126 -128 -197 -108
$$ packed form
3365bM84n18K92k99L01j52m8l20K00J12k87m9J38k39J72J28r3l5J10J22P5K5J76
3388B93m45L84J29j86k16k9J37k30k0O8k10K45J09kQ2j94P7J63k13M17l61K31
3410B29m8j75M3O9r2J28n04K91j13L4J6k10K43k4J56J19Jk38L45j36J00J09o9
3433B74k30l6j14q7q3L13k40j66M96l45N31l16o1M20l83J48OP8j13J70j80J04
3455A86j07M1J11k98j56J40L9l09pN6P4K13k26K78j26K61K4J8oj17j47J71M0k92
3479a39J07K07l26Q0K1j92j41m9J63J26K42o7K23j91L50k71J56j75r5l5k3O4J37
3502A72k16j40j11O9J02n9K57p8R4j31J64P9N9n2j64L15j92j43OO1r1p7j56J92
3526d0l12M29k48j41K66J58K19k38j31R3J76n9j7k3J57m35J51r5J21j57ko9Q9
$$ plain form
3549 -108 -224 -58 -82 -206 -94 191 328 -149 73 291 156 39 -3 -165 -121 -5 -36 -164 -112 -205 -178 -164 -159
3572 -159 185 86 -65 -2 319 41 314 107 125 290 112 101 -266 -187 -253 -296 -114 -6 -40 -345 34 7 -96
3595 -96 41 -55 138 -60 -39 333 60 2 184 24 -33 -83 171 -102 -290 -385 -285 -389 275 -91 50 0 97
3618 97 -37 35 131 13 473 91 80 218 95 -103 145 -144 -30 -319 -117 -162 -231 175 -148 4 -81 -193
3640 -193 189 442 159 -41 -162 -81 -57 -15 -102 -263 30 2 -171 78 -317 -60 78 -125 -56 0 -43 109 19
3663 19 218 192 140 211 97 48 137 76 -146 177 -281 -337 -500 -281 -399 -291 -340 -156 372 311 111 390 179
3686 179 32 379 46 179 60 -244 -289 -231 -14 26 -353 -201 -303 -409 -266 78 102 -14 6 275 282 336 198
3709 198 150 -41 130 -112 -48 -62 -7 -291 -131 -302 -292 -130 40 -125 -171 132 214 35 113 347 341 246 382 34
$$ packed form
3549a08j16J66k4j24J12K85J37m77K22K18j35j17m2j62M4J16l1j28N2r3K7J4N
3572a59L44r9j51O3L21k78K73k07J8J65j78j1l67P9o6m3J82J08l4l05L79k7j03
3595i6J37r6J93j98K1L72k73n8J82j60n7n0K54k73j88r5J00j04O64l66J41n0R7
3618I7j34P2R6j18M60l82j1J38j23j98K48k89J14k89K02m5o9M06l23J52q5j12
3640a93L82K53k83k00j21Q1K4M2q7j61K93k8j73K49l95K57J38k03O9N6m3J52r0
3663A9J99k6n2P1j14m9Q9o1k22L23m58n6j63K19j18J08m9J84N28o1k00K79k11
3686A79j47L47l33J33j19l04m5N8K17M0l79J52j02j06J43L44K4j16K0K69PN4j38
3709A98m8j91J71k42O4j4N5k84J60j71J0J62J70j65m6L03Q2j79P8K34or5J36l48
$$ plain form
3733 34 -1 -36 -268 -129 -451 -338 -147 -262 -142 -190 -176 -103 -262 1 105 499 193 353 153 298 51 58 9
3756 9 -88 -8 -356 -101 -370 -37 -205 184 -107 -197 297 189 28 135 475 115 154 361 309 -95 75 -97
3778 -97 -109 111 -327 -318 -159 -107 -309 -234 -132 156 -31 286 144 225 366 136 253 539 89 143 139 -242 -93
3801 -93 -131 -343 -112 -218 -130 -411 -217 -79 143 122 16 87 183 172 269 94 -148 264 -258 -290 -26 -145 -309
3824 -309 53 -176 -324 -154 -365 30 127 310 284 280 252 261 218 325 -22 144 -74 28 -24 -175 -186 -192 -493 -132
3848 -132 -394 -109 -116 -365 138 334 264 323 171 624 498 109 193 31 98 -171 -122 -108 -239 -348 -228 -103 -38
3871 -38 -157 -234 -64 192 253 106 360 256 293 348 -102 291 147 -100 -130 -88 -471 -335 -674 -436 -385 -221 -366
3894 -366 -361 -137 94 323 -96 466 329 384 433 168 -73 -5 8 -40 -343 -295 -8 -312 -470 -160 -268 -35 49
$$ packed form
3733C4l5l5k32J39l22J13J91j15J20m8J4P3j59K63J04L94l06J60k00J45k47Pm9
3756Ir7Q0l48K55k69L33j68L89k91r0M94j08j61J07L40l60L9K07n2m04J70j72
3778i7j2K20m38RJ59N2k02P5J02K88j87L17j42Q1J41k30J17K86m50N4ml81J49
3801i3l8k12K31j06Q8k81J94J38K22k1j06P1R6j1R7j75k42M12n22l2K64j19j64
3824c09L62k29j48J70k11L95R7J83k6mk8Rm3J07l47J66k18J02n2j51j1ol01L61
3848a32k62K85pk49N03J96p0N9j52M53j26l89Q4j62O7k69M9J4j31j09J20J25O5
3871c8j19p7J70K56O1j47K54j04L7N5m50L93j44k47l0M2l83J36l39K38N1J64j45
3894c66NK24K31K29m19N62j37N5M9k65k41O8J3m8l03M8K87l04j58L10j08K33Q4
$$ plain form
3917 49 -11 229 180 467 417 70 442 379 357 285 -40 -189 16 -72 -81 -402 -342 -421 -551 -182 30 -11 -223 173
3941 173 493 373 113 543 222 127 313 158 -258 -210 -273 -20 -500 -384 -406 -305 -383 -323 -95 -78 267 356 283
3964 283 420 601 347 228 79 146 -132 -39 -187 -139 -333 -517 -523 -253 -185 79 -14 -200 244 142 109 418 -45
3987 -45 300 355 100 69 321 -210 -74 -89 -318 -278 -466 -164 -333 -292 -66 223 -70 91 248 262 391 394 336
4010 336 357 134 -5 210 155 -469 -277 -311 -186 -342 -450 -488 -431 155 -32 353 431 321 111 388 282 180
4032 180 63 213 -24 44 -132 -376 -272 -463 -547 -438 -538 -586 -90 -244 62 323 130 280 571 547 419
4053 419 214 -119 145 -35 -155 5 -257 -118 -210 -145 -665 -178 -116 -197 -46 137 162 418 214 576 108 439
4075 439 461 261 -69 -117 -1 -385 -231 -316 -113 -414 -153 74 41 119 147 214 216 315 421 482 333 157 26 362
$$ packed form
3917D9o0K40m9K87n0l47L72o3k2p2l25j49K05q8rl21O0p9j30L69K12m1k12L96
3941A73L20j20k60M30l21r5J86j55m16M8o3K53m80J16k2J01p8O0K28J7L45Q9p3
3964B83J37J81k54j19j49O7k78R3j48M8j94j84oK70O8K64r3j86M44j02l3L09m63
3987d5L45N5k55l1K52n31J36j5k29M0j88L02j69M1K26K89k93J61J57J4J29Ln8
4010C36K1k23j39K15n5o24J92l4J25j56j08l8N7N86j87L85P8j10k10K77j06j02
4032A80j17J50k37O8j76k44J04j91q4J09j00m8M96j54L06K61j93J50K91k4j28
4053D19k05l33K64j80j20J60k62J39r2O5n20M87O2q1J51J83K5K56k04L62m68L31
4075D39K2k00l30m8J16l84J54q5K03l01K61K27l3P8K8O7KR9J06O1j49j76j31L36
$$ plain form
4099 362 -102 53 -222 -353 -394 -382 -232 -354 -374 -172 -314 85 -38 57 479 413 445 203 272 343 137 -50 -84
4122 -84 -28 -296 -198 -131 -292 -383 -286 -358 47 -5 134 99 178 248 302 338 445 303 229 341 78 -60 59 106 -341
4147 -341 -503 -399 -645 -244 -218 -324 -69 -23 242 359 629 453 171 231 186 254 82 155 -424 -320 -340 -356 -229
4170 -229 -180 -274 -461 -293 -37 267 140 393 667 414 325 447 35 296 -60 7 -75 -308 -560 -332 -651 -287
4192 -287 -337 -454 -314 -304 -116 307 288 292 308 314 532 496 362 179 -197 17 -283 -379 -244 -259 -273 -449 -197 -379
4216 -379 -189 -82 161 160 187 255 218 358 254 516 183 115 249 -389 -375 -378 -374 -550 -484 -289 -282 -365 -102 245 281
4241 281 248 349 546 407 383 138 225 320 51 -87 14 -241 -242 -416 -236 -270 -510 -153 -198 393 176 326 369
4264 369 289 436 481 658 213 306 362 56 105 -215 -200 -541 -49 -260 -477 -344 -18 -33 -110 291 293 135 369
$$ packed form
4099C62m64J55k75j31m1J2J50j22k0K02j42L99j23R5M22o6L2k42O9P1k06j87l4
4122h4N6k68R8O7j61r1R7p2M05n2J39l5P9P0N4L6J07j42p4J12k63j38J19M7m47
4147c41j62J04k46M01K6j06K55M6K65J17K70j76k82O0m5O8j72P3n79J04k0j6J27
4170b29M9r4j87J68K56L04j27K53K74k53q9J22m12K61l56O7q2k33k52K28l19L64
4192b87n0j17J40J0J88M23j9MJ6OK18l6j34j83l76K14l00r6J35j5j4j76K52j82
4216c79J90J07K43jK7O8l7J40j04K62l33o8J34o38J4lMj76O6J95Pq3K63L47L6
4241B81l3J01J97j39k4k45Q7R5k69j38J01k55jj74J80l4k40L57m5N91k17J50M3
4264C69q0J47M5J77m45R3N6l06M9l20J5l41M92k11k17J33L26j5p7M01Kj58K34
$$ plain form
4287 369 305 605 340 185 195 -2 31 -140 -220 -149 -249 -381 -605 -142 -282 -339 57 -7 -111 285 499 405 563
4310 563 256 291 437 183 -58 78 -435 -222 -92 -287 -496 -447 -575 -292 56 171 113 376 402 256 495
4331 495 449 356 405 66 -84 -79 -129 -231 -270 -296 -385 -420 -360 -297 -269 200 39 20 428 651 268 455 312 392 145
4356 145 91 9 -148 -283 -195 -191 -408 -382 -193 -347 -314 135 -98 141 108 340 571 448 234 603 462 288 144
4379 144 -206 -344 -414 -273 -470 -502 -531 -93 -176 -458 -24 137 86 176 -6 185 271 404 340 284 256 98 140 -476
4403 -476 -227 -185 -409 -751 -324 -200 -76 -264 108 226 166 530 159 205 157 374 416 237 227 174 -375 -345 -484
4426 -484 -27 -101 -517 -78 -368 -283 -145 -295 295 308 358 500 688 383 -33 24 241 134 -110 -73 32 -240
4448 -240 -241 -376 -419 -18 -190 -629 25 -19 216 228 206 387 357 217 137 513 -46 -197 -274 -162 -165 -277 -184 -372
$$ packed form
4287C69o4L00k65j55J0j97L3j71q0P1j00j32k24M63j40n7L96o4j04L96K14r4J58
4310E63l07L5J46k54k41J36n13K13J30j95k09M9j28K83L48J15n8K63K6j46K39
4331D95m6r3M9l39j50Nn0j02l9k6q9l5O0O3K8M69j61j9M08K23l83J87j43Q0k47
4356A45n4q2j57j35Q8Mk17K6J89j54L3M49k33K39l3K32K31j23k14L69j41j74j44
4379A44l50j38p0J41j97l2k9M38q3k82M34J61n1R0j82J91Q6J33o4n6k8j58M2o16
4403d76K49M2k24l42M27J24J24j88L72J18o0L64l71M6m8K17M2j79j0n3n49L0j39
4426d84M57p4m16M39k90Q5J38j50N90J3N0J42J88l05m16N7K17j07k44L7J05k72
4448b40jj35m3M01j72m39O54m4K35J2k2J81l0j40q0L76n59j51p7J12lj12R3j88
$$ plain form
4472 -372 -187 -337 -69 7 190 274 142 663 214 529 440 264 64 256 34 -19 -21 -254 -267 -153 -539 -355
4494 -355 -150 -236 -67 -116 -47 271 87 305 219 252 670 43 174 223 159 -183 -244 -276 -517 -615 -587 -217 -404 -343
4518 -343 -148 -155 276 213 283 53 544 549 218 408 226 85 -158 -116 -301 -617 -246 -239 -349 -283 -225 -145 -119 -36 141
4543 141 472 266 277 443 355 169 376 23 -1 -114 -199 -133 -416 -308 -456 -466 -52 -16 -530 -60 217 307 398
4566 398 132 516 297 221 215 482 -15 -33 -13 -327 -426 -425 -354 -287 -233 -311 36 -24 43 263 110 246 422 610 425
4591 425 260 31 -197 258 -205 -122 -429 -448 -205 -287 -552 -170 -148 -219 124 -21 162 298 194 421 447 356
4613 356 29 196 220 -64 -40 -65 -391 -428 -434 -357 -242 -379 -135 -66 142 399 495 457 406 400 616 249 94 140 82
4638 82 -191 -246 -152 -211 -542 -587 -183 -46 -288 35 -12 323 301 467 341 344 210 323 39 -67 98 -98 189
$$ packed form
4472c72J85j50K68P6J83Q4j32N21m49L15q9j76k00J92k22n3kk33j3J14l86J84
4494c55K05q6J69m9O9L18j84K18q6L3M18o27J31M9o4l42o1l2k41r8K8L70j87O1
4518c43J95pM31o3P0k30M91Nl31J90j82j41k43M2j85l16L71Pj10O6N8Q0K6Q3J77
4543A41L31k06J1J66q8j86K07l53k4j13q5O6k83J08j48j0M14L6n14M70K77R0R1
4566C98k66L84k19p6oK67m97j8K0l14r9JP1O7N4p8L47o0O7K20j53J36J76J88j85
4591D25j65k29k28M55m63Q3l07j9K43q2k65L82K2p1L43j45J83J36j04K27K6r1
4613C56l27J67K4k84K4k5l26l7oP7J15j37K44O9K08K57R6l8n1oK16l67j55M6n8
4638H2k73n5R4n9l31m5M04J37k42L23m7L35k2J66j26Lj34J13k84j06J65j96K87
$$ plain form
4661 189 -13 -409 -206 -492 -456 -81 -111 208 275 266 117 252 154 305 211 212 215 20 165 47 -20 -175 -462 -325
4685 -325 -358 -628 -280 -83 -145 76 244 367 470 462 409 544 219 344 163 84 -56 197 -63 -146 -403 -526
4707 -526 -526 -428 -359 -249 -272 -103 131 14 295 456 386 198 168 150 110 239 -187 -153 -293 -539 -334 -52 -275
4730 -275 -173 -277 -244 -52 142 -58 432 295 464 283 215 293 99 197 272 -190 -224 -451 -457 2 -398 -381 -366
4753 -366 -237 -169 160 210 118 342 198 241 284 113 498 124 133 47 -24 -168 -347 -298 -501 -111 -439 -203 -227 -41
4777 -41 36 205 432 143 102 217 311 501 242 -177 -58 41 -21 -207 -293 -382 -375 -391 -109 6 16 -50 106 233
4801 233 345 477 685 433 311 338 514 167 -91 -78 -96 -388 -395 -187 -320 -531 -34 -150 -279 326 98 452
4823 452 633 259 102 7 18 452 456 108 -90 -171 -328 -203 -341 -581 -343 -182 -345 -86 -49 212 121 388
$$ packed form
4661A89k02l96K03k86L6L75l0L19O7rj49J35r8J51r4JLj95J45j18o7j55k87J37
4685c25l3k70L48J97o2K21J68J23J03qn3J35l25J25j81p9j40K53k60q3k57j23
4707e26%R8O9J10k3J69K34j17K81J61p0j88l0j8m0J29m26L4j40k46K05K82k23
4730b75J02j04L3J92J94k00M90j37J69j81o8P8j94R8P5m62l4k27oM59m00J7J5
4753c66J29O8L29N0r2K24j44M3M3j71L85l74Rq6p1j44j79M9k03L90l28K36k4J86
4777d1P7J69K27k89m1J15R4J90k59m19J19R9o2j86q6q9Pj6K82J15J0o6J56J27
4801B33J12J32K08k52j22K7J76l47k58J3j8k92pK08j33k11M97j16j29O05k28L54
4823D52J81l74j57r5J1M34Ml48j98q1j57J25j38k40K38J61j63K59L7K61r1K67
$$ plain form
4845 388 243 308 366 214 219 193 422 85 -211 -214 -115 -295 -215 -543 -254 -562 -206 68 87 100 361 269 397 47
4869 47 496 385 168 361 -2 -265 -132 -448 -272 -441 -423 -101 -508 -184 -226 172 112 445 284 243 342 472
4891 472 354 434 86 170 94 -85 -150 -154 -294 -319 -105 -531 -1 -231 -92 36 160 207 532 415 271 185 214
4914 214 397 24 -60 114 -222 -200 -243 -388 -367 -203 -331 -122 -187 14 9 253 313 225 619 476 382 24 -25 76
4938 76 -29 -129 -268 -85 -318 -257 -180 -248 -265 -293 -27 113 134 80 240 392 147 297 519 71 448 102 -50
4961 -50 -385 -461 -182 -71 -264 -312 -216 -303 -28 127 248 122 468 257 440 474 265 268 323 -162 -318 -88 -414
4984 -414 -378 -95 -133 -359 -494 -13 52 -152 29 109 58 153 191 192 351 106 127 24 45 91 -52 -442 -507 -380
5008 -380 -182 -243 -406 13 -41 -124 362 138 367 327 538 361 278 244 194 -34 141 -141 -120 -410 -505 -224 -364
$$ packed form
4845C88j45O5N8j52Nk6K29l37k96lR9j80Q0l28K89l08L56K74J9J3K61r2J28l50
4869D7M49j11k17J93l63k63J33l16J76j69J8L22m07L24m2L98o0L33j61m1R9J30
4891D72j18Q0l48Q4p6j79o5mj40k5K14m26N30k30J39J28J24M7L25j17j44q6K9
4914B14J83l73q4J74l36K2m3j45K1J64j28K09o5K01nK44O0q8L94j43r4l58m9J01
4938G6j05j00j39J83k33O1P7o8j7k8K66J40K1n4J60J52k45J50K22m48L77l46j52
4961e0l35p6K79J11j93m8R6q7K75J55J21j26L46k11J83L4k09LN5m85j56K30l26
4984d14L6K83l8k26j35M81O5k04J81Q0n1R5L8JJ59k45K1j03K1M6j43l90o5J27
5008c80J98o1j63M19n4q3M86k24K29m0K11j77q3l4n0k28J75k82K1k90r5K81j40
$$ plain form
5031 -364 -189 -378 -126 67 98 155 327 370 347 163 238 215 87 188 72 198 -119 -199 -376 -309 -192 -430 -275
5054 -275 207 -42 163 144 141 303 353 297 176 152 198 -42 102 166 -233 -42 -316 -83 -445 -241 -344 -139 -192
5077 -192 -96 100 129 240 347 248 100 165 -198 50 154 51 -388 -215 -594 -119 -284 -308 -404 -278 163 -196
5099 -196 125 -90 229 217 396 320 514 254 378 200 -101 47 -378 -176 -3 -406 -283 -382 -135 -65 -59 73
5121 73 196 279 289 -38 269 304 73 341 210 187 -56 -181 -244 -140 -245 -303 -553 -150 -236 -145 -41 128 192
5144 192 319 313 281 146 293 111 438 310 140 -188 -307 -219 -627 -7 -540 -155 -180 8 -294 -228 -116 144
5166 144 363 144 410 294 312 512 402 -140 11 -100 -158 -302 -176 -90 -191 -249 -105 -28 -111 312 24 3
5188 3 543 302 267 110 288 139 -22 144 -347 -142 182 -275 -261 -180 -272 -79 83 -80 21 89 347 97
$$ packed form
5031c64J75j89K52J93L1N7J72M3k3j84P5k3j28J01j16J26l17q0j77O7J17k38J55
5054b75M82k49K05j9lJ62N0n6j21k4M6k40J44O4l99J91k74K33l62K04j03K05n3
5077a92R6J96K9J11J07r9j48O5l63K48J04j03m39J73l79M75j65k4r6J26M41l59
5099a96L21k15L19j2J79p6J94k60J24j78l01J48m25K02J73m03J23r9K47P0OJ32
5121G3J23Q3J0l27L07L5k31K68j31k3k43j25o3J04j05n8k50M03q6R1J04J69O4
5144A92J27ol2j35J47j82L27j28j70l28j19Q8m08O20n33L85k5J88l02O6J12K60
5166A44K19k19K66j16J8K00j10n42J51j11n8j44J26Q6j01n8J44P7q3M23k88k1
5188CN40k41l5j57J78j49j61J66m91K05L24m57J4Q1r2J93J62j63J01O8K58k50
$$ plain form
5210 97 363 241 225 216 93 153 136 -240 -452 4 24 -191 -345 -279 -228 -222 -35 -108 10 102 335 307 139 180 200
5235 200 122 -26 37 -10 -229 -251 -349 -342 9 -92 -170 -220 -283 -10 203 135 263 244 200 508 248 -11 324 138
5259 138 -17 167 -260 -250 112 -232 -208 -253 -206 -333 49 51 17 -224 90 428 134 152 304 203 343 -102 -85
$$ packed form
5210I7K66j22j6rj23O0j7l76k12M56K0k15j54O6N1OJ87p3J18R2K33k8j68M1K0
5235B00p8j48O3m7k19k2r8PL51j01p8n0o3K73K13o8J28j9m4L08k60k59L35j86
5259A38j55J84m27J0L62l44K4m5M7j27L82Kl4k41L14L38k94J8J52j01J40m45J7
$$ [...]
8191b3
##END NTUPLES=NMR FID
##END=
