##TITLE=1H_Pr Q-3
 200.13MHz, CDCl3,
 8 sc
 
 15.1.2025
##JCAMPDX= 6.0         $$ Bruker NMR JCAMP-DX V2.0
##DATA TYPE= NMR FID
##DATA CLASS= NTUPLES
##ORIGIN= UXNMR, Bruker Analytische Messtechnik GmbH
##OWNER= pz
$$ XWIN-NMR		Version 3.5
$$ Wed Jan 15 15:52:44 2025 Russian Standard Time (UT+4h)  she@DPX200
##.OBSERVE FREQUENCY= 200.1313
##.OBSERVE NUCLEUS= ^1H
##.DELAY= (6, 6)
##.ACQUISITION MODE= SIMULTANEOUS
##.ACQUISITION SCHEME= undefined
##.AVERAGES= 8
##.DIGITISER RES= 18
##SPECTROMETER/DATA SYSTEM= spect
##.PULSE SEQUENCE= zg30
##.SOLVENT NAME= DMSO
##.SHIFT REFERENCE= (INTERNAL, DMSO, 0, 14.3821)
##AUDIT TRAIL= $$ (NUMBER, WHEN, WHO, WHERE, WHAT)
$$ ##TITLE= Audit trail, XWIN-NMR		Version 3.5
$$ ##JCAMPDX= 5.01
$$ ##ORIGIN= Bruker BioSpin GmbH
$$ ##OWNER= she
$$ F:/spectra/data/she/nmr/H-C/1/audita.txt
$$ ##AUDIT TRAIL=  $$ (NUMBER, WHEN, WHO, WHERE, WHAT)
(   1,<2025-01-15 15:51:27.43 +0400>,<she>,<DPX200>,
      <created by zg, POWCHK disabled, PULCHK disabled
       configuration hash MD5:
       00 E9 B6 7A A2 85 ED C7 34 08 36 98 17 FE 4E 26
       data hash MD5: 16K
       E1 0E 2E AC 6E 8F 19 05 45 78 40 1F 51 AB 7A 23>)
$$ ##END=
$$ 
$$ hash MD5
$$ EF 52 05 F2 04 01 12 95 15 FB 1C FD 4A 57 B6 67
##$RELAX= 
##$RELAX= 
##$RELAX= 
##$RELAX= 
##$RELAX= 
##$RELAX= 
$$ Bruker specific parameters
$$ --------------------------
##$DU= <F:/spectra>
##$EXPNO= 1
##$NAME= <H-C>
##$PROCNO= 1
##$TYPE= <nmr>
##$USER= <she>
##$AMP= (0..31)
100 100 100 100 100 100 100 100 100 100 100 100 100 100 100 100 100 100 
100 100 100 100 100 100 100 100 100 100 100 100 100 100 
##$AQSEQ= 0
##$AQ_mod= 1
##$AUNM= <au_zg>
##$AUTOPOS= <>
##$BF1= 200.13
##$BF2= 200.13
##$BF3= 200.13
##$BF4= 200.13
##$BF5= 200.13
##$BF6= 200.13
##$BF7= 200.13
##$BF8= 200.13
##$BYTORDA= 1
##$CFDGTYP= 0
##$CFRGTYP= 5
##$CHEMSTR= <none>
##$CNST= (0..31)
1 1 145 1 1 1 1 1 1 1 1 1 1 1 1 1 1 1 1 1 1 1 1 1 1 1 1 1 1 1 1 1 
##$CPDPRG= <>
##$CPDPRG1= <>
##$CPDPRG2= <>
##$CPDPRG3= <>
##$CPDPRG4= <mlev>
##$CPDPRG5= <mlev>
##$CPDPRG6= <mlev>
##$CPDPRG7= <mlev>
##$CPDPRG8= <mlev>
##$CPDPRGB= <>
##$CPDPRGT= <>
##$D= (0..31)
0 0.7 0 0 0 0 0 0 0 0 0 0.03 0 0 0 0 0 0 0 0 0 0 0 0 0 0 0 0 0 0 0 0 
##$DATE= 1736941886
##$DBL= (0..7)
120 120 120 120 120 120 120 120 
##$DBP= (0..7)
150 150 150 150 150 150 150 150 
##$DBP07= 0
##$DBPNAM0= <>
##$DBPNAM1= <>
##$DBPNAM2= <>
##$DBPNAM3= <>
##$DBPNAM4= <>
##$DBPNAM5= <>
##$DBPNAM6= <>
##$DBPNAM7= <>
##$DBPOAL= (0..7)
0.5 0.5 0.5 0.5 0.5 0.5 0.5 0.5 
##$DBPOFFS= (0..7)
0 0 0 0 0 0 0 0 
##$DE= 6
##$DECBNUC= <off>
##$DECIM= 32
##$DECNUC= <off>
##$DECSTAT= 4
##$DIGMOD= 1
##$DIGTYP= 9
##$DL= (0..7)
0 120 120 120 120 120 120 120 
##$DP= (0..7)
150 150 150 150 150 150 150 150 
##$DP07= 0
##$DPNAME0= <>
##$DPNAME1= <>
##$DPNAME2= <>
##$DPNAME3= <>
##$DPNAME4= <>
##$DPNAME5= <>
##$DPNAME6= <>
##$DPNAME7= <>
##$DPOAL= (0..7)
0.5 0.5 0.5 0.5 0.5 0.5 0.5 0.5 
##$DPOFFS= (0..7)
0 0 0 0 0 0 0 0 
##$DQDMODE= 0
##$DR= 18
##$DS= 0
##$DSLIST= <SSSSSSSSSSSSSSS>
$$ [...]
##$SUBNAM0= <"">
##$SUBNAM1= <"">
##$SUBNAM2= <"">
##$SUBNAM3= <"">
##$SUBNAM4= <"">
##$SUBNAM5= <"">
##$SUBNAM6= <"">
##$SUBNAM7= <"">
##$SUBNAM8= <"">
##$SUBNAM9= <"">
##$SW= 18.0517328524113
##$SWIBOX= (0..15)
0 0 2 0 0 0 0 0 0 0 0 0 0 0 0 0 
##$SW_h= 3612.71676300578
##$TD= 16384
##$TD0= 1
##$TE= 0
##$TE2= 300
##$TE3= 300
##$TEG= 300
##$TL= (0..7)
0 120 120 120 120 120 120 120 
##$TP= (0..7)
150 150 150 150 150 150 150 150 
##$TP07= 0
##$TPNAME0= <>
##$TPNAME1= <>
##$TPNAME2= <>
##$TPNAME3= <>
##$TPNAME4= <>
##$TPNAME5= <>
##$TPNAME6= <>
##$TPNAME7= <>
##$TPOAL= (0..7)
0.5 0.5 0.5 0.5 0.5 0.5 0.5 0.5 
##$TPOFFS= (0..7)
0 0 0 0 0 0 0 0 
##$TUNHIN= 0
##$TUNHOUT= 0
##$TUNXOUT= 0
##$USERA1= <user>
##$USERA2= <user>
##$USERA3= <user>
##$USERA4= <user>
##$USERA5= <user>
##$V9= 5
##$VALIST= <valist>
##$VCLIST= <CCCCCCCCCCCCCCC>
##$VD= 0
##$VDLIST= <DDDDDDDDDDDDDDD>
##$VPLIST= <PPPPPPPPPPPPPPP>
##$VTLIST= <TTTTTTTTTTTTTTT>
##$WBST= 1024
##$WBSW= 4
##$XGAIN= (0..3)
0 0 0 0 
##$XL= 0
##$YL= 0
##$YMAX_a= 189706
##$YMIN_a= -222261
##$ZGOPTNS= <>
##$ZL1= 120
##$ZL2= 120
##$ZL3= 120
##$ZL4= 120
##$ABSF1= 10
##$ABSF2= 0
##$ABSG= 5
##$ABSL= 3
##$ALPHA= 0
##$AQORDER= 0
##$ASSFAC= 0
##$ASSFACI= 0
##$ASSFACX= 0
##$ASSWID= 0
##$AUNMP= <proc_1d>
##$AZFE= 0.1
##$AZFW= 0.1
##$BCFW= 1
##$BC_mod= 2
##$BYTORDP= 1
##$COROFFS= 0
##$CY= -3
##$DATMOD= 1
##$DC= 2
##$DFILT= <>
##$DTYPP= 0
##$F1P= 0
##$F2P= 0
##$FCOR= 0.5
##$FTSIZE= 0
##$FT_mod= 4
##$GAMMA= 1
##$GB= 0.15
##$INTBC= 1
##$INTSCL= 1
##$ISEN= 128
##$LB= 0.25
##$LEV0= 0
##$LPBIN= 0
##$MAXI= 10000
##$MC2= 0
##$MEAN= 0
##$ME_mod= 0
##$MI= 1.114404
##$NCOEF= 0
##$NC_proc= 0
##$NLEV= 6
##$NOISF1= 3.799351
##$NOISF2= 2.8
##$NSP= 1
##$NTH_PI= 0
##$NZP= 0
##$OFFSET= 14.38212
##$PC= 1
##$PHC0= 250.0603
##$PHC1= 14.9922
##$PH_mod= 1
##$PKNL= yes
##$PPARMOD= 0
##$PSCAL= 0
##$PSIGN= 0
##$REVERSE= no
##$SF= 200.129724274929
##$SI= 16384
##$SIGF1= 3
##$SIGF2= 2
##$SINO= 400
##$SIOLD= 16384
##$SREGLST= <1H.CDCl3>
##$SSB= 0
##$STSI= 0
##$STSR= 0
##$SW_p= 3205.1282051282
##$SYMM= 0
##$S_DEV= 0
##$TDeff= 0
##$TDoff= 0
##$TI= <>
##$TILT= no
##$TM1= 0
##$TM2= 0
##$TOPLEV= 0
##$USERP1= <user>
##$USERP2= <user>
##$USERP3= <user>
##$USERP4= <user>
##$USERP5= <user>
##$WDW= 1
##$XDIM= 8192
##$YMAX_p= 0
##$YMIN_p= 0
$$ End of Bruker specific parameters
$$ ---------------------------------
##NTUPLES= NMR FID
##VAR_NAME=  TIME,          FID/REAL,        FID/IMAG
##SYMBOL=    X,             R,               I
##VAR_TYPE=  INDEPENDENT,   DEPENDENT,       DEPENDENT
##VAR_FORM=  AFFN,          ASDF,            ASDF
##VAR_DIM=   8192,          8192,            8192
##UNITS=     SECONDS,       ARBITRARY UNITS, ARBITRARY UNITS
##FACTOR=    0.0002768,     1,               1
##FIRST=     0,             0,               0
##LAST=      2.2672688,     0,               0
##MIN=       0,             -222261,         0
##MAX=       2.2672688,     189706,          0
$$ Real data points
##PAGE= N=1
##DATA TABLE= (X++(R..R)), XYDATA
0@%%%%%%%%%%%%%%%%%%%oJ4j6J6j6J6j6K1k9L2l5M0m5N3n9O6p3Q2r3J01j14J28
$$ 0 0 0 0 0 0 0 0 0 0 0 0 0 0 0 0 0 0 0 0 -6 8 -8 8 -8 8 -8 13 -16 16 -19 21 -24 29 -30 36 -37 45 -48 53 -61 67
41F7j40J54j71J90k10K31k52K77l07L37l72M13m57N04n58O23o97P85q92J022j186
$$ 67 -73 81 -90 100 -110 121 -131 146 -161 176 -196 217 -240 264 -294 329 -368 417 -475 547 -639
62f39J396j680K091k717L782n925J1765n7420j72914J53380K03273o9228j57146
$$ -639 757 -923 1168 -1549 2233 -3692 8073 -49347 -222261 -68881 134392 65164 -91982
75i1982L6954J27895L429p6791k4666m185j2763M1924O4994k8993r0361R36R2117
$$ -91982 -55028 72867 76296 -495 -25161 -29346 -42109 -185 64809 35816 -54545 -53609 38508
88C8508J0870r5527k9269Q5481N4673l4045l5777J169j0885j3053L4060K4357
$$ 38508 49378 -46149 -75418 10063 64736 30691 -5086 -3917 -14802 -27855 6205 30562
100C0562m6675k1657P0016M1524p2081p0247L6963N8161j8188k9413K4131J5672
$$ 30562 -16113 -37770 32246 73770 1689 -68558 -31595 26566 8378 -21035 3096 18768
112A8768k0887p36J3246k4114k8671L9177N7198k6089n8820K4601M9342m0919
$$ 18768 -2119 -2855 10391 -13723 -42394 -3217 53981 27892 -30928 -6327 43015 2096
124B096o2384L9509P2842k9787o8392L8289P0289m8439q9738K9869R1210n694
$$ 2096 -60288 -20779 52063 22276 -46116 -7827 62462 14023 -75715 -45846 45364 39670
136C9670p1326N513O3450l590n4619p826K9310N341n597J6410O569k8694j2798
$$ 39670 -31656 -26143 37307 33717 -20902 -28728 582 5923 326 16736 23305 -5389 -18187
149a8187K4302J282l4332O78M4378J2785l5367j3478K5867j08l1863K944L7134
$$ -18187 6115 7397 -26935 -26257 18121 30906 -4461 -17939 7928 7820 -24043 -21099 16035
162A6035N345k4125K353K0503j1612l0473N624K5354k147j2110J2616J0188k0648
$$ 16035 21380 -2745 -392 20111 8499 -21974 -16350 9004 6857 -5253 7363 17551 -3097
175c097j8891J3502J3181j3806l684K5104Q607k2458p080J5286n749k3495J3733
$$ -3097 -21988 -8486 4695 -9111 -12795 12309 20916 -1542 -8622 6664 915 -22580 -8847
188h847L9523o965m2449K561M1153k913n1181j1424M8826K7108k9975k6350J3515
$$ -8847 30676 23711 -18738 -16177 24976 22063 -29118 -40542 8284 35392 5417 -20933 -7418
201g418J7441o948j2969j445N246J1766J6667l318k8744j1352K3693J5911k1117
$$ -7418 10023 3075 -9894 -11339 -6093 5673 22340 19022 -9722 -21074 2619 18530 -2587
214b587j7753K0980K3545j3466k2744P51P269l628J811J3240J023j3610O82J7287
$$ -2587 -20340 640 24185 10719 -12025 -11274 -4005 -7633 -5822 7418 8441 -5169 -4487 12800
228A2800m723k4123k393K5104J4423j3508j2645N286M802o538l902m03j023N768
$$ 12800 8077 -16046 -18439 6665 21088 7580 -5065 221 5023 -1515 -5417 -5820 -6843 -1075
242a075J3002K27j9979j0588J6663J2189j4891r821J7591J6996j0601j8288L431
$$ -1075 11927 12154 -7825 -18413 -1750 10439 -4452 -14273 3318 20314 9713 -8575 -5144
255e144R761n537n209Q793O218n452n249K605q06r811j110J1571M855m899j24
$$ -5144 4617 -920 -6129 2664 8882 3430 -1819 786 -20 -9831 -10941 630 5485 586 462
270D62L186l198o538J938O473j811k179J0113N493j2626j1257N739R750n555j0145
$$ 462 3648 450 -6088 -4150 2323 512 -1667 8446 13939 1313 -9944 -4205 5545 -10 -10155
285a0155Q349J3025n374j2218j390M795R63j597L744M498j905l3K631m815p711
$$ -10155 -1806 11219 5845 -6373 -7763 -2968 -2005 -3602 142 4640 2735 2702 5333 518 -7193
300g193L025R143J790o400j259O103k717r334j088N737J610j299L025M595m171
$$ -7193 -4168 4975 6765 365 -894 5209 2492 -6842 -7930 -2193 -583 -1882 1143 5738 1567
315A567q068K640O242k927k808N881O500k076q345j129K894k194j243L706J275
$$ 1567 -6501 -3861 2381 -546 -3354 2527 9027 6951 -1394 -2523 371 -1823 -3066 640 1915
330A915j131n1j21k898n319J252Q268J529m114J252M161q03o567k150N394L269
$$ 1915 784 733 612 -2286 -7605 -6353 1915 3444 -670 582 4743 3940 -2627 -4777 617 3886
346C886k118O33K278k580l949j710R52m45r01M221L743k854l284m26R82J68j39
$$ 3886 1768 2401 4679 2099 -1850 -3560 -2608 -3053 -3954 267 4010 1156 -2128 -2554 -1572 -1404 -1543
363a543K460K868m08l09R42l550m773J364M764J785l606k296L550N69m703l324
$$ -1543 917 3785 3377 3068 4010 460 -4313 -2949 1815 3600 -6 -2302 1248 1817 -2886 -6210
379f210R49M320L475m9j235j492k48K212k90l844K15N410L784k613o100j515K397
$$ -6210 -5261 -941 2534 2485 1250 -242 -490 1722 1432 -2412 -2197 3213 6997 4384 -1716 -3231 -834
396h34M0j495l55J936J583M59j627j500k047M26L590K617R6j246J11N26q08k226
$$ -834 -794 -2289 -2644 -708 875 1334 -293 -1793 -3840 -3414 176 2793 2889 1643 1754 2280 1472 -754
414g54j093J000J913J636p05k903j449o55L0O75J032J187l24P22K592j95m738
$$ -754 -1847 -847 1066 2702 1997 -906 -2355 -3010 -2980 -2305 -1273 -86 -410 312 2904 2709 -2029
431b029k436L898O336j32o163j995M773K457m471o110N31O313L111k583m190k085
$$ -2029 -4465 -567 5769 5637 -526 -2521 2252 4709 238 -5872 -5341 972 4083 1500 -2690 -4775
447d775K467M270j55m889k423O764Q481l312j0289k773P675O658m871p817J758
$$ -4775 -2308 1962 1807 -3082 -5505 1259 9740 6428 -3861 -6634 1041 7699 2828 -4989 -3231
462c231P777J013o707n300J550M143J579j65o18j515K05K612N22k033k866K033
$$ -3231 4546 5559 -1148 -6448 -4898 -755 824 659 41 -1474 -1269 1343 1865 -168 -3034 -1001
478a001O038J322n037m429J882L999k012n051J967N305j672m051J83L544j275
$$ -1001 5037 6359 1322 -3107 -1225 2774 762 -4289 -2322 2983 1311 -2740 -2557 987 -288
493b88n322J681Q703J960p921m110O271P076n689r066K871Q889J087n095l956
$$ -288 -5610 -3929 4774 6734 -1187 -5297 974 8050 2361 -6705 -3834 5055 6142 1047 -2909
508b909o03J546J979K060l220o130L812J0473O38j1814p610J0021J3366l822j4564
$$ -2909 -3512 -1966 13 2073 -1147 -7277 -3465 7008 7646 -4168 -11778 -1757 11609 7787 -6777
523f777q42J2716O283r695j0261K716Q828J957l512m571j255K865L109O18m209
$$ -6777 -7619 5097 11380 1685 -8576 -5860 2968 4925 1413 -3158 -4413 -1548 1561 2179 -2030
538b030m625L043R490K555q488p716N089J1458j794j1919j721J0538N174p900
$$ -2030 -6655 -3612 5878 8433 -55 -7771 -2682 8776 6982 -4937 -6658 3880 9054 1154
552A154q626L567P116k537m979J974M210j607l982K886M595l940n049N028O712
$$ 1154 -7472 -3905 3211 674 -4305 -2331 1879 272 -3710 -824 3771 -169 -5218 -190 6522
567F522k060o261l83M410k9l032O37J044k281q31L742J856n716o420N384J0083
$$ 6522 4462 -1799 -2182 2228 2199 -833 -196 848 -1433 -2264 1478 3334 -2382 -8802 -3418 6665
583F665k246r059j420R367M857p516o729M002O453J367m042m488M30L629P14j965
$$ 6665 4419 -4640 -6060 3307 8164 648 -6081 -2079 4374 5741 1699 -2789 -2359 1270 1984 19
599A9k867j521L372L901N02n323n105M523Q030p54p725k348P669O100n203r139
$$ 19 -2848 -4369 -997 2904 3406 -1917 -7022 -2499 5531 4777 -2948 -5296 2373 8473 3270 -5869
615e869J618Q535J812o810m368M410M377l580l758J002J122Q39J405P67j969j287
$$ -5869 -4251 4284 6096 -714 -5082 -672 3705 125 -3633 -2631 -1509 -670 735 1502 -467 -1754
631a754K312K230j834k505K096K416q03k426m27K084n35l143k65L193P02k327
$$ -1754 558 2788 954 -1551 545 2961 2158 -268 -695 1389 854 -2289 -2554 639 1341 -986
647i86k291K345K166k020j002J244R79J240J51o70q13j02O12L31o39j063l3M56
$$ -986 -3277 -932 1234 -786 -1788 -544 435 1675 1826 1156 343 241 853 1184 545 -518 -551 -95
665i5J229j147k862j44K885J879j804l076J280L905L53l061j988K601L658p33
$$ -95 1134 -13 -2875 -3019 -134 1745 -59 -3135 -1855 2050 2403 -658 -2646 -45 3613 2880
681B880l477j34J987L83j390j483K58N22O24l1j128q38M59Q07L4k48O38J168J03
$$ 2880 -597 -731 1256 1639 249 -1234 -976 -454 170 139 -989 -1827 -1368 -561 -527 -775 -137 1031 1134
700A134k86R5P6o09m13P57P55m11k070j81J464m97j439l01P75J422l53p52J65
$$ 1134 848 943 1019 410 -3 754 1509 1098 -972 -1153 311 -186 -1625 -1926 -1151 271 -82 -834 -669
719f69M74Q42k21n43N53J086N2r02l53k28n1Np82L71L65n91j66j04J35l21l97
$$ -669 -195 647 426 -117 436 1522 1574 672 319 91 40 45 -737 -366 -1 -592 -758 -862 -727 -1048 -1445
740a445R38J315m4n50J39L25N59q13j21M42K22K15r08q58N9N62q16o30j41J277
$$ -1445 -507 808 764 214 353 678 1237 424 303 745 967 1182 274 -584 -525 37 -779 -1409 -1550 -273
760b73N93r03q59J232P41L2o59o9J821J60j172k81j30K27j19n22K7l8p4m17k59
$$ -273 320 -583 -1442 -210 531 563 -96 -165 1656 1816 644 363 233 460 341 -181 -154 -192 -266 -683 -942
781i42l78O43mn18J044N60K7j22n15Q16J050q32n98N69J03J85j055q77K72M3m03
$$ -942 -1320 -677 -681 -1199 -155 405 432 310 -205 611 1661 829 231 800 903 1088 33 -844 -572 -529 -932
802i32M58m40J87L79m49O7M63l33R75N20mj65J51o4K21o82k50J46k74L18m83q22
$$ -932 -474 -914 -727 -348 -797 -730 -267 -600 375 895 891 726 877 813 1034 352 102 248 -26 292 -191 -1013
824a013k89M40M45k80n34O30J719o07j097L99N37J082p72o78O77N13m33k48j071
$$ -1013 -1302 -862 -417 -697 -1231 -601 1118 511 -586 -187 350 1432 660 -18 659 1172 739 491 -580
843e80Q3O71j91o73n72J18J023J89j460J22Q14J293K08r55J03J100N2m43m60m72
$$ -580 -497 174 -17 -690 -1262 -1144 -121 68 -1392 -1270 -456 837 1045 90 193 1293 1345 902 442 -30
863c0L29M74k68n18j051p6Q92k65q00J61O66M95L11p48J92L89J41J127l03q75
$$ -30 299 773 505 -13 -1064 -1140 -248 -513 -1313 -1152 -486 9 320 -428 -236 153 294 1421 1118 243
883B43R0L42M53o87j440K99Q91j63p56J37l92L53J75M91j41r49N37J774K97j057
$$ 243 333 675 1128 441 -999 -700 191 28 -728 -591 -983 -630 -455 36 -105 -1054 -517 1257 1554 497
903D97r02O29J419j68j627l20N08L73K11j350j052O23R91R45j535q06R37J361
$$ 497 -405 224 1643 1475 -152 -472 36 409 620 -730 -1782 -1159 -168 777 -758 -1564 -627 734
921G34k71p91J88M99R31J65l23n36j047O07J382j026j721j94J680O67j969j208
$$ 734 463 -328 -140 359 1290 1455 1132 596 -451 156 1538 512 -1209 -1403 277 944 -1025 -2233
939b233J803Q22j202N2J265M40j240j1K074K36k300m90K000P20j639j372P15J005
$$ -2233 -430 392 -810 -758 507 947 -293 -304 1770 2006 -294 -784 1216 1936 297 -1075 -360 645
957F45q71o15J02k91j66O55Q50l78j350M58K159N90j209j297R08J805k4j651j591
$$ 645 -226 -841 -739 -1030 -1196 -541 309 -69 -1419 -961 1198 1788 579 -718 190 1995 1971 320 -1271
976a271L49K377L42l022j130J551K015q96k281N15J716O1k14K87m21o37Q18J971
$$ -1271 -922 1455 1797 -1225 -2355 -804 1211 315 -1966 -1451 265 326 112 399 -22 -659 159 2130
994B130p5k848j250L629J550l374l202K306L400j695l487J369K666j290j634J177
$$ 2130 2055 -793 -2043 1586 3136 -238 -3440 -1134 2266 571 -2916 -1547 1119 -171 -1805 -628
1010f28J608q32j356K017J440j632j831J721J448j014k222O74J762n16j995N96
$$ -628 980 148 -1208 809 2249 617 -1214 507 1955 941 -1281 -607 1155 639 -1356 -760
1026g60N97q21j83O47R22o30j215R82J058O41l46j586J68K070N02k170j252R63
$$ -760 -163 -984 -1167 -520 402 -228 -1443 -461 597 1238 892 -694 -526 1544 2046 -124 -1376 -413
1044d13K247q69k668L02J445J98j247k03J053j17p16J060J973k497j529L000K575
$$ -413 1834 965 -1703 -1401 44 242 -1005 -1208 -155 -272 -988 72 2045 -452 -1981 1019 3594
1061C594k630l373J690M183j564l978N51K839k76k450k90J693l0j127N40J636
$$ 3594 964 -2409 -719 3464 1900 -2078 -1527 1312 1036 -1414 -1704 -11 -41 -1168 -628 1008
1077A008j103j119J387J406m82k151R86K323j118j962P24J208o49j144J20N59
$$ 1008 -95 -1214 173 1579 1097 -1054 -68 2255 1137 -825 -101 1107 458 -686 -566 -7
1093gl69l38O51n90k35P14J85l58k0O85M09o40l24J220P31j060j186Q85P12q27
$$ -7 -376 -714 -63 -653 -888 -174 11 -347 -367 318 727 87 -237 983 1714 654 -532 353 1065 238
1113B38j299N50O86j490j29K238q30j301K40K399P7k763P20K631k39k132j27J602
$$ 238 -1061 -511 175 -1315 -1444 794 -36 -1337 -1097 1302 1379 -1384 -664 1967 1728 -404 -531 1071
1131A071M93j654p41J227M9j264Q0Q53l90j133L65K032p53j827J454J821j112
$$ 1071 1564 -90 -831 396 445 -819 -739 114 -276 -1409 -1044 988 235 -1592 -138 1683 571
1148E71j183R07J118p58j020J101L04j158j16Q01p21q34mQ28K79j035j27J316
$$ 571 -612 295 1413 655 -365 736 1040 -118 -234 567 -154 -988 -992 -164 115 -920 -1047 269
1166B69or78K34P51M96o07K04R61n90j243O21J065r77j019R82M27j394q67J525
$$ 269 263 -715 -481 270 766 159 363 1324 734 -509 112 1177 200 -819 163 590 -804 -1671 -146
1185a46O36j486l62J147Q14n26n07J205M23j235NJ033M04j370o52J286P6j457
$$ -146 490 -996 -1358 -211 603 77 -430 775 1198 -37 -32 1001 1405 35 -617 669 745 -712
1203g12k33J181k33j373M21J286k33j238Q54J055o03p21O64J235p78r19M85J201
$$ -712 -945 236 3 -1370 -949 337 104 -1134 -280 775 172 -549 115 1350 572 -347 138 1339
1221A339r55p36N52J91r08m02O49K63p52l27R64P73j309m7J157Q3n13MR71o8r73
$$ 1339 384 -352 200 391 -517 -919 -270 -7 -759 -1086 -122 651 -658 -705 452 535 22 26 997 929 -44
1242d4J3J218p94o75K83J71l37j058M35J167q13p22P89M96l38q8N25P39m18r01
$$ -44 -31 1187 393 -282 1 172 -165 -1223 -788 379 -434 -1156 -367 129 -209 -297 228 967 549 -352
1262c52J102M41r18m36P31J64q66n90O67R3j241O56O01o11n33L02J318n0j247
$$ -352 750 1191 273 -163 568 732 -134 -724 -57 36 -1205 -549 52 -559 -1092 -790 528 478 -769
1281g69J015P26m32l93J00O80J1r52jP53q35o16N19K78q52k80M21O91m40m32O28
$$ -769 246 972 540 147 247 927 938 -14 -15 738 -97 -713 -194 84 -768 -1048 -627 64 -376 -808 -180
1302a80O66m03J06O66R0n88K3M20l47o78K3Q28n74n09j48K58K43n07l52J178m82
$$ -180 486 83 189 855 945 357 380 800 453 -225 -202 626 52 -457 -605 -347 -104 -611 -963 215 -267
1323b67j15O70J14j3rk2L75j80l91N61J9q73j75J54J75m47o37M99L09n62q4Q82
$$ -267 -382 288 402 389 380 358 733 553 162 723 742 -131 -306 -152 23 -424 -1061 -562 -253 -815 -899 -17
1345a7j47q9mQ53L10n33l78R88n48m3j65p3L10q00pM19m45l30L98k56J39J40J41
$$ -17 -164 -253 -257 596 906 373 -5 983 435 392 227 154 464 -336 -343 76 -369 -699 -301 -557 -418 -278 -137
1368a37J83O6j90J51K09N5M22j72k56O6P1J29m88m38J39Q6k94n1o0l5J47K1j61
$$ -137 46 112 -78 73 282 337 759 587 331 397 468 597 109 -329 -190 -104 -398 -449 -509 -544 -397 -376 -537
1391e37M34J78j54N87k59K06k19j5M33m16n69L99r9j62m04k53N43j68J46K72l22
$$ -537 -103 75 -79 508 249 455 236 221 654 238 -331 68 -31 -193 -597 -850 -307 -475 -329 -57 -379
1412c79J92Ok0N37p9J6q2L81m8k6m36j05Q2K69p12J31k15o8L94k79J37o7J47N1
$$ -379 -187 -181 -201 336 257 273 191 572 524 498 62 -43 39 308 -404 -273 -488 -556 -162 -441 -304 -371 -224 -173
1436a73K59q6K95q6M95L2l22k62j32L99l2l40n24J86O88n38m62j99N05K05pm3
$$ -173 86 0 295 209 704 736 414 152 20 419 387 47 -477 -291 397 -141 -603 -802 -297 -92 -99 -142
1458a42J77L42l60J6N42N7m12R3P09m43n86k83M41K10r36q5M34M5l53o5K82L96
$$ -142 35 377 17 33 575 632 220 313 1022 579 -7 -290 151 361 -575 -660 -226 -181 -534 -599 -317 79
1480G9k58k96M00L73j94j37K97M05j78n04k39Q60m06n87p0K7K14m4m88K19M39
$$ 79 -179 -475 -75 298 104 -33 264 669 491 -13 -252 608 202 -385 -455 -428 -214 -258 -746 -527 -88
1501h8k83K62n1J77J0j37M23L52l07j46K33K20n9o50o75O68L58j046p3L32M95
$$ -88 -371 -109 -160 17 27 -110 313 665 358 212 445 665 606 -44 -719 -51 307 -739 -812 -480 15
1522A5l88m08M46P47n17M4K74M23k64n16M90O55p62n18M97J12q7j021j14J121
$$ 15 -373 -781 -335 412 -105 -61 213 636 372 -144 346 1001 239 -279 218 330 243 -778 -892 229
1542B29m13m91J28N48j84j26M3O64m5p08P31M56l41q7j50R8R9n40j23K61j76k30
$$ 229 -184 -675 -547 1 -183 -309 -266 398 353 -355 376 832 491 404 254 352 451 -89 -212 49 -127 -357
1564c57L9k54J52q4L63j68J36K98J38m12M79L55l47k56K40J39l32q7j65M1j62
$$ -357 -318 -572 -420 -504 -141 -309 -173 125 263 -149 330 685 338 82 322 461 129 42 -123 -82 -244
1585b44k26K88k02O0j71j04L26O22p59M07N40k34j89l6P47j23n03m44O32j9p34
$$ -244 -470 -182 -384 -324 -495 -599 -273 349 -410 -3 537 303 114 78 825 702 199 -245 387 368 -366
1606c66K10J57L6n34o0M42Q7m88J30J75L34j76J40K47l51M11k31L28p32N2O38
$$ -366 -156 1 37 -497 -557 -115 -28 -516 -386 -211 123 -53 87 334 -17 394 163 491 -241 -189 449
1627D49o81L2l53K66J18q70M05O49k20k21M84j5J37k72K66N48o41k25O18k40J4
$$ 449 -232 -200 -553 -287 -169 -1039 -634 15 -205 -426 58 43 180 -92 174 722 81 -144 474 234 248
1648B48l86J09L23n10l66J85K04l47l83P46M30l58j04J73O74n23j60M30K78l9
$$ 248 -138 -29 294 -216 -582 -397 -193 -540 -923 -177 253 -105 -209 -36 638 115 -45 385 663 624
1668F24m63J21L07p33R1K25q7k79j58K1L17n70n9L90J49Q7J54K80j37j85K46M01
$$ 624 161 282 589 -144 -53 172 85 -194 -352 -331 -14 -584 -643 -253 -104 -17 137 417 280 95 341 742
1690G42l94j02R8l41k4j92K30j82k55j37J22M61l37Q9J88K88j80k33N78k0k52
$$ 742 348 246 344 3 -21 -213 17 -165 -420 -557 -435 26 -311 -222 -34 254 74 -159 419 399 147
1711A47r4O32k70n23J67J58r8n58K9O54n79m86N42J92J3r1J36K15r7K3K98N0J34
$$ 147 53 685 415 -108 59 217 119 -439 -410 244 -335 -821 -279 -87 -74 -165 -29 186 89 112 410 460 594
1734E94m29J06P5l07l17K01k08m8m2J08p7M4k01J35L14l59M67L43k54r1n9L90
$$ 594 165 271 346 39 -278 -77 -285 -333 -375 -267 -344 -300 -501 -366 -52 -411 56 399 145 54 -5 385
1756C85o1k67N65n6p13R0J67k48j06l35Q9P13p42O1J15K94j31K14O1J85j46j70
$$ 385 324 57 622 566 -147 -57 110 -138 -244 -579 -490 223 -519 -458 -343 -49 -180 34 95 280 134 -36
1778c6N82k23m61J49Q5R3l23L5J69m1j74j96K48k33q2K30J86K4O7K64K33m37k24
$$ -36 546 323 -138 11 96 189 -134 -99 70 29 -145 -341 -93 -326 -408 -178 8 32 99 363 596 159 -65
1801f5N27m3m10k4Q9J72m35j40K14j62l0k79N15K25n92J73L39J78m36J08O29k00
$$ -65 462 419 9 -15 74 246 -189 -329 -115 -277 -307 -586 -71 154 -438 -265 74 252 -184 -76 553 353
1823C53n78J39N46l5n45j31N73m89m9o0k41N2j38L52J78J36j71K68m2J61J28k33
$$ 353 -225 -86 460 425 -120 -251 322 -167 -216 -276 -517 -465 -603 -251 -73 63 -108 160 118 279 407 174
1845A74M75o02J25Rk06m36M61M6r7j33L9m2k10n14N52M73l61n9M20L60j00l74
$$ 174 649 47 172 181 -25 -461 0 46 -51 -184 -145 -187 -397 -911 -359 114 -247 -306 114 474 374 0
1867@K68N53o25n03N65p3j47l65J62L27n57k11J71L91l35K27o4L90P0k08K7M99
$$ 0 268 821 196 -307 258 185 38 -327 -165 162 -395 -606 -435 -44 -379 -152 -216 174 244 36 63 562
1889E62k38j47K6p5j8o5p3K7j39j24J0O8j86K69k33p7M85J06r3k16M7M90K7K5
$$ 562 324 177 203 128 110 45 -28 -1 -140 -264 -254 -186 -372 -103 -336 -413 72 178 85 -131 -84 406 433 458
1913D58k42l1k47Q8j85J03O1p02L71j92M93k23j25K87J92k20P6K16Lj42K54P0
$$ 458 216 185 -62 26 -159 -56 5 -697 -326 -518 -25 -248 -373 -86 106 -114 -38 178 181 39 293 363
1935C63M8J1j86q8P1l43j5K06P4n47l3R3l2M3J59P5k6R7L17j68K32j20Qj86J66
$$ 363 411 422 236 148 219 -124 -139 67 141 -406 -439 -346 -378 -335 -176 -101 -127 -30 287 119 351 231 239 53 219
1960B19J77j87l08n3j2j34k18J27J18K15k72m4J42J80K24l24L24n2M22l47K01
$$ 219 396 209 -99 -152 -164 -298 -516 -389 -271 -56 -328 -372 -230 -50 174 -150 174 122 544 197 398
1981C98P5j92j27K9p0j69k52J33r7l82M39j45pJ29Q9k02N03J07l6j91kK19K46
$$ 398 473 281 154 183 113 -56 -308 -175 -272 -654 -215 -360 -367 -238 -149 -351 152 259 223 32 30 249 495
2004D95m50K51P2m43p6q0k62P6j86K58M76k92l39n1O37J25k92M34o2l42M36m53
$$ 495 45 296 368 -75 -151 -231 -493 -417 -603 -345 131 -161 -500 -551 86 211 -81 353 291 -51 385 -68
2026f8L11J27o7n5J37m24j35j25k97K33N5J47m18L67pL01j61K92l3n5J57p1K47
$$ -68 243 370 303 248 385 -39 -174 -299 -596 -363 -308 -161 -579 -212 -219 82 -79 213 180 125 282 211 458
2049D58q8k80M2j35j15n4j02J15J42o20O4M46j08LL94m4m9j04J82K52K57l72q0
$$ 458 370 90 132 -3 -118 -172 -274 -159 -17 -637 -573 -127 -235 -232 162 118 69 -35 147 399 656 284 204
2072B04Q4Q8k31j95r4J34m58L6M82l87PJ62k0J66J9ML30l3j06J09N4l3J36m48
$$ 204 288 376 145 -50 -144 -10 -468 -432 50 -337 -330 -168 -188 -22 -3 1 331 298 192 301 355 322 458 10
2096A0O6r5l41J52N6l50M73j09J20j42m9J65n1j10M90r5j20Q8R8m6j92rk8j34
$$ 10 76 -19 -360 -208 -152 -502 -29 -138 -18 -160 -209 -44 -95 -205 285 190 70 158 256 210 18 9 -19 -153
2120a53L23n60M09j8l62J05k07O67m48K2K53Rr1J47j18K35J43m3J20k8l03j76
$$ -153 170 -390 19 1 -361 -256 -463 204 -244 -222 31 40 -51 96 -22 213 356 313 433 405 102 -74
2142g4j13R1n5m4o5l45R1K90j8r6M88l34L62j90N0k8K75P6l46J49P2l7k06J2R9
$$ -74 -187 -96 -151 -195 -260 -605 -514 -224 -242 -338 150 -184 178 -12 38 10 285 361 15 164 236 199 -7 5 104
2167A04m14o0L57p3k40K43J35j51J34o4J26J01j10J51o1K3k83L64j38l7k43L2
$$ 104 -310 -370 -13 -86 -326 -83 52 -99 35 -29 97 198 88 239 178 201 -82 282 144 107 -136 -104
2189a04J39j63k26J91J11o2j83K60K64k70M7k0L60Q8p38Q29k58R4k76M08m98j78
$$ -104 35 -128 -354 -163 -52 -114 -297 -37 227 -43 4 -16 344 432 -306 523 265 359 83 491 -7 -185
2211a85l6j71O50m74K1k35M31k37j58O83p7N8k32K61j77q9J28L03n07M5J88q6
$$ -185 -221 -392 258 -216 -195 -430 1 -236 -394 289 212 270 38 299 122 33 161 464 -43 2 190 104
2233A04J63p31K58J91l97j86M23Ll8K63N4L38m52K2K23j08K23j11L2n4l60J57
$$ 104 267 -464 -206 -15 -412 -598 -175 -172 -210 53 107 445 -7 15 238 130 353 242 274 220 -140 17
2255A7j3k28j95K88j0j91M06m37M16o1k32M63R4k99K3L44j58J02L7j74K64p12
$$ 17 4 -224 -419 -131 -141 -332 74 -363 53 -8 -240 223 317 18 41 385 227 329 366 192 456 -256
2277b56j11L65j67P6j54K5J71o0k42K93K52l85L63K33l40L1N3k75L43j37J48k11
$$ -256 -367 -2 -169 -93 -247 -222 -51 -111 -353 -60 192 -193 170 403 63 94 147 -128 215 78 226 15
2299A5j20n1l2K30J35o43M00J9K12o16L00J00L24k46m2K74j61OJ52O9k86L28j78
$$ 15 -105 -156 -188 42 177 -466 -66 -47 165 -451 -151 -51 273 27 -15 259 98 104 256 325 39 367 189
2322A89k06o9p3K06j34j74J63j87K06P8J09j67m1j0M74J80m85K3L70j89m46Q9
$$ 189 -17 -86 -159 47 -87 -261 -98 -285 -79 -1 108 -59 -100 -110 364 544 59 82 452 263 -183 -94
2344i4J79Kn24R8J55PK14k82Q0J68O3L1n0J67n8J3q7J62k1m1L7k44j42J69j07
$$ -94 85 87 -437 -339 -184 -177 37 -245 -165 3 66 97 47 214 156 169 82 244 223 182 219 -25 -167 2 -105
2369a05OK15l26P4O8k90K55m1J86j51J23J31pn0J08J29jj79k53M3j12L0R2k27
$$ -105 -99 116 -210 -136 -68 -358 -103 -144 42 -109 14 145 138 88 196 325 324 145 -108 -65 -177 -147 -55 -282
2393b82J06l7j82L63q3lL21k49J55O5m8qK57k93Q9K16k89K11o17L06j68J64k20
$$ -282 -176 -213 -395 -32 -115 -118 203 -46 109 174 126 118 375 82 171 387 98 309 -308 -2 -170 -6 -226
2416b26K16r7m6k15L56n7j14L84j21L48k26k70J96j39mJ26K2l90K14j11J96k47
$$ -226 -10 -107 -153 -368 -12 -69 -183 201 80 428 202 -68 128 -11 -15 111 133 -257 -43 -154 42 -205
2438b05k44L63j59k6L17j34l7M33k22K6p0K59k41K62k75QJ01K61p67L79j41j10
$$ -205 -449 -86 -245 -271 46 -88 -125 308 86 112 42 301 60 322 47 55 156 417 -350 29 -112 -222
2460b22J10k20K50l8m7J00K22l56J66j7K3L63l37K32q2j48k7p5j85J03J38k37
$$ -222 -112 -332 -82 -120 -167 -67 155 -201 -35 -52 -29 334 -3 229 147 -1 -28 -103 -288 -185 -47 -284
2482b84J46j10J44k2m8K94j42JL6j6L46j49J30m7J2k59J80k93R2j75J16k91K67
$$ -284 -138 -248 -104 -126 -174 120 -22 -21 15 -1 345 196 326 279 291 32 212 -81 11 -164 -48 -339 -72
2505g2j70k8J43M3K2K08l20J83l2l3R6J40J16j0m93L95j60N3J7k88j4L34k76j38
$$ -72 -242 -270 -127 -84 -62 146 -174 9 -23 -56 40 180 296 286 -207 188 28 81 98 -190 -204 130 -146 -284
2529b84M10l54L1j33N89k27J95l69M22j31k7K6J02k69K6r9k28N35l22J99j55j24
$$ -284 126 -228 -197 -330 259 32 227 -142 280 149 122 148 250 -19 7 -92 -320 215 -107 92 -63 -187
2551a87l4l17L28K43N2j65J33k22J90K38k21N43l99J20k94k57K32J22k61j01O0
$$ -187 -221 -538 -210 33 85 -80 53 -169 21 259 38 581 182 302 8 -249 -17 105 -156 -257 -197
2572a97J1k51L42k32J00J74J37K51m32M25m08L23k10M47n01m5L26l14p3J31k05
$$ -197 -186 -437 -95 -327 -227 -53 84 335 -97 328 -80 243 33 480 -21 -66 260 -54 -127 4 -201
2593b01O6L8j9M5j30j63k0J73K0M89l93J67k03N01m92R3J67Ok93J4K09k38K34
$$ -201 -135 -97 -116 -71 -201 -364 -384 -211 -191 298 -95 72 -131 370 -122 -29 138 144 -149 -135 74 -164 70
2616G0q7n34L62J02r9N3m9M35q9k52M71j00j31J5J4J85l33J95k69K9k74R2m6L64
$$ 70 -17 -551 -189 -87 -186 -133 -182 253 164 -88 383 283 152 167 181 366 33 228 -41 -12 -286 -194 -240 124
2640A24k13k60J42J78J21j24q4L76l08J38K35j25N7m9R1k88j3L55m06o4j01L70
$$ 124 -89 -349 -207 -29 92 -32 -116 260 -48 90 325 200 257 208 299 11 -2 353 -53 -117 -218 152
2662A52j91j79K82k93J23J14L4L29j93l31K67Q1o5Q0q6Q8lm69j6O11m68r6K92
$$ 152 -39 -218 64 -229 -106 8 42 371 178 -153 114 195 130 210 124 212 209 -260 -276 335 -133 -229 63
2685F3j73k6j13J84J97l93O6K27K28r9j30l0K30m63J19K42K7J77m86q0J53j56
$$ 63 -110 -136 -249 -65 132 -261 -195 32 260 161 31 1 231 -232 -113 129 156 333 -153 -233 -80 -236
2707b36N8m7K3J87k16K58J00l1J88j05p4J15nR6j05j13o6J57l41r5j14J92J79
$$ -236 -178 -225 -202 -15 -231 27 127 96 284 179 105 220 215 311 206 93 27 184 -157 -252 -366 -174 5
2730Ep6q5Rp4K71M7k76j93M84N6P2R0j96P1L0j77k14M78j11o58J93J95Q1J73n50
$$ 5 -71 -156 -147 -221 50 97 -179 -372 112 168 240 330 134 205 235 58 -156 322 211 -447 -254 -59 22 195 -355
2755c55K31j58L91j90K57J60k46j61M30k19o6K60k9k52Rn32M75k74r9K48J44k66
$$ -355 -124 -282 109 -81 176 336 90 -71 359 140 74 334 305 53 62 -470 5 -269 -368 -120 24 -242
2777b42m4L15j69Q0K66k74J50o7K74l5k44j53P4J13J41m03P6K58l14J21J40k75
$$ -242 -286 29 -140 -60 206 -68 82 15 289 254 10 -143 -69 44 185 -218 -142 116 -198 -77 63 -212
2799b12N5p2J11JlJ02J63J82k37M9j34R1m2l14K06M87o38j50K73j04j98L06j21
$$ -212 -157 -229 -118 -117 -120 -18 145 327 90 139 5 96 54 -260 -54 433 -205 -355 -82 -186 -384 -78 -199
2822a99L24l69K17J17j8N6j15J82N8QQ1k32j25J1K21l90m9R2qj5j63n9L28J58
$$ -199 125 -244 -27 90 72 128 13 195 253 261 342 110 -15 -4 217 -173 -222 -130 -138 -153 -316 -375 -47 111
2846A11l93K59L21l71m1L4J93K15n33L53P7j81P5l1l09J60r5L38J30l32k15m8
$$ 111 -282 -23 298 -73 -114 -80 113 328 -205 148 225 44 119 88 -221 -61 -156 182 312 -20 -235 -283
2868b83M37k08K04k53J25N19k83p2q0J9m8L70l51r3k25K11nk05L89q9j87j16J52
$$ -283 154 -54 150 -103 22 541 258 186 106 125 77 447 96 3 -222 -11 -16 -221 168 79 -108 -224 -72
2891g2j98L84k42K49p0K71p8k57J49J72m9k20J11j21K1j60J74l03K53j28K24j62
$$ -72 -270 114 -128 121 51 322 244 -13 136 308 259 39 150 29 50 -110 64 -239 14 -114 110 -52
2913e2l09M50P5j29Rj6K91m58L92K9J5k20j29R2K36m15M1j05m6J25k44O1J68J17
$$ -52 -361 89 164 35 44 28 319 -139 253 282 297 77 -52 40 276 -139 -98 -203 -249 -124 -368 -307 -139 -22
2937b2j93L67l08L27o5l31M41j62j07R4j89q7J87j49l4J79P0k78M3P7j29K58j8
$$ -22 -215 152 -156 171 106 -225 216 54 -53 41 -148 -235 -48 -197 -231 -52 18 -260 -217 -140 -269 -11 -29
2960b9L8j7P6k40O67j23m18K41l56J64J92k35KJ28k36j61J02J26l5j34Q7L74l84
$$ -29 9 -8 68 -172 495 372 -46 195 -161 3 195 -40 -38 90 -146 -307 -205 -79 -114 -248 -161 213 -171
2983a71k6K78K48j51k8jP8k50k1J49m9r1Q1Kn4K31m57K31l27K54J16R7j65k06
$$ -171 -197 81 329 178 150 149 227 -23 -44 105 56 -35 46 48 -6 225 -232 -1 -328 -74 42 139 -26 -232
3007b32L06k5j93L22k07J69q0Q9k47kk04K1K67m4J55j38j72J37J87j34o4L96j33
$$ -232 74 49 -144 178 -29 140 60 149 -98 -100 -304 -283 -16 -60 95 -43 -215 -78 109 -25 -89 307 174
3030A74j59nL20m52q4J51L84m06N7L9q3mL4J77l29q3m3K30J71k48K62L54m11k36
$$ 174 15 10 330 -122 -206 -55 329 -77 -20 19 -64 -68 -34 143 -186 -269 -312 -82 89 -159 103 457 46 -190
3054a90L20j77M3P6r7j65r8Q0J89K8j80j37J9J53J22J6J26m1m4M22l11j93M94
$$ -190 130 -47 -4 72 -25 -190 -288 -208 -19 9 -171 -308 -289 -136 -14 2 128 87 43 465 154 -39 455
3077D55l06k45K38Rk01J34k1j70k3J71k47J13l0N1J90j87L8LP5J44l08L36q2J08
$$ 455 149 -96 142 151 -50 84 63 -107 -130 41 -206 -93 -123 -72 118 -69 -31 -28 47 191 -117 219 137 245
3101B45k57R1l21L22Kk67L93n3o0M0k65p5K2J32o5J38l7J55n1J76r0k3m8J18m8
$$ 245 -12 79 -242 80 82 -185 208 155 95 135 -130 -205 -183 -51 -116 22 -15 140 89 265 175 152 104 222 174
3126A74k52lJ35l5p3p4m5J99rm9J14j26J82j06j94K59J41l56L02P7j50OJ12k86
$$ 174 -78 -81 54 19 -54 -128 -173 26 17 -32 82 -44 138 32 -162 97 238 -118 184 261 111 117 229 -57
3150e7R4l02j94K12J29K29k39KL37l04J32L7Q1J16K6j87q3j34K84j06j05O8l09
$$ -57 37 -265 -459 -247 -118 111 -128 -126 211 -93 39 76 157 273 299 112 29 -105 179 73 -32 36 -273
3173b73L6L09j63%j73K22n2P9m2p4K08k41L1L19l8N2k27r7J25k87M38R6k86j02
$$ -273 -237 72 -91 -91 -264 -42 -94 -15 -57 -131 77 -164 -133 186 148 200 -27 -124 1 -286 152 248 -38 -140
3197a40k1K8Q9j20o1L63n59M23K1k29K58J12j10j52K54k41J4M5K78j5k97k35L96
$$ -140 -161 -133 -44 -164 -225 138 -421 2 23 -206 52 164 54 -98 156 -85 -71 -26 252 237 -60 -295 101
3220A01j04nj15K38k14J01Mj86J47K28l6q1K38k81k1j86K10p7N48o21K32q5J53
$$ 101 -3 -8 -123 115 -99 2 6 -180 -33 195 159 78 316 35 14 -172 38 -39 509 -112 120 35 188
3243A88r0k43K30k48J25J39j8k82M57m7m26O59k10J17j26K72l96j39k1k10R0P2
$$ 188 98 -145 85 -163 -38 101 83 -199 258 211 -215 444 234 351 225 497 101 -38 -59 -269 -179 -107
3265a07J63j96J04j83OL1K83o8j33L09P5j25k31P1L2Q6q4J2J34k67J9J59j21j10
$$ -107 56 -140 -36 -219 -213 -182 101 33 -100 209 284 159 -72 -1 31 117 33 45 179 -88 -69 90 -31 -141
3289a41m2O2j2J82j1J80k23K7m9J11j29J95l1o0J46n7op3R1q2M1J9j59k86O06
$$ -141 -183 -121 -133 49 38 218 -5 22 -27 84 -45 150 119 59 205 148 142 69 160 78 119 138 -21 -307 299
3314B99m30J2J23j29M30k23J1j47M27k67P2k9j52O5l48K88J68k03O3m23L29m53
$$ 299 -131 -119 4 -125 305 82 93 -54 373 106 178 149 -3 62 -286 2 170 -33 30 -393 -64 -517
3336e17N13k22J22l0J16K50l23J74N9Nj91Q2j60J62k24J86K91m24q1K01j51J5
$$ -517 -4 -226 -104 -134 -18 232 -91 83 142 147 -44 38 -122 40 -184 2 293 -131 -212 -11 -162 -147
3358a47k2L27p5r9R0q6p1j54L65n9j71JO6K3j13J87q1Q5l50R9J06mKj01J75KJ09
$$ -147 -169 158 83 -16 74 -12 -83 -237 128 69 -102 -101 -35 -12 -125 62 -19 66 -284 -185 -79 -83 -81 -182 -7 -5 104
3385A04k01L36m47N12r2k53J09J77k04m4Rj30L3R9k97L47k4k26P3l0J11k29M37
$$ 104 -97 239 -208 304 212 -41 68 245 41 -3 6 -124 -91 8 -289 58 34 -192 -119 -149 -38 -267 170
3408A70k95L52n81O09J40r1l24J28L00q0p09M55m4k74K13l9J0K73m78P6P6J5K76
$$ 170 -125 227 -354 255 395 304 -20 108 408 328 -381 74 30 -244 -31 -70 -60 213 -265 -189 -113 -98 178
3431A78m07K12l0K19j13O1j52J59k62K84l2k85k09L70J53j80N4j62O6K43k98J03
$$ 178 -229 -17 -47 172 59 120 -32 127 -135 149 117 -168 -377 -7 146 -34 20 -142 -76 167 -131 -28
3453b8qL01k63J86k39K74O2l32M06l11l8k62P6K21j1P6nl44r4N36j24M7J8j94
$$ -28 -36 265 2 188 -51 223 285 -47 359 48 10 -252 -176 45 34 110 105 -239 -333 203 79 126 144 -50
3477e0L3Jj59p9L85k67L07k31J14N5k42L5J62j2N3k6k26Mk2J58j30j5J52J10K50
$$ -50 -17 -16 -175 -254 131 -136 171 -60 54 109 -133 -98 64 52 105 79 -147 -143 -165 -7 -137 -152 0 110 360
3502C60k07p4j87K78k88J34K9k00M46m89L63j77j51N5k9j18J05N4J89M7K55m31
$$ 360 153 79 -108 170 -118 16 45 -155 291 -198 165 -12 -163 -108 -137 -255 -150 -96 93 140 395 -36
3524c6J18K79j18l40K75k70JL23j52l67K54N5j68J91Q1K27j52pj88K55o5o0R0
$$ -36 82 361 243 -97 178 -92 -91 232 80 -287 -33 22 -146 45 126 353 201 194 6 261 196 136 226
3547B26j46k17q0M13k04L3N7j13J11p5M1j74j40K43j59K35N5k02K87j01k88J72
$$ 226 80 -137 -217 196 -8 25 82 -31 80 5 46 -128 -268 -25 -184 51 106 -96 191 90 -198 -26
3569b6K84m5r5l08J93n1k0j05K07m2M27p47L21k4j69L3l53L70O5J11p8K09j79
$$ -26 258 213 118 -190 3 -48 -68 -173 34 -8 419 -328 -7 -31 -200 -167 -520 -150 -85 26 -52 157 -22
3592b2K86k05n4Q6J02k26O6R4j72q6N2Q5m1r3kK12J15j79k56L60j98J57kk35J58
$$ -22 264 59 5 91 193 -33 33 127 -45 -131 -79 6 -35 -128 -130 82 197 18 -238 122 -76 81 79 -156 2
3617Bl51M24n0J22%j90k3j37J70mj93P6J49k71L08j41r0M49k20J47j21R9M6j57
$$ 2 -349 75 25 147 147 -43 -66 -203 -33 -37 -230 -154 -5 -276 32 -109 -199 250 30 177 56 155 201 44
3641D4J22l06L24l59m7O9j20J41J29k84K15J85J57k72j21K55O3k42K3L53l68K67
$$ 44 166 -140 184 -175 -222 -153 -273 -132 -3 -287 -72 113 270 -2 -123 132 195 -47 -24 329 -39 228
3663B28m61R7K35J84l13L17m79J09j38K90k64K90Q6j60No2rM6O7j65J45r4K66
$$ 228 -233 -136 99 283 -30 287 -192 -83 -221 69 -195 95 181 21 26 -36 -45 1 68 -97 48 -46 220
3686B20k46O8N9j1o0p7j8K26j87j2m3j59K17jn9J01m1k75K34N3k8Q6j87R8o4K39
$$ 220 -26 42 101 90 30 -47 -65 161 -26 -38 -81 -240 -23 -24 -83 18 -23 -298 -64 -11 -39 47 -140 -42 -106 133
3712A33J78k74j61j3o6L44k67M8J18l86L89j01K65j36K2j98J82m13M53j25K41
$$ 133 311 37 -124 -137 -203 141 -126 -78 40 -346 43 -58 207 71 93 -105 77 -336 117 -8 233
3733B33k29r3j88J28J65p4J37r6o6j9J11j54L10r9j1J41k88K00k16P0K37r7Qo7
$$ 233 4 -89 -277 -149 16 -58 79 -17 -83 -102 9 -145 165 66 55 196 -92 108 -108 -38 199 102 110 43
3757D3j11L5P7j01M3j01l9m8J22j4OJ57j79J04J48j45k55J87Rj85K49k00K09j36
$$ 43 -68 -33 44 -57 -14 -115 -154 -202 -80 -94 -88 69 -110 -6 142 -3 -258 -71 -62 -247 2 -198 11 -125
3781a25K11l38J69r0M59l32M2LJ49k42M4q5K32P3o7K36l52l0n8J96k45J78j01
$$ -125 86 -252 -83 -173 286 -46 -4 -1 148 -94 -50 -135 97 170 103 339 -13 -43 -101 95 -150 28 -73
3804g3P1k4n4J02j40R6K11M1l98L19o1K3j65n8K21l7k2l66K07J13L4k78L86o20
$$ -73 -2 -26 -80 22 -118 -22 189 230 -168 151 90 113 -52 -110 111 74 52 -314 -107 6 40 -238 148 -472
3828d72M61k64N5K54n7J10m5K10k08M3J29k79r3P4M95l50M1j08K00j64q0K3M7
$$ -472 -11 -275 -220 34 -23 87 42 252 44 87 216 -63 -156 -82 413 63 104 -4 196 32 -48 -25 22
3851B2j69l11K87K34n9n3J81L5l24J72J95q2M8l6r4k79O0Q6p6K49N3j26j48j3
$$ 22 -147 -458 -171 63 4 -49 132 167 -157 15 210 128 176 140 46 -233 -173 -87 -163 86 139 13 -135 -148
3875a48J28Q3K83k57Q5l05L05J5Km02J48L50j41j76m1j42K11K7K00k91P1n6O7
$$ -148 -20 63 346 89 174 -131 174 189 191 -211 -63 287 146 -30 -71 -213 -2 25 225 -66 5 -51 16
3898A6J13L98n94J34J96k61J90j11k16J14J64k36L03k20J28k01l0j8L65k96OJ54
$$ 16 129 527 -67 67 263 2 192 81 -135 -21 143 -93 210 -10 118 -83 -113 -131 234 -62 -56 98
3920I8l29L36k60j17J71J70j41J14M8k71J11J23k01J34j87J64L1j61L01j23l09
$$ 98 -231 105 -155 -272 -101 69 -72 42 90 -181 -70 53 -148 -14 -201 -37 -6 -167 134 11 -298
3941b98J41j55J69K01k01J30K6j20L23j94P9J19k38K48j63r5R1K63m54P1J22n58
$$ -298 -157 -312 -143 58 -143 -13 13 -107 216 22 101 220 -18 230 67 -28 63 326 -128 -57 65 -493
3963d93RO19k65R4N7j13M52j43l16K67j24J35j97K20l36M03k63O1j40J04j85Q4
$$ -493 -484 135 -130 -36 21 -92 360 217 -99 168 44 179 -18 202 -134 269 6 67 -73 31 -154 -70
3985g0r3K01j16k63N52n65K69L45k21R5q0K13r7o6J22k09l8n6J23m56L74L19k01
$$ -70 -163 38 -78 -341 211 -354 -85 260 39 134 54 267 170 104 226 17 -21 -77 46 -410 -36 283 82
4008H2k15J15j46rJ87k1l1O1K45R2l67N2Oq7j20K06n6J69l57QL10k26q1J42j13
$$ 82 -133 -18 -164 -173 14 -7 -38 23 268 360 -7 45 51 -36 -156 50 -6 163 -194 -186 124 -102 -183 -41 -154
4033a54J94r6K15r6L0j75r1J55L66k11k98J09O7k3j23l3J70j63J47L1R7J06j93
$$ -154 40 -56 159 63 93 -82 -173 -18 348 137 -161 -52 15 -8 -131 -164 6 -157 -10 21 118 224 31
4056C1o1n3n7K97k01K10N20n68j18J67j77J79Pl86N8N5K32k65o8K68k20K54k13
$$ 31 -30 -83 -140 157 -44 166 686 118 0 167 -10 169 176 -210 -152 -97 135 -130 -198 70 -150 104 -109
4079a09L38j72j01K42q8P2k46K99k25J50j74J52j42k30K82j46L8R6j95L8j31J37
$$ -109 229 57 -44 198 110 182 -64 235 10 160 -14 138 -4 -234 48 -98 -60 36 -159 -121 -252 -115
4101a15K91n9j79N7L97j75n1J35m79J08J18j78k2j64M22k11J2J08j74n4M12l20
$$ -115 176 117 -62 -5 392 217 166 301 -178 -70 48 -130 -152 -316 106 -105 -93 15 -159 -213 199 -121
4123a21J98m01J76J35N7j37p3J58r1K44n7Po3j59K51l18J33q7p4J48j49J97j79
$$ -121 77 -324 -148 -13 44 -93 -166 -8 -99 145 88 95 32 -127 124 -194 -61 -148 -222 -74 -223 -26 -205
4146b05M84m61J98k5J48ok27K21o7j16K04J5j37k09J18N5J86j41K8j7j46j01K15
$$ -205 279 -182 16 -9 139 133 -94 127 60 -56 148 163 26 -183 -65 -10 176 35 63 46 -100 -201 14
4169A4J2m8K37K9k05j29K02L9j53J27j34k12L83j76k5l57K84j11L59j5p0L7k79
$$ 14 26 -22 215 244 39 -90 112 151 -2 125 -9 -221 162 -14 -39 -396 -112 -223 136 121 51 88 -191
4192a91R1J6O2l8J5k84M21k43K69j41P3J1k89L40J7k42K54j48L9j69J75l7j03
$$ -191 -100 -84 -22 -60 -45 -329 92 -151 118 -23 50 61 -228 112 129 -113 141 -7 32 -137 38 1 -102
4215a02p9J81j27R5J67k74Q0j44L49k99R7K08l27J61J1j10k29K88j10K66o0jJ18
$$ -102 -181 0 -127 -32 135 -139 -59 -203 146 -153 -56 152 -175 -14 -3 -113 -342 -54 -164 102 42 41 159
4238A59k20p2K82j96J13j56L23k21j7K10k53L44l03j29J51j20K22k83K41K2J9
$$ 159 -61 -133 149 -47 66 -90 233 12 -5 205 -48 296 -7 -136 15 -105 117 -166 75 97 116
4259A16L2J7p5l10K36k65J85L0pJ54j58J85l93J30K6J14j3K2N3j86K28j35j04
$$ 116 148 165 90 -220 16 -249 -64 -34 -41 113 -45 140 -253 -123 -97 17 4 26 79 -107 121 -14 -118
4282a18j28j7L9K61j80M39k80N8J02Pk03q9L1m6O6J8P9j27p1L7K86k2k32K73n3
$$ -118 -246 -263 -224 37 -143 296 16 74 176 183 -20 -109 -78 -124 -58 -40 39 -88 -159 -122 164 142 -90 183 130
4307A30k05j69L10L97l61Q8j76k06M3O0l1M2RK1J55j9J57k29P3J43l67K62o9m1
$$ 130 -75 -244 66 463 102 190 14 -192 -149 -89 -120 -78 -69 -48 107 88 245 16 89 232 -135 127 58 17
4331A7L27j85n1j27M1j28O1O0l8J5o5J35k60K02J11l0q7R6j35L5L21j6o7j49K1
$$ 17 344 159 108 -19 22 -106 -45 15 -23 -8 -73 62 -198 4 115 85 -2 94 -41 -6 315 299 232 83 104
4356A04k08J52N8k29K22k42J55l26K36K30k16R4n06M83j9l8K06r9k35M40j99k01
$$ 104 -104 48 106 -123 99 -143 12 -314 -78 152 -64 30 -476 7 -12 -50 156 57 -178 262 63 -138
4378a38J44k14N33j74k24j30J45K2P4j10K39m73P13n70J44M7j0K7m1nO8K15j74
$$ -138 6 -208 325 151 -73 -203 -58 -36 38 -72 167 -306 407 -163 -19 28 18 45 4 -1 67 282 108
4401A08j43n6J58m33L77j27J55j33J7j43K13L01l93M3K36J99l70K7r1j28L33p2
$$ 108 -35 -91 67 -366 11 -116 39 -94 -77 -220 -7 294 -99 -56 180 379 9 36 -55 -183 150 78
4423G8l73K94N6m5J1R7nj19q1p0R9j5M0j87K96j79K86m04O05k26o7J47j71o1l61
$$ 78 -295 -1 55 10 21 118 113 -6 -87 -157 -58 -73 -33 -220 76 -103 183 -221 384 158 91 238 67 6 -355
4448c55N32p5l15J76L1k76J48L60p5J23k0k24k8j49o6K03M2m8J8j88J98R5Q3k85
$$ -355 177 102 -213 -37 -6 -282 -134 226 151 274 254 30 2 -147 -213 -10 32 -16 2 -186 12 107 190 -95
4472i5J87k45q6J92P6Jk8K01n06K17R3k2j9r8O7N0K49m80n5J33J79l3Q3j6m11
$$ -95 92 -153 -239 -47 29 30 2 203 -303 -86 7 -15 -34 -132 -65 -15 234 -246 -301 -168 11 -22 61 45 -366
4497c66L38j29L69k93n4P0j54L20j00p2P5j33J48k50L04o3K12j27m9j94n3Q7J4
$$ -366 -28 -157 212 -81 -135 -65 -219 101 1 -71 4 -129 19 -231 73 10 222 95 46 -148 -201 -114 -100
4520a00J57j99k7q4L64r3l05j7J53K27p3KK93l27K43k67J99j00m6P6k39J55J12
$$ -100 57 -142 -169 -253 111 18 -287 -304 -151 76 3 5 298 -29 214 -53 146 46 0 76 -163 -8 104
4543A04j54JK8J5P8K55j50k56M6oJ04J70j72q2L1l16j3J85O1P7r9m8L1K08jq9
$$ 104 -50 -49 -21 -6 72 327 177 -79 -33 -39 65 235 63 -19 12 -304 -317 -132 -71 6 -93 -141 -110 98 97 8
4569HK14l45J48K86k79L9j16L54j22K07n11K4m8J9P6K2J33k66P8j29J66k4L06
$$ 8 222 -123 25 311 32 71 -45 309 187 394 -117 -93 -141 -122 -46 -24 109 -157 -79 -208 -42 -66 240
4592B40k08J84k27J96k04p0J04j44L53k71q2K12l86M12j58N41m45j7K00j48p8
$$ 240 32 216 -11 185 -19 -89 15 -129 224 -47 -129 83 -303 109 -49 492 47 30 230 82 4
4613Dl4J0j33K99j62N7j25K26j83J92J30m15M00l51j29J79q6L01j99j46K18R6
$$ 4 -30 -20 -153 146 -16 41 -84 142 -41 151 281 -134 266 -85 -214 -35 -121 180 -19 -165 53 149
4635A49n2j01j85K50l68M7K83K34j85m6m2J17j49k2L26k98J24L6k80K46m9k15
$$ 149 97 -4 -189 61 -307 -260 23 257 72 26 -16 101 -48 -70 256 -42 82 118 -162 84 35 -180
4657a80J81QK01j99J86k64J13k33j7J69j18O9j1J23n6j76M77m40L58j43k98J04
$$ -180 1 9 210 11 197 -67 46 -187 -204 -35 -153 -84 -95 28 -28 -204 273 -167 191 48 -250 -146
4679a46J27p6J39J23o0j16j06O0R1K2J40j95n8J69m11K44P2J05k3J80m70J86J39
$$ -146 -19 -95 44 167 107 -9 -115 -55 36 58 198 3 -55 114 -297 -53 19 124 101 281 -189 -3 136
4702A36k59L63m84K14k04K05N0L9O4j46j9k1J53r3j73M67l01J51q9j87K49j90
$$ 136 -123 240 -244 -30 -234 -29 21 60 124 -22 -41 -62 91 -2 -175 292 -9 142 53 -134 115 -75
4724g5O7q0K21j18N6k53J26J8L21q9l25L02K20n61J60j37J9K87p8j93j11M06j07
$$ -75 -8 -88 133 15 71 -182 -56 -38 283 194 -131 171 391 -170 -10 -147 -128 159 81 -112 -223 183 76
4747G6j19L35k06k5J10K2l6R6p0j30J24l07J05J42Qj88J23q2M6O2k90J37l5J49
$$ 76 -43 292 86 61 171 193 157 253 183 53 177 -130 -25 117 125 -63 60 -22 24 86 -204 -67 -102 47
4771D7l9J56m84L26j50J17n1J74j19j49L58j91J56l36L38Ok48j05Q9j64L14Q2
$$ 47 8 164 -320 6 -144 -27 -78 96 -23 -172 186 -5 151 -185 153 159 -89 -194 -105 -269 45 127
4793A27k85K42q5N3l1r9J26k89L45k00N6k51K80j45K37Q9k39O2k49J2K16Q0J27
$$ 127 -158 84 -1 52 21 -78 48 -241 104 -96 -40 -291 -11 -156 81 170 -69 -7 -256 -244 -28 52 179
4816A79lk05p2M26n31L45j71lK59k67L70m70J81K29j50k89L41j55K16Q1m48K08
$$ 179 176 -29 -101 325 -206 139 -32 -35 224 -43 327 -143 38 267 117 -172 169 14 230 311 -137 71
4838G1k36K38J2k06J80o9k43K22K73l16o5k8j62N21N2j48j64N8J43p2n0k5R7R5
$$ 71 -165 73 85 -121 59 -10 -253 -31 242 -74 -139 -167 -329 192 244 96 -68 -10 133 61 11 -14 83 178
4862A78j6k44r6K06O3m5p5j48L02k75k5N5O3J39j49oK39j77j20R7np8N5K08R1
$$ 178 162 -82 -178 28 91 46 -29 -177 125 -150 -175 -120 -57 82 -67 -73 166 -11 -131 -34 -39 -117 -62 146 237
4887B37j34j37J64l6o8J54k01l7L6M1P8j87j26J18K88l86R5l9r6K21N8L1p0K7
$$ 237 103 -34 130 94 26 180 -21 -58 -22 19 97 -90 -216 -98 190 -196 -101 -140 -236 -15 43 74 4 31
4911C1R5l13J17R8Q4J26l89J59J95l64n8K59L43l51m4m9l02K91K13rj90J58j4
$$ 31 126 -187 -70 28 112 238 -151 8 203 -161 -219 40 383 32 -12 -61 -363 -72 141 132 -58 100 86
4934H6R0k45O2M5j05q8K52p5r3RK58j26k02oK15k63O4j4K00J4k20n8L09Ln1R0
$$ 86 176 -69 -7 38 -67 -155 97 22 -71 -62 196 70 -132 -138 77 -186 -122 -136 64 78 -142 -200 109 112 61 151
4960A51j39l3k10K81r4k39K14Q2o4j79NJ41M0K69m5l20J91%J0l53K74J18l28J64
$$ 151 12 -21 -231 50 -44 -283 -69 13 -51 -230 -225 -84 -44 225 180 -140 51 51 61 -292 -18 100 -228 -64
4984f4N8N1n3n3J2K12k30Q3J8l47L86k02m4L42k39l6P7K19j72%K45l67K11j84
$$ -64 -6 45 -8 -61 -49 163 -67 16 34 -313 73 -129 -173 169 -70 -106 -29 190 18 18 263 -104 107 -77
5008g7O3J21Q3j67J69r8j35J55J0K43j68m24K97j5p6J14J75k18k69K70J3l12M87
$$ -77 -14 107 190 23 192 94 -41 114 124 367 199 -225 72 57 -19 95 270 52 -217 53 66 -246 241
5031B41j88O9K5K11j58n01K16O5M4P4j55q3M05n4j52r1j70J91N7k06J84K52k44
$$ 241 53 122 147 358 200 -301 -85 -20 24 98 -57 -140 265 211 59 -32 -202 -11 46 -160 24 276 32
5054C2j12P5l9P7q0K02l05J39j07K1J44k99N3K57m8J95l62K45j17J27q0K63m9
$$ 32 -80 -5 -44 33 -47 155 -150 -11 -118 -97 47 -252 -199 58 10 205 -157 88 -29 98 18 281 232
5077B32j97l4n7N2j42nM1P5M4K38j86P0M4o5K0o4n9J1Km23K24M5P1K21m11J92
$$ 232 35 1 -56 -4 -146 -151 -110 -35 9 247 61 131 175 110 130 66 7 18 20 -403 -179 -134 -63 158 -253 -61
5103f1K78j00p3O5l95J05N6N85m24k13L83k78k15K11J72m55M79l38R9K01k29K71
$$ -61 217 117 44 109 -286 -181 -125 460 36 -177 206 -72 -287 -76 96 -359 120 -218 -119 82 -147 124
5125A24l58K60j55j37J45R9L4L18l70q1N17o27Q5J30j20J34J00j56M0j19L92k32
$$ 124 -234 26 -129 -266 -121 -22 12 330 -40 -121 396 -231 -146 -16 -136 -2 98 -58 -18 -137 255 23
5147B3P7p7k85L14l23J43M9J53M0k81K51n0k7M9p2N3M9J7r4M19n49pL39j85j47
$$ 23 100 23 -262 52 -271 -128 -79 74 114 -167 84 34 7 56 -16 37 86 103 9 428 -121 -128 211 26 -121
5172a21L12k58K9J02j69K29r4MJ23K6l13K21k86L56k08J02N5p9J61k46K2R0m9
$$ -121 191 -67 -38 64 -105 124 30 34 157 183 -130 91 -195 161 -47 55 110 31 192 -54 -32 58 9
5195IJ21k35q4P3Q4L1j95J73O4O0n3J51j41k27Q0j24K30K46n51L47k73K02j12
$$ 9 130 -105 -189 -116 -32 -1 -196 -23 41 101 48 199 58 -169 -89 -213 17 263 -288 59 -214 -12 -124
5218a24R9R4l26N84m42L13Q0j00m36L04j27P6N6m0k7j5K20l81L44k61J3J14N4
$$ -124 -25 69 -257 327 -115 198 278 178 -258 46 -81 -5 51 11 -16 -31 189 -192 152 -109 -96 18 72
5241G2r5k15J63r0K15p4K18j44j90R3J41O5j59R5Q1k05n6l5J40r6J8k12K45K9
$$ 72 -23 -238 -75 -165 50 -24 194 50 -140 -47 94 159 0 95 176 -29 -85 -120 20 -76 -58 -270 -25 4
5265Dp6J85k62O9K44j80M7m9j05R2P0o2m7Q4l01M49k88K59k76J76m9l1O8j20K34
$$ 4 -72 113 -149 -80 164 -16 31 -18 -123 -31 39 -23 -70 14 -287 162 -126 133 -143 33 -16 -47 21 -99 135
5290A35l3m24J30lL14j56lm5J56m7Lk8n2k74J31L49k23J51j90J22P4K56j29j25
$$ 135 102 -322 -192 -195 119 -37 -40 -85 71 24 27 -1 -53 -327 -196 153 -70 81 -109 13 87 343 214 89
5314H9L0k26L37k42K3rk2P9k36K74k72m6K12k27K27K52k22K41l07N9j90L05K93
$$ 89 119 -107 230 -12 11 2 -20 59 -177 97 -175 -221 -9 -236 -9 243 21 262 -45 14 -176 129 422
5337D22l01j41O3O2j56N7j23K18P3j1j47K59m15M4j10K08J11m35Q5J82M5o2J16
$$ 422 121 -20 43 105 -51 6 -117 101 174 163 16 275 -140 -96 -206 2 113 -322 -237 -55 -10 -72 44
5360D4j48L31k27K59n03R2K33K31l38m1k1r2K4K22l32L86l22L21j36r9J75j37
$$ 44 -104 227 0 259 -244 -152 81 312 -26 -67 -88 -180 -156 66 -266 120 -202 119 -17 -116 59 -78
5382g8P8n2J3M3J00M5j83J11j97j81M00L30m76J46m10M37r7J88j65K3K37m43K71
$$ -78 0 -52 -39 4 104 149 -34 77 -120 -301 99 429 -47 99 -311 126 29 217 52 75 312 -131 140
5405A40j35j71K63j12J14k22j34r1K20M59l65%k62K64P3j44K2J81j59J23MK05
$$ 140 5 -166 97 -15 99 -123 -257 -348 -128 331 -34 -34 -296 -32 41 -103 -81 100 -59 64 68 273
5427B73l48L3j07J82j43K7J72J39j63l88K63J82k52N6l3L62l85J11J80k08J34
$$ 273 -75 -42 -149 33 -110 -83 89 228 65 -323 -60 122 -130 -74 -107 255 -130 -19 161 -47 87
5448H7J22k72K41k4p7r8J08o9j9j52j08K68O7R9j75r3L21k59P1L85l69J25j75
$$ 87 209 -63 178 154 77 -21 87 18 -1 -153 -261 7 74 173 -2 -95 226 -33 38 423 54 179 4
5471Do6o1N7N8q2j7kL28n15K25J94l5j22j17L51k80J09j87J4k2K57k08LP6j00
$$ 4 -62 -123 -66 -8 -90 -107 -109 219 -296 -71 123 88 -34 -151 200 -80 29 -158 -144 -166 91 -117 -114 -38 -138
5496a38K9j39L0J14Q1j56J06p6RK27o9k11P2J06J56k20k7K65o2l30J41J52K81
$$ -138 -109 -248 -218 -104 -23 -179 -73 -149 -140 87 18 -193 -121 -15 141 -79 -106 159 97 -233 -92 60 341
5519C41l34K7J97on16L36J46k29O9k5k24L80m99K27J14k28L90m45K23q8M7K76
$$ 341 7 34 231 225 -291 45 191 -38 31 6 -218 162 -337 -110 4 -224 166 -279 -56 -144 -97 179
5541A79l69M2J20L28o96M36q6J11j85J86L2O3j54O8k67L15k60L33l7j64j29J07
$$ 179 -190 -148 -28 300 -396 40 -46 65 -120 66 98 161 7 75 -192 123 -137 196 159 -5 -134 -27
5563b7N4j14l9J32k04J62o3k16J36q4L39j87k19J74L28k85K32R5j07k10J7k9L62
$$ -27 27 -87 -126 6 -198 -36 -99 -315 -179 -263 76 -111 -330 -156 172 -113 119 214 107 -103 -86 -115 247
5586B47k76j60L09R9k40j40R3o1L43j81J63l21K12j07R5n3J24q6j32K19M3k2l81
$$ 247 -29 -189 120 219 -21 -161 -68 -129 214 33 196 -125 87 -20 75 22 146 60 -72 147 190 168 -213
5609b13K67j35J43j67K29K29m11L1J2j0M3j30J99j85O5Q7k7PJ52l80J0L98l33
$$ -213 54 -81 62 -105 124 353 -58 -27 -15 -25 18 -112 87 -98 -33 54 27 34 186 -194 -184 214 -119
5632a19L38L8j60q4P6o0k61L2K99n5j73R1o2L75j60Jj02L0j71K03m3j55J53Q7
$$ -119 219 257 97 13 89 29 -232 -200 99 44 -129 -38 -100 275 115 116 14 44 -127 76 33 -122 31 118
5656A18l40j47K77j43J77J78l19M0L27P2k77K61m0k47J53J23J65m05K18r0j19
$$ 118 -222 -369 -92 -235 -58 120 -199 -159 168 240 -37 224 184 -63 90 213 378 -27 191 101 -18
5677a8J88j66j35K15j20J47j24n1m3p8K0R6Q4k52L04j89j23J35J87j10K45j79
$$ -18 170 4 -131 84 -36 111 -13 -64 -107 -185 -165 -69 15 -237 67 -122 -245 -110 77 -33 212 33
5699C3J07p6j22j31J31l1J6K0k98J42J30N2j86K06k48J28K44J1Q2j20j38N2j00
$$ 33 140 64 -58 -189 -58 -89 -73 -53 -351 -209 -79 -27 -213 -7 -255 -127 117 128 210 90 -48 4 -96
5722i6k17M37p0m2O9j79L7j42K09j29J8K17K3q2oj00J66n23L15P6p1K18l43L64
$$ -96 -313 124 54 12 81 -98 -61 -203 6 -123 -105 112 135 53 47 -53 113 -410 -95 -19 -90 128 -215 149
5746A49j22J58m6r6q2J01K34m37K87j93J5pJ39J33j66l46M18Lp8k29k23M32J52
$$ 149 27 185 139 43 -39 62 296 -141 146 -47 -32 -39 100 233 67 -279 139 142 64 -165 -388 44 196
5769A96k6j70lL3l39M79L2l64N2m2l1O0J53j01P4J52mj65q2M6r8o6L15m97O00
$$ 196 170 0 -3 30 -309 170 202 -162 -110 -152 -183 -123 30 -71 3 155 151 -14 -96 -50 -148 -214 101 -396 204
5794B04q2o3k36k29K88j39K69j90P3K22k50j17J04L48k23J33j37o3K4J46J89l9
$$ 204 122 59 -177 -406 -118 -257 12 -178 -105 117 -133 -250 -146 202 -21 112 -25 -88 -64 82 271 232
5816B32n23K63J03j94j31K77J7J29N8n7m59K52Q9k66K69NP0q9J84l01%J84j07
$$ 232 -291 -28 75 -119 -250 27 44 173 231 174 -285 -33 56 -210 59 64 134 45 229 -72 -72 112 5
5839EpK3J45p2J79l01J9L9j22K9K7kJ99O0j66N0J39j04k08J58N2j14Q0j51j45
$$ 5 -2 21 166 94 273 -28 -9 30 -92 -63 -36 -38 161 221 55 105 244 140 -68 90 142 28 108 -43 -188
5864a88K89rj02J28j71m1N9J45j13R9J55m14K24j69k2n3K15q4K6Q8o6K45k29N6
$$ -188 101 92 -10 118 -53 -94 -35 110 -3 96 251 -163 61 -108 -130 -183 32 -52 -26 62 -4 241 12 68
5888F8j22K13k05o8J28K62n10jL61l8n0O6k73R0N5K4O1k15J20J73j10J76l06J37
$$ 68 -54 159 -46 -114 14 276 -234 -235 126 88 38 104 -169 -79 -24 0 61 -154 -34 139 29 205 -101 36
5912C6k19L77m17O7N9J63o6k22K04J54j91L1j68K04j33J16N6k26J20n9K2r4K49
$$ 36 -183 194 -223 -156 -97 66 0 -222 -18 136 -55 -24 -192 12 -121 -5 51 -175 -55 -114 -92 -186 63
5935F3l85K45q5L12O6n5j87O2J02O1K1k46M47k05m18L77k27k8J66J54k30j01Q9
$$ 63 -322 -77 -162 150 216 161 -26 36 138 199 220 -26 421 216 -202 175 -52 -80 86 240 10 -91 -2
5958bO7j58Q1p4L7K67r4k26K92o22N41J67j62k70J48RP2j69L51l57K03k32o2M12
$$ -2 65 -93 -12 -86 -49 218 124 -102 190 -432 109 276 114 -156 -8 1 73 -96 255 -102 101 -131 -193 219
5982B19j55O1k05J1O8Q2j61j67L69l75p1L71j3j71K04p0l36M45j60N6K52l32J18
$$ 219 64 125 -80 -69 -1 81 -80 -247 122 -253 -324 47 34 -137 67 -3 -339 106 -54 2 254 -78 40
6005D0P5l50K96J46j76j08K72j87K7P8K24n61K66K5j96J30J66J20o46N93j12J61
$$ 40 115 -235 61 207 31 -77 195 8 35 113 337 -224 42 67 -129 1 167 287 -359 234 122 283
6027B83n43L36n2j73J97j0p6Q5k39M02k42J21j32j49NL08j85m5J07p7j09L8L13
$$ 283 -260 76 24 -149 48 38 -38 47 -192 210 -32 89 -43 -192 -187 121 -64 -109 -2 -79 -188 -150 163
6050A63k49K62k85L00j79j71jJ52J93k9l51J38J44j92J92K6J98j98j65J10j28
$$ 163 -86 176 -109 191 12 -159 -160 -8 185 156 -195 -57 87 -105 87 113 311 113 -52 58 -70
6071g0N4p4J99q3L0J10j49J08k20J82j45L6j88m1L29l3q9R3r2K93k46O1l15K02
$$ -70 -16 -90 109 26 56 166 17 125 -95 87 -58 -22 -210 -251 78 45 -44 49 -43 250 4 65 -250 -48
6095d8J64k51r0K73Rj19L7LoK3p4k8J37j2K09l26j05K03O4m92J69L49k1%K0k8
$$ -48 116 -135 -225 48 57 -62 -25 -22 -28 -5 -79 -107 30 18 227 -99 -204 -1 63 -429 -260 89 68 68 88 60
6121F0P3m6j11oMl3l6K0k33L60k00J32J30k03K0%O4Q7j90L11j74k49K32l29L24
$$ 60 133 87 -24 -30 -26 -59 -95 -75 -308 52 -148 -16 114 -89 -69 -69 -5 82 -108 203 29 -220 12 -317 7
6146GO2J65j3j60p0m7n3L30k55j69L12j85m6R7J68J08m10J59K64k24J17q7l4k35
$$ 7 69 234 221 61 -9 -56 -109 221 -34 -203 109 -76 -122 -25 143 251 -159 0 264 40 157 70 36 -199
6170a99K82j5K4r0K3R8J3j80r6J78j89M41l33J92j57K0L0n26M23J35j7k15n9K78
$$ -199 83 68 92 2 25 123 136 -44 -140 38 -151 290 -43 149 -8 12 42 -484 -61 74 57 -158 -217 61
6194F1J72l84L65j92Q5M5j23r2K43j78kp9Q3J18J46k73RJ61k49M1J10K07l20j31
$$ 61 233 -151 214 22 107 152 29 -63 180 2 0 -79 4 122 268 -5 4 165 -84 -43 67 274 -46 -177
6218a77J18j44J32KM8J6J44J4o7k57P1n8L04m17L78M00n14K71m12Q7K5j0O4r4
$$ -177 -59 -203 -71 -69 -21 -5 139 153 86 -171 -100 -158 146 -271 107 507 -7 264 -148 -61 -36 -46 18 -76
6242g6M5J45l13M20O4Km34J34K46l88K79r7O7k56L68l75m5J46Q0J34K1j68J73
$$ -76 -31 114 -199 221 285 287 -147 -13 233 -155 124 27 94 -162 206 -169 -214 -68 12 146 167 -1 172
6265A72o7j77l2P2M2P8l0L8M3m2n8J67l18K95K0k32j01L52m43J80r3J47L5j75
$$ 172 105 -72 -104 -32 10 88 58 96 139 97 39 206 -112 183 203 -29 -130 222 -221 -41 -134 13 48 -127
6289a27K93l35L50j72j24J28J58k94J9J8%K13j91J62J0k16J52j49n5J14r4J14
$$ -127 166 -169 181 9 -115 13 171 -123 -104 -86 -86 127 -64 98 108 -108 44 -105 -160 -46 -140 -26
6311b6K2J60K1k47k9K40O6r9j13J26k84M21k18k50L58L8m08J72j19J91k25L23
$$ -26 -4 156 177 -70 -99 141 207 108 -5 121 -163 258 40 -210 148 186 -222 -50 -169 22 -203 120
6333A20L4o5l26J53J68j03K06k77l7K61l66K0L34j98J30R5M2m0m3m5j56N5k2j0
$$ 120 154 89 -237 -84 84 -19 187 -90 -127 134 -232 -212 122 -76 54 149 191 151 108 63 -93 -38 -60 -70
6357g0RJ59J05l48J03J42n1q3L0l6o1j5j5K27k29L68k89K70l97Q0K91n0k30J6
$$ -70 -61 98 203 -145 -42 100 49 -34 -4 -40 -101 -116 -131 96 -133 235 -54 216 -181 -101 190 140 -90 -74
6381g4m2j71J92J49J58k95J08j1r5J94j41j55R5m2K22k97L64R5j83J8j70J88l83
$$ -74 -116 -287 -95 54 212 -83 25 14 -81 113 -28 -183 -88 -130 92 -205 159 254 71 89 -81 107 -276
6404b76K73k3r1K31l21L79R6j98j50J80J24m87L42j74J44o0J99k50j8j19L99l6
$$ -276 -3 -26 -117 114 -207 172 268 70 -80 100 224 -263 79 -95 49 -11 188 -62 -80 -199 200 164
6426A64m60L26K18r1k26L06k38l3R3k17J47O8k06L95n62L07l7m4j04K65l7m0L7
$$ 164 -296 30 248 157 -69 237 -1 -34 59 -158 -11 57 -149 246 -316 -9 -46 -90 -194 71 34 -6 31
6449C1L13m15P5K51j97K5l28K01K22p9k48L60o0j99qLj90J49L40k18k2k2K05k69
$$ 31 344 -71 4 255 58 83 -245 -44 178 99 -149 211 151 -48 -56 -53 -243 -94 246 28 6 -16 189 -80
6473h0n1L17j10l6j6J55l41j00M21k73J62J94n12L07p4J3P7J36J01k84RO0J03
$$ -80 -131 186 76 40 24 179 -162 -262 159 -114 48 242 -270 37 -37 -24 53 189 290 6 15 75 178
6496A78j37J74k73J08J5Jk68M24k49R3j50J98Q0l74K57j81K48j47j48L07j79J63
$$ 178 41 215 -58 50 65 66 -202 222 -27 66 -84 114 194 -180 77 -104 144 -3 -151 156 -23 140
6518A40j16l46M16j26O9R3J35k09k56l9K51L5l05K32N2j84j38K14J19N6oK00k82
$$ 140 24 -322 94 -32 37 130 265 56 -200 -239 12 47 -258 -26 26 -158 -296 -82 37 93 87 287 5
6541Ej40K50j18M7J83k16j08J48k1j08n7P6j10j17K09j7L31l55L8Q3j00J70q1
$$ 5 -135 115 -3 44 227 11 -97 51 30 -78 -135 -59 -169 -286 -77 -94 237 -118 -80 3 -97 73 -8
6564hn1L7J06L7k38O9M3J03J08l35L01j33j64j6K79k90M17r2k5k59L5O1J57k03
$$ -8 -59 -22 84 121 -117 -48 -5 98 206 -129 172 39 -125 -141 138 -152 265 173 148 -111 -76 -15 142 -61
6588f1k3N6J0P4j02O7Q2l93K06J07P9m47M81l35L09k84K97k27K07j63L1J41l50
$$ -61 -84 -28 -18 56 -46 21 103 -290 -84 23 102 -345 136 -199 110 -174 123 -104 103 -60 -29 112 -238
6611b38K76L6n1q1P5j79K84Q7j26j62j15K11q7k07K71k6K65j61m58N12j64l70
$$ -238 38 74 23 -58 17 -162 122 209 83 -79 -194 17 -70 -277 -6 -32 233 72 -386 126 -38 -408
6633d08L97J40k69L58l2n58M16j81J98k06l7L4o9L76q9p4lJjj27J08PL2m3J57
$$ -408 -11 129 -140 218 186 -372 44 -137 61 -145 -182 -148 -217 159 70 -4 -7 -6 -7 -134 -26 -19 13 -30 127
6658A27r4j87L21k1j57n9R2J1K5k22Q7K0K1P6l3j82J97j63m4J95O5k51J57J03
$$ 127 33 -154 167 146 -11 -70 22 33 58 -164 -77 -57 -36 40 7 -175 22 -141 -185 10 75 -176 -19 84
6682H4j58J19K52k52k2Q6j60K06k48k10L42J33n0Q2j96m7j27J29k1J03J56m50
$$ 84 -74 45 297 45 23 109 -51 155 -93 -303 39 172 122 204 8 -39 -166 -37 -58 45 201 -249
6704b49M12k20K65k30O5%j20rl06K38J60J23qj14L04j90k13L25j08%J09k86q6
$$ -249 163 -57 208 -22 43 43 -77 -86 -392 -154 6 129 121 7 311 121 -92 233 125 125 234 -52 -138
6727a38ro4M10l05n3O4J36j07L11l29J57l4p3k9k20M49j32l93L22K60k09P2Q9
$$ -138 -147 -211 199 -106 -159 -95 41 -66 245 -84 73 39 -34 -63 -283 166 34 -359 -37 223 14 86 175
6750A75j64J8l6J29J46l81N2K0J82P2l79k8K84k6j96K00q4q7K64o5j8L4N6P2l50
$$ 175 11 29 -7 122 268 -113 -61 -41 141 213 -166 -194 90 64 -132 68 -16 -103 161 96 78 112 168 240 -110
6775a10N00m09K27n7j60N9K14m37J28J86j51K45l75K49j45J93o7j01k06J17q6
$$ -110 390 -19 208 151 -9 50 264 -173 -45 141 -10 235 -140 109 -36 157 90 -11 -217 -100 -186
6796a86M24j92p4L3j35o9L37k21L20J34m0j58j14j35L1J46O1o4j46M5k08N22l64
$$ -186 238 46 -28 5 -130 -199 138 -83 237 371 331 173 59 -76 -45 101 162 98 -48 -3 -211 311 -53
6819e3O7j8J58k56K35p7J02K36n70J71J23j25J2N5M9l2R0k67J34j49O7pr5K00
$$ -53 14 -4 154 -102 133 56 158 394 -176 -5 118 -7 5 60 109 77 167 -100 34 -115 -48 -55 -150 50
6843E0k51K11q6K0J88J2k76P8Pl08MM09l10L00k25K09J85m47J12L10k40K83n6
$$ 50 -201 10 -76 -56 132 144 -132 -54 -47 -355 -351 58 -252 48 -177 32 217 -230 -118 192 -48 235 179
6866A79q0M8N8k59kM0K35k78lJ70j09M2Q4j61J81J10k39RK55m05N7K41j23n0m3
$$ 179 99 147 205 -54 -56 -16 219 -59 -62 108 -1 41 125 -36 145 255 16 25 280 -125 -68 173 50 0 -43
6891d3Q6j99K85k59J68K35K2l23l7J92j33M61m17n7N6k81K91q2o6q8L38n8m21
$$ -43 43 -156 129 -130 38 273 295 -28 -65 127 -6 455 38 -19 37 -244 47 -35 -101 -189 149 91 -330
6914c30J85r3j1L32J70l63K63q9j04K56j14r3J9j85L14k50J50j27p6K58p4J09
$$ -330 -145 -238 -249 83 253 -110 153 64 -40 216 102 9 28 -157 157 -93 57 -70 -146 112 38 147
6936A47k18K53l94M43j42k62M4J61m7k52M94k14q2L3K0lN4n4L2J04l7N3j53j54
$$ 147 -71 182 -212 231 89 -173 -129 32 -15 -267 227 13 -69 -36 -16 -19 35 -19 13 117 80 133 -20 -174
6960a74j29J15jJ80Q7J26j82r1p7O1K18k33L01k56j8J55j16N5K52l59N9j78J59
$$ -174 -303 -188 -189 -9 78 204 22 -69 -146 -85 133 -100 201 -55 -73 82 -34 21 273 -86 -27 -205 -46
6983d6l5j06L41j38r2R8K1j25Q7l1%m5l2M45l17j19N11o09j16N04o9L8j23k60
$$ -46 -81 -187 154 16 -76 22 43 -82 5 -26 -26 -71 -103 342 25 -94 417 -192 -308 196 127 165 42 -218
7007b18K32q8M12k89k48l4K39k33p9J52m1j3R9o7L11K1p4j00J46r1o9J41k79L26
$$ -218 14 -74 338 49 -199 -233 6 -227 -306 -154 -195 -208 -109 -176 135 156 82 -18 128 37 -32 109 -170 156
7031A56k25M01J9n27j39K05K36N3k54j40P4M1J29O8Q8l68K32j65J69J37l23J57
$$ 156 -69 332 351 -176 -315 -110 126 179 -75 -215 -141 -100 29 97 185 -183 49 -116 53 190 -133 24
7053B4k41L96m2j17QJ01k79j06K49%J3j0j69J61K9j10jK40j13K2j6KQ5k00l2M
$$ 24 -217 179 137 20 28 129 -150 -256 -7 -7 6 -4 -173 -12 17 -93 -94 146 33 55 39 41 126 -74 -106 -102
7079a02J64j0o6J18k66L1K66j0m27M17j30J80n2k41J01K3N3n2L2K24j43R7k8q8
$$ -102 62 52 -14 104 -162 -131 135 125 -302 115 -15 165 113 -128 -27 -4 49 -3 29 253 110 207 179 91
7103I1j56l3R1q1J62o1j03R9J4k48M89l71J84N8l47N59n25Q1r2K33K7j40L18k73
$$ 91 -65 -98 -7 -88 74 13 -90 9 23 -225 264 -107 77 135 -212 347 -178 -97 -189 44 71 -69 249 -24
7127b4M5N1jL8k77M01j62j67N0O9J5j67k3l3K22l4J33p8k06j2N0K02k40L52r6
$$ -24 21 72 71 109 -168 233 71 -96 -46 23 38 -129 -152 -185 37 3 136 58 -148 -160 -110 92 -148 204 108
7152A08l0k45J22j21J45QL2J57l16J28j21J33j96Q5j59L26r8L45l39R5k3N2j59
$$ 108 78 -167 -45 -166 -21 -13 19 176 -140 -12 -133 0 -196 -111 -270 56 -42 303 -36 59 36 88 -71
7175g1r5K00M4m94M49J61k47M2j70M1Q1K01j17j48J97j73MJ99J15Mj89j37J06
$$ -71 -166 34 78 -416 33 194 -53 -11 -181 -140 -59 142 25 -123 74 -99 -95 104 219 223 34 -103 3
7198CO8l59K07J20k86K81n8j97P3j77P3R2J35jm8K27k11j53K87j46L79m24Q3J9
$$ 3 71 -288 -81 39 -247 34 -24 -221 -148 -325 -252 -160 -25 -26 -74 153 -58 -211 76 -70 309 -115 -32 -13
7222a3J74k11k11N13k59N0J06j42j53j9M58k61o6L7J6k65K73j08J11j06Nn2P9
$$ -13 161 -50 -261 252 -7 43 149 7 -146 -165 293 32 -34 3 19 -246 27 -81 30 -76 -71 -123 -44
7245d4R4j46P3O8p5J04j85Q5M0n4N9j60M53k06j34M6r8J99j69j68K87j03j28J20
$$ -44 50 -96 -23 45 -30 74 -111 -26 14 -40 19 -141 312 106 -28 18 -80 119 -50 -218 69 -34 -162 -42
7269d2L32m66J70J18p8P2k16K69rn7k44K06R2l32N96o57J55rj76J40J62L6lj61
$$ -42 290 -176 -6 112 34 106 -110 159 150 93 -151 55 147 -185 411 -246 -91 -100 -276 -136 26 62 59 -102
7293a02o9L05m3j85l1J46o3j8J20j12j63K03J60R3m4l44K11l85M05l24J28L9J49
$$ -102 -171 134 91 -94 -125 21 -42 -60 60 -52 -215 -12 148 241 197 -147 64 -321 84 -240 -112 -73 76
7316G6l57J81K55l53J79j3l1J6K5j5j67K73j69j6K94k57Q5N4K13m56N01l52J50
$$ 76 -281 -100 155 -198 -19 -32 -63 -47 -22 -37 -204 69 -100 -116 178 -79 6 60 273 -183 318 -34 116
7339A16P3l42K2L00l95K24q8J82lJ0m23K4N76l20k01M91l64J93r2N9l16M7K84
$$ 116 189 -153 -131 169 -226 -2 -90 92 89 99 -324 -300 276 -44 -245 246 -118 75 -17 42 -274 -227 57
7362E7J33l79K77%R4k07K49m54L43j55K12j57j62p2R7K83q5l1j06J70r2l06K85
$$ 57 190 -189 88 88 182 -25 224 -230 113 -42 170 13 -149 -221 -124 159 74 43 -63 107 15 -291 -6
7385fk3j04R3j31J84N2J17j72J57j51P3j40K39J28l92R5n4J77q4N9k80K18l6J45
$$ -6 -29 -133 -40 -171 13 65 182 10 167 16 89 -51 188 316 -76 19 -35 142 58 117 -163 55 19 164
7409A64k34J63l20L10k3J08k07j8R5N7k41L31j39l6j00k0K02Nl06K08k48J53J14
$$ 164 -70 93 -227 83 60 168 -39 -57 38 95 -146 185 46 10 -90 -110 92 97 -209 -1 -249 -96 18
7432A8J08Rk69J83R9j16j32P8K67m48L54J21k50K9k41o5J84R8l02M31l08L43m6
$$ 18 126 135 -134 49 148 32 -100 -22 245 -203 151 272 22 51 -190 -255 -71 27 -275 156 -152 191 145
7455A45k7k9m3J67k82p3K66k78J52j01J04j69K92K6k38K68l63J2J41R3M0j31p7
$$ 145 118 89 46 213 -69 -142 124 -154 -2 -103 1 -168 124 150 -88 180 -183 -171 -30 63 103 -28 -105
7478a05M23k41J63k74l3J23j81J4K7K01KN9N2l35K94k94J56l6q7J1j14j03K72
$$ -105 318 77 240 -34 -67 56 -125 -111 -84 117 119 178 230 -105 189 -105 51 15 -72 -61 -175 -278 -6
7501fk0j47n3J32q5K93l4K94m73L1j33k7K43J94j46j91M15l3m04J75J56j07N0
$$ -6 -26 -173 -226 -94 -179 114 80 374 -99 -68 -201 -228 15 209 63 -128 287 254 -150 25 181 74 124
7524A24J41m90L54j45l6J97k08l7P5J0O2P4l16J48L01k98J02k16K54j99M7j48
$$ 124 265 -225 129 -16 -52 145 -63 -100 -25 -15 47 121 -195 -47 254 -44 58 -158 96 -103 -56 -204
7546b04O8J22k45P4K37l9m8k12L72k77J36K5J89j12o3j43L19k18Q8J0l41L22k28
$$ -204 -136 -14 -259 -185 52 13 -35 -247 125 -152 -16 9 198 86 23 -120 199 -19 69 79 -262 60 -168
7569a68K17Q1Nj27J59j80J72K05m18K04j88O4k66L54j11j27N0J39J17j68j74J11
$$ -168 49 130 135 8 167 -13 159 364 -54 150 -38 26 -240 114 3 -124 -74 65 182 14 -160 -49
7591d9jq5r6L72j04LJ15j27J2k34K57K3j61k09L30m6P4m54M41k07NQ4L1J98j51
$$ -49 -50 -135 -231 141 37 40 155 28 40 -194 63 86 -75 -284 46 0 74 -380 61 -146 -141 -57 -26 172 21
7616B1L8Pn9q7J71l1j26K50Ok32l0p6j43M10r0k30J76n4o4J37j36J5K72k32J64
$$ 21 59 66 7 -80 91 60 -66 184 190 -42 -72 -148 -291 119 29 -201 -25 -79 -143 -6 -142 -127 145 -87 77
7641G7k5R3L9j63K07j26j05k42L41J11j46j7m8j81K54j93K38k6j75P3L00l97j90
$$ 77 52 145 184 21 228 102 -3 -245 96 207 61 44 -4 -185 69 -124 114 88 -87 -14 286 -111 -301
7664c01M4O7L78k24J16k14j91K22j95J61M16k00K79k96L07l93j49L92j27p6J92
$$ -301 -257 -190 188 -36 80 -134 -325 -103 -298 -137 279 79 358 62 369 -24 -173 219 92 16 208
7685B08n21N37m54L60j79j47L48j07j66j20K56N3j01K10j57j38Q3q1K80o1j1l08
$$ 208 -313 224 -230 130 -49 -196 152 45 -121 -241 15 68 -33 177 20 -118 -35 -116 164 103 92 -216
7707b16J68K03l7k62M0J44j63O5R0KQ2k16L87k10j03q4pK57P5k53k19N98m03J2
$$ -216 -48 155 118 -144 -104 40 -123 -58 32 34 116 -100 287 77 -26 -110 -117 140 215 -38 -257 341 -62 -50
7731e0J27j5J48k83J00J47n1r5K6j32M3K2K45qj13Q3k13j21j00L14q3N9N0J9j12
$$ -50 77 62 210 -73 27 174 123 28 54 -78 -35 -13 232 224 111 194 -19 -140 -240 74 -9 50 100 119 7
7756Gr5n8j74L50J20n6k47Q9m0J07J57Jk06L9n1M08k93j79m2M37k78r9OK30j87
$$ 7 -88 -146 -320 30 150 94 -153 -64 -104 3 160 161 -45 -6 -57 351 58 -121 -163 274 -4 -103 -97 133 -54
7781e4K4k52L39q5j0L74l77j3K43p4J08pl46L50j78j43M03k45p4J62p5j70qO8
$$ -54 -30 -282 57 -28 -38 336 -41 -54 189 115 223 216 -130 220 42 -101 302 57 -17 145 70 -100 -108 -40
7805d0R9j59j18R6MK19k58J13J8J74J98k87j3L1K1J35J3l88J26R3l57J41K61j20
$$ -40 59 -100 -218 -122 -118 101 -157 -44 -26 148 346 59 46 77 98 233 246 -142 -16 77 -280 -139 122 2
7829Bn7O9Rj01j61J32K26O3k51j65L17n1R9q0m6k51J37K12j19K78k15n2J01q7
$$ 2 -55 14 23 -78 -239 -107 119 182 -69 -234 83 32 131 51 5 -246 -109 103 -16 262 47 -5 96 9
7853IN5j73K91j22K64l52J36ok08p0K69j37J82l20K5N7n8J65M4k10J93J6q8K30
$$ 9 64 -109 182 60 324 -28 108 102 -106 -176 93 -44 138 -182 -157 -100 -158 7 51 -159 34 50 -38 192
7877A92l79o8N3L38k30J78k5k77M11r4p5j21j79O2J90k94K31k5K70j13R1J15j87
$$ 192 -187 -255 -202 136 -94 84 59 -218 193 99 24 -97 -276 -214 -24 -318 -87 -112 158 45 136 251 64
7900F4P2l99N8K56l2L1k54R5K06j39O5J07l08J06j5K88l03P8K77k05N7j05k69
$$ 64 136 -263 -205 51 19 50 -204 -109 97 -42 23 130 -178 -72 -87 201 -102 -24 253 48 105 0 -269
7923b69J92L0q5L95k44j2J31K3n59J13K40LJ98l22J60j85j29N01k14j03N4K47
$$ -269 -77 -47 -132 263 19 7 138 161 -398 -285 -45 -42 156 -166 -6 -191 -320 181 -33 -136 -82 165
7945A65k75K93k43K36j06p7j24J65R3R6j51J91k54k8J28j90m4k0K87p1k50K01
$$ 165 -110 183 -60 176 70 -7 -131 34 127 223 72 263 9 -19 109 -81 -125 -145 142 71 -179 22
7967B2l14M55l8l9j53L8JjJ2J96l51J87N3j69Pj05N7L0J75k47J5K27N1p0j54N9
$$ 22 -292 163 125 86 -67 -29 -28 -29 -17 179 -172 15 68 -101 -94 -199 -142 -112 63 -184 -169 58 109 39 -115 -56
7993e6QJ02N8k8j84P1j46p0J79L65l19q7K95k64J98Q5j82pk2N4K3j36K93k73P8
$$ -56 -48 54 112 84 -100 -29 -175 -245 -66 299 -20 -107 188 -76 122 207 25 18 -4 50 73 -63 230 -43 35
8018C5j81R4K16m84L42%o7K24k64J99n9Ll22J24R6j15l2J50J67k53K74l31N8K8
$$ 35 -146 -52 164 -320 22 22 -45 179 -85 114 55 58 -264 -140 -44 -159 -191 -41 126 -127 147 -184 -126 -98
8042i8j68J64j33M45j83J16R6n4j08k54K65J6j30K14j59k52P6O3J3J44m5R8p2
$$ -98 -266 -102 -235 210 27 143 239 185 77 -177 88 104 -26 188 29 -223 -147 -84 -71 73 28 126 54
8065E4k24J98j7J20k1j36J31M0j95O4L4J30k32Q6j46J76o1J30O4l70L06%m9M3
$$ 54 -170 28 11 131 110 -26 105 145 -50 14 48 178 -54 32 -114 62 1 131 195 -175 131 131 82 125
8089A25n8r8K1J77k76j46L29j2ml56L36M7q1j03N9K0K69j86k6j69rJ88k3j44Q9
$$ 125 67 -31 -10 167 -109 -255 74 62 58 -298 38 85 4 -99 -40 -20 249 63 37 -132 -141 47 24 -120 -31
8114c1J8R7k87J49j42J54k90L32L3p6P7J02j09L83k10k9L4r4j00l30K64N6RJ09
$$ -31 -13 84 -203 -54 -196 -42 -332 0 33 -43 34 136 27 410 200 171 205 111 11 -319 -55 1 10 119
8138A19j58K88j57o5J98l95QM6j46K58P6j55J0j10L11l16L24j65J32rm41L79P5
$$ 119 -39 249 92 27 225 -170 -162 -116 -262 -4 72 -83 -73 -183 128 -188 136 -29 103 94 -347 32 107
8161A07q0R2j81J34j48J38j03J77l87L27l7J61l03k4K93p9k77K29J0j7k92j50
$$ 107 27 119 -62 72 -76 62 -41 136 -251 76 39 200 -103 -127 166 87 -190 39 49 32 -260 -410
8183d10J87K28p9K6J32j99J10q1
$$ -410 -223 5 -74 -48 84 -115 -5 -86
8191h6
$$ Imaginary data points
##PAGE= N=2
##DATA TABLE= (X++(I..I)), XYDATA
0@%%%%%%%%%%%kJ0j6J6j6K4l2L2m0M9n7P2q8J04j20J36j60J84k08K40k74L14l59
$$ 0 0 0 0 0 0 0 0 0 0 0 0 -2 8 -8 8 -8 16 -16 16 -24 25 -32 40 -48 56 -64 72 -88 96 -112 128 -146 168 -191
34a91M06m55N11n74O41p16P98q88R84j088J208j337J475j628J795j978K178k400
$$ -191 215 -240 271 -303 338 -378 420 -468 516 -572 636 -701 774 -854 941 -1037 1141 -1259
52a259K646k916L219l562L950m391M901n498O212p080Q155r538J1391j4011J8042
$$ -1259 1387 -1529 1690 -1872 2078 -2313 2588 -2910 3302 -3778 4377 -5161 6230 -7781 10261
67A0261k5093M0967j46257M9094K60734j29143j59892L7761J54240k6777r8559
$$ 10261 -14832 26135 -120122 -71028 189706 60563 -99329 -61568 92672 65895 -32664
78c2664k6170M2526O691L6497L5504l7032q6583J5497Q8006Q089r6979j6155R2018
$$ -32664 -58834 -16308 -9617 26880 62384 25352 -61231 -45734 42272 50361 -46618 -62773 29245
91B9245M5456o4172n0564J0571J4276l111K8662K2243l6725k2324N9380K7900
$$ 29245 74701 10529 -40035 -29464 -15188 -18299 10363 32606 -4119 -26443 32937 60837
103F0837p5675n9891N6036O8356k4463m4317J9320K0020k5771j1202J5236j1250
$$ 60837 -14838 -74729 -18693 49663 25200 -19117 203 20223 -5548 -16750 -1514 -12764
115a2764j7514L6068M5400l3301o0638K3160N3239l2240n2159M3772P0313l3604
$$ -12764 -30278 5790 51190 17889 -42749 -19589 33650 1410 -50749 -6977 63336 29732
127B9732p1518L0467O5121m6821q1052M1473R3368j6229q2285L002O5227n643
$$ 29732 -41786 -11319 53802 6981 -74071 -32598 60770 44541 -37744 -34742 30485 24842
139B4842o0122j592M5203J0943j4229O094L729k4852j0849K6365P876k7737J699
$$ 24842 -35280 -36872 8331 19274 5045 11139 14868 -9984 -20833 5532 13408 -14329 -12630
152a2630M0332M681m2858j7010K7993O178k7756M040L6816K078l0662k992K1190
$$ -12630 27702 32383 -10475 -27485 508 6686 -21070 -17030 19786 21864 -8798 -11790 9400
165I400p881k4331J1018L0772j626j8080N797Q666j8993j6368J7040J6951j2349
$$ 9400 1519 -22812 -11794 18978 17352 -728 5069 13735 -5258 -21626 -4586 12365 16
178A6p745J9246M550k6315r854J7977K090j6335J3000L3210j0526m1917L736M1305
$$ 16 -7729 11517 16067 -10248 -20102 -2125 -35 -16370 -3370 29840 19314 -22603 -18867 22438
192B2438l559m5364k445N2059K0040m1453l0175J9490K0859j0561j5193L874J1331
$$ 22438 18879 -26485 -28930 23129 43169 1716 -28459 -8969 11890 1329 -13864 -9990 1341
205A341P331N612r008k4716l993K8283J6289k0882j5989K1738K0368j8712k5179
$$ 1341 8672 14284 5276 -19440 -23433 4850 21139 257 -15732 6006 26374 7662 -17517
218a7517N359J4976q08j230Q152j692j4928j512J4390l669j9715L181K7091R658
$$ -17517 -12158 2818 2010 780 8932 7240 -7688 -9200 5190 1521 -18194 -15013 12078 21736
232B1736j9062j4649Q517Q839n726l268L720K660L652O353n241j8620p060J8026
$$ 21736 2674 -11975 -3458 5381 -345 -3613 107 2767 6419 12772 7531 -11089 -18149 -123
246a23J2463j5453j0291J6569J3317j5070j8407O778J4719k231n470Q550N934
$$ -123 12340 -3113 -13404 3165 16482 1412 -16995 -10217 4502 2271 -3199 5351 11285
259A1285q325o648L289J155n988K35J1582L266r497l765K324k798m763L056Q200
$$ 11285 2960 -3688 -399 756 -5232 -4997 6585 9851 354 -3411 -1087 -3885 -8648 -5592 2608
274B608o52l556O287L806j2193q595J0158J1395m617r216O990J0591q204j3854
$$ 2608 1956 -1600 4687 8493 -3700 -12295 -2137 9258 4641 -4575 2415 13006 4802 -9052
288i052O28P926J707k446J469K997l220k954J984k727m476N934R783M72p309k296
$$ -9052 -8424 -498 1209 -1237 232 3229 9 -2945 -961 -3688 -8164 -2230 7553 8025 716 -1580
304a580N834j596q430J395Q096J379l375J7J358n153o961K942P962k351l145N123
$$ -1580 4254 2658 -5772 -4377 3719 5098 1723 1740 3098 -2055 -9016 -6074 1888 -463 -3608 1515
320A515M970m108p688J3O361P92m85L201P71l066j948m58k039k930J849P341K85
$$ 1515 6485 2377 -5311 -5298 1063 1855 1370 4571 5342 2276 328 -130 -2169 -5099 -3250 4091 4376
337D376o654n68L387j648m920k34P255M331k978p55J989k478l084K09K572Q85
$$ 4376 -2278 -2846 541 -1107 -6027 -6261 994 5325 2347 1592 3581 1103 -1981 -1772 800 1685
353A685m28J702J978m686n134O85K017J59J88J710K192j474j589P86j574k316
$$ 1685 1257 2959 4937 251 -4883 -4198 -2181 -2022 -1834 -124 2068 594 -995 -209 -1783 -4099
369d099L946N122J329m275k840K892P28m967k441K791M154J086k382l321j116
$$ -4099 -153 4969 6298 2023 -817 2075 2803 -2164 -4605 -1814 2340 3426 1044 -2277 -3393
384c393j18K111O10k228J708M934K292m006m974K39M390J128j761J56J214O42
$$ -3393 -3511 -1400 -790 -3018 -1310 3624 5916 1910 -3064 -2825 1565 2693 932 1088 2302 2944
400B944j843k492j988m75J152L087J497j417j778m11R21L08j096R25K357J880
$$ 2944 1101 -1391 -3379 -3854 -2702 385 1882 465 -1313 -1724 -803 -495 -1591 -666 1691 3571
416C571J049k091k957r66O15N11J083m9M4q93q51N71j066l649j92N007N463j401
$$ 3571 4620 2529 -428 -1394 -779 -268 815 766 810 -83 -934 -363 -1429 -5078 -5270 -263 5200 3799
434C799o342m86M985K800m630m431L190O980N30m882m571r40K883L033j265m876
$$ 3799 -2543 -3029 1956 4756 126 -4305 -1115 5865 6395 1513 -3058 -3998 -1115 1918 653 -4223
450d223p21N858N548n020r867Q58J0062N070n389p322L895Q000m92q040m019M282
$$ -4223 -4944 914 6462 1442 -8425 -7567 2495 7565 2176 -5146 -1251 6749 6257 -1783 -5802 -1520
466a520M772M0k713j705j258K15J887k56k160j107K980M914M1n608l092M065M458
$$ -1520 3252 3292 579 -1126 -2384 -2169 -282 -538 -2698 -3805 -825 4089 4130 -1478 -4570 -505 3953
483C953j502m302J961N241k473n384L64L325j207m991K012P429l6q800l118P636
$$ 3953 2451 -1851 110 5351 2878 -2506 -2142 1183 -24 -5015 -3003 4426 4390 -4410 -7528 108
499A08N759n685p592N272R616n62p229l303K147L036J347N09l699m432L672P565
$$ 108 5867 182 -7410 -2138 7478 6916 -313 -3616 -1469 1567 2914 3423 -276 -4708 -1036 6529
515F529k329j2195l712J1313J1364p138j3772J716J4206L914j0806q715O856J0607
$$ 6529 4200 -7995 -11707 -394 10970 3832 -9940 -8224 5982 9896 -910 -9625 -2769 7838
529G838n21o357l920L64L804K122k106l652l162L812P121q58r190n150P339J0606
$$ 7838 7317 960 -2960 -2596 1208 3330 1224 -2428 -5590 -1778 5343 4485 -4705 -9855 -2516 8090
545H090l295j1320L34J2010L686r162p758N860Q420l246o134J343M210k588m444
$$ 8090 4795 -6525 -6191 5819 9505 343 -7415 -1555 6865 3619 -2515 -1172 3038 450 -3994
560c994J946M343l572m490M898N895l242o391R79N936Q46l621Q94K207j947m41
$$ -3994 -2048 2295 -1277 -5767 -869 5026 1784 -4607 -3628 2308 3154 -467 427 2634 687 246
576B46K439J68m434m691N650Q027m314j0138J71R508L317q695n427O188P667r25
$$ 246 2685 2853 -1581 -6272 -622 7405 3091 -7047 -6876 2632 5949 -2746 -8173 -1985 5682 4757
592D757n350l081K482M387L22k654k076m0K977K436k215n436k810M474P108k606
$$ 4757 -593 -3674 -1192 3195 3517 863 -1213 -1253 1724 4160 1945 -3491 -6301 -1827 5281 2675
608B675q280n56Q168M690o664p625L994R391R58p762l503N730M468m238m512J597
$$ 2675 -5605 -6161 2007 6697 33 -7592 -3598 5793 6751 -1011 -4514 1216 5684 1446 -3066 -1469
624a469K466l19j64n24j878j064J772K305j992j948K372K689q08k160k2K488L41
$$ -1469 997 678 514 -10 -1888 -2952 -1180 1125 -867 -2815 -443 2246 1438 -722 -744 1744 2085
641B085k891N35L287K24l336k583K377J561k508j304J231J451L1k38r55m99Q99
$$ 2085 -806 -271 3016 3240 -96 -2679 -302 1259 -1249 -2553 -1322 129 160 -78 -1033 -1532 -633
658f33Q53Q70l87l5K90N60N15j136k214L74K601R65k755l080J200L664r06l636
$$ -633 220 1090 703 668 958 1518 2033 897 -1317 -943 1658 2623 -132 -3212 -2012 1652 746 -2890
676b890q43L531L132j605l446P27K748N45j323r01Q73J258r4o26j428j037Q89
$$ -2890 -3733 -202 2930 1325 -2121 -1394 1354 1899 576 -325 548 1806 1712 1086 -342 -1379 -490
693d90P97r08j028L53R25P6q25J7O63N9p0J253P45l07j452L44J344J81k160M9
$$ -490 307 -601 -1629 -1276 -351 -275 -1100 -1083 -420 -361 -431 822 1567 1260 -192 152 1496 1677 -483 -434
713d34R23N75r62j823j86J102N92o64l07M23J037K25o43j70O38M70K01j51L14
$$ -434 489 1064 102 -1721 -1907 -805 -213 -877 -1184 -761 276 501 -142 -312 326 796 997 846 1160
732A160J08m80o09j94rj56r53N45P87j201n64J81P35L27j44j44J356N44l39l65
$$ 1160 1268 788 179 -15 -24 -180 -1133 -588 199 -1002 -1566 -1385 -650 -323 -467 -611 745 1289 950 585
752E85m77M87P91r22m66K36N52k74j144j136O17Q22p4p32q9J114O81j179K6N62
$$ 585 108 595 1386 464 -2 234 786 512 -632 -1768 -1151 -329 -403 -1135 -1224 -110 571 -608 -582 -20
772b0O74J7n4K37M74k33q89m1j15R2l02o55K57M71p20k02o00P27J067m24k69R30
$$ -20 654 671 617 854 1328 1095 206 165 50 142 -160 -815 -558 -87 -807 -1009 -1609 -882 185 -239 -508 422
794D22M91K02p66n72J313J85m74l72J0n78L98p75l42j57j95P10J39l65N0K94J55
$$ 422 913 1115 349 -223 1090 1275 801 429 439 -139 259 -516 -858 -1015 -1210 -500 -361 -726 -676 -382 -227
815b27L70J3j80J008K58k62J04j048J39L33k34j37p38L2J000j075j162O77P56
$$ -227 143 156 -24 984 1242 980 1084 36 175 508 274 137 -601 -569 431 -644 -1806 -1129 -373
834c73K35j11p62J017J367o66m82p3J70J076m28n49l80M4O11m09j416p52J662
$$ -373 -138 -249 -1011 6 1373 707 225 152 322 1398 970 421 41 85 696 287 -1129 -1881 -219
853b19L07k93j095J4J348K54m76n1M77M20O99m81k22m29j47R57l19j102j06N48
$$ -219 88 -205 -1300 -1286 62 316 -160 -211 266 686 1385 904 682 253 106 1063 744 -358 -464 84
873H4n3n29m97m43Q70j88P07L70j464Q13J149K22m67j058R79J017j89p71m79j07
$$ 84 31 -498 -995 -1438 -568 -756 -49 321 -1143 -330 819 1041 574 -484 495 1512 1323 552 73 -34
893c4j12pn2l37n39q6J542k92j328k58J075J382L6j367K37R16O22k51j075n47
$$ -34 -146 -153 -205 -542 -1081 -1167 375 83 -1245 -1503 -428 954 990 -377 -140 776 1398 1147 72 -475
913d75M70Q33M31j554j250J077J076r08j299K22O51O80J02k51J63q40J448J112
$$ -475 -5 828 1259 -295 -1545 -468 608 -300 -1599 -1377 -726 -46 56 -195 -32 -872 576 1688
931A688q33j222J51J829K4j999j052J862L08j492p36J128L00r89n33K163O2j825
$$ 1688 855 -367 -216 1613 1637 -362 -1414 448 756 -736 -1472 -344 -44 -1033 -1566 597 659 -1166
949a166J12K322P38j670j047J349J021p64m30n8p7m07j58O45j056j402M94J937
$$ -1166 -1054 1268 2006 336 -711 638 1659 895 465 407 330 -77 -235 410 -646 -2048 -1554 383
967C83M76k096o52J485J980l48j882p23J575K193P8k898r65J887J616j367k562
$$ 383 859 -1237 -1889 -404 1576 1228 -654 -1377 198 2391 2469 -429 -1394 493 2109 742 -1820
984a820L92K154o19r67J36m31n2O44J649P0k762l01L915J227l214k682L154L098
$$ -1820 -1428 726 107 -860 -724 -1155 -1207 -563 1086 1156 -1606 -1907 2008 3235 21 -2661 493 3591
1002C591k169l479J438K486j409k161J033J065r82j290J390J829j856j629K003
$$ 3591 1422 -2057 -619 1867 458 -1703 -670 395 -587 -1877 -487 1342 -514 -2143 -140
1017a40K407j522j737Q35K131n02j981M80R75n50q50N44K51n95j219O15J091j87
$$ -140 2267 745 -992 -157 1974 1472 -509 -29 946 396 -454 90 341 -254 -1473 -858 233 46
1035D6r87l91M03J795O36j765q32J407J978n98k593J89K435p10j401l31P47rr98
$$ 46 -941 -1332 -929 866 1502 -263 -1095 312 2290 1692 -901 -712 1723 1013 -388 -719 28 19 -979
1054i79K60J383j701j653K656K394k825k616K284M451j558m142J280L470p01k713
$$ -979 -719 664 -1037 -2690 -34 2360 -465 -3081 -797 3654 2096 -2046 -766 2704 2003 -710
1070g10k58J863L6j812N4J656j686r10J020J419o85j935J028K268n07j880J131
$$ -710 -968 895 931 -881 -827 829 -857 -1767 -747 672 -13 -1948 -920 1348 841 -1039 92
1087I2J427m60j086L22J008r05n07O03k71j019K19M00n24L0L44K79p56l54J749
$$ 92 1519 1059 -27 295 1303 398 -109 494 223 -796 -577 -177 -701 -671 -327 -48 -804 -1158 591
1106E91O11j824k8R32J159q50j029J036Q67j517n56J578n98j956L41J794m82j993
$$ 591 1202 -622 -650 282 1441 591 -438 598 1465 -52 -608 970 372 -1584 -1243 551 69 -1924
1124a924K04L103m58k379L66K087M26j147j069J916L18j364j98J321r10j189Q44
$$ -1924 -1720 1383 925 -1454 -1088 999 1425 278 -791 1125 1443 79 -119 1202 292 -897 -53
1141e3Q55o43j829M40K106j433j235J148J566r07r79J178Q65q04m58J502n57q75
$$ -53 802 159 -1670 -1230 876 -557 -1792 -644 922 15 -964 214 1079 275 -183 1319 762 -113
1159a13J21P43j28j058n38J314k17j292n8J149J73j037n9J680j19j177N80J464
$$ -113 8 751 623 -435 -973 341 124 -1168 -1226 -77 96 -941 -1000 680 561 -616 -36 1428
1177A428p04p03Q73M96j523n38J261K79j258j076J094Q99j427m70J091N09q90
$$ 1428 724 21 894 1390 -133 -671 590 869 -389 -1465 -371 528 -899 -1369 -278 231 -659
1194f59j41J024L51j033MJ743m28r07k03J639o12j321L13P82k12j412K69J226
$$ -659 -800 224 575 -458 -454 1289 861 -46 -249 1390 778 -543 -230 552 340 -1072 -803 423
1212D23j103q93R03J077o39p96P11J121j94j025P88M96k62n55N02M24q50q91J186
$$ 423 -680 -1573 -670 407 -232 -1028 -317 804 610 -415 373 869 607 52 554 978 128 -763 423
1231D23j56p01o23J195l88n33j9P73L29j188Q87R28k08p39O57L12k92p74J02J066
$$ 423 267 -434 -1057 138 -250 -783 -802 -29 300 -888 -1 927 719 -20 637 949 657 -117 -15 1051
1251A051q58r50L49Q26j131k99M96N95m99q82J084J007j118K3P03P73r38m59J076
$$ 1051 193 -757 -408 418 -713 -1012 -516 79 -420 -1302 -218 789 -329 -306 397 1170 232 -227 849
1270H49J91q94l02P47m81o88N9M76n6j150M13J132j78j231O01Q47Q0m41J57R26
$$ 849 1040 146 -156 591 110 -578 -519 -43 -99 -1249 -836 296 118 -1113 -512 335 415 -26 131 1057
1290A057m72q66Q71L16n34o36M88p3m60q26O42L71n85q9O96K9l73J1P77J72o95
$$ 1057 585 -281 590 906 372 -264 224 151 -309 -1135 -493 -122 -707 -796 -100 -71 -444 -433 344 516 -179
1311a79L65Q34k89o86N05j34n9n70k66P03k50r80M27J83k37l6L85M5J4k13J005
$$ -179 186 1020 731 45 550 416 357 -213 -479 224 -26 -1006 -579 -396 -633 -669 -284 -239 -225 -438 567
1332E67j19n07L4O51J48l80j58K75J06j175J90K84r9l99k96P39J96m75k63O26
$$ 567 448 -59 -25 626 774 394 236 511 617 -558 -368 -84 -183 -582 -878 -139 57 -418 -681 -55
1352e5L23m81K21M13K34j39m29N38k7n03K37N1o60L4k98N7K81n53K90R4j8L47
$$ -55 268 -213 8 421 655 516 87 625 598 95 332 383 -277 -243 -541 -484 -203 -756 -466 -372 -390 -43
1374d3J8j68N99M0p0K57l48J48M15p79j70M27l32J80o25j48K85j22k13L80Q7m85
$$ -43 -25 -193 406 446 376 633 285 433 848 69 -101 326 -6 174 -451 -599 -314 -436 -649 -269 -182 -667
1396f67M25K23N58L0p87M03Q61m21m18K92l26L33o98J02K31l40k35j48o6L24P5
$$ -667 -242 -19 539 569 -218 185 1046 625 207 499 173 506 -192 -90 141 -199 -434 -582 -648 -324 -249
1417b49m94O34J09j53k2K44N19J88n78M3J40J27l21l2j88M4k30k25l8l1o7j7K24
$$ -249 -743 -109 0 -153 -175 69 588 776 198 241 381 508 187 155 -33 11 -219 -444 -482 -513 -580 -597 -373
1440c73j9K14R3K28O8M69m40j01M88r0l61n22M30M9l79O7l92N18l82p7K67L3j03
$$ -373 -392 -178 -85 143 211 680 240 139 627 537 176 -346 84 133 -246 -179 -571 -53 -435 -512 -245 -212 -315
1463c15j35L56M81M8o02L76L95q6k64n12O97k66j74k00K80Q5o22l35L53K02j29
$$ -315 -450 -94 387 435 -167 209 604 518 254 -258 439 173 -1 -201 79 164 -458 -793 -440 -238 -367
1484c67l78M64L69r3m7L78N64k2p18J28J31K01j38q22R3O0k66K0J5J22N5l04L10
$$ -367 -745 -281 88 -5 -52 326 890 868 150 278 409 610 472 -350 -257 -197 -463 -443 -428 -306 -251 -555 -245
1507b45L08k86L4K48L67Rl80j25O86K48l22n55K04N00o82m87K25M52q48Q5L11
$$ -245 63 -223 -189 59 426 435 55 -70 616 864 542 -13 191 691 9 -478 -253 199 -649 -564 -253
1528b53K71l09k55M32Q76q52k63Q28P06n22n72l6Q31m00j143O60M67o06m13P7
$$ -253 18 -291 -546 -114 762 -90 -353 475 1181 659 87 51 882 482 -661 -1 466 -140 -553 -476
1548d76L11Q8n48K73N31k28j44J41L58L26k99j17L59k10j9O9m66j04L72o25M46
$$ -476 -165 -77 -625 -352 179 -49 -193 -52 306 632 333 216 575 365 346 415 -51 -155 217 -408 38
1569C8k72j87L95m26p1O02ko26P27P63o47k27K31K06o9K5l50K57m66j67Kq2M39
$$ 38 -234 -421 -26 -452 -523 79 77 -549 178 941 294 67 298 504 435 460 110 367 -99 -266 -264 -346 93
1592I3p61P8M51j46l57J49Q92J08o67O5O93L9m83J69J90j49m48j05O21m38j69
$$ 93 -668 -590 -139 -285 -642 -493 399 507 -160 -95 598 637 154 323 513 364 -84 -189 432 -6 -175
1613a75k63M36o58L03m35N93P1l8n0M25k38K9O00j21j12L2L4k48j41r8L15l75
$$ -175 -438 -2 -660 -357 -792 -199 -128 -166 -216 209 -29 0 600 479 367 399 433 185 44 -54 261 -114
1635a14j4l93J53k07R0N64p2l27j88M26N63j21k81K51K77l98j41L38J10p54j14
$$ -114 -128 -521 -368 -575 -485 79 7 -320 -508 -82 481 360 79 330 607 209 68 406 516 -238 -352
1656c52K80L06o48m99N61K77o17J43N47K28k69j13N00J31j86j20M65qn45j57L67
$$ -352 -72 234 -414 -913 -352 -75 -692 -549 -2 226 -43 -156 344 475 289 169 634 626 81 -76 291
1677B91r5l22j80N4R2m46J72j94L13k18N45K39j45k06N00Q5n05R9L82j03k09m12
$$ 291 196 -126 -306 -252 -160 -606 -434 -628 -315 -533 12 251 106 -100 400 485 -20 79 461 358 149 -263
1699b63N39k97j49j78K56m33P7J29M12L0o01J89N23K21n25J56M21K35n44J70J76
$$ -263 276 -21 -170 -348 -92 -525 -448 -319 93 123 -478 -289 234 455 -70 86 507 742 198 368 544
1720E44j84q54P43j66k81k17K80K0K6p28M84M38k78J76k9L61om3k4L06l27m3j87
$$ 544 360 -494 249 83 -198 -415 -135 -115 -89 -817 -333 105 -173 3 -26 335 329 286 262 568 241 198 11
1743A1J57k43R0n9r0m02L61N3j95l21M47L50j21j15K29N31j23n92N77q6m37L34
$$ 11 168 -75 15 -44 -134 -536 -175 -122 -317 -638 -191 159 38 -77 152 683 560 -32 545 459 22 356
1765C56j62l58R0j83o9L34m44k36L57J09P5m17O47J93m91L84K34Pk41L49l3l65
$$ 356 194 -164 -74 -257 -326 8 -436 -672 -315 -206 -131 -548 99 292 -199 185 419 426 185 534 501 136
1787A36j9l9L2k44k47J21k0o6j83K03M21k46l18P78j08p3R2N8K70m67j95L27K52
$$ 136 117 78 110 -134 -381 -260 -280 -346 -529 -326 95 -151 -469 309 201 128 220 278 548 81 -114 213 465
1810D65l94o8M7j32m03o6M17N1o34J57O43K10m80p0M65J4j50KK07J4k34L08Q1
$$ 465 71 3 50 -82 -485 -551 -134 -83 -717 -560 83 293 -187 -257 208 222 72 74 281 295 61 369 450
1833D50l44j98l86N08l21k76L06m5j49L11r7J72o3nJ70M04m12N33j40l93Q7K69
$$ 450 106 -92 -478 30 -291 -567 -261 -306 -455 -144 -241 -69 -132 -137 33 437 25 558 418 25 112 381
1855C81j98k12j04j29K83k83m47M14L15l61o7n5Q01j31n50O77K52j47k97L53o8
$$ 381 183 -29 -133 -262 21 -262 -709 -295 20 -341 -408 -463 338 207 -343 334 586 439 142 495 427
1876D27q5m43K00J17n76J22l2k9J37l52N12l34mJ26L73j46J64oq7L37k75k49L35
$$ 427 342 -101 99 216 -360 -238 -270 -299 -162 -514 -2 -336 -340 -214 159 13 177 171 84 421 146 -103 232
1899B32P0j93kj93l60J33l8K13j88j81N11k6k09m8L21J61k05Q8L87j55k25N7P1
$$ 232 302 109 107 -86 -446 -313 -351 -138 -326 -507 4 -22 -231 -279 42 203 -2 86 473 318 93 150 221
1922B21j32k02j6j45Kj57P6K51k08j08K12N9M53m40J91K43J13l72J20N42k82m63
$$ 221 89 -113 -129 -274 -272 -429 -353 -102 -310 -418 -206 -147 306 -134 57 300 413 41 161 703 421 -42
1944d2jJ77l3j93L5j25J55j82J29j66j91J38K95p8K45K1rK06l0j48K96l83np6
$$ -42 -43 134 101 -92 -57 -182 -27 -209 -80 -246 -437 -299 -4 -82 163 184 175 381 351 203 499 116 111 35
1968C5K8l43l83O71k33j9k56M39k78J39J77n1L03j33J94j02K85k59m30M11O7j21
$$ 35 63 -280 -663 8 -225 -244 -500 -61 -339 -200 -23 -74 229 96 290 188 473 214 -216 195 262 141
1990A41K81m75LN7j65K1q7P9k26K45o1K58j21k2L39j43K85l16k08M91m4j65n5
$$ 141 422 -53 -50 7 -158 -137 -224 -145 -371 -126 -187 71 -50 -72 267 124 409 93 -115 376 332 167 112
2013A12k1k03l8m56M43P6k69K79j20J12n5K18P4R1p3J45J87m00p6J84k54J50k6
$$ 112 91 -112 -150 -606 -163 -87 -356 -77 -197 -85 -140 78 152 243 170 315 502 102 26 210 -44 106 80
2036H0m51N19k41l89J11k2N1P4L7k14K71mN9L61l2K22p2J56j90n9L4l80M1q5J50
$$ 80 -371 148 -93 -482 -371 -393 -342 -268 -231 -445 -174 -178 -119 242 210 432 360 516 326 267 301 -79 -38 -123 27
2061B7n38Q7P01n84J28p1L29l3j29J36J92L49l21j84J55rL6k33R6m2n78K04K67
$$ 27 -511 -424 277 -307 -179 -250 79 46 -83 53 245 594 273 89 244 235 271 38 134 92 -486 -282 -15
2084a5q7q0k50j67N14n7j0K10j87R6M88l33J09k1K49J23m77q5J35o0p3k69j28
$$ -15 -102 -182 -432 -599 -85 -142 -152 58 -129 -33 455 122 231 210 459 582 105 20 155 95 22 -247 -375
2107c75L15k88j34N37j13k88M19L39k76j98P0N37l70J74P8p5k35O7j53nl78J48
$$ -375 -60 -348 -482 55 -58 -346 73 412 136 -62 8 545 175 349 427 352 117 184 31 26 -352 -204
2129b04R8r1Q7k28L70J47k47p9J89L21m15J07J12j57J46J03Q4o74J56j9o7k1L65
$$ -204 -106 -197 -110 -338 32 179 -68 -147 42 363 -52 55 167 10 156 259 343 -331 -175 -194 -261 -282 83
2152H3k11k97N6K6nM58l94K15N05j80o0j38K30r6l29L43j24J96r4q8J51n00j08
$$ 83 -128 -425 -369 -343 -348 110 -284 -69 436 256 196 58 288 192 -137 206 82 278 184 96 247 -253 -361
2175c61kK53L6o36O25J43j32J67J2m6L36k14L0j46L10j19k99N8Q7j8n63M57q2
$$ -361 -363 -110 -74 -710 -85 58 -74 93 105 59 395 181 211 65 375 256 -43 15 102 84 -479 -22 -104
2198a04M3j33j84J98J38M39m03J1J92q9L43j72r2J08k9M0l08j31n1R5j54qj57
$$ -104 -61 -194 -378 -180 -42 397 -6 5 197 108 451 279 187 295 266 306 -2 -133 -184 -89 -243 -251 -408
2221d08j03N93l42J21j9Q4N65m48PL36n5K6k08K10q9l17j27K07Jq2k06Q7K86l38
$$ -408 -511 82 -260 -139 -158 -74 491 43 50 386 331 357 149 359 270 -47 -174 33 34 -48 -254 -167 119 -219
2245b19j36K05J43k58L19K72j45Q6l30L81k05K00j86L6j36n0K39j44k54j15K33
$$ -219 -355 -150 -7 -265 54 326 181 267 -63 318 113 313 127 163 27 -23 216 72 -182 -297 -64
2266f4N0j02p4p8M71l02K91qJ78m09J61K48l02L06k61n4K5m7k72j53K57j16N35
$$ -64 -14 -116 -190 -268 203 -99 192 184 362 -47 114 362 60 366 105 51 76 29 -243 -396 -139 -255 280
2289B80l67k75J17n8K72P9j84K10L87n92N94o28K80J16k78k8K55l19k59L99m01
$$ 280 -87 -362 -245 -303 -31 48 -136 74 461 -131 463 -165 115 231 -47 -75 180 -139 -398 1 -400
2310d00L06m4j38K39m6J05J15J52p8k52J43nl4J16K32l97j39J60j58n8o8M1j0
$$ -400 -94 -138 -276 -37 -83 22 137 289 211 -41 102 97 63 179 411 14 -125 35 -123 -181 -249 -208 -218
2333b18J90k47N2M24k38j48L09K14k25Q3Q9J62q1m42L63k19j50k6J51k56J8O7
$$ -218 -28 -275 -223 201 -37 -185 124 338 113 196 285 447 366 -76 287 68 -82 -108 43 -213 -195 -128
2355a28r6K62m46J98L53j73O2J95j79J26J71k88K23k44J33J24k34j75Q2K14m58
$$ -128 -224 38 -408 -210 143 -30 32 227 48 174 345 57 280 36 169 293 59 -116 -34 180 -278
2376b78m8J75j16K23K0J7l10L31J38j16K40j07p1K71j80j83J08k60JJ92m20L38
$$ -278 -326 -151 -267 -44 -24 -7 -317 14 152 36 276 169 98 369 189 6 114 -146 -145 47 -373 -35
2398c5J3j88j83M3Q4L51j69J62J04m28L32j7Q5o9J05j64K19j03j34j56k8N0o3
$$ -35 -22 -210 -393 -350 -266 85 -84 78 182 -246 86 69 154 85 190 26 245 142 8 -148 -176 -126 -189
2421a89J26N5l18J36J50j02K04k06J08J88J00j09K90l80R8J21k78r6O1k33L56
$$ -189 -63 -8 -326 -190 -40 -142 62 -144 -36 152 252 143 433 53 151 272 -6 -102 -41 -274 82
2442H2j33k32J20J2k0k36J07K36M3j15KK87p7j27M35n8r6L70p57K59K12o77K80
$$ 82 -51 -283 -163 -151 -171 -407 -300 -64 -21 -136 -134 153 76 -51 384 326 230 600 -157 102 314 -363 -83
2465h3p4j78N2J2K03j34j5L62l93L48J81n07L85j98M0RO44m62k83O4q4Q4p4l1
$$ -83 -157 -335 -283 -271 -68 -202 -217 145 -248 100 281 -226 159 -39 1 10 654 192 -91 -27 -111 -27 -101 -132
2489a32J12j01o3J52R1j53L1K65j13K73l16j7p8L70m24M9O8P2J8l87R4K32l01
$$ -132 -20 -121 -184 -32 59 -94 -63 202 89 362 46 29 -49 321 -103 -54 14 86 104 -283 -189 43 -258
2512b58J51j15j99J77J10j4K64J44n8Q2j12o5j7J76j20k11J24K56k57l93K33q7
$$ -258 -107 -222 -421 -244 -134 -148 116 260 202 284 172 107 90 266 146 -65 59 315 58 -335 -102 -189
2534a89o7M5J71m18L45K63J3j79K85k18k21J70L56k6n8m18K47k1j53j47K8j01
$$ -189 -256 -211 -40 -458 -113 150 163 -16 269 51 -170 0 356 330 272 -146 101 80 -73 -220 -192 -293
2556b93J19rj14M27l10M27j00p2J09K49l0l72L76l45K69l63J94k44q8K08k25R4
$$ -293 -174 -183 -297 130 -180 247 147 75 184 433 403 31 407 62 331 -32 162 -82 -170 38 -187 -93
2578i3k08Q5K92k22j96K41n4L12Q1j16j05K49Q7k45O3k39q0K79p1k8j08p6q2r
$$ -93 -301 -216 76 -146 -342 -101 -155 157 238 122 17 266 353 108 171 -68 -148 131 60 32 -76 -152 -234 -243
2602b43R1l0K85k70K56k4m3M8J29n3k21K62J28l05J9K8O7n3k5k2m2j47j90L59
$$ -243 -152 -182 103 -167 89 65 22 70 199 146 -75 187 315 10 29 57 124 71 46 24 -18 -165 -355 4
2626Dl41L90k23J53J6K00k83L23L2l35O4k20L29k71K29L2j74o8k16O61l48l20
$$ 4 -337 53 -170 -17 -1 199 -84 239 271 -64 0 -220 109 -162 67 99 -75 -143 -359 302 -46 -366
2648c66m1K74K12J70k39J56P1q0M8n6J83j62L0j61oj02k86L38k87J65l41N18k63
$$ -366 -407 -133 79 249 10 166 237 157 205 149 332 170 200 39 33 -69 -355 -17 -304 -139 -480 38 -225
2671b25J53j31K17j46J90M19l41k61J65K6m0J50l13M59k14Jj97K58o09O08l05
$$ -225 -72 -203 14 -132 58 477 136 -125 40 66 26 176 -137 322 108 109 -88 170 -439 169 -136
2692a36J05O9j78p7L85j53j51L40Q1j09K6M9j1O3m83M25O1j86p0k15J41p2j04
$$ -136 -31 38 -140 -217 168 15 -136 204 285 176 202 251 240 303 -180 245 306 120 50 -165 -24 -96 -200
2715b00J06K41k95p9L54Pr0j8J94k61J86J24k42K40j56j64K80m74Q2P1J61k83
$$ -200 -94 147 -148 -227 127 134 44 26 220 -41 145 269 27 267 111 -53 227 -247 -165 -94 67 -216
2737b16RK7M3M34j28M9k8k29M0N61j04m77j4K42O9n20M0L10l01R5M3m5j32k1J40
$$ -216 -207 -180 -137 297 169 218 190 -39 1 562 458 -19 -33 209 278 -242 -202 108 -193 -98 -55 -100 -232 -253 -113
2762a13J88k20L26m50L98r7J57k51K46J22n61K35J17K8k91j39K71J16o6k48M27
$$ -113 75 -145 181 -269 129 32 189 -62 184 306 -255 -20 97 125 -166 -305 -34 82 16 -232 195
2783A95l81J01L22j33k26L07l60K66J73n48N97l70kJ9j49M6l10L57J66k47r4j28
$$ 195 -186 -85 237 104 -122 185 -175 91 264 -284 313 -57 -59 -40 -189 -143 -453 -96 70 -177 -271 -399
2805c99M24l07L39j31N68n15l9L66r0n8l15J44L36k09l80J75K15m69K36q3L20
$$ -399 25 -282 57 -74 494 -21 -60 306 216 158 -157 -13 323 114 -266 -91 124 -345 -109 -192 128
2826A28k64j27J77m9j07J71J05o7o4K72K6j67n4O6j5K01j73K6j22k7k49K56j2
$$ 128 -136 -263 -86 -135 -242 -71 34 -33 -97 175 201 34 -20 46 31 232 59 85 -37 -64 -313 -57 -69
2849f9l5r7J44J17k10L00K21j45m23L62l64L24J0o5K99k41l59M93p5Q3m77Q7r
$$ -69 -104 -201 -57 60 -150 150 371 226 -197 165 -199 125 135 70 369 128 -231 262 187 270 -207 -120 -129
2872a29j67K29R9L6J87k44P3K53l68K33r9J27k3l82K82j88j63K22j77K68j01l43
$$ -129 -296 -67 32 68 255 11 84 337 -31 202 103 230 207 -175 107 -81 -244 -22 -199 69 -32 -375
2894c75L38k4l49M63J53j59PM5J64k54J35l6O1j22j77L62r7l33O4m9N9P2m56K18
$$ -375 -37 -61 -410 53 206 47 54 99 263 9 144 108 169 47 -130 232 135 -198 -134 -183 -124 -52 -508 -290
2918b90K63o0K05j48K58k70RM0j45L38R3j13j19l44K02k59K48k37K27Q9j8k61
$$ -290 -27 -87 118 -30 228 -42 -33 7 -138 200 293 180 61 -283 -81 -340 -92 -329 -102 -13 -31 -292
2940b92j8M30j50J39k69L72k69K51j13p4M84o90P9K85J72m01q3J8j7K46j72J01
$$ -292 -310 120 -30 109 -160 212 -57 194 81 7 491 -199 -120 165 337 -64 -147 -129 -146 100 -72 29
2962B9j46M01j56j39j24J21j80N23l54J19L10l28lmpj96k40K03J13R1k89K64L8
$$ 29 -117 284 128 -11 -135 -14 -194 329 -25 94 404 76 73 69 62 -134 -374 -171 -58 33 -256 8 46
2985D6k45lL4M06j44K48l88L21l03L76k71p5j54K29J70k97j18j93M57j6j51m0
$$ 46 -199 -202 -168 238 94 342 -46 275 -28 348 77 2 -152 77 247 -50 -168 -361 96 80 -71 -111
3007a11L2q8M28k95p4J33K4J06R2J91N8n31j03L3k84N01k39O9j13j18J33J48j23
$$ -111 -79 -167 261 -34 -108 25 49 155 247 438 496 -35 -138 -105 -389 112 -127 -58 -171 -289 -156 -8 -131
3030a31j26m6M15Mlj28r0J81j63M25k35r5o7m6L42n31%j08J83K29Nj16n1Q5J41
$$ -131 -257 -303 112 116 113 -15 -105 76 -87 338 103 8 -59 -105 237 -294 -294 -402 -219 10 15 -101 -152 -67 74
3055G4j03K4j31J67j56M51k19p8%j84J61j13Qk1k3K24j96M9l0P7k26j7K30N7k63
$$ 74 -29 -5 -136 31 -125 326 107 29 29 -155 6 -107 -99 -120 -143 81 -115 -66 -96 -19 -245 -262 -32 25 -238
3080b38L77J25j13Lj13k0kr0J22J17j66o7P3k43L76m81L50j54J76M2R7j58j30
$$ -238 139 264 151 154 41 21 19 -71 51 168 2 -65 8 -235 141 -340 10 -144 32 74 171 13 -117
3103a17L78M1r5p9NL3J90l64j06L53l7m65L52K9j81KQ1o3k29J61M55k91J52K20
$$ -117 261 302 207 128 133 166 356 -8 -114 239 202 -263 89 118 -63 -61 20 -43 -272 -111 344 53 205 425
3127D25k06k98J86M3j29l03L66p7J48k38N9k04OO7r3m2J17L13l96L40k46L87J91
$$ 425 219 -79 107 150 21 -282 84 7 155 -83 -24 -228 -222 -155 -248 -290 -173 140 -256 84 -162 225 416
3150D16m9k23O1m23M8J00m6P5o0l0l82L22J47k51Q5K61N6k84M83l52K24n9j1O6
$$ 416 367 144 205 -218 -170 -70 -116 -41 -101 -131 -513 -191 -44 -295 -210 51 107 -177 306 -46 178 119 108 174
3174A74M3k90m2l4j05K26l4J46J19k18l37L94p2P8j03R0J38j32J53j77Jm8J37
$$ 174 217 -73 -115 -149 -254 -28 -62 84 203 -15 -352 42 -30 48 -55 35 173 41 194 17 18 -30 107
3197A07K70l57P2j28K72l91OR4j2l5M27n67J22P0j71K21oJ89k53J55l5K5k11L85
$$ 107 377 20 92 -36 236 -155 -149 -55 -67 -102 325 -242 -120 -50 -221 0 -6 183 -70 85 50 75 -136 249
3221B49k50J29k88O0M9j18J35J53j88M4l16K34K4mK84l07L25M3k40K23m18J19
$$ 249 -1 128 -160 -100 -51 -169 -34 119 -69 -25 -341 -107 -83 -87 197 -110 215 258 18 241 -177 -58
3243e8J02l3J46l27J65q6j7K00j89jM5J26o5l30N20j97QJ99p0k22J6L79j25m58
$$ -58 44 11 157 -170 -5 -91 -108 92 -97 -98 -53 73 8 -322 198 1 9 208 138 -84 -68 311 186 -272
3267b72M68p3l74J29p4lL7k6K02j6P9l34P99l79P4k27J33l94L10J13L8r4j74r2
$$ -272 196 123 -251 -122 -196 -199 -162 -188 14 -2 77 -257 542 163 237 10 143 -251 59 172 210 116 -58 -150
3291a50m5Q6m1J65l30L27L0qJ2j09N0K1R3J10jM8k02o0J81R8m99O6K9J00N5j10
$$ -150 -195 -109 -150 15 -315 12 42 34 46 -63 -13 8 101 211 210 258 56 -4 177 275 -224 -158 -129 -29 26 -84
3317h4J09k02j0M5m7K28q0P6j11k10K55N1P2J7j74L42l49l56N60j40K4j51j04
$$ -84 25 -177 -187 -142 -189 39 -41 35 -76 -286 -31 20 92 109 -65 277 -72 -428 132 -8 16 -135 -239
3340b39L75p6o9K97l83RK00P0j86L8q8Q7J34k28K09l4m0k09P0k73M04l22J94L5
$$ -239 136 60 -9 288 -95 -86 114 184 -2 36 -52 35 169 -59 150 116 76 -133 -63 -336 68 -254 -60 -25
3364b5o5K2j92J95L21j27k15J11J36R0j50J90k47O4l69J28J0r2L32k33J50l75
$$ -25 -90 -68 -260 -65 256 129 -86 25 161 251 101 291 44 108 -261 -133 -123 -215 117 -116 34 -341
3386c41L03j40K58J12m31M08P3j82j32K02j69K80K4j29r9K24l95K3J78j60J61
$$ -341 -38 -178 80 192 -239 169 242 60 -72 130 -39 241 265 136 37 261 -134 -111 67 -93 68
3407F8n6k00Q9n7K9Q9J60j73q0M84l88q8O1j9J63K5q1K13l49K39r7J8j85j30L57
$$ 68 12 -188 -99 -156 -127 -38 122 -51 -131 353 -35 -123 -62 -81 82 107 26 239 -110 129 32 50 -135 -265 92
3432I2k79Q5J26k13K14J38k07j4l4M00k44m7O7o0L87k16l33J47j11J55j24J29
$$ 92 -187 -102 24 -189 25 163 -44 -58 -92 308 64 17 84 24 411 195 -138 9 -102 53 -71 58
3454E8k18J2k07K72KJ71Q8q1j40L71m25O3M10l54Q7o1R3k26m7J95k26J30R1l76
$$ 58 -160 -148 -355 -83 -81 90 178 97 -43 328 -97 -34 376 22 109 48 141 -85 -132 63 -163 -33 58 -318
3478c18N80l26K1q6L48j56j14j53O7L25m43M08K2j89j12J40J22j55j5o9j32M56
$$ -318 262 -64 -43 -129 219 63 -51 -204 -137 188 -255 153 175 -14 -126 14 136 -19 -34 -103 -235 221
3500B21k84Q5oK91l20r7M10k93L88l32m4j86K75k45J35j78J84k92L28q8j42M0
$$ 221 -63 22 16 307 -13 -110 300 7 395 63 19 -167 108 -137 -2 -180 4 -288 40 -48 -190 -150
3522a50L69j52K5k37O3R5k44L59J25r5K43n40P9j65P0K11k43K22l28j07J25J89
$$ -150 219 67 92 -145 -82 13 -231 128 253 158 401 -139 -60 -225 -155 56 -187 35 -293 -400 -275 -86
3544h6L0J92l07J81J80k78J50J28k40j07J0K39L7J00j55J45n2m18K2J36J34J5
$$ -86 -56 136 -171 10 190 -88 62 190 -50 -157 -147 92 129 229 74 219 167 -251 -229 -93 41 56
3566E6p1J95m85K45L25k57J55j52rK1J87n1l68K73J93k12k12Q3j33J56j99J86
$$ 56 -15 180 -305 -60 265 8 163 11 2 23 210 159 -209 64 257 45 -167 -84 -217 -61 -260 -74
3588g4N2j53J81q9L08j00k00K21k81O76k86j83Q1J5j94N6O7l62K27O4j10j83K38
$$ -74 -22 -175 6 -83 225 125 -75 146 -135 541 255 72 153 168 -26 30 97 -265 -38 26 -84 -267 -29
3611b9R5j10m0J80k08K40o4J93m87K30J80m30K56j04J62r3j92J40mRJ9PO6j62
$$ -29 66 -44 -84 96 -112 128 64 257 -230 0 180 -250 6 -98 64 -29 -221 -81 -85 -76 -57 -50 16 -146
3635a46J84j71j6K26k1j6P4o1m3oj67L10j42r0L49l12J72k6k13J12l71M98k19
$$ -146 38 -133 -149 77 56 40 114 53 10 4 -163 147 5 -85 264 -48 124 98 -115 -3 -374 124 -95
3658i5k11N30k28K68m01L83p7j95K04k24K33k71p1N3J92j71J69j68o7J70J90m45
$$ -95 -306 224 -4 264 -137 246 169 -26 178 -46 187 -84 -155 -102 90 -81 88 -80 -147 23 213 -232
3680b32j65L37p2l4J4L83o0k2k40L1J47K6j73j48L8J90j1j1Q7l10N18J01o11K76
$$ -232 -397 -60 -132 -166 -152 231 171 149 -91 -60 87 113 -60 -208 -170 20 9 -2 85 -225 293 394 -217 59
3704E9J03j06l21L64k8k60k00M15PKj32K56k84L18l04J28j55J02J67l98L87j47
$$ 59 162 56 -265 99 71 -189 -389 26 33 35 -97 159 -125 193 -111 17 -138 -36 131 -267 120 -27
$$ [...]
8191C09
##END NTUPLES=NMR FID
##END=
