##TITLE=1H_Pr Q-27
 200.13MHz, CDCl3,
 8 sc
 
 27.1.2025
##JCAMPDX= 6.0         $$ Bruker NMR JCAMP-DX V2.0
##DATA TYPE= NMR FID
##DATA CLASS= NTUPLES
##ORIGIN= UXNMR, Bruker Analytische Messtechnik GmbH
##OWNER= pz
$$ XWIN-NMR		Version 3.5
$$ Mon Jan 27 14:38:45 2025 Russian Standard Time (UT+4h)  she@DPX200
##.OBSERVE FREQUENCY= 200.1313
##.OBSERVE NUCLEUS= ^1H
##.DELAY= (6, 6)
##.ACQUISITION MODE= SIMULTANEOUS
##.ACQUISITION SCHEME= undefined
##.AVERAGES= 8
##.DIGITISER RES= 18
##SPECTROMETER/DATA SYSTEM= spect
##.PULSE SEQUENCE= zg30
##.SOLVENT NAME= CDCl3
##.SHIFT REFERENCE= (INTERNAL, CDCl3, 0, 14.3821)
##AUDIT TRAIL= $$ (NUMBER, WHEN, WHO, WHERE, WHAT)
$$ ##TITLE= Audit trail, XWIN-NMR		Version 3.5
$$ ##JCAMPDX= 5.01
$$ ##ORIGIN= Bruker BioSpin GmbH
$$ ##OWNER= she
$$ F:/spectra/data/she/nmr/H-C/1/audita.txt
$$ ##AUDIT TRAIL=  $$ (NUMBER, WHEN, WHO, WHERE, WHAT)
(   1,<2025-01-27 14:36:59.68 +0400>,<she>,<DPX200>,
      <created by zg, POWCHK disabled, PULCHK disabled
       configuration hash MD5:
       00 E9 B6 7A A2 85 ED C7 34 08 36 98 17 FE 4E 26
       data hash MD5: 16K
       94 E7 FC E0 A5 C7 44 0A 5B 7B 3F EE CC 69 80 F1>)
$$ ##END=
$$ 
$$ hash MD5
$$ A3 46 1F 24 11 16 CA D8 E6 34 93 31 DE 19 26 AC
##$RELAX= 
##$RELAX= 
##$RELAX= 
##$RELAX= 
##$RELAX= 
##$RELAX= 
$$ Bruker specific parameters
$$ --------------------------
##$DU= <F:/spectra>
##$EXPNO= 1
##$NAME= <H-C>
##$PROCNO= 1
##$TYPE= <nmr>
##$USER= <she>
##$AMP= (0..31)
100 100 100 100 100 100 100 100 100 100 100 100 100 100 100 100 100 100 
100 100 100 100 100 100 100 100 100 100 100 100 100 100 
##$AQSEQ= 0
##$AQ_mod= 1
##$AUNM= <au_zg>
##$AUTOPOS= <>
##$BF1= 200.13
##$BF2= 200.13
##$BF3= 200.13
##$BF4= 200.13
##$BF5= 200.13
##$BF6= 200.13
##$BF7= 200.13
##$BF8= 200.13
##$BYTORDA= 1
##$CFDGTYP= 0
##$CFRGTYP= 5
##$CHEMSTR= <none>
##$CNST= (0..31)
1 1 145 1 1 1 1 1 1 1 1 1 1 1 1 1 1 1 1 1 1 1 1 1 1 1 1 1 1 1 1 1 
##$CPDPRG= <>
##$CPDPRG1= <>
##$CPDPRG2= <>
##$CPDPRG3= <>
##$CPDPRG4= <mlev>
##$CPDPRG5= <mlev>
##$CPDPRG6= <mlev>
##$CPDPRG7= <mlev>
##$CPDPRG8= <mlev>
##$CPDPRGB= <>
##$CPDPRGT= <>
##$D= (0..31)
0 0.7 0 0 0 0 0 0 0 0 0 0.03 0 0 0 0 0 0 0 0 0 0 0 0 0 0 0 0 0 0 0 0 
##$DATE= 1737974219
##$DBL= (0..7)
120 120 120 120 120 120 120 120 
##$DBP= (0..7)
150 150 150 150 150 150 150 150 
##$DBP07= 0
##$DBPNAM0= <>
##$DBPNAM1= <>
##$DBPNAM2= <>
##$DBPNAM3= <>
##$DBPNAM4= <>
##$DBPNAM5= <>
##$DBPNAM6= <>
##$DBPNAM7= <>
##$DBPOAL= (0..7)
0.5 0.5 0.5 0.5 0.5 0.5 0.5 0.5 
##$DBPOFFS= (0..7)
0 0 0 0 0 0 0 0 
##$DE= 6
##$DECBNUC= <off>
##$DECIM= 32
##$DECNUC= <off>
##$DECSTAT= 4
##$DIGMOD= 1
##$DIGTYP= 9
##$DL= (0..7)
0 120 120 120 120 120 120 120 
##$DP= (0..7)
150 150 150 150 150 150 150 150 
##$DP07= 0
##$DPNAME0= <>
##$DPNAME1= <>
##$DPNAME2= <>
##$DPNAME3= <>
##$DPNAME4= <>
##$DPNAME5= <>
##$DPNAME6= <>
##$DPNAME7= <>
##$DPOAL= (0..7)
0.5 0.5 0.5 0.5 0.5 0.5 0.5 0.5 
##$DPOFFS= (0..7)
0 0 0 0 0 0 0 0 
##$DQDMODE= 0
##$DR= 18
##$DS= 0
##$DSLIST= <SSSSSSSSSSSSSSS>
$$ [...]
##$SUBNAM0= <"">
##$SUBNAM1= <"">
##$SUBNAM2= <"">
##$SUBNAM3= <"">
##$SUBNAM4= <"">
##$SUBNAM5= <"">
##$SUBNAM6= <"">
##$SUBNAM7= <"">
##$SUBNAM8= <"">
##$SUBNAM9= <"">
##$SW= 18.0517328524113
##$SWIBOX= (0..15)
0 0 2 0 0 0 0 0 0 0 0 0 0 0 0 0 
##$SW_h= 3612.71676300578
##$TD= 16384
##$TD0= 1
##$TE= 0
##$TE2= 300
##$TE3= 300
##$TEG= 300
##$TL= (0..7)
0 120 120 120 120 120 120 120 
##$TP= (0..7)
150 150 150 150 150 150 150 150 
##$TP07= 0
##$TPNAME0= <>
##$TPNAME1= <>
##$TPNAME2= <>
##$TPNAME3= <>
##$TPNAME4= <>
##$TPNAME5= <>
##$TPNAME6= <>
##$TPNAME7= <>
##$TPOAL= (0..7)
0.5 0.5 0.5 0.5 0.5 0.5 0.5 0.5 
##$TPOFFS= (0..7)
0 0 0 0 0 0 0 0 
##$TUNHIN= 0
##$TUNHOUT= 0
##$TUNXOUT= 0
##$USERA1= <user>
##$USERA2= <user>
##$USERA3= <user>
##$USERA4= <user>
##$USERA5= <user>
##$V9= 5
##$VALIST= <valist>
##$VCLIST= <CCCCCCCCCCCCCCC>
##$VD= 0
##$VDLIST= <DDDDDDDDDDDDDDD>
##$VPLIST= <PPPPPPPPPPPPPPP>
##$VTLIST= <TTTTTTTTTTTTTTT>
##$WBST= 1024
##$WBSW= 4
##$XGAIN= (0..3)
0 0 0 0 
##$XL= 0
##$YL= 0
##$YMAX_a= 207694
##$YMIN_a= -215748
##$ZGOPTNS= <>
##$ZL1= 120
##$ZL2= 120
##$ZL3= 120
##$ZL4= 120
##$ABSF1= 10
##$ABSF2= 0
##$ABSG= 5
##$ABSL= 3
##$ALPHA= 0
##$AQORDER= 0
##$ASSFAC= 0
##$ASSFACI= 0
##$ASSFACX= 0
##$ASSWID= 0
##$AUNMP= <proc_1d>
##$AZFE= 0.1
##$AZFW= 0.1
##$BCFW= 1
##$BC_mod= 2
##$BYTORDP= 1
##$COROFFS= 0
##$CY= -3
##$DATMOD= 1
##$DC= 2
##$DFILT= <>
##$DTYPP= 0
##$F1P= 0
##$F2P= 0
##$FCOR= 0.5
##$FTSIZE= 0
##$FT_mod= 4
##$GAMMA= 1
##$GB= 0.15
##$INTBC= 1
##$INTSCL= 1
##$ISEN= 128
##$LB= 0.25
##$LEV0= 0
##$LPBIN= 0
##$MAXI= 10000
##$MC2= 0
##$MEAN= 0
##$ME_mod= 0
##$MI= 1.114404
##$NCOEF= 0
##$NC_proc= 0
##$NLEV= 6
##$NOISF1= 3.799351
##$NOISF2= 2.8
##$NSP= 1
##$NTH_PI= 0
##$NZP= 0
##$OFFSET= 14.38212
##$PC= 1
##$PHC0= 296.8496
##$PHC1= -52.60778
##$PH_mod= 1
##$PKNL= yes
##$PPARMOD= 0
##$PSCAL= 0
##$PSIGN= 0
##$REVERSE= no
##$SF= 200.129724274929
##$SI= 16384
##$SIGF1= 3
##$SIGF2= 2
##$SINO= 400
##$SIOLD= 16384
##$SREGLST= <1H.CDCl3>
##$SSB= 0
##$STSI= 0
##$STSR= 0
##$SW_p= 3205.1282051282
##$SYMM= 0
##$S_DEV= 0
##$TDeff= 0
##$TDoff= 0
##$TI= <>
##$TILT= no
##$TM1= 0
##$TM2= 0
##$TOPLEV= 0
##$USERP1= <user>
##$USERP2= <user>
##$USERP3= <user>
##$USERP4= <user>
##$USERP5= <user>
##$WDW= 1
##$XDIM= 8192
##$YMAX_p= 0
##$YMIN_p= 0
$$ End of Bruker specific parameters
$$ ---------------------------------
##NTUPLES= NMR FID
##VAR_NAME=  TIME,          FID/REAL,        FID/IMAG
##SYMBOL=    X,             R,               I
##VAR_TYPE=  INDEPENDENT,   DEPENDENT,       DEPENDENT
##VAR_FORM=  AFFN,          ASDF,            ASDF
##VAR_DIM=   8192,          8192,            8192
##UNITS=     SECONDS,       ARBITRARY UNITS, ARBITRARY UNITS
##FACTOR=    0.0002768,     1,               1
##FIRST=     0,             0,               0
##LAST=      2.2672688,     0,               0
##MIN=       0,             -215748,         0
##MAX=       2.2672688,     207694,          0
$$ Real data points
##PAGE= N=1
##DATA TABLE= (X++(R..R)), XYDATA
0@%%%%%%%%%%%%%%%%%%JrJ6j6J6j6J6j8K6l2L2l6M4m9N4o1O9p8Q6r7J10j20J32
41G0j48J64j81K00k21K45k71K97l26L59l95M37m84N35n94O61p39Q34r46J081j251
62f73J473j773K199k852L961o171J2145n7839j66218J73807K13608q3149j82987
75i4469J2207J10966K3886k8121j1643m7079m1014P5691J05529o0119j50323R656
87i4833J62627M4411j35416p9716Q1578Q1831k1640m9771j4826J068K2384M8099
99D5796k927q0200k6809Q3258M7738o6007n1612M0019L2776k5278j619K6721l0231
112h375m2001N0298O5805m7034q2932K9344Q7489r693p6164Q68N6782n486l7724
125a8823K1004K8500m4766l8957O0278N7690o2573p4164N2016Q1918l1292p6230
$$ y = [0, 0, 0, 0, 0, 0, 0, 0, 0, 0, 0, 0, 0, 0, 0, 0, 0, 0, 0, 1, -8, 8, -8, 8, -8, 8, -10, 16, -16, 16, -20, 24, -25, 29, -32, 37, -41, 45, -52, 58, -62, 70, -78, 86, -95, 105, -116, 129, -142, 155, -171, 188, -207, 230, -254, 281, -313, 348, -391, 443, -503, 578, -673, 800, -973, 1226, -1626, 2335, -3836, 8309, -49530, -215748, -41941, 171667, 88518, -94469, -82262, 28704, 52590, 24469, 12826, -34253, -75267, 424, 105953, 45834, -104489, -94833, 67794, 112205, -23211, -102927, -21349, 60482, 38842, -10929, -25755, -24687, -2303, 45796, 42869, -37331, -64140, 19118, 66856, 849, -50763, -10744, 22032, -3246, -4865, 21856, -8375, -50376, -78, 65727, 18693, -64239, -34895, 52594, 42901, -33263, -32395, 24387, 18901, -18823, 2181, 30681, -14085, -53042, 7236, 64926, 2353, -71811, -19795, 62123, 30831, -45399]
137d5399J2804N8001l850l2914J0790J2230k4494r07L9025J735m9675j2886M8561
150A3021K2650l9905k6313K4974K1066j1406r356N271l717p617J6681J6869k2156
163F2k4025K1915K7219j8086k5440J4627K0256j5856j5551K0734J0586k8265j1715
176b3539L1277J5738k9358j7999K5667J7256k0336j0269J7193N57j8054Q488K6093
189B2714j0835l6147O653M2442M28m3084j1167L3831J7131k0084j5443O819O096
202f46J407R007j674k1882n290K9510J7853k7118k8380J8524L3006p652k8849
215a2184l201J6271O901k747l923r065p105J5210J9403j3680k8087P982L1249
228A7024J649k6749q677J9463J0483j0419o379L490j322p42P436J399j2518p462
$$ y = [-45399, -32595, 25406, 21556, -11358, -568, 11662, -12832, -13739, 25286, 27021, -22654, -35540, 13021, 35671, -4234, -30547, -5573, 15493, 4087, -5269, 2, -3715, -11332, 5349, 22218, 62, -23963, -2048, 25171, 7085, -18355, -3728, 16528, 672, -14879, 5855, 16441, -11824, -23539, 7738, 23476, -5882, -23881, 1786, 19042, -1294, -11563, 5630, 6187, -11867, -3379, 22714, 11879, -24268, -17615, 24827, 25255, -17829, -28996, 4835, 21966, 1882, -13561, -6742, -646, 761, 9768, 8094, -13788, -19078, 10432, 28285, 1167, -27213, -8689, 24317, 16665, -12184, -15385, 886, 7787, 5040, 1117, -7948, -15053, 157, 19560, 5880, -22207, -14225, 17024, 18673, -8076, -16753, 2710, 13193, 2774, -3605, -115, -1437, -2179, 5257, 6656, -5862, -13324]
242a3324J4016J2177j3100j4195J0655J3821o770j0733N427Q132n592m687Q590
255D417K071j0576l91J0947l10j1471j211J0447K01j0069R33Q637k024p234L160
270b473P052k403p350L505Q115l208p506L463O423l158n671K783M403m551m387
285d963O259K353p986j489Q216J875p910j959Q196L204p474k007N873J676l417
300D47o66J885j86k634J691K656m178m375M522M977m195n805K650P197j465o327
316c806J401M807p76j623J118L44k188N68L909j062o167P73N758n48n229j544
332d265L978K737l202k349K384J549q88J60N79m22m85J381J924k692k863L166
348F92L174l284l707J813L065j042l259L09K172l28p2O41j131k46J801J734r84
$$ y = [-13324, 692, 12869, -231, -14426, -3771, 10050, 3280, -7453, -2026, 6106, 514, -4173, 4417, 6488, -4088, -4479, 6468, 6158, -5313, -6524, 3923, 4124, -5945, -5012, 3625, 1601, -5633, -2473, 4579, 2176, -5174, -1669, 6446, 3238, -4268, -805, 5618, 2460, -3211, -428, 3975, -576, -4963, 1296, 3649, -4337, -5826, 2390, 4265, -3645, -5604, 2592, 5796, -1678, -3685, 2188, 3864, 447, -219, 1666, 1480, -1154, 537, 3193, -985, -5360, -838, 4139, -56, -5861, -3211, 3986, 2521, -3806, -2405, 2402, 1626, 3, 1121, 1465, -723, -155, 3754, 2692, -3475, -2702, 3056, 2508, -2721, -4265, -287, 2450, -752, -3101, -717, 832, -56, 104, 683, 261, -224, 1157, 3081, 389, -2474, 692, 3866, 582, -3125, -1312, 1753, 711, -2548, -2239, -67, -395, -467, 174, -957, -1203, 598, 2332, 1348]
365A348k607J42L424R17l368j612J508J787p12k041j14o8j51J817Q54k606j517
382b999K619L124p91l552k30K964J490n73j719j801J158K288K47k202l074L25
398b726L572J486k447l575L50M058K418k085l618l76L481M335j486n838j382N150
414A317L927k590n661o03L756K408o36l506l168J846N205J714m202n201J777P479
430C862K864o213o207K926P963R30o538m137K652M389J367k879m609j190L868
445i52M881q41o504l113N404O956p08q103m083O883P902k699q183j921N539M505
461D963j865m713k243J068L778K946k636n322j510N021O502j905r184k401R213
476A712P245n375r260J032Q030J995m272l159q25J151L010K647k392o824j848
$$ y = [1348, -1259, -1117, 2307, 3224, -144, -1756, -248, 1539, 827, -1214, -1328, -1396, -1547, 270, 1124, -1482, -2999, -380, 2744, 1953, -1599, -1829, 1135, 2625, 2052, 333, -1468, -310, 1978, 2225, 23, -3051, -2726, 846, 2332, -115, -3690, -3340, 718, 3136, 1051, -2567, -2943, 538, 4873, 3387, -2451, -3833, 1317, 5244, 2654, -3007, -3610, 146, 2554, 1918, -1588, -4756, -2910, 2295, 4009, -193, -5394, -3617, 3862, 6726, 513, -5694, -2768, 5195, 6125, -413, -4550, -1898, 2491, 3858, 979, -3630, -4820, -952, 3929, 3088, -3416, -6529, -1125, 5831, 5123, -2980, -7063, -180, 7722, 5023, -3160, -5081, 458, 4963, 3098, -1615, -3858, -2790, 988, 3934, 1298, -4024, -5534, -513, 5989, 4084, -5100, -7501, 1712, 8957, 3582, -5678, -4646, 3384, 5379, 1107, -2052, -2877, -1726, 1284, 3931, 1539, -5285, -7133]
491g133Q195P045n814j0622J129J2222N141r951q365M797Q496O38n173l591J97
506b789K329L982R88o057o492L846R629K003r387q256N946J2222N67j1897o282
521i648P995J0303k225r138k590M420M414O71l085m804j840L989P396k77j0184
536d603n362Q708J0703l544j3655j792J3416O602q106q186K140O150J006j768
550A709j094l137k107N529O228m666j0494l34J1630O117q761r585M122J0233K158
565G548p608o020L423O029J238k428l786k313K438N287J231o513o279L789R062
580E098J123q300o149M973R662J66r618m546O722P491j817o550j691K897J984
595A445J259o42m636k769M771O447k434q905j944Q652N268m930p098J590P452
$$ y = [-7133, 1062, 8107, 2293, -8329, -7200, 5022, 10163, 212, -8153, -3356, 5140, 5778, 605, -2986, -2789, -460, 3522, 4510, -1547, -8039, -4193, 5436, 7439, -1948, -10204, -4258, 7964, 8531, -3366, -9648, -1653, 8650, 6425, -2713, -5303, -883, 3531, 4202, 1117, -3687, -5527, -1538, 5858, 5581, -4603, -9965, -1257, 9446, 5902, -7753, -9545, 3871, 10473, 2367, -5819, -3679, 2471, 3477, 1709, 615, -2522, -4629, 900, 7128, 2462, -8032, -8366, 3264, 9381, 620, -8965, -4843, 5390, 7548, -60, -6080, -2657, 3372, 4610, 2182, -1604, -3917, -1479, 3808, 5039, -1474, -7753, -3964, 5098, 6221, -2079, -8228, -3255, 6407, 6573, -3045, -7591, -869, 6622, 4805, -1745, -3436, -539, 1445, 2704, 2062, -2574, -5343, -572, 5875, 3441, -5464, -7408, 1244, 6512, 1582, -5516, -3926, 3526]
610C526J735n177k828K018J619M20O01r30l028o55L963K356m185m142K360L883
626A536Q23k813k290J309L085P03j962j920Q74J653K55J0n09j826m39K027J496
643B012j939k545k9L184J494j531l122j23L210K053k326k139J430J657K68j12
659A442r21k066J01L293J203l501l217K481L468p41l130j447J945K779j53k204
675f68j160J359K183Q0j391j299j04J669J800j762k719N91K314N04j945j180M64
692a264J074Q90k3j486p48J784J181j005r11L66Q04M77k74m95q61j86Q81L99q98
711b95m92o7N50P55n58j032K04R93O13j98m54j52M80N89L67r75j030O75J167m72
731F68r76n57M83P53m49n21m32K66R42M17q07n78P43P07L69r72n48R54O18l26
$$ y = [3526, 5261, 84, -2744, -726, 893, 1313, 1914, 984, -2044, -2699, 1264, 3620, -565, -4707, -2347, 1536, 2359, -454, -2744, -1435, 1650, 2353, 391, -1529, -655, 998, 1253, 1263, 754, -1072, -1511, 516, 2012, 73, -2472, -2501, 683, 2177, 646, -2476, -2599, 611, 2664, 338, -1801, -371, 1286, 1554, 1442, 521, -1545, -1444, 1849, 3052, -449, -3666, -1185, 2283, 1542, -1588, -3035, -1090, 1689, 1536, -668, -1828, -469, 1714, 1794, 403, -896, -1000, 669, 2469, 707, -2012, -1421, 893, 1397, -548, -1728, -1264, -190, 700, 677, -809, -1557, 227, 1408, 403, -508, -142, 662, 1139, 865, 370, -491, -677, 204, 603, -295, -787, -854, -304, 451, -107, -1139, -935, 58, 671, 473, 19, -133, 347, 936, 1303, 328, -702, -27, 1140, 668, -308, -865, -382, 371, -78, -599, -1031, -765, 177, 594, -213, -791, -48, 659, 1028, 56, -492, 462, 1080, 754]
751G54p83n62O64M14o94m28k0L05N24j59p20K44M13L54k6p46M72Q36Pk83n14k97
773b45N13N47q81l41m0M46Q3o54l38M85M79k8jn41M04P00k84m1p3O6L27Q9m58
796B14l23k50M46J11o97j52K68K79J21m69j56N82K20j95n8R7M25M6J12l38j09
817A74j82M24j1p51o1L54lk25k79o6M49Nr7Q3NK36M93r8l9k73p7O11j47n95j49
842b19K85J08j65l05j23J37M2L31j90m73K19O99L69m69o54M28O79J3l64j37j09
863A02J56O2j07o98k22J63R30k23j022j55P29P58l00o46J30L90M80N51o22j013
883e57L53J187N8j216r35R59P47l61p62k57L10L29M16J6o66n17P03J540j93j961
903h07k45J816R83j400j228O82P78m99k08L1m84l55P56J047q90j398K18J872O59
$$ y = [754, -29, -591, 73, 487, -207, -635, -655, -350, 174, 15, -705, -461, -48, 306, 280, -466, 6, 842, 849, 566, 52, -245, 268, 815, -66, -407, -447, -1, 82, -572, -910, -425, 54, 26, 25, -516, -112, 588, 304, 263, 190, 256, 583, 672, 214, -109, -359, 87, 198, -499, -651, -383, -104, 17, -452, -608, -26, 194, -1, -59, 38, 463, 509, 621, 283, 174, -8, 416, 405, -346, -407, -53, -56, -281, -560, -626, -177, -172, -269, -186, -181, 55, 548, 450, 411, 138, 61, 672, 525, -70, -219, 66, 174, 9, -296, -419, -282, -240, 91, -99, -572, -353, 346, 715, 246, -408, 20, 699, 712, 348, 211, 102, 258, 320, 213, -485, -707, -544, 386, 163, -859, -1014, -285, 473, 173, -473, -343, 47, 527, 1078, 456, -557, -204, 983, 1041, -175, -1110, -151, 596, 235, -527, -784, -474, -145, 271, 287, -379, -896, -193, 1347, 1154, -807, -1052, 764, 1747, 347, -881, -199, 579, 80, -128, -97, -581, -936, -180, 867, -23, -1421, -1203, 669, 1328]
922A328j351r02M85J543L97j259p36K27M77O24l54j332j32P69P45l61r13l74L51
941g68J229O55r13j584N32K583K41k345j478J880K010j213j755L20Q01k42j14
958a61L86k92j600K49K570M96k829j292K681K374j654k761Q84K492p1j618j27
975b73N12k29k73O00L07j612o82J857J447j712j780N60K133P45j636j197P90J482
993A039N92j318j115N59J100k10n22n64k31K20K52Q96m33j736l89K541J424k053
1011E2k354J643L068o91l169Q8K472L48j635K3R57r53j244J631J707k372k146
1028b575J765L151r31l422J48K912P59k031o46J000O67l28l21M34p78q96J197
1045A05J149q55j711J9J664P61j241j151L74J023J207q74j285K16J420P94j269
$$ y = [1328, -23, -925, -440, 1103, 1500, 241, -495, -268, 209, 833, 479, -853, -985, -216, 529, 168, -745, -1119, -768, 461, 1116, 203, -1381, -849, 1734, 1975, -370, -1848, 32, 2042, 829, -926, -606, 195, -47, -161, 225, -67, -1667, -1418, 1152, 1648, -1181, -2473, 208, 2582, 928, -1833, -949, 1543, 1472, -146, -273, 239, 10, -263, 337, 644, -968, -1650, 207, 1654, -58, -1838, -1278, 855, 1600, -36, -1233, -443, 1039, 1631, 313, -802, -243, 857, 647, 125, -439, -670, -450, -198, 698, 265, -1471, -1860, 681, 2105, 52, -2302, -659, 2409, 1718, -1451, -1363, 1109, 1457, -178, -155, 802, -151, -1395, 236, 1943, -429, -2575, -810, 2341, 1410, -2012, -1864, 1048, 1807, -224, -870, 130, 797, 469, 148, 582, -196, -1092, 105, 1254, 399, -1312, -1293, 371, 1132, -109, -1260, -886, 137, 1344, 470, -815, -599, 821, 1615, 346]
1062C46j159P32P46o90L7N46o40j066P14J447o74k226L11K723N44k520p22K063
1080E12R43j460p24Q97P66j233N0J410o50j828K04K191O8k364k81J883N81j298
1098c33n44P31L32k14J98N38o73m20R65P12j131p53L06O31K9q16R3K38o2K83J68
1119B78n80n98O63J018K9j484J71J254L4j201J20Q94m35n69P58L01j044r07J294
1138dR40j276r83R56J136n76j036P67Q52j004J9P85J41q22m3O66L72j420k66J355
1158E59O2j177k61R66R0o66jJ094o60r52P10J161n08q49M54P97j83j021M97M88
1178F00n56o26O78O3n25m58Q81J66p79j41J012K01o10j65N29J80m05q5N99k39
1198C20m36P4N99m31p97K22R62m70q02M47P64m83o24P34M06m33m50O32N16p21
$$ y = [346, -813, -81, 665, -25, 12, 558, -82, -1148, -434, 1013, 339, -1887, -1576, 1147, 1691, -829, -1551, 512, 1455, -5, -729, 168, 934, -299, -249, 1161, 511, -1317, -1113, 1078, 1146, -1218, -1499, 384, 965, -333, -877, -146, 186, -28, 170, 708, 35, -385, 580, 1292, 161, -592, -286, 345, 374, -442, -349, -111, -173, 110, 278, -302, -900, -237, 781, 810, -674, -503, 751, 785, -416, -296, 598, 163, -406, 352, 653, -391, -1298, -4, 936, -340, -1323, -367, 769, 193, -843, -76, 776, -228, -209, 576, 717, -105, -148, 518, 890, -530, -796, 559, 621, -556, -817, 149, 239, -427, -428, 666, 6, -946, -236, 925, 417, -432, 22, 819, 636, -385, 112, 600, 44, -582, 96, 159, -366, -824, 57, 223, -556, -697, 315, 516, -94, -259, 270, 450, 45, -40, 559, 320, -116, -42, 557, 126, -671, -449, 513, 43, -759, -312, 452, -31, -655, 79, 485, 52, -398, 234, 750, 29]
1218B9l57Q96K59r80l74Q42k7o13q6O41j21p16J2P62j2n99Q4P65j5n46K32O93
1240G69k77q63M33O09m21n56R0N14m62n67O36K25o23k24N79L08l66k14P34K74
1260E98p91J35N65k5n20j02M76P7o71J00M93l14k98O0M67j33n89R5P68l04n02
1281d15N69M26l10o09N90K44m72l70N44M31q05j87L97Q8n14p5N60M8l78j10M07
1302E9J79m36J99K34J77m12j39N17k26l18K25J18j68k01J97O4j13k68J64O5r6
1323a79P6L78j26p7j24K13J98k98nq1K28k35K5j2K7k50J26M53l47m93L61K19l8
1346C9j22K2J69J06j87J19J11j05m2J19J16k48l01J53J81k36j47o3K56Op8J46
1368A4m3N7J52P4k7l19M5K59N7k62k3PJ00j45J9N1m03J20Q1KLl47L49M58j73k27
$$ y = [29, -328, 568, 827, -153, -527, 315, 288, -325, -411, 230, 109, -607, -595, 167, 155, -444, -360, 405, 390, -156, 76, 769, 492, -371, 62, 671, 250, -306, -216, 298, -164, -731, -95, 130, -493, -717, -138, 170, -196, -410, 324, 598, -193, -58, 507, 482, -38, -140, 336, 413, -258, -158, 335, 21, -277, -217, 250, 117, -472, -377, 391, 87, -415, 154, 580, 270, -339, 251, 495, 23, -347, 197, 628, -177, -364, 33, 121, -393, -468, 92, 140, -238, -348, 59, 238, -198, 1, 235, 412, 0, -139, 378, 152, -166, 59, 177, 9, -192, 5, 69, -44, -312, -148, -83, -179, -103, 275, 149, 72, -52, 161, 359, 61, 56, -25, 203, -32, -7, -19, 8, -242, -116, 337, -10, -503, -142, 77, 39, -83, -61, 108, 214, 27, 146, 257, 152, 110, 229, 345, 97, -204, -51, 130, -106, -253, -316, -60, -54, -132, 14, -29, 28, 180, 254, 227, -92, -47, 212, 269, 7, -16, -9, 91, -54, -35, 16, -387, -267, -186, -184, -181, -528, -179, 279, 106, -121]
1394a21mL83L1p3q7j56M0j7Q7j68j1m1kJ40n1l08j0L53K20j47j93J2L23K4j85
1419C9j12P0K30J3j65j44o4j66J10K44j65k34N9K32K45m10k27L90K23J35l35N2
1441B0j7K42K7r8k17O0P3j32J04P6l66j63K76M36n50l45L33N90j67m60J96K29
1463A47J89l72J82j31K98j73j75Q4L3l74J8M44j18l63j72N52M36n82k77M70L60
1484D76l35j12J52l6R5j14J1J5j66l38K17L38n1n88J39L52J13k72l40M31K74o9
1506A92m17K05L0Q5m3j81J14K32l24P1J21l6m59o2N96J12m34k63M17N16n10k50
1528b88M05K23j46j30K9J77j41j40M11j42n6r38N54O20n75k40J78L96j86k28j35
1549c52N01LJ27j27L2q5K1n2R1j53j18j1R7Q9J56n25j09L76K5j02k88K83M16r8
$$ y = [-121, -125, 258, 289, 216, 129, -27, 13, -4, 83, -85, -96, -137, -139, 1, -50, -358, -368, -15, 205, 58, -135, -123, 200, 224, 39, -73, -3, 227, 240, 75, -69, -133, -299, -189, 55, -110, -344, -285, -53, 192, -218, -445, -55, 168, 303, -32, 20, 3, 245, 272, 174, -43, 17, 90, -42, 62, 138, -228, -391, -115, 321, -229, -574, -241, 349, 182, -278, -82, 147, 336, -36, 146, 15, 313, 140, -35, 49, 82, -292, -274, 170, 52, -311, -483, 69, 505, -77, -354, 116, 476, 141, 29, 181, 145, 240, 126, 137, 152, -14, -352, -135, 203, 152, -436, -297, 55, 168, -104, -444, -13, 261, 192, -225, -20, 10, 95, 52, -129, -15, 217, -107, -36, 85, 49, -410, -472, 124, 236, -198, -461, -44, 472, -38, -288, 117, 340, 194, 64, 93, 270, 129, -11, 400, 258, 202, -736, -182, 438, -137, -377, -199, 197, 11, -217, -352, 149, 152, 279, 152, 184, 99, 120, 68, 159, 6, -112, -123, -26, 63, 219, -306, -415, -39, -14, -116, -404, -121, 295, 197]
1573A97j50j4L2J09j87J33P5l6l64J89K30l09l59L08K54K5m58J46M66k25j24K5
1595c7K33m6j66m7N06l30k98L78j47J03n37K88J27j0L5k03O5L9o0O4R2O6j64J39
1619I0K82l37J22J57k0k88N3L3q3l5j67M35l88k71M00j02k7j00L25K9j21k5K21
1642A83n2l34K15K77n9m91M4M34p4l16l1J13J82j96j80L55jm46K68L21j6l81K62
1665G7M40l31l07J16M35l63l22K52K53k97j93O1K34k88o5Q1J86j22rK16K26k34
1687D6K6j5K35k98j70L02k4j62R2Q8r1l25qM01k95q1J71L25j35k08K76J11k21
1710D0j67M62j36j87j42K13J9j99j86J73J02j28n0J69k3j82P2J60K18k90Q8N7
1732H3K59m00O4K97Lj85l50K22K1j67M5J29j04k75M17K63n34N0J38k9J81k46L01
$$ y = [197, 47, 33, 65, 174, -13, 120, 195, 159, -205, -16, 214, -95, -454, -146, 108, 133, -325, -179, 287, 62, -62, -37, 196, 150, -16, -63, 443, 113, -185, 193, 46, 149, -388, -100, 27, 17, 52, -151, -86, -47, -107, -43, 49, 115, -49, 90, 372, 35, 157, 314, 294, 6, 59, 92, 9, -26, -193, 242, -146, -417, -17, -119, -146, -246, 79, 108, -13, -38, 183, 131, -203, 12, 289, 230, -261, -217, 217, 143, -173, -204, -91, 91, -105, -285, 70, 69, -377, -109, 212, 196, -185, 77, 517, 186, -121, -5, 430, 67, -255, -3, 250, -47, -240, -179, 55, -233, -298, -217, -31, -153, -162, 54, 280, 46, 72, 57, 292, -6, -176, 126, 102, -60, 32, 120, 29, -296, -304, 97, -198, -279, -108, 217, 82, -126, 150, 261, 40, -127, 335, 199, 12, -130, 83, 102, -97, -283, -110, -8, -136, -186, -17, -40, -222, -150, 10, 228, -62, 26, 83, 342, -58, 6, 303, 306, 121, -229, -7, 14, -153, -108, 21, -83, -358, 59, 322, -212, -162, -24, -53, 128, -118, 183]
1755A83J11j40n16O17l1l15n5J06J99n95J70L51l8k64R0JK06q2O4LJ02k18L7L42
1779C28l21n3l4K03j43n2p0J94k84N7o1K80k72O8J20J87k45j44N99o4l93K53Q6
1802B39n8k88j35M90Lm11L3K72r0l04MK38rj46R9K8R4j13O0K43m2k68J37K18k35
1827E9q3j8J46k50N9J24k01J20LK49k93O1j01K14P5j97J50n1J10j35n4K08o5m26
1851b96K71J26j78j36M6L28j70q5L15r7k02o5K06p4J28j01J56J77l00p1P3Q5k69
1874a33R6J51j76j45K38j22J59k29K46n5K9j88R3K18j02lj20J03j09L1oQ2j97
1897a39LK40n4k88Q7LM3j83K61J56P0j35m2J33k1j50J09J45k36l1j63J07M3j9
1921f1j05N9J64L8k96K54j78J69O6p8J04j95K37M6j81N2Q0j87r9L1R3j01N2K6
$$ y = [183, 294, 154, -362, 255, 224, -91, -146, -40, 159, -436, -266, 85, 47, -217, -127, -126, 80, -2, 62, 65, 167, -51, -14, 328, 7, -46, -80, 123, -20, -72, -142, 52, -232, -175, -236, 44, -228, -160, -40, 147, -98, -242, 357, 293, -100, 153, 239, 181, -107, -242, 248, 251, -160, -127, 145, 55, -249, -245, -7, -16, -162, -63, -35, 59, -54, 6, 249, 207, -61, 76, 294, 59, -24, -42, 104, -146, -87, 37, -164, -44, -41, 208, -85, -24, -125, 89, 164, -33, 117, 66, 176, 41, -13, 195, 130, -296, -25, 101, -77, -213, -167, 161, -9, -94, 221, 124, -78, -143, 63, -11, 117, 16, 172, 349, 49, -22, 51, 136, -133, -37, 114, -62, -207, 31, -91, 68, -161, 85, 30, 59, -129, -36, 182, 80, 77, -43, 60, -49, -18, -24, 58, -139, -136, 104, 50, -238, -151, -148, -105, -288, -27, 129, 199, 64, 22, 155, 134, -16, 93, 238, 2, -29, -192, -85, -42, -61, -166, -107, 57, 95, -201, 53, -125, 44, 110, 32, 136, -59, 178, 224, 43, 95, 175, -12, -111, -80, 13, -88, -36, -10]
1945a0L7j93j05L2L68j20k14K67K31l28rJ37J3r6m9P6P8j03j20O6K24ml64k08
1969c94M65j39N6p9N2J44N9m24K41J75J6j28J7R5j09r1j0K20j00m10m9L48O8j14
1993i1k09L74m2K5k24M29k79R2j8P8J09l58J52J3L8l25J44L5O8Q5j48k8J10o4
2017c4n7J11oJ18j72j3K36O4l09Q9k9L20k79k01R1J59k3k73J85j5J50k42m2L19
2041A47l0o0l9J94K25m45l10M56K16m14Q2J0j45o3j11L26o1p3j51N8K36l3o4P0
2065B1n0M4j53K44n7Jl1j79K89l6j94M1R5k21J5O3R5l9J73q8j39j0K40R7l38L70
2091B53J4l62J38R6n1k5j44M8J55j81j35K12Q0j10o9K3J54o2r3J33J51r6j67P
2115c1K00j32r5J74R1k57k2P3N1k03M7M0J7k96K35L28k11j1Q9Q2J17l16KJ25j53
$$ y = [-10, 27, -166, -271, -239, 129, 9, -205, 62, 293, -35, -44, 93, 106, 10, -39, 37, 115, 12, -108, -42, 182, 178, -186, -394, 71, -68, -12, -91, -39, 105, 164, -260, -19, 156, 172, 44, 61, 156, 47, -44, -54, 166, 66, -344, -393, -45, 23, -91, -300, 74, 32, 57, -167, 262, -17, 75, 57, 135, 244, -114, 38, 51, 89, -236, -92, -57, 11, 96, -52, -80, 30, -34, -91, 20, 14, 132, -40, -53, 183, 247, -62, 27, -2, 318, 39, -162, -71, 88, 65, -208, -23, -38, 112, -130, -172, 147, 117, 57, 18, 212, 437, -8, -318, 138, 354, -60, 22, 32, -113, -176, -287, 39, -22, -95, -246, -188, 48, 15, -49, 21, -29, 15, -138, 106, 49, 50, 19, -160, 129, 93, -101, -60, 35, -186, -171, -108, -13, -52, 121, 33, -106, -116, 124, 221, -117, 253, 267, -95, 43, 139, 88, 63, -81, -33, 122, -59, -194, 18, 98, -12, -81, -58, 96, 34, -59, 74, 225, 129, -38, -31, 169, 37, -58, 116, 207, -50, -72, 1, 52, -151, -104, -64, -47, -343, -108, 220, 9, -2, 87, 169, 286, -30, -28, 97, -56]
2140e6K3J04N8q5k17J96q1j24j96L21j2j15J63N3J54k68J63J8L4l32J39L87k81
2163D6p6jJ66j74n5m9L49m37L06K4p2n1Q6M5k0p8o4K02N1m0k37J49o3k74K80J94
2189B07j37k37l3J10M4j18Q8J67nj12P3nJ20k58J86M2k16PJ20J22k04J5l4N5q3
2214h6o6P6R6j25O8J25J00k1k32J85k9j14l3Q5m8k1O6J68j17k30JJ58j08m7J0
2239a39J15Qo4J2R5k7j4R1j9l3P5j87J87r0k15K63m8j22J6J54pj00JJ03m9M1k01
2266a54K46j71k8J38J7n9JR8j06J76m66K34J85l72R4J38J05n8j72J5J93j7M8J4
2290I9J03k10N8pL7k33J43J47j5j96k02L99r2O6k61Q8m0k5K18J11k20j42J18J36
2314H0r2M3K3P3r6k2j4j3M3j14J96k6l60J84P6K21k57n3Q2K19k75Q6J03J19k48
$$ y = [-56, -33, 71, 129, 44, -173, 23, -58, -182, -378, -57, -69, -184, -21, 32, 186, -82, 81, 99, 133, -199, -60, 327, 46, -30, -31, 135, -39, -94, -143, 206, -231, 75, 99, 27, -24, 62, 107, 87, 9, -55, 147, 198, 158, -79, 70, 7, -267, 13, 207, 70, -167, -200, -90, -46, -164, -76, 91, 86, -26, 47, 42, 162, -96, 90, 132, -84, -77, 43, 165, -39, -24, -58, -3, -86, -152, -76, 20, -105, -37, 88, 188, 167, -65, 120, 91, -23, -56, 29, -19, -40, 26, 194, 77, -153, -152, 6, -102, -149, -139, -24, -16, -80, -68, 27, 0, -14, 77, 58, 25, 100, -87, 100, 10, -205, 58, 10, -112, -96, 58, 51, -49, -48, 55, 6, 47, -154, 92, -79, -107, 31, 48, -11, -10, 88, -18, 158, -308, -74, 111, -261, -167, -29, 76, 18, -154, -139, 54, 37, 85, 99, 202, -8, 50, 43, 80, -153, -10, 137, 122, -74, -276, 123, 31, 97, -164, -76, -116, -141, 77, 188, -32, -174, -56, 80, -12, 31, 54, 127, 31, 9, -5, -18, 25, -89, 107, 81, -279, -95, -19, 202, -55, -108, -26, 193, -82, 4, 107, 226, -22]
2339b2j9P7j36K22l5j6k5q5J08pj16n7n1J39Jor3J19j16O1L02j06j53O2J79j78
2365D9k04M8K50M8k36K5Q6l5o1n5m4J37k2Q2K3r7N2J21j56m0r6K28m5j74N0N5
2391a1o4Lm8J12P8j96JO3J66q9j72J62J9L8j15K0Q9O3k90K63j14l3LJ80k17J34
2417D5j79J56J07j29n4J51j90R0L8j3r6K55k25O7k1q1K4j11J09K7L6k05K55l3
2441B3k6n9r2J60p9R0M2j0j49J55Q0j06n6j36J38Q2N1r1pm9J26qk03J6J91j3Q
2468G8r4l5L7n4J39J5o6n2K1nJ79k56j24K24r4K40j96Q9k07J79r1L8J40q1l2j14
2494a22L29j23k80J97J58p8m2QRk2k54J98j16R1n8K2R6k0M5K0Jj03L02l83J96
2519G1k1j12M5Q2n2L4jp4Q3N4m1k37J96m7r4j30K32J63kk93K15J8p0n6j37N4K53
$$ y = [-22, -41, 36, -100, 122, 87, 71, 46, -39, 69, 62, -54, -111, -162, -23, -22, -28, -121, -2, -118, -57, 245, 139, -14, 48, 227, 49, -155, -107, 143, 191, -45, -20, 66, 31, -30, -85, -129, 8, -14, 68, 91, -6, 46, 167, 11, -29, -125, 103, 58, -116, -66, -11, -75, -72, -120, -8, 70, -126, -125, -62, 104, 15, -157, 5, 24, 62, -53, -33, 56, 119, -171, 92, -22, -55, -52, 128, -89, 45, -134, 22, 129, 0, -54, 97, -93, -3, 35, 22, -74, 181, -44, 23, 2, -79, -55, -166, -57, -30, 6, -199, 56, 23, -3, -62, -154, 6, -73, 17, 59, 49, -100, 55, 135, 29, -27, -163, -25, 57, 108, 17, 10, -39, 87, 79, -124, -108, 83, 70, 78, -16, -51, -14, -68, 71, 86, 20, -32, -11, -16, 163, -93, -217, 7, -87, 153, -43, 46, -161, 18, -73, -35, 105, 24, -8, -122, 207, 84, -196, 1, 159, 81, 39, 47, 56, 34, -220, -22, -138, -47, -105, -83, 13, -7, 38, 58, 59, -44, 258, -125, 71, 50, -62, -17, 65, 13, 47, 46, -28, 55, 109, 68, -169, 27, -20, -114, -244, -12, 151, 149, -144, 71, 89, 19, -37, -174, -120, 133]
2546A33j29k57L01l4j29K5l1J25j5L6J1J25k64P7J65m5r2j18J62Om0m3M6r0o2
2571a37P2R5q2N6J17j26j1k0Rno8K98j33L2j15p4K43k59J08J9J60p6k29QJ23R
2597A4j21O9J4M3j5o1L3J0N8m9j36R5J00j8m7R5j74K8J26o6j03J46n9K5j81K86
2623A12j50m3J26M4K3Qm3J21k06M5O6kj56j69L70p7n2j43P7J35q0q5L8o4L3l2
2649a04L29k4j89j68rJ59m7J53r8K0r5k04L01l4n9klJ66j03M0J23j18q5j32M51
2674B68l68R1N2J10j61j15J87rm7j9n8N5R7J7l3n1j03J15p8N2j36K09j4Oj37P3
2700CJ34m6k27M9k1q9M1J85Mj05J7o7K39j81M4J18J8j7j18J46M5j37j5m7K49k42
2726b0j57K02J0J7o1K8P4o9j26K6K9M1J41l3j8j50K67j29r6L2j20K72j75k4m7
$$ y = [133, 4, -253, 48, 14, -115, -90, -121, 4, -11, 25, 36, 161, -103, -26, 139, 94, 2, -116, 46, 52, 12, -31, 15, -75, -137, -65, 30, -52, 4, 121, -5, -16, -36, -27, -32, -100, 198, 65, 97, -18, -92, 151, -108, 0, 19, 179, 103, -126, -118, 5, 14, -107, -38, -24, 19, 4, -57, -24, -14, 44, -5, -141, -46, 54, 36, -11, 84, -90, -62, 64, -2, -105, 41, -18, 7, -174, 112, -38, -81, 45, 89, 112, 120, 77, 198, -8, 37, 103, 101, -55, -224, 146, 69, 17, -126, -49, 86, 6, -79, -41, -105, -72, -104, 225, 201, 12, -156, -165, -6, -53, 100, 2, 22, -73, -277, 24, -10, -69, -71, -74, 92, -11, 29, 152, 34, -51, -183, 268, -100, -9, 43, 153, -8, -123, 64, 55, 8, -11, -69, -14, 83, 100, 67, 16, -87, 28, -50, 2, -134, 75, 61, 67, -70, 3, 137, 91, -136, -87, -108, -197, -156, 29, 33, -72, -55, -122, 117, -64, -20, 98, 116, 99, -19, 127, 172, 35, 20, -27, 222, -20, -177, 25, 35, 52, -9, 19, 93, 24, -102, -76, -47, -6, 135, 102, 84, -66, 201, 72, -24, 8, -112, 160, -15, -39, -86]
2751h6JP1j43K33r9Qo2O2L7k3R9r4N4m6j40R6M2j17J69J29k35K3J35n4j17j89
2777b46K34J7N9J2j46r5R4J29l9j25R3R5M3O7j52Rq3O3k0r5k1J35j42j05J90j2
2803d1N2LJ88j66oN4j50K9K5R3j07R8qj42P1L5l05Q8L09j44P3K2N0k13M0K07k72
2830a17k4J55m6O8k63J36O1K4l3K8r1M8j14K23J41j82j36J36k9l6K14j8k27J4
2854f8J85m8j24l5J09n2N1J01j61K5P7j60K01j50J28M0j08L1j01K2O3J23p0p8
2878Am8J24K1r4m9pO3j01K52k34K9M3p0K6O4p6P1J18J8j21l8R1j38m1j03J94p9
2905h4M1O2j13R0q4K47r8r8j3J33j02M6M6k5M2k47L9K16o5Mo5m8K52l29R2P9j91
2932a73J58j53J12J19k16L32j76m6Q9j30J01n3j8R3k9RRL2N8k98J16j09K21o0
$$ y = [-86, -85, -14, -157, 76, -23, -15, -77, -15, 22, -1, 98, 4, 58, 12, -128, -32, 10, -107, 62, 191, -44, -21, 114, 60, -57, -246, -12, 5, 64, 76, -70, -165, -71, 58, 19, -106, -13, 82, 125, 192, 40, 49, -34, 29, 9, -86, -107, 28, -114, -219, -29, -41, 11, 14, 202, 36, 30, 84, -66, -37, -12, 81, -26, 72, 64, -78, -7, 28, -277, -189, 120, -24, 49, 71, 121, -92, -52, 155, -117, -141, 14, -32, 36, -227, -91, -30, -6, -39, -11, -102, -54, -168, 55, 196, 14, -122, 14, -15, -51, 163, 145, -82, -68, 117, 69, -55, -90, 19, -33, 18, 119, -42, -17, 60, -100, 101, -49, 79, 119, 11, 42, -59, -37, 26, 149, 79, 1, -47, 77, 98, 4, -45, -52, 11, -90, 162, -72, -43, 0, -70, -44, 20, -56, 15, 133, 151, 30, -8, 83, -55, -96, -199, -5, -84, -43, 19, -94, -4, -88, 159, 61, -37, -50, 83, -19, 27, 73, 48, 90, -157, -118, 98, 33, 37, -28, -76, 176, -153, -61, 18, -173, -15, -168, -56, 63, -153, 179, 3, -43, 46, -84, 17, -36, -54, 39, 10, 19, 28, 60, 118, -180, -64, -173, 48, -12]
2956a2n4J60j37J9P1M2k41K80j26R6j10P8O9j33j15J91j46Q5RK7N5k33k2Q9K23
2981A65j12M8j75J28j33J45j21P2R4m9O9o8j17J89l51J74p7q2J96J25m0k52K32
3004F0j37lL1Q6k7K5r4p7K30j95J14q1j35K21k22J19J14pq1M6O0j13Q6m6N9qN9
3031H4j5j6j56K11k90L4J12K0M4m4O9n5R6k10J72j45j0J2J28j38M7Q5j08L8J03
3056F8j75K25j02J40k91LJ72lk6K7pJ3r9J24p6R5oj92J78q5q0K4O4J05k2j02R
3083a9j0J76j6k26p6J43L6L8pl5k35K34L2j5J42l5j5K2r7p0q3K27j6l30N4J85
3109DJ2j13k0N9K3J8Q3j09N2j1P5o3j44J11K14j32j85K10l5Q2k07j02K05j23J86
3134I0j24m4O0k3J16j39J10N6j93K41j48Qk14J63J62j8R3k60L2Q5k01K6K5J06
$$ y = [-12, -66, 94, -43, -24, 47, 89, -152, 128, 2, 98, -12, 66, 135, 2, -113, 78, -68, 17, 26, 53, 108, -125, -147, -58, 165, 53, 101, -74, 54, -79, 66, -55, 17, 111, 62, 131, 63, -54, 135, -216, -42, -119, -201, -5, 120, 80, -172, 60, -77, -80, -49, 37, 10, 35, -59, -136, 94, -101, 13, -68, -203, 18, -204, -85, 29, 22, -59, -13, 47, -66, 20, -26, 33, 25, 84, 69, 53, -103, 108, -182, -148, -36, -16, 28, -16, 53, -2, 94, -116, 56, -89, -99, -87, 41, -97, -50, 35, -73, -35, 68, -107, 118, 16, 156, -135, -132, 40, 37, 11, 38, 31, 44, -55, 69, -7, 88, 82, -110, 68, -17, -97, -73, -9, 96, 74, -28, -19, -29, 147, 131, -95, -171, -28, 8, 46, 39, 4, -231, 3, 35, 20, 162, 127, 112, 134, 37, -33, -116, 111, 95, -235, -181, 4, 16, -97, -117, -58, -35, -17, 66, -43, 9, -2, 73, 10, -134, -23, 191, 59, -126, 84, 49, 131, -76, -178, 27, -96, 90, -34, -78, -18, -41, 75, -64, 46, 102, -91, 150, 2, 10, -204, -41, 121, 103, 196, -64, -32, 53, -148, -122, -97, 9]
3158Ijnj73J63r7J24k9j2O1J53q5nj17L8p3k7K26k8j76Q5Q3r0j33J1M0J11j21
3185f8q6J90j28K10p4p6q4K3K8nQj30J94k6j59J26n8J1q4N4K30K1l4j51J64k62
3211a66J51M7J37p4j86l9O5K21j83l3J21j64MN0N1M4j14K00j08O2q0L7N8K2q4
3236C9r0N8R7q6j09O6j09P7P5j2P4l4j7j14J13m1j27j6O7P4o3J19n4N2j59J83
3262F3j57J05J72k54N9J65k42P5Q3j5k8o5m0P1L3j46K21k59R4L8K8j7lJ59j14
3287B6M1j10J44p0k7j14J1l2K15J4o7P5j33R9j09J18n4K5p3J35j48L3q7K50k24
3312f2o3K31j13J69j66Q4k04J64j60RJ90o7k6K85k28j00J17L4M5j32l8M4k5r1
3336a03q3K12J16k48J2K55k50J02K00j62k22K23mpj68J65m8m2P3j33J99j8j83
$$ y = [9, 8, 3, -170, -7, -104, 20, -9, -21, 40, 193, 108, 103, -14, 24, -49, -76, 150, 122, -54, 31, 114, 24, -109, -98, -58, 53, -68, -154, 36, -92, 118, 44, -32, -116, -93, -65, -70, -62, -192, 2, -24, -183, -57, -115, -104, -188, -134, 96, 117, 83, -68, 96, -166, -15, 32, 169, 95, -91, -130, -65, 156, -27, -60, 61, -103, -99, -49, 2, 46, -68, 132, 24, 86, 6, 43, 101, 123, 39, -51, 7, 104, 18, -91, -25, -134, -57, 18, 6, 80, 46, 29, -85, 28, -13, -140, -156, -89, -15, -78, 41, -13, 39, -120, 63, -94, 11, 183, -71, -12, 153, -89, -14, 69, 54, 26, -39, -79, -8, 25, -121, 100, -159, -65, -27, 1, -16, -19, 140, 26, 67, -43, 101, 31, 4, -110, -99, -131, 84, 98, 31, 106, -27, 72, -37, 81, 27, 52, -21, 114, -34, -1, -88, 162, -62, -125, 106, -7, 162, -4, 80, -124, 40, -120, -111, 79, 12, -14, 271, 43, -57, 60, 94, 139, 7, -31, 13, -12, -103, -186, 26, 142, -106, -94, 161, -89, 13, 213, 51, -171, 52, 48, 41, -127, 38, -10, -52, 21, -112, 87, 69, -114]
3359a14j12K50J69j99J3Q3m4J03j30j38Q3J33j5j03J8J05j45J31j32j25J51O2
3381D4q2K2L5O6j75O7J99k59J16l4K9L2p0q1n0J97m7j1Nj8j1k0R0k10J89m3p1
3408i1%R3l4R5J1p5R4k06J84J03l6k66l9J96n3j7j84J65p1J25P0P2j7J3j8p2j9
3435B3J3j6J35Qk04J67r2j11K64j64m7K32k19Q0l2p4J01j12O6qp1lJ50j2Q4Ql4
3462A32j39k7Qj43QP8K47j06M6j15R8p8j7N3j22J58j28n9J6K71j53p0M3j29M4
3487h4K5J17j67J06k4j05J29q1Q1kn9K4P3j12P1k1p6K83k06k9J60k16Q2L3l6L8
3513Dn1K5M9m9j2o5Q4pJ08q6RK0j81J65o6K62r1m03L17J76k69J27j20J03q0R5
3539F4J4n9j54K2K20k3j56P9q3K48q0j92O6Qm4J21J50j96k0M0J3j96J93r8M4J1
$$ y = [-114, -226, 24, 193, -6, 7, 90, 46, 149, 19, -119, -36, 97, 82, -21, -3, 102, -43, 88, -44, -169, -18, 44, -38, -16, 19, 85, -90, -23, 176, -83, 33, -1, 28, 60, -10, -91, -141, 56, 9, -2, 3, -15, -26, -46, 44, -166, 23, -20, -91, -91, 2, -32, 63, 74, -1, 93, -113, 71, 174, 138, -128, -167, 29, -24, -41, -225, -60, -131, -6, 64, 136, 119, 132, 114, 42, 23, 36, 20, 155, 163, -41, 126, 34, -77, 187, 23, -24, 208, -11, 69, 37, -37, 64, -48, 18, 10, -61, -64, 86, 74, 158, 166, 132, -7, -34, -26, -169, -161, -83, 164, 58, 104, -11, 87, 9, -8, 45, -77, 81, -47, -106, -90, 181, 28, -42, 1, -128, -84, -59, 58, -109, -3, -27, -132, -3, -84, -3, -5, -64, -40, 33, -79, -8, -29, -105, 178, -28, -57, 103, -113, -31, 2, -34, 4, -47, -22, 27, -22, -34, -99, -15, -22, 86, 0, 9, 29, -152, 13, -53, 209, 118, -285, 32, 208, -61, 66, -54, 49, -31, 64, 78, 19, -135, -113, 107, 84, -72, 7, -76, 172, 92, -100, -34, -26, -70, 51, 201, 5, -15, 25, 38, -158, 35, -63, -19, -8]
3565hOm8J30Kj41p7J41J28r3l5J9N1k8j38OJ62q4P8j43r8J33R4N3q6j01j1k4J65
3593E3o7R6m8j5o4L3p3J60j40j5J60K5M9l2j69l8J02j88J65J01O6Mj04O3k49Q6
3619c9l8K58l02J16l6Jo2K5J25j83O9j60R6J48L0m8l2j05J23M6K7j31R3M5o7J1
3645A0o1J10j72O8P8j38J99Pj41J11l0o7m6K2J91j63j1K7J5J9l9J66j47j05L0
3670f7M2Q1n8kj55J10J52J9k10J94j05N9j9j4j67K48K4M0k59qJ45j62P8j1J19
3695G4p8m6J7J67j01Q4j98K2q1J17K53k88O8K0L6j12r0j7K01P6rk39K20j61k7
3720i2K73j07j55J53l0j68K19r0J55j60N4l4J09k53M4J58M3p7q4j5J86j48M5J09
3744A35j77j6j72J67O4O2k25J85j36J33j39J33j97J19J41j9j21P8J42l41J51L5
$$ y = [-8, -2, -50, 80, 82, -59, -136, 5, 133, 40, 5, 24, 75, 47, -91, -85, 77, -7, 71, -72, -170, -37, 57, 110, 24, -77, -88, -112, 53, -14, 82, 34, 19, -45, -12, -85, 75, -65, -80, 80, 105, 154, 122, -47, -85, 17, -171, -6, 95, 161, 165, 61, 124, -125, -39, -77, 181, -121, -5, -41, -40, -102, -77, 48, -135, -66, -226, -130, 18, 48, 0, -32, -137, -14, 32, 59, -72, 21, 66, -1, 10, -51, 59, -113, -45, 33, -105, 94, 101, -40, 71, 41, -26, -72, -50, 141, -22, -33, -6, 9, 28, -11, 155, 8, -97, -67, -25, 56, -2, -4, -159, -49, 103, 122, -88, 106, 1, 60, 41, 27, -140, 108, 132, 172, -87, -95, 50, -112, -34, -45, 74, -4, -50, -33, 134, 33, 117, -81, -59, -140, -23, 230, -58, 10, 30, 66, -46, -136, -153, 48, 124, 115, -124, 96, -65, -92, 181, 74, -81, 72, 42, -126, 93, 3, 158, -2, 52, 18, 127, -126, -82, 76, 119, 42, -42, -57, 129, -19, 26, 135, -42, -58, -230, -63, 1, 63, -162, 23, -113, 20, -119, 14, -183, -64, 77, 58, -63, 15, 157, -184, -33, 2]
3766Bl3mK86k03J1L8L9k59J95k06lK72j96J49j28Q3L5q8jO5j12P2j22J23j6J54
3792A53l39L00r3k19K11J29k26J0L0R0Q4j35N2q9M8J36j24j68J38j3N6n3lk02
3816b27L47k14J54L6k73J89J14j79L3R5l2k0o5M1r5l3J76J85k99J04j43J39j48
3839a15J07o9K2J14j71R7j53K61k16P3PpQ4p4o4K60j4k39K52ql8j36J53r3N5J1
3865I9j47J27j07N5j9j0J25m8lm9j54P9N2q0J26r3M6J9n1Q3m2n0j59J69n3J31
3891D6m0l6L8n8J3J36j74J32j14j46J83m4P1p0K99j37k73K96j87p3J28q3k8p6
3915a97L09p8j35J05o5O0R4j3K2m5j07J1l3J32n0k10Q4K20k08N1R1j39K62j90
3939b9j6M9j06J00L6J13q2JQj13O7L3j4j0M6J6m9kmN1k58K22LQ7p4J40k18J4M1
$$ y = [2, -31, -35, 251, 48, 59, 97, 136, -123, 72, -134, -137, 135, -61, 88, -40, 43, 78, -10, -11, 54, -58, 14, -108, 15, -1, 153, -186, 114, 21, -198, 13, 142, -84, -74, -44, 46, 130, -5, 47, -42, 6, 142, 18, -150, -12, -25, 31, -22, -25, -227, 120, -94, 60, 96, -177, 12, 126, -53, -20, 75, 43, 23, -42, -1, -96, -129, 47, 232, -67, 37, -106, 33, -115, -8, -77, -55, 59, -112, -15, -168, 93, -123, -50, -43, -50, 34, -40, -104, 156, 142, -97, 155, 147, 109, -27, 126, 33, 88, 99, -48, 79, -28, 27, 8, -2, 123, 75, 72, 23, -131, -52, 0, -80, 46, -47, -1, 18, -33, 50, 8, -42, -201, -32, -85, 46, 6, -30, 8, -50, -37, 99, -75, 57, -57, -203, -20, -64, 7, -63, 236, 99, -174, 122, -65, -138, -10, -93, -121, -197, 112, 34, -101, 4, -61, -1, 93, 80, 102, 57, -50, -39, -72, 60, 10, -200, -116, 104, -104, -53, 38, -101, 161, -29, -45, 4, -102, -2, 34, 147, 65, 66, 74, -39, 28, 61, 47, 37, 83, 99, 50, 48, 44, 95, -163, 59, 62, 149, 75, 215, -3, 11, 52]
3968E2j44P1R2j38P2l8O1M9n1l9MJ7Q6j91Q3N1p4j99K43J19P6l47J30q9R9Jp9
3995h3M7J2no4J50M4j60J62j95k4J09n3n0K52k21j71J40K44r7rl4j04K09k22P7
4020d6l8K00j55J35J1k7k66J10J27j12K7l2J06p2J2R4N9o7J40k50M5J29l6n2l2
4045A0k1K44l76J9j4J75n0L9k1K05j78l2R1n2j85L7M9l7J69M3j20K5j06J30M1
4070H5lj8j88J29J46k10M3K02o3n5j83J91j58K11kr4J9nJ3J56l37M7O9j5k7j3
4096f0J65JN9l38L69k14p3J62J0Nj61K70j94J04j01K1Q0n3M7j30K37k30p5R3N0
4121D4j33O4O4l2P9j42P0o6L1J23k12NJ23P5j99l4K1K7R1O7m2P9rn2Q3j69j3O1
4149DJ45j96Q8j2j22Q9j88L45j45J64j37j2m8J71n7j32pJ69m2M9q7q1J42k41J02
$$ y = [52, -92, -21, 71, -67, 5, -33, 28, 77, 26, -13, -9, 8, 94, -97, -14, 37, -37, -236, 7, 126, 202, -145, -15, -104, -5, -4, -83, -36, -24, -29, -93, 57, 101, -59, 103, -92, -116, -7, -60, -110, 142, -79, -250, -110, 134, 37, 28, -6, -110, 99, -123, -46, -84, 116, -39, 96, 107, 80, -186, -76, 51, -61, -34, -66, 40, -32, -20, 74, 133, 66, 206, -44, 1, 130, 94, 42, 10, -11, 233, -143, -124, -138, 37, -13, 26, 5, 210, 32, 0, 91, 39, -146, -109, -60, -97, 72, 115, -5, 20, -86, 44, 85, 82, 64, -124, 5, 151, -59, -16, 186, 123, 68, -115, 76, -82, 129, 127, 33, 52, 47, 60, 216, -121, -74, -5, -20, -47, -60, 105, 106, 165, -173, 196, -18, -91, 71, 81, 86, -75, 195, 1, 105, 4, 25, 105, 52, 99, -31, 206, -24, -99, -6, 44, -89, -25, 39, 7, 86, -56, 14, -52, -21, 102, -110, -105, 18, 93, -106, -140, -119, -92, -1, 66, 24, 103, 94, 42, 125, -44, -57, 4, 149, -47, 41, 29, -93, -4, -192, 153, 8, 172, 35, 23, -25, 146, 89, -43, -50, 119, 77, 126, 39, -42, 100, -141, -39]
4174c9l6J69j06p5J96O6k13m5R3j22J15q4N1M1k2M1M2j49K23j23j58N8R9Rj51
4199a20J40K5O4p1o4M9M9j54J57j13nj4J30k9K6j3k89L82k14j30J52j61L05N0
4223A52j72J26j22j2qo2R8Q0j85J41kp1rJ98j50j62J27j78K11n9L6p4K03j33K70
4248B43k41J21j09m5J47j0j01O9m2k6Kl2M8p1Q9j33J18l3p4P3J39r9m1J8r4J40
4274E6l0k4J11k06J01M9M0j63j07J74j90K50k9LN3l0q9l0P0k2l3k8p0J80L7qL9
4301A04m0j26M9Nk1j13K26j95J61Lj55J14M9j50J28r5%J10j35P2l3P9j47l3J58
4326A5p0R5n4Q7j05j60K59p6J9QK3j0j04P6p3l0Q4j05J41J25l4Np0nj54J51J2
4353E0r3J8kJ01k00J31QK2J2k7j35lJ32m8pj7m8L31k27M2J04j89m3k8M7P2P0m9
$$ y = [-39, -75, 94, -12, -87, 109, 175, -38, -83, 10, -112, 3, -81, -30, 11, -11, 30, 72, -77, 146, 23, -135, -77, 22, 31, -120, 20, 45, 109, 38, -26, 23, 72, -82, 75, -38, -43, -57, 73, 44, 70, 57, -232, 150, -64, -194, -42, -203, 102, 152, -20, 106, -16, -28, -36, -98, 0, 80, -105, 36, 34, -37, -46, 152, 2, -160, -33, -211, 0, -59, -23, -97, 106, -27, 243, 2, 123, 14, -31, 116, 106, 5, 74, 32, 6, 8, -24, 24, -47, 42, -91, 27, -6, -80, -7, 132, 33, -8, 10, -84, 56, 26, 2, 113, -93, 8, 57, 97, -66, -173, 1, -189, 61, 32, 35, 88, 58, -31, -61, 9, -13, -46, -74, -144, 36, 73, 65, 104, 64, -62, -13, -8, -29, -142, 84, -111, 50, 53, -102, 12, 61, -89, 39, -56, -56, 54, -81, -9, -42, 37, -110, -143, 15, -55, 40, -14, 73, -32, -192, 67, -9, 10, 18, 41, 31, -73, 3, -70, -100, -16, -121, 20, 145, 111, 116, 46, 41, -113, 38, 50, -43, -25, -27, 74, -126, 5, 13, 35, 47, 20, -115, -118, 14, -34, -41, -58, -106, 225, -2, 40, 144, -45, -88, -116, -69, 3, 73, 24]
4381B4R0k0l9j6J20m0k40J96j70J01K79r1k00j44M9j46L22J8j96K36o4j80K94
4404A83k07J89o1j10J80j44j5J80k69K45j27J49l25J57J29j74Lj24J62j18K0J50
4426G3Ro9j08K64j77k6m5N1K9p6R0O5j96Q3J46k59J77Q9j30m9J09k6m6l8J86j27
4452aO4r6M6M4j16N1k9j9N3J23k30Q6q1O3n3J37oq0K1K12k96J82L7j60J6L1o8
4479f9j11N6J30p4j1K55k22K1L8O9j79j5J42o3P8q6pq5R1K39k03J42K2j79O6J2
4505E7KNo5N2p9r3K39nj0q9P2j34R0j00J02Rk8no6J05j00K2J01J20k44K3J13L7
4533A31j32K6J10m7m5k4k14J78K25j11l5j05J30j40J05o5K11j89K5M0N0k23J18
4556A9j56J95k20K43r2n0J77j46lJ82l18J95M1j27J54N0j31lj01Q8J81l09K69
$$ y = [24, 114, 94, 55, 39, 159, 119, -121, 75, -95, 6, 285, 194, -6, -150, -101, -247, 75, 93, -103, 133, 69, -111, 183, -24, 165, 104, -6, 174, 30, 15, 195, -74, 171, 44, 193, -132, 25, 154, -20, -17, -141, 21, -97, -77, 73, 82, 13, -95, 169, -8, -34, -79, -28, 1, -75, 15, 80, -116, -33, 113, -146, 31, 120, -10, -59, 50, 24, -22, -60, 126, -1, 63, -33, 13, 57, -59, -8, -37, -56, -3, 120, -110, -24, -105, -42, -95, 42, 36, -44, -23, 189, -107, 75, 112, -48, -32, -1, -69, -180, -124, 6, -68, -79, 176, -46, -25, 13, 82, -97, -112, 30, -33, 45, -41, -48, -133, -42, 197, -6, 136, 158, -21, 45, 57, 59, 64, -1, 51, -28, -121, 118, 113, 103, 14, 86, -48, 42, -58, 44, 53, 25, 20, -46, 59, -41, -19, 82, 202, -42, -19, 94, 131, -1, 25, 135, 88, 43, 19, -195, -17, 208, 97, 62, -43, 87, -53, 52, -13, 198, 9, 34, 74, 124, -99, 19, -137, 58, -162, 81, -11, -61, 116, -30, -33, 149, -169, 26, 67, -60, 94, 144, 13, 10, -91, -3, 178, -131, 138]
4579A38j43j8J7j9qq9N4K5J9L4N6k13K19p2r3P2J17j32n8KJ0J5J88j23o8K1L9
4606a0P6k9J42k50K99j57j63j7K57j48j38P5R5oM8j12M1o0%J00Nn5j67JJ24J26
4632G7j9n2N8n4J7M7k09K8K15Jj09O5j32p9J60L1Q4p0j28K11l6j07j02J59%n5
4658Al5j09J80p0R2L5m4K7r0Mp9J29N2Nj6l1q6P6j01oJ19j65J17L4K7o4q6J82
4686I8l8Oj31m6J6L8J4J30j10P2o0Q9j34J2J20l7K6L8j12j93K72j92o7J88lK5
4712B1P7pj14p9J70R0k56K14j49N0nl8j24J11M3P4j55K8M4j61J62P0j08P4l9Q6
4738G9n2j94J36M4m6J90j36nj53J21O0j71J06j06J92q3J40r1k8n9P3J0J20k16
4762f9j7r0R6J8J14nM1m9N0m5j16L5j6l7J42q2J3m3J83j62o7M9p0N3J35p5j82
$$ y = [138, -5, -23, -6, -25, -33, -122, -68, -43, -24, 10, 66, -147, 72, 0, -93, -21, 96, -36, -94, -92, -82, -67, 121, -2, -70, -49, -10, 66, 37, 179, -71, 228, 71, -92, -109, 148, 0, -138, -63, 32, 26, 74, -38, 3, -57, -57, 43, 48, -7, -174, -173, -49, 77, 58, 6, 64, 10, 27, 74, -135, -107, 108, 109, 0, 65, -67, -146, 14, 45, 129, 59, -69, 142, 106, -1, -103, 56, 56, 1, -34, -143, 37, -33, 59, 94, 50, 77, -13, -9, -88, 41, 93, 98, 82, 51, -35, 41, -60, -66, 53, -112, 5, 39, 66, 2, -84, 98, 60, 66, -65, -111, -95, -57, -43, 87, -23, 49, -11, 78, -56, -44, 76, 39, 65, 103, -9, -202, 70, -122, -189, -1, -4, 21, 98, 91, -23, -102, 68, 158, -98, 116, -33, 17, 12, -26, -150, -39, 4, 78, -77, -49, -5, -166, -4, 66, -42, 32, -7, 79, 27, -167, -31, 13, -33, 157, 21, 16, -137, -16, 44, -127, -21, -127, 65, -18, 122, 31, 3, -56, 17, 27, 147, -69, -86, -176, -80, -62, 52, 47, 88, 39, 89, 44, -72, -37, -53, -90, 52, -30, -17, -60, 123, -39, -106, -57, -127, -74, 61, -14, -196]
4789a96M7K49l16K65m0j88J77p6M8k6J77k00p6J72m5J30j08M0N5j63L00r7k53
4812a24J60j8j07L5K5k2J22j02J25p2l3L0q6L7M3J20l7j49J29l8r1K98k98J07
4836E4m1q7P0K7Nq0K32j13j59K24q1j5L4j32P1R2o5p3m5k9Q7rM5n6JKm7R3J6k52
4866b31K22q2l9K50l18K09j40J42l5m3J55k54J66l2L2M8j30J65j6K9o7l9Mj16
4890a20J28J39p3j47J25j21J69m1j15K2M6J31k04J13j86J20N8k05J54k6mR1j28
4913g4P7L3j10J18P2j85L7k9P6O5j07K1M6J2jJ21j91M2j53K63j21j6Jq0pR0J96
4940A96l29K85l71J23n0J07K94k49J16j42o5N6N9l0K00p3k39Q8o8J47j50K7R2
4963B4l5J1k9J54j35Q5j97R7J24j74J14m7R0o3j5Q5M3r5j25K9Q3J07j16j70O7
$$ y = [-196, -149, 100, -216, 49, 9, -179, -2, -78, -30, -56, 121, -79, -155, 17, -28, 102, -6, 34, 89, -74, 226, 129, -124, 36, 18, -89, -54, -29, -51, 71, -31, 94, 22, -11, 19, -67, -30, 13, 133, 96, -53, 76, 38, -53, 245, -53, 54, 13, -74, -4, 23, 28, -52, 180, 67, -92, 132, 51, 36, 70, -62, 9, 101, 36, -37, -82, -111, -24, -33, 12, -44, -43, -41, -88, 5, 21, -231, -9, -91, -130, 120, -198, 11, -129, 13, -22, -65, 90, -164, 2, -30, 2, 50, -80, 85, 69, 98, 31, -8, -4, -120, 8, 147, 74, -73, 52, -69, 100, 59, -56, -34, 12, 143, -61, 52, -134, -14, 44, -161, -7, -33, -37, 54, -74, 3, 36, -74, 44, 116, -69, -32, -61, 15, 80, -27, -6, 40, 52, 51, 172, -19, 23, -130, 133, 12, -4, -3, -83, -90, 0, 196, -133, 152, -219, -96, -146, -39, 255, 6, 122, -20, -85, -29, 30, 0, 200, 127, -112, -24, -92, 55, -95, -68, 24, -11, 0, -29, 125, -10, 75, -122, -25, 99, -75, 39, -8, 82, 19, 4, 89, 132, 37, -88, -59, 24, 131, 15, -155, -88]
4988h8pJ43o2K1n9J3O0O3l9mp0M5M9j95n9K01M7j99L2k5K87l32J84j31J51n7j08
5015a39Q1O3K9j67J25K4L8m9q8L5l2J77j01J26l2o4R3j41J97j49k9J3rk03J85
5040a7n6P1J02j78K86K7l27r4K12j41j20L34o7j11J54k32J31R5j84J31j60J14
5062c0Q4j14qj11J04J52l9N1j35n2j01J40n3J60m6j44J29q2O3K3M2J6j59J31j25
5087a04M4J20o7K66l09P2l3R3p2o7M4J67l9j85Q0N3r8J5j6jn6N0J17k5m4M1L2
5114G8j61Q2L9k52K33L9k26J23L1M3J00j45L1j2J01n7r4m6R2j05R2r4J60j01q1
5139a30N2J29j72O2J14k15J86j88R0J30p9Nn4QK16j81N9m0M7Lo9J27o4o9r3L7
5165h9m0k45J62J46K02j80P3p1J71j33j6j60K84j43J%Q8j58K9J85k6k6p4J0RO2
$$ y = [-88, -95, 48, -14, 7, -52, -39, 21, 84, 45, 41, -29, 16, 65, -130, -189, 12, 59, -140, -108, -133, 154, -178, 6, -125, 26, -31, -139, -58, 5, 34, -133, -8, 16, 54, 5, -83, -48, -80, 97, -4, 122, 90, 26, 119, -22, 175, 26, -3, 10, 1, -202, -17, -73, -2, 100, -78, 208, 235, -92, -186, 26, -115, -235, 99, 32, -79, 75, -157, -26, 69, -115, 16, -144, -30, 54, -60, -68, -179, -75, 77, 38, 89, -46, -98, -199, -59, -112, 48, 2, -142, -13, -95, -32, -9, 33, 49, -110, 21, -104, -60, 60, -7, 259, -50, 22, -11, 82, 10, -57, -13, 154, 115, -70, 10, 63, -35, -20, -36, -37, -93, -43, 74, 49, 5, 46, 78, -83, -1, 38, -214, 19, 58, -168, -45, -14, 29, 129, -16, 15, 3, 104, 47, -47, -93, -1, -106, -14, -108, 52, -49, -130, -78, 51, -121, -59, 55, -160, 26, -162, -72, 58, -21, -16, -70, -62, 154, -27, 32, -8, 39, 42, -27, 100, 36, -33, -126, -89, -129, -374, -212, -66, 136, -44, 29, -42, 129, -4, -20, -180, 104, -39, -38, -38, 50, -108, -79, 106, 80, 54, -20, -10, -1, 61]
5191F1j47J30r1n9J85L1o9J00k04O6Q0k80J57p6J35l1k7m5J9NJ40j17O5o5KkM0
5218Cj18R3O1p8M9R3j68O1Q0r3m6m8rJ23j0r4J04j05K3Q9j18K36Nj89J63%N4j00
5246F1j16P3j76K72k95J00J25j17j6PJ58j37J27j44O1m7j6J61k47K98j9k01L45
5269B57j82j3j36P6lQo2Q4qj51J68p9j44J66K1K4jl3mm1R0j29M4n4J51P8j59j
5297c3lPQ7n4n2L7l7J68Qk9o2m7k07Q5J3N6J07l0o4J35q2J35p0j55J16M4o2q1
5325g0L05m56J77MN7j75N8M0l7Q3R9p5P1j77k7L05q6j11M5L7j7K5O9j93k8N5J4
5352hJ0k0k9j94K90l2Or2J40l2p8K1j40J94L7j37O1J36k7j42L2J44j94M3J50q2
5378E7j13L0p0K51j91k9J9K1rk8m5R9K0m0Ko7q0K62k12M7J25o5J0Kq8l5J5O6J82
$$ y = [61, -86, 44, -47, -106, 79, 110, 41, 141, -63, 3, 83, -197, -40, -116, 19, -12, -39, -84, -65, -60, 80, -37, 28, -37, -35, -37, 3, -115, -22, 39, -39, 10, 103, -65, -4, 76, -17, -63, -111, -120, 3, -7, -101, 3, -102, -79, 10, -108, 128, 133, -56, 107, 107, 161, 61, -55, 18, -158, 114, -181, -81, 44, -73, -89, -82, 76, -61, 66, -78, -17, -64, -80, 81, -166, 132, 113, -88, 257, 75, 62, -74, 2, -1, 7, -55, 29, 21, -130, 38, -41, -185, -19, 2, 26, 25, -8, -12, -53, 37, -92, -48, -102, 49, 127, -32, -33, -36, -29, 58, 4, -48, -11, -48, 120, 128, 99, 37, -10, -217, -132, -119, -63, 44, 14, -50, 85, 3, 138, 68, -87, 29, 73, 11, -70, 235, -221, -44, -40, 17, -158, -100, -60, -97, -14, 85, 10, 81, -96, -123, 182, 96, -15, 30, 67, 50, 75, 144, -49, -77, -22, -8, 2, -18, -47, -241, 49, 17, 23, -69, 71, 39, -39, -18, -158, 36, 73, -64, -3, 133, 106, -36, -4, 140, -54, -11, 139, 57, -56, -26, -96, 155, -36, -65, -46, -25, -34, -62, -107, -8, 12, -28, -26, -93, -173, 89, -123, -76, 49, -16, -6, -4, -92, -127, -112, -46, 136]
5407A36r0j52J34M3jj52k8J11O1l4K40k26k13L16j04j7l4P9P4j40O4J69j17j72
5431e3m9L6K17j51K9N0nl9l7l0l0J66j90P3o4R5m8J5RK33l75J94j67J79J08j35
5457C1o6K7K04l70M9J24M5Pk6o1L6o8M5M1m7n1J77j90Q5j7N4l3P9m0k7%j18K22
5485A12q6N6O2o1m5n5J14m0j18q0l0K51j35N4J04j28n2N5K7k4qn9jJ66k35K17
5511F1j08O9M4n8pj66J19K4m6J82j72j42K05O8j43N0j08P7N3K1r1M4m4J08j41
5536a01J05M2m7j6l4J3J05j35KOJ13j08J59j87M4rJ66k63J92N6Pk0j71J16j08
5561g3L1Q8p9j28K02j37K2J26j80K9O7j14J93p4J34l9k9m6j93J11j42M43k16O1
5585E7l1j52J96m4O1M8j46q7K34j74J6r7J91j68m0K28j00J23j73J52k12K09j82
$$ y = [136, 46, -106, 28, 71, 70, -82, -110, 1, 62, 28, 268, 42, -171, 145, 41, 24, -10, 69, 143, 3, 67, 236, 119, -53, -102, -66, 151, 0, 29, 79, 74, 35, -2, -32, -62, 104, -86, -13, -77, 18, -30, -15, -6, 227, -148, 46, -121, 58, 166, 31, -35, -8, 196, -174, -125, -1, 44, 51, 25, -36, 0, -68, -23, 18, -29, -80, 97, -93, -8, -25, 29, -4, 75, 35, 8, 8, -110, 112, 26, 82, 144, 83, 38, -17, 97, 57, -61, -141, -171, 80, -55, -1, 103, -25, -77, -22, 5, -19, -27, -86, -87, 79, -156, 61, -47, 22, 66, 8, 1, -165, -46, -22, -68, 114, -58, -200, 5, 73, -70, -20, -128, -51, 2, 23, -68, -24, -68, 40, -101, 4, 46, -1, -17, -51, -38, 67, -68, -66, -60, 53, -55, 104, -83, -39, -48, 118, -145, 47, 103, 110, 90, -81, 35, -73, -42, 46, -33, -161, 41, -96, -74, 52, -128, -99, -32, -146, 47, -27, 107, 68, 39, -7, -200, -89, -231, 212, -4, 57, 26, -126, 70, 26, 87, 135, -11, -98, 136, -38, -22, -119, 72, -96, -136, 92, -8, 115, -58, 94, -118, 91, -91]
5608i1O4j3J25J89l22L3O1n3M5j19M3Q6j31K27k62K14K6k47o6L7J17Q8l2r8O1
5633a8M8pK19j02l68K48M2j9r1K34k99k0m5L48k10n9R9K78k68r0L7P4Q0k17J32
5658B6P3n3j4q7M1k9O3o7J31j45lK48j46o5P2K4J49k98J82r7r4j32J82nm5R8j9
5685a0J06q6j8R7P8j94J35j7k5j21l1J33L0R5k87J93k7J11j17J20k03l6p8J40
5709a2J01j87J66j84J17K1j6j75K64r2R7o2j14K54j37M8r6M0j11K11p3j32J13
5732D1j24l5K08j09J4l2J30p3j02P6K0m5Nll2N4j39K31j04O0j05K06k06J91k7
5757A00j61M1N7j86K24j78N1J3Q4l8j82J53K09p6q4o8J9L5R3j78M6M2n4k6K89
5782B25k28P8m4j05R7j00J33L3n7k0q6J50o8j33R4P4Q1j12Q9j6p6L7M7N9m4k33
$$ y = [-91, -27, -40, 85, 274, -48, -15, 46, -7, 38, -81, -38, 48, -83, 144, -118, 96, 122, -125, -191, -154, -37, 51, 19, -79, -18, 30, 23, 242, 140, -228, 20, 62, 43, -48, 186, -113, -133, -178, 170, -40, -99, 0, 278, 10, -80, -43, 31, 111, -106, 26, 99, 46, 32, -55, -14, -43, 20, -47, 84, -61, -64, 184, 38, -27, 45, 69, 218, -80, 102, 5, -89, -221, -39, -44, -89, 9, -10, 96, 10, -8, 89, 167, -27, 108, 91, 66, -55, -86, 47, 77, 172, -115, 78, 51, 162, 45, 165, -38, -74, -152, -12, 89, -98, 68, -116, 1, 22, 6, -169, 95, 3, 100, 38, -76, 178, 41, 89, -7, 33, -78, 133, 60, -72, 41, -83, -118, 90, -19, -5, -37, 93, 20, -82, -6, 14, -31, -26, -29, -61, -7, -146, 85, -19, 41, -64, 142, -64, 127, 100, -61, -20, 37, -149, 75, -103, -52, -39, 45, 7, -175, -22, 187, 111, 27, -41, -22, 13, 106, -72, -26, 16, -38, -64, 225, -3, 75, 31, -74, 23, -77, 56, 89, 32, 12, -74, 76, 8, -125, -31, 43, 124, 12, 101, 85, 9, 46, 93, 152, 108, -125]
5808a25K5R8MJ28N1j94M4J58j48l7O8L7l9r1j4J11lnqj84J25q2J73j62kN4j23
5835a41K41j51M4N6O4p7j7r3K41k31P5l2l1R6l1j50J65J1L5o3L9j13Q5j10P7J07
5861I6k43K1K5M6J10J2J10j82kl7J03o2j35m3k1K44j37N6m7J58J8j01q4J22j61
5886a34l7P7J24PQ9j45KO7o1l4J21l35K30N0J3o4Q8j41J43o7M4L3r5K31l97J88
5912cn5j83K99k77K1K14R6n7p7P7J42j50m0J0J7Oq3n4J11L1j98M9J69p4m0M0J73
5939A64k62K74k03q6m8K34Kj15j47K87j50L2k3J96k14ol9P9o6K5l0J07Q5j35M0
5964An9O8p6NK05k32m7J97Q7k1j72Q5N0l3n8J3kN1j03k4M4jM2p0Q3J3O2q3Jj73
5994a47J11O0j36O3R1ln9M7q1K4pK3j02LJ15p4M2O3m7jM3K0j24K0J17R6j23MJ62
$$ y = [-125, -100, -2, 2, 130, 181, -13, 31, 189, 41, 4, 72, 109, 70, -21, -35, 76, 73, 68, 60, -124, 1, -81, 92, -70, -72, -18, -141, 100, -51, -7, 49, 113, 36, 19, -74, 167, -64, 11, -21, -52, 44, 13, -137, 28, 39, 74, 11, 50, -63, 22, -88, -11, 96, -147, -126, -101, -55, 55, 67, 177, -5, -7, -44, 59, -3, -138, -181, -202, 42, -95, -39, -86, 72, 90, -11, -95, 27, -134, -171, -94, 30, 37, 126, -19, -17, 50, -11, -45, 76, -259, -29, 21, 34, -30, 58, -83, 60, -7, 37, 70, -25, 206, -191, -3, -58, -241, 58, -219, -198, 16, 112, 55, -22, 55, 197, 47, 7, 17, 34, 40, -43, -97, 14, 45, -153, -104, 65, -9, -49, -9, 164, -98, 176, -27, -113, -161, 73, 75, -40, -187, 100, -50, -18, -41, 155, -59, -65, -104, -25, -91, -66, -96, 11, 96, -39, 1, -58, 10, -66, -61, 144, -88, -135, 62, 149, 128, -44, 41, 91, 58, 0, 13, 11, 62, -41, -65, -21, -22, 20, -50, 33, 46, 108, 25, 26, -147, -36, 24, -112, -49, 42, 39, -20, 27, -54, -30, -37, -14, -116, -113, 2, -72, -30, 33, -14, -15, 28, 48, -76, -56, 61, 157, 34, 38, 200]
6023B00l2j82N3J2j18J21q6Q1Q4n9l7j17K22j51J9m8J76q1j64J33M9p7j63K43
6047G8r9J03j94J25j22P2P7jM5O9j10qj5Nj60J50L7j98J67J00k27J39j31N7%o4
6073a05J7j17K27mn5j06J97p1OJ58j57q5J0J29J8j45k7O3q9N5P1J48r5k10K53
6098H6j46j0O4R5m7k46K1J84k1Q8j64L5N6N1j32L3R6J35j58r3K6jJ1k6R6j25J03
6125A1j5K5m4J20m4k9pK9m5r9J01j53L2K07Ok10LJ15l2L4lN4j59n6RJ8J20N6j64
6154a20J55J30k42P5j6k1J59l7p9j07Q7l5J66L5k02J24j11J28j04J06J4k29J98
6177G4M9k08J26l2M1j67J88K2Pr5j25P2J09p7n6R4k05J76%OJ7j15J28q9J05J4
6203E9l5M3Pj12K7qJm5K63l00K12j30Q5k20J13m0RQ8j42K8J14J09q6J99j30j80
$$ y = [200, 168, -14, 39, 51, -67, 54, -32, 49, 133, 74, 37, -80, 142, -9, 10, -38, 138, 57, -107, 26, 75, -2, -165, 78, -21, 82, -112, 13, -109, -37, 40, 39, 84, 153, 43, 35, 20, 25, -135, 15, 52, -146, 21, 121, -106, 33, -98, -41, -41, -105, -88, -205, 22, 18, -37, -143, 54, -17, -11, 147, -10, -95, -85, 44, 62, -83, -110, -47, -136, -81, -10, 138, 43, -167, 86, -60, -70, -6, 89, 42, -204, -183, 1, -20, 68, -96, -61, -5, 46, -86, -53, 43, 178, 20, -73, -47, -48, -37, -63, 33, -92, 11, -4, 21, -23, 97, 53, 24, 17, 46, 1, -98, 3, -150, -118, 89, 95, -115, -112, 3, -29, 5, 2, 56, -103, -159, -150, -132, -12, 44, -120, 35, 165, -77, -2, -18, -39, 120, 83, 4, -103, -16, -51, 115, 150, -52, 72, -39, 89, -15, 91, 105, -124, 74, 123, -85, 41, 9, 50, -117, 71, 93, 100, 5, -120, -48, 61, -16, -72, 22, -183, -7, -7, -1, 16, -99, 29, -60, 45, 59, 24, 67, 74, -38, -11, -19, -18, -63, 200, -100, 112, -18, 67, -153, -40, -80, -71, 17, -125, -97, 17, 126, 40, 239, 109, -71]
6229g1N1j26J73j11J10j27J11Q9k05J49kj24J14j63K13j36J44L7r4k4K04l06J47
6252E3l4K0n7m8l0J10k8j2O4j64K14n3l0l1j0K14k17k1J05r8P7l8J68j41j52J74
6278C5o7j2O5o3J02nN9n5Pj65O0p2Q0J48j27m8J49j48L5j80J97k9n8j5J12O0r0
6305b5n0N1q1J63k13nJ37P6j17J54j37l5J29j1J6j6J78l04NJ80n7p9J8R2j93K18
6331I4lN6j04j25J6k16M88j96L7j17PQ4m1l3M7K5j28J29j01J4R6r6K54N0l36j2
6357a11j5J96m6k09L11j35N7P9q0K9j18n6J71j32M7N4n4J43j83J30q6q8P6J52
6381A32k20J92j09M2o8mK0K4o4j9K26l78J18L8K48m6k12M1J17j33M8j26J32J88
6405A87j73k4P5p5%j27L8P6j12qK78j29q6O0O2j48J62l0JK9j01K3k4J27j56J93
$$ y = [-71, -20, -146, 27, -84, 26, -101, 10, 99, -106, 43, 41, -83, 31, -132, 81, -55, 89, 126, 32, 8, 212, -94, 53, 19, 39, -18, -66, -96, 14, -14, -26, 38, -126, 88, 35, 5, -26, -36, 178, -39, -60, 45, -53, 24, -14, 154, 13, -139, 35, -32, -44, 21, -42, 60, 55, 114, 59, 66, -99, -39, -111, -31, 117, -10, -58, 91, -57, -22, -202, -5, -34, -92, -107, 5, 65, -25, -75, -24, -105, 58, -155, -160, -23, 53, -64, 90, -47, -82, 47, 36, 52, 36, 214, -90, -85, 95, 38, -41, -23, 69, -124, 94, 91, 147, 43, -82, -66, -282, 206, 10, 47, -70, -63, 21, -20, -53, -6, 19, -109, 20, -81, -67, 29, -67, 187, 237, -99, -111, -126, 70, 24, -185, 126, -9, 48, 127, 47, 76, -42, -98, 73, -59, -12, 42, -12, 131, -52, 78, -8, -96, -20, 132, -88, 104, -5, 37, -31, -35, -15, 9, -55, -74, 152, -226, -108, -70, 178, 132, -80, -39, 78, -55, -7, -133, -1, 187, 14, -10, 65, -10, -10, -137, -99, -23, -135, -143, 135, 6, -80, -20, 42, -106, 56, 26, 27, 56, -45, -22, -46, 81, -75, 118]
6431A18M4k16O0j17J47J1mM1k23J54n8P7J99j16Q5j42K7q9r0J78N7j19n3j22J50
6456aO3m2J61j61R8k71J08p0J03j25P6j1j9Mq8J99j59K6R6m5Q6J66j62l1pn1l9
6483i6J10oO5K8j96P4K9Q4r6n8j5M5K04j82j0m6J18j04K6j63PO1J45p7Q4J8l3
6510A6j01P2j50K03L0j1k5j0M3j09r2R8Q1M4Mj08J16o0j33J44L2r8O2j22R4K8
6536D8M0r2J54k55K71j14j03P4r1J73k14L9k3K12O9k43P6n9Q2k2j71J43m6N5q3
6561h0O8m8J0N0O7p4j7J49k34K12j18j10K44j62R0o4n6J60j04Q7p7K59m27J48
6585b7j33K34j69k1J11j72J53M3j06L9J25j25J0r2J97K4j9M1n9q4J12J8j66J35
6609F9m8M5n1M0l0P7q2p0K58k07O6j79R8J33q8l6K3Q0p8j6l27M66q8j06J69j06
$$ y = [118, 162, -54, 6, -111, 36, 47, 43, 84, -139, 15, -43, 34, 233, 117, 202, 60, 87, -2, -92, 86, 143, 24, -29, -151, -1, 62, 20, 181, 20, 118, -153, -45, -115, -12, -137, -61, -72, -91, -87, -175, 24, -135, -109, -13, -58, 28, 194, 32, 1, -6, -57, -96, 14, 8, 73, 101, -95, -21, 8, 92, -4, -62, -77, -32, 172, -10, -20, -66, 52, -52, -26, -189, -182, -121, 24, -53, 31, 49, 16, -85, -13, -163, 40, 70, 59, 34, 24, 67, -42, -134, -36, 45, 89, 93, -15, 101, 41, -92, 52, 84, -14, 48, -74, 20, 48, 88, -4, 150, -105, 166, 52, -51, 23, -68, 105, -109, -70, -93, 119, 188, -55, 21, -38, 44, 22, -149, -6, -52, 3, -80, -12, -60, -50, 0, 67, -7, -24, 125, -109, 103, -15, -125, 119, -43, 47, -17, -73, 87, -17, 70, -7, 252, -175, -27, -160, 74, -95, -116, -5, -177, -24, 19, -87, -48, 77, -48, -38, -130, 67, 91, 72, 113, 54, -30, 82, 100, -66, 69, 21, 66, 15, 55, 25, 102, 20, -50, 208, 1, 67, -112, -14, 119, 31, -5, 18, 98, 20, 4, -323, 143, 55, -51, 118, 12]
6635A2j08K67l17K34J00k24Q4n3L11l30j8K70j25l9j07P1K4J26p5j87p2J06k2
6658g2l8J76P6j85j8L1P0j53k5J66r8P8J42o2K8j66J33j27j19K00N3k19K29o4
6682C6j07N9j10J74%M%p1R4n4k8j3j8J34m7q3o0K08k20J11m2k2J94r0k27K34j20
6709f4J73mk67K46j74Q6n0K1L9J37j36Q1jj50Q7j43J81J25j46o2j6M4J66j31p9
6734c7PJ11k84K52K3J8qn0K3P9k48K36l3r2J47k04J73j12n8p5K21j49PJ29k3j41
6760h8JJ38j12J99n8o4j29Q7M1n8n8R7q1R2M1j15J6J47p2j0L0j7j02P4j28J88
6786E9j99J02M4P9J5pj09K0l6J18o2n8J28j6j05m3J16Q5k28K7L4om9LK35j46j47
6813a46K07Jp8RJ2m5m8L8l0n7J63r3J76k06J39n5j78K73j95j8J95p7J95r7k58
$$ y = [12, -96, 171, -146, 88, 188, -36, 48, -5, 306, -24, -42, 228, 103, 64, -43, 28, 52, 178, 103, -84, -156, -50, -72, -110, 66, 142, -43, -61, -30, 40, -113, -138, 28, -70, 8, 150, 88, 116, -50, 83, -44, -163, 37, 90, -129, 100, 36, -71, -12, -122, 52, 52, 56, 56, -15, 79, 25, -3, -16, -34, 100, 53, -30, -90, 118, -102, 9, -33, -55, 139, 49, -178, 56, -64, 109, 105, -162, 84, -90, -4, -54, -33, 6, 143, 7, 88, 87, -63, 24, -119, 62, 187, 41, -21, -37, 7, 173, 42, -37, -30, 81, -203, 49, 72, 90, 82, 32, 55, 134, -114, 122, 89, -3, 144, -60, 113, 1, -57, -132, 89, -60, -53, 76, 53, -88, -87, 51, -61, 138, 80, 16, -113, -26, 15, -43, -101, -4, -85, 7, 48, -67, -51, 96, 24, 14, 44, 27, -75, -1, -129, 59, -140, -38, 6, 85, 100, 93, -16, 4, -32, 86, 24, -34, 94, 78, -27, -70, 46, 131, -97, -70, -36, -42, -91, -88, 147, 1, -146, 61, 62, -16, -7, 5, -40, -88, -50, -80, -137, 26, -67, 109, -97, 42, -13, -191, 82, -113, -131, 64, -13, 182, 85, -173]
6838a73L08j08N3m6j85K97k10q1J64r8k6R2j57J97L1n0q3J87R9k74MJ2J39j39
6862d7P2K7m8L4p3OL2j54K64p4l8k5p3%K26l2k35K53q9j88R7o4N0o9J41r2J66
6889F7j24j01Q9o5R8JJ5k8O7r3P4O0L8j29j05J47m2J5n6K6J43P7j48p8P7k4k0
6916a9Q5k24J04J6J52k29M6K85k73k5J23rj14J35m4J48l7k85J36L5J70j42k40
6939b06K02P0r2J5N3j7n7K31j41r6P1j44K07j34J43J10j79m9j1P3n2J09p6n8j1
6964c9K2J08o1q6R1l2M4p3K3j16L4R4j70K16O0j69J31o6k6R2j18QN9J04k02J55
6990H3j97N8k9P1n8K4o6J92j53J9j05K88M6k37R5J56k72J8J21j07J92q0L8o2R1
7015A26j32o9J65o8J3J08r8j61R0K2l2J26j80l6K27o7o0J3J47r1J01j99J7J9o5
$$ y = [-173, 135, 27, 80, 34, -151, 146, -64, -145, 19, -79, -105, -13, -170, 27, 58, 8, -75, 112, 211, -63, -59, -47, 92, -47, 25, 52, 4, 38, -35, -29, 3, -151, 113, 39, 1, -24, -97, -97, 129, 97, -138, 115, 26, -162, -65, -129, -79, -148, -7, -99, 67, -57, -158, -69, -134, -36, -35, -20, -48, 19, -74, 0, 60, 98, -31, -136, 11, -31, -16, -72, -46, 97, 174, 26, -52, 25, 1, -19, 66, -158, -54, -38, 114, -115, -69, 216, -57, -82, 41, 32, -82, 53, 9, 157, 120, -165, -29, 6, 176, 34, -206, -4, 66, -26, -11, 42, 25, -32, 199, 58, -38, 33, -111, 96, -38, 105, 215, 36, -13, -24, 49, -3, 106, 30, -28, -39, -17, 91, 30, -56, 35, 3, 47, -26, -3, -119, -85, 9, -161, 55, 115, -54, 77, 11, -15, 77, -41, -33, 26, 130, -72, 83, -114, -56, -85, -14, -72, -48, -114, 78, -75, -56, -161, 127, 173, -64, 31, 187, -85, -67, 54, -53, 139, 59, 97, 35, 126, -6, -75, 90, 22, 35, 143, 45, -116, -26, -4, -36, 90, -90, -126, 101, 34, -26, -13, 134, 43, 144, -55, -38, -19, -84]
7040h4j7P7J35j66j3M4q1N5N0p9oLJ1J9N5q9O6L6N7j51J96j38J29k77J83p0O0
7067Ej44J2L43l03R4j4oJ18N1m0j60J41K0j26J1K7j52N5M0L0J01j51O0j54J28
7092a4O1l4J13o0lJ21j22O8oj83K5q2R3J96j28Q6j97J35q4J21j99M5K50k21J9
7117@j0l3J09m9J4k93K28o9J97k7j29O5p8K56k97L80k72R0lK0K8J8j14j05J63
7142H9j57K27k30P3o1j18J16J24L1j80l7J03J09K8p8o3j01M6K9o9M7j13J65n7
7166g7Jn6L0J6J24l0Q5j09R0p4j59K42J6Or5k0Q9j12P6P2k93J98j86J48l0J95
7192A47j13N1j49Q0P1n9j63J75k4j27M3J4J95j22nm6QJ26o7o1q7J05P4o5J78k59
7218h0J15l43L24kP1j23r8Q9M1J1P2J72k31J23j45q1K1l0O8L3j59K86j06J16R5
$$ y = [-84, -101, -24, 111, -55, -68, -24, -105, -50, 0, -79, -85, -82, -71, -52, 3, -86, -20, 16, 73, -78, 118, -20, 109, -168, 15, -55, 5, -139, -127, 216, -87, 7, -7, -13, 105, 156, 116, -44, 97, 117, -9, 2, 29, -123, -68, -28, 2, 103, -48, 12, -142, -14, 47, 13, 126, 66, 63, 184, 62, 130, 124, -59, -34, -116, -23, 173, 45, 131, -66, 69, -15, 106, -93, -48, 202, -19, 0, -10, -43, 66, 17, 31, -262, -34, -103, 94, 67, -62, 3, -75, 181, -116, 264, -8, 82, 79, 99, 127, 145, 31, -74, 89, -68, 159, -71, 2, -59, -177, -61, 63, 94, -86, -123, -20, 89, 117, 39, -24, -125, -79, -50, -119, -72, -185, -20, -77, -76, -132, -102, -86, 38, 8, 93, -16, 74, 0, -159, 83, 99, 105, 10, -10, 79, -33, 43, 115, -178, 20, -166, -18, -48, 147, 34, 85, -64, 16, 87, 28, -135, 40, 16, -111, -68, -54, 141, 19, 14, -32, -24, 102, 35, -26, -113, -8, 66, 1, 179, -80, 35, -308, 16, 14, 85, -38, -136, -47, -6, 5, 77, 249, 18, 141, -4, -85, -64, -94, -26, 7, -152, 134, 28, 144, 239]
7243B39k79J36j24J41k47N2J45q0N8P2o8J02k30J22N2p9K2o2%J26j76O9o3J40
7267F8J02p4q2P6j11J55j72k9P4n4j37J23L5N5n3M6k3J32n7j22N8Jl7j3L5k48
7293b52L16O4j00M0r5R0N3j14K02j56m3j64J83RN6k2p2m9L1Q2j56R4j61K71j49
7318d2o9K2J54j57J90j57nJ7n0J26K6j63K62o7Q7j61OM5j03k29K68ML1j8L8j21
7344f6R0j7J9Q0l7J0Qn8l9m1Q9k31L0K27M2j58J00j19J59k08P6r3K75j66j07J83
7370D8J53k32J58j64J2P9L4m6L7N4j69n7K10k51m9N9J45j1j1Q8j0O3l23R0P7j8
7396c4m2Pj34J22K29l24J96Kj17M5J68k28J44j34K57j92M2j21J68J48p2k34J35
7419C1Q3m6j55Q7j48K10q0O3n3M6M3j02J06J3o6J30j63m5J3K15k55K31k43K6p2
$$ y = [239, -40, 96, -28, 113, -134, -82, 63, -17, 41, 113, 45, 147, -83, 39, 91, 12, 34, -28, -28, 98, -78, -9, -72, 68, 170, 96, 14, 90, -21, 134, -38, -67, 7, -47, -184, -61, -26, 29, -24, 22, -1, 131, 74, -48, 10, 11, -26, -39, -4, -252, 64, 128, 28, 68, -27, 63, 116, 2, 204, 48, 5, -159, 24, 33, 89, 67, -5, -54, -23, 59, -97, -3, -164, 107, -42, -111, -89, 65, -92, 98, -59, -64, -47, -97, 29, 55, -108, 154, 87, 174, 13, 19, 64, -39, -268, 0, 4, 35, 17, 55, -66, 24, 7, 26, 106, 69, 79, 87, 29, -10, -51, 38, -193, -163, 64, 106, -52, 48, -71, 88, -120, -44, -137, 138, -28, -135, 48, 201, -31, 127, -37, -25, 54, 88, 42, 79, 133, -36, -93, 117, -134, -183, -124, 21, 10, -1, 87, 77, 140, -183, -93, -16, -34, -76, -69, -203, -81, 148, -176, 20, 22, -95, -50, 118, -110, 34, -100, 157, -35, 7, -114, 54, 202, 130, -104, 31, 114, 68, -87, 0, -148, 62, -18, 45, -8, 38, 81, -21, 85, 98, 32, 162, -1, -46, -33, 182, -73, 158, -85, -59, -131]
7444a31J27O2p3L1J68k56q0K49j30R4Kj7r0J24p1J07q6R1j42JnP4p4NP6j2r0k8
7472g4R9Rj61M8K25j33o7M5P1o2k64J83K21l76M13j74k0N7k0l4nO4r8K89j02j57
7498b3j9l6J01J06j13l1j5K7J17j69J13O3r6m0R5J00o7j07o3Q3J3n5j08P8N4p6
7524f8Q0o3J31m6q3R8m7k4l1KJ6J0j8L6PJ81k09J38q0r3Q9P6n0J0N1M8j15N1j65
7553f8J76j00M6k1L6O5p3j64J43m6j13J05j3L8R0j13l2J22j78M2pP2j5J09k1q6
7579fj6J5O9j46K0J40p7m2m3J79m1J30l37lJ67l2J26p7j02O0M4j47J42m1j42J
7605a59J44j1q3O8j02J21R6j8n2Q5j86N4Kl1n4J09J5Okr0Q8o5m0l5L76k50o6k3
7633a03J11M6l5R5n3Q2k23J24l8rn2k6Q1r4P7Q6n0J6Np6N0j11N3J75j88q3Q4R2
$$ y = [-131, -4, 58, -15, 16, 184, -72, -152, 97, -33, 61, 63, 46, -44, 80, 9, 116, 30, 121, -21, -20, -25, 49, -25, -20, 56, 44, -46, -74, 25, 34, -127, -79, 146, 13, -54, -9, 62, 0, -264, -81, 140, -236, 177, 3, -17, 40, 20, -14, -19, 45, -53, 236, 134, -23, -42, -78, 23, 129, 16, -15, -30, -3, 114, -55, 58, 121, 25, -15, 80, 180, 113, 6, -57, 26, 39, -16, -124, -46, 8, -68, 12, -51, 80, 34, -49, 49, 2, -22, -53, -51, -35, -25, -43, -7, 0, 181, -28, 110, 30, -63, 26, 102, 52, 62, 113, 161, 46, 97, -68, 108, 8, 54, 33, 69, 134, 61, -103, 40, -6, -119, -14, -27, 11, 101, -12, -44, 78, -100, -58, -65, 7, -8, 101, 80, -6, -22, -7, 62, -84, -64, 76, -1, -43, -86, 93, 52, 182, -155, -158, 9, -23, 103, 26, -76, -16, 28, -119, 23, -18, -160, -159, -15, -26, -109, -41, -143, -22, 74, 56, 4, 89, -97, -43, -41, -72, -126, -17, -2, 4, 2, -88, 0, -65, -105, -140, 236, -14, -80, -103, 8, 54, 19, 114, 61, 143, -80, 44, 6, -3, -55, -81, 0, -94, -17, 69, 19, 35, 40, -36, 14, -97, -44, 131, -57, -140, -56, 36]
7661C6p3j06K04n8j18J07K5j02l4Q5M8p5N1k9N2Nj01R6j26j1q3K47j65J56l7N2
7687D6q4j10J68j08K30l47K37m5J17k01r4J86q4K9R1k4k51K89m3J08j11J23o2
7710F0k00K17k77K15P0o0l7j18K00L0m9m5J4k2K1k5J95k55O1O0j19J0J03p4R6
7735G1j75J52j00N1Q5j39J2K1j6N2r3J4Q8r4L8J34j37J05kk4q8q1n0J03J00K9
7761E6j63OK10r7pJ5r4j3R8L1m5j19j6P1R0q2O7n9P7qJ41j40j44K12j70J84j40
7788c9J12k39N9J91j11m0K42k13R5L0n3J8j30n8J15J52k44J20j15R4j03K06j75
7811h6N6J05mj28K6J17j66j93J76J55j09l8m9J42K32k09o5L4J8m7J14p6M5m8O4
7836F6k42N7L8L0J3J51j02N2mj99N7R3L1r9r5K11j27m3P4o6J85k16K16m1j61j9
$$ y = [36, -37, -143, 61, 3, -115, -8, 17, -85, -119, -34, 14, -61, -10, -39, 13, 18, -83, 13, -113, -124, -207, 40, -125, 31, -6, 46, -38, -148, 20, -88, 142, -205, 32, -13, 104, -97, -191, -5, -89, -60, 31, 7, -244, 45, 2, 110, -1, 122, 60, -140, 77, -200, 15, 85, 25, -12, -130, 70, 100, 51, 6, 20, -2, 19, -6, 189, -66, -5, 55, -64, -54, 49, -25, 71, -104, 48, -52, -1, 84, -55, -43, -22, -38, 14, -79, -65, 23, -71, -33, 101, -36, 69, 67, 43, -45, -126, -176, -73, 27, 56, -107, -101, 109, 12, 5, 20, -74, -87, 11, 42, -3, -122, -138, -67, 23, -59, 8, -51, 26, 18, 159, 19, -125, 87, -83, 101, -39, 73, -166, -107, 84, -27, -67, 175, -38, 57, 87, 34, 52, -78, -136, -21, 131, -113, 7, -108, -14, -117, 89, -86, -30, 75, 71, -57, -31, 86, -80, -273, -97, 58, -51, -89, -138, 4, 236, 27, -38, -4, 14, -33, 81, 5, 50, 2, 66, -176, -119, -81, -51, -38, 113, 11, 63, 59, -140, -83, 10, 41, -58, -153, 58, -69, -112, -38, -104, 81, -135, 81, 40, -121, -140]
7862a40J93r4P9j7r2OQ1M9L9p6Q4o5j9Mm8jm3j55J33M4q4K09J8m8q2Q4p3O2j93
7891a45K10J03k54P3M1J7kL6m6k6kj02K00l03L16j6j49m7K1K1K1K3O6J1j26J99
7917A40m1J3k6M8o9o4j20N8J78j08q8K47k52P9R9o5q4j84L05N0j14PL3J50r6n9
7943C7m3Q7k22J27rQk1N8P4j84J62R4n6l29K69j78J88r2O6q6k5J67o2r6Q2N7j19
7970d6j7M0J59j97J25N1r4mJ29l87K94j6m0j29O6lR5j76K32j23R3l3j66RJ81p6
7996c3J4m4P3Q3k18J52Q9r7k63K53L2K7K6j21J00l4k9l0k3k16J58K6J69j77J40
8021E7j01R3m7M6j66K23r0J8J4m6%r3R6j70J04MJ33p4J31Kj4j65j1N0n2qJ71N9
8049A64jk07J77j17j16K05j51P6M2o2n5n3J29p2kP6P3m0J36l22J93k8k2j49J22
$$ y = [-140, 53, -41, 38, 21, -71, -65, 16, 65, 104, 28, 112, 47, 28, 32, -16, -17, -60, -215, -82, -38, -122, 87, 105, 57, -25, 59, -14, 48, -145, 65, 168, -86, -13, 28, 45, 43, 79, 33, 7, 5, -97, 103, -200, 116, 100, -49, -96, -75, -54, -33, -10, 56, 67, -59, 140, 99, 112, 86, 134, 65, 1, -119, -61, 117, 9, -79, 168, -84, -5, 94, 29, -55, -239, 66, 116, 2, 9, 42, 192, 96, 37, -6, 81, -141, -14, -23, -15, -36, 22, 96, -88, 74, 168, 112, -217, 52, -126, 62, -30, 36, -50, -75, 92, 30, -66, 16, 73, -46, -63, -23, 136, -61, 64, 115, 21, 17, 146, -241, 53, 37, -3, -132, -66, -69, 26, -150, 82, -41, 52, 19, -147, -138, 43, -33, -19, -63, 10, 93, -125, 27, 116, 19, -244, 9, 41, 68, 94, -27, 73, 39, 10, -20, -43, -259, -101, -75, 94, -83, 57, -44, 49, 2, 48, -118, 105, 15, 33, 47, 1, 1, -92, 4, -166, -62, -58, 75, 1, 132, 134, 120, -45, -56, -6, -58, -66, 105, 164, 163, -44, 133, 16, -100, 105, -46, 30, 72, 10, -45, -98, 31, -41, -43, 33, 106, 66, 202, -120, 73, 45, 23, -126, -4]
8074dk3M0n1j03J22L1L8k47P4K8J66j03NN2Q4J8j6r5j2K7M1o3r4l5J85J8j10j48
8102a75J4J34j23K78j21PJ59j67J73q4p9j28J96j38o5Q4K3K0M6m8op1J46J9j12
8127a8j0O2p7N3l6n5K9RO4q5l9J55q3r2J04R2K1j47n1k9J86j5p3P8j15M8P1nj56
8156a14K24j42K7O0j20M3l2J63j79Q8j62K02p0k8J4j30J95m5k7r0K37k12L29k33
8180bk04J05J87j23J71k28K09k57K05j15N8
$$ y = [-4, -27, 13, -38, -141, -19, 12, 50, -197, -123, -95, 71, -32, -27, 25, 109, 127, 111, 16, 4, 31, 72, 9, -85, -120, 65, 83, -27, -175, -161, -27, -150, 128, 7, 14, 173, 6, 179, 95, 16, -112, 84, -54, -119, -35, -12, 8, 54, 6, 0, -71, 75, 94, -18, -28, 34, -43, 10, -26, -81, -52, -43, 21, -64, -103, 52, -31, -123, -19, 73, 94, -53, -104, -133, 53, 38, -35, 43, -72, -24, 47, 42, -114, 110, -32, -5, 55, -65, -22, -54, 109, -70, 18, -144, 58, -12, -40, -26, -156, 39, -6, -33, -123, 114, -98, 231, -2, -206, -101, 86, -37, 134, -94, 115, -142, 63, -52, 6]
8191F
$$ Imaginary data points
##PAGE= N=2
##DATA TABLE= (X++(I..I)), XYDATA
0@%%%%%%%%%%%%Qj6J6j6J6k4L2m0M8n6O4p2Q8j04J20j44J68j92K23k54K87l22
34a70L62m08M61n18N79o48P23q03Q91r89J095j210J335j473J625j789J970k171
52a138K393k638K911l221L571l972M436m975N619o403P375q625J0299j2665J6291
67I258k2612L6745j27393O2722K48974j51343j84183L2982J62057L992o2842l0376
79b2019q234j7144P2237O9731o9657j34476L9978J58514J9697j56540o4706J07739
91d880Q6271n1860o7566o98K8559K2404K6951j5300o5927j2309Q5841L8761p6163
104e916n2560N2491M4029l0663j9054K3414j5721l3715M1509N3256n1476p5405
116f9811L9601Q8141j7888q2509M387O7415j090m6245J1860L1052l3067l1883
$$ y = [0, 0, 0, 0, 0, 0, 0, 0, 0, 0, 0, 0, 0, 8, -8, 8, -8, 8, -16, 16, -24, 24, -32, 32, -40, 48, -56, 64, -80, 88, -104, 119, -135, 152, -170, 192, -216, 245, -273, 306, -342, 381, -422, 469, -520, 575, -635, 700, -773, 852, -937, 1033, -1138, 1255, -1383, 1528, -1693, 1878, -2094, 2342, -2633, 2986, -3417, 3958, -4667, 5632, -7033, 9258, -13354, 23391, -104002, -41280, 207694, 56351, -127832, -94850, 67207, 71199, 8357, -22019, -30253, -47397, 24840, 94571, 24914, -109562, -69584, 88930, 108627, -47913, -112619, -4880, 81391, 29531, -38035, -38733, -10174, 12230, 39181, 23881, -42046, -54355, 31486, 70247, -5916, -58476, -5985, 38044, 7381, -11673, 11741, -3980, -37695, 3814, 57070, 5594, -69811, -30210, 57931, 40043, -42466, -38079, 29336, 28246, -17999, -6139, 24913, -8154, -40037]
128d0037N3969M7714o3774o7144N8196P8395m2953q1080K0748O8699o231m5182
140a8680O588K2287j6397m731L2425Q9m5026o929N0505J8502m5704k5545L2049
153e67K4388j8200j6592O968K624n955J0426J2164j9889k0454K3225K6881j9907
166E112k6163J6234K3717j4672j8044J8028J2376k4900j0866L0086J3163l1055
178f984j7969K7304J7854k3396j4449J8778N838j6447N106K2230j0510l0718R700
191a3663M0221l156m3903o104L9439J4346k7425j7662J2539J1077k117O61k807
204A446j6143r06K7118J1315k8576k3348K4174L2058j2633l1983K095K3355N856
217A3828r600o556m294j278J2485J2855j5370k4999J1048L0228l017k9777n215
$$ y = [-40037, 13932, 61646, -2128, -69272, -11076, 67319, 24366, -56714, -35966, 32733, 26502, -18680, -12092, 10195, -6202, -10933, 21492, 21581, -23445, -30374, 20131, 38633, -7071, -32616, -567, 23821, 5621, -10971, -4003, -1379, -7334, 3092, 15256, -4633, -25087, -1862, 25019, 5112, -21051, -4817, 18900, 4228, -13816, 4212, 16588, -8312, -19178, 10908, 24071, -6984, -24953, 2351, 20205, -3191, -17640, 1138, 6976, -9471, -4365, 17865, 7355, -23363, -13663, 26558, 23402, -20501, -26605, 12834, 27180, -245, -17907, -5368, 5709, 3592, 4253, 1446, -14697, -15603, 11515, 22830, -5746, -29094, -4920, 27138, 14505, -17478, -15383, 7972, 13828, 4228, -2328, -6622, -7900, 4585, 17440, 2070, -22929, -11881, 18347, 15330, -14447, -19662]
230a9662K4031J0886j4526q568P123K875j398M586M47j0394m559J3599R638j4224
244a46j4058J1603J3972r066j2765N726R848n034n875P321L657r237m34J0992
258F504J96j1159m03J0835P88j0508k82R033j928q243K443O607l135p078K823
273c507Q141k907p646L780P193k964n476L130N018l442m285N037L163p311k292
288d368P739J170q280k412P766K742p975k369P065J947m318n73L094L28j736J278
304A098K464l012l752M256M372m702n675K905O566k542p137J154N781q38l280
319b342J360J263j404M93L611p40n117J210O167p07n747p02M200J912l807l030
335c380K668J783j708r60P30j69j70J198J308j405k376L292L411l431l191K680
$$ y = [-19662, 4369, 15255, 729, -7839, -716, 2159, 761, 5347, 5794, -4600, -9159, 4440, 14078, -146, -14204, -2601, 11371, 2305, -10460, -4734, 5114, 80, -5795, 1526, 5183, -4054, -4488, 6504, 6700, -4459, -4862, 5973, 6761, -3747, -4029, 5004, 3076, -5167, -2724, 3883, 748, -6330, -3507, 4634, 1727, -5919, -2139, 5054, 2090, -3386, -256, 4762, 1320, -2965, 2072, 5235, -2076, -4368, 3371, 4541, -3739, -6151, 1615, 4357, -3618, -5987, 1078, 3025, -1293, -1866, 1228, 1556, -180, 1098, 3562, 550, -3202, 1054, 5426, 724, -4951, -2046, 4520, 1978, -5159, -4005, 1776, 938, -2342, -982, 281, -1123, -630, 2981, 2241, -2876, -1666, 4501, 3794, -1953, -2655, 1545, 3457, -350, -3380, -712, 1071, -637, -1597, -867, -1036, -1206, -8, 1300, -105, -2481, 811, 4222, 791, -2400, 280]
351B80L214j456l765M79K578m30j661J90p67n17J649R84j312k014Q12L754N82
368B600l457q85K466K020j094k103J30R51j61O18L16k829j444K639K043j591l407
385c188K27L613J205j518j374m48J720K434l34k406j668J186L370M00l726k575
401c082J174L365J196l415l235P49L852K724k412n112K11O367K937l759n014J092
417b362M873K013k585l695j633K871M090m16n116l815L142O447Q26p337m351M909
433b139P538l42p392k662M834M890n50l896l534O73M642L131l181o320j442O199
449D49N121l439p640j755P933O755m884q262O66P369L636l528m858n31K962L486
465C480P39l899m656O26N465L620l842q343N1R654M988p241q571L326R391R60
$$ y = [280, 3494, 2038, -1727, -1248, 1330, 900, -761, -571, -1338, -1855, -206, 778, -534, -2548, -1736, 2018, 2600, -857, -1742, 724, 2744, 1650, -453, -323, 628, 467, 1085, 1401, -1428, -2872, -233, 1810, 219, -3188, -2961, 652, 1857, 339, -1035, -1483, 237, 2671, 2337, -69, -1737, -551, 2819, 3219, -507, -3082, -1908, 1457, 2653, -762, -3997, -3248, 604, 3328, 916, -4196, -3985, 2382, 5319, 1560, -3454, -2362, 2511, 4524, 1939, -1756, -3389, -518, 3572, 3156, -1960, -5775, -2633, 3814, 4640, -2697, -7048, -2139, 5399, 5057, -2335, -4997, -163, 4727, 4177, 281, -3253, -2580, 2062, 5193, 2012, -4308, -5750, 449, 5570, 2131, -5509, -7264, 669, 7424, 2540, -5722, -5056, 2313, 5949, 2421, -2437, -2968, -6, 3480, 4219, 320, -4336, -3710, 1755, 5375, 1533, -6810, -6759, 2895, 7883, 642, -7929, -4603, 4788, 5748]
481E748o222k801J827K569K299N30l700m982M54P652M108p594r045L577J1710
496F130K185j1828o945Q040R117j562o744k542K603L752K280j100n535l937N486
511f00Q057j317j0156n770P734J0829k928j2579l409J0229R002m625j0352k07
525f092P237M106j827l879l102Q37M758M663k595r836k647J0016P957o719j2747
540i870J367J3764M653j0846p994N270P894j8l729j187q23l62M713M070n958q565
556g621K244J1183L282j0682q613O445J0275o16r342m322N620O984o04m373k834
571b974q7L910M249r90o506l814N429P911j727r506l891O660Q228k346j0244k483
587h181Q592O450l908p153k01N115K315n54j447l135r25M834M584m171p961n8
$$ y = [5748, -474, -3275, -1448, 1121, 3420, 3950, 250, -4732, -4278, 3374, 7482, -112, -9157, -5580, 6130, 8315, -3513, -10458, -2418, 6699, 5137, -1607, -4149, -1546, 2206, 4486, 3386, -2149, -6086, -600, 7457, 6140, -4016, -9786, -2052, 8777, 5849, -6730, -10139, 90, 9092, 4467, -5885, -6092, 1145, 5251, 3424, -455, -3557, -2720, 2038, 6701, 4106, -5730, -8377, 1639, 9596, 2877, -9870, -8503, 5261, 9914, -932, -8926, -3656, 4238, 4220, 491, -696, -1519, -1881, 2832, 6902, 944, -7621, -5377, 5806, 9088, -1594, -10207, -3762, 6513, 5897, -3445, -7767, -2147, 4837, 4233, -140, -2974, -3061, 849, 5098, 4108, -2398, -6212, -783, 7128, 5401, -4105, -7996, -1336, 6892, 4546, -5698, -8181, 411, 6861, 2953, -4200, -4401, 714, 3029, 2475, 1028, -2107, -3032, 1802, 6386, 2215, -5746, -5804]
603e804R002L410o838o476L043P577L15o210k613L782K947n87o91m94j484k2L593
620B450J514m510l480L258L812o60l729j940K064K896l45k684j307J706K041Q8
636A174q02k34q45j60K268Q59j838k303J018K712P40k718k784Q78K928J328l031
653h10k233K073K323o34q52m61q60Q85K712Q92l758k197L312L006j651l711m99
670b463K418K219j211k726m90J520J950l22j806p13P25J776J380j757k074Q64
686g10K732j25k097j210R65J329J56p21j617m50J640J281j633j135R07R25M12
703F49k16n81j38K54R22K63q10m92K57M17K33m98j309L1J003K36n75n42N4P21
723a21K62J41n47o99R89J420n78r96k95Q57N59n37q36l35O04M25j98r50m37J063
$$ y = [-5804, 3198, 6608, -230, -6706, -3663, 3914, 4229, -1981, -4594, -812, 2135, 1548, 857, 363, -1121, -1143, 2450, 3964, -546, -4026, -768, 3044, 2384, -1345, -3285, -1221, 1675, 1330, -1354, -2661, -955, 1086, 1174, 372, 138, -707, -867, 1401, 2260, 422, -1881, -863, 1849, 2589, -129, -2913, -2035, 893, 2221, -810, -3043, -970, 1353, 719, -133, -594, -1454, -569, 2143, 3035, -723, -2920, 392, 3398, 1747, -1964, -2463, -45, 2174, 963, -1763, -2253, -733, 1217, 895, -911, -1624, -899, 877, 2257, 500, -1574, -710, 2022, 1897, -200, -1410, -445, 884, 1040, 319, -1298, -1748, -108, 1173, -460, -1595, -688, 237, 649, 433, -148, -286, -32, 890, 1153, 343, -149, 108, 525, 758, 260, -1049, -1018, -15, 221, -354, -896, -842, -121, 141, 282, -265, -964, 25, 1445, 867, -129, -424, 433, 992, 455, -381, -716, -112, 313, 115, -835, -1272, -209]
743b09L87k1o93n30J111R34l95p18k3Q75N62q24p30J55M46M82o99q19j14Q22j0
764a1k37n08M8R24n5m27j05L13P18J31o32k58N09L14j60l00p22L05M03k80m83
785e13l92M84N67m16j60oK85N63O0m25J4L86K29k30l70r8M57n0j81l86l36M58
807f0n5l53k47K33K77K61j80m2J39K1M85k4m77K50N03k10m12k84OL23k02k64j40
830d52o3K63K13l21N4k8J13L95K87m39J41K83J91j78m68J9J55j23R2k9p04J18
852d81O72k51n58k50L58R03j53n46J86L72O4M31l46l35k54M77N57l19j081k24
872g78Q41M44o54p88J27N48L80L6n20m71N93J169J8j201m37J029R64n02j069p
892b78L42K72M7m32o54j85N98J034n03j785K83K150M95j377j129J074J145n14
$$ y = [-209, 178, 157, -536, -1066, 45, 979, 584, -134, -157, 718, 1280, 456, -274, -119, 327, 809, 110, -709, -823, -1, -11, -248, -756, -708, 216, 161, -266, -371, -58, 660, 791, 159, -99, 410, 724, 564, 264, -458, -153, 250, -30, -513, -905, -421, 146, -270, -430, -436, -151, 412, 472, 47, 61, 447, 676, 446, 76, -22, 435, 385, 204, -182, -518, -60, -115, -468, -715, -482, -205, 56, -124, -166, -27, -6, 479, 455, -22, 228, 731, 521, 109, -175, -169, 154, -48, -312, -452, -515, -252, -39, -360, -306, -334, -221, 174, 461, 22, 163, 446, 637, 459, -9, 10, 165, 42, 134, 105, -599, -481, 191, -60, -618, -868, -510, 393, 240, -306, -120, 252, 316, 747, 401, 66, -188, 289, 846, 527, -554, -778, 63, 507, -147, -935, -808, -260, 120, 156, -364, -835, -242, 927, 945, -256, -693, 336, 1300, 798, -271, -278, 64, 336, 383, -49, -703, -888, -290, 744, 241, -1544, -1261, 889, 1384, 7, -1122, -48, 1097, 583]
910E83n66J60k35k42Q35L93q84j493N91J696P9j590r63J144J372pj325m98Q40
929a10R00K59n27j023R1R06O79p40r56m34Q28N64J03j130j004O26K305j21k340
948a124q07K036J848j169j870O97J448j88o40j9m9j032K48J832N9k669j095K762
966B68K026k284k529J236K955m07j997P4R93K62l69M68J7j142n69J703P90j805
984c10j685J034K154lk000j097J265J597K9j330q98J127J045n0q11k32J45K71
1002B51K29L17o84j474J58K209P73k607j857J926K822j150k966L39K899K70j787
1019c32n8J295n66j143J364J361k087j901J899K585j555l353M75L420R8k422n86
1036a506J251J031o34m07M21l60l40R71J117r74j665O64J488K78j541j088O80
$$ y = [583, 17, 177, -58, -300, 535, 928, 44, -1449, -858, 838, 917, -673, -1636, -492, 880, 873, -452, -950, -110, 790, 1049, 522, -501, -410, 496, 1175, 435, -521, -955, -127, 437, 540, -590, -1594, -968, 1337, 1216, -1124, -1931, 105, 1953, 784, -1086, -389, 1059, 871, 231, 212, 163, -869, -621, 1211, 1270, -1399, -2494, 268, 2294, 10, -2519, -1283, 1672, 1265, -732, -658, 335, 597, 228, 696, 713, -429, -998, 705, 1495, -310, -1995, -961, 1193, 1190, -810, -1907, -642, 955, 984, -346, -1244, -117, 928, 878, 67, -165, -20, 251, 480, 797, 113, -1361, -1203, 1006, 1779, -828, -2685, -759, 2063, 913, -2053, -1714, 1185, 1455, -332, -390, 905, 339, -804, 560, 1921, -166, -2067, -168, 2417, 862, -2491, -2016, 1404, 1502, -920, -1506, -255, 776, 142, -265, 156, -204, -544, 427, 1544, 570, -1095, -431, 1057, 1335, -206, -1294, -614]
1053f14J017K76q54j036L69J489J95j168p37R81R93m87l85O28m08q18N76J320
1071A337q59k273P21K505J0k764o78K330R53j606j046J540M36p64oQ63q7j643
1089a031N25K181l21k499l41K299N85j845p30J015M21m11q3L06n04l33J029N98
1107H61j026n69O32R29j85p58qM11r4l6P4o78m81P75R83o67j173J17J451j14j175
1128g31J57R37j9o02N96M79q76r07J453P74j413q15Q11J080q94j203P39Q13p54
1147c75l76R89J15q45MJ448k19j325l3J240L31j167k29P73J11o65n6N60j23j002
1167h44M51J002m58j168P25Q83m85o78M00R35m09p23R30J03q32l24Q37L06r40
1186b89m71J035J41r28j80P89R1n68O2P06l8o85L59O41l12r32O32O89l86p89L76
$$ y = [-614, 403, 679, -175, -1211, -842, 647, 842, -326, -1063, -82, 911, 424, 39, 667, 259, -559, 17, 1337, 478, -1795, -1074, 1431, 1441, -1323, -2001, 329, 1282, -324, -1370, 170, 606, -158, -164, 699, 612, -1031, -506, 1675, 1354, -1145, -1486, 813, 1398, -447, -1177, -162, 259, -152, -235, 71, -433, -766, 263, 861, -165, -734, -102, 827, 642, -116, -124, 287, 193, 157, 231, -447, -928, -153, 830, 163, -1010, -893, 558, 444, -731, -574, 363, 344, -258, 338, 817, -59, -966, 487, 1261, -152, -967, -156, 924, 30, -1173, -434, 379, -375, -751, 238, 353, -492, -488, 960, 741, -584, -617, 623, 954, -213, -442, 331, 442, -223, -279, 281, 158, -844, -393, 609, 151, -1017, -292, 591, 106, -572, -172, 763, 354, -369, 561, 664, -168, -492, 345, 651, -289, -760, 275, 416, -512, -692, 97, 188, -380, -318, 388, 350, -335, 24, 665, 353, -579, 53, 742, 356, -433, -57]
1207e7N82l87r49N44Q08r19m03P54L63m56n08R89L01p89l99R09M89q78k74P26
1227D46J39q60j88P66n9p18k23P18J38p80K42P65j56p22M45O41l67m46K70O39
1247F90k71p69O31J87o33m47O74J69p26N0L00K91m21j68Q35j12n48K07M14J02
1267D55m37r4N26n9r21M09M62k48o90J79N45l55l19L63K71l02p3L14K88j97k21
1288a04N19R0o99J45M42N7m45j81M32M7m88k61N38n8n80K39K44J83l34p5M32K26
1310C69n09J66L54n4k02j29L95j97l54J99p2j91j49L82Q3j81j21J57K14k67J26
1331A9J88p9k1QJ72q8l27J72K67k10o11K65L84j27l94j2M69j02j89J60J57j26
1353b5j3L58k5l81J01J82K39l10k11rJ47j4j52j63J3K03J5j16J9KJL39Q3l72P5
$$ y = [-57, 525, 138, -811, -267, 541, -378, -781, -27, 336, -120, -628, 361, 662, -127, -526, 383, 872, -6, -280, 446, 585, -275, -463, 303, 244, -474, -697, 21, 159, -621, -379, 386, 230, -492, -47, 594, 227, -219, 51, 690, 419, -350, 281, 468, -165, -612, 62, 231, -495, -445, -145, 146, -275, -443, 392, 280, -268, -61, 353, 455, 18, -76, 450, 391, -530, -121, 341, 93, -597, -418, 127, -228, -547, -184, 87, -215, -288, 26, 314, 117, -104, 415, 505, -194, -49, 393, 450, 5, -176, 256, 303, -185, -446, 92, 34, -546, -307, -63, 120, -214, -289, 143, 369, -140, 26, 380, 326, 124, -5, 390, 193, -161, 38, -34, -225, -374, 8, 91, -90, -211, -54, 160, -107, 19, 207, 128, 107, 115, 287, 199, -128, 44, 311, 101, -510, -245, 139, 12, -382, -394, 75, -27, -216, -56, 101, -25, -38, 320, 295, -86, 15, 197, 436, 126, -85, -94, 53, 39, -113, -276, -263, -60, -45, -161, -142, -140, -139, 200, 283, -89, -14]
1378a4O9R9m3Q4k52o8K28P2j51j40n2O9L35k89k17J2K73K9j3j27RK72p0J01j27
1403H9p3j07L33j46Lj77j29K61J56n13k06J58M60J5k46j18J58K21r4q8Q3M1K4
1426A05p5K87j31k77K1J64j3l33j61J93L14k23o0J20J34j7J84k34J14r4K04j9
1448B03No7j22k94M89J2m15k45L61N64l62p26K79L90J6l53p1M29j3o5J39J07J57
1471D18n06QM23Pn99l92P29K40n08l76L53N32m52j6O2J02Q4j68J21J7Q0j13K33
1494B79K23j84p33J19N32j76k14l08M65K01j29n09R7L32J23j44N0J93q0j42N0
1515D5K62j4m81l3N73J42o30l85O08K80o37k57M16J95n7k65P9L11k5j09KK22m3
1538A99m11L49M35n26l50J66K41l7n25J2N59k63j10L02m2j06K24j43R7O5r3P2
$$ y = [-14, 55, 154, 111, 195, -57, -125, 103, 175, 24, -116, -168, -99, 236, -53, -270, -258, 15, 44, 31, -96, -87, 185, 115, 216, 89, 16, -91, 242, 96, 99, -78, -207, 54, 210, -303, -509, -351, 109, 124, -122, -240, -82, 139, 45, -43, 40, 81, 105, 30, 317, 186, -91, -70, 94, 81, -252, -413, -220, 94, -129, -189, -69, 65, 48, 232, -2, 112, 18, 222, 203, 208, 141, 19, -275, 214, 226, -189, -434, -73, 491, 129, -597, -318, 72, 88, -265, -336, 93, 80, 15, 154, 261, 418, -88, -80, 343, 350, -249, -641, 88, 328, -180, -556, -203, 329, -123, -139, -77, 25, 109, -59, 62, 79, 159, 46, 279, 502, 318, -415, -296, 236, 60, -154, -462, 3, 204, 75, -434, -337, -5, 118, -26, 24, 217, 137, -5, 45, 307, 293, -188, -221, 352, 494, -136, -521, 87, 367, -270, -527, -111, 84, 27, -238, -159, 152, 127, 18, 20, 242, 199, -212, 137, 572, 46, -304, -138, 103, 66, -459, -447, 112, -151, -261, 41, -1, -107, 117, -26, 71, 136, 43, 115]
1560A15J69K8r9o9k86K79p0k06K3J4J08J17k34j56L24o0o6J58L3j08M0J14K14
1583C82r6o90K72M90j39m42qM93J0o30K53O6Nm2O1K58k84j82K52K88j67k80L57
1606B27K5J02m11P3L43l59m2k34L86k06j69K95J77l77qK39J09q7j47M65k78l2
1628I1K6J06k31j62K8M68l80j22K00o0P0j57l6P8j17K60K55q1j75q1K90j3k91
1651c4kJ90J95m20p6L12L5m77P4J98R8k70q8M49K7n36K91L21j98j04K81M9j83
1674A32k14K27J25l46o9j9J25L3k06L5J76j22r1Q9J39K2j33K22J28j77rR7l6k04
1698g6K7M02j99l43J35J71k24k06L56l1q4k14K74J51k46m4K86K00m11J44n6K39
1720B51j84k5k6M6j65j89L95j18j79q5L89k09r4L1M52j78k78J66K27l66K36r1
$$ y = [115, 284, 312, 213, 144, -142, 137, 67, -139, -116, -102, 6, 123, -111, -267, 57, -3, -69, 89, 122, 14, 54, 168, 382, 286, -404, -132, 358, 219, -223, -231, 262, 272, -358, -105, -39, -34, -76, -15, 243, -41, -223, 29, 317, 150, -130, 227, 252, 354, -57, 16, 359, 0, -42, -276, 110, -96, -265, 30, 207, -170, -178, 61, 170, 83, -64, 401, 123, 91, 117, 223, -8, -170, -142, 326, -54, -176, 24, -36, 34, -123, -159, -81, -198, 62, 317, 236, 61, -20, 270, 257, -34, -36, 154, 349, -71, -147, 165, 200, -277, -203, -5, 93, -177, -265, 184, 211, -325, -34, 287, 89, -15, 266, 315, 132, -82, 145, 270, -76, -145, -164, -39, -6, -212, -177, -1, -123, -214, -125, 14, 36, -97, 125, 253, 76, 67, 164, 128, -76, -49, 353, 154, -189, -54, 117, -107, -313, 43, 12, -72, -286, -12, 139, -107, -151, 135, 335, -76, 68, 12, 251, 67, 42, 16, 62, -103, -292, 103, -15, -194, -279, 110, -99, -193, -162, 290, 112, -166, 0, 227, -139, 97, 6]
1742FJ54J97m58j11K65q9l4MM6j64k9K23Qj68p8L09J26j2j62k4J93r3j05P7j43
1767f2p0K6L61l01j59m0L78r7k45K13J57j47k2N6J02j62j8J99j01j4j15J64K02
1790C05m88O6J65n8n3j25K88k11k43L12K00j40J1q2K40j2k26J38J47Q3k35q6P8
1813G4k8j0m8m9Q2m9QJ09j06j25J25J26k06Q3K91l14N0J30j95K04K9j88j13J08
1837a2j60J54L6q6j70J67K44j08m1N0J54k42k02L56Q0k25k6J57O9l20J8J7J03
1860A3k4j66J40j15kl0J28J86m6l83M53K46l52j93L40o5j8q0J70k05ql9L5j17
1884a32j3L04j22j66k5R1K24j25j47N29l17Jj40L07k5l72r6L29q3j51j38J99J75
1907A07k07NM7k1Q3M9n1J2P6q6J21L4K3k18oR3J04j44j57J51K4j55J45j51L0R6
$$ y = [6, 160, 357, -101, -212, 53, -36, -70, -66, -20, -184, -213, 10, 18, -150, -228, 81, 207, 195, 33, 9, 202, 109, 4, 81, -62, -132, -106, 255, -46, -205, -245, 133, 36, -209, 4, 161, 14, -8, 48, 150, -12, -30, 169, 68, 54, -61, 103, 305, -183, -117, 48, -10, -63, -188, 100, -111, -354, -42, 158, 18, 29, -53, 187, 175, -51, 87, 234, 317, 82, -4, 74, 46, 36, -12, -61, 21, -28, -20, 89, -17, -142, -17, 109, -97, -14, 277, -37, 13, 143, -52, 152, 181, -7, -120, -12, -172, -18, 18, -68, -238, -71, 173, 65, 24, 74, 228, -14, -216, 140, 220, -5, -31, 126, 195, -125, -107, -90, 13, -11, -177, -37, -152, -154, -184, -56, 130, 84, -299, 154, 400, 48, -145, 195, 130, 112, 32, 202, -3, -11, -50, -15, -132, -145, 159, 37, -129, -154, -63, 161, 36, -111, 418, 101, 102, -38, 269, 244, -128, -224, 105, 22, -129, -267, -68, 107, -100, -95, -48, -69, 14, 63, 12, 24, 100, 14, 135, 169, 192, -26, -32, 61, 165, 21, -136, 15, 39, -116, 29, -122, -92, 4]
1933Dm0KnK0Q7L8J04l7j11k41J92O4L3q9p0J07J23m47j62M47M5j74lJ41l4r5J53
1960E2K46m04L5K51J21j83q7n0J03m4K0k70J10J27k90J75R8J68k64q4N5K33j06
1983A2j24J76K68k13j01L1J11Mj54k40K03R5k01q0J82N1%k58K30M2N5k52K98K34
2007C69k13j53K04M6j99j00K1l6O6m5j6K5j45L45l26K26q0L7O0j0l3K5l2P1K38
2032C45l6k78r0K27N2m26k2M7K85j55k09K34K68k01k20M21j71k18J90K04o4j79
2054Dj37K70Np2j17Q4j13J50N4k03p2O7j52J17J43j31nR0J09j18j9O2J09j72J48
2079A01J34l49K14Nj91p4q1L01j93k4K26K15j75k36K08KK4j43J48J28r2j22J56
2102A82N8k01r7N1K02l49k23L05L6m0j08J58J64k53J11J44J20j69p3J22m7L4l18
$$ y = [4, -36, -34, -39, -19, 68, 106, 210, 173, 62, -179, 13, 77, 110, 21, -49, 58, 181, -266, -428, 19, 64, -110, -113, 28, -6, -101, 52, 298, -106, -71, 180, 301, 118, 31, -19, 84, 40, 60, -210, -100, 27, -263, -88, 10, 178, -86, -170, -115, 118, 12, -112, 64, 332, 119, 18, 49, 160, 164, 10, -230, -27, 68, -133, -213, -31, 20, 20, -238, -8, 34, 89, -163, 135, 369, 156, 3, 207, 253, 54, -46, -25, -61, 5, -40, -56, -31, -176, 169, -157, 69, -11, 26, 86, 76, 43, 68, 36, 107, 345, 309, 31, -59, 168, 220, -206, -228, -181, 104, -51, -260, -26, 242, 41, -179, 242, 71, -147, 43, 247, 183, 4, -133, 137, 142, 70, -47, 37, -76, 74, 128, -75, -147, -80, -232, -115, 28, -103, -108, -18, 91, -27, -46, 16, 125, -47, 101, 235, -114, 100, 105, -86, -160, -241, 60, -133, -157, 69, 284, 109, -127, 81, 83, 107, -36, 112, 240, 148, 26, 182, 240, 39, -58, -7, 195, -154, -377, -72, -36, -76, -184, -26, 138, -115, -4, 140, 260, 91, 18, 140, 93, 127, -191]
2125a91K10Lj80J95m3p9L4J1j29L2L0J24r7J10j9P4J35k29q0K23j04q2M7J98k76
2150h3j60J98N6j37j21K6J97J55m26K19L45k12j84l0L68k13j10K07O6j58N9o4
2172bol4N3j53P8K28j52m9O1O8k13K73l7l5K0k38L00Pk80K57j25kj17O3R6l51
2198b90L23L7k26J00J66j04J38j25J03l1J34l30J19L23k36p1J09m5k21k1J71J42
2220A65k38k42J56K66j14p0J31n2oO7O7j5j18J25n1N5r3K1K1j28j0L0j3O5j46
2245a27L8J49j26J17r4P7l0j62K97pj29O3l0J0j56PK2o2J45j06L07p8l17N5J35
2270bq2q6J67RJ31j54k5R5oJ42j68J30k74K1K7J11n5j03J18k0r2L6L5M0r3J43
2296D5J98k17j75J11J46j26K53j90Jj56L4N5j33J18j02J55l7p7j42K06n2Q0N5
$$ y = [-191, 19, 22, -158, 37, -6, -85, -51, -40, -169, -137, -107, 17, -80, 30, 11, 85, 220, -9, -89, 134, 30, -52, -5, 193, -83, -243, -45, 11, -126, -247, -221, -24, 131, -295, -76, 269, 57, -127, -157, 211, -2, -112, 95, 161, 3, 62, -2, -8, -42, 11, -142, -64, 164, 12, -37, 24, 92, -121, 152, 115, 80, 100, -138, 162, 169, -111, 146, 21, 19, -98, -35, 61, -290, 33, 70, -156, -56, 110, 6, 144, 19, 122, 91, 225, -105, 14, 337, 101, 30, 139, 94, -127, -148, 23, 165, -73, -315, -159, 107, -7, -77, 54, 2, -4, 63, 130, 115, -3, 122, 71, 126, 33, 54, 75, -53, -63, -33, -46, 19, -127, -89, 60, -66, 51, -43, 34, 4, -158, 139, 132, 3, 66, 36, 46, -110, -103, -81, -143, 2, -104, 203, 125, -192, -137, -2, -84, -170, -3, 6, 137, -17, -42, 53, 47, 189, 21, 151, -123, -102, -75, 36, -19, -122, -4, -24, -116, -80, -45, -5, -98, 45, 243, 26, -149, -38, 108, -18, 235, 45, 46, -110, -76, -21, -154, -36, -138, 17, -20, -97, -239, -33, -85, -5, 50]
2319E0n4J99j12j01OM8K5j4P4j86k7J82m0J6r8n0J45q3j46J25M3n6%J84m1j61
2345g2j04Q7K62n8k8k85K29j40o7K56j46l5OPN1l4P2M6j17mK13K4J22l29J19j12
2371c7N5J60l82K41j43J62j32p8J10K5n3o1J75Q6o2L3l13L62j91J44j96M6J32
2394H3p2r0n1J17M1kj50j1J38k6k7K08l01K19n1J46j78n0J30J71j46j16m8M7J65
2419A46k23l3k5o6R9oJ40n7k2Q1j32J92J03k31JJ64Jj68J92k02J61j16j51K8O0
2444f4K5o6q6K20n9K1r0J08J9q4J90P5r4j89J20ljj64J00K7p6K21r7n2l5Oj39
2471a67O0J56l8q0N6K01j71j71J0o9J99k5k34J24J75r8O0k56L40j90J5J41m5L9
2495C2j67J28J07k06R2K5M9K9k5j76K91q6k22J11k10K63j10q2K73k35J06m5Q7
$$ y = [50, -4, 195, 83, -18, -12, 36, 61, 47, 121, -65, -92, 90, 50, 66, -32, -82, 63, -20, -166, -41, 2, -54, -54, 130, 89, -72, -176, -89, 173, 115, 87, -198, 31, -109, -176, 80, -66, -101, -95, -88, -37, -71, 1, 47, -70, -74, 139, 163, 285, -44, 75, -37, 18, 178, -204, 37, -106, 56, -76, -154, -44, -19, -72, -133, 42, 128, 66, 99, -214, 148, -43, 101, -95, -49, 83, 11, -79, -130, -13, 28, 26, -124, -135, 3, -23, -50, 158, -143, 76, 25, 171, -7, -57, 73, 244, 98, -18, -66, -19, 146, -77, -110, -135, -201, -102, -108, 32, -25, -47, 34, -98, 94, 197, -34, -33, 131, 132, -36, 156, -46, 115, -1, -152, -124, -64, -39, -105, -191, 29, -30, -9, -99, 9, 28, -56, 134, 209, 115, -74, 46, 43, 42, -122, -22, 5, -71, 150, 53, 1, -34, -28, -167, -107, 49, 11, -69, -13, 188, 17, -154, -144, -213, -14, -39, -273, -149, 26, -72, -12, -268, 72, -118, -103, 38, -7, 32, -135, -7, 100, -106, -14, 11, 60, 89, 64, -112, 179, 93, -129, -18, -228, 35, -75, -157, 116, -119, -13, -58, 29]
2518B9J14k62L7R5J20j81R8j70J44m6j69J52OPp8j6J24o1lr8Q2R1k46K51n6R1
2544E5J06k56P2P7k6l7J66k1P0r8k08JJ15N5r6R5m9j0J4j01M9l8K04j69L9K5R9
2571A33j20J5L9j22m7K21k30j6J66%l4KJ9j30j6J10j91K15pJ29j29j53J96r3J20
2596G7j24q4L53j65o8r7J84k13MK61l36K29j8J36j07k5m1JL14k46QJ9P8j05r4
2621e9j4J32j64R6q4J42j9j5%r4k20K67J2K72k16m1m7J92j47j4J35k6j57J53k19
2646a35J82j65L0J29j22K3j97K91k3j80J96m9p7N4K02P2j93K9M6Ok87J77J51r0
2670G0j38n8J49o0R4k6mO1j08n2J78k5j09pl6J49k8j94K3K08l09L06k24Ok5J26
2696c3p4K56J12j84m6j48J45p8O5r0M9Q3R6j96jP7j53J98qo9L0k80K65J26j47
$$ y = [29, 143, -119, -82, 13, 133, -48, 50, -120, 24, -22, -191, -39, -33, -26, -104, -120, 4, -57, -60, -158, -76, 15, -231, 20, -36, 55, 161, -95, -23, 54, 28, -9, 157, 136, 206, 108, -100, -99, 16, 71, -25, 70, 21, 11, 25, -76, -27, -65, 139, -30, 9, 34, 133, 13, 28, 67, -55, -102, 119, -111, -127, 39, 39, 5, 7, 26, -104, -120, -10, -201, 14, 7, 136, 7, -146, 50, -43, 77, -47, -131, 222, 57, -11, -108, 76, -137, -133, 128, -208, 21, 3, 139, 32, 7, -34, -33, 281, 35, 43, 62, 140, 35, -59, -73, 59, -105, -9, -93, 49, 30, 15, 15, -79, -299, -32, -20, 252, 36, -5, -52, 140, -7, -21, 114, 88, -69, 84, -135, 47, -118, -88, 41, -81, -58, -255, 36, 13, -167, 29, -20, -97, -43, 159, 231, 38, 67, 113, 119, -168, 9, 160, 70, -68, -126, 23, -37, 57, 31, 27, 88, -20, -72, 106, 81, -28, -35, -71, 78, 50, -144, -121, 87, -222, 84, -140, -134, -159, -33, -107, 149, 261, 77, 31, -117, 28, -50, 15, -75, -26, 57, 153, -43, -44, 33, -120, 78, 70, 1, 31, -249, 16, 142, -5]
2721ep7J10J18k78J41q0J19l6L6o9Oj55n4L40j60o2O7n2J58L5j78J28j70l4J85
2746C3m7l0J56m3k1M3j23j10Q8J7j60L00j1o8p3K7J96j49OJ03j78N2K11k14k9
2771b4j06N3J39n3K7p8kL7p0N8J1l3k31K41p3N3J0J26p6n2J41L4o7M0k71K46l5
2798D5q7O6J4m8j21J33n5J95o4j13J07O2l33K35j1Mp3QQ4L1p0q9K12j58Q9j02
2824c9L5n2J05r3j16K73k80L27q7j29J13q9RJ8P3J5j71J41r5L6n8j14J52J27n6
2849D5p3J32j60J07r1o5L01j00j39J04o5n8J09q6Q6l7j07p1K40p6k8J18j89M7
2873e6j75K68K8m5m0j31J60O7nMj36M9RR7j36N6Q3l2j98J40j34J90j19O0J46j15
2899C5J9k1j2n2Q9o3l5J32j96J34K6m4j12L00r8O4l30K03j88NNJ23k7J07m6k1
$$ y = [-5, -82, 28, 146, -132, 9, -71, 48, 12, 48, -21, -15, -170, -224, 116, -44, -106, -39, -91, 67, 102, -76, 52, -118, -152, 33, -14, -44, 112, 69, 48, 91, -32, -142, -54, -37, -197, 103, 92, 24, -49, -22, 174, 25, 31, 134, -44, 8, 219, 5, -24, -130, -77, 62, 9, 36, -42, -44, -7, -77, -19, -8, -41, -272, -31, -104, -51, -41, 85, 9, -43, 98, 132, 65, 105, -166, 80, 45, -42, 24, 38, -10, -131, 2, -53, 142, 78, -35, 72, 134, -199, 36, 25, 29, -44, -36, 48, 79, 9, -80, 132, -26, 63, -39, -4, -56, 49, -44, -160, 113, -167, 160, 73, -56, 57, -32, -23, -5, 68, 83, -88, 53, -42, -6, -64, -178, -26, 101, 45, -28, 104, -56, 51, -40, -105, 196, 96, -43, 61, -4, -62, 47, -39, 47, 10, -97, -168, 72, -4, -32, 86, -103, -56, -231, 37, 65, 20, -20, -151, 9, 76, 71, 75, -61, -12, -3, 94, -42, 14, 97, 65, -133, 7, -127, 63, -56, 4, 150, 35, 54, 33, 21, -31, 58, -5, -40, 92, -104, 30, 56, 12, -100, 200, 102, 166, -164, 39, -149, -144, -139, -16, -43, 64, 18, -3]
2925cL8J16j70P6R4l8j50L6R0j59jj4qR1N5O4q6m0J06j31J7P5L2o0Jj45J40K05
2953B31k57j61O6J68P4j35K15j29o0j75J83K7j98L50j61j3L0R7k57Q5N4j32J24
2976B6J15m1l34K04k0R5r4P5NMl9M1O4j59J45p4k3J42j44JJ14j76o3OL2J47k1
3003B8rJ77j77j46N9o4M3qR3m2L3o4J74k70O4L46r6l0p7L7j21J34N5j11j51M6
3029g7n9J05M9j80K06o6J93l12J61j56K68o7m5k5R3Qj1j82K06j35o6J48l3j67
3053a44J09J30j26m9J45j64r2K85j19o6J98o2O5j25K4j3oo9J37k61J87P3j58K79
3077A78j28o8k03K30M2j11K08k44P7L9l1p6K46q1n8j2K4q9P6p6n2O9J21J62l03
3102f0J48j20J83k77J79N4p4o4Q6O4l3M6k80N7J83j06O3K0j24J06N8m7j90J86
$$ y = [-3, 35, 151, -19, 57, 151, 113, -37, -1, 89, -70, -71, -85, -93, -2, 53, 117, 31, -9, 97, -34, -17, 58, 90, 30, 31, -114, 26, 231, -26, -187, -121, 47, 121, -14, 201, 72, 12, -163, 20, 47, -151, 199, 38, 25, 55, 152, -105, -20, 34, -98, 26, 141, 100, -234, -30, -50, 45, -49, 26, 31, 35, -4, 37, 101, -58, 87, 13, -10, 132, -12, -11, 103, -73, -136, -130, -98, 49, 28, 19, 196, 19, -127, -68, -132, -89, -97, -4, -46, -13, -77, 97, -173, -109, 237, 141, 111, 34, 71, -50, 84, 139, 28, -123, -77, -136, -31, 18, -162, 44, -22, 171, -141, 20, -136, 132, 65, 20, -5, 88, 96, 85, -97, 109, -26, -92, 56, 23, -144, -35, 95, -31, -80, 65, -99, -191, 94, -25, -91, 107, 45, 110, -15, 9, -4, -10, -79, 58, -203, -16, 57, -101, 178, 50, -18, -221, 9, 51, -60, 148, -96, -19, 20, -11, -87, 159, 78, 20, 8, 32, -57, 19, -57, -109, -40, 81, 243, -60, 88, -32, 151, -126, 53, 107, 33, -31, 55, 119, 86, 132, -148, -91, 92, -14, 49, 69, -55, 51, 109, 62, -128, 58]
3126E8o4r4J49r2L5n9O4k7o3O9J14O2o0j77J00J7N5j73K88j65m6P2Nj08J04j32
3152f8J18j9l2M0K2M9j58P0pkj1j65K44lJ0q6n9K6L6j05J20j9O8j13J46M6r0j7
3180D1K9j36Q0k3L6J31l24J60q4J52k0R1j66oJ18k71L20p8j70L08q5p3N7n2p2
3205c7k4J52j93J7N9RJ4R2q9o9N8K0J08k57J70N0p0j48K63j13k37K32K17j67j67
3230a10Rk1J56l5K6%J22r6n9o2p2K7K69j23K6L2k5l08J94L6j29K61p5j89J58k4
3256a2L6q1J51j59J38m9J6j1K1P1j28Q0K7k17r7Q1J14n3o0M4j11J31L1k1K4L0
3282dJ89j12n1n2l7N4O9Oj20P5r2J09j90M0l7O2j63L02k4J6K0K1n3N0j55P4j29
3309a32L9J01PJ55j85o4r1K91r3j26P6J27o0k5J1n2J2Q0j71P5N6JJ23r6J4q7J1
$$ y = [58, -6, -100, 49, -43, -8, -67, -3, -30, -93, -24, 90, 152, 92, -85, 15, 32, 87, -86, 202, 37, -9, 63, 68, -40, 64, -68, 50, 31, -1, 39, 61, 110, -48, 22, 15, 13, 2, -163, 81, 78, 88, 2, -57, -31, 5, -100, 20, 1, 69, -44, 102, 148, 58, 41, 70, -66, 14, -9, 27, 158, -166, -6, -90, 62, 42, 133, -33, -39, 79, -192, 128, 50, -120, 188, 103, 30, 87, 35, -37, -61, 91, -102, -85, -26, -17, -3, 89, 0, -69, -11, 9, 117, -140, 30, 80, 10, -138, 125, 12, -225, 7, 224, 57, -110, -101, -122, 34, -1, 25, 25, 147, 51, -8, -70, -142, -115, 154, 31, 57, 89, 64, -244, -50, -14, -143, 118, 43, -146, 12, -12, 24, -57, 94, -65, 73, 24, 40, 29, 50, 121, -7, 73, 100, -117, -214, -133, -19, -72, -132, -88, -199, -68, -37, -58, -34, -4, 185, 73, 22, -30, -67, -13, 56, 62, -58, 17, -75, 34, -156, -116, -153, -91, -254, 48, 24, 40, 60, 81, 28, 78, -77, -3, -132, -93, 8, 15, 170, -15, -79, -170, 121, 28, -98, -22, 105, 45, 20, 31, -21, -9, 71, -100, -25, 31, 32, 155, 59, 73, -14, -3]
3336c%P5m5q6J60j28j32Q8J54j8o8K29j2k30L6m7j3l0O7q8p4J93J2j81K4Q5J68
3363A36k28Q0n9oJ97j06K1k4J94j46Mj05m3P6j55K10j36N9J23j95L04j53n1nJ35
3388A27k35J3J46m5l3n0J14q5K4K00k26Q0J10j99M0rJ03k04J05N0q7k3O4pJ40
3413A13j68J18m2O8Nj29R7k03Q3r1J03N9j19QJ38j00L1J15o7r2J05j31J68Qp9
3438bM2n9J61j92K5L7J37j00r1N2N1O4q8j36R9J1J25k0j04K95k66L2j39Q7q6J02
3464C7K3n3j4J11j15l9J70j31P0j82J69K5j28r0K48M1j07Nj51R4M8J45l07J86
3488E5Q0j38j39J49qr3K08j35p0J04j33J28O5q6nr5J54K1q0K35k10l3j40K29K08
3513B71l93K29j20j65K38j44K0R1Q6j30K9r8j99L35l3J71j41j79J94j58J11P1
$$ y = [-3, -3, 72, 27, -59, 101, -27, -159, -71, 83, 65, -3, 226, 214, -16, 20, -27, -40, -70, -3, -91, -165, 28, 40, -141, -117, -32, 136, -92, -12, -71, -77, 120, 14, 35, 11, 205, 59, 63, -42, -85, -9, -164, 46, -90, -31, 92, -103, 201, 48, -3, -8, 127, -108, -95, 51, 6, -27, -77, 37, -48, -24, 176, -50, 30, 140, -59, -19, -28, 75, -129, -24, 26, -61, -84, -20, -27, 113, -55, 63, 21, 89, 94, -35, 62, -141, -58, -149, -46, 13, -106, -98, 40, -60, -29, 86, 19, -73, 32, -99, 69, 77, -2, 40, -19, 142, -50, -25, 12, 149, 49, -42, 10, 61, 125, 37, -99, 0, 11, 136, 116, 12, 307, 41, 73, -66, 21, -65, 37, 60, 7, -7, 104, -11, -50, 120, -11, 59, -123, 46, 71, -57, -147, 101, 142, 35, 40, -111, -17, 31, 176, -131, 55, 135, -3, -142, 7, -1, -94, 114, -21, -91, 13, -120, 8, 73, -13, -18, -113, 41, 62, -18, 217, 7, -26, -166, 63, 271, -122, 107, -13, -178, 60, -84, -64, 27, 113, -17, 12, -86, -285, 50, 17, 188, 47, -132, 62, -96, 15, 86]
3535H6QLm3n9l0L7K3J4k5p3J59n9Qj35M4J94p1Mj08J07n9k3J00L9j61K1Q0k71
3563a90J18J26M6j87j66J83J84j60m6M6oO3M6j13J3k26L34j12O4J00n2k29J43
3586b1J9P1n2M2l6k43L01j75k6M9p8J73J1P6j29R2q5j01L0k1O3J39k34M7K13J50
3612B75j92n1j31k5l2K08Rj96M1K43k10J71j69J25o0op5J92j96k9J92O4j72J11
3636H7j96P7P1j64K07j13PL2j4R1m3j06P5Q8n4k03J65r8p9J74pM4j17m5R7J69
3662A45k47J05j28J49J33k14J8N7R8j95J3N3j2J66j54L8k25K48r9l1R4q9K12j54
3686a9R5J40k59K88j53LL2p7j2L4k01N0j6R7N4m5J05q7O7j37J9J78j38j07J88
3711I9j92KJ76j38J1K6J8j70K60q2m6K4J00j6j34J45j26K94j86j3J4j60J70O5
$$ y = [86, 94, 97, 54, -5, -35, 2, 25, 39, 14, -59, 100, 41, 49, -86, -42, 152, 81, 85, -23, 84, 25, 2, 102, 141, -20, 1, 81, -190, -72, 54, 100, -87, -253, -70, 114, -46, -92, -46, -52, 11, 57, -56, -43, -269, 65, -47, 17, 117, 65, -164, -21, -2, 69, 17, 59, 23, -220, 81, -94, -120, -71, -149, 24, 35, 111, -18, 74, -11, -112, -82, -103, -40, 99, -135, -88, 125, 275, 83, 32, -99, -124, -156, 52, 61, -135, -94, 149, -61, 110, -59, 66, 6, 0, -75, 117, -79, -108, 84, 148, -24, 87, -109, -32, 39, -125, 82, -31, -24, 8, -6, 85, 42, -64, 11, 99, 45, -158, 7, -91, -170, 4, -3, 41, -76, -121, -24, 145, -102, 3, -125, 24, 157, -57, -39, 18, 116, -79, -66, -13, -25, 141, -13, 25, -200, 48, -51, -82, 12, -77, 135, -19, 76, 216, -43, 245, 92, 95, 127, 50, 38, 72, -129, -79, -95, 2, 56, 11, 116, 29, 96, -41, -22, 156, 18, -89, 99, -93, -91, 85, -53, -42, -16, 2, -168, 92, 10, -36, -12, 88, 72, -62, 83, -43, 251, 65, 52, 66, -94, 76, 141]
3735A41j64k6J1l0J92l04J69P3K2j11j1K95k37j41O8p0P7J19O9r8M1K9k5N3j19
3760B3j3p5J42M8j48O0j06K17k4j04j5j31J08R5k40K59j42QR9k3n3J51k81J80
3784C5Q7j73R4p3j34K30J6j56P3J78j93Q1j83N1R7k79K94m5J74l23J58J48k14
3807e7LN4p6J50r7J08k35K46j64K7K6J72K0j29n8k21L24l0j16J58o4J4q7P1k9
3832A0j20J80o5R2o5m1O0k66J00K76j52RL7o4J35j38J08n1j94J78q5m3pJ29k06
3857a83K85j66J77j8p8J5PJ22m2j68j14K81j42P9M2j33o2K43q2L5j07Q8k33K18
3881F4k6%j06M0O2kj38J72q1K15k59P8L2j44L3P0l6j05K11J8jk97J22M3J33j09
3907a1j7J56j1q3N4J6k88J09L0O6l6N3q0pJ10m6N4k23J65M6R3r0j03J80k6o1n2
$$ y = [141, -23, -49, -38, -68, 124, -180, -11, 62, 84, -27, -38, 257, 20, -121, -53, -123, -46, 73, 142, 44, 85, 114, 89, 142, 23, 10, -65, 77, 125, -23, 37, -69, 148, 124, 20, 5, -126, -18, 77, -163, 96, -46, -38, 61, 38, -15, 136, -145, 35, 122, -51, 43, -30, -164, 66, 82, -74, -1, 177, -16, 65, -118, -67, 30, -249, 45, 0, 174, -149, 9, 157, -57, -54, 0, -76, 74, -23, 85, -150, 96, -68, -41, -15, 157, 177, 48, -10, -231, 93, 63, -53, 105, 41, 55, -32, 39, 10, -110, 70, 5, 97, 32, -9, 51, -215, -115, 161, 9, 18, 55, -9, 126, -12, 96, 45, -149, 29, -56, -99, -106, 23, -183, 102, -64, 113, 95, 17, 32, 39, 161, 119, -49, -163, 118, -24, 55, 97, -36, -98, 145, 63, 98, -9, 79, -154, 64, 38, 38, -68, -28, 34, 32, -106, 66, -15, 200, -59, 19, 51, -93, -60, 10, -26, -131, 80, 98, 97, -200, -78, -35, 98, -11, -28, 128, 117, 34, 88, 104, -184, -75, -45, 21, -15, 38, -42, -49, 61, 15, 69, -154, 11, 57, 150, 60, -43, 137, 111, 50, -2]
3934bJ1K5K0M3j83L9J89p6r4k2p8K5N8R8p8J2J3L5r3L3J60j07p6Q2p9J22Rr9N7
3963D4j06J28l8k6O7j33J53j08l8M8l7Q2j25M2L2L7J16o7j5rO2O3j60j20Q2n9
3989h5J04J48k74J9L0J12R4j74k0J18j07k4kR2j4j63K1J40n4R3q4n0J30n4J00
4014I6oo4j01J13L0j28J10r5L9m7P8o2J0ON8l0j48J01j1j74J33N7J04J95k90K32
4040B06k62K35k96J27K3j10L0j4J04k11J40RJ16k17J39l3M6kR7k05J35j21K1r7
4064a40K14q2J28j02k55K73Ok37L31J4Mk7j53j2m1Q6j64K95l13J81j15R4M9j86
4088a52k3J53o0J75j09o9K7q4J42J48n6j84j03K64l6J13l81L66J9j55r2J97j34
4111c4R7k6r3R3j31N8O7j90J40P8j52K13r2N3j88J08M6m2nr7Q4mq3K02j59J27
$$ y = [-2, 9, 34, 54, 97, -86, -47, 142, 66, -28, -50, -128, -103, -45, 53, -25, -13, 0, 35, -58, -25, 135, 28, -48, 34, -45, 77, 86, -13, 44, -62, 66, 28, 2, 69, -64, 89, -19, -57, -9, -46, 36, -89, -47, -15, 22, 138, 71, 56, 47, 109, 172, 12, -108, -26, -85, 19, 167, -107, -88, -58, 54, 148, -26, -46, 72, -35, -59, -61, 31, 17, -146, -125, 15, -39, 54, -30, -80, 50, -4, 96, 90, 26, -75, 38, 68, -60, 50, -45, -6, -53, 25, -37, -27, -21, 37, 7, -141, -40, -51, -225, -92, -35, 69, 264, -26, 206, -56, 179, -117, 10, 33, -77, -47, -61, 43, -168, -28, -19, 97, -120, 19, -14, 32, 30, 127, -78, 57, -64, -43, -140, 74, -8, 120, 18, -237, 36, 42, -195, 136, 150, 154, 127, -26, -38, -79, 7, -157, 138, -175, 6, -109, -15, 34, -152, -175, -22, -82, 93, -16, -85, -58, -142, 0, 148, 92, -92, -195, 69, 33, 146, -235, 131, 150, -5, -97, 100, -34, 63, 37, -56, 37, -94, -36, 31, -159, -19, 59, -93, 120, 28, 81, -107, 1, 47, 5, 0, -97, -13, -17, -100, 102, -57, 70]
4137G0j19Q2k28K7L41k84J31j72LL8O4J59Nl0q4o2O3J69k25Q4l1m2Lo7N2r1K08
4164F4m3Q1rKq1k0Q1k12K1K7j35L34q2QJ15k07j3J65j25J40j81M5K13l65J65j82
4190a94J98R7o0k8j26Q9J55j63R8r4K2n9L4M9K0L1j68K29j14R9j59l9J1j6O1K7
4216@j01K46j11Nj7J8J10j06j3k01K44n4jn2l7M9p0K12p2j07R3j49J7N4RL2Mr8
4244i6m4N3M7J5k3L0j4J11Q3j63q9J21jj95J54Rmp0J45L1K8j87m0J08J75q6n8
4271D0j3j1qJ73k85Q5n9N4j00k2N4N5j3M10k82p3p5M8O2m7J8M5j42J86j02N3K6
4298G7l3j25Q8rj21J81Q2k21P3m4l2L2K3o6J3R4o4j4JP2q3J39r8J72k65J92N6
4325A20j69j4l5l1J02K8J35j12o8M4M6j70J48J8P5j6m4J09k24K06j15j4j8k13
$$ y = [70, -49, 33, -195, -168, 173, -111, 20, -152, -149, -111, -47, 112, 117, 87, 3, -59, 4, 173, -52, 32, 1, -41, -38, -105, -53, -144, 64, 21, 102, 93, 95, 14, -6, 75, -137, -116, -89, -224, 110, 28, 36, 151, -56, -69, 96, -29, 111, -70, -25, 188, -177, -12, -194, 4, 101, 41, 13, -113, -24, 131, -32, 66, -28, -6, -65, -31, 18, 38, 69, -99, 130, 16, 115, -44, -83, -72, -88, -27, 0, -101, 145, 34, 39, 22, 40, 150, 44, 31, -170, 74, 20, 19, -33, -70, -21, -91, 121, 49, -58, 35, -114, -97, -43, -34, -2, 2, -96, -140, -87, -40, -25, -48, -18, -32, 79, 162, -1, -90, 31, 30, -165, -11, -2, -6, -76, 69, 100, 128, -59, -99, 9, 184, 98, 40, 27, 16, 8, 181, -104, -19, -78, -24, -124, -146, -92, -37, -50, 360, 78, 5, -70, -22, 40, -7, 11, 56, -86, 100, -2, 51, 77, 44, -81, 7, -2, -123, 58, 140, -81, -8, -52, -84, -52, -29, -95, -82, 12, -52, -66, -65, 7, -76, 63, -35, 137, -128, 64, 120, -49, -63, -98, -129, -27, 1, 136, 24, -44, 0, 46, -124, 24, 42, 117, 101, 57, 166, -58, 148, 33, 19, 1, -212]
4349b12K14n3N9k3j25J64J60k10K0j8K19q9j51R4k60L01J38j78o9L6L6o4J46j38
4373cj5j52L00k45R6N0k85L96k53j8J26L9J05j16O4k23J15l2J32l1l1j09J9N8
4397a3Q6j46J54j15M8K24k62oj37R5j08J40J62j43J04J69k95k4L00j65j17O2j74
4420a61J96J66j31M3j38R3j38L4O5n1l0R6k63K57j21J17K0l1k44J14J23J09o0
4443F5Q8j47Q6P4l81K6J63q3J33p8J44k09J73R9j36lN9P5j62Mk4J89j01%k7J11
4469A38k17J23j13J88k05n4m3J41j0nm4J67k09J90j06l1K11m0j82K43r4M2L5L9
4493A64n0m1o2j09K5J44m8j3K4j19J35p9n8J01j50K05q0J11O9l46J05J28j83J56
4517B9O1q9j11J35j73J10k4J53L6pK7j82K7o3N4O4M2J2n4j08R0J34j40k1m2Q4
$$ y = [-212, 2, -51, 8, -15, -140, 24, 184, -26, -6, -24, 195, 106, -45, 49, -211, 90, 228, 50, -19, 17, 53, -11, 135, -3, -18, -170, 130, -115, -19, 31, -254, 142, -111, -129, -3, 36, 141, 25, 89, -134, -19, -51, 81, 50, 19, -90, -71, -13, 73, -73, 81, -34, 14, 238, -24, -30, -167, -72, -180, -40, 122, -21, 83, 252, -43, -67, 233, 68, -49, 13, -161, 35, 201, 70, 113, -25, 68, -70, -36, 29, -22, -52, 44, -219, 38, -83, 34, 54, 23, -221, -107, 16, 125, 65, 153, 6, 92, 166, -215, -189, -26, -109, 24, -54, 90, -119, 54, 153, 17, 14, 73, 148, -14, -10, -34, 155, 54, 54, 27, 138, -79, 44, -69, 119, -86, -140, -183, -42, -52, -57, -101, 66, -143, 47, -59, -90, 121, 81, -101, 142, 48, 90, 125, 164, 114, 73, 11, -98, -73, 71, 23, 10, 34, -85, 50, -29, -87, 14, -136, 69, -11, 100, 169, -177, -72, 56, -127, 29, 90, 1, -110, 25, -148, -38, -62, 91, 127, 120, 147, -35, -8, -71, -17, 47, 89, 101, 47, -61, 29, 163, 23, 2, -40, 44]
4543D4q3Q7kq5l0j0R0J02q6P7L5k07N5K3O2j09j68K23Nj13J82J5j70PN1q6J99
4570A08k24j0O9N0o1K30r2j86k9K20j52J57K1j81R8j90K86q0j22LK24j30j7l1
4594c9j47l1K71q2O0q8L3k7K2k6R3J00q5r2J02k8Lr0O2j50J08R4J24j20n4N9j2
$$ y = [44, -39, 48, 46, -39, -69, -79, 11, 113, 27, 104, 139, -68, -13, 10, 72, -37, -205, 18, 23, -90, 92, 107, -63, -56, -5, -91, 108, -116, -126, -57, -7, -68, 162, 70, -116, -145, 75, -77, 80, 101, -80, 18, -172, 114, 34, -88, -85, 139, 9, -8, -39, -186, -217, 54, -28, 32, -56, -23, -50, -28, -54, 39, 139, 54, -38, 64, 36, 39, -51, 11, -139, -31, 63, 187, 67, 13, 72, 60]
$$ [...]
8191B00
##END NTUPLES=NMR FID
##END=
