##TITLE=1H_Pr Q-26
 CDCl3
 8 sc, 
 26.1.2023
##JCAMPDX= 6.0         $$ Bruker NMR JCAMP-DX V2.0
##DATA TYPE= NMR FID
##DATA CLASS= NTUPLES
##ORIGIN= UXNMR, Bruker Analytische Messtechnik GmbH
##OWNER= root
$$ XWIN-NMR		Version 3.5
$$ Thu Jan 26 14:50:25 2023 Russian Standard Time (UT+4h)  she@DPX200
##.OBSERVE FREQUENCY= 200.13135
##.OBSERVE NUCLEUS= ^1H
##.DELAY= (6, 6)
##.ACQUISITION MODE= SIMULTANEOUS
##.ACQUISITION SCHEME= undefined
##.AVERAGES= 8
##.DIGITISER RES= 18
##SPECTROMETER/DATA SYSTEM= spect
##.PULSE SEQUENCE= zg30
##.SOLVENT NAME= CDCl3
##.SHIFT REFERENCE= (INTERNAL, CDCl3, 0, 15.7039)
##AUDIT TRAIL= $$ (NUMBER, WHEN, WHO, WHERE, WHAT)
$$ ##TITLE= Audit trail, XWIN-NMR		Version 3.5
$$ ##JCAMPDX= 5.01
$$ ##ORIGIN= Bruker BioSpin GmbH
$$ ##OWNER= she
$$ F:/spectra/data/she/nmr/H-F/1/audita.txt
$$ ##AUDIT TRAIL=  $$ (NUMBER, WHEN, WHO, WHERE, WHAT)
(   1,<2023-01-26 14:49:21.65 +0400>,<she>,<DPX200>,
      <created by zg, POWCHK disabled, PULCHK disabled
       configuration hash MD5:
       00 E9 B6 7A A2 85 ED C7 34 08 36 98 17 FE 4E 26
       data hash MD5: 16K
       C0 01 3E 8C 77 E8 D5 1A B7 E5 D3 74 4E 3A DB 49>)
$$ ##END=
$$ 
$$ hash MD5
$$ D9 DE 09 34 0D EB D8 2C B9 D8 DB 5A B6 86 5D BA
##$RELAX= 
##$RELAX= 
##$RELAX= 
##$RELAX= 
##$RELAX= 
##$RELAX= 
$$ Bruker specific parameters
$$ --------------------------
##$DU= <F:/spectra>
##$EXPNO= 1
##$NAME= <H-F>
##$PROCNO= 1
##$TYPE= <nmr>
##$USER= <she>
##$AMP= (0..31)
100 100 100 100 100 100 100 100 100 100 100 100 100 100 100 100 100 100 
100 100 100 100 100 100 100 100 100 100 100 100 100 100 
##$AQSEQ= 0
##$AQ_mod= 1
##$AUNM= <au_zg>
##$AUTOPOS= <>
##$BF1= 200.13
##$BF2= 200.13
##$BF3= 200.13
##$BF4= 200.13
##$BF5= 200.13
##$BF6= 200.13
##$BF7= 200.13
##$BF8= 200.13
##$BYTORDA= 1
##$CFDGTYP= 0
##$CFRGTYP= 5
##$CHEMSTR= <none>
##$CNST= (0..31)
1 1 145 1 1 1 1 1 1 1 1 1 1 1 1 1 1 1 1 1 1 1 1 1 1 1 1 1 1 1 1 1 
##$CPDPRG= <>
##$CPDPRG1= <>
##$CPDPRG2= <>
##$CPDPRG3= <>
##$CPDPRG4= <mlev>
##$CPDPRG5= <mlev>
##$CPDPRG6= <mlev>
##$CPDPRG7= <mlev>
##$CPDPRG8= <mlev>
##$CPDPRGB= <>
##$CPDPRGT= <>
##$D= (0..31)
0 1.2 0 0 0 0 0 0 0 0.06 0 0.03 0 0 0 0 0.0002 0 0 0 0 0 0 0 0 0 0 0 0 
0 0 0 
##$DATE= 1674730161
##$DBL= (0..7)
120 120 120 120 120 120 120 120 
##$DBP= (0..7)
150 150 150 150 150 150 150 150 
##$DBP07= 0
##$DBPNAM0= <>
##$DBPNAM1= <>
##$DBPNAM2= <>
##$DBPNAM3= <>
##$DBPNAM4= <>
##$DBPNAM5= <>
##$DBPNAM6= <>
##$DBPNAM7= <>
##$DBPOAL= (0..7)
0.5 0.5 0.5 0.5 0.5 0.5 0.5 0.5 
##$DBPOFFS= (0..7)
0 0 0 0 0 0 0 0 
##$DE= 6
##$DECBNUC= <off>
##$DECIM= 32
##$DECNUC= <off>
##$DECSTAT= 4
##$DIGMOD= 1
##$DIGTYP= 9
##$DL= (0..7)
0 120 120 120 120 120 120 120 
##$DP= (0..7)
150 150 150 150 150 150 150 150 
##$DP07= 0
##$DPNAME0= <>
##$DPNAME1= <>
##$DPNAME2= <>
##$DPNAME3= <>
##$DPNAME4= <>
##$DPNAME5= <>
##$DPNAME6= <>
##$DPNAME7= <>
##$DPOAL= (0..7)
0.5 0.5 0.5 0.5 0.5 0.5 0.5 0.5 
##$DPOFFS= (0..7)
0 0 0 0 0 0 0 0 
##$DQDMODE= 0
##$DR= 18
##$DS= 0
##$DSLIST= <SSSSSSSSSSSSSSS>
$$ [...]
##$SUBNAM2= <"">
##$SUBNAM3= <"">
##$SUBNAM4= <"">
##$SUBNAM5= <"">
##$SUBNAM6= <"">
##$SUBNAM7= <"">
##$SUBNAM8= <"">
##$SUBNAM9= <"">
##$SW= 18.05172834244
##$SWIBOX= (0..15)
0 0 2 0 0 0 0 0 0 0 0 0 0 0 0 0 
##$SW_h= 3612.71676300578
##$TD= 16384
##$TD0= 1
##$TE= 0
##$TE2= 300
##$TE3= 300
##$TEG= 300
##$TL= (0..7)
0 120 120 120 120 120 120 120 
##$TP= (0..7)
150 150 150 150 150 150 150 150 
##$TP07= 0
##$TPNAME0= <>
##$TPNAME1= <>
##$TPNAME2= <>
##$TPNAME3= <>
##$TPNAME4= <>
##$TPNAME5= <>
##$TPNAME6= <>
##$TPNAME7= <>
##$TPOAL= (0..7)
0.5 0.5 0.5 0.5 0.5 0.5 0.5 0.5 
##$TPOFFS= (0..7)
0 0 0 0 0 0 0 0 
##$TUNHIN= 0
##$TUNHOUT= 0
##$TUNXOUT= 0
##$USERA1= <user>
##$USERA2= <user>
##$USERA3= <user>
##$USERA4= <user>
##$USERA5= <user>
##$V9= 5
##$VALIST= <valist>
##$VCLIST= <CCCCCCCCCCCCCCC>
##$VD= 0
##$VDLIST= <DDDDDDDDDDDDDDD>
##$VPLIST= <PPPPPPPPPPPPPPP>
##$VTLIST= <TTTTTTTTTTTTTTT>
##$WBST= 1024
##$WBSW= 4
##$XGAIN= (0..3)
0 0 0 0 
##$XL= 0
##$YL= 0
##$YMAX_a= 112296
##$YMIN_a= -163292
##$ZGOPTNS= <>
##$ZL1= 120
##$ZL2= 120
##$ZL3= 120
##$ZL4= 120
##$ABSF1= 10
##$ABSF2= 0
##$ABSG= 5
##$ABSL= 3
##$ALPHA= 0
##$AQORDER= 0
##$ASSFAC= 0
##$ASSFACI= 0
##$ASSFACX= 0
##$ASSWID= 0
##$AUNMP= <proc_1d>
##$AZFE= 0.1
##$AZFW= 0.1
##$BCFW= 1
##$BC_mod= 2
##$BYTORDP= 1
##$COROFFS= 0
##$CY= 11.3945322036743
##$DATMOD= 1
##$DC= 2
##$DFILT= <>
##$DTYPP= 0
##$F1P= 2.36226072786647
##$F2P= -0.459571619588291
##$FCOR= 0.5
##$FTSIZE= 0
##$FT_mod= 4
##$GAMMA= 1
##$GB= 0.15
##$INTBC= 1
##$INTSCL= 1
##$ISEN= 128
##$LB= 0.24
##$LEV0= 0
##$LPBIN= 0
##$MAXI= 10000
##$MC2= 0
##$MEAN= 0
##$ME_mod= 0
##$MI= 1.114404
##$NCOEF= 0
##$NC_proc= 0
##$NLEV= 6
##$NOISF1= 3.799351
##$NOISF2= 2.8
##$NSP= 1
##$NTH_PI= 0
##$NZP= 0
##$OFFSET= 15.70392
##$PC= 1
##$PHC0= -19114.25
##$PHC1= 14.80079
##$PH_mod= 1
##$PKNL= yes
##$PPARMOD= 0
##$PSCAL= 0
##$PSIGN= 0
##$REVERSE= no
##$SF= 200.130013532006
##$SI= 16384
##$SIGF1= 3
##$SIGF2= 2
##$SINO= 400
##$SIOLD= 16384
##$SREGLST= <1H.CDCl3>
##$SSB= 0
##$STSI= 0
##$STSR= 0
##$SW_p= 3612.71676300578
##$SYMM= 0
##$S_DEV= 0
##$TDeff= 0
##$TDoff= 0
##$TI= <>
##$TILT= no
##$TM1= 0
##$TM2= 0
##$TOPLEV= 0
##$USERP1= <user>
##$USERP2= <user>
##$USERP3= <user>
##$USERP4= <user>
##$USERP5= <user>
##$WDW= 1
##$XDIM= 8192
##$YMAX_p= 0
##$YMIN_p= 0
$$ End of Bruker specific parameters
$$ ---------------------------------
##NTUPLES= NMR FID
##VAR_NAME=  TIME,          FID/REAL,        FID/IMAG
##SYMBOL=    X,             R,               I
##VAR_TYPE=  INDEPENDENT,   DEPENDENT,       DEPENDENT
##VAR_FORM=  AFFN,          ASDF,            ASDF
##VAR_DIM=   8192,          8192,            8192
##UNITS=     SECONDS,       ARBITRARY UNITS, ARBITRARY UNITS
##FACTOR=    0.0002768,     1,               1
##FIRST=     0,             0,               0
##LAST=      2.2672688,     0,               0
##MIN=       0,             -163292,         0
##MAX=       2.2672688,     112296,          0
$$ Real data points
##PAGE= N=1
##DATA TABLE= (X++(R..R)), XYDATA
$$ [...]
1837E1Q4m59L44j0O9J1m23O94o5m56Q59n59j89N27n74K59J06m14L49m68J13M84
$$ 51 135 -324 20 10 79 90 -333 361 296 -160 699 140 -49 478 -96 163 269 -145 204 -264 -151 333
1859C33p71O61l17l75N62j28k92O53l07p8O2j15N15n73j96P61n72J87M38n46L59
$$ 333 -438 223 -94 -469 93 -35 -327 326 19 -59 3 -112 403 -170 -366 395 -177 10 448 -98 261
1880B61J86l53K29k94l1Q9l63K33k9k92N11p6m52N25k17O8K51o55L30j06q9M54
$$ 261 447 94 323 29 -2 87 -276 -43 -72 -364 147 71 -381 144 -73 -5 246 -409 -79 -185 -274 180
1902A80o30M20J49n30P94j23n04N33l1k16L89l48M60n59j29K61m93L66M69r35
$$ 180 -450 -30 119 -411 383 260 -244 289 258 42 431 83 543 -16 -145 116 -377 -11 458 -477
1922d77L84L18n93K34J79j89K82n02N71n2l50L78k65q2N18l54j15M20k26J99R4
$$ -477 -93 225 -368 -134 45 -144 138 -364 207 155 -195 183 -82 -164 354 0 -115 305 79 278 372
1943C72Q6n7m52M51r1o72Q48l59m73N47m40L41J7l73K95j90J53j47k96J96O26
$$ 372 458 401 -51 400 309 -363 485 126 -347 200 -240 101 118 -255 40 -150 3 -144 -440 -244 382
1964C82m31J60J12k51J68k11J43J21m24M07J25k26Q6K13m11M52m90O0L33n47L32
$$ 382 -49 111 223 -28 140 -71 72 193 -231 176 301 75 161 374 -37 415 -75 -15 318 -229 103
1985A03j21j75M25p00K5P71p70M03j30l31O36k18k77M89l99L15K7R9M52p56l02
$$ 103 -18 -193 232 -468 -443 328 -442 -39 -169 -500 136 -82 -359 130 -269 46 73 172 624 -132 -434
2006d34Q02k52k88N83l28K6j21j79K99j40O3r7m05Q31n74r3M00l0m21L72l93K19
$$ -434 368 116 -172 411 83 109 -12 -191 108 -32 31 -66 -471 360 -214 -307 93 63 -358 14 -379 -160
2028a60r7j09K53k76K98N27q90M89L95n67P21l27k59L20m57M26l00m25P00l89
$$ -160 -257 -366 -113 -389 -91 436 -454 35 430 -137 584 257 -2 318 -139 287 -13 -438 262 -127
2048a27K2L61n56M31j05j20R9j36l2L12n74M90R9n83N08j82j63N64k24j71M01
$$ -127 -105 256 -300 131 26 -94 5 -131 -163 149 -425 65 164 -419 89 -93 -256 308 84 -87 314
2069C14l52K38J43k19J61k34M1j69j48K66J19l87J00J60k43J04m41O12j20l05
$$ 314 -38 200 343 124 285 51 92 -77 -225 41 160 -227 -127 33 -210 -106 -547 65 -55 -360
2089c60O15o15r1L35m31O53J41k58M3k5L59l7m80L45J81o70M82p2l11M96n06J81
$$ -360 255 -360 -451 -116 -547 106 247 -11 32 7 366 329 -151 194 375 -295 187 115 -196 300 -206 -25
2111b5L10l82P3l7j48K94m88L34K77m94J35J40j69L37k49j50K85k85J12L81m69
$$ -25 285 -97 -24 -61 -209 85 -403 -69 208 -286 -151 -11 -180 157 -92 -242 43 -242 -130 251 -218
2132b18O24l65j85N00m00J6L73l15p8J02j52L00o14L94K5k44K21L1l80K69j60
$$ -218 406 41 -144 356 -44 -28 345 30 -48 54 -98 202 -412 -18 7 -237 -16 15 -365 -96 -256
2153b56j9M76k06k3k6j31L24l79J5O25n55J24J78l12O5M4j05N68l69k8J6j42K87
$$ -256 -275 201 -5 -28 -54 -185 139 -240 -225 400 -155 -31 147 -165 -100 -56 -161 407 38 10 26 -116 171
2176A71k38m22R89o06l24N79m10K77q2j11L24l70J62m7j42K74l3l65O80m06R6
$$ 171 -67 -489 500 -106 -430 149 -261 16 -66 -177 147 -223 -61 -108 -250 24 -9 -374 306 -100 -4
2197dM70m23R0K5m26O61k30l73L58L9q9j19L5l7R1m66L61Q0M3j07k38N24k86l87
$$ -4 466 43 133 158 -268 393 163 -210 148 187 98 -21 14 -23 68 -398 -37 43 86 -21 -259 265 -21 -408
2221d08O72l43n7K17m37M25J3l0J23j16K0L75n43M76n7n36M14nk30R0j80j64N29
$$ -408 264 -79 -136 81 -356 69 82 52 175 59 79 454 -89 387 330 -206 208 203 -27 63 -117 -281 248
2244B48n32L45n1j53L87n24L03J25j87P5M2k05J98o4j37L21l42N73m8m96M13n34
$$ 248 -284 61 10 -143 244 -280 23 148 -39 36 78 -127 71 7 -130 191 -151 422 374 -122 291 -243
2266b43M50K4o15N57j94K00l6m85J34L15l25M83m7m62M09j06l30J21j67N0N9J78
$$ -243 207 231 -384 173 -21 179 143 -342 -208 107 -218 265 218 -244 165 59 -271 -150 -317 -267 -208 -30
2288c0N99o95J9N21n67K58R3j96m5K96k66R9L1k24O4k60J93K12j63L99l52k21
$$ -30 569 -126 -107 414 -153 105 198 2 -43 253 -13 86 117 -107 -43 -303 -110 102 -61 338 -14 -235
2310b35N53m41M9J78l80M98m39K03K03n44J94O12m56L12k27j61J26l16K90L93
$$ -235 318 -123 -74 104 -276 222 -217 -14 189 -355 -161 451 -5 307 80 -81 45 -271 19 412
2330D12m43K08k83J47L02k97j55O00o65J35J29l82J52J43N5Qk32Q4j11j21L84
$$ 412 -31 177 -106 41 343 46 -109 491 -174 -39 90 -292 -140 3 58 66 -166 -82 -193 -314 70
2351G0k79O7J20J3Q7J80m08O41o42K36K31k86K77k57k25K99j04m9K27j92K5J11
$$ 70 -209 -142 -22 -9 78 258 -150 491 -151 85 316 30 307 50 -175 124 20 -29 198 6 31 142
2373A42j47l01M23l10L69l08l13P00n67M51p3j53J66l5k30J14N7K06j15m02Q47
$$ 142 -5 -306 117 -193 176 -132 -445 255 -312 139 66 -87 79 44 -186 -72 -15 191 76 -326 521
2394E21o61j4K95K6r5Q2k50K05k98J13K94n45K69L36m54K88j52M7n6j08L2N9p2
$$ 521 -140 -154 141 167 72 154 -96 109 -189 -76 218 -327 -58 278 -176 112 -40 7 -49 -157 -125 -66 -138
2417a38J26L50n02Q7j72K30J90l72J66OK11k28J09J07k16k88L36J47k78K44J08
$$ -138 -12 338 -164 -77 -249 -19 171 -201 -35 -29 182 -46 63 170 -46 -334 2 149 -129 115 223
2438B23k53L86m01j26K97k75K0J17j67K20k41N20l22o8j42M60K2j76J8qJ02l80
$$ 223 -30 356 -45 -171 126 -149 -129 -12 -179 41 -200 320 -2 -70 -212 248 270 94 112 104 206 -174
2460a74Q2M84o01N55j72j45K87j85j83K58k14lm3j19N1j82M49n2l98K58k4O9M68
$$ -174 -92 392 -209 346 174 29 316 131 -52 206 -8 -11 -54 -173 -122 -304 145 93 -305 -47 -71 -2 466
2483D66o34J80J81m84O59k60m84L95l12L12M9k34K88p1p9J43Q0l43QJ8J91j79
$$ 466 -168 12 193 -291 368 108 -376 19 -293 19 68 -166 122 51 -28 115 195 -148 -140 -122 69 -110
2505a10k61L65m2j78K40R5n06P32k03j02k33k4M19k39J40K62m47O6K70l43K63
$$ -110 -371 -6 -48 -226 14 109 -397 335 132 30 -203 -227 192 -47 93 355 -92 -26 244 -99 164
2526A64k67q6P8MJ08N0l00L77r5r9K66m44O9K82l32K36p8K6K6R6n0j42o8L76m61
$$ 164 -103 -189 -111 -107 1 51 -249 128 33 -66 200 -244 -175 107 -225 11 -67 -41 -15 81 31 -111 -179 197 -264
2551b64K13M56l60k2L11l90J19q0J12Pj80K76j0m33J96K76o34P11k60j05K03k71
$$ -264 -51 405 45 23 334 -56 63 -17 95 102 -78 198 188 -245 -49 227 -407 304 44 -61 142 -129
2573a29P3k56J93K05j37m5K82q4n2N2j40K58J71l08J12m10K85J51l51J14j90J26
$$ -129 -56 -312 -119 86 -51 -96 186 102 50 102 -38 220 391 83 195 -215 70 221 -130 -16 -206 -80
2595h0L16j44k24K05o2l22J45P9O2j17M17k95j29P8J99m23L87l9nN3k55K25p9
$$ -80 236 92 -132 73 11 -311 -166 -87 -25 -142 275 -20 -149 -71 128 -295 92 53 48 101 -154 71 -8
2618hj23K83j93J10K8o6j21K00k36J5n7j05K96l87M09P2k43K15k57M3M3J23j36
$$ -8 -131 152 -41 69 97 31 -90 110 -126 -111 -168 -273 23 -364 45 117 -126 89 -168 -125 -82 41 -95
2641i5L14m68J92K94j66Q4k98j5M53m75N4M56m20j15M43m51M01P0j50k05O0J70
$$ -95 219 -249 -57 237 71 155 -143 -158 295 -180 -126 330 -90 -205 238 -213 188 258 108 -97 -37 133
2663A33n2l89O44n26J10j4j29J75j66l2K73j23K04P1m80M58l57K77K43k34j78
$$ 133 81 -308 336 -190 -80 -94 -223 -48 -214 -246 27 -96 108 179 -301 157 -200 77 320 86 -92
2684i2P2j30K60n4J14J17j49o5K71l43M7K53n92J28R4J06j96j33L58l58L43K12
$$ -92 -20 -150 110 56 170 287 138 73 344 1 48 301 -291 -163 -69 37 -159 -292 66 -292 51 263
2706B63l56N1J45j39mN9J19j37Q6j58L50j59j91K08k4P5k13k34L05p6j77K61k07
$$ 263 -93 -42 103 -36 -40 19 138 1 87 -71 279 120 -71 137 113 188 -25 -259 46 -30 -207 54 -153
2729a53Q0L3j06L54k53j87M13l67J17O5O4n9j63n4J84K56r2j40K2J98j25o3j14
$$ -153 -73 -40 -146 208 -45 -232 181 -186 -69 -4 60 1 -162 -216 -32 224 132 -8 14 212 87 24 -90
2752i0R2J51l8p8PL99l99q0k07Q5K83p1k5j0J1j06J12j99K80O9m31K62l3J79m9
$$ -90 2 153 115 37 44 443 44 -36 -243 -158 125 54 29 19 30 -76 36 -163 117 186 -245 17 -16 163 114
2777A14p6K71j46j78K24j78M3O6k31L52l72l4R8p4qK03l10Q6q4j5K23l84L65j7
$$ 114 38 309 163 -15 209 31 74 140 -91 261 -111 -145 -47 -121 -129 74 -236 -150 -234 -249 -26 -410 -45 -62
2801f2k17K80k17K24J19m22K55K82j56N7j09PK21j95k62M55p2p8J49m53L89j73
$$ -62 -279 1 -216 8 127 -295 -40 242 86 143 34 41 262 67 -195 260 188 110 259 -194 195 22
2823B2kj8J22j39l0k54L55k89J27K6N6J07j17j82J86n1P7O3p2j9J66l08L78Pk
$$ 22 20 2 124 -15 -45 -299 56 -233 -106 -80 -24 83 -34 -216 -30 -81 -4 59 -13 -32 134 -174 204 211 209
2848B09j93m47M46Q0l68K08o3O4K26l82qM31k91K10k10j28L24j05JL0o3J22J05
$$ 209 16 -431 15 95 -273 -65 -128 -64 162 -220 -228 203 -88 122 -88 -216 108 3 4 34 -29 93 198
2871A98k43O5j07q7L27j9j7m2m1L41k77l37K90m7k15K51j99L34l15J42P1k98J52
$$ 198 -45 20 -87 -174 153 134 117 75 34 375 98 -239 51 4 -211 40 -159 175 -140 2 73 -225 -73
2894g3J60m45J47L12l01R4r4j01M81m76K23N1k9L01l89K36Pr9k69L33j61K48O1
$$ -73 87 -358 -211 101 -200 -106 -200 -301 180 -296 -73 -22 -51 250 -139 97 104 5 -264 69 -92 156 217
2917B17l36K28p4J78k92j37J33P9%j31J27m9K00l53K84j43k17L94k8m84P50n44
$$ 217 -119 109 35 213 -79 -216 -83 -4 -4 -135 -8 -57 143 -210 74 -69 -286 108 80 -404 346 -198
2939a98M07j94Mj52R7K32j75l95L29J53N0J25j84k15R1m7j20K76l40J16J18p8
$$ -198 209 15 19 -133 -36 196 21 -374 -45 108 158 283 99 -116 -25 -72 -192 84 -256 -140 -22 -100
2961a00K74k99J47m8l04L21J47l31K94n3m6J96k04J63j64JJ79j34k28J67J21j0
$$ -100 174 -125 22 -26 -330 -9 138 -193 101 48 2 198 -6 157 -7 -6 173 39 -189 -22 99 89
2983H9n0k65J06M0J49k67K95j59J68k74R3J15r2kk34K33J62j06O2k32K94j42k02
$$ 89 39 -226 -120 -80 69 -198 97 -62 106 -168 -75 40 -52 -54 -288 -55 107 1 63 -169 125 -17 -219
3006b19M73j45k43N11l82j65K78j48m0Q1k54K26m7Q8lK4n3J20j4j41L2L4p4J05
$$ -219 254 109 -134 377 -5 -170 108 -40 -80 1 -253 -27 -74 14 11 35 -18 102 88 -53 -21 13 -61 44
3030D4k68J35K0j02K35j13P0Mk85K23l4j11J99k4K7J3J53l68M7J48K9l19L8K36
$$ 44 -224 -89 -69 -171 64 -49 21 25 -260 -37 -71 -182 17 -7 20 33 186 -182 -135 13 42 -277 -239 -3
3054cJJ29k01pJ01j41M94m70j31M34j64k10N18k34k9L5j31p6K08j29J95k24L78
$$ -3 -2 127 -74 -81 20 -121 373 -97 -228 206 42 -168 350 116 87 122 -9 -85 123 -6 189 -35 343
3077C43m04J03J9l6l6k2j14J67j02J56J23k04J20l04j8R7K30l63L08j17O7jL73
$$ 343 -61 42 61 25 -11 -33 -147 20 -82 74 197 -7 113 -191 -209 -112 118 -245 63 -54 13 12 385
3100C85m51K2p7r1M10j23N7L1k02K31k47Q2j19r2K2r9L78r8p1l1k41L68L5N7j23
$$ 385 -66 -44 -121 -212 198 75 132 163 -39 192 -55 27 -92 -184 -162 -261 117 19 -52 -83 -324 44 79 136 13
3125A3O2k94j4M95l19M1p8K49M8m49L49j79K3K32k9k85R3Q2k58L27k95K84J50
$$ 13 75 -219 -233 262 -57 -16 -94 155 203 -246 103 -76 -53 179 150 -135 -42 40 -218 109 -186 98 248
3148B48l86J93M2j87K74k52j91M10l62J83J03m46L22j07K79J28m46L11Q1k83j22
$$ 248 -138 55 97 -90 184 -68 -259 151 -211 -28 75 -371 -49 -156 123 251 -195 116 197 -86 -208
3169b08J39k13J74K36K14n65K21n7K3K02M2k48j8J44j60J59k55QL6j70J51M55
$$ -208 -69 -282 -108 128 342 -223 -2 -59 -36 166 208 -40 -58 86 -74 85 -170 -162 -126 -296 -145 310
3191C10o12K62j73n7M77k42j7L74k01J6J15n4p9o3j34K08k72K97o7M8Pk25J67
$$ 310 -302 -40 -213 -270 207 -35 -52 322 121 137 252 198 119 56 -78 130 -142 155 88 136 143 -82 85
3214H5J29j85o0Q8r8J56k08l56N03j42P1J46k44K08j10j39J77nj8K92k82L6J50
$$ 85 214 29 -31 57 -41 115 -93 -449 54 -88 -17 129 -115 93 -17 -156 21 16 -2 290 8 44 194
3237A94j26j24K34j71R8l08q5M15k54J0J35j46L31k82j14K18j84M88l93k86N83
$$ 194 68 -56 178 7 105 -203 -288 127 -127 -117 18 -128 203 -79 -193 25 -159 329 -64 -350 233
3258B33o2n2j32nP8j08J45P0p6L0l6j92K53j49k09K59N0O6k76J74j20L6k38J83
$$ 233 171 119 -13 -18 60 -48 97 167 91 121 85 -107 146 -3 -212 47 97 163 -113 61 -59 -23 -261 -78
3282g8J93l10K76k76J28J30o9N8O2q7J65k00k07J13K84M4k08k7Q6k53P9J51j69
$$ -78 115 -195 81 -195 -67 63 -6 52 114 27 192 -8 -215 -102 182 226 18 -9 77 -176 -97 54 -115
3305a15l6LJ32m1k43L08J39l72Q3M1j21K85q3r4M3j75K64o8R8K27k54j88K80j55
$$ -115 -151 -148 -16 -57 -300 8 147 -225 -142 -101 -222 63 -20 -114 -71 -246 18 -50 48 275 21 -167 113 -42
3329d2j47L95k62j08M3K18m3j16k2j3J46l57N46l50p2J48m6J13P4l61Q6k9J05
$$ -42 -189 206 -56 -164 -121 97 54 -62 -84 -97 49 -308 238 -112 -184 -36 -82 31 105 -256 -170 -199 -94
3352i4n6J43JJ88k6j93j72N72m84J81l3J19n9k9l35P50n26rJ69j37N9R5k33K01
$$ -94 -150 -7 -6 182 156 -37 -209 363 -121 60 27 146 87 58 -277 473 -53 -62 107 -30 29 124 -109 92
3376I2m2j78oP2J18l3r1m1K37Mj61J73K9K1l23K77k10J95j26p2K93j91k52m3N04
$$ 92 50 -128 -134 -62 56 23 -68 -109 128 132 -29 144 173 194 -129 148 -62 133 7 -65 228 37 -215 -258 246
3401B46n77L77J1r3N0j75K23j27k15L20j07j9j4j87K13j07L28l13J25K23O7l75
$$ 246 -331 46 57 -36 14 -161 62 -65 -280 40 -67 -86 -100 -287 -74 -181 147 -166 -41 182 249 -126
3423a26K73j61j9K7j4k92J78J79j6j27j3N8J58k31M11m45J57K32m14Q4o8L05K1
$$ -126 147 -14 -33 -6 -20 -312 -134 45 29 -98 -111 -53 105 -126 285 -160 -3 229 -185 -101 -169 136 157
3446A57k56J32N0m87N15K2k16J94o1q8k00L25k47J54o3J13J5j91K54jJ40l82o
$$ 157 -99 33 83 -404 111 133 -83 111 50 -38 -238 87 -160 -6 -69 44 59 -132 122 121 261 -121 -127
3469a27L28K4k88K57k14k82J80K10J33j81l53N43j77J16j78j74L70k26K6K8J47
$$ -127 201 225 -63 194 -20 -302 -122 88 221 40 -313 230 53 169 -9 -183 187 -39 -13 15 162
3490A62l17K10q3J0l8mL79n7j44r6k8K4L8j2Q5j49l0J89j98Lk7l39M81J43m9J68
$$ 162 -155 55 -28 -18 -56 -60 319 262 118 22 -6 18 56 44 129 -20 -50 139 -59 -56 -83 -422 59 202 153 321
3516C21q3j98P1P9m69J84Q0K37n15n9K10O6kJK7J04k01J10p7k77K56J95k62R9
$$ 321 238 40 111 190 -279 -95 -15 222 -293 -352 -142 -76 -78 -77 -50 54 -147 -37 -114 -391 -135 60 -202 -103
3540a03J69R8l46J03LL08k05p3J13K5k37J08K58j69L8j30J18l72K61K48k51l6
$$ -103 66 164 -182 -79 -76 232 27 -46 67 92 -145 -37 221 52 90 -40 78 -294 -33 215 -36 -72
3562g2n8Q6J71j91J59M1k34L89p22L54O1k52K39PkK73k94M3J98j07j90kl6l5L52
$$ -72 -130 -44 127 -64 95 136 -98 291 -431 -77 -16 -268 -29 -22 -24 249 -45 -2 196 89 -101 -103 -139 -174 178
3587A78j52N0j46J8J40k9mj50k07L20k50J86k0j37O6J17J2J91m12Nk3P4K83p1
$$ 178 26 76 -70 -52 88 59 55 -95 -302 18 -232 -46 -66 -203 -137 -20 -8 183 -229 -224 -247 -173 110 39
3611C9j92J33k09K1L25j46K4j08j48L73k10L01Lj95j05M21o01J02K26j67K51k85
$$ 39 -153 -20 -229 -208 117 -29 -5 -113 -261 112 -98 203 206 11 -94 327 -274 -172 54 -113 138 -147
3633a47jr5K90k3j24O5J01j26J9M4Ko4P0MJ05l42L02k6rJ15o2k49J99p9M5J82
$$ -147 -148 -243 47 24 -100 -35 66 -60 -41 3 5 -59 11 15 120 -222 80 54 45 160 98 -151 48 -31 14 196
3659A96j35N5O2k60L2pj42J59K12m40L08p6J48j38k37L89lQ2o3m30L61K75k93
$$ 196 61 116 178 -82 -50 -57 -199 -40 172 -268 40 -36 112 -26 -263 126 123 205 142 -288 73 348 55
3682E5Pm8kK61l63j6K98k22r9J69j6J50l29K49k55M21m43K34j65J89k08P1LL2
$$ 55 62 14 12 273 -90 -106 192 -30 -129 40 24 174 -155 94 -161 260 -183 51 -114 75 -133 -62 -59 -27
3706b7M1k07O2m7K28q8R7J2k18N3K43k90oK13j9J35r2R7l94J53J05J03j51j50
$$ -27 14 -193 -131 -178 50 -38 59 71 -147 -94 149 -141 -147 66 47 182 90 187 -207 -54 51 154 3 -147
3730a47P5J07J05l93J50M5J61k08LK09o4k6k1l2J32k69j26K73K90k10j61k7K58
$$ -147 -72 35 140 -253 -103 -58 103 -105 -102 107 43 17 -4 -36 96 -173 -299 -26 264 54 -107 -134 124
3753A24k24M6J73j61J16j38lN4J2J50M1k83J01J62k8j11l16j1K87J33K06l55L3
$$ 124 -100 -54 119 -42 74 -64 -67 -13 -1 149 190 -93 8 170 142 31 -285 -296 -9 124 330 -25 8
3776Hk8l4j62K32K13k74o1J35J33j86k9J85k83O7q8K51qm55L76%L2r1J07j72L97
$$ 8 -20 -54 -216 16 229 -45 -106 29 162 -24 -53 132 -151 -84 -172 79 71 -384 -8 -8 24 -67 40 -132 265
3801B65l68n0J49j07k2M37l74qP7j8l8L17m63J94j66J49K29l9q1j59M43j52j42
$$ 265 -103 -153 -4 -111 -133 304 -70 -78 -1 -19 -57 260 -203 -9 -175 -26 203 164 83 -76 367 215 73
3824G3p0j31MM37k95k3O3N6k67K95O5J17l96J84R2j07n3J15j25k5K24m77JM73
$$ 73 3 -128 -124 313 18 -5 58 114 -153 142 207 324 -72 112 204 97 44 159 34 9 233 -244 -243 230
3848B30j86j28JK29J60m34J41J33m08J49j12K75M2l89L95k34k1N33j53k85jNO6
$$ 230 44 -84 -83 146 306 -128 13 146 -262 -113 -225 50 92 -297 98 -136 -157 376 223 -62 -63 -58 8
3871Hm6j29M55k29p7K5j26K71k08K5Q4R5j59Q9nj10k23Q9L28j90j2J28m2k53L84
$$ 8 -38 -167 288 59 -18 7 -119 152 -56 -31 53 148 -11 78 73 -37 -260 -171 157 -33 -45 83 41 -212 172
3896A72J04l31R0j7J66m17K83l29M74j40P8J00l9m2K6l49K86j41L66k44j14nr2
$$ 172 276 -55 35 18 184 -233 50 -279 195 55 133 233 194 152 178 -171 115 -26 340 96 -18 -23 -115
3919a15J8k4j57J79L5N7J42P5j26k36k0k1L27j06n6j33J75k74L15K33l70J10M5
$$ -115 -97 -121 -278 -99 -64 -7 135 210 84 -152 -172 -193 134 28 -28 -161 14 -260 55 288 -82 28 73
3942G3o1K00k54K39K8l24p8L04M4l22J10j21M07k36Q0k09P1J78j40J32j05k21
$$ 73 12 212 -42 197 225 -99 -177 127 171 -151 -41 -162 245 9 89 -120 -49 129 -11 121 16 -205
3964b05K55l53r3O32k44L3qJ08k41j39M09j42o3J59m4J5j45K09j64K09k51j86
$$ -205 50 -303 -396 236 -8 25 17 125 -116 -255 154 12 -51 108 64 79 -66 143 -21 188 -63 -249
3986b49M06k25pQ4j08j63L41R3J1k13J51R7o66N48j69J02J2l8n4K38k97P5m4N7
$$ -249 157 -68 -75 9 -99 -262 79 172 183 -30 121 218 -448 100 -69 33 45 7 -47 191 -106 -31 -75 -18
4010a8K12l39K10j98J84j93J16r2J39p3K8K41n36M04j10k07K27q9J10K0J04l5
$$ -18 194 -145 65 -133 51 -142 -26 -118 21 -52 -24 217 -319 85 -25 -232 -5 -94 16 36 140 105
4032A05k99K08LJ88OM4k95K52k38J45J76k75k3L67k89k25K69j4K9k57j23N33l27
$$ 105 -194 14 17 205 211 255 -40 212 -26 119 295 20 -3 364 75 -150 119 105 134 -123 -246 287 -40
4055d0j29J91o7J36M4l34r9M58j09j01N7q8J17j14P1j5j14L23ml38K49j99L30
$$ -40 -169 22 -45 91 135 -199 -298 160 51 -50 7 -81 36 -78 -7 -22 -136 187 183 -155 94 -105 225
4078B25l30N8P7j79J06K21k21j83J83J09L6r9J9K24l12K23j30o1K40l19M68l43
$$ 225 -105 -47 30 -149 -43 178 -43 -226 -43 66 102 3 22 246 -66 157 27 -34 206 -113 355 12
4100A2k6L9j41OK33q2k7k9j21J12K32k58J36k25n2O0J6M06q2Q6l14P2N1R8mj01
$$ 12 -14 25 -116 -110 123 41 14 -15 -136 -24 208 -50 86 -139 -191 -131 -115 291 209 295 -19 53 104 202 198 97
4126I7K2j20Q3M2k62M08n43K70Q5n9l4qJ52R6j61j94K99k76J48N0J00k47J56l36
$$ 97 119 -1 82 124 -138 270 -273 -3 82 23 -11 -19 133 229 68 -126 173 -103 45 95 195 -52 104 -232
4150b32M40l12j40K57k36K16Om27M32L06k88J43n3J20j67j18J93k21L63j30o6
$$ -232 208 -104 -244 13 -223 -7 -1 -428 4 310 22 165 112 232 65 -53 140 -81 282 152 86
4171H6j51N4K45l03K1m4K85L8l84J60P2J70j79j30J30k32Om2J26K25j34k2j40
$$ 86 -65 -11 234 -69 -48 -92 193 231 -153 7 79 249 70 -60 70 -162 -156 -198 -72 153 19 -3 -143
4194a43K6j23L03j61L03l19j96O19o97M14J81l11L47j28k07J63p0K3j21l6J94
$$ -143 -117 -240 63 -98 205 -114 -310 309 -388 26 207 -104 243 115 -92 71 1 24 -97 -133 61
4215F1j84L19p6J2j46p3r5M50l45O2J1J91j94K38l23O9K64m40J44K23j5l02J54
$$ 61 -123 196 120 132 -14 -87 -182 268 -77 -15 -4 187 -7 231 -92 -23 241 -199 -55 168 153 -149 5
4238Ej12j3J04K33M6k10Ok63O0J06k46J79j18J32M3J17q8j23J82l3J09j41o6L29
$$ 5 -107 -120 -16 217 263 53 59 -204 -144 -38 -284 -105 -223 -91 -48 69 -19 -142 40 7 116 -25 -91 238
4262B38j43j84R7K41k98N5j77K51r0K15nk62J32n2O3m9mK0r4J3Q7l9n0J53k64
$$ 238 95 -89 8 249 -49 6 -171 80 -10 205 200 -62 70 18 81 32 28 48 -46 -33 54 15 -35 118 -146
4287a46J90O2j48P5j80J66N3r3J2j60L20k04k58L28j77J48K8J63k02J28n3l3P7
$$ -146 44 106 -42 33 -147 19 72 -21 -9 -169 151 -53 -311 17 -160 -12 16 179 -23 105 52 19 96
4310I6J3K20j96k54J8J31L6q5k07m6K6K08J12k55J06J85q3J31k7j28M7m13L95
$$ 96 109 329 133 -121 -103 28 64 -21 -228 -274 -248 -40 72 -183 -77 108 25 156 129 1 48 -365 30
4333C0K03p6j76L6n4M1J38Q9k91lo5J85n7J3J0k17L33k89K87qj05j96l6L20j44
$$ 30 233 157 -19 17 -37 4 142 231 -60 -63 -128 57 0 13 23 -194 139 -150 137 129 24 -172 -208 112 -32
4358c2j67J17O5q9J29k1O4k10N7J28L2n7m13M35m59N84k83M62l16k40j4J51K31
$$ -32 -199 -82 -17 -106 23 2 66 -144 -87 41 73 16 -397 38 -421 163 -120 342 26 -214 -228 -77 154
4381A54k75J56K1l0R8L6N3k40K64m71l2M82j96j47J60J24K0k08J56j0k66Q2l7
$$ 154 -121 35 56 26 124 160 213 -27 237 -234 -266 216 20 -127 33 157 177 -31 125 115 -151 -69 -106
4404a06m7J71q1J79l43K82R3p8l11J15J28O0n0O1j47O4r8n5N9l6K84m1k13Q8j48
$$ -106 -153 18 -63 116 -227 55 148 70 -241 -126 2 62 12 73 -74 -10 -108 -163 -104 -140 144 103 -110 -22 -170
4429a70J84Q2p5J74k69J68k78K43J3J0j90N5K80k95j99L84J05j18j40J31j76l4
$$ -170 14 96 21 195 -74 94 -184 59 72 82 -108 -53 227 -68 -267 117 222 104 -36 95 -81 -115
4451a15L25l70K50J08n7K2k04k81N12k99M05k41J78j36r1k45N26l72OJ1M5n1K08
$$ -115 210 -160 90 198 141 163 -41 -322 190 -109 296 55 233 97 6 -239 287 -85 -79 -68 -23 -74 134
4474A34k19J54l5k42R1J3K44j58j28M71n59J87J58M6l24R6j11J01O4J55k62j35
$$ 134 -85 69 34 -208 -117 -104 140 -18 -146 325 -234 -47 111 157 -167 -71 -182 -81 -17 138 -124 -259
4496b59M01j34k43L53O5m93M01O6k84K74j66pJ46m05M4K17l30L21J63j08P7r5
$$ -259 142 8 -235 118 183 -310 91 157 -127 147 -19 -26 120 -285 -241 -24 -354 -33 130 22 99 4
4518DQ5L2m49L16K61m95K40m19M36j6P5p0k8J68j43Lj89L75l11p2K32j45L32k71
$$ 4 89 121 -328 -12 249 -246 -6 -425 11 -5 70 0 -28 140 -3 0 -189 186 -125 -197 35 -110 222 -49
4542d9rK71l3k23p6J03J6K63l53J66K9M7j48Pj44L31L2o1J39Jk44k7J33r1m01
$$ -49 -58 213 180 -43 -119 -16 0 263 -90 76 105 152 4 11 -133 198 230 169 308 309 65 38 171 80 -321
4567c21LK56j30K92j60J06q9N9L3k51mJ33L52k35n7n9J45k32J94N5j35K78q8l18
$$ -321 -318 -62 -192 100 -60 46 -43 16 49 -202 -206 -73 279 44 -13 -72 73 -159 35 90 -45 233 145 -173
4591a73M53o27J88K51j81N2L7O3j4j57n3J05%K4q7JK31r9m4l1j5J51q3q4L02R2
$$ -173 280 -347 -159 92 -89 -37 0 63 49 -108 -161 -56 -56 -32 -119 -118 113 14 -30 -61 -76 75 -8 -92 210 302
4617C02k08r8l6j7Q9j46K26j04J4k62J92N9J57j55j55P5j36J87R3k93L19l8P8
$$ 302 94 -4 -40 -57 32 -114 112 8 22 -240 -48 11 168 13 -142 -67 -203 -16 77 -216 103 65 143
4640A43J3k11O1J94l85J98j50Q3K73m18K09j87J27j3J12J65k18j41K32k9%K02
$$ 143 156 -55 6 200 -185 13 -137 -54 219 -199 10 -177 -50 -63 49 214 -4 -145 87 58 58 260
4662B60kj50l9n4J26j90j08M4K01j24R8r9r5K26k93K66Rn6P8k16N8p4R6K98r4
$$ 260 258 108 69 15 141 -49 -157 -113 88 -36 62 -37 -132 94 -199 67 76 20 98 -118 -60 -134 -38 260 166
4687A66l53J02J28N3J07l21J50J75r8J19k16j61J18K87k85j25J47o7J06r7p2N4
$$ 166 -187 -85 43 96 203 -118 32 207 109 228 12 -149 -31 256 -29 -154 -7 -74 32 -65 -137 -83
4709h3J40j07J5K95k99m0Jj24lk7J60K50o7j80J62J08m42M4j03L31K6j47JJ8O1
$$ -83 57 -50 -35 260 -39 -79 -78 -202 -205 -232 -72 178 111 -69 93 201 -241 -197 -300 31 57 -90 -89 -71 -10
4734a0J9K1P4j25r0J70L7j62J71k53J60j89J60k67J00O4j07K47J16l37J22L09
$$ -10 9 30 104 -21 -111 59 96 -66 105 -148 12 -177 -17 -284 -184 -120 -227 20 136 -201 -79 230
4756B30k41l90L00k1J08Jm8l11M10L5k50J48n2K96l29Ok28M36j64j22J85j1k12
$$ 230 -11 -401 -101 -122 -14 -13 -61 -372 38 73 -177 -29 -81 215 -114 -108 -336 100 -64 -186 -1 -12 -224
4779b24K15J01r5j37Q1J85j08K95m92K97j67j21J75jK69k58J22k03q1K00J39l29
$$ -224 -9 92 -3 -140 -59 126 18 313 -179 118 -49 -170 5 4 273 15 137 -66 -147 53 192 -137
4801a37oK55N3j65O0M2j49J96J14j60l83L35M6N7O1j82k92K16L09k36n2r7p2O5
$$ -137 -143 112 165 0 60 102 -47 149 263 103 -280 55 101 158 219 37 -255 -39 270 34 -18 -115 -187 -122
4825a22L21m66l6K14k8J10J3J7o1M11m72L46l92J60j1m6j30L01m46M98k47q1J78
$$ -122 199 -267 -303 -89 -117 -7 6 23 -38 373 -99 247 -145 15 4 -42 -172 129 -317 181 -66 -147 31
4848C1k33K98k38J01J70q2k39J22J23K8Ok09m3K35J0Q8k60R4k38L54o8j00J31
$$ 31 -202 96 -142 -41 129 47 -192 -70 53 81 87 -122 -165 70 80 168 -92 2 -236 118 50 -50 81
4871H1q4j32o5M07j36k68K74k3j33j07L19k53K02q1j33J16J96Ll1r5L8R8m5k17
$$ 81 -3 -135 -200 207 71 -197 77 54 -79 -186 133 -120 82 1 -132 -16 180 183 152 57 95 193 148 -69
4895f9J70P3l13K11O1k94L81o49L93k2k65L12j32K40j67L3J94k46o0L15o72N24
$$ -69 101 174 -139 72 133 -161 220 -429 -36 -58 -323 -11 -143 97 -70 -37 157 -89 -149 166 -506 18
4917A8L9j37j64R2K01r9M9L38l13m15L99l58M61O2k82J1j9Q7P4k13J91j2J40k15
$$ 18 57 -80 -244 -152 49 -50 -1 337 24 -391 8 -350 111 173 -109 -98 -117 -30 44 -169 22 10 150 -65
4941f5K92l66N50m83O0K79j58l70K42N9l2jPJ0l43K08K90j88j76K13l3j26K75
$$ -65 227 -139 411 -72 -12 267 109 -261 -19 40 8 7 14 24 -319 -111 179 -9 -185 28 -5 -131 144
4964A44L8o6k37J14J55m21J72L20l56L05j52K32l72q5K41J85m66L50n1m2k94L5
$$ 144 182 116 -121 -7 148 -273 -101 219 -137 168 16 248 -124 -209 32 217 -249 101 50 8 -286 -251
4986b51L6k7J33K04p7k86L86j6l27J85J95l55L74k89K73k0k77J39n3j60K51j00
$$ -251 -215 -242 -109 95 18 -268 118 102 -225 -40 155 -200 174 -115 158 138 -139 0 -53 -213 38 -62
5008f2N4J24N5k86K65L5j09k88M20j52P0j09k15l3N01j56k11J49k16L12l70M58
$$ -62 -8 116 171 -115 150 185 76 -212 208 56 126 17 -198 -231 270 114 -97 52 -164 148 -222 236
5030B36n03K73K47j62J71k08K8J5k65L14j98Q8J27k31J71J17k72pM2N4k45R9K66
$$ 236 -267 6 253 91 262 54 82 97 -168 146 -52 36 163 -68 103 220 -52 -59 -17 37 -208 -109 157
5053A57k69pl7K43j01j33K79j34R9Ml41K57r4O1o3J37R3j27j51m6L37m1j18L5
$$ 157 -112 -119 -156 87 -14 -147 132 -2 97 101 -240 17 -77 -16 -79 58 151 24 -127 -173 164 123 5 40
5077D0n0o5M4j18O9q1J70K58k56m0N3j63M62l36n8K22k45L02m13M07L04n19l69
$$ 40 -10 -75 -31 -149 -80 -161 9 267 11 -29 24 -139 323 -13 -71 151 -94 208 -205 202 506 -13 -382
5100c82L39J15j43J09J85k78J04k02M29k34P1j52j30K52j90J89J64j13J02l16
$$ -382 -43 72 -71 38 223 -55 49 -153 276 42 113 -39 -169 83 -107 82 246 133 235 -81
5120h1j03J98J10n7l90J32K16j78L07R9j65k6j94R7l5J53j69J90j45j40J77o8
$$ -81 -184 14 124 67 -323 -191 25 -153 154 253 88 62 -132 -35 -70 83 -86 104 -41 -181 -4 -72
5142g2r6K77qj05J27j66K72k23p9J60k08J44j22J87l9k73J59j12L2J3J22K6o1
$$ -72 -168 109 101 -4 123 -43 229 6 -73 87 -121 23 -99 88 49 -224 -65 -177 -145 -132 -10 16 -45
5165d5N0j50J61J38j00k35J34N2Q2P8m34K06J31k20J98j71K72k88M3L2q6O2l8
$$ -45 5 -145 16 154 54 -181 -47 5 87 165 -269 -63 68 -152 46 -125 147 -141 -98 -66 -152 -90 -128
5188a28K46k04N4Q1j29K83j39L1j83m0J8N9K91l21m4J83j1k56M18j34J66k43j27
$$ -128 118 -86 -32 49 -80 203 64 95 -88 -128 -110 -51 240 -81 -125 58 47 -209 209 75 241 -2 -129
5211a29%J67q1L37k97jM4L05m88J51j09J6O3J51j93J36k47K02J20m4k25J78j4
$$ -129 -129 38 -43 294 -3 -4 40 345 -143 8 -101 -85 -22 129 -64 72 -175 27 147 103 -122 56 42
5234D2j4l70J77L78m39J74K17j02K0j9l1j31n7M08n05M12j66R9nr1k46M13O1j35
$$ 42 28 -342 -165 213 -226 -52 165 63 83 64 33 -98 -155 253 -252 160 -6 93 88 -3 -249 164 225 90
5258I0j33o5J42n0P9j92NJ23J16p3k7n2K7K17j04l26J23J44J24k43K89k11M3L9
$$ 90 -43 -108 34 -16 63 -129 -124 -1 115 42 15 -37 -10 207 103 -223 -100 44 168 -75 214 3 46 85
5282H5q6J39j20J47p7m27K63j04J47J17k84rO1K42p9QJ8K33k05k57K36k55K92
$$ 85 -1 138 18 165 88 -339 -76 -180 -33 84 -200 -209 -148 94 15 23 41 274 69 -188 48 -207 85
5305H5p1K1k95K66J07m5o9K56j75k65K13m2j04J18m6Ln0M12l09j96L41j68j17
$$ 85 14 35 -260 6 113 68 -1 255 80 -185 28 -14 -118 0 -46 -43 -93 319 10 -186 155 -13 -130
5328a30L04k20R6k32N8P4Q1k91M21P2Kk80J20j13j80K42m30N65l67J39J74k73
$$ -130 174 -46 50 -182 -124 -50 31 -260 161 233 235 -45 75 -38 -218 24 -406 159 -208 -69 105 -168
5350a68M59l27J39r9K8n0K26o2j89p5J47N1j1M8O3j56o0P0OKJ4n9n9N7j51J86
$$ -168 291 -36 103 4 32 -18 208 146 -43 -118 29 80 69 117 180 24 -36 34 40 42 56 -3 -62 -5 -156 30
5376C0m4L9k8L28k99o8J32l25K06k43K45j60M14k82L93K2k33j18N2J10j14k45
$$ 30 -14 25 -3 325 26 -42 90 -235 -29 -272 -27 -187 227 -55 338 360 127 9 61 171 57 -188
5398a88J57j3K43l28K2K10r1j55M16l84j35K04k8K13j26j94K59pj43J01m9K1K02
$$ -188 -31 -44 199 -129 -107 103 12 -143 273 -111 -246 -42 -70 143 17 -177 82 75 -68 33 -16 5 207
5421B07K8j59K2p6N3q0j59J64J53p7K0M5K7k11J16K71m20K66j65R9j3l42K43K0
$$ 207 235 76 98 22 75 -5 -164 0 153 76 96 141 168 -43 73 344 -76 190 25 124 111 -231 12 32
5445C2k07m4K32j77K32j69Q6q3J74J97l38j1J05NJ4L0k15K33j23k8J77j82J15
$$ 32 -175 -219 13 -164 68 -101 -15 -98 76 273 -65 -76 29 34 48 78 -137 96 -27 -55 122 -60 55
5468E5M28l90n1p8r6K42k63J94O9P6q7k44PN9n7l5K67k93N8P2q2L27l52J98r6
$$ 55 483 93 42 -36 -132 110 -153 41 110 186 99 -145 -138 -79 -136 -171 96 -197 -139 -67 -149 178 -174 24 -72
5493g2J45N5l07L0K4L15l54K29k23O6L40n43K39K09j98J55m10M85l39K95j81K49
$$ -72 73 128 -179 -149 -125 190 -164 65 -158 -92 248 -295 -56 153 -45 110 -300 185 -154 141 -40 209
5515B09o7K1J04m20J02J24M6k51L26l01J13qQ3Kj52j69L09J63l16K01j17J88k19
$$ 209 142 163 267 -153 -51 73 119 -132 194 -107 6 -2 81 83 -69 -238 71 234 -82 119 2 190 -29
5538b9K23l9l4L0J0o0r9M9J48j77j40J30R3k96L14J21k51K66l43K05r3J08r2o
$$ -29 194 155 121 151 161 101 2 51 199 22 -118 12 105 -191 123 244 -7 259 -84 121 28 136 44 38
5562C8k18J01j20K49K54l53K55k50J22j99K70j75o1j3N2J3Lj95J10O3K63l26L27
$$ 38 -180 -79 -199 50 304 -49 206 -44 78 -121 149 -26 -87 -100 -48 -35 -32 -227 -117 -54 209 -117 210
5585B10l71J5P4j00L37j6J45l14r4L31J32n0j40O5l86j54L40l4j19J64J15l82
$$ 210 -161 -146 -72 -172 165 149 294 -20 -114 217 349 299 159 224 -162 -316 24 -10 -129 35 150 -232
5607b32K34N4q5k3J48j44q2K05j81M1J6j53K25Q4M5j51l42M99J6J02m35K16k68
$$ -232 2 56 -29 -52 96 -48 -130 75 -106 -65 -49 -202 23 107 152 1 -341 158 174 276 -159 57 -211
5630b11K90r5r7K36J20k95k4R7k26R4%Q0JM4Q3L0j69M7M2o4J77P5l29K14j32j95
$$ -211 79 -16 -113 123 243 -52 -76 21 -205 -111 -111 -31 -30 14 97 127 -42 5 47 -17 160 235 -94 120 -12 -207
5656b07M5QK14j91j26L01k09OL67j88k33L82p0oJ60k63j4r2L89l84J39O3k40Q9
$$ -207 -162 -154 60 -131 -257 44 -165 -159 208 20 -213 169 99 93 253 -10 -24 -116 273 -111 28 91 -149 -60
5680f0L1L0j64K18o0p5J40j5NJ60k41j30J58j85K53l1k29R6M0J86r8k03J2J56
$$ -60 -29 1 -163 55 -5 -80 60 45 50 210 -31 -161 -3 -188 65 34 -195 -99 -59 127 29 -174 -162 -6
5704fk44J84K90j4l60Q7J57j46N6J9k0R0j13J83j61J6K10k59K85l69J90j01P8
$$ -6 -250 -66 224 210 -150 -63 94 -52 4 23 3 93 -20 163 2 18 228 -31 254 -115 75 -26 52
5727E2kk75N93m48K28k05J61k58K18P1j44q0J40j78j43M37k77O3J75n5k77O9Q7
$$ 52 50 -225 368 -80 148 -57 104 -154 64 135 -9 -89 51 -127 -270 167 -110 -47 128 73 -204 -135 -48
5750d8K55k83J57k05K99j61J8l1o7K71l42L71l36m8J0K54j02J21p3L52m29J42
$$ -48 207 -76 81 -124 175 14 32 1 -66 205 -137 234 -102 -150 -140 114 12 133 60 412 -17 125
5772A25j61k4J54p1j23K57m1m7k16j5M02k13J43l7l52J84K61n14K93m6Q1K62n47
$$ 125 -36 -60 94 23 -100 157 116 69 -147 -162 240 27 170 133 -219 -35 226 -288 5 -41 40 302 -245
5795b45L53J05k25p4m7mK95Q6l65j66L75J49j9j62m4K36j74J89j20l23K05k9L4
$$ -245 108 213 -12 -86 -133 -137 158 244 -121 -287 88 237 218 56 12 248 74 263 143 -180 25 -4 30
5818C0l82PO06l83jJ23j14J41P7O0n80M36j59N4K1J36l8j8J06k29L05k10N5k35
$$ 30 -352 -345 261 -122 -123 0 -114 27 104 164 -416 20 -139 -85 -64 72 34 16 122 -107 198 -12 43 -192
5842a92J70J85k09K39k15q7l2M0J75k0l7QK56l90J57k37P5OJ23J46j87J87o7j04
$$ -192 -22 163 -46 193 -22 -109 -141 -101 74 54 17 25 281 -109 48 -189 -114 -108 15 161 -26 161 94 -10
5866a0k49J11P0J37j38L35k73j01K12j61K31l6k52qL90k93K16l34J99j59J73R6
$$ -10 -259 -148 -78 59 -79 256 -17 -118 94 -67 164 128 -124 -132 258 -35 181 -153 46 -113 60 156
5888A56k77K19o5K2n8K4k7j80K8J37K8J3%j68J11o0J7q7K14j68P9J66p4J04j19
$$ 156 -121 98 33 55 -3 21 -6 -186 -158 -21 7 20 20 -148 -37 -97 -80 -167 47 -121 -42 124 50 154 35
5913C5J28k00J95j70K03J41o9k84L5J73k18J14L2q3o1J77k77j5n0K84J18j05l03
$$ 35 163 -37 158 -12 191 332 263 -21 14 187 -31 83 115 32 -29 148 -129 -144 -194 90 208 103 -200
5936b00J45p4K7J01l4L8N7k46J05k22O16k67k1J8l65p2L55K63l36J02J46k13j76
$$ -200 -55 -129 -102 -1 -35 3 60 -186 -81 -303 313 46 25 43 -322 -394 -39 224 -112 -10 136 -77 -253
5959b53J33K50R9q6l37j29J03K27P0J7Qj2q6p2L42j21k01L0l0K09j22m4r0K4K83
$$ -253 -120 130 229 143 -194 -323 -220 7 77 94 102 90 4 -68 274 153 -48 -18 -48 161 39 -5 -95 -71 212
5984B12j10k78J26J47P1j63J20j72O6k6M7J87j27l0L2L3j02o2MN7K5j7P6pn1k16
$$ 212 102 -176 -50 97 168 5 125 -47 19 -7 40 227 100 70 102 135 33 -29 -25 32 57 40 116 109 58 -158
6010a58J26JJ40L5j46J20m9k13K88l9J96l01J83l03J22j61J05N8q6J1O8J32j26
$$ -158 -32 -31 109 144 -2 118 69 -144 144 105 301 0 183 -120 2 -159 -54 4 -82 -71 -3 129 3
6033CR0j89K85k10Mp6K31K7k31q1L54J63k96j13k2K04K9j79j99J22K08j69K18
$$ 3 93 -96 189 -21 -17 -93 138 165 -66 -147 207 370 74 -39 -61 143 172 -7 -206 -84 124 -45 173
6056A73l41K18l52K76J8q6J94l02J39K4r8j47N08Qj65K9mq4P6k71L90l55J34N5
$$ 173 -168 50 -302 -26 -8 -94 100 -202 -63 -39 -137 -284 224 232 67 96 92 8 84 -187 203 -152 -18 37
6080C7J65l40L26n5L0m15J35k0L3K59k96M95m98J64j33l0J40j29K47j48P0n5M4
$$ 37 202 -138 188 133 163 -252 -117 -137 -104 155 -141 354 -144 20 -113 -143 -3 -132 115 -33 37 -18 26
6103B6q2pK82l58j4K84l27J47m9o8K7q8M34q3k66J00R3k47K30K39k17j14o6J23
$$ 26 -56 -63 219 -139 -153 131 -196 -49 -98 -166 -139 -227 207 124 -142 -42 51 -196 34 273 56 -58 -124 -1
6127aR4r2M4j12M7o9K07q0l5j50K92r5j65J37J56k9j18Q3k17L77m9k26K44j53
$$ -1 93 1 45 -67 -20 -89 118 38 3 -147 145 50 -115 22 178 149 31 114 -103 274 225 -1 243 90
6151I0J03r4l76J20l5J02o5K04K32J5k84J81l91J15K98j47k2K1l46K28k4O5rj17
$$ 90 193 99 -277 -157 -192 -90 -155 49 281 296 12 193 -198 -83 215 68 46 67 -279 -51 -75 -10 -19 -136
6175a36l3K20O0ok10L62j1n31M68j13l6K34p6j89K3j5j81J33K2J11Q5r4j19Q4
$$ -136 -169 51 111 105 -105 257 246 -285 183 70 34 268 192 3 26 11 -170 -37 -15 96 181 87 -32 52
6199E2J8k68M6L27k04J29L8k19L01o2MJ33k65m3O7j57K84M6k05L7j2j59K60O9
$$ 52 70 -198 -152 175 -29 100 138 -81 220 158 162 295 30 -13 54 -103 181 227 22 59 47 -112 148 217
6223B17k65J43k46qJ91k46J62j8K02l55O5m5K73j33K95k72k60N4M04j52k80L86
$$ 217 -48 95 -151 -159 32 -214 -52 -70 132 -223 -158 -203 70 -63 232 -40 -300 -246 158 6 -274 112
6245A12o7J24l13R9R0j80J78m4j69O6K7P8j26L80j35k15P1J26j72M6k66M02j58
$$ 112 45 169 -144 -45 45 -135 43 -1 -170 -104 -77 1 -125 255 120 -95 -24 102 -70 -24 -290 112 -46
6268d6N1j28J22J44j05j02k25K01M03m01J79j25O5j34J21J86m51J84k49L62J34
$$ -46 5 -123 -1 143 38 -64 -289 -88 315 -86 93 -32 33 -101 20 206 -245 -61 -310 52 186
6289A86k33Ln0M9K12J97k92j8m9p7l7J9J15O9l04K15J7N9P1j71R0J37l26k0J08
$$ 186 -47 -44 -94 -45 167 364 72 54 5 -72 -109 -90 25 94 -210 5 22 81 152 -19 71 208 -118 -138 -30
6314c0m6K86l79J79R5j34J18L4m61M05J84j94r8J33q8J77j17j9J69j62p3k36K40
$$ -30 -76 210 -169 10 105 -29 89 123 -338 67 251 57 -41 92 4 181 64 45 214 52 -21 -257 -17
6337a7N4m8K10l35R6K65k8j96M5m4k56L27k10K26k12J25m9K44j73l4O1r9J23k53
$$ -17 37 -11 199 -136 -40 225 197 1 46 2 -254 73 -137 89 -123 2 -47 197 24 -10 51 -48 75 -178
6361a78K04k24M03l41J66o2L4r8N3K32j12L7l27L10j36NM7o8N9j46l2L31j71j13
$$ -178 26 -198 205 -136 30 -32 2 -96 -43 189 77 114 -213 97 -39 -34 13 -55 4 -142 -174 157 -14 -127
6385a27J74j25J42r0J61M2j95O4q0N6j64J3L27l66J99K9o3j38K22j53j22L98r4
$$ -127 47 -78 64 -26 135 177 -18 46 -34 22 -142 -129 198 -168 31 60 -3 -141 81 -72 -194 204 110
6408A10j91j9K63j31r4j74K02M5J61J49l15r8J65P4m04M7K88n0j54j4K47J40l08
$$ 110 -81 -100 163 32 -62 -236 -34 11 172 321 6 -92 73 147 -257 -210 78 28 -126 -140 107 247 -61
6431f1r1P0J40j5o7qN7j1o3K2k06J18M5m6Q3k17J29p0O6K46l52K36n5J3L22k36
$$ -61 -152 -82 58 43 -24 -32 25 14 -49 -27 -233 -115 -70 -116 -33 -250 -121 -191 -125 121 -231 5 -50 -37 285 49
6457D9L3j25O3J0mJ30k25J72p7J86j23l58M40k90J04j29RJ14j98N3m0K63j20J84
$$ 49 82 -43 20 30 26 156 -69 103 26 212 89 -269 171 -119 -15 -144 -135 -21 -219 -166 -206 57 -63 121
6481A21j78P4l40L88j01J16k26M71m77MJ45J0J25k05n7J21J16j35j08o0M0LK96
$$ 121 -57 17 -323 65 -36 80 -146 325 -152 -148 -3 7 132 -73 -130 -9 107 -28 -136 -196 -156 -153 143
6504A43k55J15L48k20k52L30j15l23K82q0o5K29l43K73J46l33m9J8O3j56L37J98
$$ 143 -112 3 351 131 -121 209 94 -229 53 -27 -92 137 -206 67 213 -120 -169 -151 -88 -244 93 291
6526B91k48n3K6m4M4J32j50j41J78k46K56R3k59K44k5k32L6J58k26L75r4M7l80
$$ 291 43 -10 16 -28 16 148 -2 -143 35 -211 45 138 -121 123 98 -134 -98 60 -166 209 115 162 -218
6549b18L5M47k69K3J1j44K11o2j27P5n2j04K8K89l34K01j33K79j84J07o5J6k30
$$ -218 -183 264 -5 18 29 -115 96 34 -93 -18 -70 -174 -146 143 -191 10 -123 156 -28 79 14 30 -200
6572b00P9K43n1l05P5K82j19j4n9k9Q5q1J56j24J48j11j65%K53j9k6P8k0q4Q4
$$ -200 -121 122 71 -234 -159 123 4 -10 -69 -98 -13 -94 62 -62 86 -25 -190 -190 63 44 18 96 76 -8 76
6597G6j89L00O7m13J87Q7j89J15J77k36j21J74j41n1lj76M16J3M2J02o15K42K11
$$ 76 -113 187 254 -159 28 115 -74 41 218 -18 -139 35 -106 -157 -160 -336 80 93 135 237 -378 -136 75
6620G5N7k00M3j65K85j11l62K51L08j90j8K1l8J3J14j0L7o4m6j62j73L42Mk82
$$ 75 132 -68 -25 -190 95 -16 -378 -127 181 -9 -27 -6 -44 -31 83 73 110 46 0 -162 -335 7 11 -271
6644b71L57J76k46r7Q2l8j31K46k1J04j31k22M53k11k27K95j16qJ09j71k9K08
$$ -271 86 262 16 -81 1 -37 -168 78 57 161 30 -192 261 50 -177 118 2 -6 103 -68 -97 111
6666A11Rk23K19o4j88j1J45J68l58J24Q4j19J27O4j62K93j70j46J66J94m37O3
$$ 111 120 -103 116 52 -136 -147 -2 166 -192 -68 16 -103 24 88 -74 219 49 -97 69 263 -174 -111
6688a11J18k04Q6R7Q4k34K40P6l38K18l31L23O5p1L38j97J06l42L25j80n6Rj20
$$ -111 7 -197 -111 -14 70 -164 76 152 -186 32 -299 24 89 18 356 159 265 -77 248 68 12 21 -99
6711i9J20k13MK02O7j00k9R6k3m0K39k37J23m9L8k76J28J44K8oJ11k49K27l04
$$ -99 21 -192 -188 14 81 -19 -48 48 25 -15 224 -13 110 61 99 -177 -49 95 123 117 228 -21 206 -98
6735i8J26j53l3K55k10kj68J50k9K3J71J3l38J98J0J77j16J58k0m20O06k77M3
$$ -98 28 -125 -158 97 -113 -115 -283 -133 -162 -139 32 45 -293 -95 -85 92 -24 134 114 -306 300 23 66
6758F6J3l9jk32K23Np2Q1J03k71K08k82l4J89J52m42K78P3Ro7P7j36K14j50j45
$$ 66 79 40 39 -193 30 35 -37 44 147 -124 84 -198 -232 -43 109 -333 -55 18 27 -40 37 -99 115 -35 -180
6783a80J83k3KJ42N7l07L10k20K15K5k54R0P7j9k31n9K39m9k1r3K09k58L85p8
$$ -180 3 -20 -18 124 181 -126 184 -36 179 204 -50 40 117 98 -133 -192 47 -2 -23 -116 93 -165 220 142
6807A42m4q2J79j21k40J42R3p2J15J17j22k33K71j01O1k32o3M06k64L75k73k32
$$ 142 98 16 195 74 -166 -24 69 -3 112 229 107 -126 145 44 105 -127 -190 216 -48 327 54 -178
6829a78J03m5oJ07qJ68r7P0o3J17k34K83j14K47l26K33l01K59j95r8l9j98K35
$$ -178 -75 -120 -126 -19 -27 141 44 114 51 168 -66 217 103 350 24 257 -44 215 20 -78 -117 -315 -80
6852h0L30k96K75k31j12J22J52k24L0j13Q8n6L19k34j06K50j32N3Q2l15J35J30
$$ -80 250 -46 229 -2 -114 8 160 -64 -34 -147 -59 -115 204 -30 -136 114 -18 35 117 -198 -63 67
6874F7j20P5j35M15n17J64J25j29j88J05J54j32q0J65m3J71l25J63l9L12r6k80
$$ 67 -53 22 -113 302 -215 -51 74 -55 -243 -138 16 -116 -196 -31 -74 97 -228 -65 -104 208 112 -168
6896a68K03j95L00j11J86k71k04R7K29j03L0l3j08K17j26j86K88L5k66j8L0L30
$$ -168 35 -160 140 29 215 -56 -260 -163 66 -37 -7 -40 -148 69 -57 -243 45 80 -186 -204 -174 156
6918A56j37J19j58j91L84k76l9K10r4j88K65p1J55m5o2K71m50M1j9n5J79l3m7
$$ 156 19 138 -20 -211 173 -103 -142 68 -26 -214 51 -20 135 90 28 299 -151 -110 -129 -184 -5 -38 -85
6941h5k9J11j49j8L95n8k31j83K31j18K45R9k04j39N0L7J05j0j16n4R5J12k96
$$ -85 -114 -3 -152 -170 225 167 -64 -247 -16 -134 111 210 6 -133 -83 -46 59 49 -67 -121 -26 86 -210
6964b10J05J02J62j82O4J61k13l4J89j91J57j69N5P3k84K33m1r0K52J81m10K45
$$ -210 -105 -3 159 -23 41 202 -11 -45 144 -47 110 -59 -4 69 -215 18 -23 -113 139 320 -90 155
6986A55m10K34r6M1K97l41L58k45k6k2j34J05K51J0r2l23K82n7J53l45J15K20
$$ 155 -255 -21 -117 -76 221 -120 238 -7 -33 -55 -189 -84 167 177 85 -238 44 -13 140 -205 -90 130
7008A30m0j3k13M7K72j51q8J59l7j90N0m8N1R9J77k3m06P1J87k12K50j18O9j23
$$ 130 90 77 -136 -89 183 32 -56 103 66 -124 -74 -122 -71 28 205 182 -224 -153 34 -178 72 -46 23 -100
7032a00J87l7k12L43q1l25K65k63K23J02l52K57l25L76j77j43L08M2l5K08l93
$$ -100 87 50 -162 181 100 -225 40 -223 0 102 -250 7 -318 58 -119 -262 46 88 53 261 -132
7053a32R7j89K10J49R0k19m1L6j32K22k42K95l12J68p0J47J63l87J44j1J80k06
$$ -132 -35 -224 -14 135 225 6 -35 1 -131 91 -151 144 -168 0 -70 77 240 -147 -3 -14 166 -40
7075d0P1k64J30k9L9J72j19J38k32L5R1J85j47j81J6N6J70P0l3O8q2n7k42J70
$$ -40 31 -233 -103 -132 -93 79 -40 98 -134 -99 -8 177 30 -151 -135 -79 91 161 128 196 114 57 -185 -15
7099a5L42j88j81J91j45k0R2k51j0R7L50l68K65j40J53o2j13J69j75j53J81k14
$$ -15 327 139 -42 149 4 -16 76 -175 -185 -88 262 -106 159 19 172 110 -3 166 -9 -162 19 -195
7121a95J20K2j99J36K39J1k33J6L19m14q9K18k03N0J61o9L24m71L25j41l1K07
$$ -195 -75 -53 -252 -116 123 134 -99 -83 236 -178 -267 -49 -252 -202 -41 -110 214 -257 68 -73 -104 103
7143A03m56L03k20L23J29l30J36K10k67K42P9j55p3j17N1Lj07N2K08L6j66O4O2
$$ 103 -353 -50 -270 53 182 -148 -12 198 -69 173 252 97 24 -93 -42 -39 -146 -94 114 150 -16 48 110
7166A10j46r4J83j55K47m3j06m1J60l05K06j19J96j42R3J06m18k5L83M4n0n4Q2
$$ 110 -36 -130 53 -102 145 102 -4 -45 115 -190 16 -103 93 -49 44 150 -268 -293 90 134 84 30 112
7189A12j84J79k52K90j28K64k05m9n3J48j09m78N40k35J68Q1K49k62j57l5J56
$$ 112 -72 107 -145 145 17 281 76 27 -26 122 13 -465 75 -160 8 89 338 76 -81 -116 40
7210D0j24K61k89K84j79O3k00J62k14J79q2P1q0L54j60l26K64rN6j48J02j48K82
$$ 40 -84 177 -112 172 -7 56 -144 18 -196 -17 -99 -28 -108 246 86 -240 24 15 71 -77 25 -123 159
7233A59j24j77K33j36J35k96J81k39J15k4K98m6J02j06j92P5R7j19L1k17N23p7
$$ 159 35 -142 91 -45 90 -206 -25 -264 -149 -173 125 79 181 75 -117 -42 55 -64 -33 -250 273 196
7255A96j37Ok45Q3l4K44l37M47j77j70K33j81j94J15K08J82n3k18pK54p1q9l53
$$ 196 59 65 -180 -97 -131 113 -224 223 46 -124 109 -72 -266 -151 57 239 186 -32 -39 215 144 55 -298
7278b98K29J16O1%J31m09K37R8l14J90j42L6L5K16p9J0l3j25K5L1J20o3k40J47
$$ -298 -69 47 108 108 239 -170 67 165 -149 41 -101 -65 -30 186 107 117 84 -41 -16 15 135 72 -168 -21
7302b1Qr5J78k31J38lM6j04j9O7m5K60j25j71N0P0rJ87r0k67J28j20M31k11j80
$$ -21 -13 -108 70 -161 -23 -26 20 -84 -103 -36 -81 179 54 -117 -67 3 -6 181 91 -176 -48 -168 263 52 -128
7327a28p8M36m34K96N6k69Q6K21m48M95r0k06L07m13K45k9l0k34J25J8J18J61
$$ -128 -206 230 -204 92 148 -121 -35 186 -262 233 143 -63 244 -169 76 47 17 -217 -92 -74 44 205
7349B05j14k20L27k00k84J96K10P5L5n5n35K10K18j52L9J63K32l85J1N8j48m3
$$ 205 91 -129 198 -2 -286 -90 120 195 230 175 -360 -150 68 -84 -45 118 350 -35 -24 34 -114 -157
7371a57J47O0Mj60J36k3o8O2k57J87L7J22j53J77p7q7n6L67r3m12K03nL81j74
$$ -157 -10 50 54 -106 30 7 -61 1 -256 -69 -32 90 -63 114 37 -50 -106 261 168 -244 -41 -46 335 161
7395A61k39K95k85j69J72J82k23K23j79pk96L08M1M4J05j31j5k25K63k8P0k70
$$ 161 -78 217 -68 -237 -65 117 -106 117 -62 -69 -365 -57 -16 28 133 2 -13 -238 25 -3 67 -203
7417b03o7M71m98R8J90r2L32k64K48l06K43k40p8L10k75R2LO0o0J0j38m4K89m8
$$ -203 -270 201 -297 -199 -9 -101 231 -33 215 -91 152 -88 -166 144 -131 -39 -36 24 -36 -26 -164 -208 81 33
7441C3M2R1k85K34k7N1k22k6J02o4K36j29m0J42l01J53Q9R9j17j26j18J05J69
$$ 33 75 166 -119 115 88 139 -83 -109 -7 -71 165 36 -4 138 -163 -10 79 178 61 -65 -183 -78 91
7464I1p8Q0j5L06k46Jl0l77M54P7m77L13l12K12J49j07M7k93K41r2j77L06l09
$$ 91 13 93 78 384 138 139 109 -268 186 263 -214 99 -213 -1 148 41 88 -205 36 -56 -233 73 -236
7487b36K83m02M24m4J33j79J74k16n4J42J64l00O1R7k88L06k11j6N3mR8J0J83
$$ -236 47 -355 69 25 158 -21 153 -63 -117 25 189 -111 -50 47 -241 65 -146 -162 -109 -113 -15 -5 178
7510A78k03O4J10j01k30L37j67J6J68m97L12R3k75K39J82j01O6k54P4m8P3p5L4
$$ 178 -25 39 149 48 -182 155 -12 4 172 -325 -13 80 -195 44 226 125 191 -63 11 -37 36 -39 -5
7533ep1j7M4K17k62L63k46pJ91j93o5K64j55m3n9j22K37m74J90K80J4j5q3q8J79
$$ -5 -76 -93 -49 168 -94 269 23 16 207 14 -51 213 58 15 -44 -166 71 -403 -213 67 81 66 -17 -105 74
7558G4j87J83O2k45P2K8J87k77M30k90l10L60O6j74R3J92k20m2p2LK6n5OPJ10
$$ 74 -113 70 132 -113 -41 -13 174 -103 327 37 -273 87 153 -21 72 264 44 2 -70 -67 -41 -96 -90 -83 27
7583B7j92k23M49j84oJ68l2j51Nn0J35Kj60K35J49j46m0JQ9k85L4j04M76P3m63
$$ 27 -165 -388 61 -123 -129 39 7 -144 -139 -189 -54 -52 -212 23 172 26 -14 -13 76 -209 -175 -279 197 270 -193
7608a93L35n72L50j4j41K48K2j18M0J62k41J40r5K74l01K35k70J04J47k73K46
$$ -193 142 -430 -80 -94 -235 13 35 -83 -43 119 -122 18 -77 197 -104 131 -139 -35 112 -161 85
7629H5k15P8P2l8r5K23j83k84J51K64j8j46q8Q3r7K78k08kK66k7L6j66l6j37L8
$$ 85 -130 -52 20 -18 -113 110 -73 -357 -206 58 40 -106 -194 -111 -208 70 -138 -140 126 99 135 -31 -67 -204 -166
7654a66K3n6K45j39J4j98K83J02k50L71n4j06j91J58O4l41J93J13O0k31R8j15
$$ -166 -143 -199 46 -93 -79 -277 6 108 -142 229 175 69 -122 36 100 -241 -48 65 125 -106 -8 -123
7676a23J91o3q3K0j26L01l99K69Mp7J20M4j11L6j21J1M34k73L09m01n7J31p9M9
$$ -123 68 5 -78 -58 -184 117 -282 -13 -9 -86 34 78 -33 3 -118 -107 327 54 363 -38 -95 36 -43 6
7700FJ17J00l66J92j47M8O5M1j86R2K20j85J05j14j30J67m0K05k34O2k8K23k15
$$ 6 123 223 -143 49 -98 -50 15 56 -130 -38 182 -3 102 -12 -142 25 -15 190 -44 18 -10 213 -2
7723bk11L67j88J66k22R7M3Q4j44l62J96J91K27mk16J3J62r4p6K28j63m9l7R5
$$ -2 -213 154 -34 132 -90 7 50 134 -10 -372 -176 15 242 238 22 35 197 103 27 255 92 43 6 101
7747A01J87k23J08k24J6J26j96J95j76K27k80M4Q8m4J57J33k68M7N2N2j22R1j13
$$ 101 288 65 173 -51 -35 91 -105 90 -86 141 -139 -95 -7 -51 106 239 -29 18 70 122 0 91 -22
7770b2R2J15o5qj50O3kj76K06k15P4%j79K10J26p3K08m23J11P3R9J05M0L6k73
$$ -22 70 185 120 112 -38 25 23 -153 53 -162 -88 -88 -267 -57 69 -4 204 -219 -108 -35 64 169 209 245 -28
7795b8k3j37J93P2n5j69N1j50L78l14J65N4%L9j8j53l3K31k22K89j32J70j64q6
$$ -28 -51 -188 5 77 22 -147 -96 -246 132 -182 -17 37 37 76 58 -95 -128 103 -119 170 38 208 44 -42
7819d2K0J56j94J09k26q1N22k71o9J48ml68M16P0l5j6K32p69L30J48lj42N9n2
$$ -42 -22 134 -60 49 -177 -258 264 -7 -76 72 68 -300 116 186 151 135 367 -402 -72 76 73 -69 -10 -62
7843f2K0J6j44K8J57K34j72j24n4J29j31K9K97l32J48J4K9k5m07K81J87N2n6P8
$$ -62 -42 -26 -170 -142 15 249 77 -47 -101 28 -103 -74 223 -109 39 53 82 57 -350 -69 118 170 114 192
7867A92N0O8m75P9Q3J4J32l58L36K6j57J29k15J66lq8j09J81j0O7lL3k85L44j48
$$ 192 242 310 -165 -86 -3 11 143 -215 121 147 -10 119 -96 70 67 -21 -130 51 41 108 105 138 -147 197 49
7892D9j69Q8n1K85k57M7P8k4M9k24L92j4l35q2jJ17n2J95q2K0MR2o8j21N4k6k2
$$ 49 -120 -32 -83 202 -55 -8 70 46 95 -129 263 249 -86 -168 -169 -52 -104 91 9 29 33 125 57 -64 -10 -36 -58
7919e8M3l6o7K14l0l0j70j79K13M1r3J29p6j59K80r8Pj20L91k85j43L85l84M24
$$ -58 -15 -51 -118 96 66 36 -134 -313 -100 -59 -152 -23 -99 -258 22 -76 -69 -189 202 -83 -226 159 -225 199
7943A99j29p6J67k33J34J8o7k27J39RK7k16LJ13J34J21k44K00J73j48j8j07k14
$$ 199 70 -6 161 -72 62 80 13 -214 -75 -66 -39 -255 -252 -139 -5 116 -128 72 245 97 79 -28 -242
7966b42K75J12O8j62j30J55J01k40J47J66m45J70J74j89j41L92j70j14J74n2P
$$ -242 33 145 213 51 -79 76 177 -63 84 250 -195 -25 149 -40 -181 211 41 -73 101 49 56
7987E6Rm5p2l2K0R4o6m9J92l4K63m61L53j03k69J96j73l6M4K16j12jK47j29k22
$$ 56 65 20 -52 -84 -64 30 -36 -85 107 73 336 -125 228 125 -144 52 -121 -157 -113 103 -9 -10 237 108 -114
8012a14J39K01k27J28j21k28L91j25J48k95K35k09j00K09j6p0K29k80L34k90J20
$$ -114 25 226 -1 127 6 -222 169 44 192 -103 132 -77 -177 32 16 -54 175 -105 229 -61 59
8033E9j0n7Q2j12K1J75n6J0k29N4J75k27K99p8M2n5J10k41K08j85k2J28J80k74
$$ 59 49 -8 74 -38 -17 158 102 112 -117 -63 112 -115 184 106 148 93 203 -38 170 -15 -37 91 271 -3
8057cj19J53o5O0m0M9R8l08K2j09K63j64M78k15N8j99J84k41P0J72l54J26J1J19
$$ -3 -122 31 -34 26 -14 35 133 -175 -153 -262 1 -163 315 100 158 -41 143 -98 -28 144 -210 -84 -73 46
8081D6k61K69q7k6J15J42l20p5K14J29k5m2k24L58l13k5J0L02k04k41L89K83k64
$$ 46 -215 54 -33 -59 56 198 -122 -197 17 146 121 79 -145 213 -100 -125 -115 187 -17 -258 131 414 150
8104A50j89q7N40k70j08K0j91J47m9J43N8j92K70k06j3l20K34J32l70K78k76L66
$$ 150 -39 -126 414 144 36 56 -135 12 -37 106 164 -28 242 36 23 -297 -63 69 -301 -23 -299 67
8126F7k56K29K6N1k57P2K76k41J34j31J86j41k0j71J58L0j26J58p5OJ41J46l94
$$ 67 -189 40 66 117 -140 -68 208 -33 101 -30 156 15 -5 -176 -18 12 -114 44 -31 -25 116 262 -132
8149a32L29j82pJ16j71N7o8L8j93j6L02k3L5K52j66l11j02K86k16M06k14k74J32
$$ -132 197 15 8 124 -47 10 -58 -20 -213 -229 73 50 85 337 171 -140 -242 44 -172 234 20 -254 -122
8172a22J41p8K65j51k23K55n5L3k82L33l4l5p7J38J5l64N6N2K54
$$ -122 19 -59 206 55 -168 87 32 65 -217 116 82 47 -30 108 123 -241 -185 -133 121
8191A21
$$ Imaginary data points
##PAGE= N=2
##DATA TABLE= (X++(I..I)), XYDATA
0@%%%%%%%%%%%%%%%%Qj6J6j6J6j6K4l2L2m0M8n6O4p2Q4r2J04j20J36j52J69j91
$$ 0 0 0 0 0 0 0 0 0 0 0 0 0 0 0 0 0 8 -8 8 -8 8 -8 16 -16 16 -24 24 -32 32 -40 44 -48 56 -64 72 -80 89 -102
38a02K15k39K66k96L28l63M00m41M88n37N92o52P19p92Q72r64J065j179J311j462
$$ -102 113 -126 140 -156 172 -191 209 -232 256 -281 311 -341 378 -414 458 -506 559 -620 691 -771
58g71J638j848K101k412K807l324M038n092O793r972J7835p0752j04333J98091
$$ -771 867 -981 1120 -1292 1515 -1809 2229 -2863 3930 -6042 11793 -58959 -163292 34799
72C4799P7497j06458m3963P1525Q129m8062K2881J5812p8388R446P9754k3206
$$ 34799 112296 5838 -38125 33400 41529 -6533 16348 32160 -46228 -36782 42972 19766
84A9766p5331J6020P7557n136p7508K4808N8957l3205l0065K0075M755j7727J506
$$ 19766 -55565 -39545 38012 32876 -44632 -19824 39133 5928 -24137 -4062 693 -17034 -15528
97a5528L3078j6568l3744M9431K3617n2631l50M2788o46l7261k895K8293j9892
$$ -15528 17550 982 -32762 16669 40286 -12345 -12695 30093 29447 -7814 -10709 17584 -2308
110b308j4229L4916k3625l8177L9458L3136k2967l2709J2093L5221j1871j5517
$$ -2308 -16537 18379 -5246 -43423 -3965 29171 6204 -26505 -14412 20809 8938 -6579
122f579J0287q502j765J0877j178n041j3498J2659K4017k6699j2362L0660O698
$$ -6579 3708 -4794 -6559 4318 3140 -1901 -15399 -2740 21277 -5422 -17784 12876 19574
135A9574j8141j4304J3616J4569j8717r67O137j6402J2089J4465j7986m981J1546
$$ 19574 1433 -12871 745 15314 -3403 -4370 1767 -14635 -2546 11919 -6067 -11048 498
148D98J0303n464j2227J3230J103j2479J0626k406q526P685l070J873P70r915
$$ 498 10801 5337 -6890 6340 7443 -5036 5590 3184 -5342 2343 -727 1146 1916 -7999
162g999N502N534J135k079j3962N786Q831p369M836n469n951J5312l18m629M849
$$ -7999 -2497 3037 4172 2093 -11869 -6083 2748 -4621 215 -5254 -11205 4107 3789 -840 4009
177D009k499J621J387M132M255j5353J946J1221j3265J747O130j1480p53M496
$$ 4009 1510 3131 4518 8650 12905 -2448 -502 10719 -2546 -799 5331 -6149 -6902 -2406
191b406K431l962r669J0844M631q319N790k612k53J2169q081m055O725r71L678
$$ -2406 25 -3937 -13606 -2762 1869 -6450 -660 -3272 -3525 8644 563 -3492 3233 2262 5940
206E940l031k952L802m567M870K282r120P640p93q030P681k293n398K858l081
$$ 5940 2909 -43 3759 -808 4062 6344 -2776 4864 4071 -3959 3722 1429 -3969 -1111 -4192
221d192K02m34J338L951j1450M502J4885j0130j855P590j851J272k728r15L675
$$ -4192 -3990 -4424 -3086 865 -10585 -6083 8802 -1328 -3183 4407 2556 3828 1100 185 3860
236C860m977L319n32o005P556k537l132Q604o812k183Q239k867k247l408J93O089
$$ 3860 -1117 2202 1670 -4335 3221 684 -2448 6156 -656 -2839 5400 2533 286 -3122 -2929 3160
252C160o707J099K474o514Q041L37q743Q150J251m769L473m59J016l199n72Q071
$$ 3160 -3547 -2448 26 -6488 1553 1890 -6853 1297 2548 -2221 1252 793 1809 -1390 -1962 6109
268F109q608k224J0793o051j024L450l833L841l8k645K723k922K427r92n475P228
$$ 6109 -2499 -4723 6070 19 -1005 2445 -1388 2453 2415 -230 2493 -429 1998 1006 -4469 2759
284B759k819n619Q186l716l130N640l233O73k75j26L991n356K022L908o987O300
$$ 2759 -60 -5679 2507 -1209 -4339 1301 -1932 -1259 -1534 -1660 2331 -3025 -1003 2905 -4082 2218
300B218J578q417O543K561m465J280r63M192k404m907O827l241k717N334o453
$$ 2218 3796 -4621 1922 4483 18 1298 335 4527 2123 -2784 4043 802 -1915 3419 -3034
315c034Q04N265o999J712K194k223J366j888L321J13n872P883p39o259O653j164
$$ -3034 -2230 3035 -3964 -2252 -58 -2281 -915 -2803 518 631 -5241 2642 1903 -4356 2297 1133
331A133j917L207l410J702J589k083K139l037K325K618p943N260L662r006L263
$$ 1133 -784 2423 -987 715 2304 221 2360 -677 1648 4266 -3677 1583 5245 -3761 -498
346d98K478k793L77k559L108L04l667M259l464r10O156n965L16N931n177J246
$$ -498 1980 -813 -436 -2995 113 417 -3250 1009 -2455 -3365 2791 -3174 -2858 3073 -2104 -858
362h58K453j628J266k572L469J003n593N346l08n732O385j883k861M523l231N13
$$ -858 1595 -33 1233 -1339 2130 3133 -2460 2886 2578 -3154 3231 1348 -1513 3010 -221 292
378B92J370j703Q80m133K346L818q415K188M675n057K337N16j689L783j296O99
$$ 292 1662 -41 839 -3294 -948 2870 -5545 -3357 1318 -3739 -1402 -886 -2575 1208 -88 611
394F11K16j756M966l815k181O625m877j775N545l555L08J260j150K095k874J031
$$ 611 827 -929 4037 222 -1959 4666 -211 -1986 3559 4 312 1572 422 2517 -357 674
410F74J321n005L483j40m370M911k833l274N944r73k067N10J675L603m603o68
$$ 674 1995 -3010 473 333 -4037 874 -1959 -5233 711 -262 -2329 -1819 -144 3459 -1144 -1812
426a812O014n177M35K786m526L315L11k808L317o09k02K9j030M620l700l227N838
$$ -1812 4202 -975 -540 2246 -2280 1035 1346 -1462 1855 1246 1044 1073 43 4663 963 -2264 3574
443C574m161k420L833l552m0J841j125K169k404J138K817l281L316q96m332O560
$$ 3574 -587 -3007 826 -2726 -2766 -925 -2050 119 -2285 -1147 1670 -1611 1705 809 -3523 3037
459C037j155n104L305M89K39n93j252M534k121j335L843l852R65J861n469K673
$$ 3037 1882 -3222 83 572 811 218 -1034 3500 1379 44 3887 35 1000 2861 -2608 65
475F5J013m360K090J10L56k85j356M691k043l480N883k567k052L173k915K84J557
$$ 65 1078 -3282 -1192 -1082 -726 -1011 -2367 2324 281 -3199 2684 117 -1935 1238 -1677 -1393 164
492A64j790K044q65R53J517k723L542K61n770N253P18n006J759j54J789m47l947
$$ 164 -1626 418 -447 506 2023 -700 2842 3103 -2667 2586 3304 -1702 57 -97 1692 1245 -2702
509b702L057k78p79J965n095K093M024n436J261J340k240K981j72o32k6l87M933
$$ -2702 355 77 -702 1263 -3832 -1739 2285 -3151 -1890 -550 -2790 191 19 -613 -639 -1026 3907
526C907j898m770N586n85j813K788l688K83K710k205p1j731J408K004n110K274
$$ 3907 2009 -2761 2825 2240 427 3215 -473 -190 2520 315 244 -1487 -79 1925 -3185 -911
542i11K444m839L152J42k750L110j256j85J076j411K237j586l32M146m360L14
$$ -911 1533 -3306 -154 -12 -2762 348 -908 -1093 -17 -1428 809 -777 -1109 3037 -1323 -1009
558a009L947l543Q42J567k543K190m72q48J097k000K960r71l125M298k578j756
$$ -1009 2938 -605 237 1804 -739 1451 979 131 1228 -772 2188 1217 -1908 2390 -188 -1944
574a944M109l661j354K698j98j20k786J357L977l877K99K646k578L056q12k918
$$ -1944 2165 -1496 -2850 -152 -350 -470 -3256 -1899 2078 -1799 -1500 1146 -1432 1624 812 -2106
590b106M041o74j888J198k07K090k066q14L987l731p11L791l926M5J466j957J557
$$ -2106 1935 1261 -627 571 364 2454 388 -426 3561 -170 -881 2910 -1016 -971 495 -1462 95
607I5j433J6J816k239K008k73k032M138k627k893N011j695j863J227J91K237k167
$$ 95 -1338 -1322 494 -1745 263 -10 -2042 2096 -531 -3424 1587 -108 -1971 -744 -553 1684 -483
624d83o31L640j992J224R22l925L456M19l938K228m61j073Q07j067J473j702o72
$$ -483 -1114 2526 534 1758 2680 -1245 2211 2630 -1308 920 459 -614 193 -874 599 -1103 -1775
641a775L772l527j063M276l018k29J616j867J804l51q01J432j119K643l95l497
$$ -1775 1997 -1530 -2593 1683 -1335 -1564 52 -1815 -11 -362 -1163 269 -850 1793 1398 -2099
657b099M906n16l180K794p17o37Q51k398J639l87j185J740k812J935J688m618
$$ -2099 2807 2291 -889 1905 1188 551 1402 -996 643 256 -929 811 -2001 -66 1622 -2996
673b996K809J454l313K172n27p11P71p68J869j087j531L871j987q98L013k730
$$ -2996 -187 1267 -2046 126 -401 -1112 -341 -1109 760 -327 -1858 2013 26 -872 2141 -589
689e89P15K550l087P73P31k88L57k517K769N31m468L087M07k469K298j893k84
$$ -589 126 2676 -411 362 1093 805 1162 -1355 1414 1945 -2523 564 971 -1498 800 -1093 -1377
706a377K041k067P69j19l62J806k694J392K374l891K191J557k913K096O4q91J416
$$ -1377 664 -1403 -634 -753 -1115 691 -2003 -611 1763 -2128 63 1620 -1293 803 867 -24 1392
723A392j200J632p16j912L525j783j460K921l009m2K384k715O2L81J16J321l450
$$ 1392 192 1824 1108 -804 2721 938 -522 2399 -610 -652 1732 -983 -921 -540 -424 897 -2553
740b553J893J570l107K197m83j781L743j909j033K474j060J028r10j71K345k405
$$ -2553 -660 910 -2197 0 -483 -2264 1479 -430 -1463 1011 -49 979 69 -102 2243 -162
756a62M32K810l607J130J559k909J226k5j020J298j505M72j01j459K958k383j024
$$ -162 270 3080 -527 603 2162 -747 479 454 -566 732 -773 -301 -402 -1861 1097 -1286 -2310
773b310L854k299j290K752j155O60o58l57K056j722O99J172k119K437n86k173
$$ -2310 1544 -755 -2045 707 -448 212 -446 -803 1253 -469 230 1402 -717 1720 1134 -1039
789a039L286r50j920J735j059N56p96r96K432k524R2K625k976Q80J616k391J531
$$ -1039 2247 1297 -623 1112 53 609 -187 -1183 1249 -1275 -1183 1442 -1534 -654 962 -1429 102
806A02j07j348J677j153P89k48j381L182j677j566L668j870m55K137j696O51l3
$$ 102 -5 -1353 324 -829 -40 -288 -1669 1513 -164 -1730 1938 68 -387 1750 54 705 672
823F72p55J294j737R94Q00l251K586N49l166K427k77j660K068j206L97J0j052
$$ 672 -83 1211 -526 468 1268 -1983 603 1152 -2014 413 136 -1524 544 -662 -265 -255 -1307
840a307K448j947n68K260k686J238J672k617J560J062j030O60n49J672k30k471
$$ -1307 1141 -806 -1374 886 -1800 -562 1110 -1507 53 1115 85 745 196 1868 1638 -833
856h33K608o77k181K392j594n38J892k127P22P52j077Q97j229O85R29k927J907
$$ -833 1775 1098 -1083 1309 -285 -823 1069 -1058 -336 416 -661 236 -993 -308 621 -2306 -399
873c99R18k873K473K9j178J718q81P38L30p86J641j187l10K083k845P38K081l215
$$ -399 519 -2354 119 148 -1030 688 -193 545 875 89 1730 543 233 2316 -529 209 2290 -925
891i25P81Q24q41N73j300O77Q66k315J890n61j510K831j946j058K660j492K71
$$ -925 -144 680 -161 412 -888 -211 655 -1660 230 -331 -1841 990 -956 -2014 646 -846 -575
908e75P36l33J009j242J004J273k677J559J011k590J890R4j633J485j011L33K10
$$ -575 161 -172 837 -405 599 1872 -805 754 1765 -825 1065 1159 -474 1011 0 333 543
925E43j221J790j644m57K344k844L63K117k138N49K99p99J466j150J99J161j634
$$ 543 -678 1112 -532 -989 1355 -1489 -1126 991 -1147 -598 -299 -1098 368 -782 -583 578 -1056
942a056J752l39j810L339j416j545K518n60l71J84o93J466j606O0J402k480J159
$$ -1056 696 357 -1453 1886 470 -1075 1443 883 512 696 3 1469 -137 -77 1325 -1155 4
959DR94k601J723j47j314J569p59m08M56p62J795j024j061K974j901o11K037j486
$$ 4 998 -1603 120 -27 -1341 228 -531 -939 -483 -1245 550 -474 -1535 1439 -462 -1073 964 -522
977e22P09P12j470J734p56K21L58j617J721k26k115K184n97j636K099j403L27
$$ -522 187 899 -571 1163 407 628 986 -631 1090 864 -1251 933 336 -1300 799 -604 -277
994b77K83n96Q54j165O4J703k225Q72J523k650J566Q12k221J920k72N2Q1j277
$$ -277 6 -590 264 -901 -837 866 -1359 -487 1036 -1614 -48 764 -1457 463 191 243 324 -953
1012i53K659r81j722K477j116o86J840k252N44R89j427R85p73R1J023j876J507
$$ -953 1706 725 -997 1480 364 -322 1518 -734 -190 799 -628 357 -416 -325 698 -1178 329
1029C29K77k386K704j170j375J991q20k22M82n15J353r65k74J682j378L19J781
$$ 329 606 -1780 924 -246 -1621 370 -450 -672 -190 -705 648 -317 -591 1091 -287 32 1813
1046A813k559J227R19j621R40n06K48K01j588J492j5j532J780j412p9J684j872
$$ 1813 -746 481 1400 -221 719 213 461 662 -926 566 551 -981 799 -613 -692 992 -880
1063h80j24J330j099N87r39K31J080j597J442N90k076K368p8j474J796m97J81
$$ -880 -1004 326 -773 -186 -1125 -894 186 -1411 31 621 -1455 913 835 -639 1157 660 841
1080H41J72r68J061p53o29J291j941L13J825k173N04O68j228J404j155k52N83
$$ 841 1013 45 1106 353 -276 1015 -926 -613 1212 -961 -457 211 -1017 387 -768 -1020 -437
1097d37n21O88p46p20K495j409n68K590j228k48J433q67O54n69J74P51j988O48
$$ -437 -958 -270 -1016 -1736 759 -650 -1218 1372 144 -104 1329 462 1116 547 721 1472 -516 132
1115A32R97k396J483K7j689J841p00k51N60m90J064q78n58J671j946K55J386j593
$$ 132 1129 -1267 216 243 -1446 395 -305 -556 4 -486 578 -300 -858 813 -1133 -878 508 -1085
1133a085Q82O90j281J498n6m01P26q98R96k15j812K077j126q69J633j702L45Q71
$$ -1085 -203 487 -794 704 648 247 973 75 1071 856 -956 1121 -5 -874 759 -943 -598 273
1151B73p72O41k73K39R04j519N76O78j867J342j64j502J768o93l92P39l63R87
$$ 273 -499 142 -131 108 1012 -507 69 747 -1120 222 58 -1444 324 -369 -761 -22 -385 602
1169F02m31q10J835j037k01J042j912P78R53j778R70M03l94M93p87J128K88j417
$$ 602 171 -639 1196 159 -42 1000 -912 -134 819 -959 11 414 20 513 -274 854 1142 -275
1187b75J419p34j283J595j264p00J141j215O11n8k74R04r43J118J000j822J507
$$ -275 1144 410 -873 722 -542 -1242 -101 -1316 -705 -763 -1037 -133 -1076 42 1042 -780 727
1204G27N27j876J186j90k12P05j329J140j47n25J609j448kJ166j814J06R82j754
$$ 727 1254 -622 564 374 162 867 -462 678 531 6 1615 167 165 1331 -483 -377 605 -1149
1222a149N99k03k41O43j301J315J99j190J818l66j112K447j008M9N99j020O35
$$ -1149 -550 -753 -994 -351 -1652 -337 -138 -1328 490 124 -988 1459 451 500 1099 79 714
1239G14k99l77R17j511Q19J059k053J088K95r95R69q55n26J000r49L76j80p63
$$ 714 415 38 955 -556 263 1322 -731 357 652 -343 626 -229 -755 245 -704 -328 -508 -1271
1257a271J364j329L36J881j509J79J620j145L49K51o00P33j046O10J15j562J751
$$ -1271 93 -1236 -900 981 -528 -349 1271 126 475 726 126 859 -187 423 538 -1024 727
1274G27o25j000J829p14q4N65j015N37j95n19J126j577L91R95j398J028K50j083
$$ 727 102 -898 931 217 133 698 -317 220 25 -494 632 -945 -554 441 -957 71 321 -762
1292g62J377k77o63O92j96L25l88q15J575j101n85J617j248M5J005p76P16l2k67
$$ -762 615 338 -325 367 171 496 108 -707 868 -233 -818 799 -449 -404 601 -175 541 509 242
1311B42O92r21M86K9j290J396l96j434J425p52l21Q18n77N85n1p35J192p26m8
$$ 242 934 13 499 528 -762 634 238 -1196 229 -523 -844 -26 -603 -18 -69 -804 388 -338 -386
1330c86J183j585J076K45j491J307K86m62P58m95M03k38o09J206p49q69J584j796
$$ -386 797 -788 288 533 -958 349 635 173 931 436 839 601 -8 1198 449 -420 1164 -632
1348f32m3J039j131L24k53j52Q98q18M94N83j338J542l65j040J225p8k29O18p64
$$ -632 -675 364 -767 -443 -696 -848 50 -768 -274 309 -1029 513 148 -892 333 255 26 644 -120
1367a20M87R7n74J275p78p1R93j836N86R60j697N07M0m17L57m50R0L98r46J431
$$ -120 367 464 -110 1165 387 316 1309 -527 59 1019 -678 -171 -131 -548 -191 -641 -551 -153 -1099 332
1387C32o32m81J375p26k45R99j017J65M09k42N40l92K26N55j374J286J77j216
$$ 332 -300 -781 594 -132 -377 622 -395 -230 179 -63 477 85 311 866 -508 778 955 -261
1405b61J067n41m91Q44j032J25L83o62R80j083M36P79j156M68R40j389N21K56
$$ -261 806 265 -226 618 -414 -289 94 -568 412 -671 -235 544 -612 -144 796 -593 -72 184
1423A84o86N59m12N70j02n11P55q2o24J175q59n9J011r65K30L15m70N53r31L07
$$ 184 -502 57 -355 215 113 -398 357 275 -349 826 -33 -92 919 -46 184 499 29 582 -349 -42
1443d2L38q19P42Jj072R27k50l69N95m15J66p2J54M78o84j52J036j073N78R34
$$ -42 296 -523 219 220 -852 75 -175 -544 51 -364 -198 -270 -116 362 -322 -474 562 -511 67 1001
1463A001j428R60p4m20M84p61N25%o32J254p22r81J574q61n93R38o10J42N03r96
$$ 1001 -427 533 459 39 523 -238 287 287 -345 909 187 -794 780 -81 -674 264 -346 -204 299 -697
1483f97P51n66j3N35o25P68J30j244J207j88n61N75j74N08j06m51O82L9r81J262
$$ -697 54 -512 -525 10 -615 153 283 -961 246 58 -503 72 -102 406 300 -151 531 570 -411 851
1503H51r16J66R33j511O07K36q03N70k08j82K74q12P63j11q19J212n66m76J291
$$ 851 -65 101 1034 -477 130 366 -437 133 -75 -257 17 -795 -32 -143 -962 250 -316 -792 499
1522D99q29K74L56m46P19o61MQ44j171Q13L49j259J047j98k33M20l20K8R5p92
$$ 499 -330 -56 300 -146 573 -88 -84 760 -411 402 751 -508 539 341 108 528 208 236 331 -461
1542d61P75n02n40J114p38p7M88o81M61K93m78M44l78K23K37o27P56j07o53J137
$$ -461 314 -188 -728 386 -352 -429 59 -622 -161 132 -346 98 -280 -57 180 -447 309 202 -451 686
1562F86l19n19R66p57l4K55j00M7J9l87M68j053K51P70r60L19L50n79M83l72K46
$$ 686 367 -152 814 57 23 278 178 225 244 -143 325 -728 -477 293 -667 -348 2 -577 -94 -466 -220
1583b20M01p51Q45m60p3O72n56j02R67r52J59P22o30N25l59O4N05j172M87N55
$$ -220 181 -570 275 -185 -258 414 -142 -244 723 -229 -70 652 22 547 188 252 757 -415 72 627
1603F27r06N19n19k13P91n38j32K55J6J99k53m69P75q37K54Q51j148O17J62m73
$$ 627 -279 240 -279 -492 299 -239 -371 -116 -100 99 -154 -623 152 -685 -431 420 -728 -111 51 -422
1623d22N83J3j20J15L2L61k29p05Q21k84l58R12p20j49J07m09M61j24l9K42n52
$$ -422 161 174 54 169 201 562 333 -372 449 165 -193 719 -1 -150 -43 -452 9 -115 -154 88 -464
1644d64L28L27q10Q00l64k42M34J12m68K33O3L49n3l30O27n24K58M13p75N62J88
$$ -464 -136 191 -619 181 -183 -425 9 121 -347 -114 -51 298 245 -85 542 18 276 689 -86 476 664
1665F64p76O46p01R0J03l37O56m72o17J033k85n09Q66o27J4L61m36K70m6l13L32
$$ 664 -112 534 -167 -77 26 -311 345 -127 -744 289 4 -505 361 -266 -252 109 -327 -57 -103 -416 -84
1686h4l55N45M78r73P53Q4l55N76n29k11M63n30N22l94m10M46n54K00O32q12J91
$$ -84 -439 106 584 -389 364 448 93 669 140 -71 392 -138 384 -10 -420 26 -528 -328 304 -508 -317
1707c17M20l28J94j9n8K88n86N92j65l34M78k07k18P79l78l64Q25m01K03l21J39
$$ -317 103 -225 -31 -50 -108 180 -406 186 21 -313 165 -42 -260 519 141 -223 602 201 404 83 222
1728B22K74o02L29L50q19L24K09o66P02n00m29N52j08k85J61k67O58n29n6J060
$$ 222 496 -106 223 573 -246 78 287 -379 323 -177 -606 -54 -162 -447 -286 -553 105 -424 -480 580
1748E80j043N19J46m20M89l77J91J05m19L59J18k58M43k94n04P89p60L23K79l79
$$ 580 -463 56 202 -218 271 -106 85 190 -229 130 248 -10 433 139 -365 424 -336 -13 266 -113
1768a13J50j82n7J88l52J14J89m68M68J06m52M93l3m20O92m30K24j15k64P96o03
$$ -113 37 -145 -202 -14 -366 -252 -63 -531 -63 43 -409 84 51 -369 323 -107 117 2 -262 534 -69
1789f9l19J090j056L07L57k00J7j18j74K30j03L0N9m77P80n61m17Q50l91m11O59
$$ -69 -388 702 -354 -47 310 110 127 9 -165 65 -38 -8 51 -426 354 -207 -624 226 -165 -576 83
1810H3l30Q1L33k75L40j17k11N21o51N03r8l88O48k55l47O8p2K47J65n01L85m23
$$ 83 -247 -166 167 -108 232 115 -96 425 -226 277 179 -209 439 184 -163 -95 -167 80 245 -256 129 -294
1832b94k87P95o28J33M41p01K83M45n37M10m91L08K36n01O89L5p46Q34j89o0J85
$$ -294 -581 214 -414 -281 160 -541 -258 187 -350 60 -431 -123 113 -388 301 336 -410 424 235 175 360
1853C60o51N28m9k88N60m97J9O10j161P85j88m07L44N0Rq5l19N63o40J09N09l45
$$ 360 -291 237 188 -100 460 -37 -18 592 -569 216 28 -379 -35 15 24 -61 -380 183 -457 -348 161 -184
1875a84l26N09k73K92L83m45p2M94l71K86m03M10L21o77L49k37k26M01j35l47
$$ -184 -510 -1 -274 18 401 -44 -116 378 7 293 -110 300 621 -56 293 56 -170 231 96 -251
1895b51N65m25l2J60m25J66M8j4O33q75L58M10o54J77J75K3K99q43O65R0l97M89
$$ -251 314 -111 -143 17 -408 -242 -194 -208 425 -450 -92 318 -336 -159 16 39 338 -505 160 250 -147 342
1917C42oj20L07o70j93O41k61m48M68%Q4m02J09M88n11L62l35k04N17k70j58K00
$$ 342 336 216 523 -147 -340 301 40 -408 60 60 144 -258 -149 339 -172 190 -145 -349 168 -102 -260 -60
1939f0j59o8L77l40J79J4k5M95m39L88K92p75K59L1n16M10l0o3L40m90K30j27
$$ -60 -219 -287 90 -250 -71 -57 -82 413 -26 362 654 -121 138 169 -347 63 33 -30 310 -180 50 -77
1961g7j99Q29p52k23O14l00n6J47J95j30k01J36P6n25O02O6n89P20K0j69L02m83
$$ -77 -276 553 -199 -422 192 -108 -164 -17 178 48 -153 -17 59 -466 136 202 -387 333 353 184 486 3
1983CQ8n7O3L36l36m02O42n61J66J72m57L53p8j67M29l83L54k56n38P99m46l24
$$ 3 91 34 97 433 97 -305 337 -224 -58 114 -343 10 -68 -235 194 -189 165 -91 -629 170 -276 -600
2005f00Q23j87l90P41m98L76O5l90K06J90k49J04m76O23n1l74N83j56n06L36l03
$$ -600 223 36 -354 387 -111 265 330 -60 146 336 87 191 -285 338 287 -87 496 340 -166 170 -133
2026a33J62l7m40N19j91Q5K89n98N48M3o59L21M37n92L58j69J06M0m02N47j34
$$ -133 29 -8 -448 71 -120 -35 254 -344 204 247 -412 -91 346 -246 112 -57 49 89 -313 234 100
2047A00r3K65k26N5L52n78J07Q4j85K67l67J34J98m35J94L14q61P61o2n14L51
$$ 100 7 272 46 101 453 -125 -18 66 -119 148 -219 -85 113 -322 -128 186 -675 86 24 -490 -139
2068a39p0R0J64k94M89j97k89Q25o01JL62m53J48K81k15j33j75p6M91l89m7M71
$$ -139 -209 -119 45 -249 240 43 -246 579 -22 -21 341 -112 36 317 102 -31 -206 -282 209 -180 -227 244
2090B44m35M60l10j62L83k27m5N4m4K7k03j52N26l8kK67n79N01N6k78K02k45J06
$$ 244 -191 269 -41 -203 180 -47 -92 -38 -82 -55 -258 -410 116 78 76 343 -236 265 321 43 245 0 106
2113A06J13j35q2R3l98N70k99r4M94m81K27k87j7J95n4k33N8M9K67r0l03M84k86
$$ 106 219 84 2 95 -303 267 -32 -126 368 -113 114 -173 -190 5 -49 -282 -224 -175 92 2 -301 183 -103
2136a03j23L73J64l82L16l40K92k81j3M40l47R2M71q70M86J77o00K58qj29J98
$$ -103 -226 147 311 -71 245 -95 197 -84 -97 343 -4 88 559 -311 175 352 -248 10 2 -127 71
2157G1k21q9K25k40N12l86k21K83j74j73M83o4P9j7l42K79j94N46K3o15N12J00
$$ 71 -150 -239 -14 -254 258 -128 -349 -66 -240 -413 70 6 85 68 -274 5 -189 357 380 -235 277 377
2179C77k79J03J75m85L64m89K72P4l46O24n88J28P1k65K53pL1J02k64Q7J74l09
$$ 377 98 201 376 -109 255 -234 38 112 -234 390 -198 -70 1 -264 -11 -18 13 115 -149 -62 112 -197
2201a97L82l58N8L31Jj64J26k07J73Jj58J06R3q4K07o62M44J37o02M83j09l41
$$ -197 185 -173 -115 216 217 53 179 -28 145 146 -12 94 187 103 310 -352 92 229 -373 110 1 -340
2223c40N30j85j87Q2k42K17m9m4L95l38L05P5l75L23m0l11M67r4k10K95l85J37
$$ -340 190 5 -182 -100 -342 -125 -174 -218 177 -161 144 219 -156 167 127 -184 283 189 -21 274 -111 26
2245B6R2m79M95k3j83N59m86oR7k06j18K18n44N52m58L89K39n07J82L77m45P37
$$ 26 118 -361 134 111 -72 487 1 -5 92 -114 -232 -14 -558 -6 -464 -75 164 -343 -161 216 -229 508
2267E08l42q5Q3j87J26l27L8N04k34l50O67m68J59jn37L60j16J24L30j16l58J60
$$ 508 166 81 164 -23 103 -224 -186 318 84 -266 401 -67 92 91 -446 -86 -202 -78 252 136 -222 -62
2289f2k92M80k20q0N26n50N55k94l38O31n40L31pm16K50J46k54J69mn5Q4k7N4
$$ -62 -354 126 -94 -174 352 -198 357 63 -275 356 -184 147 140 -276 -26 120 -134 35 31 -24 60 33 87
2312H7j35K39L03k76j97J16k81j55M59n57M38j30k20J62N9K86j21k77K31Kl07
$$ 87 -48 191 494 218 21 137 -144 -299 160 -397 41 -89 -309 -147 -88 198 77 -200 31 33 -274
2333b74M72k1l10K77m77K74K9J30j17K41j34J07k55K55j56k94K10r0j89L62k24
$$ -274 198 177 -133 144 -333 -59 -30 100 -17 224 90 197 -58 197 41 -253 -43 -133 -322 40 -184
2354a84n1K33k20N81o74K46O9J71k54L08m15K73lk30K18K00l03k8O4K14k1k67
$$ -184 -235 -2 -222 359 -315 -69 0 171 -83 225 -190 83 80 -150 68 268 -35 -63 1 215 194 -73
2376g3L71l9l26N1L4j77J17o47N39J50l22M08k43M03P0p54N66nn44N40N7r8k81
$$ -73 298 259 -67 -16 18 -159 -42 -689 -150 0 -322 86 -157 246 316 -438 128 123 -421 119 176 78 -203
2399b03L43j26R1k42M42l55j26M08l43R9j8j01J19k11Q7J7O1J49j72p0L27j07
$$ -203 140 14 105 -137 305 -50 -176 232 -111 -12 -30 -131 -12 -223 -136 -119 -58 91 -81 -151 176 69
2421F9Q1j3k59k6L77k67j30J45r1q4L9Q9j06J33L9O5j15K74j23j82P3j88K04J88
$$ 69 150 137 -122 -148 229 -38 -168 -23 -114 -198 -159 -70 -176 -43 -4 61 -54 220 97 -85 -12 -200 4 192
2445A92l82K14q7l05M61n7n63Q21o13N14j38k48M25n41O1L30p4j24l7RL69l37
$$ 192 -190 24 -63 -368 93 36 -527 294 -319 195 57 -191 234 -307 -246 84 10 -114 -151 -142 227 -110
2467a10J28K70m18L14K3j60pql15M77l48J57L7k63L77j65l66O35j86o1Ql92L93
$$ -110 18 288 -130 184 207 47 40 32 -283 194 -154 3 40 -223 154 -11 -377 258 72 11 19 -373 20
2490B0J39m98Q54m60j96J94j39J75L2j21L26j64J55J49m11J08j09j57J99K7p47
$$ 20 159 -339 515 55 -141 53 -86 89 121 0 326 162 317 466 55 163 54 -103 96 123 -624
2511f24N32j5o1L84k23M42n57L2K74k44Q1Nk38K42l8l10L99MQ4kj92M61m66K2
$$ -624 -92 -107 -168 216 -7 435 -122 -90 184 -60 21 26 -212 30 -8 -318 81 85 169 167 -25 436 -30 -8
2535hPj02j22J98l11J84J35J3R5p0L8j09k30O19j7n33L16j96k3N20n35K14o5P7
$$ -8 -1 -103 -225 -27 -338 -154 -19 -6 89 19 57 -52 -282 337 320 -213 103 -93 -116 404 -131 83 18 95
2559I5J93j83l49M51j77PJ74l32j03L76j43K48k31r3K25m59J74P2l2J61J6j40
$$ 95 288 105 -244 207 30 37 211 -121 -224 152 9 257 26 -67 158 -301 -127 -55 -87 74 90 -50
2581e0J65l37R4K68m03K65k39j05M23k64K16k83o9M23j20j89K58M1o9j07j38K00
$$ -50 115 -222 -128 140 -263 2 -237 -342 81 -183 33 -250 -319 104 -16 -205 53 94 25 -82 -220 -20
2603b0j1P9q7p8K06K0k63J32j28k8L82n03L70J55m35L99l10K7J56j15m0K70nk08
$$ -20 -31 48 -39 -117 89 109 -154 -22 -150 -178 204 -299 71 226 -209 190 -120 -93 63 -52 -92 178 173 -35
2627c5OJ36J34k79Q0J95k23o9L7n1L27l62K26L6k2q2l44J80J48p5n4J74k34M6
$$ -35 -29 107 241 -38 42 237 14 -55 -18 -69 258 -104 122 158 136 54 -290 -110 38 -37 -91 83 -151 -105
2651a05r4p7J58K99k44j8P7Q4k0r5K34k20q5K24M7l31J34l3j49M67l51r0K1L52
$$ -105 -199 -276 -118 181 -63 -81 -4 80 60 -35 199 -21 -106 118 165 -166 -32 -65 -214 253 -98 -188 -167 185
2675A85k91O7r5J91l09K45K03n07L01j0K8l02N20N5k76l03L11J0M5P5k17N2L57
$$ 185 -106 -39 -134 57 -252 -7 196 -311 -10 -20 8 -294 226 281 5 -298 13 23 68 143 -74 -22 335
2698C35m91K31j25j74M08j12j72k17K20K06k4k54K71k03l7q1M9K00N4k9K29j51
$$ 335 -156 75 -50 -224 184 72 -100 -317 -97 109 85 -169 102 -101 -138 -219 -170 30 84 55 284 133
2720A33l1J10k95J90j08N7Q1l00l3J46j20J45J35k00K31j37p1P4j3rp8J1J82j60
$$ 133 102 212 -83 107 -1 56 137 -163 -196 -50 -170 -25 110 -90 141 4 -67 7 -6 -15 -93 -82 100 -60
2744f0l4r7L61k7M1k42K85j3k76K41j81J27J17j58K06k22j05NJ08L2j73K7j22
$$ -60 -94 -191 170 143 184 -58 227 214 -62 179 -2 125 242 84 290 68 -37 -32 76 108 -65 -38 -160
2767a60N17o12P8K57j93J74l52J09K56j19J13k87j90K81J12%J49k09K21n7n7k30
$$ -160 357 -255 -177 80 -113 61 -291 -182 74 -45 68 -219 -409 -128 -16 -16 133 -76 145 88 31 -199
2789a99J99oK35l28K83K7m13P1K55k93M24j46k30L22k83K72j93J06O6m73K22K36
$$ -199 0 -6 229 -99 184 211 -202 -131 124 -169 255 109 -121 201 -82 190 -3 103 169 -304 -82 154
2811A54k73L14k03l1r3j84N90k4m19N57k88l9L10l90j37K34p3R8j48l9O7k91K84
$$ 154 -119 195 -8 -39 -132 -316 274 250 -169 388 100 61 371 -19 -156 78 5 103 -45 -84 -17 -308 -24
2834b4K46l72K62K2q0J08k59m9J96n4M2P1m01M86j49J71J11j64o1j5k01J78O5
$$ -24 222 -150 112 134 54 162 -97 -146 50 -4 38 109 -292 194 45 216 327 163 102 87 -114 64 129
2857A29j82K37k95J01m8k40L34J32m28J16J88L8J29m20j02N32l11J83l59j19N15
$$ 129 -53 184 -111 -10 -58 -298 36 168 -260 -144 44 82 211 -209 -311 221 -90 93 -266 -385 130
2878A30j77J94m7m38M17P4k86N26m39J02o0N8K71k88j10J49j20J76K42n12J05
$$ 130 -47 147 100 -338 79 153 -133 393 -46 56 -4 54 325 37 -73 76 -44 132 374 -138 -33
2899c3r9Q5K14m91M62j27k17L17j83l7O4pJ75J24n48K00L34j65J46l30J64J0J63
$$ -33 -132 -47 167 -324 138 11 -206 111 -72 -109 -45 -52 123 247 -301 -101 233 68 214 -116 48 58 221
2922B21j1j41J59l98K55M6n3j18j8r8ok9j94N11l7k72J73M3k06m0M71m10k3O9
$$ 221 210 69 228 -170 85 131 78 -40 -58 -156 -162 -191 -385 126 89 -183 -10 33 -173 -213 258 -152 -175 -106
2946a06K92j10j16J9m9p2M19j01Pj87q7K22j83j91M56j88p5J20p3K49n4j54J9
$$ -106 186 76 -40 -21 -70 -142 277 176 183 -4 -91 131 -52 -243 213 25 -50 70 -3 246 192 38 57
2969E7o5l11K86L4l6j24n1K70o5k56K67k32O2M12m96M06k64L90Jl51L77k71r1
$$ 57 -8 -319 -33 1 -35 -159 -210 60 -5 -261 6 -226 -164 248 -248 158 -106 284 285 -66 311 40 -51
2992e1J68j47j65M20j93j38K77Rk24K3P6M2p4k19K54R6k68J97m3j6j92J0K58R7
$$ -51 117 -30 -195 225 32 -106 171 180 -44 -21 55 97 23 -196 58 154 -114 83 40 24 -168 -158 100 197
3016A97k47J36j61J17O8l16O05l34j56J4K69o2M5k75L39l54j4L00l30O4K60j18
$$ 197 -50 86 -75 42 110 -206 399 65 -91 -77 192 130 175 -100 239 -115 -129 171 -159 -95 165 47
3038D7J3j74J38mk38K58K51m91O0J19k13N84j86j29M7k46J52R4l57L19J00k04
$$ 47 60 -114 24 20 -218 40 291 -200 -140 -21 -234 350 164 35 82 -164 -12 82 -275 44 144 -60
3060f0j45J86J11j26k76O27n17K83J10j59q1K97M4m42J44J72J07k39L9L4k30J15
$$ -60 -205 -19 92 -34 -310 317 -200 83 193 34 -47 250 294 -148 -4 168 275 36 75 109 -121 -6
3082fQ2m47N72j73k47K48p1M3j94J02p9J45j37J47Pj5J60J10k08l07L45j59j39
$$ -6 76 -371 201 28 -219 29 -42 1 -193 -91 -170 -25 -162 -15 -8 -23 137 247 39 -268 77 -82 -221
3105b21M30k19l04L36N9k45L1R8K7q7j9r4L04k8K5%k09O9j45L29N9n63K54j13
$$ -221 209 -10 -314 22 81 -164 -133 -35 -8 -95 -114 -208 96 68 93 93 -116 -47 -192 137 196 -367 -113 -226
3129b26L38j69m5K09o8k31J51j53n2K41%P5Ok31J19j42K63J68l78K49J23k30P8
$$ -226 112 -57 -102 107 39 -192 -41 -194 -246 -5 -5 70 76 -155 -36 -178 85 253 -125 124 247 17 95
3152I5k96J4M22j08k84J97l58K93j35j05M47m88K54p1o8K81M7j45Q4j20R2O3j85
$$ 95 -201 -187 235 127 -157 40 -318 -25 -160 -265 182 -306 -52 -123 -191 90 137 -8 76 -44 48 111 -74
3175g4n8K63k09J83J01l4J33l67j16K67L7L2j78k31L05k22J74o1j79J76k4K53
$$ -74 -132 131 -78 105 206 172 305 -62 -178 89 126 158 -20 -251 54 -168 6 -55 -234 -58 -82 171
3197A71n34K73J00P2j57K68k03j05L76l31J25J69m62J20L75k99L23o8l66R3k8
$$ 171 -363 -90 10 82 -75 193 -10 -115 261 -70 55 224 -238 -118 257 -42 281 213 -153 -60 -88
3218h8lJ5j73M66j07j47KJ38J05P5k50j68%Q3J6m3K07J09NM5K8m09J30R3j38L7
$$ -88 -91 -76 -249 217 110 -37 -35 103 208 283 33 -135 -135 -52 -36 -79 128 237 242 287 315 -94 36 129 -9 28
3244B8LQ0M0j07J70Q6j90J7K5q0k15L95k79J38j32K82k44p4J44j41pJ84j93N0
$$ 28 31 111 151 44 214 300 110 127 152 72 -143 252 -27 111 -21 261 17 -57 87 -54 -61 123 -70 -20
3268b0J01J4Q3l02K70j67J18j62k07M30l93J48K72m4k92O5Q7k64L51j50N0JNj64
$$ -20 81 95 178 -124 146 -21 97 -65 -272 158 -235 -87 185 141 -151 -86 1 -263 88 -62 -12 -11 -6 -170
3292a70k5J04K70k70j3K71k93L10j85l4j13J14Q9K22j66o4O0l96O48k71k17J86
$$ -170 -195 -91 179 -91 -104 167 -126 184 -1 -35 -148 -34 55 277 111 47 107 -289 359 88 -129 57
3314E7n9J64o5k54K76m01M14m21K78j23J43k15N60k95q7J6J99k28J50j81K27k16
$$ 57 -2 162 97 -157 119 -282 132 -289 -11 -134 9 -206 354 59 -28 -12 187 -41 109 -72 155 -61
3336f1j97M01m61K46K12j28p3n1N2J92j96j92M56k03MJ21l23M49l13J2O0L7j28
$$ -61 -258 143 -318 -72 140 12 -61 -112 -60 132 -64 -256 200 -3 1 122 -201 248 -65 -53 7 44 -84
3359h4J27k02J67j37J20Q4M5R5j17q2n1r3J78K2l07K32m1J58j90K19m95L61J2
$$ -84 43 -159 8 -129 -9 75 120 215 98 16 -35 -128 50 72 -235 -3 -44 114 -76 143 -352 9 21
3382B1k3J30j39j59Q9o6O3J80l12NJ14M60k68j16J05j36j01K02k17j8K29q7k3
$$ 21 -2 128 -11 -170 -81 -147 -84 96 -216 -211 -97 363 95 -21 84 -52 -153 49 -168 -186 43 -44 -67
3405f7K08k99J28k49L82R5m05rK74k28K39k96j26M87o7N3j12n0K93k66j86K93
$$ -67 141 -158 -30 -279 103 198 -207 -216 58 -170 69 -227 -353 134 67 120 8 -42 251 -15 -201 92
3427I2l88K37L88l66J90j33l55M32m47L00kj50L29l82K72J9k1n5r6Q2NK76P5k39
$$ 92 -296 -59 329 -37 153 20 -335 97 -350 -50 -52 -202 127 -255 17 36 15 -40 -136 -54 -49 227 302 63
3451F3j15K23k67k12M77k05j5J25q5RM5o6N0r6J25k9r6J72rj85J43M3n4j23J08
$$ 63 -52 171 -96 -308 169 -36 -51 74 -11 -2 43 -23 27 -69 56 27 -69 103 94 -91 52 95 41 -82 26
3476B6MJ26N9j43j6j24J09l1q0J21q9p3MLL10k84m4K56k07RK39j98k08L03l78
$$ 26 30 156 215 72 56 -68 41 10 -70 51 -38 -111 -107 -104 206 -78 -122 134 -73 -64 175 -23 -231 72 -306
3501c06K46J80m4J03k00Kp5R1K7j12m2K16j20n0j37J50r3K45K22l19k5j1J72j45
$$ -306 -60 120 76 179 -21 -19 -94 -3 24 -88 -130 86 -34 -84 -221 -71 -164 81 303 -16 -41 -52 120 -25
3525b5K90m54R1J3K10j86L72o05L22l01L67m1l15K92m9RJ03L7l01J70j3j36J13
$$ -25 265 -189 -98 -85 125 -61 311 -294 28 -273 94 53 -262 30 -19 -10 93 130 -171 -1 -14 -150 -37
3548c7k7J08j63J59J02Q4m89M21l43K72k6k69K40J08J16m34L68p0j7k63K16l88
$$ -37 -64 44 -119 40 142 226 -263 158 -185 87 61 -208 32 140 256 -178 190 120 103 -160 56 -332
3570c32J80J37O4n5k3P6m17M51n9K6o9o2L85k10j07j39n1L83l80K13Mj16j5J04
$$ -332 -152 -15 49 -6 -29 47 -370 81 22 48 -21 -83 302 92 -15 -154 -205 178 -202 11 15 -101 -116 -12
3594a2l5K28k64N3K12m21J73K65n11R3N44l32k48K53r9K17K6p5k3p6J67k48o2
$$ -12 -47 181 -83 -30 182 -239 -66 199 -312 -219 325 -7 -255 -2 -101 116 142 67 44 -32 135 -113 -175
3617a75J22O8qk4R6j7N1n1p3j98K17J00j34J83J02l46J49J73j08J38j40J2O9k75
$$ -175 -53 15 7 -17 79 62 113 62 -11 -209 8 108 -26 157 259 -87 62 235 127 265 125 137 206 -69
3641f9J23q6J2l0j35L24k21k2K12k04J86j42P7M5J21j28K84l07Q8j68j58L00k86
$$ -69 54 -32 -20 -50 -185 139 -82 -104 108 -96 90 -52 25 70 191 63 347 40 128 -40 -198 102 -184
3664a84J63k6M5p4J98j51K02j52N7k24K66r4N8R7k06k03K99n6k11j68L42J25N
$$ -184 -21 -47 -2 -76 122 -29 173 21 78 -146 120 26 84 181 -25 -228 71 15 -196 -364 -22 103 108
3687A08k55J66L4j72P0J20rO8k08q8N1j04K37m8J32oj12J92j23k82L18j69J25
$$ 108 -147 19 53 -119 -49 71 62 130 -78 -166 -115 -219 18 -30 102 96 -16 176 53 -229 89 -80 45
3710D5j15J91j48J41J07l85J7L31j40q4L9k42O09o36M79j13p6J41q0J91o5k68
$$ 45 -70 121 -27 114 221 -164 -147 184 44 -40 -1 -243 366 -270 209 96 20 161 81 272 207 -61
3732f1k04L40j6J01k12MJ42p3j25kpN13k86k38M47k65P1j40o1J83J14k29P4j74
$$ -61 -265 75 59 160 -52 -48 94 21 -104 -106 -113 400 114 -124 323 58 129 -11 -72 111 225 -4 70 -104
3756a04L32j03k41K39p6m8K16l80Q3M48l72p0OL5K3j23L84j03j81L94l37j62K72
$$ -104 228 125 -116 123 47 -1 215 -165 -82 366 -6 -76 -70 -35 -12 -135 249 146 -35 359 22 -140 132
3779A32j91m3J25p2nk6J83J00k74J89j73K27p3J3j32M3q3J05j95J02J19pM9Ml5
$$ 132 -59 -102 23 -49 -54 -80 103 203 -71 118 -55 172 99 112 -20 23 -60 45 -150 -48 71 64 113 117 82
3804H2k25L23j79J0j46j50L37L7k57K71j96R2k16R6J13J63%j81J55k61m5K24k96
$$ 82 -143 180 1 11 -135 -285 52 89 -168 103 -93 -1 -217 -121 -8 155 155 -26 129 -132 -177 47 -249
3827b49J31J02k21O00n73L48k31K74j64q1P9j30%Q1m0M6J6N6j38m6l6K44q7k02
$$ -249 -118 -16 -237 363 -210 138 -93 181 17 -64 15 -115 -115 -34 -74 -28 -12 44 -94 -140 -176 68 -19 -221
3851b21L91j03N7K8k7q9M76m28J6P9k03k07o3J15L6J06K04j44j03P4jm1N0J48
$$ -221 170 67 124 152 125 36 512 84 100 179 -24 -231 -294 -179 -143 -37 167 23 -80 -6 -7 -48 2 150
3875A50p1j07o8K44k97J97j13l5K91m31K49J45p5k92J24L7o0k2M5PN0n2K55n6
$$ 150 79 -28 -96 148 -149 48 -65 -100 191 -240 9 154 79 -213 -89 -52 -112 -134 -89 -82 -32 -84 171 115
3899A15lk40J79M6k28J26m6J04J1M8k18j1J34p0J72J19n1k04J57p0k92Q7L34k88
$$ 115 112 -128 51 97 -131 -5 -51 53 64 112 -106 -117 17 -53 119 238 187 -17 140 70 -222 -135 199 -89
3923h9K01m0l00M54L3j19J7k43L69l23L16j53l7l04K77J08r7J48m72L18j5p6L8
$$ -89 112 72 -228 226 259 140 157 -86 283 -40 276 123 86 -218 59 167 70 218 -254 64 49 -27 11
3946A1j72K77k11K7K57k9L5j76K32k34j16j00K66L2j67K65k06k45L04r4J05l34
$$ 11 -161 116 -95 -68 189 160 195 19 251 17 -99 -199 67 99 -68 197 -9 -254 50 -44 61 -273
3968b73L63J24j09j91J93j81L76l80K64j21pj78K13j31L62j97l05R4N9J49m00
$$ -273 90 214 105 -86 107 -74 302 -78 186 65 58 -120 93 -38 324 127 -178 -84 -25 124 -276
3989b76M06Q1l15K40j02J2l81J71J65j66J35j18K58j81m6R6K4J74k36L7R0oj80
$$ -276 130 211 -104 136 34 46 -335 -164 1 -165 -30 -148 110 -71 -117 -21 3 177 -59 -22 68 62 -118
4012a18J39l45K68L19j97J06K01l00k76J28o0M13l60J8J97l39Q5M90n61J51R8
$$ -118 21 -324 -56 263 66 172 373 73 -203 -75 -135 278 -82 -64 133 -206 -121 369 -192 -41 57
4033E7q0o3L45j39J68k76N9l64N7J39M2M15m25m5Q2j01l1J82M7Q6k33J04J55m0
$$ 57 -23 -86 259 120 288 12 71 -293 -236 -97 -55 360 -65 -110 -28 -129 -160 22 69 155 -78 26 181 141
4057A41l17M17o34M68l9o0L07r9p7O1m63L17j90J0K39k40J79J87n4o7J48l84K27
$$ 141 -176 241 -393 75 36 -24 283 184 107 168 -295 22 -168 -158 81 -159 20 207 153 86 234 -150 77
4080G7J75l00L62n09K81J27l51J18K11o6o0Q1k38J72l8j55K10n2oj86L2K68l22
$$ 77 252 -48 314 -195 86 213 -138 -20 191 125 65 146 -92 80 42 -113 97 45 39 -147 -115 153 -169
4103a69J09N00n08q1J18J60M7p9J19k35O0O4n1k88M04j47Jm4j00J13J07Mo3q3
$$ -169 -60 440 -68 -149 -31 129 176 97 216 -19 41 105 54 -234 170 23 24 -20 -120 -7 100 104 41 -42
4127d2K62m5q9j50rK1J61L0j65L49k71K68l36j36J43lj27k1K55m8P7K7m6j65O3
$$ -42 220 175 86 -64 -73 -52 109 139 -26 323 52 320 -16 -152 -9 -12 -139 -160 95 47 124 151 105 -60 3
4152Cj01n3m7K29j48J9L0J3J2p9p9K53p8j9R8N4J54l05j64J75j2J65l2k53L91
$$ 3 -98 -151 -198 31 -117 -98 -68 -55 -43 -122 -201 52 -26 -45 53 107 261 -44 -208 -33 -45 120 88 -165 226
4177B26k72J70mm8n6n3j9Q8k93K71Q6l64J70j75L97l8k84p7J19rJ23O4j00Q5l3
$$ 226 -46 124 120 72 16 -37 -56 32 -261 10 96 -268 -98 -273 124 86 -198 -275 -156 -165 -42 22 -78 7 -26
4202b6r6Q6Q3n7Q8Ro6r0n8L56k10j93M20k08M1J37l12K21j83Q8M8J06J28j32l37
$$ -26 -122 -36 47 -10 78 87 21 -69 -127 229 19 -174 246 38 79 216 -96 125 -58 30 78 184 312 180 -157
4227a57J25k7L85m24l0K77m84J47N2j78K70K0R8j93O2L1j68J52k74N67k37j9j88
$$ -157 -32 -59 326 -98 -128 149 -335 -188 -136 -314 -44 -24 74 -119 -57 -26 -194 -42 -316 251 14 -5 -193
4250a93M09j91k14M22k12K1R6k12K05K7n40K47J48K21l07J62l23K70j29mJ19O4
$$ -193 216 25 -189 233 21 42 138 -74 131 158 -382 -135 13 234 -73 89 -234 36 -93 -97 22 86
4272H6k38J68N6J20l9r0j23J36k37J86j02J15K95l92J84j08l05K47L3l3L16l44
$$ 86 -152 16 72 192 153 63 -60 76 -161 25 -77 38 333 -59 125 17 -288 -41 -8 -41 275 -69
4294f9M48m05L3r7L63j99j16K33l09K35k85R5J30J93m01K10l26L25M9j92K12q6
$$ -69 379 -26 7 -90 273 74 -42 191 -118 117 -168 -73 57 250 -151 59 -267 58 107 -85 127 41
4316D1J50k87j44J78o8J34j20m1M97o01L46j15l9O7N1J65k11p5J34o7j11R3m5
$$ 41 191 -96 -240 -62 -130 4 -116 -157 340 -261 85 -30 -69 -2 49 214 3 -72 62 -5 -116 -23 -68
4339f8j29J27J89k50M28l49K06q7k8m5P9j28j8j20nM86k01k13L52l17K50l96K37
$$ -68 -197 -70 119 -131 297 -52 154 67 39 -6 73 -55 -73 -193 -198 288 87 -126 226 -91 159 -237 0
4362@lp2L93l22L2k8lP7j21j62J70J36j41Q7k94J33j04K60p7K44m98M47j58Q2
$$ 0 -3 -75 318 -4 28 0 -3 74 -47 -209 -39 97 -44 43 -251 -118 -222 38 -39 205 -293 154 -4 78
4386G8n4k8j17J78N7n8J83m38K51R5j73j14K74J76l61K5J6j28j87L52K41j64p4
$$ 78 24 -4 -121 57 114 56 239 -199 52 147 -26 -140 134 310 -51 -26 -10 -138 -325 27 268 104 30
4409C0n3J63k92n3L09k24L14l23l9K43r1rk40L05j84K06q5L6Lj77pK25j40L9N0
$$ 30 -23 140 -152 -205 104 -120 194 -129 -168 75 -16 -25 -265 40 -144 62 -23 13 16 -161 -168 57 -83 -44 6
4434FK71j48j67n5L35m32J49j71j62M47r6J23o4O7j07J26Q9j50k59j0K82j97K23
$$ 6 277 129 -38 -93 242 -190 -41 -212 -374 73 -23 100 36 103 -4 122 211 61 -198 -208 74 -123 100
4457A00l24J96L32m48L19k13N4K02j92m0q2R4L83m68K2Q2Q5J26j92k17J72L6j7
$$ 100 -224 -28 304 -144 175 -38 16 218 26 -14 -96 -2 381 -87 -65 17 102 228 36 -181 -9 27 10
4480A0k7k14K51M0m42L45K02n10L89j34K9l0k5J45o1J37k56M33K8j16k57J08K2
$$ 10 -17 -231 20 60 -382 -37 165 -345 44 -90 -61 -91 -116 29 -32 105 -151 282 310 194 -63 45 67
4503F7j25J43J3k60Q8o1j8J95k07l1K73rp1p3O0M6j90K9M9J75O9r0k73M09j57
$$ 67 -58 85 98 -162 -74 -135 -153 42 -165 -196 77 68 -3 -76 -16 30 -160 -131 -82 93 162 72 -201 208 51
4528E1R2j90p1K71k91J16o8K51j79J72k95J62j9oO6j54j07L26o6j74RJ6J93k20
$$ 51 143 -47 -118 153 -138 -22 -90 161 -18 154 -141 21 2 -4 62 -92 -199 127 61 -113 -104 -88 105 -115
4552a15J7q4L72m6k17K98k71j53K53J8j20K39q3k50L18m1l46J46k23K51J98m12
$$ -115 -98 -182 190 144 -73 225 -46 -199 54 72 -48 191 108 -142 176 135 -211 -65 -288 -37 161 -251
4574b51M08j90p7J94n1Q5Rj19M4J81m45M40m6k87J82j89J74j27M9j2Q5J48K24
$$ -251 157 -33 -110 84 33 118 127 8 52 233 -212 228 182 -105 77 -112 62 -65 -16 -28 57 205 429
4597D29l51O4k3k51J30k24N56l49K2j32L03k53J23k92J50L20k97j42L20k46J02
$$ 429 78 142 119 -132 -2 -226 330 -19 3 -129 174 -79 44 -248 -98 222 -75 -217 103 -143 -41
4618d1nO6N4Q8j47j28J4j43J77R2j43J62j40L1J21k23J16j5L5n0j12L96l46L15
$$ -41 -46 20 74 162 15 -113 -99 -242 -65 27 -116 46 -94 -63 58 -165 -49 -64 -29 -79 -191 205 -141 174
4642A74l02L6P7j59J29j88M31j72K16n04L44O3j41K92j08l1k45K21J30l81M33
$$ 174 -128 -92 -15 -174 -45 -233 198 26 242 -262 82 145 4 296 188 157 -88 133 263 -118 315
4663C15l82n1J49m4J7P4k12j85J75j16K93R6l0L0j19j06O2O9k40K63k07J67O0
$$ 315 -67 -118 31 -13 4 78 -134 -319 -144 -260 33 129 99 129 10 -96 -34 35 -205 58 -149 18 78
4686G8l1J37k19j3J52j70q6K48k09L19j05J4j17Lk00J29J28Lq3r6L04n4j56m3
$$ 78 47 184 -35 -48 104 -66 -152 96 -113 206 101 115 -2 1 -199 -70 58 61 -22 -118 186 132 -24 -67
4710f7J54J66j84No7j16L04k08j00j7J54q5KL3j23K31pk0j53n5L50oj62n1j9k4
$$ -67 87 253 69 74 7 -109 195 -13 -113 -130 24 -61 -59 -26 -149 82 75 55 -98 -153 197 191 29 -22 -41 -65
4736f5K24l23L96m61M23k36j07K42j38o8K09R1l23K99Q2k78J26p5K9N5p2K82k71
$$ -65 159 -164 232 -229 194 -42 -149 93 -45 -113 96 187 -136 163 245 -33 93 18 47 102 30 312 41
4759D1J36k02J65k20j71J71j2j58J24L6L7L9K8O5k19L01l65M43k78Q9K03k18p9
$$ 41 177 -25 140 -80 -251 -80 -92 -250 -126 -90 -53 -14 14 79 -140 161 -204 239 -39 50 253 35 -44
4782d4M83l41L75l96J9j19k5J90K32n29M01k19mJ4J89j71J65k10L1P7k7k60k49
$$ -44 439 98 473 77 96 -23 -48 142 374 -155 246 27 23 37 226 55 220 10 41 118 91 -169 -418
4805d18L56J63k25N28k32k68J74j49K22J45r0r3rl7J61j88k22K04l53L83j08N4
$$ -418 -62 101 -124 404 172 -96 78 -71 151 296 206 113 104 67 228 40 -182 22 -331 52 -56 -2
4827bJ2L2j79M3Q6j29J38m1J88n4j55j81r4K67Q6Q6M2ok15q2K73j53K72k39P8
$$ -2 10 42 -137 -94 -8 -137 1 -40 148 94 -61 -242 -336 -69 17 103 145 139 -76 -158 115 -38 234 -5 73
4852G3P6l09J95q5j0J63j38N0J21k01j11K05J35j63j90J65J71k79K43j17r5J21
$$ 73 149 -160 35 -50 -60 103 -35 15 136 -65 -176 29 164 1 -189 -24 147 -132 111 -6 -101 20
4874B0J6J31j71L2n2p2P7j79L15j23J73j71m6L03n48L77M5k46n6L33q0J3k5j28
$$ 20 36 167 -4 28 -24 -96 -19 -198 117 -6 167 -4 -50 253 -295 82 127 -119 -175 158 78 91 66 -62
4898f2m9J19J75k27J79j14k94N29k56m5Lj7J56k47J11O3k0J37m4K5j45P5n8k2
$$ -62 -111 8 183 -44 135 21 -273 256 0 -45 -42 -59 97 -150 -39 24 4 141 97 122 -23 52 -6 -28
4922b8J55j83N1R9p1r0p1K20o1K0nk7K49l83J58K1O0l30L48n3J5M4j01j47L10
$$ -28 127 -56 -5 94 23 -67 -138 82 21 41 36 9 258 -125 33 54 114 -216 132 79 94 138 37 -110 200
4947B00k17J2j76M2K25k32j00N73l04J2r8K30J64l03K18l70J4J75k7p1j30p2P3
$$ 200 -17 -5 -181 -139 86 -146 -246 327 23 35 -63 167 331 28 246 -124 -110 65 38 -33 -163 -235 -162
4970a62J27o5J78j20J02j14J43Ol48J7K76N2n9p2q1J75j1j94K19Q4k83J62j33
$$ -162 -35 -100 78 -42 60 -54 89 95 -253 -236 40 92 33 -39 -120 55 44 -150 69 153 -130 32 -101
4993a01N9j6L68m47j47r4L40J40m9J94l04JJ10j68K28n3q2l2j85K50rm7J32j54
$$ -101 -42 -58 310 -137 -284 -378 -38 102 53 247 -57 -56 54 -114 114 61 -21 -53 -238 12 3 -44 88 -66
5017f6J54M8L4r4l06J63J74o2J14k80J25K50k68J31l7j59J53P7j08j36n8J52p6
$$ -66 88 136 170 76 -230 -67 107 45 159 -121 4 254 -14 117 80 -79 74 151 43 -93 -151 1 -75
5040g5KK65J68l64j18N9Q8n4M2R9r7j3j32J91k27j6K56J12j41P0j29J60k56Q0
$$ -75 -73 192 360 -4 -122 -63 25 -29 13 112 15 2 -130 61 -166 -182 74 186 45 115 -14 146 -110 -30
5064c0K81l8k44L5j31L36l64J64K71m11P1L3k4kJ08L3k37K35J0q7P0J08j50R5
$$ -30 251 213 -31 4 -127 209 -155 9 280 -131 -60 -27 -51 -53 55 88 -149 86 96 9 79 187 37 132
5088A32j0n1J9J12l5j54q1K03k8l46L1K50N8j55j34J0q6J21L13j52k57K67j10
$$ 132 122 71 90 202 167 13 -68 135 107 -239 -208 42 100 -55 -189 -179 -265 -144 169 17 -240 27 -83
5111h3J91j60rq2M5J06j39J72j9L18m08J2J31O7j61k35L10k0J38o0l62L49r7J00
$$ -83 108 -52 -61 -143 -98 8 -131 41 22 340 -68 -56 75 142 -19 -254 56 36 174 114 -248 101 4 104
5135A04q3p9M7m49M34J48m8k3p9Q4k32Q9J43M6J1j31j01R4j92J68n3J7L56q2j94
$$ 104 21 -58 -11 -460 -26 122 74 51 -28 56 -176 -87 56 102 113 -18 -119 -25 -217 -49 -102 -85 271 189 -5
5160ej0l9kJ7M3k0N0K83j36l74lJ74J77j9N5k92J38J00l26L15j01j80K92J2j13
$$ -5 -15 -54 -56 -39 4 -16 34 317 181 -193 -196 -22 155 136 191 -101 37 137 -189 126 25 -155 137 149 36
5185C6K0K9J38k06n2J71j23j53L04k40k89K75L5Kj39l2N3L26k18R3j71K54j28
$$ 36 56 85 223 17 -35 136 13 -140 164 -76 -365 -90 -55 -53 -192 -224 -171 155 -63 30 -141 113 -15
5208a5l0j80J94j69M75l93K35k84J82K70m4m55R7j89M62j81p0K67j71J06J02l95
$$ -15 -45 -225 -31 -200 275 -118 117 -167 15 285 241 -214 -117 -306 156 -25 -95 172 1 107 209 -186
5230a86J84K2k90K1L17j04J63j13k37J22K61k4l9k26J02n8J82j64k62L25%J52
$$ -186 -2 20 -270 -249 68 -36 127 14 -223 -101 160 136 97 -129 -27 -85 97 -67 -329 -4 -4 148
5252A48k17J64M8Om14K89l3n5n3R9r3R0j77J75J97r8J1J9P9m30M22j19j35j40
$$ 148 -69 95 143 149 -265 24 -9 -64 -117 -18 -111 -21 -198 -23 174 76 87 106 185 -245 177 58 -77 -217
5276b17L75k61j16L33p3Q2l2o5o6o1J24j37m1L22j73L2o0j4pk7L0L3r2J23j1R7
$$ -217 158 -103 -219 114 41 123 91 26 -40 -101 23 -114 -155 167 -6 26 -34 -48 -55 -82 -52 -19 -111 12 1 98
5302I8r4K50l42K43O4l03M8j03J93j59j25J15J93j3J60l57K37K5R0j00j07j8J72
$$ 98 4 254 -88 155 219 -84 -36 -139 54 -105 -230 -115 78 65 225 -132 105 130 220 120 13 -5 167
5325A67r7l00K31j87L53l53o8J68K18k09K85J78l38L3k3k75K39N5l04L63k51J75
$$ 167 70 -230 1 -186 167 -186 -254 -86 132 -77 208 386 48 81 58 -217 22 77 -227 136 -115 60
5347F0n9l53L01p6J39L61m01p5j56K58R5P6k48J10j03J09O5q1k31L44P3l57K78
$$ 60 1 -352 -51 -127 12 373 -28 -103 -259 -1 94 170 -78 32 -71 38 103 22 -209 135 208 -149 129
5370A29k34J93j71M4K8n2L5N5M5R3J67j23j58J1j05P3q5P6M5J78j11j94j01O5
$$ 129 -105 88 -83 -39 -11 -63 -28 27 72 165 332 209 51 62 -43 30 -55 21 66 244 133 -61 -162 -97
5394i7q1K91j26LN5O7K9k67K12k3q1J13J13j86O6j44K55j10k06J64o6l7K98j21
$$ -97 -178 113 -13 -10 45 112 141 -126 86 63 -18 95 208 22 88 -56 199 89 -117 47 -19 -56 242 121
5418A21k09J15k80J71P1J9j43N76l69J69k87J00r7J45J50m67N10k47o6J40l39
$$ 121 -88 27 -253 -82 -11 8 -135 441 72 241 -46 54 -43 102 252 -215 295 48 -18 122 -217
5439b17K49R4j86r6K31k12j59M46j42N1k37o3M48m6k12o9k08L44m5j74j7J78j56
$$ -217 32 126 -60 -156 75 -137 -296 150 8 59 -178 -241 207 161 -51 -120 -328 16 -29 -203 -220 -42 -198
5462a98K01K1L20l93K98j68k88k6M29k64J53l6J88P1n24K04j31m4J45RM9J5m1
$$ -198 3 24 344 -49 249 81 -207 -233 196 -68 85 49 237 308 -216 -12 -143 -187 -42 -33 16 31 -10
5485a0J5O7j4m13M50q1L6k38K64N7k5J52j71j62J67k66L84r5j29RJ14k99J12O3
$$ -10 5 72 58 -355 95 14 50 -188 76 133 108 260 89 -73 94 -172 212 117 -12 -3 111 -188 -76 -13
5509a3J55o9l23K43j41K67P7k9n9j20l9j63K71j04J32l49N26k17j17K62j21J4
$$ -13 142 73 -250 -7 -148 119 196 167 108 -12 -51 -214 57 -47 85 -264 262 45 -72 190 69 83
5531H3j42J85j06L6Jj49l5K91r9O0K11k34J23j02N7k31k76N95j45l4k40K20n2
$$ 83 -59 126 20 56 57 -92 -127 164 65 125 336 102 225 123 180 -51 -327 268 123 89 -151 69 17
5554A7j1j9J71j80L6j78j05J41K47k37K77J64j90k23n0L58j57K9k41K48K6k31
$$ 17 6 -13 158 -22 14 -164 -269 -128 119 -118 159 323 133 -90 -140 218 61 90 -151 97 123 -108
5576a08K75j89Q1r7J65k06j57K83j01L38Ll21J67J14l91k07K06K43J17l02K04
$$ -108 167 -22 59 -38 127 -79 -236 47 -54 284 287 -34 133 247 -144 -351 -145 98 215 -87 117
5597A17q0J73j15j74J55J41j38M2J18m11K50k54j29L30K26m82L25j29mJ37N0J1
$$ 117 37 210 95 -79 76 217 79 121 239 -172 78 -176 -305 25 251 -231 94 -35 -39 98 148 159
5619A59j65J13k91K91L6N0k41J13j32J23RJ37k89O0J43k08j8J66p2J46o0K12k07
$$ 159 -6 107 -184 107 143 193 -48 65 -67 56 65 202 -87 -27 116 -92 -110 56 -16 130 70 282 75
5642G5k91J17M2K2k19O8J37m3O3j24Q1j27L82j35l50L66l8k31J46J09ln1l0q3
$$ 75 -216 -99 -57 -35 -254 -186 -49 -92 -29 -153 -72 -199 183 48 -302 64 26 -205 -59 50 47 -4 -34 -117
5666a17Q6K83k81J93jj61L14k87r4J56l12L97j47k19j1K28q0J45K3P2k58L40j08
$$ -117 -31 252 -29 164 163 2 316 29 -65 91 -221 176 29 -190 -201 27 -53 92 115 187 -71 269 161
5689A61j60m7j2L79m38J73K33j93k52J77O5p5K86m60O5o3J8q1L70j45Rr5J71N3
$$ 161 1 -46 -58 321 -117 56 289 96 -156 21 86 11 297 -163 -98 -161 -143 -224 146 1 10 -85 86 139
5713A39j81O2K1m0q9K7Q3l60K39K44K9l02K84n2j87K17R4j85n6k6J00o1l7N6k04
$$ 139 -42 20 41 1 -88 -61 22 -338 -99 145 174 -128 156 104 -83 134 228 43 -13 -39 61 0 -37 19 -185
5738a85j15M05j53J23J68n52K85Q8J61r1j57j43K43P6l56R2N4J07j3n9j46K91
$$ -185 -300 105 -48 75 243 -309 -24 64 225 134 -23 -166 77 153 -203 -111 -57 50 37 -22 -168 123
5760A23j51M9K6n4J80l05J86J12l70M21j35J3j24%J91l61L9J49J76j83k44K74
$$ 123 -28 21 47 -7 173 -132 54 166 -204 217 82 95 -29 -29 162 -199 -160 -11 165 -18 -262 12
5782A2l2O2k08N7P7p8j42J74L31j39j17j51K56o2k83L26k61k26M41n3R4J55k86
$$ 12 -20 42 -166 -109 -32 -110 -252 -78 253 114 -3 -154 102 40 -243 83 -178 -404 37 -16 78 233 -53
5805e3R0j39J21pj08o0K95j12j04K7K5o1p9K77j17J26M5l05PQ6O4J47o7j32L30
$$ -53 37 -102 19 12 -96 -156 139 27 -77 -50 -25 -86 -165 112 -5 121 166 -139 -132 -46 18 165 98 -34 296
5830B96j84L92p10K58o2j11M7n1r2J50j01K65P2m26L84j03K61J61n7m78J0L09
$$ 296 112 504 -206 52 -10 -121 -74 -125 -217 -67 -168 97 169 -257 127 24 285 446 389 -89 -79 230
5852B30j38k58j4P3KK24r7k07K78j21J32pJ48m35R9J83r2J83k1n5k00q4j25J31
$$ 230 92 -166 -180 -107 -105 119 22 -185 93 -28 104 97 245 -190 -91 92 0 183 162 107 -93 -177 -302 -171
5876a71K92j52j82N18o92M71j53L72j31k41J22J3j25k02O19k13n6j74L84k89J9
$$ -171 121 -31 -213 305 -387 84 -69 303 172 -69 53 66 -59 -261 358 145 89 -85 299 10 29
5897B9P7O9m24K62l4j52J17J18K7r6k39J45L07j73j60K62j59j43J01J57Rn7k73
$$ 29 106 175 -249 13 -21 -173 -56 62 89 -7 -246 -101 206 33 -127 135 -24 -167 -66 91 100 43 -230
5920b30L51k26J24j33oJ54j93L45k38J82L10o89J77K92k60P1J17j55J75j87M6
$$ -230 121 -105 19 -114 -120 34 -159 186 -52 130 440 -249 -72 220 -40 31 148 -7 168 -19 27
5941B7O0O8k90J53j0R0o2o1K99k92j3L43j51J8N0l60J66L7p0j19J69J3j74M2K52
$$ 27 87 155 -135 18 8 98 36 -25 274 -18 -31 312 161 179 229 -131 35 72 2 -117 52 65 -109 -67 185
5966A85Pm0k9j17O6r1q5J21k0J57k58J30M7N2j93P0J17j19J49k00K42l32J81q3
$$ 185 192 152 123 6 72 -19 -104 17 -3 154 -104 26 73 125 -68 2 119 0 149 -51 191 -141 40 -43
5990d3K33Qj72J13j39J2n2k42Q4N65m56k69L96L35k72r0j66p3J18qL07k28M6R2
$$ -43 190 198 26 139 0 12 -40 -282 -198 367 -89 -358 38 373 101 11 -155 -228 -110 -118 189 -39 7 99
6014I9pj5J11J72l12N4l78K39l0M11j92k1j20Q2j18J15j16J75J6l90R0L8R8M6
$$ 99 92 77 188 360 48 102 -276 -37 -67 344 152 131 11 93 -25 90 -26 149 165 -225 -135 -97 1 47
$$ [...]
8191a78
##END NTUPLES=NMR FID
##END=
