##TITLE=1H_Pr Q-25
 CDCl3
 8 sc, 
 26.1.2023
##JCAMPDX= 6.0         $$ Bruker NMR JCAMP-DX V2.0
##DATA TYPE= NMR FID
##DATA CLASS= NTUPLES
##ORIGIN= UXNMR, Bruker Analytische Messtechnik GmbH
##OWNER= root
$$ XWIN-NMR		Version 3.5
$$ Thu Jan 26 13:50:39 2023 Russian Standard Time (UT+4h)  she@DPX200
##.OBSERVE FREQUENCY= 200.13135
##.OBSERVE NUCLEUS= ^1H
##.DELAY= (6, 6)
##.ACQUISITION MODE= SIMULTANEOUS
##.ACQUISITION SCHEME= undefined
##.AVERAGES= 8
##.DIGITISER RES= 18
##SPECTROMETER/DATA SYSTEM= spect
##.PULSE SEQUENCE= zg30
##.SOLVENT NAME= CDCl3
##.SHIFT REFERENCE= (INTERNAL, CDCl3, 0, 15.7039)
##AUDIT TRAIL= $$ (NUMBER, WHEN, WHO, WHERE, WHAT)
$$ ##TITLE= Audit trail, XWIN-NMR		Version 3.5
$$ ##JCAMPDX= 5.01
$$ ##ORIGIN= Bruker BioSpin GmbH
$$ ##OWNER= she
$$ F:/spectra/data/she/nmr/H-F/1/audita.txt
$$ ##AUDIT TRAIL=  $$ (NUMBER, WHEN, WHO, WHERE, WHAT)
(   1,<2023-01-26 13:49:37.78 +0400>,<she>,<DPX200>,
      <created by zg, POWCHK disabled, PULCHK disabled
       configuration hash MD5:
       00 E9 B6 7A A2 85 ED C7 34 08 36 98 17 FE 4E 26
       data hash MD5: 16K
       46 97 45 DD D9 0D 5D 7E 0C 38 6E 26 E6 18 E2 33>)
$$ ##END=
$$ 
$$ hash MD5
$$ 5A F6 B2 23 64 5D 19 1F 3C 06 74 DC F0 82 67 CE
##$RELAX= 
##$RELAX= 
##$RELAX= 
##$RELAX= 
##$RELAX= 
##$RELAX= 
$$ Bruker specific parameters
$$ --------------------------
##$DU= <F:/spectra>
##$EXPNO= 1
##$NAME= <H-F>
##$PROCNO= 1
##$TYPE= <nmr>
##$USER= <she>
##$AMP= (0..31)
100 100 100 100 100 100 100 100 100 100 100 100 100 100 100 100 100 100 
100 100 100 100 100 100 100 100 100 100 100 100 100 100 
##$AQSEQ= 0
##$AQ_mod= 1
##$AUNM= <au_zg>
##$AUTOPOS= <>
##$BF1= 200.13
##$BF2= 200.13
##$BF3= 200.13
##$BF4= 200.13
##$BF5= 200.13
##$BF6= 200.13
##$BF7= 200.13
##$BF8= 200.13
##$BYTORDA= 1
##$CFDGTYP= 0
##$CFRGTYP= 5
##$CHEMSTR= <none>
##$CNST= (0..31)
1 1 145 1 1 1 1 1 1 1 1 1 1 1 1 1 1 1 1 1 1 1 1 1 1 1 1 1 1 1 1 1 
##$CPDPRG= <>
##$CPDPRG1= <>
##$CPDPRG2= <>
##$CPDPRG3= <>
##$CPDPRG4= <mlev>
##$CPDPRG5= <mlev>
##$CPDPRG6= <mlev>
##$CPDPRG7= <mlev>
##$CPDPRG8= <mlev>
##$CPDPRGB= <>
##$CPDPRGT= <>
##$D= (0..31)
0 1.2 0 0 0 0 0 0 0 0.06 0 0.03 0 0 0 0 0.0002 0 0 0 0 0 0 0 0 0 0 0 0 
0 0 0 
##$DATE= 1674726577
##$DBL= (0..7)
120 120 120 120 120 120 120 120 
##$DBP= (0..7)
150 150 150 150 150 150 150 150 
##$DBP07= 0
##$DBPNAM0= <>
##$DBPNAM1= <>
##$DBPNAM2= <>
##$DBPNAM3= <>
##$DBPNAM4= <>
##$DBPNAM5= <>
##$DBPNAM6= <>
##$DBPNAM7= <>
##$DBPOAL= (0..7)
0.5 0.5 0.5 0.5 0.5 0.5 0.5 0.5 
##$DBPOFFS= (0..7)
0 0 0 0 0 0 0 0 
##$DE= 6
##$DECBNUC= <off>
##$DECIM= 32
##$DECNUC= <off>
##$DECSTAT= 4
##$DIGMOD= 1
##$DIGTYP= 9
##$DL= (0..7)
0 120 120 120 120 120 120 120 
##$DP= (0..7)
150 150 150 150 150 150 150 150 
##$DP07= 0
##$DPNAME0= <>
##$DPNAME1= <>
##$DPNAME2= <>
##$DPNAME3= <>
##$DPNAME4= <>
##$DPNAME5= <>
##$DPNAME6= <>
##$DPNAME7= <>
##$DPOAL= (0..7)
0.5 0.5 0.5 0.5 0.5 0.5 0.5 0.5 
##$DPOFFS= (0..7)
0 0 0 0 0 0 0 0 
##$DQDMODE= 0
##$DR= 18
##$DS= 0
##$DSLIST= <SSSSSSSSSSSSSSS>
$$ [...]
##$SUBNAM2= <"">
##$SUBNAM3= <"">
##$SUBNAM4= <"">
##$SUBNAM5= <"">
##$SUBNAM6= <"">
##$SUBNAM7= <"">
##$SUBNAM8= <"">
##$SUBNAM9= <"">
##$SW= 18.05172834244
##$SWIBOX= (0..15)
0 0 2 0 0 0 0 0 0 0 0 0 0 0 0 0 
##$SW_h= 3612.71676300578
##$TD= 16384
##$TD0= 1
##$TE= 0
##$TE2= 300
##$TE3= 300
##$TEG= 300
##$TL= (0..7)
0 120 120 120 120 120 120 120 
##$TP= (0..7)
150 150 150 150 150 150 150 150 
##$TP07= 0
##$TPNAME0= <>
##$TPNAME1= <>
##$TPNAME2= <>
##$TPNAME3= <>
##$TPNAME4= <>
##$TPNAME5= <>
##$TPNAME6= <>
##$TPNAME7= <>
##$TPOAL= (0..7)
0.5 0.5 0.5 0.5 0.5 0.5 0.5 0.5 
##$TPOFFS= (0..7)
0 0 0 0 0 0 0 0 
##$TUNHIN= 0
##$TUNHOUT= 0
##$TUNXOUT= 0
##$USERA1= <user>
##$USERA2= <user>
##$USERA3= <user>
##$USERA4= <user>
##$USERA5= <user>
##$V9= 5
##$VALIST= <valist>
##$VCLIST= <CCCCCCCCCCCCCCC>
##$VD= 0
##$VDLIST= <DDDDDDDDDDDDDDD>
##$VPLIST= <PPPPPPPPPPPPPPP>
##$VTLIST= <TTTTTTTTTTTTTTT>
##$WBST= 1024
##$WBSW= 4
##$XGAIN= (0..3)
0 0 0 0 
##$XL= 0
##$YL= 0
##$YMAX_a= 226775
##$YMIN_a= -181775
##$ZGOPTNS= <>
##$ZL1= 120
##$ZL2= 120
##$ZL3= 120
##$ZL4= 120
##$ABSF1= 10
##$ABSF2= 0
##$ABSG= 5
##$ABSL= 3
##$ALPHA= 0
##$AQORDER= 0
##$ASSFAC= 0
##$ASSFACI= 0
##$ASSFACX= 0
##$ASSWID= 0
##$AUNMP= <proc_1d>
##$AZFE= 0.1
##$AZFW= 0.1
##$BCFW= 1
##$BC_mod= 2
##$BYTORDP= 1
##$COROFFS= 0
##$CY= 11.3945322036743
##$DATMOD= 1
##$DC= 2
##$DFILT= <>
##$DTYPP= 0
##$F1P= 2.36226072786647
##$F2P= -0.459571619588291
##$FCOR= 0.5
##$FTSIZE= 0
##$FT_mod= 4
##$GAMMA= 1
##$GB= 0.15
##$INTBC= 1
##$INTSCL= 1
##$ISEN= 128
##$LB= 0.24
##$LEV0= 0
##$LPBIN= 0
##$MAXI= 10000
##$MC2= 0
##$MEAN= 0
##$ME_mod= 0
##$MI= 1.114404
##$NCOEF= 0
##$NC_proc= 0
##$NLEV= 6
##$NOISF1= 3.799351
##$NOISF2= 2.8
##$NSP= 1
##$NTH_PI= 0
##$NZP= 0
##$OFFSET= 15.70392
##$PC= 1
##$PHC0= -19110.94
##$PHC1= 14.00079
##$PH_mod= 1
##$PKNL= yes
##$PPARMOD= 0
##$PSCAL= 0
##$PSIGN= 0
##$REVERSE= no
##$SF= 200.130013532006
##$SI= 16384
##$SIGF1= 3
##$SIGF2= 2
##$SINO= 400
##$SIOLD= 16384
##$SREGLST= <1H.CDCl3>
##$SSB= 0
##$STSI= 0
##$STSR= 0
##$SW_p= 3612.71676300578
##$SYMM= 0
##$S_DEV= 0
##$TDeff= 0
##$TDoff= 0
##$TI= <>
##$TILT= no
##$TM1= 0
##$TM2= 0
##$TOPLEV= 0
##$USERP1= <user>
##$USERP2= <user>
##$USERP3= <user>
##$USERP4= <user>
##$USERP5= <user>
##$WDW= 1
##$XDIM= 8192
##$YMAX_p= 0
##$YMIN_p= 0
$$ End of Bruker specific parameters
$$ ---------------------------------
##NTUPLES= NMR FID
##VAR_NAME=  TIME,          FID/REAL,        FID/IMAG
##SYMBOL=    X,             R,               I
##VAR_TYPE=  INDEPENDENT,   DEPENDENT,       DEPENDENT
##VAR_FORM=  AFFN,          ASDF,            ASDF
##VAR_DIM=   8192,          8192,            8192
##UNITS=     SECONDS,       ARBITRARY UNITS, ARBITRARY UNITS
##FACTOR=    0.0002768,     1,               1
##FIRST=     0,             0,               0
##LAST=      2.2672688,     0,               0
##MIN=       0,             -181775,         0
##MAX=       2.2672688,     226775,          0
$$ Real data points
##PAGE= N=1
##DATA TABLE= (X++(R..R)), XYDATA
0 0 0 0 0 0 0 0 0 0 0 0 -8 8 -8 8 -13 16 -16 24 -31 32 -40 48 -57 71 -81 96 -112 129 -148 169 -193 222 -253
33 -253 286 -321 361 -408 456 -510 568 -634 703 -781 866 -957 1058 -1166 1286 -1419 1562
50 1562 -1720 1896 -2090 2306 -2548 2820 -3131 3486 -3901 4387 -4972 5689 -6593 7770 -9378
65 -9378 11711 -15431 22312 -39400 177833 194130 -40192 153915 163692 17987 -72669 -2600
77 -2600 -26623 -75638 -74766 -87618 -138813 -54582 9704 -34497 -67160 13686 66859 -5858 -73350
90 -73350 -11028 -6616 -55491 -14398 56315 63656 62903 85751 103850 65272 42039 47120 13349
103 13349 -2877 9599 -36603 -83244 -73687 -57298 -88209 -114542 -40742 26782 -11547 -7522
115 -7522 50524 39177 7608 14699 18987 1642 3280 29232 10347 -11152 24516 21841 -14095
128 -14095 2543 29950 29138 13357 14408 25153 -12431 -46916 -29948 -40668 -67195 -52069 -23023
141 -23023 -14336 -21572 -1511 27525 16064 18803 39955 28806 25715 37247 26430 2774 -14917
154 -14917 -8041 -3941 -18988 -2166 20156 13863 13269 9767 -2656 -13315 -20424 -20897 -37771 -48076
168 -48076 -25401 -25387 -32986 -9150 5940 11566 25473 44696 60094 50053 40787 42170 17654
181 17654 -5864 -12003 -19876 -21701 -23607 -21679 -17115 -24301 -13555 -2547 -14930 -8332 3126 -5013
195 -5013 -10946 -12815 -7571 -7319 -10952 8925 19823 17257 32427 38870 33331 29058 19059 14545 1018
210 1018 -14305 -11944 -21981 -30964 -23374 -26273 -25959 -19347 -12412 -220 -477 2557 13495 6189 4743
225 4743 9258 3070 5554 7462 7313 9703 3913 11435 15245 1591 7161 12096 1521 -1764 -4085
240 -4085 -4846 -9120 -19091 -12267 -12569 -18440 -6551 -5523 -6498 3294 5696 9909 8785 6775 15559 7321
256 7321 26 6999 689 -2225 -410 -4068 -661 -2537 -267 7814 -871 1897 9278 -309 -1734
271 -1734 -2024 -4901 -3301 -10450 -7217 -1807 -8305 -1329 3150 -870 5178 4692 4844 7340 1134 4317
287 4317 3269 -4334 1017 -1260 -4704 322 -3342 -635 1056 -3238 3005 194 -2528 3890 -1625
302 -1625 -1414 2756 -1894 424 -833 -2045 3205 -2015 -226 4507 -1973 2835 3029 -3110 1540 -1310
318 -1310 -3559 -1128 -5342 -2290 -2612 -6048 91 -1516 -1151 5044 1293 4208 7045 2235 6097 4350
334 4350 364 2487 -1338 -1492 -2046 -5829 -723 -3719 -6628 379 -3255 -3937 757 -2065 321 997
350 997 254 3420 116 2713 5369 -799 3752 4934 -1331 1626 204 -2674 -1499 -4255 -1673 -2713
366 -2713 -5015 1412 -1451 -2308 2568 -596 945 1435 -1527 3789 2211 290 6039 3885 3077 2838
382 2838 732 1857 -4566 -6297 -1897 -9532 -9059 -3039 -7315 -5220 -278 3015 5174 4059 9812
397 9812 10577 2326 6139 5175 -2816 -941 -701 -1473 -440 -840 4711 2115 -2585 2597 -2453 -7307
413 -7307 -3769 -5630 -6495 -7706 -7135 -1668 -4488 -1746 8823 7304 8181 12013 9399 5557 -334 -1014
429 -1014 -1815 -10821 -4983 2018 -4569 -298 7125 4292 76 24 6033 1065 -5990 3436 748 -11203
445 -11203 -6136 -4655 -10622 -9384 -1865 5702 766 1130 11986 3756 -4463 3174 3954 1198 4394
460 4394 10934 11407 -1125 914 7117 -8317 -10406 1931 -979 -6468 -2870 1986 -5604 -15867
474 -15867 -4342 -386 -12677 -1586 12150 5179 344 4967 8204 -712 -1681 15473 12320 2529
488 2529 15283 14255 -4804 -10966 -7391 -10210 -19851 -12181 3145 -5280 -7635 6392 453 -9738
502 -9738 -1168 10242 8982 1459 12226 17788 -3466 -6137 6389 -3212 -8916 5522 13397 2739
516 2739 -3509 8126 -1207 -25163 -15287 -3607 -14418 -10379 6697 8652 -3015 -1188 13088
529 13088 4824 -3173 16592 20619 5059 4907 9373 -2419 -18043 -12408 -1102 -12071 -9065 11860
543 11860 5297 -7802 -560 1495 -9692 -13520 2137 8308 -4987 2393 13273 -2550 -9181
556 -9181 3026 6142 -1117 2970 18121 10345 -7052 1750 3186 -14541 -10943 3951 2053 -4815
570 -4815 1736 8820 -5456 -13145 422 -2119 -10581 436 9113 2527 -3773 1529 3680 -9426
584 -9426 -6212 9742 4006 -456 9983 8700 -2943 -3806 4895 2685 -5634 5770 12134 -2201
598 -2201 -3412 1399 -5911 -12850 -8835 -330 -3472 -5817 6681 4740 -7849 -2656 3198 -957 -2182
613 -2182 5289 9682 947 -319 7544 -753 -4796 6165 6885 968 1859 6236 1798 -9693 -6851
628 -6851 -2099 -11209 -8598 2597 742 -2668 1088 4587 -982 -4901 4873 5537 -2320 4797 7185
643 7185 -2088 -3049 455 -56 -3777 -824 7199 2387 -2053 3485 -267 -6784 -4220 -1199 -91 -1641
659 -1641 1999 6776 -1913 -2697 3970 -1239 -3898 2066 4200 1548 -2146 2706 1297 -7420 -1614
674 -1614 3354 -3637 -992 4710 2569 -2800 -3199 1783 -1263 -6020 3611 4548 -1080 3827 5363 1358
690 1358 -1240 95 2797 -2045 -2447 4603 -147 -3909 -428 -2266 -3285 -3351 -456 3645 -827 -255
706 -255 3994 -1217 -2422 1113 196 -21 -387 2821 3135 -1970 2115 4168 -2785 -20 2533 -175
722 -175 -145 -593 578 -1851 -4753 21 -1176 -4134 1718 1570 352 2182 1582 2466 105 -1028 2894
739 2894 -1170 -2431 854 -1992 -2094 -1662 -1718 1056 -978 271 3675 -112 -43 2000 -654 -351 -683
756 -683 -378 805 -2101 1059 2423 -825 2304 2491 102 1170 -331 -300 -739 -3602 -1910 -3193 -4232
773 -4232 -1362 -2332 -1165 1314 -100 1980 2180 583 3036 1565 789 1801 -14 1182 806 -497
789 -497 2230 634 -151 1937 -346 211 376 -1659 -789 -2181 -3337 -1801 -3571 -2469 -1284 -2602
805 -2602 -57 238 -232 2651 1468 2439 3748 2288 3643 2288 718 1564 -1153 -979 82 -2119
821 -2119 28 39 -1053 960 -253 -324 549 -1610 -1600 -2458 -3761 -2204 -3848 -2367 -4 -1189 1280
838 1280 3361 2420 4652 4725 3370 3512 542 365 -443 -3249 -856 -1817 -2713 17 -1279 -336 1007
855 1007 13 1397 -127 -1054 356 -2802 -2412 -620 -2421 -934 -85 303 2430 1319 3013 4447
871 4447 1340 1815 1460 -1121 -989 -2059 -1561 -901 -3331 -19 299 -2382 748 1173 -455 887 595
888 595 1142 -200 -1189 1687 -1189 -1844 1522 95 -104 2041 1519 1889 -475 -766 1051 -2925 -2367
905 -2367 717 -2165 -2028 -319 -329 -686 -2736 719 2225 -1344 2808 5040 1086 1609 2583 1224 -820
922 -820 -1582 2622 284 -3425 1405 -349 -5177 -2615 -1535 -1959 -2589 4 4201 -430 -1495 3607
938 3607 -644 -3247 421 1548 846 477 3568 4627 -2064 -799 3336 -1924 -2310 2551 2485 -1265
954 -1265 -2990 485 -2195 -7983 -1294 2452 -3066 368 5142 1703 -2031 -597 2560 -2580 -3595
969 -3595 4853 3119 -1755 2742 3095 -2447 -4705 -425 1900 -3028 -1050 6145 189 -3985 1062
984 1062 1147 -3045 -1714 5040 4813 -2053 1679 4181 -5012 -6147 296 -708 -3313 16 5203 1227
1000 1227 -4691 1133 877 -6622 -1820 3688 282 -1133 2408 4036 -2444 -2842 4710 2182 -823
1015 -823 5895 6119 -275 -2176 -287 -1980 -8008 -4319 1956 -2909 -2782 3399 829 -4300 -2535 1674
1031 1674 -132 -3018 3823 5753 -2201 -893 2438 -1514 -2660 2853 6285 2566 1690 6657 2164
1046 2164 -5217 -1182 -38 -5212 -4162 59 -287 -5321 -3610 799 -4111 -4539 3798 4067 1439 3739
1062 3739 5198 1873 -3086 -248 2028 -2524 97 5698 1636 -786 1197 1004 -2444 -3373 2096
1077 2096 1407 -3266 607 935 -5845 -5472 -2047 -2312 -2953 1383 6990 3578 1561 6163 2547 -1933
1093 -1933 1503 3173 378 -861 1332 1164 -5139 -4658 -9 -3383 -2538 2453 3076 963 -501 618
1109 618 -1322 -6250 -2122 1063 -2615 702 4713 2909 1015 1555 4258 1318 -3 5511 3278
1124 3278 -2051 -168 -1165 -6444 -6913 -4058 -1914 -3864 -890 4462 371 -1870 2718 414 -2459
1139 -2459 -307 2642 2293 -909 2267 3969 -1658 -359 4116 2539 1700 3980 4519 768 -4019 -1892
1155 -1892 -3456 -8826 -5475 -2544 -4654 -3836 -770 1007 -757 -559 4775 3413 923 5567 5170 1352
1171 1352 1556 1961 812 -1364 334 3731 686 147 3586 344 -2709 -2279 -2846 -4165 -6336 -4205
1187 -4205 -2799 -5676 -3337 169 -986 765 4445 5557 5536 4847 6722 5055 251 1668 1154 -2533
1203 -2533 -1624 -845 -1404 -1757 -2038 356 -1326 -2756 711 -905 -3174 -1910 -2234 -2546 -3085 -2099 380
1220 380 -420 1230 4616 3689 4278 5536 4229 3470 1325 367 208 -3212 -2925 -2546 -4700 -3687 -2720
1237 -2720 -2174 -895 -372 1416 1364 -235 1229 442 -1118 331 -550 -324 298 29 2209 2115 2141 3922
1255 3922 2415 1908 2240 149 -809 -1890 -3279 -3285 -4755 -4000 -2353 -2696 -1171 687 1134 2816 2691
1272 2691 2842 3371 1472 1605 1444 -334 94 -467 -575 603 -65 1172 1841 563 1363 378 -1282 -1368
1290 -1368 -2976 -3344 -3148 -4403 -2965 -2481 -1752 1176 1358 2863 4060 3631 4658 3999 2218 2616 553
1307 553 -638 -803 -2324 -1806 -1702 -1943 -523 -1128 -1252 -13 -1493 -757 -942 -2402 -1470 -2250 -2225 -921
1325 -921 -459 828 1971 1827 4224 3546 3064 4017 2237 1491 986 -816 -1277 -2372 -3081 -1976 -2762 -2006
1343 -2006 -1068 -1897 -439 -207 -572 658 171 -323 554 -558 48 871 -109 1107 1107 1290 2145 1657 2654
1362 2654 1925 491 1512 64 -2010 -869 -2233 -2318 -2109 -1983 -542 -1369 -888 1482 256 295 2225
1379 2225 1524 954 645 542 518 -1400 -389 748 -1348 1 1306 422 691 470 577 -96 -1779 -148
1397 -148 -86 -2223 -677 53 -753 -809 -212 1339 251 181 3344 1734 -212 1704 556 -1446 -1470 -387
1415 -387 -547 -1965 -357 1443 -1378 -1228 1144 -303 -853 419 1388 641 -849 883 1501 -1892 -771
1432 -771 1596 -13 -412 1242 1841 -228 -1237 916 -116 -2664 -19 1458 -832 -871 527 437 -2047
1449 -2047 -1613 1741 -442 -1222 2377 1380 -1159 -266 1128 4 -1843 779 2491 -548 -451 2054
1465 2054 -687 -1922 -206 821 -462 -1179 1636 1410 -2030 -334 827 -1721 -1522 1320 1223 -612
1481 -612 -243 1837 -574 -3015 367 1044 -1311 494 2479 934 -1366 -199 1019 -1592 -1719 2073
1497 2073 1209 -787 1167 1186 -740 -2112 496 1296 -1530 1010 2932 -359 -1348 -76 -1062 -2311
1513 -2311 -1494 1411 594 -1364 1275 1560 -2272 -1376 586 -328 -124 1328 3091 466 -801 1580
1529 1580 -718 -2311 779 2050 492 968 1824 528 -2433 -1587 225 -2318 -1563 1433 643 -1415
1545 -1415 -1166 -294 -1531 -3035 360 2183 -134 1694 3079 343 -1027 -298 662 -826 -522 3446
1561 3446 1974 -702 1282 871 -2413 -2132 -136 206 -1230 89 1814 -2111 -3205 -356 -1617 -2591
1577 -2591 433 2599 1642 581 2290 1885 -2218 -784 2115 -179 -337 2287 1608 -342 -1657 255
1593 255 -795 -3009 510 1868 -786 -145 951 -491 -2976 -2142 364 -942 -1386 2768 2183 -565
1609 -565 558 1881 -62 -980 1356 2412 -465 -292 1689 -1182 -2533 -498 -329 -1265 -667 1991
1625 1991 1612 -1384 383 1389 -1425 -1218 947 288 -527 213 1682 249 -1809 866 1093 -1297
1641 -1297 550 1959 421 -1112 -322 212 -2309 -2207 707 -454 -1107 679 1140 -114 -329 1023
1657 1023 1025 -416 448 2158 -282 -615 695 -152 -848 -618 718 448 -863 954 927 -1269 -610 72
1675 72 -659 -1237 -650 286 -434 -1197 662 -95 -821 632 1350 443 1009 1073 1199 -176 -146 1024 -782
1694 -782 -960 502 -110 -706 -278 14 68 -833 -509 564 -764 -291 170 -599 -503 -203 -65 163 -263 656
1714 656 1170 8 846 875 396 631 -83 320 122 -677 241 -414 -913 120 -222 -720 130 187 340 -134
1734 -134 -481 524 -514 -535 235 -543 -432 115 -334 -159 -26 199 732 -446 72 452 -102 462 387 63
1754 63 191 -385 217 413 -388 389 311 -115 418 -178 -427 -30 -767 -313 -356 -919 -23 -774 -467 -151 -429
1775 -429 -90 118 115 361 114 295 649 220 790 660 110 613 -3 -240 304 -511 -185 143 -563 70 -236
1796 -236 -571 91 -714 -248 -291 -405 157 -40 -536 458 21 222 596 168 590 458 235 866 387 -108
1816 -108 709 -301 130 30 -472 243 -632 -495 -117 -528 -292 281 -288 147 -106 -247 87 -277 252 821
1836 821 -236 784 143 -367 331 50 299 241 44 490 78 -275 571 146 -493 -290 -288 -194 -235 -407 252
1857 252 -394 -161 594 -209 -120 704 265 210 -150 311 436 -594 5 131 -834 -212 126 -14 189 -533
1877 -533 258 -54 -983 91 308 -617 -12 -21 -34 -231 123 1206 -60 87 1568 455 -535 145 56 -513
1897 -513 -821 -56 43 -672 -718 435 -767 -995 -96 -217 -481 -46 843 296 -681 143 957 -593 199 1129
1917 1129 886 64 470 802 35 -956 633 -51 -1029 -292 -43 -830 -1165 -652 -113 -1188 -727 1094 172
1936 172 -316 1094 394 -275 -288 744 719 -291 704 1258 -236 -163 681 -400 -234 206 633 129 -482
1955 -482 114 -530 -1767 -714 -176 -837 -278 278 733 32 -526 863 38 -775 1100 882 346 134 812
1974 812 -109 -1483 -424 282 -795 -88 1275 241 -396 175 -83 -991 -832 210 743 -454 440 913
1992 913 -510 -785 -110 44 42 163 1650 545 -707 232 -388 -1369 -799 533 632 -53 768 1265 -744
2011 -744 -968 645 -510 -778 1199 1103 132 -367 522 -76 -1607 -248 838 -306 255 1430 470 -880
2029 -880 -903 -93 -885 -1164 689 951 -637 200 814 -567 -1271 -175 891 141 330 2039 527 -875
2047 -875 -55 -117 -1059 -785 707 970 -302 79 1186 -1080 -1520 127 -255 -682 -59 1051 55 -1102
2065 -1102 87 196 -1381 -139 1087 639 249 1022 979 -364 -946 451 255 -749 979 1281 -522
2082 -522 -500 118 -138 -1524 -782 1214 84 -725 747 426 -951 -708 292 57 -879 404 1270 -371
2100 -371 -113 830 -211 -966 249 809 197 -363 955 496 -1148 -311 649 -462 -326 293 583 -264
2118 -264 -390 604 -224 -1118 181 471 -246 -74 425 -111 -1046 -341 553 -315 -432 741 163 -125 221
2137 221 541 205 -482 391 782 -338 59 671 -386 -480 -201 -340 -404 -278 200 524 -440 10 49 -654
2157 -654 -254 -170 164 -131 -155 602 -145 -567 276 346 -62 518 600 632 -176 182 471 -599 -482 243 -497
2178 -497 -400 220 -149 -121 -407 6 29 -647 136 382 -257 461 74 63 -138 29 240 266 69 603 394 9
2200 9 -68 26 122 167 -203 72 -365 -391 -76 -562 -599 -29 -254 208 176 302 610 125 318 472 -208 -213 316 -65
2224 -65 -17 -4 -150 227 -231 90 -100 -362 292 -256 -529 -376 -801 -423 -308 -238 185 350 147 961 976 641
2246 641 842 489 463 170 -223 -114 -387 -676 -428 -816 -658 -633 -618 -350 -116 -200 -219 -67 169 297 -278 232
2268 232 191 120 587 653 676 826 668 606 320 459 107 -201 -572 -354 -813 -787 -728 -743 -643 -431 -437 63 127 261
2292 261 361 315 596 419 417 560 289 123 158 276 227 211 141 183 -115 -118 -59 -351 -237 -350 -539 -227 -871 -674
2316 -674 -133 -315 81 178 81 525 546 634 782 545 593 160 23 -27 -199 -356 164 -248 221 0 175 94
2338 94 -156 -141 -152 -754 -348 -525 -553 -234 -159 -13 128 48 702 543 258 763 537 298 5 41 253 -330
2360 -330 -521 22 -122 -370 33 3 -271 -89 -397 -253 -379 -245 190 -141 -272 357 137 81 146 784 934
2381 934 529 635 420 -174 -124 -130 -547 -800 -655 -123 -714 -715 -94 -150 -515 173 359 170 309 444 562 248
2403 248 171 485 -140 9 829 571 -8 319 365 4 -679 -222 48 -699 -422 356 -471 -732 -357 -176 -333
2424 -333 -334 664 675 226 731 880 15 175 309 176 -56 193 588 85 -456 -97 -119 -572 21 -149 -62 -174
2446 -174 -144 -290 -729 -608 48 -675 -372 851 538 548 507 389 157 -365 272 608 -86 150 377 -109 -511
2467 -511 -583 -150 -227 -335 338 312 -84 98 105 -718 -658 -210 96 -319 -96 661 -194 -167 567 229 -70 389
2489 389 893 585 -310 -48 431 -874 -502 215 -216 -400 198 341 -225 -375 45 49 -965 100 831 68
2509 68 110 654 40 -546 -279 625 -164 -162 652 351 -190 -7 127 -398 -587 -142 419 -109 -438 685 -153
2530 -153 -477 76 356 443 75 611 734 -311 -444 95 -484 -348 157 263 -222 -215 238 -279 -617 -30 72
2551 72 -623 -34 361 51 -230 -291 259 -295 -155 694 396 -142 647 547 -218 -665 6 35 -608 -173 535
2572 535 -278 -655 -69 -80 -359 -308 429 514 -392 381 455 -408 -264 254 90 -59 -62 517 4 -767 341 -54
2594 -54 -557 -5 306 -175 68 312 463 -254 -343 203 177 -341 147 232 152 -405 -33 -141 -606 137 419 -256
2616 -256 -187 534 27 -176 -263 -20 -95 -133 524 626 132 203 572 -188 -8 102 88 -45 -25 230 -141 -344
2638 -344 183 -32 67 -17 35 2 -102 13 -5 -150 -180 283 -77 129 174 -48 62 -213 407 122 -243 103
2660 103 577 -58 42 436 -138 -165 -492 -69 -58 -127 -203 146 -158 -440 -159 -263 -312 38 285 154 -15 447
2682 447 237 -104 170 -171 251 358 103 32 -54 108 -59 2 -185 -86 -269 -180 -462 -580 55 -361 -220 488
2704 488 -189 215 254 -12 441 84 265 -137 -15 -156 72 -267 46 -180 -54 -108 28 87 -147 -60 90
2725 90 -120 -234 -50 -35 -125 -156 238 95 69 -12 570 -10 196 169 254 -219 -124 179 -167 -142 69 -39 -316
2748 -316 196 -137 -73 240 -27 80 -36 26 128 109 2 342 99 -2 72 -88 354 44 -105 29 269
2769 269 -37 72 -162 1 -181 -114 -194 -175 -63 -254 -157 -263 -247 -229 222 -99 195 112 -229 194 11 -56 248
2792 248 56 345 186 124 134 107 -73 -60 0 -122 167 -408 -255 -217 -298 -214 -229 233 128 -249 -41 -15 417
2815 417 -76 190 163 -5 205 44 141 173 -19 155 -103 -61 -39 28 30 -173 210 -279 -368 240 51 -239 -61
2838 -61 69 149 3 -65 299 250 -27 435 -66 -1 8 -261 111 85 112 -19 -311 -251 40 -401 132 -83 -163 296
2862 296 -192 138 87 -74 92 205 -170 -20 210 169 212 171 436 -28 -187 168 96 -191 23 58 -79 -164
2884 -164 -122 76 -198 2 239 10 128 252 -106 168 -174 -142 -39 -373 -129 -120 -162 -138 112 -364 -129 27
2906 27 34 -49 -72 92 206 24 -181 -170 -209 163 75 216 397 -72 315 -149 129 497 -276 -156 70 26 20 -67
2930 -67 57 56 -46 62 200 -44 78 138 59 -155 -227 -106 -317 -129 417 -62 -114 28 238 219 86 129 156
2953 156 -120 58 403 33 -407 -191 62 -135 -122 288 -46 -135 68 -5 -257 -81 172 272 -85 -94 150 145
2975 145 -360 188 335 14 -147 263 193 -363 218 88 -153 -229 102 36 -166 369 38 -115 -55 -96 28 -289
2997 -289 158 406 -18 -16 241 209 142 -212 199 -34 -60 45 144 -267 -107 13 -169 -152 60 468 68 27 -84
3020 -84 163 -242 97 312 -79 -47 136 469 -23 -119 73 -126 -167 -4 85 -204 106 89 -52 -118 116 380
3042 380 -280 -90 492 189 44 70 301 -50 -321 38 232 49 -194 -256 -111 -235 212 -53 -56 166 321
3063 321 -49 -217 -146 79 -368 45 50 92 -84 -137 352 -31 70 291 206 1 77 273 -103 -207 107 243
3085 243 -352 57 256 -213 -198 -171 82 23 8 -79 226 -241 57 396 -154 -212 147 80 -357 1 228 -60
3107 -60 -28 171 32 -75 2 -22 108 -121 244 268 -242 -68 69 -229 -92 -49 -31 127 149 93 -205 -534 -75
3130 -75 -250 -174 121 190 146 -119 170 -160 -97 38 355 111 -10 243 389 -322 -269 -222 -101 119 -70 187
3152 187 -6 -107 335 61 -15 -54 -353 -8 -83 5 97 -424 227 236 -136 136 111 52 35 -4 26 -89 -237 -133
3176 -133 23 93 113 27 -41 -5 -272 17 184 -11 -93 -31 -131 245 237 78 52 139 -222 -160 -129 75 -89 -598
3200 -598 -257 87 -166 -229 175 164 -187 243 -1 -89 248 -111 -56 64 -205 -291 223 -21 62 -95 81 163
3222 163 -61 -122 -182 83 85 -139 -99 -173 -124 -278 30 173 -22 140 -209 264 95 89 -51 19 -99 -124 -4 99
3246 99 -214 -120 168 -32 -72 -93 -232 51 2 -60 62 155 251 -147 26 302 64 102 -19 -179 -193 150 140 353
3270 353 310 4 180 68 -94 281 -257 -31 86 -132 258 166 20 66 -90 -171 -46 -192 39 28 -128 -91
3292 -91 -143 57 -32 -78 174 -260 51 -104 8 163 -18 -63 -151 157 137 193 207 -88 -137 -5 57 27 -23 38 -90
3317 -90 -154 -43 -70 -150 -76 -221 76 -565 -226 -304 37 -39 -138 -90 -37 -228 166 -66 -7 189 188 9 63 184 -253
3342 -253 -109 -133 -138 98 25 -43 127 -232 276 -94 65 -40 -300 -31 108 -94 123 41 40 118 -146 -120 26
3365 26 -20 -222 111 -181 -55 -128 -28 44 286 192 47 122 227 7 2 14 32 23 -158 -32 -185 -182 -12 114 -18
3390 -18 -202 -188 -150 76 98 194 62 -32 -46 -36 -1 92 136 -95 91 3 -13 15 102 24 38 -4 -38 14 36 224 -251
3417 -251 210 40 53 -3 -19 -17 -199 111 159 -102 -227 92 -155 51 14 249 17 20 62 141 -155 -193 232 112
3441 112 78 -84 37 193 -129 44 -42 -127 -43 136 161 -35 11 -49 -227 73 -127 -302 -225 -150 -35 25 90 -14
3465 -14 -44 -13 163 178 -48 108 -237 129 -44 -233 -189 -88 15 -16 256 -56 -53 138 -149 -206 62 -56 -64 79
3489 79 152 14 -111 178 281 160 -124 85 -21 113 -238 127 -295 -41 -65 10 -21 20 174 251 249 80 -132
3512 -132 -121 -108 183 -151 30 -60 -256 -181 -38 12 -68 -202 35 65 -129 -144 15 -208 -32 -218 203 88 135
3535 135 333 -192 -77 115 -39 -214 75 183 30 -2 -90 -104 -348 -235 -10 -106 -5 -146 -57 17 16 78 93
3558 93 -279 176 -118 63 124 170 297 -146 -14 128 310 -78 -27 54 -105 221 -243 -29 165 -152 -110 -216
3580 -216 -226 411 95 -163 -102 325 27 191 -39 -23 -318 -18 -12 -367 -87 -15 102 -26 335 163 236 -61
3602 -61 244 318 183 -92 111 -34 -205 11 43 75 -172 96 86 -136 82 -154 5 39 57 -41 -46 108 68 7
3626 7 12 -136 200 -36 -21 271 195 75 -4 -54 -59 -26 77 -131 -48 -182 -169 -5 -22 61 104 -251 264 -105 -112 -88
3652 -88 215 -230 153 80 38 -30 -75 11 58 -46 213 -23 -53 -142 41 59 -88 12 76 -8 -16 175 101 -241 -219
3677 -219 134 -8 22 -88 -50 152 211 -83 90 118 -154 262 111 -37 89 90 89 -207 221 -81 68 -60 -37
3700 -37 -334 -85 105 135 279 170 119 24 -11 -293 -68 -5 -15 237 14 72 -21 -70 -30 69 -50 241 -44 132
3724 132 59 -263 -41 34 -69 -40 -126 179 -68 -21 84 50 -18 -276 112 181 -12 19 63 -77 308 39 98 70
3748 70 -41 -11 -132 56 -30 -25 -189 155 7 -161 89 57 -287 234 -174 -73 244 -56 187 -216 -45 22
3770 22 17 -53 99 -38 284 -77 -157 -184 -49 -356 -48 -19 -254 136 -11 203 143 -139 266 -149 -253 251 -19
3793 -19 -34 -233 -69 -93 42 -95 292 -185 159 -44 -105 -122 -76 -188 203 -44 75 -227 -157 -182 -64 52 33
3816 33 77 114 -4 -50 41 -187 28 125 -95 60 96 -146 -117 -110 82 -103 -213 -25 117 -6 107 -52 137
3839 137 -188 -13 -39 -77 -88 -168 -62 34 -68 -57 -1 -71 -3 142 -137 132 -12 -93 37 -118 79 100 58 104
3863 104 146 58 -60 -188 -231 -26 -106 109 -112 87 -153 -121 25 -103 -174 -73 417 -246 2 -128 62 118
3885 118 170 139 125 158 73 18 130 -93 137 66 -129 -308 140 78 -42 119 34 -58 -31 -104 -91 -41 -147 -40 63
3910 63 -74 -118 208 -227 -194 153 168 -14 37 -47 -174 -358 -210 -23 173 104 109 158 43 -81 35 -153 -108 220
3934 220 -211 -94 -136 217 -198 -195 167 60 96 -27 64 -182 101 -51 -303 -82 28 72 281 12 190 -39
3956 -39 -241 -81 -173 -92 144 -191 -79 -11 63 -138 -56 -94 -126 -85 -212 23 110 -92 -246 -2 122 -181 92
3979 92 -16 0 23 -139 -60 7 -2 -278 136 -50 72 251 33 -37 -58 80 -60 6 337 -29 -131 -8 -266
4002 -266 -242 -316 -28 -50 -111 -122 296 -184 -105 -182 -52 -156 -182 41 -15 153 148 149 -158 -225 219 -113 -46 175 -214
4027 -214 -96 -94 111 11 86 -32 -16 110 171 62 -230 -15 -325 52 -231 117 -12 105 -356 112 -213 438
4049 438 -53 49 373 90 189 64 48 -51 85 37 -10 283 188 -49 -42 -88 -8 -313 -440 -41 94 63 177 -75
4073 -75 34 -62 267 157 -122 -27 89 23 -408 142 148 -38 -140 64 -149 -103 -7 -12 57 182 139 -81 -280 219
4097 219 -153 -127 40 87 110 -233 69 -32 139 -215 -113 -28 23 -221 246 -55 -130 -154 218 -74 -159 280 256
4120 256 -131 368 -33 51 21 32 -4 -52 -82 -267 -78 -233 191 5 59 -323 -97 -163 -439 -12 123 -212 94
4143 94 321 -367 73 -18 76 -26 -167 176 -182 -133 91 56 221 -31 -43 281 -72 -303 15 -132 -250 17
4165 17 -205 131 76 -75 -8 -5 -209 -68 -143 159 -218 -20 58 19 -127 24 171 127 -29 66 104 -102 -109 46
4189 46 -81 34 -261 -40 -72 -175 -135 -130 -48 -84 42 10 -64 251 -183 135 -19 90 62 178 372 -66 14 135
4213 135 98 -89 23 -15 76 56 -171 7 -58 122 159 -84 32 149 -204 51 -99 -60 60 251 -94 38
4235 38 78 44 -268 -270 37 -197 20 40 -27 -36 2 20 375 291 -58 208 22 103 -2 119 -14 132 39 -56 23
4260 23 -82 -83 -33 -248 24 -34 -116 53 -147 -188 124 16 -97 -80 73 -20 48 71 70 615 45 -174 -46 142
4284 142 162 217 -236 -188 -89 112 148 -95 10 279 113 -92 34 -17 214 -28 -28 -188 1 105 101 139 103 161
4308 161 195 67 141 158 -56 -76 -88 95 -27 157 20 -222 -63 25 33 -95 67 161 -149 4 81 -35 -13 -13
4332 -13 34 29 1 -91 349 -169 -65 3 -124 262 -7 318 7 -376 155 -33 174 -123 -2 -172 -176 -4 -109
4355 -109 199 -10 85 -121 -209 22 -140 62 117 -81 -167 -48 -63 -217 -88 201 34 -69 -122 85 148 -248
4377 -248 -147 -119 232 113 80 117 -60 54 124 -192 -199 -244 387 43 -188 -78 -172 -318 133 -67 -240 -142 12
4400 12 269 48 61 275 -81 30 211 25 78 -8 -88 -208 -21 -187 67 35 -140 94 -225 133 113 -62
4422 -62 -203 -143 236 -33 -88 175 -10 -39 -38 -196 -67 -38 -237 -16 154 -162 107 170 180 5 -99 0 -266
4445 -266 -28 -25 -334 16 -85 77 -141 84 126 -149 102 91 57 -90 -208 -27 -137 -55 199 -43 40 -205
4467 -205 -56 -132 -170 60 142 139 160 -181 -39 -166 -20 17 -252 -42 128 158 -4 81 139 -77 -182 -44 -71 24
4491 24 -103 31 -39 69 -301 -16 -102 313 -128 48 -108 -65 85 -240 153 123 255 86 -138 109 -219 3
4513 3 120 -292 -233 77 -97 -307 100 -82 -97 -215 -19 16 -123 -25 -57 60 -328 -104 -90 260 -14 24 148
4536 148 -99 252 -90 86 -35 -128 -12 -206 53 -17 41 -171 113 -121 54 89 63 88 43 -187 -133 126 -86
4559 -86 -87 -26 -147 20 12 77 -60 -133 0 33 187 151 -50 56 -104 17 -24 115 65 -122 -78 227 93 -21
4583 -21 -134 135 102 -192 -69 30 -161 7 -108 129 -159 -144 63 198 -14 45 95 29 -165 150 116 -1 217
4606 217 73 28 -228 -120 -255 6 -72 371 181 -41 -239 -58 -2 -333 270 -181 -54 23 72 -79 -166 103
4628 103 -41 65 136 17 -131 6 117 79 -93 313 -3 110 -52 26 278 -252 172 138 16 205 -55
4649 -55 -199 104 -104 82 51 -75 -110 5 -96 -20 -86 -217 -36 42 11 116 46 234 189 143 342 289 105 -100
4673 -100 138 -7 -73 -92 137 -67 137 -65 66 -16 -190 -268 -166 -166 -50 -11 -121 -85 36 -13 -65 -215 -81
4696 -81 127 -157 -127 -274 39 -79 283 120 25 -202 166 -125 -229 107 -175 -152 262 -56 77 -67 -186
4717 -186 -4 -235 -32 191 -10 -25 152 -73 -98 143 -55 -181 -77 -198 89 -182 317 203 -154 119 176
4738 176 -72 115 160 -80 -349 -119 53 -263 -63 -120 -112 45 -62 -9 155 38 -99 -29 -45 -199 344 -138
4760 -138 -3 91 -39 46 193 -12 41 153 -53 117 -169 -211 -170 218 216 -21 30 153 -339 113 -242 -98 84
4783 84 19 24 72 148 65 254 232 58 54 87 35 -192 -72 292 175 74 -69 -27 -12 29 83 390 -89 -37 -202 -336
4809 -336 180 -145 97 77 67 -41 -258 -96 -222 -43 82 43 109 -208 34 -207 187 55 -148 101 -295
4830 -295 183 211 -195 202 376 -51 -176 161 -50 3 23 -61 -112 271 175 -181 -152 -40 -263 265 -128 324
4852 324 39 -112 -112 288 -123 -119 28 -12 32 23 -70 139 -26 230 31 -98 -58 -3 138 -30 -170 -179 80 23 65
4877 65 -268 23 -33 -68 66 41 -112 256 -21 56 70 -66 20 247 69 63 30 -220 57 182 245 110 -23 -131
4901 -131 -81 -169 192 187 164 -16 36 318 85 -292 -152 -265 43 -254 -30 -205 -304 -223 99 173 58 67 -5 24
4925 24 19 139 65 -128 -127 197 -172 84 -12 -83 -85 90 146 247 -321 113 -116 -256 -274 -185 -103 -248 132 -103 78
4950 78 -103 290 -44 -63 187 103 -88 -162 -176 -55 -29 312 132 139 191 243 -91 -133 -231 -165 -99 142 47 -180 -23
4975 -23 -82 -211 -193 -12 -86 193 -1 -234 -3 20 -111 -143 -9 -248 65 167 -85 -169 -268 305 -127 101 68
4998 68 82 67 -277 82 23 -327 1 157 -72 -252 167 -336 -348 106 163 -133 -34 150 -101 -80 -17 144 -173
5021 -173 -58 128 -148 92 -73 353 -57 -15 229 -28 -70 -5 -41 -14 167 127 98 -63 39 115 180 149 -124
5044 -124 47 371 -157 72 -41 69 -78 443 97 32 15 -143 -178 -96 91 9 264 154 96 -65 -319 136
5066 136 -331 -209 -74 -158 -101 -118 154 -142 59 81 336 -71 -158 -5 157 -211 40 -215 -56 86 -90 -28
5088 -28 -156 -185 122 5 -197 227 -294 134 -176 4 -101 18 -249 24 61 -253 -132 151 38 12 115
5109 115 15 165 -231 -63 131 61 -104 13 -60 210 -308 -171 96 77 23 -145 163 231 65 -206 68 74
5131 74 -188 -149 -67 26 127 -195 135 -283 -1 -118 21 85 -213 11 -123 -71 157 -122 -135 43 -94 -283
5153 -283 104 36 70 -50 9 -108 -61 -354 330 14 -140 199 -109 -22 61 -29 -75 22 35 -161 -110 76 118 267
5177 267 36 95 -54 -76 -81 93 -14 -89 452 -44 59 32 193 -71 -59 -67 26 79 148 71 30 -12 -248 -201 -45
5202 -45 -116 -132 220 -95 -183 -12 17 160 -33 -144 1 59 -24 250 115 70 245 41 41 -152 -6 321 -210
5225 -210 -14 10 -114 44 178 29 124 -401 328 255 -190 225 -79 -35 -76 43 64 -177 -126 -201 -270 15 187
5248 187 -77 79 -162 108 69 -8 24 258 27 70 -132 81 -39 202 -132 103 -374 -114 -1 -161 -183 -91
5270 -91 -52 75 8 -119 75 44 -39 9 -29 59 -101 224 -119 -21 -44 145 360 -94 15 -21 291 191 20 7
5294 7 -125 -28 1 -24 -111 -5 84 204 191 157 22 -408 232 126 -130 -44 86 -150 91 -80 47 -204 10
5317 10 87 -153 -85 -15 106 -105 -199 -161 -76 -80 -28 81 53 -45 12 -59 -132 -132 -172 -81 -42 403 107 -64 104 -52 36
5344 36 276 -181 186 169 152 -194 -47 -81 124 -231 -28 -9 113 -157 -113 -40 -3 9 161 205 -93 -76 -200 -154
5368 -154 -100 -282 -78 -19 -121 -36 58 12 -217 -56 12 173 -59 264 275 55 21 -88 50 193 -20 113 -97
5391 -97 -71 -23 110 -56 10 -225 21 -29 -129 89 -194 1 94 -174 279 -125 267 -5 110 -117 230 -95
5413 -95 39 -190 -182 114 44 -55 -183 72 97 72 41 55 312 -1 -219 41 -78 -113 -8 -47 -36 141 23 -17
5437 -17 -61 48 -126 -186 15 137 185 -277 -315 -214 112 -267 280 -97 -19 -143 -84 150 56 -13 -293 -213 170
5460 170 -82 -126 -296 165 183 -141 -8 -84 -228 -123 270 200 187 -76 171 -163 -21 57 136 -101 -161 185 -230
5483 -230 -189 -7 -37 -160 -363 -131 206 33 98 -35 6 -157 -201 41 -291 -55 24 -87 -101 -72 113 -78 79
5506 79 203 48 -225 30 115 203 -104 200 -7 51 122 206 -37 -272 49 15 -311 -156 52 62 125 -84 -55
5529 -55 9 -336 48 -85 -496 -410 52 -6 31 -32 -74 -124 -29 87 -19 -118 187 93 -36 -28 -52 -2 -101 20 121
5554 121 -49 45 -96 32 75 -29 25 -74 -101 93 239 -146 156 125 133 -87 217 14 138 -83 -37 15 -148
5577 -148 -382 62 -212 -183 244 -165 72 -161 -28 -249 -156 -94 -75 14 197 -134 -15 92 7 54 8 -174 198
5600 198 -151 -16 240 -181 24 76 -228 189 208 -138 129 -157 -215 170 -14 -164 32 271 -169 -77 35
5621 35 68 -131 250 172 7 -133 -99 -84 -91 -190 -86 -278 -53 182 -25 256 287 58 -27 63 -50 332 -150 2
5645 2 317 40 250 131 -6 -151 -97 182 -49 -233 -146 -3 58 218 -137 -48 -270 -205 8 -33 -226 73 -167
5668 -167 -2 128 -233 -127 -126 -270 75 -175 18 139 -121 -152 140 -216 12 37 -42 79 96 -14 -177 -24
5690 -24 96 -75 -110 12 -176 74 -195 -236 -53 101 -17 -1 215 240 -86 -172 -61 -253 -161 278 282 -318 -114
5713 -114 198 -197 308 -250 213 126 -303 227 120 110 54 -291 -334 -65 76 -46 -25 -101 124 -3 116 -138
5735 -138 320 -132 -54 65 136 -238 62 100 -327 163 -48 -69 -139 18 -155 248 -74 -91 147 -50 91 -169
5757 -169 82 174 -90 -116 -365 -51 55 67 -129 39 97 -28 227 -343 -100 -156 -23 21 -85 73 -62 -153
5779 -153 -38 385 207 174 58 47 -15 -229 5 5 9 -83 -167 -39 -14 232 149 77 -316 120 80 86 -35 102 186
5804 186 147 237 163 -38 125 -132 -94 -152 -291 193 -44 -153 196 18 -109 35 -85 53 -101 21 -6 61
5826 61 -197 128 326 164 -30 -15 -118 117 57 -49 -261 84 -30 85 27 3 -56 43 -21 1 87 -150 -104 17
5850 17 -220 -473 39 -52 20 226 10 149 103 236 -29 -83 -157 278 -176 124 246 104 173 33 41 -113 277
5873 277 250 103 194 -129 22 -185 -197 157 216 29 -138 -139 1 17 -11 -186 42 138 116 11 -37 19 54 101 140
5898 140 213 215 -90 40 111 -74 195 23 -130 -97 34 -33 -294 63 -54 -330 -118 -7 231 -172 -169 42 86
5921 86 -234 19 -119 -247 -266 -44 74 -33 -12 -107 -47 330 4 335 -210 -86 258 -236 51 -12 -185 -249
5943 -249 -36 -63 -6 17 -107 105 -272 -196 319 -13 232 -22 -93 171 -107 173 132 -20 -45 -29 -26 -134 105
5966 105 -16 -241 -82 -32 197 -221 -97 148 -97 -200 -151 17 -107 -206 168 39 -204 -19 -160 -27 33
5987 33 274 4 -20 66 235 -173 -199 29 40 68 215 -151 77 126 -33 -138 -147 40 171 -279 68 167 58
6010 58 -99 -219 -139 -51 78 -131 -54 -145 30 170 -219 -137 -403 264 -223 -328 224 143 -383 116 58 -24 47
6033 47 -110 128 -108 -144 -43 -105 -157 -34 143 63 -66 130 95 -31 34 106 -235 -22 -198 -184 37 -22 -108 134
6057 134 165 72 171 -84 253 -6 188 -48 -146 130 62 325 122 -17 -58 -54 -83 4 -262 -8 -24 -267 74 268
6081 268 -149 -113 56 -201 66 8 -183 109 -84 -10 -68 -60 -62 -58 52 -83 103 -284 -45 -380 137 -13 -212
6104 -212 229 -96 -31 86 -5 -307 -74 -277 84 -160 -77 -38 -15 215 -25 -148 139 -3 207 5 -93 237
6126 237 70 81 27 -65 6 87 -47 -137 -73 -155 56 161 -80 -83 -58 114 -106 -122 179 323 -25 -162 67 41
6150 41 114 -85 61 8 31 15 -31 -312 111 -219 39 237 170 92 -140 26 93 -46 247 100 -203 -157 182
6173 182 -114 -64 135 333 177 127 157 -52 -145 220 80 -112 -131 17 110 16 -49 335 40 -39 126 -122 -220
6196 -220 213 -84 -87 85 -19 87 66 23 156 -84 -188 -33 221 -10 -57 -80 57 38 55 15 83 59 325 5
6220 5 69 73 -48 -51 -32 -13 -12 35 209 -145 60 -86 -95 1 -248 59 6 114 -137 256 -19 -78 12 -60 -139 46 79
6247 79 223 -175 199 74 21 157 -65 -88 300 -136 -130 -85 -242 54 76 166 106 303 34 -152 87 281 -245
6270 -245 -285 -181 -97 -26 96 -103 45 66 253 271 152 11 -61 -87 3 257 12 116 325 103 233 228 -146
6293 -146 75 -275 -109 -344 -106 162 153 162 -46 342 117 92 241 -63 49 -115 -306 47 197 62 0 230
6315 230 10 151 18 42 57 -72 -226 -301 -87 -87 206 -25 174 -199 211 -152 -233 185 68 -79 -43 23 123
6338 123 327 17 -3 -71 -89 -106 259 63 222 128 -27 203 63 50 -257 -130 127 4 -158 -76 -53 55 148
6361 148 -50 -91 43 -69 90 -141 15 -83 -34 -230 -60 -10 250 -9 -45 93 9 214 -42 46 134 97 49
6384 49 3 -227 -120 -100 302 174 -6 -277 -103 -111 -62 -178 -164 -55 -223 188 161 64 37 -239 -6 144 -27
6407 -27 260 177 -59 488 85 -88 -43 -38 371 -160 69 374 -43 132 97 28 -78 211 55 136 -30 87 -17
6430 -17 15 -8 256 127 -42 81 54 -80 -74 70 46 102 39 14 291 -105 266 -30 -208 -59 52 -125 -144 77
6454 77 -79 -126 -40 78 237 94 111 -43 -121 -190 -49 89 -146 213 -55 123 190 -48 279 -97 111 106 -171
6477 -171 -45 77 -74 -72 242 105 -217 189 -51 -87 -115 -62 93 -232 51 74 -9 -70 -157 20 74 -251 386
6500 386 -94 11 -19 -4 104 45 295 277 38 119 119 220 -181 -178 170 -24 -203 -48 182 107 68 -111 71 -132
6524 -132 86 -57 -274 -63 143 -52 23 98 286 -25 106 -125 7 127 118 -125 -175 -40 45 -74 -38 108
6546 108 106 0 -12 258 -137 -72 -207 143 -167 -141 167 46 107 -12 -46 42 -75 78 -1 -11 -180 17 -149
6569 -149 -123 23 -12 45 -152 -15 -99 25 -31 -12 211 229 199 119 88 -13 -115 7 200 73 52 -40 -37 35 -80
6594 -80 -98 -327 -12 -40 82 -116 139 -87 -127 -60 -107 184 -90 108 27 15 139 51 31 107 -12 -210 -12 -54
6618 -54 -164 -17 -233 -210 -79 -6 -215 23 80 -52 49 -170 236 118 97 -57 240 1 92 29 -244 139
6640 139 -141 -298 70 -208 -128 106 26 -35 -137 62 73 66 -79 55 -274 -89 140 -207 72 -400 47 210
6662 210 73 48 142 -171 191 78 -113 49 -124 -337 41 -33 -139 -60 196 -3 -138 80 -21 111 -179
6683 -179 -46 7 -73 -93 -126 -78 -267 44 4 157 -15 -11 41 -28 -33 61 -248 180 22 -133 -67 -139 101 -125 387
6708 387 -48 50 121 -110 -16 28 16 -97 270 -164 -167 89 153 7 218 64 253 64 -49 -9 -14 21 138 -10
6732 -10 172 144 53 81 269 -13 -34 196 3 212 180 -265 -124 73 -109 24 -126 -119 -57 -179 -230 -95 -177 102
6756 102 -197 164 -10 -151 -68 -47 -37 181 -19 45 216 -186 22 -95 161 66 -54 45 19 51 108 43 100 89
6780 89 -143 -97 -45 -271 -156 108 -328 -235 -77 6 1 58 190 -23 -91 -225 197 170 -218 -216 -113 31 9 134
6804 134 -74 208 107 -11 14 116 -87 -50 -136 66 9 -69 64 43 -111 80 -10 -86 -229 -275 -287 201 40
6827 40 -35 -239 -81 215 119 74 -151 -134 108 85 -93 207 -143 -60 70 129 -159 4 112 10 -47 -125 163
6850 163 -235 -192 52 183 -325 -3 105 51 72 43 171 41 -35 171 121 69 259 109 -150 -227 -33 -61 -40
6873 -40 52 96 -50 13 -199 -65 -224 69 80 -225 -90 23 289 -21 155 113 -192 -107 19 88 -184 48 122
6896 122 -95 208 170 21 -42 -25 38 120 -98 -214 -83 -156 -52 -22 132 41 -301 173 67 -202 -112 -39 24 36
6920 36 23 -79 135 -62 195 -284 82 211 43 115 96 81 -118 92 83 -75 -271 130 163 -296 -38 -42 -294
6943 -294 -128 229 205 12 -50 -46 238 200 -110 27 2 191 -245 -97 -283 -107 -71 -280 22 72 91 -95 84
6966 84 22 -17 -41 -174 -198 -2 -75 -51 -38 -166 27 -77 -20 -45 6 174 -17 148 154 124 -95 -1 -124 -18 -108
6991 -108 101 -39 73 333 -8 -105 260 36 31 -66 50 205 -267 122 -153 -44 -26 -170 -53 37 17 153
7013 153 -141 30 45 46 194 -48 -21 -106 143 107 -61 296 106 2 120 -191 -63 -160 32 -216 122 391
7035 391 -212 221 -8 -33 -124 119 -68 -255 -281 13 154 142 112 289 -114 280 244 138 60 -1 -50 -30 -194
7058 -194 -61 -35 -11 144 51 126 347 171 180 -21 29 156 51 66 102 61 -50 56 -238 273 0 -61 34 -106
7082 -106 -206 372 14 270 126 -13 -65 122 -160 97 96 -188 258 -96 -198 -132 -200 66 83 -88 90 69
7104 69 -177 -198 -54 -51 -54 -285 -32 -205 -122 -201 142 60 361 251 -121 -161 -112 61 76 290 -39 94 -159 -134
7128 -134 90 -281 252 65 211 32 43 -271 53 312 -49 -92 63 -147 102 13 59 79 11 -117 125 -71
7150 -71 -51 -282 -58 -7 -210 64 -157 -64 -141 -198 10 187 40 -95 -97 -10 298 -31 98 -18 -200 79 246
7173 246 26 124 -168 213 -347 118 78 169 -128 161 10 22 -165 -339 -147 -3 50 -86 -54 -140 43 -118
7195 -118 2 -78 -38 -91 87 108 -28 174 -224 -102 -122 96 85 -91 216 28 101 57 -253 -167 31 10 9 4 88
7220 88 2 -113 -2 -199 168 106 232 -154 -112 -214 7 -192 154 -42 43 23 261 61 -145 -88 -275 187
7242 187 94 -153 201 68 -55 -38 -189 -436 113 72 39 -50 -128 -64 182 -106 -221 173 126 74 142 -53 -214
7265 -214 54 -87 -92 249 -152 -180 68 -11 -106 135 123 174 -200 -73 -25 -112 41 97 202 144 274 149 -33 138
7289 138 -9 -56 -21 141 78 237 -111 -76 -197 169 -54 357 93 -13 39 -157 -201 -131 70 -143 -168 -52 250
7312 250 -85 -21 6 155 9 141 185 -93 22 88 232 -189 -7 263 36 -168 -153 31 -129 -66 75 43
7334 43 236 -92 -34 320 110 -194 -52 -18 -294 53 -12 104 66 96 50 21 -72 84 -20 -73 -73 -1 -77 213 -256
7359 -256 -24 -77 87 -123 107 12 4 -77 102 330 -134 -256 -5 57 39 -97 -69 -4 -30 172 159 179 54 -73
7383 -73 322 -164 -96 71 -5 -67 -102 46 -135 9 -183 189 -267 -137 -1 108 -223 208 -192 52 -108 98
7405 98 52 -95 28 123 -44 68 -152 -165 321 20 28 -155 64 88 -39 -144 -32 201 31 -20 -54 -92 -119 -72
7429 -72 -114 -173 122 210 141 110 212 97 -191 -45 -202 95 -99 44 -124 -162 -235 -121 8 3 -93 -122 211 93
7453 93 102 -206 192 -26 -114 -245 -102 -22 -83 -114 -45 -99 47 -295 26 118 -187 8 18 -82 217 204 211 -35 98
7478 98 8 -36 61 -193 97 -68 -4 102 -80 -293 -22 -108 -378 -127 -48 14 94 106 117 -77 6 99 -72 -84 -17
7503 -17 -45 34 -167 -157 184 61 -165 -89 160 -64 -158 299 35 -144 -94 36 -152 -166 24 -143 -150 -15 -107 69
7527 69 -87 -12 -57 -141 -18 -86 -78 92 -9 -153 76 45 21 -59 -165 165 118 -123 -62 93 44 -21 -222 16 -131
7552 -131 84 126 -49 26 -154 113 54 -105 133 -133 137 -31 -135 -9 48 78 -64 165 -39 -14 -85 239
7574 239 68 260 -130 -55 281 -204 -182 -157 -92 166 -87 3 55 46 -29 -170 117 384 -215 -120 -16 97 7 223
7598 223 -97 41 31 168 -228 -58 185 -295 53 -28 -59 159 -90 39 -120 -397 174 -17 167 12 152
7619 152 26 -214 -180 21 67 -150 73 212 -211 105 131 -99 146 111 -276 -239 127 136 -55 -6 11 -28 50 -36
7643 -36 78 170 -77 -124 107 50 131 38 27 231 62 59 -105 116 -75 -194 75 168 73 -18 136 -19 102 -45
7667 -45 -121 19 -135 -24 -200 117 -42 96 -63 -62 -146 -69 -241 30 -219 336 47 -130 -51 -323 127 -16
7689 -16 275 -123 -372 -98 55 60 -176 -85 -205 151 -5 101 101 -98 175 -119 -327 142 466 112 -34 120
7711 120 91 15 67 -180 -95 -62 7 -188 -87 -29 -33 -43 164 -210 -250 187 155 191 -20 107 128 45 88 47 -57 -79
7737 -79 4 49 174 -35 -292 240 -26 222 93 -155 -89 -71 92 104 85 191 -133 75 -82 53 -33 58 -126
7760 -126 24 39 29 68 71 429 148 78 9 -32 -452 67 77 -92 27 71 -209 -54 -6 48 155 239 -130 -180 -31
7785 -31 171 -15 30 27 155 61 33 98 -102 -142 -247 232 -130 41 84 196 15 -127 -36 288 190 -25 -144 -122
7809 -122 -42 46 91 0 2 -358 37 -7 170 -166 -29 32 -27 121 28 -12 -285 144 64 -101 32 123 38 -68 -114
7834 -114 202 26 86 -122 -172 -152 -86 42 33 -74 -278 -81 -66 -17 -200 -38 113 158 193 175 153 226 25 -21 -47
7859 -47 -112 63 231 142 -182 -112 -144 -167 62 -80 169 -204 12 -125 -55 -162 191 45 508 -28 -48 -37 -54
7882 -54 270 -15 -76 80 -14 295 -52 253 276 140 -113 76 288 73 -36 141 -88 -82 67 -72 -191 -106
7904 -106 -111 65 303 64 -75 -186 -185 -105 288 311 154 89 36 -188 -146 113 82 -29 -78 31 -190 -186 -43 48 20
7929 20 -127 -213 -77 -102 77 172 12 -168 159 202 334 138 225 45 -243 -6 278 16 -232 -161 -72 -347 5
7952 5 1 -336 -36 -68 -9 -228 134 193 -17 308 103 -116 164 -21 -87 -125 -375 153 118 12 -120 -203 57 9
7976 9 79 231 -176 8 -62 -133 -95 181 184 244 1 145 94 33 14 -56 -82 -114 -177 73 -9 -22 148 -140 185 -36
8002 -36 -27 217 -112 -121 -9 -119 -165 237 -18 -77 55 -66 61 62 -105 1 177 -361 236 89 162 -99 154
8025 154 -74 262 -22 -24 89 -7 14 121 -156 -38 -37 188 56 84 16 108 12 -70 -47 130 189 -86 -85 -38 -238
8050 -238 -71 -42 -227 -80 -12 311 -99 -62 -7 59 -217 -155 -85 -8 -145 58 43 75 37 51 100 199 13 122 -10
8075 -10 -125 220 101 45 -203 244 81 7 284 -4 77 -137 -193 -101 -83 -194 148 -47 -263 -195 -55 -41 -96
8098 -96 -59 143 188 142 -168 38 104 35 279 164 -226 -12 76 -108 97 -124 -284 -7 189 -66 -5 250 -88
8121 -88 -141 -65 112 92 124 -220 -319 172 199 70 154 -36 -91 -105 -289 132 -7 140 -101 201 -144 -46 -2 197
8145 197 132 -108 -42 227 16 35 208 249 157 133 125 -126 -37 -158 29 116 107 66 111 -11 -137 -297 -133 90 174
8170 174 -161 116 -139 -154 -31 13 -187 -289 57 103 -146 -64 190 -21 148 -152 155 80 69 106 -61
8191f1
$$ Imaginary data points
##PAGE= N=2
##DATA TABLE= (X++(I..I)), XYDATA
0 0 0 0 0 0 0 0 0 0 0 0 0 0 0 -5 8 -8 8 -8 8 -16 16 -16 24 -24 32 -38 40 -48 56 -64 74 -85 95 -109 121 -137
36 -137 155 -172 192 -214 238 -265 292 -323 359 -395 438 -481 530 -584 644 -709 783 -864 955
55 955 -1060 1178 -1315 1474 -1663 1895 -2181 2545 -3026 3701 -4708 6369 -9591 18099 -86475
70 -86475 -181775 93201 151602 48792 100057 226775 151956 31111 59197 72429 -55615
81 -55615 -68616 24325 9372 -65567 -43982 26682 10275 -67948 -56041 -32435 -58785 -44300
93 -44300 -34181 -72994 -66547 -28612 -23873 -43166 -2704 85289 93873 70774 110136 107557 51529
106 51529 28222 26388 -776 -46363 -36636 -6422 -54160 -78130 -34773 -43496 -59591 -17815 6338
119 6338 -6396 1754 35832 19414 -26322 -3640 12493 -26401 -20577 17681 28650 25013 26352
132 26352 41578 33408 14628 36395 33072 -1460 1042 5317 -22693 -53420 -51540 -31807 -45309
145 -45309 -47553 -6384 5116 4575 26206 28983 14795 5433 10339 17345 -379 -2171 11548 190
159 190 -2456 8183 8577 16816 29165 37588 28065 8860 13801 -1018 -40695 -45567 -44255 -55737
173 -55737 -50185 -34389 -15444 -7535 -1588 22866 30248 28076 43612 46220 38664 29436 13968 3402
187 3402 -12143 -14272 -2841 -12766 -11804 6262 84 -8355 -9372 -10673 -14625 -26919 -23041 -17025
201 -17025 -27942 -18690 -6000 -6451 3773 14576 26022 34568 31770 39482 36227 17718 15030 4648
215 4648 -11396 -13515 -15877 -13861 -16463 -21094 -11459 -13612 -16365 -5173 -5378 -3575 2801 -186 964
230 964 -2123 570 8968 -1172 2745 16571 9467 8318 13604 13473 12204 2696 4342 5597 -7279
245 -7279 -4736 -4375 -14537 -10240 -9221 -11281 -8718 -9242 1259 3024 -2860 7880 7486 496 3764
260 3764 -211 -905 -419 -3097 3572 -1322 -3199 8633 3775 1283 7656 4839 5017 773 -2399 2002
276 2002 -7146 -8010 -2086 -9315 -7123 -2853 -4482 1324 -117 1937 6600 -435 2868 4626 -1995
291 -1995 2474 634 -2001 1350 -3624 -393 1956 -3014 3553 1558 -2937 3047 -1338 -1957 456
306 456 -3472 683 -1631 -4129 2639 -1135 -9 5579 -261 3630 5318 467 3612 871 -220
321 -220 1417 -5023 -2898 -3565 -8383 -3074 -5485 -5520 1249 -2268 1424 5723 2295 6260 5803 3676
337 3676 5114 650 2054 1710 -3966 1432 -187 -4862 -86 -2339 -3862 -1314 -3235 -859 -1573 -2384
353 -2384 2009 -3043 -1575 4390 -802 2030 5000 1536 3452 1990 992 1541 -2859 920 111 -4460
369 -4460 286 -1029 -3085 -488 -3981 -1664 -391 -4433 717 2255 410 4099 3933 6380 5182
384 5182 2840 8446 3790 -1076 3361 -3749 -10018 -7397 -8821 -8544 -8543 -3686 2601 -1782 2404 8502
400 8502 1902 3286 5712 2398 1550 -267 1830 1904 -2580 3283 5212 742 6488 6644 2284 663
416 663 -3824 -4153 -9634 -13974 -6447 -7348 -8120 425 2458 3313 4433 5566 8323 1395 1821 8302 -1822
433 -1822 -5612 1175 -3146 -6891 -3107 5135 6681 1688 10023 11785 -2200 34 3424 -6346 -7370
448 -7370 -2509 179 -5336 -9038 304 -2847 -12759 -2553 2010 -2138 868 6033 6663 -1856 -837
463 -837 10155 1742 -2029 13525 12393 2385 4072 5641 -1933 -12122 -4457 2802 -9764 -5812
477 -5812 7735 -3302 -13192 -8016 -4789 -9810 -10715 5901 9462 -1973 10105 16954 2004 1040
491 1040 11636 11325 2751 3198 11929 -747 -14901 -5634 -10091 -22103 -11000 2582 2276 -4066
505 -4066 2815 10923 -5857 -11507 5655 1951 -6234 7796 15561 5250 -1607 10250 9385 -10316
519 -10316 -1260 15295 419 -6795 2034 -4007 -20538 -22421 -7731 -8330 -15171 5859 17449 3160
533 3160 3873 14390 7788 -3978 1571 13682 3033 -4623 11145 4354 -14497 -7010 888 -6883
547 -6883 -8102 6102 12072 -4296 -6509 4027 -9781 -18898 -2858 3459 -2785 407 13173 8833
561 8833 -8438 200 10538 -4183 -2125 13724 8821 -2702 254 6150 -4487 -12749 2671
574 2671 5526 -5966 1199 8677 -856 -8965 -4745 -287 -8952 -8057 8831 4978 -5529 2395 2427
589 2427 -8281 -7753 3231 4971 -2281 6016 14742 1208 -2492 7328 3092 -3082 1581 7452 2455
604 2455 -5649 370 -482 -14016 -9199 1787 -1912 -3676 2299 5148 -3170 -7440 1622 -2040 -7514
619 -7514 4089 8073 947 3127 8315 6204 -2171 271 8477 790 -2639 5979 529 -8446 -6502
634 -6502 -3650 -6505 -8503 1799 6455 -2128 1571 6426 -3282 -5088 1039 1218 -1044 366 6703
649 6703 3540 -3712 2062 1882 -4402 -696 3151 2500 -482 -599 2600 -3857 -7636 1495 -73 -3836
665 -3836 3625 5810 1845 -1753 744 1616 -5730 -2010 6209 -266 -1175 4850 1375 -4067 -4128 1045
681 1045 541 -5478 1258 4317 -4347 -1938 1883 -2288 -2439 598 4501 2272 68 6655 3494 -3128
697 -3128 998 393 -2307 -1556 -51 2402 -1237 -3761 1526 -1702 -4715 466 572 -725 -71 785
713 785 1274 -3668 -1854 2725 -2771 -876 4477 1863 974 1672 1952 1117 -2266 780 1501 -3951 -351
730 -351 245 -3073 -1562 -1143 90 376 -676 3247 2467 -619 3673 1554 -1139 -450 -1891 -755 -1651
747 -1651 -2794 1108 -938 -2143 1775 -159 -137 1157 50 929 -1475 -1343 1290 -2180 -1112 1835
763 1835 -522 1715 2364 2397 3580 1612 2144 1779 -1516 57 -1367 -3498 -1956 -3355 -2934 -849 -2288
780 -2288 15 467 -975 1300 419 516 1544 -686 1077 772 -679 2432 1283 590 2561 1155 2114
797 2114 2561 535 1999 510 -1114 -533 -3189 -2345 -2049 -4277 -2132 -2341 -3287 -609 -949 234 2190
814 2190 1079 3079 2294 1174 2808 618 484 1373 -981 557 1051 -587 2037 1468 1088 2203 160
831 160 437 -768 -2613 -1404 -4243 -4993 -2577 -4466 -2551 -280 -114 2475 2766 2853 4323 2019 2540
848 2540 2030 -1263 572 -605 -1882 6 -673 -280 701 -221 2208 752 -562 1299 -1289 -2253 -1776
865 -1776 -3612 -2305 -2305 -2040 1288 -292 744 3551 1423 2248 2391 1297 2217 -967 -316 803 -2879
882 -2879 -1454 -89 -2433 -701 433 706 1047 -1042 1140 128 -2956 663 229 -1873 1112 715
898 715 626 15 -217 2393 503 -494 3384 745 -1189 477 -816 -1840 -3491 -2088 312 -3597 -1282
915 -1282 2781 -1588 -1626 1276 119 -166 543 4368 4517 -133 3131 3680 -3081 -1447 613 -908 -1766
932 -1766 -651 1921 -1534 -4653 804 -1098 -5028 244 2007 -160 -643 780 1632 -3308 -3160 3237
948 3237 523 -773 5585 5438 938 -538 1593 811 -5448 -856 4109 -2642 -2302 3142 -703 -4750
964 -4750 -2354 1259 -969 -3036 4748 4764 -3208 103 2777 -2656 -3380 1246 4476 44 -651 5413
980 5413 -45 -6914 -1152 735 -3653 -1385 3967 4791 -1678 50 5202 -2106 -4325 3506 3001 -1622
996 -1622 555 3533 -126 -6340 -1377 2354 -4295 -1430 5851 1118 -2865 -832 81 -5138 -6708
1011 -6708 1525 1756 -2801 4019 6410 412 19 3531 3010 -1021 1179 6479 589 -4123 985 -906
1027 -906 -6904 -4112 1073 428 -2689 1716 4712 -4025 -4910 1155 -2641 -4712 669 3791 235 -1596
1043 -1596 3781 3208 -2949 2539 7164 2528 2370 5247 3126 -3323 -4359 -566 -4464 -7428 269
1058 269 1256 -3474 -1588 742 -1487 -3661 -522 4253 424 414 5311 945 -3314 -249 790 -833
1074 -833 -509 4537 5689 22 2325 3868 -3045 -4274 -124 -1773 -3681 -1640 890 -2932 -6470
1089 -6470 -1239 -824 -3999 2117 6440 4181 2908 3693 3024 -2274 -3620 2270 -254 -2688 2225 2422
1105 2422 -1473 -1918 -452 -60 -3607 -728 3537 -1649 -2376 629 -2921 -5882 -3862 -491 398 -217
1121 -217 6088 7476 1827 3647 4939 -270 -1085 1318 1734 -1669 -2741 928 -3271 -7425 -1514 -624
1137 -624 -3194 167 3078 1700 -1698 -1452 553 -4019 -4591 1785 1343 293 4024 5258 4098 1521
1153 1521 4093 5877 688 1458 4756 -910 -4149 -2922 -4106 -6857 -7498 -2470 -1493 -3835 1194 3147
1169 3147 -987 240 1780 1004 106 852 3908 1910 -201 3920 2849 482 3350 4266 3278 1910
1185 1910 1728 1508 -3512 -5210 -3305 -6688 -7781 -4740 -3964 -3444 -2342 830 2621 653 3272 6026
1201 6026 2686 2993 3995 2104 711 -380 720 -55 -1529 1175 1980 -752 984 796 -1297 -2132
1217 -2132 -2845 -2505 -4122 -5202 -2502 -2878 -3645 -211 553 1919 3139 3924 5509 3922 3583 4358 892
1234 892 -329 29 -2074 -2221 -2563 -1912 -910 -2266 -432 976 -892 307 300 -1106 -909 -1532 -1238 -1170
1252 -1170 -2107 -79 468 484 3238 3290 3346 4296 2920 3022 1458 -509 -451 -2666 -3889 -3051 -3906 -3247 -2458
1271 -2458 -1968 277 65 319 2124 836 1464 1264 -134 223 -671 -456 653 77 1395 2317 1901 2919
1289 2919 2812 1551 1915 -531 -1609 -2341 -4240 -3832 -4357 -4797 -2887 -2986 -1097 1007 891 3068 3315
1306 3315 3018 3726 2618 1887 1756 63 214 -101 -926 596 -26 30 1205 -172 55 -171 -1804 -1609
1324 -1609 -2401 -3271 -2634 -3508 -2270 -1387 -1582 1305 1869 1886 3798 3444 3394 3406 1813 2157 618 -724 367
1343 367 -1529 -1626 -783 -1667 -1244 -678 -1532 199 -453 -583 179 -1427 -963 -529 -1592 -353 -161 441 1435
1362 1435 336 2537 2840 1119 2578 2553 671 861 114 -289 -1250 -2791 -1162 -1905 -2751 -204 -312
1379 -312 -566 555 676 1144 126 -41 1341 -545 -563 1054 -490 -731 77 255 712 -192 1004 2451
1397 2451 -281 -68 903 -1207 -1840 -1421 -1023 -1177 -1310 1067 1370 -1143 1200 1933 -513 660 1700
1414 1700 957 165 -71 1262 -1336 -2640 170 -346 -1761 161 1150 470 -1104 -182 864 -1890 -1554
1431 -1554 1780 177 -915 1102 1509 11 -1432 1129 1882 -1069 872 2845 -235 -1217 102 -92
1447 -92 -2199 -1850 1235 80 -1975 1172 1124 -2373 -1286 902 -50 -1475 526 2411 -350 -1206 1775
1464 1775 -606 -2056 425 1720 702 -124 1694 1589 -2196 -1231 1365 -1012 -1156 1883 1631 -572
1480 -572 -934 906 -379 -3003 418 1704 -1083 -47 1583 -131 -2074 -852 1074 -674 -1493 2327
1496 2327 1503 -1589 173 784 -1835 -2150 324 1965 -318 597 3002 -244 -1777 339 372 -667
1512 -667 119 2430 1544 -1673 -454 373 -3214 -2213 1001 251 -490 749 1591 -785 -2516 266 -119
1529 -119 -2014 986 2631 454 178 1297 476 -1849 -814 2457 986 122 2868 1724 -1597 -1372
1545 -1372 -826 -1623 -2685 -18 1818 -1041 -607 905 -1607 -2519 -296 738 15 117 2940 1918
1561 1918 -1436 -106 927 -1764 -167 2521 2675 698 988 2280 -1333 -3004 145 -453 -2238 110
1577 110 1340 -584 -2006 -959 -403 -2874 -1356 2517 934 204 2660 1796 -1081 -1555 380 924
1593 924 -738 1369 3055 280 -460 1124 -240 -2288 -1083 1352 327 -1693 1002 569 -3180 -1713
1609 -1713 196 -1086 -1002 1575 3144 519 -444 2083 -112 -2311 310 1064 -373 -265 1154 687
1625 687 -2105 -1004 1093 -1155 -1315 1696 1229 -506 -276 420 -653 -2652 -215 1105 -942 43
1641 43 2197 827 -388 233 1313 -150 -1127 1376 901 -2058 -325 30 -1842 -1657 -277 345 -849
1658 -849 112 2246 432 -945 1073 707 -871 -171 1084 767 -613 220 1318 -834 -601 1147 487
1675 487 -66 553 784 -198 -1358 -466 -72 -2087 -860 332 -456 -509 464 757 -34 -64 1368 731 -401
1694 -401 1104 797 -534 153 -3 31 -540 -101 1185 -301 -62 764 -55 -731 -13 -751 -232 -911 -850
1713 -850 108 -1268 -501 355 -111 29 859 777 543 424 487 613 -533 315 246 -595 -46 -173 160 -20
1733 -20 -224 523 61 -358 437 -27 -397 272 -416 -444 -413 -511 128 -388 -144 521 -381 166 548 -299 181
1754 181 -229 -359 305 -313 -80 284 -8 383 191 256 714 118 324 633 -150 273 242 -792 147 -664
1774 -664 -773 -386 -828 -575 -279 -702 49 -387 -36 540 -294 310 715 125 590 474 526 688 -53 666
1794 666 514 -27 139 -34 -342 519 -191 -311 -161 -792 -190 -536 -690 -237 -467 -67 164 -469 417 512
1814 512 -105 460 152 71 619 -97 572 283 -142 328 42 -281 413 -187 -531 152 -432 141 -336 -628
1834 -628 345 -414 -410 93 -145 120 -295 -90 325 -303 457 639 -167 459 298 -199 795 292 136 -2 -126
1855 -126 96 -350 -520 179 -452 -536 351 126 -19 -46 112 590 -24 -166 590 -285 -246 154 -54 -249 -141
1876 -141 563 182 -592 210 679 -344 -318 -301 -563 -471 -618 345 -140 -711 739 322 -529 591 853 377
1896 377 485 745 641 -189 -458 730 -556 -976 296 4 -598 -665 -54 103 -1069 -389 449 -718 -324
1915 -324 806 147 -72 91 587 414 -349 973 1350 -168 587 1121 -57 -461 -283 135 -615 -788 445
1934 445 -215 -1492 -76 -593 -1316 -576 815 496 -406 136 1103 -407 -631 579 109 -167 547 1271
1952 1271 655 -310 554 506 -1093 5 726 -73 -265 24 -47 -1079 -1558 48 -26 -1042 775 1080 166
1971 166 95 278 38 -957 18 762 203 -281 1331 220 -780 -393 252 -545 -129 835 1214 -288 -64
1990 -64 642 -1143 -1221 154 143 133 210 1202 356 -764 136 142 -1045 -8 1035 290 -261 -125 483 -1188
2010 -1188 -1368 249 333 -548 1174 1539 -17 -638 -125 65 -1189 10 1712 167 -112 1345 117
2027 117 -909 -644 401 331 -305 978 1435 -711 -739 409 -947 -1213 -291 616 107 -561 946 307
2045 307 -1445 -327 610 -678 210 1309 1249 -426 -433 842 -692 -1118 673 825 -433 389 1104 139
2063 139 -1477 -374 221 -1091 -676 1047 165 -937 -112 280 -771 -1077 761 1221 -383 662 1469
2080 1469 -331 -687 427 149 -562 -139 1414 780 -662 529 460 -1248 -709 415 311 -580 226 1185
2098 1185 -594 -1199 332 -79 -1126 289 678 157 -415 466 556 -1142 -129 643 12 -5 869 600
2116 600 -175 -585 570 15 -1058 422 852 -482 -452 287 -29 -732 -544 248 -246 -635 550 339 -967
2135 -967 -401 -144 -389 -385 270 863 -147 188 1070 -130 -837 520 365 60 -260 254 500 -544 20
2154 20 375 -579 -291 14 91 -384 -419 8 -423 -1085 78 -138 -340 246 349 191 -95 -110 345 218 -141
2175 -141 829 6 -10 275 -49 -332 -202 -215 189 -212 -265 445 -122 -206 14 -230 -291 179 80 52 -84 119
2197 119 621 -180 226 432 224 499 465 534 420 -251 83 15 -754 -91 -326 -495 -202 -464 -106 -29 -52 651
2219 651 -202 -78 586 306 -31 172 128 96 -256 67 256 -164 410 454 -134 105 -209 -166 42 -450 -516 -479
2241 -479 -890 -645 -177 -210 231 60 502 617 600 1018 511 468 388 197 -40 -60 -375 -391 -302 -525 -311 -346 -315
2264 -315 -150 -600 -168 -221 -440 -392 -298 -117 -71 34 422 655 460 953 930 600 1173 656 425 308 -242 -391
2286 -391 -445 -603 -673 -973 -708 -573 -589 -160 -33 -142 331 69 -158 182 -82 302 140 -74 456 158 309
2307 309 377 335 569 481 155 80 -156 -275 -567 -673 -790 -616 -723 -338 18 -394 -22 -196 223 402 327 178
2329 178 363 58 327 5 -173 127 234 304 102 26 966 104 -98 244 -405 -181 -399 -856 -510 -660 -561
2350 -561 -222 -461 229 200 321 137 468 527 449 -28 390 505 -134 -199 222 -258 50 -304 255 152 -322
2371 -322 92 -405 -472 -471 -607 -647 -124 -131 -223 -64 180 579 206 179 923 279 548 681 199 89 -119 -423 -291
2394 -291 -1039 -523 111 -444 -80 -259 85 -420 -176 150 167 -272 420 317 -69 328 113 189 335 358 805
2415 805 366 -10 530 -139 -736 -168 -419 -494 -520 -422 -26 -604 -329 118 -595 -33 555 523 310 609 562 123
2437 123 -325 84 315 -106 4 592 -42 44 209 81 -442 -547 111 -250 -620 135 -57 -505 -424 -538 -212
2458 -212 -70 284 999 21 -176 883 106 -520 126 396 30 -71 193 576 -407 22 137 -590 -153 376
2478 376 263 -251 -381 -40 -562 -569 -391 68 -347 243 643 -116 -186 229 390 -462 -177 699 429 -471 133
2499 133 391 -438 -690 111 -14 -281 81 742 15 -498 -5 -12 -679 -364 669 368 -303 592 411 -584
2519 -584 -34 355 154 -395 199 494 -214 -658 149 -370 -1134 -93 6 5 -53 210 317 -494 -111 742 119
2540 119 -17 727 655 17 -369 106 86 -384 -64 298 -160 -425 317 -264 -292 -290 183 -188 -537 622 276
2561 276 -166 218 503 -242 -193 264 470 -124 -42 784 71 -1005 -106 -177 -255 -73 192 382 -365 -295 348
2582 348 -429 -296 193 329 -133 318 625 22 -625 -112 286 -307 111 498 -261 -240 49 247 -57 -475
2602 -475 350 311 -151 337 344 68 -204 -73 78 -455 -277 506 -97 -239 434 31 -358 -145 -129 -124 -312 59
2624 59 228 -342 -141 106 -464 -53 333 186 50 44 372 -42 -401 -57 67 14 311 308 -66 -211 -102 47
2646 47 -144 -204 60 154 -268 -6 64 -353 -98 76 67 -101 -196 316 11 -280 185 -61 -22 -59 208 453 219
2669 219 294 250 -113 -144 -65 -80 -87 -328 57 -487 -119 -7 -109 -383 109 -25 -276 92 75 237 -132 12 491
2692 491 -12 51 486 284 212 70 21 -49 -156 -237 -322 -527 -223 -74 -314 285 -52 -20 118 153 367 198 -227
2715 -227 128 209 8 186 -98 -236 -91 8 -133 -193 -88 30 -79 86 -206 -267 148 -19 -163 143 -58
2736 -58 112 91 163 162 -101 74 279 -106 -390 59 -217 -150 156 -163 341 177 -115 4 -17 18 288 52 78
2759 78 106 266 174 246 -158 35 -182 -124 -268 -101 -208 -75 125 298 291 69 68 153 -152 21 -261 -321 -196 -111
2783 -111 -95 -116 210 232 -38 62 20 179 40 -83 -135 146 77 133 -61 109 175 -19 357 158 217 310 -2
2806 -2 -296 42 -274 -40 -181 -162 -375 -44 -108 -75 -38 -24 5 137 277 -1 315 210 -89 -38 72 126 257
2829 257 -40 -43 -95 88 210 14 110 -126 -28 -268 -224 -232 -298 -268 -233 125 -178 50 120 170 196 -163 156 59 -271
2854 -271 21 49 -74 -132 25 -155 -49 11 80 93 -12 83 53 53 75 180 47 -11 107 15 99 -24 139 -8
2878 -8 -175 270 87 34 -98 -249 -161 -131 74 0 -12 -2 -40 105 -47 9 376 61 59 136 136 -218 -93 33 -118
2903 -118 -301 168 81 46 -40 360 -156 62 -18 -47 -182 169 257 21 223 -81 -206 -11 -141 73 267 119
2925 119 121 6 -262 45 187 184 -107 39 251 -42 -79 285 260 -252 10 158 -138 -313 19 -57 -161 -316
2947 -316 6 143 -44 -139 135 -40 20 383 299 -32 143 325 234 -68 36 -31 4 -174 -30 -192 -324 164
2969 164 243 -80 63 125 -102 -240 -201 -62 -127 136 320 59 -119 -63 228 -28 -293 149 374 -202 212 195
2991 195 8 -237 -61 -89 -327 75 176 -91 -280 422 -190 -221 136 137 115 -316 31 282 -332 -156 66 -310
3013 -310 -190 -187 336 -210 -239 209 38 -230 3 216 211 -245 271 8 -320 -261 138 415 164 171 184 -352 226
3036 226 -257 -201 -180 -63 63 -459 -239 -31 85 -76 -182 418 -219 -99 440 228 246 167 143 -11 -243 -89
3058 -89 69 82 199 152 -64 -499 286 -186 -253 -74 22 88 -137 -187 -5 -173 -111 294 165 -214 226 -75 -44
3081 -44 -305 342 203 -325 49 222 173 -32 -183 193 -76 -227 -89 19 38 399 216 -114 72 -185 -146
3102 -146 166 -131 142 176 -76 169 -98 -71 97 234 -267 110 424 76 61 -46 -12 -67 -152 81 -100 -137
3124 -137 103 67 169 -139 -115 20 207 51 36 167 -41 -359 -264 -218 -253 34 178 79 -50 -15 -86 -206 81
3147 81 -76 -376 -25 19 30 -122 95 -21 185 2 -167 -50 -25 -139 207 -263 -56 90 -270 -30 203
3168 203 284 15 88 195 -89 -104 -82 186 30 -152 -238 -247 78 51 40 114 -253 177 33 -199 92 100 208 -121
3192 -121 -25 79 63 -30 -158 -66 -474 -49 -57 13 31 -66 -22 57 -102 115 -190 -182 -35 -174 -183 92 -138 -51 51
3217 51 302 301 -90 263 208 -146 127 144 -43 7 -315 -186 72 71 117 -223 15 104 -86 -55 -21 170 -19 -75
3241 -75 -28 79 55 -76 133 0 -143 66 72 129 -76 -228 -196 18 9 14 124 -45 102 18 -26 -50 -41 -76 45 177
3267 177 -62 -35 -73 -79 -51 -24 78 65 -17 137 -19 -308 163 -199 1 5 -235 -8 -64 -145 91 11 190 136 276
3292 276 -12 16 -93 -164 109 -28 -61 -137 -75 -175 -253 -191 109 -22 57 -6 -298 -55 -124 -8 -31 -183 37 -211
3316 -211 140 114 -73 78 16 -359 -154 126 -244 -107 -124 -179 -116 -241 -49 126 -9 53 65 56 -121 -119 21 144
3340 144 -54 252 -74 88 143 -230 -20 1 39 -156 -2 -88 -18 210 -10 -197 -111 -3 180 92 169 117 -143
3363 -143 6 -17 -142 -139 -114 255 -133 -57 -112 -30 59 173 0 -166 64 146 -184 362 71 63 96 -52 211 85
3387 85 49 124 223 86 22 404 -130 -28 -108 -57 -85 47 -63 -151 90 108 51 -25 -58 196 -115 -58 -270 201 -161
3412 -161 18 220 -47 74 125 467 -103 -120 -5 209 -210 -62 113 259 -20 -269 -15 -331 -41 209 -14
3433 -14 -146 36 266 -133 -104 328 154 -389 -173 350 -81 -119 123 32 -131 99 251 -261 -25 87 -44
3454 -44 16 40 64 -122 -176 23 -9 -70 68 -247 -9 22 144 421 -52 173 -29 -51 -133 69 -126 -323 -120
3477 -120 -58 18 -15 100 67 -282 -223 101 154 -272 -53 210 27 -103 -153 -107 -231 -297 178 -27 118 27 20 29 -220
3502 -220 29 94 -132 -69 163 -95 114 -31 -201 -318 339 229 315 -70 265 -45 -241 -26 -74 92 -93
3523 -93 106 365 -15 -33 71 -254 -192 187 196 33 114 29 304 -84 53 42 -7 144 189 -27 -3 314 131 -279
3547 -279 3 32 43 -149 -183 12 -13 -254 54 -7 -104 155 38 499 193 -45 97 -111 -28 27 -26 -216 -174
3570 -174 198 -151 145 159 -122 190 216 436 300 -36 110 -221 -154 -163 -229 -54 -73 100 129 -61 46 86 -208
3593 -208 -38 100 -123 33 -121 68 14 48 -164 348 -176 58 177 -46 -149 -95 -3 17 43 -182 -47 -140
3615 -140 26 250 -275 -242 127 -69 0 58 363 -183 -175 28 89 -118 -144 -126 176 188 119 44 -74 -173 101 184
3639 184 -28 -64 122 129 -9 -84 123 49 -165 15 -19 -33 179 51 0 -319 30 -125 -60 -64 -26 -226 5 115
3663 115 192 -111 -1 258 45 -205 -49 -92 43 393 157 28 -170 146 285 193 135 -249 -77 151 14
3684 14 66 64 36 -266 -147 -318 -390 -53 19 -156 172 -393 41 -137 -40 168 60 0 -91 -104 -227 100 -55 55
3708 55 103 54 5 183 67 -67 -143 20 -211 136 24 -301 -171 -41 155 -59 38 -109 -131 102 -118 -119 2
3731 2 -107 -163 367 -121 -1 276 231 -327 100 -82 97 89 -226 -71 83 131 -288 -170 259 -428 -166 44
3753 44 -186 -16 44 54 -156 -218 44 187 -131 6 350 65 99 320 122 -50 -160 57 -22 -11 82 67 -195
3776 -195 252 -42 72 77 -148 0 -31 -26 151 7 146 -48 -246 -81 -106 -49 -59 210 -111 187 260 -38 72
3799 72 15 31 9 -27 60 -217 118 -23 95 153 41 62 24 -206 -127 145 -102 -171 -93 141 -22 106 127 -76
3823 -76 -107 -33 11 -106 290 -248 -117 36 -75 64 302 29 -52 -185 35 25 65 203 19 69 8 40 -279
3846 -279 14 16 -108 -111 15 70 -317 -155 144 94 198 -146 -13 -161 190 189 -138 -19 215 192 -87 38 390
3869 390 -150 -3 64 -30 -81 -235 181 139 -177 -176 19 -220 -59 -14 -4 -62 46 -41 -91 -39 6 99 -160 -68 -180
3894 -180 279 94 76 -1 -292 -96 161 -130 -89 168 173 160 -295 300 -94 -7 -80 -105 -48 -42 -92 -69 -71 -72 -34 -130 -248
3921 -248 -142 56 -216 130 -43 -14 35 -35 173 44 333 85 265 129 66 156 -80 -207 -70 -185 -13 -95
3943 -95 61 -72 80 -104 146 131 -59 338 79 -134 -35 80 -82 -7 112 -9 -47 -93 43 138 -82 142
3965 142 -143 -195 -70 75 182 184 67 38 -239 19 235 -21 33 -69 -85 107 -237 -95 131 -171 132 71
3987 71 -98 160 247 5 -87 -124 -148 175 134 95 8 58 -52 155 86 -54 166 34 -215 -236 163 -36 -133 126
4011 126 -212 13 -42 -411 -168 -47 40 -21 -347 223 161 -109 52 -92 259 -39 -194 -136 90 26 -55 63
4033 63 -6 48 -20 277 -44 -138 79 -105 -84 34 13 -178 107 37 -36 34 -94 216 111 46 168 -51 -192 55
4057 55 -107 66 -35 33 -54 -48 209 43 18 66 -131 -125 -392 -192 231 59 -40 -65 281 -389 -103 -9 -96 53
4081 53 29 -1 -29 4 182 13 -230 22 127 -136 32 -54 -101 85 -101 37 -396 -221 119 229 -127 -46 184
4104 184 217 101 162 304 63 -320 224 72 5 136 283 -106 24 155 189 51 26 31 231 46 -90 218
4126 218 -57 -27 -100 4 -8 312 117 63 -117 -82 -140 21 -88 21 12 -133 -72 -198 -146 228 -107 99 -155
4149 -155 12 344 -67 -77 355 -114 -430 175 58 -66 -29 3 -158 0 139 0 37 172 173 -258 -121 66
4171 66 30 -63 -87 195 -25 29 -65 107 -175 66 -94 91 -44 -179 122 -52 97 121 23 50 -76 13 64 274
4195 274 226 132 25 53 -231 -62 -156 47 0 12 -120 -143 -189 173 251 -165 186 -156 32 72 211 214 53 44 -19
4220 -19 182 9 -139 -238 -45 240 170 -91 -238 -340 -199 -112 -246 -240 -257 107 33 116 -16 16 -189 82 -38
4243 -38 47 181 -86 -24 11 8 78 352 170 -242 -110 -127 175 46 67 -55 -87 -223 -189 72 -35 -93 -49 40 175
4268 175 77 -352 181 73 241 -45 -18 -345 -84 -330 227 -148 99 35 86 206 179 -376 -151 -85 69 59
4290 59 282 44 -35 67 125 237 -128 231 69 33 -96 -113 -154 57 -70 122 88 -214 -93 46 -49 130 73
4313 73 -264 -319 8 21 230 -2 -224 -115 151 -1 82 -65 129 -180 41 47 98 -245 -9 -36 -88 -224 -12
4336 -12 -212 -177 234 -86 -127 -210 143 5 107 -195 134 32 -157 -145 -51 162 145 -230 -230 -396 2 -91 -286
4359 -286 190 166 -113 165 3 85 61 -108 -146 61 -12 -118 229 -156 37 -120 27 195 -293 172 -110 -178
4381 -178 42 -3 -255 -19 281 -114 55 9 56 44 176 248 -391 129 -112 65 52 -58 -63 -442 -253 281 -16
4404 -16 -105 67 14 -162 -193 177 306 5 83 -46 -3 -138 338 -2 -68 -159 -22 -1 112 49 -41 -148 -121 144
4428 144 -3 -176 -25 -271 -33 -159 0 57 -168 -44 -27 -11 -87 108 120 -185 -104 134 -19 -157 -163 169 -174
4451 -174 1 -237 143 -73 -191 374 248 46 107 20 69 155 -185 -247 -83 82 -116 -206 52 -3 -120 185
4473 185 -35 -196 -22 -68 165 -60 16 -190 -111 17 -119 87 55 119 34 384 -66 -241 44 -189 -169 324
4495 324 -38 -68 52 86 -157 -131 -90 146 -176 -113 236 -68 -121 -183 100 -121 86 234 218 237 159 80 -38 214
4519 214 18 -26 79 -19 174 18 -284 3 -84 -123 37 23 -42 -398 83 43 -284 344 315 -70 49 30 73
4542 73 -34 -73 149 -24 -345 -40 203 -4 -47 -10 -92 -59 176 173 -83 -166 145 -143 -160 40 -54 -203 -136 128
4566 128 -139 260 -169 -171 11 -197 -234 -231 98 77 -5 325 -82 95 6 -18 60 44 50 -57 -390 85 323 -52
4590 -52 20 57 -19 -21 21 -25 -75 -232 141 -80 -190 283 124 78 26 120 24 131 -140 168 -191 -47 108 27 -61
4615 -61 -15 -217 -81 -77 35 115 110 159 470 36 219 -7 100 149 -295 -169 -90 -209 -44 -17 -326 190 -10 263
4639 263 185 118 -39 -171 10 107 -133 -199 94 -43 -56 63 21 -149 13 -107 66 -34 -84 -7 -196 135 -125
4662 -125 -173 10 -212 -81 20 -100 204 162 -29 -44 256 106 154 158 206 7 -182 -126 -149 -17 -226 -51 148
4685 148 125 -46 -206 149 60 -46 -87 76 -17 94 113 97 -23 53 -123 27 -4 -137 -175 -178 106 -257 -154 -42
4709 -42 -93 44 97 205 93 296 82 238 126 -217 104 -15 76 -86 189 -93 -168 -297 8 -275 -93 46
4731 46 7 -74 70 -161 -2 17 60 280 240 34 182 -289 44 81 -96 117 123 345 -211 -3 40 -321 2
4754 2 -38 -260 -121 137 48 171 -125 -343 -71 -60 -72 195 144 35 157 96 34 72 -245 72 85 -172 399 18
4778 18 -86 100 1 18 296 -96 331 119 265 70 -221 21 -256 31 74 -12 -305 143 12 -14 -183 -144
4800 -144 40 -124 -86 -210 -168 193 -109 121 298 56 -89 42 -150 73 59 -85 -105 -373 204 146 69 -168
4822 -168 150 -72 -36 -303 102 -28 140 -29 -230 42 30 -152 -17 -41 -39 38 122 -383 143 349 -111 314
4844 314 -47 30 181 -152 74 -115 311 173 -76 -188 106 61 -201 -70 -6 223 -255 205 126 -49 -146 -55
4866 -55 38 -58 144 -59 151 -219 136 -288 -84 292 -205 -185 278 4 202 -14 106 -125 -37 235 222 218 94
4889 94 48 -134 -23 -203 73 -11 193 -26 98 10 62 188 -109 -110 77 72 -118 -139 194 79 -259 -257 66 134
4913 134 -105 234 28 -110 -110 -120 129 -127 -131 -64 -162 31 52 -371 -29 -200 176 -54 213 -43 -149 -231 -4
4936 -4 246 231 -219 68 -89 -94 -52 180 2 89 -11 -97 -130 -101 118 43 -63 304 -5 -186 -18 -98 161 -95
4960 -95 -44 243 155 -242 76 -193 37 -60 87 -240 -11 -109 132 -186 123 45 -61 63 25 -184 -212 -264 -44
4983 -44 -92 -440 40 96 -131 -47 66 -172 -329 -134 -31 102 -155 196 -157 -184 22 -35 -1 -95 381 206 25
5006 25 -38 116 22 57 129 45 189 85 1 -244 -348 63 19 -288 81 295 -69 -23 68 154 -145 -191 395 28
5030 28 -164 361 -41 0 -187 -167 -64 -68 36 58 158 57 -30 7 21 101 -180 106 -151 -326 248 -9 -65 130
5054 130 -155 -160 -112 32 44 128 168 330 -162 51 92 -78 -254 11 -10 84 40 -40 -96 -109 183 -53 309 -157
5078 -157 286 -169 17 -349 66 -251 -168 184 6 51 -80 181 45 130 -127 176 -125 -230 66 -171 -308
5099 -308 235 255 -73 -25 -36 135 -31 168 140 80 -122 60 90 82 -66 3 -7 24 176 177 -167 261 33 176
5123 176 -80 -63 47 137 -127 -117 -194 -166 -286 105 360 -172 50 -110 -33 18 -20 -88 -167 133 -141 174 -260
5146 -260 -5 252 3 -30 -56 -45 -185 18 -15 13 22 288 -33 64 -60 54 -139 259 76 -52 -29 94 -285
5169 -285 176 86 27 -170 -322 -117 102 50 287 -100 275 -114 -168 267 -157 168 -272 153 107 90 -232 4
5191 4 -52 15 -188 -58 200 -78 66 -18 -47 280 -25 -118 -12 -77 -173 -241 157 -98 -179 -163 21 -8 -30 146 100
5216 100 -77 -69 129 -112 -24 8 -143 -45 -56 -4 111 204 -274 24 -6 94 -231 8 59 -111 -169 -253 108 9
5240 9 82 -340 -317 -310 92 -309 114 170 261 -56 -121 131 -17 -41 -42 -146 87 144 118 84 175 55 556 -25 -137
5265 -137 40 103 4 -23 -14 56 -66 25 -126 -156 46 107 151 -126 151 -61 -40 34 100 94 43 -47 84 1 331 -37
5291 -37 2 -59 -78 3 -2 121 299 -46 -26 -223 -50 -2 40 87 3 -132 260 -10 114 -25 -93 192 -42 193
5315 193 26 -29 44 352 -52 -113 -206 168 -51 -167 55 207 -123 -122 -102 136 -1 -113 -165 101 -187 12 -12
5338 -12 -48 -17 143 -167 177 81 -371 134 -65 -82 168 -370 51 -62 -124 100 -66 18 89 21 -132 119 -102
5361 -102 -24 -69 -179 -96 159 60 -181 -105 -118 210 19 95 -67 274 136 39 251 -10 -25 28 45 -182 214 -219
5385 -219 -229 219 -94 75 -186 55 16 159 -62 379 90 227 80 201 312 -71 -127 -34 105 -94 130
5406 130 18 6 -199 -5 -308 145 -61 -210 -255 163 58 6 -94 91 -32 226 -126 -180 -94 -170 -99 372
5428 372 -74 -105 61 -4 -178 -58 136 -70 -116 -180 -44 -269 56 280 333 76 -98 0 -143 -68 -69 32 -123
5451 -123 -15 229 -169 -86 44 229 -195 -80 76 -116 -159 53 236 45 -162 54 71 -22 276 -71 60
5472 60 100 -35 -74 -66 57 143 177 176 138 247 -125 -141 -52 -145 -88 229 178 66 90 -165 48 -68 29 57 -215 -301
5498 -301 -60 167 -235 -39 -77 -89 -107 91 -44 -15 158 155 7 -160 1 69 7 22 158 198 -99 135 49 199
5522 199 -78 190 56 -106 214 -68 -40 118 165 93 228 109 149 -202 87 -59 -116 15 -245 -2 -113 -106
5544 -106 143 95 -241 -225 213 21 90 257 94 -43 -39 131 -205 -118 47 186 -63 55 282 200 56 3 464
5567 464 104 -18 62 -70 -99 -178 -191 10 -134 -47 45 94 -157 154 -33 28 260 240 293 -207 17 77 -139 61
5591 61 -142 -153 -296 12 -30 6 -89 13 -13 -96 153 10 -133 -85 -145 -157 -183 -118 214 -99 -236 170 -185 -20
5615 -20 112 -132 3 -52 -142 -131 84 16 60 -217 67 -162 -105 -102 93 135 -187 17 137 -388 -245 69 -116
5638 -116 62 51 -397 225 -92 177 74 228 -164 14 49 86 -57 -77 -341 -7 37 -189 27 103 185 -78
5660 -78 228 91 1 151 -76 -244 -242 16 -96 230 132 -69 148 60 -70 -163 -143 39 49 -237 -137 -277 67
5683 67 11 146 71 -75 -91 135 -82 251 -7 7 201 95 180 -7 -122 21 -145 8 -144 -45 44 58 130
5706 130 -52 190 235 -214 181 -68 -255 39 -177 -212 58 112 -92 -160 -13 -14 -212 89 -282 7 52 88 -131
5729 -131 58 -32 159 -132 170 34 48 -253 -74 171 -66 22 145 13 -82 158 -272 -28 -58 181 5 -3
5751 -3 149 296 76 284 -72 -275 -130 50 -17 -41 -39 290 -157 37 295 7 137 271 -116 48 308 -4
5773 -4 -167 -160 -115 191 -18 37 -101 -49 502 263 84 232 -43 -79 -106 -20 76 -3 139 37 -38 -128 -91 30 334
5798 334 -43 -112 -30 10 199 -48 -85 60 -126 116 169 -126 129 21 -38 200 -92 96 77 -193 80 -172
5820 -172 -281 -51 -253 -355 -164 -211 81 28 112 117 385 77 108 166 -59 70 79 228 -104 -109 144 54 -13 150
5844 150 173 130 144 20 117 145 -343 -162 -242 -193 123 -193 -73 -15 97 -53 -171 -2 -10 -109 -78 -11 -77 -328 -100
5869 -100 -198 422 55 199 12 -182 343 99 -20 35 38 104 143 -59 -262 -25 -100 41 -70 -281 87 86 -69
5892 -69 -55 119 -171 -9 167 113 61 -10 17 88 -152 124 80 -121 13 26 159 110 34 -80 97 -380 142 271
5916 271 131 -46 22 45 -184 -91 -152 -56 -32 32 185 -43 -135 384 -105 -164 26 93 -10 27 85 158 30 56 121
5941 121 16 -219 2 25 28 94 35 38 -2 -22 198 -63 -23 14 -452 -195 -8 54 -48 -156 352 -52 78 143
5965 143 196 -131 87 -115 124 -62 -97 76 -156 -240 68 -92 -6 -175 263 99 106 -118 -238 -262 136 -116
5987 -116 -161 -26 0 105 -90 -32 -31 -23 11 -189 56 263 111 84 1 -237 -13 11 -146 -91 290 -26 -45 36 -12
6012 -12 -87 -196 -159 24 -87 -213 107 -142 93 -139 212 117 -10 -53 79 -404 229 91 204 -293 -8 26
6034 26 69 -113 373 70 33 159 410 -6 173 211 -248 -4 69 67 -348 169 -237 -91 157 -407 90 34 -101
6057 -101 -288 -139 -80 243 54 -1 -2 179 198 -25 -92 -28 -236 -193 323 31 215 65 -108 127 -214 86 93
6080 93 -242 -18 58 -260 110 -247 -275 -5 -89 19 62 -195 -17 44 -13 94 -24 -49 58 -85 -125 -151 -16
6103 -16 150 -163 -149 -65 14 159 -45 -153 -252 149 -134 350 -311 -158 -131 -167 191 -121 -116 163 -106 -127 244
6126 244 107 -98 43 -1 60 -94 -211 64 -127 -21 -64 108 15 145 -33 -123 49 108 42 -135 -1 -54 -229
6149 -229 110 -205 -57 168 182 205 108 5 31 -22 -12 102 -14 -148 -168 22 81 -148 -332 157 -225 53 188
6172 188 74 167 2 212 176 -64 190 119 -386 68 123 -133 -150 -19 -17 -34 -343 87 -44 -18 142 41 -51
6195 -51 -31 188 -71 135 -50 -37 263 -63 279 -82 75 89 -72 106 147 -53 -272 -103 -129 142 -153 -98
6217 -98 37 -36 -112 146 -238 113 -94 52 28 178 25 64 -84 15 -101 -88 -50 -23 -67 -156 -56 -153 -17 -14 132
6242 132 -42 147 86 171 -11 100 -179 -53 -129 376 51 189 244 -15 -132 -87 114 -172 88 -140 105 211
6264 211 3 5 -146 324 -44 -67 264 -22 64 3 -39 181 -124 -133 -60 -361 -14 -163 -55 72 106 243 121
6287 121 91 177 63 -104 201 98 66 -141 96 2 201 -10 -254 -83 -37 -173 258 -120 -208 297 45 -117
6309 -117 169 49 -46 -1 60 -190 102 93 364 -119 213 -47 -7 -338 -49 129 -55 -117 -146 -24 9 -59 151
6332 151 1 -26 97 2 30 226 -43 -233 -165 -1 -129 118 4 154 181 -119 71 50 165 -154 15 101
6354 101 216 -344 -108 326 255 -77 -172 -34 133 177 -89 -71 64 -19 -13 -149 7 201 18 298 -33 73
6376 73 -208 -117 -262 44 -165 12 4 54 104 -4 140 80 -37 79 -198 121 53 -110 -23 72 40 -118 -130 124
6400 124 39 -51 113 85 93 9 -135 -203 -73 -220 -48 -37 -79 89 -155 179 -50 -47 -34 -94 17 80 -73 -54 -137
6425 -137 97 194 205 83 -260 -157 25 -120 -81 23 47 7 -222 111 -191 98 -195 404 128 -84 113 217
6447 217 -51 -199 54 -37 118 330 72 1 78 199 7 -62 20 66 95 205 -36 23 -95 21 26 188 -126
6470 -126 11 -49 -86 143 52 -264 163 -51 -76 -28 -73 231 -174 -203 -181 91 -84 31 269 -38 -76 159 256
6493 256 140 -135 -173 102 -131 -106 -170 -60 -7 -223 -66 78 90 -79 259 -160 -133 92 -180 209 23 -136
6515 -136 -44 112 34 -223 214 -106 -168 -61 114 -18 161 -358 53 25 -211 -73 -69 -186 -19 67 -149 89
6537 89 28 -132 -90 197 -60 133 207 -82 -29 -120 156 12 68 196 203 9 -41 -86 21 -163 51 95 -136 215
6561 215 68 -141 39 -119 23 338 74 17 -59 -105 77 -29 6 -42 -226 -257 226 -28 -24 -28 -150 40 -93
6584 -93 201 -17 -157 -124 -4 -95 -73 -5 152 -9 91 -240 -90 166 -92 -103 -159 124 -57 44 1 -130 323
6607 323 109 56 79 -1 -75 -188 69 -143 -167 171 -127 -197 50 -45 2 -239 181 -257 64 -32 -93 64 91 -72
6631 -72 -138 -20 -24 -19 -6 18 -90 -48 -89 -26 73 -209 15 372 120 -156 50 154 -82 148 -123 269 205 -109
6655 -109 -24 -38 -23 -149 150 0 142 -176 -258 279 17 150 -198 -131 -238 85 -22 -12 190 -45 191 -162
6677 -162 76 88 72 -32 84 -76 -173 57 -67 -230 264 -70 -109 119 -245 3 86 -27 4 111 -27 52
6699 52 329 -25 63 -161 60 -19 -128 -2 2 -8 68 -47 158 67 125 86 -148 42 64 60 -85 243 93 -6 77
6724 77 251 2 -142 228 -40 -132 -112 -35 109 -2 -5 -51 -248 -342 160 -61 101 143 -61 67 -179 -53 -10
6747 -10 -215 108 -205 91 129 5 -51 0 -255 -40 29 -38 96 -73 -73 100 -84 -19 -32 78 125 117 19 125 342
6772 342 -32 145 -311 -33 64 -70 83 13 120 256 -98 -52 183 -422 -128 124 -31 36 -81 134 -185
6793 -185 -68 73 103 -45 383 -2 -179 10 156 140 186 -262 77 64 -93 28 155 -160 -26 -49 -57 -190
6815 -190 -6 6 40 -144 194 142 202 95 113 164 83 -104 -87 65 -174 106 -151 -73 108 -187 59 -14 128
6838 128 -12 -218 -131 -24 12 71 152 194 -56 -167 -89 146 -233 62 6 33 -115 122 153 18 -120 -134 -57 -98
6862 -98 -265 11 -90 -74 -15 -87 120 -137 -51 -199 180 109 -100 205 308 -300 144 40 -60 -6 11 248 -140
6885 -140 -129 79 83 -195 -108 39 124 -292 -287 -114 -158 110 -126 0 -2 -9 -127 261 23 -187 100 178 85 -67 -192
6910 -192 -31 -13 21 81 -82 17 122 273 121 92 139 -78 74 192 -41 90 -36 -115 -9 179 104 -134 -6
6933 -6 -136 262 -40 169 -62 303 -26 -76 -70 85 33 21 -39 -134 21 199 -183 -155 356 105 105 -79 -90 -26 -9
6958 -9 -306 -74 -109 199 184 46 -286 -131 40 -39 88 199 81 -152 109 106 -153 -94 142 20 -136 110 195
6981 195 -179 -58 59 -59 46 37 -17 -96 218 -8 185 -236 227 -173 135 29 113 21 -68 112 131 171 -5
7004 -5 -151 -56 27 42 -125 -36 -8 -84 -248 -228 20 -68 -118 -93 92 77 -223 9 152 86 175 388 -21 -30 -47 138
7030 138 -98 -104 163 -228 -72 -148 173 -198 -70 294 -196 -63 -113 101 140 -140 173 -101 -224 -364 8 -13
7052 -13 -89 17 83 0 -160 17 79 -89 236 83 56 68 69 229 97 -21 -235 265 33 -138 285 124 -245
7075 -245 -23 45 81 -111 -72 -73 -145 74 -36 -216 -142 -11 41 -97 11 -78 33 -189 -192 128 78 43 76 -38 -189
7100 -189 -65 -185 -226 -149 198 -116 -78 -104 -110 -78 207 76 5 -97 103 197 -1 -23 44 -103 238 105 -229 -279
7124 -279 -43 68 33 61 -22 -85 -6 87 108 14 467 -30 67 109 418 -105 -193 19 -136 -142 79 -18 60 -71 -12
7149 -12 97 -110 22 -70 108 -220 -103 295 -19 34 -115 193 54 30 170 21 124 -107 63 -160 0
7170 0 -49 -150 116 -27 129 133 -126 -207 57 184 -76 112 268 -168 -40 -67 -100 207 -260 160 54 13 28
7193 28 -157 46 388 12 227 2 -122 18 -16 50 -180 -193 127 -289 -62 78 183 -127 157 -196 -218 257
7215 257 -24 -221 281 60 -82 -255 42 202 -74 126 -95 -4 -152 23 107 -145 11 154 1 18 233
7236 233 108 -14 -81 196 17 -95 -64 -44 -170 -86 39 121 119 -231 8 200 16 -121 169 72 199 219 4
7259 4 -89 13 80 78 -85 1 -35 -216 -273 -143 -134 -31 -78 -167 -39 136 237 -42 -42 -61 61 -206 163 -83 -49 204
7285 204 -29 120 -22 23 -104 -217 22 16 110 -240 -51 307 263 -55 -73 -88 66 71 -154 -69 -94 125 82 -238
7309 -238 -188 -72 53 1 135 -74 -222 -106 27 76 -62 -22 41 -129 4 136 -79 243 23 -63 54 -237
7331 -237 26 38 32 -130 -5 -1 19 199 228 -14 -118 -164 327 181 -295 12 -32 133 -202 -29 81 -115 -130
7354 -130 138 -140 251 -73 -92 166 -135 137 246 42 64 -66 30 240 -331 -35 143 29 97 -59 119
7375 119 129 -147 -58 36 -104 40 87 -109 117 5 44 -28 55 -224 -203 154 -37 179 99 81 200 202 -97 -242
7399 -242 -64 -54 141 200 125 148 110 54 74 96 -29 0 -115 -31 174 -89 193 134 131 93 -20 171 -160 58 212
7424 212 -6 -112 94 25 167 -98 145 347 71 -41 -183 54 -279 16 84 -3 -1 -15 -178 54 142 -20
7446 -20 -104 28 93 -11 32 -364 233 129 -55 -165 34 50 22 101 230 -46 244 75 2 146 186 88 53 122
7470 122 209 -10 20 27 -68 32 -254 -290 1 39 116 175 259 24 -132 -64 -4 211 -26 27 190 161 150 -117 -81
7495 -81 70 31 38 238 -107 -27 -35 -176 -5 -25 27 -125 48 -59 171 -9 -86 14 113 -185 -130 -26 -98 -195 19
7520 19 -144 -8 -101 -205 152 40 -116 -48 -29 109 -264 213 -154 -195 153 121 -186 152 49 49 -119 46 -7
7543 -7 114 -307 -309 -10 -58 -93 60 -190 -148 119 -24 19 106 -1 -41 155 76 1 -99 -32 -124 32 19 27 288 -154
7569 -154 140 68 57 -32 -33 41 67 369 -39 21 60 199 -66 -250 56 -308 -85 121 -288 73 24 138 32
7592 32 -26 -33 544 -107 133 -44 -77 120 113 158 -105 -96 46 -44 39 137 32 -45 -22 200 -125 56 19 -93 -433
7617 -433 165 -102 -160 160 -95 -69 -4 16 202 30 210 -13 -7 -91 100 -191 -66 165 -199 -169 84 -102 173
7640 173 206 -16 -6 -37 -109 162 18 225 -220 -184 -44 -103 71 37 114 -56 2 -167 -256 2 23 -101 -173 -124
7664 -124 -140 -43 26 209 -175 -136 -359 86 -29 136 56 58 137 -283 -73 65 41 -10 -120 59 9 166 146 -27
7688 -27 49 -94 -85 -36 -207 -116 104 88 -33 181 -142 -219 114 -273 -18 57 60 -112 101 22 -309 53 -248 -14
7712 -14 68 -43 3 162 80 229 179 -125 47 -146 58 138 -85 -62 336 257 32 147 49 -149 336 -85 128
7735 128 94 353 -3 149 -196 44 78 -17 167 -136 275 -105 54 112 155 -60 131 -208 -112 -32 -64 249 -12
7758 -12 22 -54 -212 37 -28 103 45 46 217 135 135 291 -144 85 -4 43 161 -50 15 24 -10 128 -98 -1 11 -252
7784 -252 -59 114 -35 122 -208 -155 26 69 217 -162 88 -199 -258 -83 90 106 186 -10 91 117 6 -84
7806 -84 -121 116 59 -64 113 19 -141 -16 -381 -150 109 163 259 -48 141 -168 156 -328 60 -129 -25 12
7828 12 21 142 224 125 58 -57 163 88 290 -43 94 -40 -134 115 68 -156 -188 -125 -104 147 80 142 -4 9 -31
7853 -31 33 20 88 -198 -71 90 -126 18 39 -146 120 -314 -46 -22 -109 -12 -51 -43 109 30 81 36 163 -205 77
7878 77 -283 -145 -47 225 121 69 25 -19 91 74 38 82 -212 -244 -251 96 108 10 50 -130 -64 -157 -12 217 138 -81
7904 -81 102 -157 -271 28 83 138 -101 -94 145 -99 -171 48 255 -288 -219 -59 60 -105 -60 -17 -40 -17 -333 -71
7928 -71 -26 67 -267 39 111 5 -66 203 -237 -105 -135 -31 348 33 -43 94 -238 -74 233 201 -252 70 -88
7951 -88 -13 132 -257 -80 -247 202 -27 -76 148 -75 189 4 90 -69 162 -32 139 177 69 -22 -239 132
7973 132 49 -12 -56 -85 -133 -229 -42 164 -11 -221 171 1 65 -141 14 104 159 -50 65 -63 15 255 -121
7996 -121 139 -13 112 -87 142 80 46 -123 -171 -215 74 -22 -81 36 -153 -95 49 7 132 26 -16 -163 46
8019 46 -72 199 -71 74 239 189 291 78 -113 -1 75 120 201 -98 -36 196 -94 74 258 -113 -122 136 -49
8042 -49 84 98 86 -248 126 -184 -214 204 58 -54 191 37 25 -146 -43 193 158 115 -57 238 -102 42
8064 42 268 20 -205 -131 101 278 70 -98 99 -125 21 -128 238 -55 87 6 174 -159 -259 -75 -194
8085 -194 -13 61 212 -20 444 62 -131 -16 55 64 318 -202 -34 127 202 170 -39 -438 -62 48 48 224 113
8108 113 -80 -4 -84 31 225 301 -51 62 101 -96 120 64 104 49 -142 -26 -125 86 147 -102 -43 13 254 -83
8132 -83 -279 90 86 -146 -19 -22 85 3 -180 8 141 -42 171 51 -103 132 -29 79 -109 2 -180 -9
8154 -9 -51 128 -36 -103 132 171 30 -241 221 175 -77 254 144 169 -10 91 -68 -39 103 172 -82 259 -3
8177 -3 -259 82 146 -91 -141 93 125 55 -206 80 -108 0 -154 -28
8191b8
##END NTUPLES=NMR FID
##END=
