##TITLE=1H_Pr Q-24
 CDCl3, 8 sc, 
 25.08.2021
##JCAMPDX= 6.0         $$ Bruker NMR JCAMP-DX V2.0
##DATA TYPE= NMR FID
##DATA CLASS= NTUPLES
##ORIGIN= UXNMR, Bruker Analytische Messtechnik GmbH
##OWNER= root
$$ XWIN-NMR		Version 3.5
$$ Wed Aug 25 09:09:50 2021 Russian Standard Time (UT+4h)  she@DPX200
##.OBSERVE FREQUENCY= 200.131506
##.OBSERVE NUCLEUS= ^1H
##.DELAY= (6, 6)
##.ACQUISITION MODE= SIMULTANEOUS
##.ACQUISITION SCHEME= undefined
##.AVERAGES= 8
##.DIGITISER RES= 18
##SPECTROMETER/DATA SYSTEM= spect
##.PULSE SEQUENCE= zg30
##.SOLVENT NAME= CDCl3
##.SHIFT REFERENCE= (INTERNAL, CDCl3, 0, 15.7039)
##AUDIT TRAIL= $$ (NUMBER, WHEN, WHO, WHERE, WHAT)
$$ ##TITLE= Audit trail, XWIN-NMR		Version 3.5
$$ ##JCAMPDX= 5.01
$$ ##ORIGIN= Bruker BioSpin GmbH
$$ ##OWNER= she
$$ F:/spectra/data/she/nmr/H-F/1/audita.txt
$$ ##AUDIT TRAIL=  $$ (NUMBER, WHEN, WHO, WHERE, WHAT)
(   1,<2021-08-25 09:07:52.60 +0400>,<she>,<DPX200>,
      <created by zg, POWCHK disabled, PULCHK disabled
       configuration hash MD5:
       00 E9 B6 7A A2 85 ED C7 34 08 36 98 17 FE 4E 26
       data hash MD5: 16K
       A9 1B 2D F2 E0 90 06 4D 44 FC 54 65 7A 19 E2 F1>)
$$ ##END=
$$ 
$$ hash MD5
$$ 95 B8 1B 8E 73 43 76 DB 74 CE 7C 53 3F 7A 32 2E
##$RELAX= 
##$RELAX= 
##$RELAX= 
##$RELAX= 
##$RELAX= 
##$RELAX= 
$$ Bruker specific parameters
$$ --------------------------
##$DU= <F:/spectra>
##$EXPNO= 1
##$NAME= <H-F>
##$PROCNO= 1
##$TYPE= <nmr>
##$USER= <she>
##$AMP= (0..31)
100 100 100 100 100 100 100 100 100 100 100 100 100 100 100 100 100 100 
100 100 100 100 100 100 100 100 100 100 100 100 100 100 
##$AQSEQ= 0
##$AQ_mod= 1
##$AUNM= <au_zg>
##$AUTOPOS= <>
##$BF1= 200.13
##$BF2= 200.13
##$BF3= 200.13
##$BF4= 200.13
##$BF5= 200.13
##$BF6= 200.13
##$BF7= 200.13
##$BF8= 200.13
##$BYTORDA= 1
##$CFDGTYP= 0
##$CFRGTYP= 5
##$CHEMSTR= <none>
##$CNST= (0..31)
1 1 145 1 1 1 1 1 1 1 1 1 1 1 1 1 1 1 1 1 1 1 1 1 1 1 1 1 1 1 1 1 
##$CPDPRG= <>
##$CPDPRG1= <>
##$CPDPRG2= <>
##$CPDPRG3= <>
##$CPDPRG4= <mlev>
##$CPDPRG5= <mlev>
##$CPDPRG6= <mlev>
##$CPDPRG7= <mlev>
##$CPDPRG8= <mlev>
##$CPDPRGB= <>
##$CPDPRGT= <>
##$D= (0..31)
0 1.2 0 0 0 0 0 0 0 0.06 0 0.03 0 0 0 0 0.0002 0 0 0 0 0 0 0 0 0 0 0 0 
0 0 0 
##$DATE= 1629868072
##$DBL= (0..7)
120 120 120 120 120 120 120 120 
##$DBP= (0..7)
150 150 150 150 150 150 150 150 
##$DBP07= 0
##$DBPNAM0= <>
##$DBPNAM1= <>
##$DBPNAM2= <>
##$DBPNAM3= <>
##$DBPNAM4= <>
##$DBPNAM5= <>
##$DBPNAM6= <>
##$DBPNAM7= <>
##$DBPOAL= (0..7)
0.5 0.5 0.5 0.5 0.5 0.5 0.5 0.5 
##$DBPOFFS= (0..7)
0 0 0 0 0 0 0 0 
##$DE= 6
##$DECBNUC= <off>
##$DECIM= 32
##$DECNUC= <off>
##$DECSTAT= 4
##$DIGMOD= 1
##$DIGTYP= 9
##$DL= (0..7)
0 120 120 120 120 120 120 120 
##$DP= (0..7)
150 150 150 150 150 150 150 150 
##$DP07= 0
##$DPNAME0= <>
##$DPNAME1= <>
##$DPNAME2= <>
##$DPNAME3= <>
##$DPNAME4= <>
##$DPNAME5= <>
##$DPNAME6= <>
##$DPNAME7= <>
##$DPOAL= (0..7)
0.5 0.5 0.5 0.5 0.5 0.5 0.5 0.5 
##$DPOFFS= (0..7)
0 0 0 0 0 0 0 0 
##$DQDMODE= 0
##$DR= 18
##$DS= 0
##$DSLIST= <SSSSSSSSSSSSSSS>
$$ [...]
##$SUBNAM2= <"">
##$SUBNAM3= <"">
##$SUBNAM4= <"">
##$SUBNAM5= <"">
##$SUBNAM6= <"">
##$SUBNAM7= <"">
##$SUBNAM8= <"">
##$SUBNAM9= <"">
##$SW= 20.0188882624521
##$SWIBOX= (0..15)
0 0 2 0 0 0 0 0 0 0 0 0 0 0 0 0 
##$SW_h= 4006.41025641026
##$TD= 16384
##$TD0= 1
##$TE= 0
##$TE2= 300
##$TE3= 300
##$TEG= 300
##$TL= (0..7)
0 120 120 120 120 120 120 120 
##$TP= (0..7)
150 150 150 150 150 150 150 150 
##$TP07= 0
##$TPNAME0= <>
##$TPNAME1= <>
##$TPNAME2= <>
##$TPNAME3= <>
##$TPNAME4= <>
##$TPNAME5= <>
##$TPNAME6= <>
##$TPNAME7= <>
##$TPOAL= (0..7)
0.5 0.5 0.5 0.5 0.5 0.5 0.5 0.5 
##$TPOFFS= (0..7)
0 0 0 0 0 0 0 0 
##$TUNHIN= 0
##$TUNHOUT= 0
##$TUNXOUT= 0
##$USERA1= <user>
##$USERA2= <user>
##$USERA3= <user>
##$USERA4= <user>
##$USERA5= <user>
##$V9= 5
##$VALIST= <valist>
##$VCLIST= <CCCCCCCCCCCCCCC>
##$VD= 0
##$VDLIST= <DDDDDDDDDDDDDDD>
##$VPLIST= <PPPPPPPPPPPPPPP>
##$VTLIST= <TTTTTTTTTTTTTTT>
##$WBST= 1024
##$WBSW= 4
##$XGAIN= (0..3)
0 0 0 0 
##$XL= 0
##$YL= 0
##$YMAX_a= 82646
##$YMIN_a= -124420
##$ZGOPTNS= <>
##$ZL1= 120
##$ZL2= 120
##$ZL3= 120
##$ZL4= 120
##$ABSF1= 10
##$ABSF2= 0
##$ABSG= 5
##$ABSL= 3
##$ALPHA= 0
##$AQORDER= 0
##$ASSFAC= 0
##$ASSFACI= 0
##$ASSFACX= 0
##$ASSWID= 0
##$AUNMP= <proc_1d>
##$AZFE= 0.1
##$AZFW= 0.1
##$BCFW= 1
##$BC_mod= 2
##$BYTORDP= 1
##$COROFFS= 0
##$CY= 11.3945322036743
##$DATMOD= 1
##$DC= 2
##$DFILT= <>
##$DTYPP= 0
##$F1P= 2.36226072786647
##$F2P= -0.459571619588291
##$FCOR= 0.5
##$FTSIZE= 0
##$FT_mod= 4
##$GAMMA= 1
##$GB= 0.15
##$INTBC= 1
##$INTSCL= 1
##$ISEN= 128
##$LB= 0.24
##$LEV0= 0
##$LPBIN= 0
##$MAXI= 10000
##$MC2= 0
##$MEAN= 0
##$ME_mod= 0
##$MI= 1.114404
##$NCOEF= 0
##$NC_proc= 0
##$NLEV= 6
##$NOISF1= 3.799351
##$NOISF2= 2.8
##$NSP= 1
##$NTH_PI= 0
##$NZP= 0
##$OFFSET= 15.70392
##$PC= 1
##$PHC0= -13351.96
##$PHC1= 6.800992
##$PH_mod= 1
##$PKNL= yes
##$PPARMOD= 0
##$PSCAL= 0
##$PSIGN= 0
##$REVERSE= no
##$SF= 200.130013532006
##$SI= 16384
##$SIGF1= 3
##$SIGF2= 2
##$SINO= 400
##$SIOLD= 16384
##$SREGLST= <1H.CDCl3>
##$SSB= 0
##$STSI= 0
##$STSR= 0
##$SW_p= 3612.71676300578
##$SYMM= 0
##$S_DEV= 0
##$TDeff= 0
##$TDoff= 0
##$TI= <>
##$TILT= no
##$TM1= 0
##$TM2= 0
##$TOPLEV= 0
##$USERP1= <user>
##$USERP2= <user>
##$USERP3= <user>
##$USERP4= <user>
##$USERP5= <user>
##$WDW= 1
##$XDIM= 8192
##$YMAX_p= 0
##$YMIN_p= 0
$$ End of Bruker specific parameters
$$ ---------------------------------
##NTUPLES= NMR FID
##VAR_NAME=  TIME,          FID/REAL,        FID/IMAG
##SYMBOL=    X,             R,               I
##VAR_TYPE=  INDEPENDENT,   DEPENDENT,       DEPENDENT
##VAR_FORM=  AFFN,          ASDF,            ASDF
##VAR_DIM=   8192,          8192,            8192
##UNITS=     SECONDS,       ARBITRARY UNITS, ARBITRARY UNITS
##FACTOR=    0.0002496,     1,               1
##FIRST=     0,             0,               0
##LAST=      2.0444736,     0,               0
##MIN=       0,             -124420,         0
##MAX=       2.0444736,     82646,           0
$$ Real data points
##PAGE= N=1
##DATA TABLE= (X++(R..R)), XYDATA
0@%%%%%%%%%%%%%%qJ6j6J6j6K4l2L2m0M8n6O8p6Q8j04J20j36J55j79K03k29K59
36A37k92L27l65M06m52N04n60O22o87P59q38R24j019J124j239J364j503J657j830
55i61K025k245K494k782L123l524M008m612N384o410P849j0036J3803k2066P6674
70F2724n7839q1682J40505J8938r3580k2381P3445o952l3897O150Q519k1148J0540
83C342p9k7968L775M2274k0657n1827K8601N9397m3941o1192L8756M9067l5732
96a6184k9015L0341J2728k2386J0402J4827k4668q738K8677O118j6867J858J1372
109a535J135L466J920j0650J008J6544o105j1015J9457J3482k3328j2000K9615
122B1994J3988l3879j6545L1444J7121k1316j1905J0043O019m39j956j2994n188
$$ y = [0, 0, 0, 0, 0, 0, 0, 0, 0, 0, 0, 0, 0, 0, 0, -8, 8, -8, 8, -8, 16, -16, 16, -24, 24, -32, 36, -40, 48, -56, 64, -72, 83, -96, 107, -122, 137, -155, 172, -193, 213, -239, 265, -295, 327, -360, 399, -439, 485, -534, 590, -649, 715, -788, 869, -961, 1064, -1181, 1313, -1469, 1654, -1870, 2138, -2474, 2910, -3500, 4349, -5687, 8116, -13950, 62724, 4885, -76797, 63708, 82646, -10934, -33315, 40130, 33178, -719, 5431, 13950, -7198, 3342, 3263, -24705, -20930, 21344, 687, -51140, -22539, 36858, -7083, -68275, -29519, 19548, -16184, -45199, -14858, -2130, -24516, -14114, 713, -23955, -32693, -4016, 2102, -14765, -12907, -1535, -400, 3066, 4986, -5664, -4656, 11888, 5783, -5232, 14225, 27707, 4379, -7621, 21994, 35982, 2103, -14442, 17002, 34123, 12807, 902, 10945, 16964, 16525, 14569, 1575, -3613]
135c613J8830K575k1918M098K0808j3405k1101J6591J6469k3201j5748K2843J1735
148A4963j7740o275J1854l10r513M739P491j1150o991J4982R472j0464j0048N685
162c305R824n19q259m801O756J0332l249j0401N066Q483o150q632O947Q091p124
177C059r454O680J2439k968j5859m206J6923O758j7585r433J5124J0366j1966
190a22j0722R928O982j0719n798R636M358r057l986Q968M774p098n042K355N089
205d54K583n483m326O428P035m404p243N307O466o006m091P646L771o257k535
220a563O437M062n726l504L367K664k90k003j104J848K050l98l157j312K347J55
236C873k224O58R14j574m66R40n60j860M17L04k495J293L264k304l609J480L923
$$ y = [-3613, 15217, 17792, -4126, -28, 20780, 7375, -13726, 2865, 19334, -3867, -19615, 3228, 14963, -2777, -9052, 2802, 2492, -7021, -2282, 5209, -5941, -12932, 2050, 11522, 1058, -8990, -3305, 6519, 6000, -2259, -7060, -304, 10028, 6779, -3622, 1444, 9927, 3777, -4855, 2092, 10183, 3059, -6395, 285, 12724, 9756, -6103, -10309, 6614, 13372, -4213, -13646, 1478, 11844, -122, -10844, -916, 6066, -4653, -10451, -815, 3543, -5514, -9500, -532, 4242, -2856, -7898, -5543, -454, 2129, -3354, -7680, -1252, 5783, 1379, -5864, -557, 5909, -97, -4188, 3458, 7229, 972, -1563, 4874, 8936, 3210, -294, 3073, 5737, 5447, 3444, 2340, 4188, 6238, 5840, 2683, 1371, 3718, 3873, 1649, 2307, 3221, 1647, 1181, 2121, 1561, -299, 118, 422, -2073, -780, 2484, 180, -3429, -1949, 1974]
253A974j144m834O15L850P38k576j026J229K177k37k552L9K129J124k385o74L751
270B198N07l497K48K998M21l066l07K936l23j597R58j61o26L97M47q84q94O08
288C63J059j547N7K97j130Q92j87j545l44J419P36j954r33K539j19k568J86K142
306f37M69k183n49K489q4j064K35J44P60L38j263K93J467Q54j182j279L005M64
324B277k432N46K163m97n00L18J041m25p98J120M1l62L58O1l6M6r5P1m43n1K48
345B651o88j42P16p62k52K02L06j328j066J498J57k125J17J313j141q29K00J36
363a037j17o44n8j26pJ5m86k17P14l36l44mM6O98o12J8N23j75m2M55L09j4k88
386a729Q23M47r68J136Q73r33K81K55M26N19n22L15O24P6K21j299R46J406p67
$$ y = [1974, 830, -4004, -3389, 461, 1199, -1377, -2403, -1174, 1003, 766, -1786, -1747, 382, 1506, -879, -1553, 2198, 2705, -792, -544, 2454, 2875, -191, -498, 2438, 2115, 518, 1476, 1315, 689, 1086, 1533, 649, -245, 363, 1422, -125, -68, 229, -901, -9, -196, -1741, -2085, -666, 70, -1884, -2817, -278, -397, -2965, -2779, -637, -168, -2351, -2900, -411, -495, -1559, -1324, -1180, -420, -82, -1345, -1052, 415, 1269, 87, -1192, 1813, 2277, -155, 391, 2554, 2057, 1557, 1875, 2916, 2491, 1693, 2813, 2854, 2492, 2850, 2911, 2875, 2921, 2826, 2897, 2454, 2403, 2651, 1963, 1821, 2537, 1775, 1523, 1725, 2031, 703, -363, 1135, 1292, -833, -716, 597, -544, -1373, -1173, -1037, -1154, -1798, -1856, -1982, -1989, -1974, -2460, -2677, -1963, -2299, -2643, -2647, -2601, -1903, -2515, -2497, -1974, -2149, -2191, -1736, -1427, -1441, -1729, -906, -459, -1427, -291, 582, -351, -70, 185, 611, 1130, 608, 923, 1547, 1623, 1844, 545, 1491, 2897, 2130]
405B130r34N74P31k28p45m13J307l32o67r26Q30P92j221n50R6L51r3m92j017Q43
425C6O09j061j82K43Q9m44J08M05j135K64J498j061r61Q07J287j48j617M4K282
444A063L13j733r05K095J878j803k321K381K012j259k391M86L324N6l943k61L290
461B282J013l447j943L186K040k681k592P55L624p56m624p2M617p56m316k68L907
478c1J45m026J16K828l17k207k87K157N42k326J5K005L83j149m8L17J078L91p77
497a191n23K384R78l222M22M853q08n098J796O366j547o541J509P158q00o145
513d09J52N420M76n140L86L728p42k165O3L33L20P47j900k381K438L443m456l744
531c431M276L210m209l255K529L085k396k765K344J47j552N07J341j784j763K991
$$ y = [2130, 1196, 1770, 2501, 2273, 1528, 1115, 2422, 2090, 1423, 497, 1327, 2119, 898, 348, 444, 795, 702, 210, -807, 36, 645, -416, -598, -355, -266, -710, -602, -197, -1332, -1068, 430, -631, -1592, -785, 502, 354, -1263, -1219, 1063, 1376, -357, -1262, 833, 2711, 908, -1413, 968, 2980, 1721, -670, -184, 3140, 3196, -747, -1008, 2282, 3295, -152, -2095, 1091, 3131, 450, -2142, -1387, 2237, 1481, -3143, -3215, 1402, 646, -3670, -3938, -31, 114, -3912, -3796, -968, -1285, -3492, -3779, -1622, -1080, -3406, -3391, -1386, -1003, -2152, -2200, -1883, -805, -414, -1191, -1714, 670, 1648, -1574, -1152, 3701, 2893, -2205, -409, 5957, 4410, -2131, -622, 6536, 5736, -409, -257, 5163, 5639, 499, 885, 4613, 3871, 1706, 1769, 2102, 2422, 3169, 1269, -1112, 1326, 4769, 313, -3431, 845, 4055, -154, -3409, -880, 2205, -191, -2956, -612, -465, -2017, -1510, -169, -1953, -3716, -725]
547g25K000m519k61M336l47l652ML542K24k159j646J853L114m37m408k52N574
564B241N09n061j171M347K304l699k682K842K760k568k462J734K207m31k615o82
580b427K432K507l721m108N341M521n558m703O022L180n156j527N416p73n054
595c608L701M439m432m000M821M630m022m087L971K850k909l34J193p75P23K120
611D281k191k797N201J831p406o95R327q83j0680J091J0941p56j1655M2R575O73
627E899q222j768N252J730m088j846J424P51M93k075k564K951L039m017m000M321
643b720M168n237l645M390L144k456k847R79K837k7j425K64J074o8L88L76K39
660e66o18P89J437q65j02J386J29m3l78K34J987o15k326Q24L074l06l585M44L111
$$ y = [-725, 1275, -3244, -3505, 831, 484, -3168, -3164, 378, 602, -1557, -3203, -1350, 1764, 1327, -3081, -3333, 2241, 2750, -2311, -3482, 865, 3169, -530, -3212, -370, 2390, -178, -2640, -906, 1301, 870, -1745, -2427, 5, 2512, -1209, -5317, 24, 4545, -1013, -5716, 306, 3486, -1670, -3197, 2219, 1446, -3608, 93, 4532, 100, -3900, 921, 5551, 1529, -2558, 1413, 4263, 1354, 1020, 2213, 1438, 2161, 4281, 2090, -707, 4494, 6325, -1081, -1776, 7551, 6668, -4012, -2921, 8020, 7264, -4391, -4349, 5226, 5899, -2323, -4091, 1161, 2891, -1197, -3043, -1619, -868, -375, -2450, -5014, -2063, 976, -3041, -7041, -2720, 1448, -3789, -7434, -3044, 100, -2356, -5203, -4224, -1387, -1414, -2839, -2575, -1501, -1569, -1181, -805, -566, -1184, -395, 1042, 177, 75, 1461, 1590, 1547, 1169, 1403, 3390, 2775, 449, 1273, 4347, 4041, 456, 900, 4011]
679D011L1k055o38M33R68R7j619o05J106j5j058n13J054n18r62j90J227J86j749
698h09k196K745J742l048j103J839M46r00m92J103m98j127J219J249p69j482L88
715a693K420k91k026K52J571n7m95L28m5J40Q62l26r04O35Q02j196L40J282k19
734A380j519o9J654L1j896q67K394o5j410o92J373J62j360J96J202j264l41O19
752d72j65j54k15j61J48M84Q8p63l23Q28N3l96J67M27J41j81n03J078p5l16p5
773c85N87K21m86N50j85K27L04L05o92M55N65l4k57k07l5J051p79l33K27N36Q9
794A724r84J66Q93m67o61l77L84R51q82j107Q69O99q55q54L31R58n61r29l06R65
814d3K07j047n58Q53Ln30l47Q2P66n86l39R5M14J15m74k60R57j84m78M53O1q6
$$ y = [4011, 4042, 1987, 1349, 1782, 2750, 2847, 1228, 623, 1729, 1714, 656, 143, 1197, 679, -283, -473, 754, 940, -809, -3005, -260, 1482, -1566, -2669, -830, -384, -1284, -1776, -673, -1171, -2298, -1079, 170, -599, -2081, -1693, 727, 436, -1590, -1338, 233, 176, -319, 9, -36, 104, 966, 640, -264, 371, 1173, -23, 317, 1599, 1380, -139, -208, 1446, 1477, -419, -1286, 1108, 1043, -367, -1059, 314, 476, -884, -688, 514, -750, -1091, -472, -637, -791, -1006, -1167, -1019, -535, -447, -1210, -1533, -705, -652, -1048, -881, -454, -313, -494, -997, 81, 6, -310, -385, 202, 423, -63, 487, 302, 529, 833, 1138, 446, 901, 1466, 1432, 1175, 968, 933, 1984, 1205, 872, 1099, 1635, 1724, 740, 906, 1799, 1332, 671, 294, 678, 1629, 747, -360, 509, 1208, 353, -501, -170, 788, 227, -702, -1008, -43, 164, -883, -1441, -588, -585, -1115, -1462, -1380, -614, -1200, -1539, -1444, -1030, -915, -1389, -1649, -692, -876, -1354, -901, -840, -926]
836i26j60N4K35L01j92L17j24K1J73K48K67l03k16P29R9n1l70J35O71j88n72P5
858B23Q21P1p43rO32J03p46K28O41j98j11o74N11P28o87o30L72N89n0o98l23Q18
880H68j94l70J0J31K44p79n8N94r7m26k1J96L87o80J17J59j00j11J1j18L01k88
902b24kJ4j69J5K03j32M10r08J95P22k73l52l29R7N79o59L6L10O7l9j73J8L7j20
926f77k75N43k07L21m28j56N95N7k11m8k9M21k46J20n7K9K64l5K18K1K54l94M42
949E22k14L0L37k36K22Kj86P06l83j54J78J22J68o32j30O52m6l69Q9J83R8j43
971H16q07O14r2r6J31l64K07km84j19L32ko7m52K79n7m65J3L52n80J67L17L73
994A4o22o37J003P0r54J61O67K87o34k62L81K50j09k27J72M72J00l45r5L01L17
$$ y = [-926, -1086, -1032, -797, -496, -688, -371, -495, -474, -301, -53, 214, -89, -305, 424, 523, 472, 102, 237, 908, 720, 148, 223, 1044, 1115, 372, 363, 995, 1098, 352, 580, 1221, 1023, 912, 238, 749, 1477, 790, 160, 532, 1121, 1071, 373, 50, 868, 674, 304, 314, 445, 689, -90, -148, 446, 349, -77, -98, 98, 485, -195, -78, 81, -19, -130, -119, -237, 64, -224, -226, -212, -381, -366, -163, -295, 115, -793, -598, 124, -149, -501, -830, -733, -154, -813, -777, -467, -400, -439, -612, -594, -557, -677, -952, -409, -616, -295, -723, -879, -284, -227, -438, -486, -515, -94, -340, -220, -277, -248, 16, -19, 199, 220, 474, 80, 522, 308, 338, 675, 439, 661, 663, 477, 1183, 800, 646, 824, 946, 1114, 482, 352, 1004, 958, 589, 678, 861, 959, 816, 9, 623, 531, 435, 566, 202, 409, 407, -77, -196, 136, 134, 67, -385, -106, -163, -628, -615, -263, -843, -676, -359, 14, -608, -1245, -242, -172, -1126, -965, -298, -11, -645, -907, -526, -276, -385, -612, -440, 32, 132, -213, -308, -7, 310]
1015C10l01r91P68J044m89j296N06J422m15j508M04J459o36q59%R52M67j362q1
1034f06O85J43l19j37K64K94l92J21l16J28M79m00k83N60J11k08o41J100J62q10
1054f5j37O08J4o41L83R52q2j432P06J141q03r68O86J267p55j303O67O06j2m00
1074D32R7j38O12j79o19j18L48K31o48l01M02N36p57n31J037K62j343m46J052
1093g1J21p84r2R4J49o3m36K64L51m43P5K87k82m15K69J158r72j067J234M53n22
1114f92m32Q23M03k18l93O9N39o1j4k91K34K72L97l03n73R63O40r20r42J737M69
1135A707j571m31J565N28j891l7J343J40r11l62J029J60j504R82N22j016m14J082
1153I21r4j194L97P03o80l95J160n32j002J076K52j026n46J091L65j041m30J237
$$ y = [310, 9, -982, -214, 830, 341, -955, -449, 973, 558, -950, -546, 913, 277, -582, -582, 370, 837, -525, -606, 79, 222, -97, -234, 30, 324, -68, 53, -263, -135, 344, -56, -339, 221, 332, 124, -517, 583, 745, -65, -202, 406, 420, -221, 162, 1114, 1032, -400, 306, 1447, 644, -324, 362, 1629, 874, -429, 238, 844, 832, 432, 529, 391, 1003, 824, 205, 87, 435, 666, 18, -283, 119, 655, -102, -633, 404, 666, -677, -1123, -71, 50, -734, -826, -732, -583, -646, -1082, -818, -467, -910, -835, -548, -830, -1245, -976, 182, -790, -1857, -623, -170, -692, -1124, -301, 102, -116, -509, -440, 99, 38, 24, -267, -33, 239, 636, 333, -240, 723, 1363, 443, -499, 1238, 1707, 136, -295, 1270, 1798, -93, -130, 1213, 1353, 442, 80, 1109, 1269, -235, 747, 1269, 253, -161, 921, 827, -367, 30, 733, 53, -342, 818, 286, -716, 360, 612, -414, -960, 131, 496, -545, -975, 262]
1171B62K22j468j86J285K06j762O99J185r03o40P81K95k92j23j20K0K12K23n59
1190f63j24Q45K58m40m38l9Q83k12p95K35J097l76p71J25J004n90l18L76j35p0
1210a48j6K30J16L86r78L97M80l40n40N72O1m14L08M20o52k18P85j46J37k63j99
1231b2L13K46j04j36J5L4N3K32l77l86Q96L8n69K19L62o34j2P03m87k56j61N40
1253E07k58j97J70q7J69j15l94r7L90l33L39l3k89R1J86l50k03J60J25k34J17
1274c36K32o88Q7L30r6l07J47N7L41k7l19J44J42J38k28J02J0Ok6J11k65N1L73
1297b1k48L30n9l07K13L59l30J71J08J66m82M18J19m46P6M90j09k98l2K74k0p2
1319C00J14l37K85N6m34K46j7mn7L53j33J0M3n66N99j06l09K97J32O8o20J98J37
$$ y = [262, 484, -984, -1170, 115, 321, -1441, -742, 443, -460, -1100, -319, -24, -316, -439, -559, -539, -327, -104, -663, -787, 58, 316, -124, -562, -601, 282, 70, -725, -490, 607, 231, -540, -415, 589, -1, -319, 57, -78, -148, -164, 66, 182, 568, -410, -13, 467, 127, -413, 159, 220, -194, 114, 534, -118, -336, 449, 303, 440, 177, -22, 291, 537, 433, 297, 312, 346, 399, 631, 254, -132, 764, 802, 233, 452, 814, 180, 168, 871, 384, 128, -33, 507, 249, 52, 222, 135, 304, 189, -205, -302, 88, -245, 94, 61, -228, -137, 49, -301, -504, -344, -219, -453, -336, -104, -792, -705, -375, -471, -778, -631, -574, -233, -260, -579, -435, -293, -155, -383, -281, -271, -265, -291, -180, -445, -394, -21, -269, 61, 2, -305, -92, 267, -63, 108, 216, 382, -100, 318, 437, -9, 67, 557, 448, 150, 118, 392, 372, 300, 414, 77, 362, 418, -16, 230, 213, 209, 152, 505, 372, 382, 425, -141, 458, 352, 43, 340, 472, 540, -80, 118, 255]
1342B55j77j05n4K57l5N4j11J06j26K43n81L45J30j84k47K62j79j5o1J32R4j41
1364a38m77M59J2k27j9j73l7L67k99j45J40J3p2k8K46J09j64k49K61j32j07nO15
1387e0k96j07K28p8pL20l76J52K84j16L17n28K29M31k00o2J85J16k47J85K02J28
1409G10m49M01%K88o57k8K68M42m63k24L07J05j69J33k60J38n78J44K13P2k82
1430A11j85J40o2L39n27o5J49L16n80q7L10j56j41J07j77L72m03J26J91k69J86
1451c05O5k50J24r9J7rJ54J63j44k2J89j68m30O39K19k63K37m31N34k04m7J23
1473I2j08R3j45j70M53k30j06J42O5L6m29K44K02j09P4RP5n5J07l02N9M3M4P9
1497A63j43QK9J59p4J22k05K80k98j5M08j56j01p6J96QK80l13O1J23k17J75j05
$$ y = [255, 78, -27, -81, 176, 141, 195, 84, 190, 64, 307, -274, 71, 201, 17, -230, 32, -147, -162, -223, -91, 3, -138, -615, -156, -144, -371, -390, -563, -600, -233, -532, -677, -537, -524, -596, -624, -378, -269, -433, -682, -421, -553, -660, -665, -50, -346, -453, -225, -303, -310, 10, -366, -214, 70, -46, 271, -257, -28, 403, 203, 141, 326, 442, 195, 380, 582, 710, 261, 662, 662, 950, 293, 265, 533, 975, 512, 288, 595, 700, 531, 664, 404, 542, -36, 108, 321, 393, 111, -74, 66, 4, 343, -184, -249, -100, 216, -364, -451, -141, -297, -438, -331, -508, -136, -539, -413, -222, -491, -305, -240, -490, -366, -465, -448, -457, -303, -140, -284, -306, -117, -285, -715, -76, 143, -120, 117, -314, 220, 16, -31, 92, -16, 77, -68, -238, 215, -15, -121, 21, 86, 122, -307, -63, 139, 30, 104, 113, 188, 133, 240, -62, -3, 40, 84, 163, 20, 28, 57, 216, 142, 264, 59, 339, 41, 26, 434, 278, 177, 101, 297, 305, 585, 272, 333, 456, 239, 414, 309]
1520C09J0J9J3O5m25J44J78j18l05L15n4j05j25K46k27j17J13r5R2N4l41J94J23
1543c7j29p2j64n5Q1m2j43J44k71J69Qo9J92j29m2J23q3M57l01j39M44m5n27K17
1567d13L16M6L8l67L98lr9Q7K08k8k84M89P4l03j00J23J77l7O0j37L11k97K93
1590E52K1m18K53j2k8j21K99m10J35j58J60K8j78P7K3K37l21o0O1O8k04J31R9
1613B34k23k05J78m7k2pj97L44J13l99j24M37k37l03L57j05m7NJ08k27JL93j2
1636A5k19P1k0k93K69K29m34K81k88j18M49l77j6L04o0j08j73L39R5n59L63M11
1658A61m90K72j09L95l07j08N3K5J20mJ41K67m37J48J46l79L59K97o26O1M91J39
1680F15j58k47Q9K14j34l2K24j8j05k36L54j7k41j53L40k83l48M34R8l96o1K41
$$ y = [309, 319, 338, 351, 416, -9, 135, 313, 195, -110, 205, 151, 46, -79, 167, -60, -177, -64, -159, -67, -13, -354, -160, -37, -166, -238, -402, -457, -376, -418, -561, -417, -688, -519, -511, -580, -388, -517, -559, -436, -519, -62, -363, -502, -58, -103, -630, -413, -97, -51, -13, -380, 18, 15, -84, 3, 211, 183, -101, 388, 462, 159, 59, 182, 359, 322, 382, 245, 556, 259, 552, 573, 155, 408, 396, 368, 247, 546, 136, 271, 113, 273, 301, 123, 200, 223, 460, 139, 79, 140, 208, 4, 135, 234, 11, -194, -16, -63, -85, -92, -289, 55, 168, -231, -355, 82, -155, -458, -101, -206, -253, -248, -140, -367, -366, 27, 15, -204, -133, -153, -446, -177, 52, -382, -101, -389, -507, -58, -435, -451, -147, -207, -315, -488, -149, -54, -613, -250, 161, -329, -57, -166, 229, -78, -186, -133, -108, 12, 8, 149, 416, -21, 127, 273, -106, 253, 550, -76, -15, 476, 615, 457, 210, 299, 513, 379, 347, 571, 553, 448, 212, 566, 549, 308, 155, 495, 212, -136, 298, 396, 0, -61, 180]
1702A80j47j90N65l56k15K66j95P1j76k05K24m1j41J29kn3Nj45K80l46l78Q27
1724d3j14k97q4M3J70j08P8%J74Q0j85J68k21J0K02L16j26k02OJ16J02K25j36
1747A74j94L4K25j11Ok2K44o8J27n45P3N03k59k28K94k26q6K28J45l72J84k03
1769g7L31l29J79J98o00M10j43k8K34j23O9L23n39r0K84K03m29J09J86mj45J81
1791B00l21p1L49k2p0QP2J2p6Q3jk55M06l49K15j84m00M09O7k56J56L18j22k24
1815e6j14o3jL25k88R1k19M9J31j41K4j22M2J43j50J91p5n6Q8K7J10l52r0N57
1839E1K9k74J14k07j8J95j75m6J63K37M0J09k39J07j3J40k56J60J59j88J5K25
1861C28m0Q5K07k21p6k15J53j7J34K5k26J7J91M7k72k52J81L38j48j83J4k7L35
$$ y = [180, 33, -157, 408, 52, -163, 103, -92, -21, -197, -402, -178, -219, -360, -231, -233, -286, -281, -426, -146, -492, -870, -43, -157, -454, -538, -495, -325, -433, -355, -355, -181, -101, -286, -118, -339, -329, -127, 189, 63, -139, -133, -17, 85, 310, 174, -20, 14, 239, 128, 134, 112, 356, 288, 415, -130, -57, 446, 187, -41, 253, 27, -59, 169, 314, -58, 126, -77, 254, -75, 104, 302, -298, 112, -31, -59, 175, 52, 121, 444, -95, -185, 99, 302, -127, -18, 168, 164, 19, 200, -121, -192, 157, 135, 65, 73, 145, 157, 81, 164, 163, -92, 314, -35, 180, -4, -404, 5, 72, -184, -28, 290, 168, -56, -170, -233, -234, 91, -197, -106, -325, -276, -145, -286, -262, -384, -342, -199, -349, -158, -233, -289, -201, -174, -64, -416, -506, 51, 80, -194, -80, -287, -305, -110, -285, -331, -168, 69, 109, 218, -21, 86, 73, 213, -43, 117, 276, 88, 103, 328, 288, 373, 580, 359, 283, 68, 221, 204, 338, 363, 137, 154, 345, 392, 120, -132, 49, 387, 239, 56, 70, 43, 378]
1884C78l16N5j18J9O2n5k73j44L24Q4j55J21k9l75K35L35l66p8L68l93K7K69j40
1907a65j24M01m44J03N8j13J58j30M2nj18j24K20K45k54k4L64m4M2m66M69j2J40
1930B19m52K89k93P6J56n8R5j15J33J66l3l11K45q7p9R8j6K72r9l32L49j01J65
1953B87j42k39L83j42J4j3K81k18J46m25L80J83r1l12K68q8o5J56j59J37k66J05
1975A80J83k24J04O1q7l6j33J72k83j45L73j88j4j44Rj66J11mJ39M6m16K46qk85
1999e09K41l37K33J03j40K58j00J7j20J78k57K65l11N17l03K66j33j31O8K49j06
2020e2J26J9m9q2M7L18j5l43L29J04j89K29j07j44m15L82L32p5J21j33n10N74
2042D67l16J07o8K72j49k5j26Q3K49o53K87K10k29k40J9M7j48M46l49j04k1L09
$$ y = [378, 62, 117, -1, 18, 80, 25, -248, -392, -68, 16, -139, -18, -47, -422, -187, 148, -218, -296, 72, -321, -294, -25, -165, -289, 112, -332, -229, -171, -284, -126, -256, -214, -219, -337, -461, -241, 4, -250, -274, 90, 46, 88, -378, 91, 79, 219, -233, 56, -237, -161, -5, -63, 32, -83, 50, 216, 183, -128, 117, 30, -49, 49, 33, 305, 206, -126, 223, 122, 287, 145, -94, 289, 147, 161, 148, 429, 211, 357, -68, 312, 495, 404, 92, 360, 272, 207, 363, 204, 341, 75, 180, 363, 139, 243, 304, 217, 181, 48, 220, -63, -208, 165, -23, -37, -181, -172, -338, -227, -231, -92, -46, -462, -216, -224, -509, -268, -605, -372, -269, -409, -151, -251, -234, -354, -176, -433, -168, -479, 38, -265, 1, -132, -263, -195, 54, -52, 74, 93, 44, -38, 9, 327, 312, -31, 298, 402, 213, 442, 335, 191, -224, 158, 490, 415, 536, 403, -107, 467, 151, 258, 190, 462, 313, 288, 162, 245, 494, -159, 128, 338, 109, -131, -112, -65, -213, 233, -116, -220, -241, 68]
2064F8l0m41J30K06j92j17L15n8j33K17l69J48l6q7J40P1o2K87J59k36Qj34L8
2087a08Q1j3N4r4N5k4p6J52j70K28l94J54K78q4k08N5p0J35j17J59k33K10n2k19
2111c01K08P0k52J47m6K43l5K36k12J81k29j4J57j57R5k4N7r7N7K05k13%K99m52
2135g7L25o6K0n5J7L2lJ33J11l10j11L4M9J03k59L8m9L6K6k58K02J92k18J79j81
2160i0j1J0L1J01J4ml9l46Q9q9K17q3O0K13k23j09L51j28K7n7j33j9K69l03J10
2185a42P1j3Q3M4k9k90M09l9l44L38m8j69L16j64j2L5Q4L4l60L09j23J04p8p1
2209e5K60L6k25Q6k6j6J88j7r4%k28O9K86l03K48j56k5j59n4Q7L20Q0r0m7K6q2
2235A09q8J81l59J44K01q8PJ3K91l95J0J93M8l28L54j82J59k86j19N2K02R1k68
$$ y = [68, 38, -403, -273, -67, -259, -376, -61, -119, -252, -35, -404, -256, -292, -379, -239, -168, -230, 57, 216, -20, -12, -146, -108, -27, -40, 14, -80, -25, -49, -125, 27, -143, 85, -309, -155, 123, 39, -169, -114, -184, -49, -166, -7, -240, -30, -82, -301, -93, -23, -275, -128, -174, 69, 34, 270, 58, 239, 10, -4, 153, -4, 91, 67, 124, 27, 84, 289, 76, 76, 375, -77, 248, 182, 202, 147, 164, 196, 193, 326, 437, 127, 16, 50, 99, 202, -57, -19, -68, -32, -6, -264, -62, 130, -88, 91, -90, -101, -91, -60, 41, 55, 51, 12, -334, -245, -334, -117, -200, -140, 73, -150, -259, 92, -36, -9, -66, -199, -218, 51, -252, -142, -71, -84, -1, 43, 14, -276, 133, 94, -250, 88, 40, -129, 187, 23, 11, 46, 130, 164, -196, 113, -10, 94, 16, -55, 205, 241, 16, 102, 76, 60, 248, 231, 137, 137, -91, -22, 264, -39, 209, 53, 28, -131, -185, -98, 222, 302, 212, 165, 191, 109, 21, 202, -157, -13, 188, 100, 107, 120, 411, 16, 26, 219, 267, -61, 293, 111, 270, -16, -135, -83, 119, 210, -58]
2258e8o2l95O8M13k96J62K0J75k91K18p3L2k43K40j88R4J34n0j82L16j21p1r3
2281b51L13k20L2n8j17P8L47k46J5P8K81j25j37O2k11L08j73N6k35K62R1k39K97
2304B08k82K62r0j15%K09o4k1kJ8L9j24oj12R7J26o2J23j55l04Q9M75j94j98J09
2329B6J96k85j12N68m05J08K19k33r7L1k03O02l19O9k87N3m7k1LNJ58l7J69k98
2353a37J00M7k50J6K11km7N5l5k65K68j27L49l84L4N0j25L52k45K75j92r6J62
2376A4M8k31%J4L78j03j67m4R3o6J43j72J49K2k16J98lJ05j21p1L36l96J6K67
2400A93Nj50L65j6k79J93m5Lj96K34J65m92K75k94L17J6rj24J8M3k12k07K96j57
2424e8R1O5K2J0j09r7J14J36m88J26J51J03k74n7p3K05J51k15J67q5k27J7K23
$$ y = [-58, -120, -515, -447, -34, -330, -168, -148, 27, -264, -46, -119, -87, -330, -90, -278, -184, -50, -100, -282, 34, -87, -158, -251, 62, -158, -126, -184, -301, -223, 124, -122, -107, -29, 252, 127, -10, 52, -159, 149, -24, 32, -203, 59, 150, -89, 208, -74, 188, 98, -17, -17, 192, 128, 107, 105, 123, 162, 38, 32, -80, 17, 143, 81, 204, 49, -255, -166, 309, 115, -83, 26, 222, -63, -175, 393, -12, 96, 315, 82, -15, 16, -187, 415, 96, 165, -122, -69, -116, -137, -134, -129, 29, -8, 161, -137, -37, 10, -240, -224, -13, -15, -62, -7, -42, -307, -39, -166, 183, -201, -167, -117, -242, 110, -135, 140, -52, -148, 14, 62, -169, -169, -155, 223, 120, -47, -91, 2, -64, 79, -93, 56, 78, -138, 60, 57, 162, 41, -30, 306, -90, -74, 193, 198, 48, 413, 397, 118, 311, 266, 269, 73, 307, 472, -20, 255, -39, 278, 294, 285, 161, 179, 222, 10, -197, 99, -58, 33, 98, 120, 130, 21, -76, 38, 174, -314, -188, -37, 66, -208, -265, -338, -133, 18, -197, -30, -115, -342, -325, -102]
2447a02J32j81j34J03L9O8j0p8k00L28L9J85j10j56n2M0n8j70lK60j52P3K72M6
2471A79r1J09k26K7J69l3k54J79N8p2J30j84K68k43J76o9j79K79k42J85o8l00
2493b02L96p8p2r7J19oj51j20N14l5l04j41L22k93lN03o0m25J13j21J71MJ46k45
2517f5J46k82J80k33L42l25L06j32oL2j93M1k78O06j65j08J23q7j52K25J8k7j82
2540b16ok26L26j34L45j81j60L08m2k77J17J16j16J71j28J6M3L0J47R8m39J21
2562h7kj6J21J29l20N2J93j7J8k00O6O4J88j53K48k46J70m16L56J16l52K28L56
2585D96l59O1l6J66j30j2j34m3J83j85J16M6J09j49j50K46k78K61k61k47L46l8
2607HJ00l72K69j49m1K75j84k74K79j13Q9n7J48j04J51r1m6N8l47L57m39M60p2
$$ y = [-102, 30, -151, -285, -182, -143, -75, -85, -163, -363, -35, 4, 189, 79, -77, -129, -89, -147, -317, -320, -60, -212, -139, 133, 179, 88, 197, -29, -2, 167, 134, -120, 59, 117, 45, 175, -9, 259, 16, 192, 123, -56, 223, -19, 166, 98, -202, 194, 116, 44, -53, 66, 60, -91, -211, 303, 268, -36, -177, 145, -148, -151, 352, 292, -133, -20, -141, 30, 34, 180, -65, 81, -201, -21, -254, 88, -237, 69, -63, -69, -37, -230, -189, -467, 139, -26, -134, -11, -98, -250, -25, -7, -34, -216, -222, -448, -122, -256, 89, -92, -252, 56, 14, -263, -146, -30, -146, 25, -103, -87, -44, -14, 133, 231, -208, -87, -89, -105, 16, 145, -175, -123, 70, 53, 71, -129, -63, 1, 189, 36, 284, 38, 208, -208, 148, 264, -88, 140, 496, 137, 198, 162, 328, 198, 186, 52, 9, 192, 7, 123, 169, 278, 129, -21, 225, -53, 208, -53, -300, 46, 8, 108, -264, 5, -144, -185, 90, -94, -368, -89, -202, -113, -170, -22, -126, 25, -66, -112, -54, -401, -44, -483, -23, -95]
2630i5K42j35P7j39j67K28R4k76L37l93K72Jj25L12k80oj5J55P6j45J24l9j86
2653h3K37k8q2N7%k04J50j73K77L3j5k10j12M06k39j03j08K56j23NJ80J97j04
2676B14m20J86N4p0r5K53j06J52j47J25j62j08M13n07K39J10m0j08J42j54q2n7
2698a68K09l68L27k39J73J73P5j0j33j13J60J01n1m31K83l57K46l1L7P9P7k99
2720b60J94Q7O6k75J69J16k60J61k6L0k24J85P2l20M73j67n5j51j60K26j31K79
2742B9k03k0K91K26l54L42l13j53L00o7Q4k18k9M39m93K9P9M48j60l21j6P1J45
2765A36k40J46K83k77J84k18K91k08O6j18m5k3J96j92J38q4J45k22J97j20Oj35
2787i4L71k95L2J30o8j97m7M57k55m03N60j88j86L9K06k56K56j60Ll5j3P0j04
$$ y = [-95, 147, 12, 89, -50, -217, 11, 105, -171, 166, -227, 45, 46, -79, 233, -47, -53, -68, 87, 163, 18, 142, 103, -83, 154, 126, 44, 101, 101, -103, 47, -126, 151, 184, 169, -41, -153, 253, 14, -89, -197, 59, -64, -59, 121, 318, 214, -206, -20, 34, -36, -131, 122, 16, 168, 21, 146, -16, -124, 289, -218, 21, 131, 91, -17, 125, -29, -111, -168, 41, -327, 0, -239, -66, 107, 182, 172, 39, -74, 86, 187, 136, -295, -12, -369, -123, -154, -117, -38, 39, -260, -66, 21, 87, -188, -19, 97, -163, -2, -28, 2, -222, -37, 35, -285, 188, 21, -34, -185, -345, -119, -250, 29, -174, -194, 97, 323, -31, 311, -2, -155, 145, 78, 162, -56, -85, 354, -139, -110, -31, 417, 257, -64, -80, -9, 136, -104, 42, 325, 48, 232, 14, 305, 97, 163, 45, 0, -23, 173, -19, 119, 35, 180, -42, 155, 35, 41, -94, 277, -18, 14, 144, 76, -121, -168, 289, 34, -369, 191, 3, -183, -144, 62, -194, 62, -98, -95, -130, -143, -73, -177]
2810a77qP9k25M30J77m12K59j36j03J87p5K9j64J04j73K11P4j89J73j57J1J76
2832I1O4k68K79n0J80j78j16K45k84J57j28K18j08j59N6q4J80R3k73P2k17K42
2854A2K03L81n39k3Kp5J21j63n8K67P4J13r8j93K48l66J78N7N1P1l29kL74j80
2878A26l77N05J10m41L1L9k18Q0k14N43l39k20M80r0l1N1k76K11j79K65j84J16
2900a2l7l55N81k49J37l11J21kM3K3J26l1J96k86R9o0k26L6N1K64k03J94j70J55
2924H4j83K1mq0kP7J50M2l36O9M74j31K8k25k26K82J15lJ09o4j87Lj04N13k10
2949B12j40n1J31j49l6J14p1J47o8j03J38J48j54k58q2M70l93K68k75jJ24M67
2971D38m08P1m07J36N71n87L74l05p3J40J89l17R6L6Q6j99L5o7J20j67J43n7R9
$$ y = [-177, -185, -106, -331, 99, 276, -136, 123, -13, -116, 71, -4, 25, -139, -35, -208, 3, 77, -112, 61, -96, -85, 91, 155, -113, 166, 116, 296, 118, 2, 247, -37, 120, -8, 210, 102, -57, -1, -85, 95, 188, -85, -13, -230, 12, 215, 596, 57, 34, 36, -39, 82, -81, -139, 128, 202, 315, 217, 24, 272, -94, 84, 141, 192, 263, -66, -68, 306, 126, -251, 254, 364, -77, -46, -7, -225, -145, -359, 184, -155, -375, 105, 15, -16, 35, -241, -30, -209, 56, -128, -12, -49, -404, 177, -72, 65, -246, -125, -127, -84, -61, 65, 34, 230, -56, 43, -17, -243, -207, -156, 108, -95, 99, -71, 84, -99, -78, -82, -162, -164, -87, 63, 105, -231, -162, 312, 181, 209, -16, -242, 40, 155, 152, 261, 197, 10, 13, -91, 422, 212, 72, 21, 152, 3, -33, 81, 10, 157, 89, -14, 124, 272, 118, -140, -222, 248, -145, 123, -152, -153, -29, 438, 30, 101, -306, -170, 401, -186, 188, -117, -190, -50, 139, -178, -82, -46, 40, -159, -124, -191, -71, -238, -95, -152, -53]
2994e3k77M71j92P8K5m99M08m5q9M7J28j8P3R0Qr3j09J6j27J17L3J66j17RK71
3019C21k08N7p4o6J08k60p0J19R0J18oM3l02KJ22l5Q9J54j6j68J4J24o0J99l21
3044b6M3P2J2k70O2J73o8j56L03j32Q1q3m0M7m9n4K05j75J73J16k86k11L63k04
3068a04J4J0P9j27J13O0k60J06j2J01O5j06J10k25O6K6j00K50k35L21J79k58l0
3091D3j73J3R5jNk21L48j75N0N6J20m37K74P3N6j00m6j11K7M2n7L00m42N05Oj06
3117A44o3j34J87j92J28J05j42j05K29j73Q6K14l09K64j13l32K81J44k62NK40
3138B02J5j90j9M0M6o8P1J33k48n1J09L0j22m6O4J75j26kJ3k99K58j39J47M0j79
3163a46J05k9m0J50m4p4k4K2j02M3J55o3j58pK23j6j33P5L6O2j35K9J82P3m19
$$ y = [-53, -330, 141, -51, 27, 52, -447, -39, -84, -173, -126, 2, -16, 57, 147, 155, 62, -47, -31, -158, -41, -8, 158, 41, 50, 321, 113, 170, 96, 30, 138, -122, -192, -73, 17, 135, 129, 172, -130, -128, -6, -41, 48, 202, 186, 18, 32, 156, 96, 295, -26, 17, 89, 101, -169, -107, 66, -2, -158, 145, 13, 94, 11, -29, 18, -31, -85, 120, -55, 118, 234, -52, -263, 100, -104, -90, -80, -1, -128, -15, 45, -215, -109, -121, -20, 45, -61, 49, -176, -110, -84, -184, 66, -169, 152, 331, 73, 43, -130, -117, -22, -23, -18, -239, 109, -66, -16, 40, 160, -277, -3, 70, 126, 26, -20, -131, -104, -62, -119, 181, -261, 244, 250, 144, 81, -53, 134, -58, 70, 175, 33, -72, 157, -16, 70, 284, -25, 239, 126, -206, 75, 219, -43, -38, 202, 217, 27, 8, 48, 94, 26, 97, 230, -18, -69, 40, 70, -52, -98, -34, 141, 15, 13, 26, -273, -15, -154, -7, 33, -146, -41, -70, -110, 40, -4, -78, -102, -80, -182, -139, 16, -47, -205, -212, 11, -5, -138, -63, -27, 35, -100, -71, 111, 184, -235]
3188b35J65k5j37K71l72L48Kj34J60Q8j79M0J79j32J41k48L10l23K70j93J90l65
3210a79K90K8qR3q1O3j81M03j21J75o61L29j59j00M14j36n70L40J05k9%mL96l80
3234B7n9j06K09J45m3j44q2m8J01k52J44j05K14L83m66MP1o4j3J68k17J22N5k14
3258a70K67l39j52K32P2J8o9N9K79p1k82M36l77r5K66r2j70j5N49l53K22l52j8
3281a55K13j05K3L3J50q4Q2j94O5k82M27Rj41K26j45j76J77J57j49p1J74o5m3
3304A26j4M6J8O5l86K28J75l93j37J6L95j99P4J79k93K29K6r3n0j75L42J6k37
3327d2M44n14L27k83J09m5N5p0J46l63n5M20r6j27J47k55J25m5J34m4k69K22M4
3350c5P4L23l78J11j75j50R7J80L9M4LK4j14K8o6l29L90k50L33j31N3k8P8k66
$$ y = [-235, -70, -95, -232, 39, -333, 15, 17, -117, 43, 131, -48, -8, 171, 39, 180, -68, 242, -81, 189, -4, 186, -179, 111, 139, 131, 224, 143, 206, 25, 428, 307, 482, -179, 150, -9, -109, 305, 169, -401, -61, 44, 15, 15, 11, 407, 27, -32, -138, 71, 216, 173, 29, -53, -101, 0, -252, -108, -213, 1, 384, -82, -78, -7, -71, -84, 84, -133, -11, 44, -170, 97, -242, -394, -162, -90, -72, -141, -82, 197, 126, -156, 280, -97, -192, 74, -18, -188, -203, 346, -7, 215, -137, -155, 58, -47, -24, 9, 159, 75, 157, -37, 28, -254, 173, 182, 41, 267, 122, -54, 123, 280, 131, 60, 234, 169, 126, 112, 158, 176, 241, -145, 83, 258, -135, -272, -256, 139, -60, 14, 193, -100, 129, 155, 62, 12, -163, 179, 195, -42, 402, -112, 215, -68, 41, -4, 51, -19, 127, -236, -291, 129, 33, -94, 53, -202, -77, -122, 12, -32, -301, -79, -35, 39, 362, -16, 95, -80, -230, -133, 47, 86, 130, 133, 157, 43, 71, 5, -324, 66, -184, 149, 18, 71, 43, 121, -145]
3374a45RJ37j14J19o2J76l7m4m9J65l95L16l81M83q7L3J40m20P0J99k71K58k38
3397a38J14J09n6M1o8j21K08r9J51k60m0L68j16k95J87K2R2n0l40K58l3R3R0k47
3421a30j4L62k67K20l56J98r8MJ1l12L00nR3l0N1J07Q6k32J06j64N3j53J41j5
3445d4o7N5J23K5l70N50k80K60l21JmJ2N8j11K3O7P3j29N4J91k30j52M92k32j3
3470C1N8O3j59J04j54J9R8m8Q3J3k9j12P6m0k5M6R3r0R7j17pO3lJ77j24r7K22
3497B38k60L66k96J88j47j6O6j1k73M7m0J64r8j8jJ4o1J31J78j7j57j17Lp3K02
3522A2k98J34J31J51j11q4l6j50M5J18R5K17k21r5l8K62j78q8J09L3m5l8j88K32
3546c1J41k06J01j58J00j18J36J85m5L5q1J24l02J35j3N0J00k75Q0L74n54KK50
$$ y = [-145, -136, 1, -113, 6, -56, 120, 83, 39, -10, 155, -240, 76, -305, 178, 91, 124, 264, -156, -86, 113, -158, 100, -138, -24, 85, 29, 70, 2, -119, 89, -10, 141, -119, -159, 209, 93, -202, -15, 7, 99, 49, -291, -33, -66, 27, 117, -130, -144, 218, -49, 171, -185, 13, -85, -81, -70, -382, -82, -87, 6, -24, 27, 134, 220, -12, 94, -70, -17, -170, -29, -44, -111, -56, 67, 92, -278, 272, -8, 252, -69, -68, -72, -60, -2, -113, -90, -23, 50, -79, -25, 166, -64, -216, 276, 44, 31, 89, 152, -7, 97, -57, -38, 60, 12, 95, 108, 79, -33, 43, 3, -22, 24, 117, 27, 124, 7, 0, 63, 60, 237, 113, 16, 238, -22, 344, 48, 236, 89, 73, 139, 128, -145, -98, -138, 26, -72, -90, -91, -77, -138, -7, 171, 154, -3, -120, -117, -190, 12, -286, -152, -21, 130, 19, -65, -101, -251, -206, -88, 7, 224, 3, -92, -130, 132, -46, -134, -25, 8, -37, -75, -263, -31, 110, -96, 5, -153, -53, -171, -35, 150, 105, 140, 59, 183, -119, 16, 3, 53, 153, -122, -42, 332, -222, -220, 30]
3569C0K13k60kN5j67M30r2j52k8R8k40J0k3M4j82r5L56L61m11K20J3k68M11k32
3593H9P0J22k38O6o8l4j27P5l2M4J47k89M31j71j53J66l45K61P8k0j22J33j12
3616b9j29j8K38j83J8J12j10j7L41j80k28K69k8n8n1j39J3L15k38lJ17m7l4p4
3640a43O7p8K22j48J63m5L4j08k9J12K09k35j33J16J41K7l75K12O6j5j13j41J76
3663a8L08j85m4n6q1j31J57lK09O5k58l13M76k34j17K04K20j60K07l23M45l76
3685hR3m9R5j03k00M38l27J62K0o5k78K64N7k61L47p9m2k04j17J75q4K40l64K9
3709b61J91J33j0k2k66L8L54m50K76j54P6K87j06k10J63o1j88L25k63J63n1K22
3731A86k35Q3K10l48J18q4J2QJ62q0N0j94N1j36J64N7k5K36m21J69r5K17k19M56
$$ y = [30, 243, -17, -19, 36, -131, 299, 207, 55, 27, 125, -115, -105, -128, -84, -266, -361, -5, 356, -55, 165, 178, -90, 321, 89, 159, 281, 43, 109, 41, 7, -120, -45, -77, -33, 114, -175, 256, 85, -68, 98, -247, 14, 92, 72, -50, 83, -29, -158, -176, 62, -121, -103, 9, -101, -118, 223, 43, -185, 84, 56, -2, -53, -192, -179, 136, -102, -105, 12, -35, -69, -143, -76, -154, 68, -80, 83, 38, 72, -36, -65, 47, 256, 21, -112, 4, 145, 172, -203, 9, 75, 60, -53, -194, -18, 290, 105, 61, 5, -76, -207, -50, -53, 156, 221, -37, -350, 126, -108, -225, -21, 199, 39, 246, -77, 368, -8, 85, 36, 131, 28, -172, 266, -61, 101, 121, 56, -222, 42, 99, -162, 185, 106, 64, -140, -257, -82, -166, 74, -290, -261, -70, 63, 53, 31, -235, -197, 157, -293, -17, -171, -95, 192, 86, -124, 39, -22, -210, 115, -148, 15, -36, 186, -49, 34, 244, -104, 14, -70, -58, -50, 112, 32, 82, -112, -61, -197, -33, 24, -1, 235, -186, -17, -112, 105, -114, 342]
3755C42k54j63R5o5J33k8K2J6L17m32J41j91M2J57l9J39m71J32K07J18m7J33m73
3778a69O42m13k22K22k2K07l19P5o8k35M83n7l41J55J3J71j19K97j95j93o4P8
3800g4O4k1L4N0j76J13R1k38J66J09j76j58N09o3L4r4r7l59M77l21jK04k73L48
3824A48J7j68j30P2J38O5j57j24L7n5K00J9r3K37k78J05J04j77j41K53j9J04p4
3847H3J20j63J12j18j36o0K03J5J69j20m70L40j29j8K67J10k75K4M1o7kl2J57
3870E1j62QJ41r7Rk6rJ03j84J65O8k79L03p6l34L38K51m04M2K0%L7Q7j0O1M9j46
3897FPk41R1R2j04L9L73k00o2J10J23m11J57J27k26L57j95o4P1J27j16J60l40
3920a19J72r1L78l20j91K52J2j36o8L44l24O4J41j5j45K03k49l7J43l34L55j74
$$ y = [342, 88, -75, 20, -45, 88, 60, 82, 98, 415, -17, 124, -67, -25, 132, 93, 232, -239, -107, 100, 218, 171, 304, -169, 473, 60, -162, 60, 38, 245, -74, 1, -67, -302, 181, 124, -217, -62, -49, 122, 3, 300, 105, -88, -152, -74, -10, -31, 3, 53, -123, -10, 81, -157, 9, 118, -58, -216, 293, 230, 264, 170, 73, -286, 191, -130, -131, 73, -200, 148, 165, -3, -133, -61, 77, 142, -15, -139, -102, -157, 43, 62, -31, 206, -72, 33, 137, -40, -181, 72, 53, 157, 83, 203, 40, 152, 34, -102, -162, 41, 56, 225, 105, -365, -25, -154, -172, 95, 205, -70, -46, -5, -72, -74, -106, 51, -111, -103, 38, -59, -50, -76, -85, 18, -166, -1, 67, -212, 91, 15, -319, 19, 270, -134, -92, -72, -72, -35, 52, 42, 103, 152, 6, 13, -228, -137, -45, -149, -110, 263, 63, 1, 111, 234, -177, -20, 107, -119, 238, 43, -21, 50, 177, 61, 221, -119, 53, -38, 340, 20, -171, 81, 93, -43, -111, 233, -91, -27, 114, 99, -46, 157, -92, -129, 14, -320, 35, -139]
3942a39o5L39q3l03K79PO5R8l17J28N0j65Q8K23j18j67Q9J5q1QO6N4j96m5L81
3967B11n7j26L0j86K87m6J81l03n8q2K96n6j03k35J41P5R3j55r3K36j52pJK9N7
3992b2K22j48l4m0K72j89N0J20k97%J73P5k47M9J47l8j92P4l4N2N6j4J6k9j25
4017a03Q3k50M23r4N2k91j13N10n83K91J04J30k11J79r8k54M85n13q7L70J2j20
4039g8J34M9j94o5K42J1o7K52l76K35k53J77o6j49J77N8J51j34k0j28J78M6k98
4062a18k84N75j0M0k78K45m41M07o7L7M0p5j76J14J67j76J3k38J38J12L03p06
4084c78L36j18M43n19K56L25p1l32L1J60l22L03j67k59N00j45Pm5N3O7k85J51
4106iLQ4k21J61R0j23k07K66j82J67o7J48k20K71j30J37k85k9K86P5r6o7j98m8
$$ y = [-139, -204, 135, 52, -251, 28, 35, 100, 198, -119, 9, 59, -106, -18, 205, 87, -80, 9, 24, -57, -49, 17, 71, -125, -170, 211, 154, 28, 58, -128, 159, 113, 294, -9, -67, -149, 147, 91, -12, -247, -106, -31, 62, -93, -186, 50, -102, -109, -108, -79, -22, 200, 52, 18, -22, 250, 61, 111, 231, -66, -66, 107, 182, -65, -16, 131, 93, -99, -25, -59, -7, 49, 35, 51, 22, -103, -20, -270, 153, 59, 111, -180, -293, 217, -366, -75, 29, 159, -52, 127, 29, -225, 260, -253, -340, 30, 42, -78, 56, 105, -89, -154, 88, 99, 32, 284, -92, 143, -110, 67, 1, -148, 29, 87, 238, 104, 84, -44, 134, 180, -118, -402, 173, 163, 203, -75, 170, -271, 136, 69, 106, 146, 71, -105, 9, 176, 0, 13, -225, -87, 25, 328, -378, -42, -160, 283, -236, 20, 345, 274, -58, -27, 133, -189, 114, -53, -312, 188, 43, 50, 5, 58, 125, -160, -9, -6, 78, -143, 18, 108, -15, -222, 44, -138, 29, -38, 110, -110, 161, 31, 168, -117, -146, 140, 215, 119, 52, -146, -194]
4130a94K71r7k48L24N5k13R7N0m2M2k39N6J94k28J54k07J30L1N6j24L63M9l26
4153d6L8L50j38l03p4K42j22P3r8q8L04Lj03j88J68R1r8L08l09k30L81n89M67
4176C9N3k88M16j77j20K42j4J46l50J3K40j82Mk83M45l51Q2Q4K09l79K65R9l74
4199a81K06j86J77Q9J22k34j14K95k73K10j07J82j58q4j43J36J39O8l40J99P9
4220H2l46M64j67MJ97k72K48k61j12J20k00qL89p3J7l74L19K17j84q0J08j41m9
4243a02L18l47q0J91K56j94k13J1J80%k28OJ66J51k55J02J1j00J42Lj88K01r3
4266f2k1K50Nl07j2J32q3J09O6J60k27r2JK91p8O3m3j85l29M56j10J72O0j38k58
4291a80K12k1Rk07Q3J11j42J12j24J60o7j57K43Ok94q0K06J03l60M32r0K6J72
$$ y = [-194, 77, -20, -268, 56, 111, -102, -5, 45, 3, 45, -194, -138, 56, -172, -18, -225, -95, -64, -8, -132, 231, 280, -46, -8, 342, 204, -99, -173, 69, -53, 20, -78, -166, 138, 141, 38, -150, 18, 109, 11, 319, 10, -220, 161, -428, 39, 92, -196, 220, 43, -77, 165, 151, 297, -53, -40, 200, 18, 22, -261, 184, -167, -85, -1, 208, -171, 94, 193, -181, 25, -161, 16, 105, 227, -7, -121, 174, -99, 111, 4, 186, 28, -56, -199, -63, 76, 144, -196, 3, 82, -264, 200, 33, 37, 234, -38, 210, -51, -163, -43, -243, -251, 138, 65, 82, -292, 27, 244, 60, -20, 88, -53, -102, 216, -131, -211, -20, 236, 42, -171, -160, 20, 20, -208, -202, -36, 115, -140, -38, -27, -127, 15, 18, -170, 31, -62, -83, 167, 172, -135, -147, -15, -98, 11, 77, 237, 10, -82, -81, 210, 132, 195, 152, -33, -362, 94, -16, 156, 216, 78, -180, 32, 11, 20, -187, -104, 7, -135, -23, -147, 13, -54, -211, 32, 38, -256, -336, -130, -27, -387, 45, -45, -19, 153]
4314A53o3Pm8o0O5j08L45k03k67J69k39K34j10l0RJ07K52j20l0l29L78rL0j81
4338d8K41l11R7J49k43J58J4m2mJ7m1q3K14p6l0K7j66J88k51R8J61j20qK3j24
4363a60J44J14j63l0J4K30r2k06P1J51K29l59j39K85K95m47m5J18J86k5l9l26
4385a94J62K39q1j25Q8J2l17K55J35k42J70K6j60J58m4n8j96J50P9j12j45M82
4407B82m5l19RK62k28k00L03K4k54K21j24j69J79J93j10j30N2N1J78k56l0J12
4429Ak08L55l11L57M6Jm16L02k08l0J26j82j9P1k8L31J2j81J21j02J85n30M14
4452A07j49R1K2L6M8k41J60K5m08K60o1J83l0q6R6J74j36n7m6K20j93L82l06j2
4476G9k46MK37J96k58j86K61J31l22J50K31k60p3J49k04j26L16k23K4L61m45L87
$$ y = [153, 90, 97, 49, -11, 54, -54, 291, 88, -179, -10, -249, -15, -125, -155, -146, -39, 213, 93, 63, -266, 112, 103, 133, -48, 193, -118, -21, 128, -115, 43, 57, 15, 11, 28, -13, -96, 118, 42, 12, 39, -127, 61, -190, -92, 69, -51, -59, -36, -160, -16, 98, -65, -95, -81, 149, 57, -149, -78, 73, 302, -57, -196, 89, 384, -63, -108, 10, 196, 171, 132, -194, -32, 207, 126, 1, 89, 101, -216, 39, 174, -68, 102, 128, -32, 126, 82, 24, -172, -22, 57, -55, -200, 282, 237, -82, -73, 189, -39, -239, 64, 88, -166, 55, -69, -238, -59, 134, 24, -106, -54, -3, 175, -81, -111, 1, -207, 148, -163, 194, 240, 241, -175, 127, -81, -111, 15, -167, -186, -115, -143, 188, 200, 19, 140, 38, 223, -307, 107, -42, 49, 71, 107, 155, -86, 74, 99, -309, -49, -110, 73, 43, -43, 53, 227, 91, 34, -12, 208, 15, 397, 91, 79, -167, -163, 74, 270, 12, -174, 87, 218, -104, 46, 277, 17, -56, 93, -111, -237, 79, -144, -120, 241, -204, 183]
4498A83j40k25K60N7K09o03L25m2K6l32L20K2j59K46j05j18O9J45k80K78J12k4
4520B24k73m9J66K15l83K60m17K24n3j40J16j96M55m62L08k8R6J78j70j20Jm6
4542i4K49k68j64L29p2K22m09L57k56K83j37j10L9J02K15m56L65k17L74j53q1
4563A18Q7j65K12j76m2r2J12o8J25l73K09n9J41k93K49K32l65L47j75J73o6k47
4585a16L13k36j3L54l75n3J39K5j26l4K29Kk0k38J39p4l5J37o0J32Ok10J11M2
4609C9K7J78l26LO9jL02k76K00l81o1L62l8j08j65K60j32j57K62P6n2k01P1L3
4633a6r7j0J7Q2L65m68J37j27Q1Q7n1j79K80j37K07k20m0J16r2o7Q1K86j74j41
4657h0k75J16J67Q3J05j86l7K3J00j92J84L2m3K33j08l4o2m6j30J07N0J31k96
$$ y = [183, 43, -182, 78, 135, 344, -259, 66, 24, 50, -282, 38, 60, -99, 147, 42, -76, -7, 138, -142, 136, 248, 224, -49, -98, 68, 283, -100, 160, -257, -33, -86, -226, -110, -306, 149, -313, -5, -33, 63, 241, 71, -49, -48, -94, 155, -113, -277, 52, -20, 202, -207, 150, -106, 177, 40, -70, -31, 71, 286, -170, 195, -22, 352, 199, 118, 205, 40, 252, 76, 34, -58, 54, -14, 111, -262, -53, -112, 29, -264, -15, 217, -148, 199, 24, 197, 131, -116, 197, -39, -52, 302, -73, -126, 13, 38, -88, -122, 107, 109, 89, -149, -10, -84, -119, 18, -42, 90, 96, -114, -3, 39, 66, 244, -82, -79, -10, -11, 291, 15, 215, -166, -227, 135, 97, -11, -176, 84, -48, -205, 57, 133, 81, -120, -49, -16, -113, -123, -106, -24, 341, -127, 10, -117, -36, 51, 0, -179, 101, -36, 171, -49, -89, 27, -65, -132, -51, 235, 61, -80, -355, -239, -72, 11, 116, -70, -107, -84, 16, -176, 8, 40, -3, 230, 122, 88, 26, -20, -150, -43, 7, 138, -158]
4680a58J82K08j90N6M7j12k11J11J13N4J5j72K6o7N2L01k54J37p0k62J51r8l7
4703a78J82O5J41k39M9j31K18pj73K36L5k89kK77k28J45q9pL03l01j12J35j95
4726a65J15ll9r6N44m18PM3j02K05L0k73K69j24k7j90M27j82q8M61m17l21L34
4749a0J76k19L08l34J81o4k05m3P4Q8J06j88P7M2N9j32rM1K01l53J0K52l9K0K20
4774B59m11J85j46J86m9k12J78J14O7k01l5K17j91J60l3r4MP6J8R8k21k58K16
4797g3N5N4j99K24m6J70k09J08j24P4k56Q6O9K84k80j89J54O3O3J15j86K0L1K1
4821B9Q7m7M5j57m1m5O4l3J85N7o9r1J4j27O3j75J04j15M31k13n6N6K26r9NJ1
4847A09J53k42j8K19o1j47K72k40K40m24J70J56k92K15nk75K25l7j25J60j35Q2
$$ y = [-158, 24, 232, 42, 98, 145, 33, -178, -67, 46, 100, 115, -57, -31, -98, -46, 255, 1, 138, 68, -194, -43, -141, -178, 4, 69, 210, -29, 20, -111, 107, 100, -73, 163, 198, -91, -93, 184, -44, 101, 12, 5, 308, 7, -105, 30, -165, -50, -53, -92, -188, 356, -62, -55, -12, -114, 91, 121, -152, 117, -7, -34, -224, 203, 21, -67, 394, -23, -344, -10, 166, -53, 255, -79, 102, 38, -167, -210, -136, -48, 58, -130, -53, -11, 48, -84, -93, -52, 149, -204, -194, 58, 19, 39, 259, -152, 33, -113, 73, 24, -188, -10, 104, 171, -30, -65, 152, -39, 121, 88, -6, -2, 74, 92, 190, -31, -289, -73, -18, 36, -163, 61, 15, 185, -24, 84, -40, 34, -222, -136, -67, 217, -63, -252, -98, -35, 28, 143, -43, -23, 8, 29, 116, 69, 114, -43, -84, -129, -65, -98, 87, 144, 75, -16, -2, -129, -66, -241, -137, -252, 179, -34, -90, -34, 192, 93, 98, 109, 262, 20, 2, 221, 160, 13, 285, 45, 285, -139, 31, 187, -105, 110, 105, -170, 55, 18, -107, 53, -82, 0]
4869@j7J27J03r7l6J42k29O1j44QJ7P4j30K34k8K36k78j12p6j6l0J49P4k08n7
4894b33L72j60p4J27l1N9k04j02K23k0m0Q4r3p6J46o7m7K12J42k83J00Q9O7k55
4918f4lOp6K40k01M0K05j25O3j78p7K57k17K27J0m2K15k12k55K74l31K18m4K15
4942A45j16P2P2k10M9J08j24n4Ml0j89N23j47k3m3M9J36k59o9K24J17k26j7n8
4966f6j27R5J46R2j31K0m2k3q9J67K07k66j82K9Q1K61j67j38J96k15J39po5p6
4990a61J38k98K85K89Q9l67M7R4j95K08j49k36L10J49q4n6J53M1k77L8j87K0k3
5013a72RK13l1j9j20j50L39M3l4o7J80k39L8j49K88l50M88l75o3J49kk5O6q1J96
5038A32p8l2K20n1k45K76j64n2j34N4J76k13J81k02Q4K10k04K59q1jk62jK56k89
$$ y = [0, -17, 110, 213, 116, 80, 222, -7, 54, -90, -82, -65, 9, -121, 113, 85, 321, 43, -69, -145, -161, -191, -42, 32, -176, -233, 139, -21, -95, 32, 1, 60, -144, -246, -23, -43, -83, 1, -92, -168, -22, -89, -136, 76, 218, -65, 35, 124, 191, -64, -67, -61, -137, 103, -98, -58, 147, 22, 85, -93, -170, 87, -130, 97, 107, 65, 280, 68, -187, 87, -244, -26, -70, 145, 29, 101, 173, -37, 12, 120, -4, -58, -54, -84, -273, 250, 103, 80, 37, 86, 222, -37, -106, 118, 235, 9, -8, -66, -193, -98, 48, 140, 9, 29, -13, -36, -125, 42, 249, -17, -199, -170, -89, 172, 5, -133, 63, -152, -13, -20, -85, -161, -23, -321, -36, 253, 342, -25, 22, 116, -79, 129, -20, -256, 54, 203, 119, 63, 216, 257, -20, 18, -169, -149, -172, -163, 50, 19, 0, -120, -270, 69, 112, 78, 11, 191, -48, -10, -159, 129, -221, 267, -108, -171, -22, -24, -49, 17, -64, 132, 54, 22, 242, 191, -54, 222, 58, 6, -128, -74, 102, -111, 70, -132, -48, 162, -42, 217, 136, 135, -127, -128, 128, -161]
5062a61N8K16k67K18p3K60k22p6P2p5K11k17m5J33J35k00K53p3k24L58o13j20
5084d52O87j15K8j03j28n7Jp5J95P4j7j31J63j88J00R7K1k00J29j55K48r8j82
5107a58K59J25j77k24m5J11p3M72j30j31%j02Q5n7K32k52J05n9O7r7k3j2K36J09
5131B61j98k38J99R4m4j53r8K06q7K17k5q1N7l40M62k61j07nK77j12K04k05OJ80
5155B09m17L23k49K41l39K38k5L4k9j23K02JJ37k19L9p2qK44l58K26K8N6p6j23
5179f0K18l17PM3N2J91j94P0n2j61L32j75r5K48M8k52o3K29K4J1m9j20p8J12J57
5204A26j63j96K80k45J98l4L2K7J95j79m1J56k5K8l51lJ20J79l36L5L26N9Nn54
5228c61K16J85K1m6l1K25k32j34M7Q3j30N56l28r7O0j87k0J53l6O0o4K39l22m2
$$ y = [-161, -103, 113, -154, 64, -9, 251, 29, -47, 25, -50, 161, -56, -101, 32, 167, -33, 220, 147, -77, 281, -332, -452, 235, 120, 148, 45, -83, -140, -139, -214, -19, 55, 38, -93, 70, -118, -18, 79, 100, -100, 29, -126, 122, 24, -158, 101, 226, 49, -175, -220, -109, -182, 290, 160, 29, 29, -73, 12, -45, 187, -65, 40, -19, 48, -49, -72, -84, 152, 261, 63, -175, 24, 118, 74, -79, -177, 29, -58, 159, 134, 53, 110, -230, 232, -29, -136, -141, 136, 24, 228, 23, 29, 209, -208, 115, -134, 107, -232, 6, -19, 15, -14, -137, 65, 66, 203, -16, 23, -49, -57, 187, -171, 55, 83, 139, 63, -60, 158, -159, -152, -109, -57, 134, -60, 10, -42, -203, 129, -46, -141, 107, 155, -97, -160, 69, 93, 104, 55, -65, -143, -31, 126, -37, -233, 47, -198, 0, -34, -2, 25, 220, 41, 0, 156, 131, 159, -192, -195, -75, 104, -232, -197, 129, 188, 193, -361, -145, 40, 61, 15, -16, 209, -23, -157, -110, -27, -157, 399, 71, -26, 34, -153, -173, -20, -56, 4, -60, 179, -143, -185]
5252a85J37K07j96J04j32o7j3J88l27J13J11n2J52j84P9N1oj14K11j57L03k6j23
5275G4k11K59r7P1j96m8J58j07Q2L6r5K42l20K53l02J02LjJ41j7J44j9n56K23
5299a81p3J38P4k0j0l5L88m46J35J17r4r5J90n8n1jN2j62L54k86R2J31k58K30
5323A31j94J93j14n8N1k91K36n5J02J1J29j05j32k31M07j41J27K08J42m15j9J43
5345A25oj43J33p9LL6j23J09KR0P1k26K36Pk83K48j51K4J81rk3l42R3q0J37J94
5371B24m63rK51J40k57K00J25r1m0r9j3N6j3k86M19j47j46R2r3K55o6M8o4o0Q7
5396E0j76j74J49j57M69j17k26K03k22L71m48N74l58M1m9J10N3n6Kq3J99k78Q9
5419c4J32Nn2J29l90L36j59J0MJ53k81R5M23j84q1q5J86k02%r7j9k2R5J7j84K3
$$ y = [-185, -48, 159, -37, 67, -65, -132, -145, 43, -284, -171, -60, -112, 40, -144, -65, -14, -20, -134, 77, -80, 223, 197, 74, -137, 122, 25, 96, -100, -148, 10, -97, -15, 21, -74, 168, -152, 101, -201, -99, -96, -97, 44, 27, 171, 152, -404, -181, -254, -116, -42, -62, -72, -107, 281, -165, -30, 87, -7, -102, 88, 30, -21, -22, 30, -132, 222, -64, 28, 159, -99, 131, -63, 130, 16, -42, 9, -282, -46, -101, 1, 12, 141, 36, -96, -327, 80, -61, 66, 274, 416, 1, -18, 125, 119, -24, 109, 30, 33, 69, -54, 55, 57, 147, 218, -8, 228, 235, -48, 200, 49, 73, 254, 245, 222, -120, -27, -107, 30, 224, -239, -248, 3, 143, -114, 86, 211, 120, 80, -19, -32, 24, 11, -275, 144, -3, -149, -57, -150, 105, 39, 87, 23, -37, 50, -126, -300, -151, -308, 161, 44, -182, 21, -201, 170, -278, 296, -62, -21, -70, 40, 93, 37, 39, -44, 155, -123, -34, 98, 103, 51, 180, -210, 126, -33, -23, -19, 134, -147, -52, 371, 187, 106, 21, 207, 5, 5, -92, -111, -133, -38, -21, -205, -182]
5445a82L49k68JJ93J05l10J92j50k7K2L08j82p9j33O9J29m0K6O4J13k55J49Mm12
5469c14K07J88L1p5k9r8R5j5O1n9l4o4Q2m9J8L2j35K06P7K2k98K58p2L7j55J19
5495C6r9K39l51J47J18l06K69j44K30p6j20Q9J87k26J8r6j64j54L62Q5J41k08
5517b3r7O5J73k03P9j33J45Q5j79R3J6j07J2K11j65J46m77L41K04J1m26K56K8
5540E5j74L69m87L37j47M5o2K32Rj10J40j22K07j77k02LO3L5K52j16k27K00k59
5563a36mJ79j60jJ9m3M66n70J59R4L07l11n3J5m7K27m4j51p3J78j80J11L1P1j05
5588b1n5j60K43q0J76K6j85J25m1K3P0k73K59r0Ql5J13j45J19P4k75N16l52J38
5612A78l00L3J23O0K1p0K2j39m2j45P1K51l2k72J93R7j70rJ45p0L5j5R3q0K26
$$ y = [-182, 167, -101, -100, 93, 198, -112, 80, -70, -97, -75, 233, 51, -28, -161, -92, 37, -3, 23, 87, 200, -55, 94, 98, -314, -107, 81, 112, 37, 8, -90, 5, -10, 51, -8, -42, -106, -24, -73, -55, -23, -158, 48, 125, 147, -151, 107, 35, 72, -83, 36, -63, 176, -175, -28, 90, -216, 53, -91, 139, 63, -57, 32, 219, -7, 11, -85, -249, -403, -41, 44, 185, -23, -120, -55, 118, -85, -6, -139, 6, 91, -88, 5, 21, -86, -74, 137, -28, 118, -359, -18, 186, 197, -229, 27, 55, -119, 250, -237, 100, -47, -2, -64, 168, 177, 67, 207, 85, 292, 115, -87, -84, -21, 14, 266, 150, -77, 123, -136, -140, 39, -121, -122, -103, -146, 320, -250, -91, 3, 310, -1, -54, -39, -86, 141, 97, -54, -127, 51, -129, -18, 13, 84, -21, -76, -236, 7, -73, 103, 129, -56, 69, 28, 51, 121, -152, 107, 17, 25, -10, 103, -42, 77, 151, -124, 392, 40, 178, -122, -89, 34, 94, 115, 45, 67, -72, -114, -259, -188, 63, 31, -241, -48, 49, -121, -130, 15, -55, -20, -35, 58, -22, 204]
5637B04k93n9J4K14J93l33O2k13J94N6j54K33M1j60j91J35K11l42M06j9l23M12
5659B88j32k40K39J07k66o7M7J67J5j08j7nrk9p5l3J74k19O4K35l9k47J85%ql0
5685cJ28j8j06j34N7L7Q6j91L55j73j94L85n05M02j39J4l1L05O1j52q2k02M3j59
5709b16Q9Q3j42N3MK17j40j2J68K4n3J37N7k32k36K39k68R7l9L39j49j04j40K60
5733C6l1p6ql6K87L4j25k32K25J6k53J5J06kK97l04J41J5q3l39N27k20N2j56P0
5758d4J23p1J13m0k2j74J55J79j56j68J44q2K00n5k41J18j80O00m50J68o7J20
5780A70j87l0j17l8L32M0nk41j16J91K14r5j80M15l30K8j83p6L76n8k15K46N0
5803A91r5k71J61j58L66l11n1M21k37J1p5J0J46K34j95J29k78j7J08r8J48K2k90
$$ y = [204, -89, -148, -134, 80, 273, -60, 2, -211, -17, 39, -115, 118, 159, -1, -192, -57, 154, -188, 218, 199, -124, 288, 156, -84, 155, 262, -4, -71, -24, 143, 158, 50, 33, 28, 19, -10, -85, -118, 56, -163, -99, 136, 97, -150, 35, 35, 27, -3, 125, 107, 1, -133, -76, -39, 47, -144, 211, 38, -156, 229, -276, 126, -13, 1, -30, 275, 336, 184, 102, -100, -57, -216, -127, -44, -186, -133, -129, 88, -52, -64, 104, 128, 75, 212, 269, 37, -199, 40, -228, -131, -170, 169, 20, -84, -224, 36, 5, -71, -79, -115, 172, 206, 81, -151, 74, 90, -163, -148, -42, -44, 253, -51, 90, 105, 22, -317, 210, -10, 42, -114, -44, 79, 8, 121, 81, 59, -115, 40, 219, 63, -105, 39, -43, 157, 102, -139, -21, -201, 399, -51, 117, 50, 170, -17, -47, -164, -202, 130, 170, 165, -76, -192, -1, 213, 118, -62, 353, 23, 51, -132, -208, 168, 110, -105, 141, 191, 96, -175, -14, -172, 194, -117, -168, 253, 16, 27, -48, -38, 108, 342, 147, 276, -2, -19, 89, -9, 139, 161, -129]
5826a29J96O3j07j09O6M6j92J80n4lJ22rj0K73k46L2n1k5q2j04m6l5J30R2Q0J73
5852B51j24j47J50j0k31R0j12K67m56J26L7K37j70J24kl37K86Q9R8l09J30N5l8
5875DK03k79n3l0K4K14M5k42Q4J20j46n1J92J09j45N7r9J3k00J36L8k5K26j52
5899D3j1J21j44q1m8j27J07J85j2Q7m7J77l49J66k63M7LJ57P3M1j1k43K24O2j24
5924C3k78M67l35M26k55j06l1L2nJ87l7J23J46l27J89k12N0j30j12L9L94l62k11
5947c15o3K38J52J8j9j88J00Q0j10K05l13J00J72J7l0o0j01k1K34j33r9L9N9M8
5971A0m8K60j01j4J18p2q8n2j6J60j67J7M7N3nj38Q1L0k06k3K30l14L89p6M2k24
5997a07J60j65J84l9j13M41k88R3j83N5j83j3K24Q9n9m1P7J19k94j0O4L0j08N
$$ y = [-129, 67, 130, 23, -86, -20, 26, -166, 14, -40, -43, 79, 70, 60, 333, 87, 119, 68, 43, -39, -143, -189, -224, -94, -2, 78, 251, 127, -20, 130, 120, -111, -21, -133, 134, -322, -196, -159, 78, -92, 32, 30, -307, -21, 68, 166, -143, -13, 42, 4, 207, -72, -125, -155, -131, 83, 128, -114, -30, 90, -56, -107, 85, 194, 49, 106, 7, 20, -180, -44, -6, -31, 195, 43, 32, 153, 9, -72, -120, -247, -140, 45, 33, 120, 73, 250, -99, 67, -196, -149, -146, 11, 84, 125, 114, -129, 95, 157, 33, -245, 222, -113, 313, 58, -48, -79, -47, -52, 135, 98, 221, 367, 40, 229, 17, 67, -63, -175, -136, 258, -104, -315, -378, -140, 12, 30, 11, -177, -77, 3, -107, 98, -215, -115, 57, 74, 44, -16, -117, -138, 96, -37, -136, -97, -38, 10, -38, 222, 121, 107, 225, 153, 65, 13, -3, 157, -10, 7, 54, 107, 102, -36, 45, 75, -131, -154, 76, -238, 151, 75, 117, -107, 53, -112, 72, 33, -80, 361, 73, 166, -17, 38, -145, -158, 66, 155, 96, 55, 132, 251, -43, -53, 11, 41, -67, -62]
6021f2K02j52P9J22j72Rj16o7L71k61K3K36j24j78PL5L40l72P5k06J83l2J02J52
6045A94l15M51k52j88J1L69j49K30k71m41K76N1J33k30J75j13R9r5J2J19r1J37
6067A12J82l70j28K40R1j88O0J74l96l9L3N26k20r9P7l9j2J15k64J17J97p3r8
6090bj78K72K6j74P5j26J72J2k4j23J53J8j7m23L63O6j43J60l72J19M39j43o0
6113I0o9p5M0J21k58Q9j63J39j44K00j07K72j45J42j19N0O4j28q8J5M4K05p4p7
6137B4j47L1%n1J73J88j28j86O5p1M2j37R7K50o6j90K56j65J0Q9J9p6M6j02K7
6162bJ0j36K42Q1l94L03j44P3J16k85j75K71K65k49R5j97J49J21j17J58r1k65
6184a71OL31j66jJ85J09l6j23r5k04J7lJ66J79j72l53K68j54J92k26L62k56K57
$$ y = [-62, 140, -12, 67, 189, 17, 26, -90, -157, 214, -47, -24, 212, 88, -90, -83, -48, 292, -80, -5, -211, -28, -60, 42, 194, -121, 330, 78, -110, -99, 270, 121, 351, 80, -361, -85, -34, 99, -131, 44, -69, 30, -65, -53, 66, -25, 112, 294, -76, -204, 36, 127, -61, -1, 173, -223, -262, -229, 297, 77, -22, 55, 16, 4, 119, -145, -28, 169, 96, -2, -180, 92, 118, -56, 19, -107, 65, 77, 53, -70, 83, 101, 84, -339, 24, 90, -53, 107, -265, -146, 293, 150, 90, 21, -54, -14, 107, -151, -62, -225, -86, -230, -30, -137, 135, -10, 132, 13, 63, 127, -1, -89, -74, -30, 175, 101, 24, -123, -92, -92, -143, 30, 218, 90, -96, -31, -102, -60, -197, -100, 150, 84, -106, 150, -15, -5, 84, 103, 27, 73, -29, -2, 8, -128, 114, 195, -199, 104, -40, 33, 149, -136, -311, -40, 225, -24, 71, -126, 23, 144, 27, 185, 94, -171, -165, 166, 0, -1, 184, 293, 257, 134, 39, -165, -148, -151, 15, 194, 22, -331, -63, -217, -25, -251, 111, -145, 112]
6207A12l99J84K4n0J27m4J05K03m55K2L7K86r9o8J14O8k7j67K05j82j09K63j31
6230A9J65k04O4j8J35k77l5K08M0j6j84lO2k98J51L31m4k07J66J39j0n11M97j61
6254Ij33O3j46K49j29mM4j3K6K80m43K68Jk8k34K48j02j69K62j11K76l48J90j51
6278i5M89m36k7o9o8Q0J88K3l42r1L96K86k71J19L4j96P0k93P6K5N2J66j06n9
6302d9j6J42m7J3k02J88J27j53K8j40K5J54O3k50J63k67K32r5K10J42l80J6K04
6325A08%j14K5j09k16L08Q0k9O1l06K18K15m3j84L6J24j07j51r4M63j90j04O2
6348E3k4M5N0k66J92k50K08Q1j29j10L95k00O2k29L06j89m7R1j6j37P2Rr4R1m37
6373d73L99K0J66J16lm66L92j29k24K45n2l7P0n6Q0l11J24OJ85J38j14qO2j76
$$ y = [112, -287, -103, -79, -129, -2, -46, 59, 262, -193, -171, -134, 152, 53, -15, 99, 167, 140, -27, 178, -4, -113, 150, 19, 184, -20, 44, 26, 161, -116, -151, 57, 97, 81, -103, -106, -44, -342, -191, 140, 96, -111, 55, 194, 184, -327, 170, 9, -124, -61, -207, 42, -87, -91, -47, -60, -34, 246, -197, 71, 72, 44, -190, 58, -44, -213, 49, -62, 214, -134, 56, -95, 394, -42, -69, -138, -206, -126, 62, 85, -257, -348, 48, 334, 63, 182, 216, 20, 90, -203, -127, -102, -50, 116, 10, -49, -65, 77, 30, 43, -159, 29, 156, 3, 31, -109, -84, 70, 133, -117, 46, -221, 11, -84, 126, 268, -112, -96, 108, 108, -6, 19, -90, -306, 2, 82, 53, 114, -192, 26, 241, 198, 14, 50, 174, 67, -84, -178, 285, 95, -9, 53, 29, 74, 124, -142, 50, -200, 8, 89, -40, -150, 245, 45, 107, -122, 184, -5, -52, 39, 23, -114, -42, -33, -127, -36, -473, -74, -54, 112, 228, 225, -241, 151, 22, -202, 43, -9, -46, 24, -32, 48, -263, -139, -133, 52, 190, 76, 68, 130, -46]
6397d6pnK5M1n3K02k56J82Kk23k69N79l6l97M07k34J05Q8j27Q4k9K23l19J22k6
6422C3j04J47k58K20j75J58j54K31m41K48j58J60J66l9K9k0k20N8J11J57O5l03
6444h9J25m7N4o8J02j17n2J00m8n9M39j67k83L57n07L81j58l7K34j28l36L19R1
6467A06o2J95m05L15j37j12J36j09on7n6K54J5j98J98j6j70j36Q3O5j43N21j67
6490A14k05P9P7J2k24M30k17mJ03j38R7j6k12J24j49J37j69j11M15j52j6K16k05
6513a4MQ2k03K69k9m6J29j53P3l06K40R5p0k34O2l7J64K58l91qJ51r9K63j37J4
6538G7q5Q2j23J27j1K35k78p2J69m76N08r7j05k07K95J4o0j55L99k8j18J95j24
6561A62R3k69J64Ml10R1j45J87k32J80j12K53j49j52K84J34l99J22J19P7J09p1
$$ y = [-46, -53, -58, -33, 8, -45, 157, -99, 83, 85, -138, -407, 172, 136, -261, 146, -88, 17, 105, -22, 62, 33, 256, -63, 59, 33, -71, 76, -182, 38, -137, 21, -133, 98, -343, -95, -253, -93, 73, 34, 63, 43, -177, -119, -8, 149, 214, -89, 36, -11, 43, -25, 77, -40, -92, 8, -40, -99, 340, 173, -110, 247, -260, 121, -37, -74, 160, 32, -304, 15, 106, 44, 239, -166, 149, 12, -100, 36, -73, -79, -136, -192, 62, 77, -121, 77, 61, -109, -245, -162, -97, -240, 281, 114, -91, -12, 65, 77, -147, 283, 66, 62, 165, 27, 124, 108, -104, 20, -129, 8, -161, -272, 143, -9, -25, 191, -14, -10, 72, -131, 138, 109, 63, 192, 39, 112, -194, 46, 141, 71, -163, -101, -138, 26, 284, -107, -115, 36, -63, 200, 63, 77, -8, 74, -49, 78, 67, 302, 24, -48, 121, -355, 153, 56, -49, -256, 39, 53, -7, -162, 237, 209, 91, 286, 162, 255, -14, 150, 154, -156, -65, -210, -23, -255, -75, -187, 66, -83, -235, 49, 183, -216, -94, 25, 102, 211, 140]
6583A40k89K23j17J82J8k19k5J53l61K89R7Q9j14k15L7o4K97j34L9n9k49L36n5
6606aJ29j11j70jK15L7n6j65J9L7nL45j76j57M6p7q6K87j99R5R3J42m40L65J17
6631B83l49K18k26K07k16n4J47l5P6q0k38M06M7Ln8j22Q5k65J79j72K28K0q5O9
6655F8Q3j09L76l89l55K69K41m27N9K11r6nl0L36r6j28Qo1j29J80oN9K13l66K75
6680A81j65J95k11J16k44P1k2j05j55L44J59Rj07k05j03n1K39J00K76l35j70R6
6702h7R6O3L7j55J41k38J45j13K13k20R0k51R1J75L33n0k82J81k76J89K35l03
6724A4r5J65k09J98K67j83k12M26n96j73M77j25j47k8M56j80m7J88j79r5n3J78
6746D7O4j83J50j81J3J92j63L76l26R0q0k20K93J0p6J08j96J33r1r4k24N83m01
$$ y = [140, -149, 74, -43, 139, 157, -62, -87, 66, -295, -6, 91, 180, 66, -149, -112, -176, 121, -13, 26, -33, -282, 54, -1, 128, 17, -153, -154, 61, 98, 42, -123, -104, -67, -72, 273, 97, -60, -14, -91, -177, 110, -89, 6, 99, 241, -199, 166, 283, -66, 152, -74, 133, -83, -137, 10, -25, 51, -29, -267, 139, 186, 189, 131, 9, 94, -171, 8, -164, 64, 84, -1, 68, 151, 42, 418, 29, -326, -57, 184, -243, -184, 27, -69, -74, -104, 232, 136, 8, 16, -45, -174, 6, 0, 59, 272, -94, 181, 16, 211, 0, 116, -128, -57, -79, -184, -339, 5, 164, 173, 66, -139, -242, -293, -54, 46, 322, -13, -183, -87, 9, 72, 109, -46, 95, -143, 2, -111, 102, -118, -28, -279, -188, -13, 320, 270, -12, 169, -107, 82, 317, 14, -81, 84, -125, 73, 340, 157, -55, 371, -225, -398, 79, -46, -193, -221, 235, 55, 8, 196, 17, -78, -131, 47, 111, -72, 78, -103, -90, 102, -61, 315, -11, 79, -1, -221, 72, 82, 6, 114, -82, 51, -40, -134, -358, 225, -176]
6769a76K08L4j19J87Q6k11J73j49j84m5J03m0K71j56k0J42k30K01n0O8l01K61
6791E3J85j72J12j15k63K84J11r1j69o7K96j30m9J61K1k62L1J97j86N9J20J18
6813B44l03m7Q1j02J42J6k31J90j37J03N7QM6n8K44j26j57N5j87K47k16K80j88
6836c9K57l60R6J31m4j78j42K24J12j68l0L67n35N05k79K88l11k7Q3j2j25J66
6858b1M08l81Mj56J00Q2k47L7R0OJ78l37J1J96J76l18L80m78L68mL1j12k48K78
6882D3L49m85j56K72O6j08J03k88M94J15l03j73L03l31j6J02J52k06o0qJ72O4
6904A01q8J35l33J66j5q5K27j0j06o9r8K85r0Q1q6l7k7J72j16k1p3K29l27K78
6928I3J39l86j05K61j03K0K64m32L31r7J26j00n2J61p1q3qj36J11J22l43K38M76
$$ y = [-176, 32, 66, -53, 134, 220, 9, 182, 33, -151, -196, -93, -133, 138, -18, -38, 104, -126, 75, 25, 93, -208, 53, 238, 66, 178, 63, -200, 84, 195, 104, -65, -132, 164, 34, -15, 146, 167, -95, -64, 133, -53, 6, 126, 244, -59, -106, -25, -127, 15, 31, -200, -10, -147, -44, 13, 21, 67, 9, 253, 127, -30, 25, -162, 85, -131, 149, -39, 218, -142, -46, 85, 41, -137, -279, -55, 57, -111, -141, 226, -309, 196, -83, 205, -106, -133, -50, -62, -187, -21, 387, 6, 10, -146, -46, 36, -211, -174, -84, -78, 100, -237, -226, -30, 146, -172, 208, -270, 98, 94, 125, 13, -235, 43, 392, -93, -249, 23, 89, -19, 84, -204, 290, 405, 102, -71, 232, -99, -115, -13, 139, -67, -127, -135, 37, 101, 13, 148, -185, -19, -34, -119, 108, 98, -8, -77, -175, 110, 20, 101, 15, -22, -49, 123, 7, -14, -87, 142, -185, 93, 232, -154, -259, 2, -101, -81, 183, -249, 82, -15, 111, 11, -41, 120, 49, -34, -42, -178, -67, 55, -288, -50, 426]
6951D26n77M84m51J27J58j06L1j71K64l39K36k66K25l5j40K17n2l3L5k32jK87
6973H7j68o3L79j55o3J30k18M2K03j66J57j10j6J49j37J24l92J47K89l30J83p9
6995gj27K36M6q8k27K79J07n28M10k17k1J02J71j07o8QJ81n5j9j74J89K0k52l7
7019a78j24K09N7J85m08l3N9L30L3k80K83j26P7M2j49L37l73P1J19k42O0k88L70
7042C1k27J51N1p9Q4m47M41j64L57j46l3O4j81qo9K35J96k04L6O7j21Lj66K96
7066A67k46O8J38l8q0K11l86JJ33K13l38K46p5p9J17pj23J78k53L20M4j05K8J13
7090B47j3k86M5K68k31k61M76l26J70k18J18NK82l36P6j11j65o1J09K98o9j5j14
7113a12K04P0qj64k54M92l51jJ61P0m4j90Q2q9O7J14j90J33m7K07K3j58j06J4
$$ y = [426, -151, 333, -118, 9, 167, 61, 92, -79, 185, -154, 82, -184, 41, 6, -134, 83, 31, -2, 33, -199, -200, 87, -81, -144, 235, 80, 17, 147, -71, -29, 174, 8, 165, 55, 39, 188, 51, 175, -217, -70, 219, -111, 72, -7, -134, 102, 148, 60, -167, 112, 219, -309, 101, -116, -137, -35, 136, 29, -39, -31, 150, 95, 76, -98, 91, 111, -141, -178, -302, -93, -36, 149, -259, -292, -233, 97, 130, -150, 133, 7, 84, 126, -23, 314, -59, 12, 131, -111, -51, -339, 31, -196, -45, 6, -73, 11, -436, 5, -159, 198, 52, 19, 83, -98, -106, -175, 60, 256, 52, 88, 155, 34, 37, -129, 167, -79, -11, 127, 89, 9, 220, -166, -165, -32, 181, -157, 89, 14, -65, 52, 45, -78, 100, -153, 167, 211, 106, 134, 247, 234, -52, -7, 261, 30, -231, 245, -81, 89, -129, -11, -6, 276, -60, 16, -95, -260, -321, -212, 86, 17, 2, -112, 92, 162, 154, -10, -264, 228, -123, -124, 37, 107, 63, -127, -45, -134, -67, 47, -143, -10, -57, 150, 173, 15, -91, -77]
7137g7K43l49m7K44Q1k22J43Q2l17J16L56j03k7L9j79O9K8J8P0Nk35J26j87J69
7161D6j22k9J73j56l4K42k7l69J62K08Q9j71qKK53j17R1m20m7K27J03k3k37K49
7185H5k30j0K28p6j0J16k01j22O1L18l31K10k63K81K3j25l8K56j33M9N6k73K68
7208A39j63j46Q4lq1J6K66J58l16J27j02p5j80J68J98j84K7k37L56l6J00l19K52
7231D9J72q2j33Q3M3k56K35k20L69j20k91J94l04O1Q6J6j97K92L3j66J48j66M8
7254a06K20k24j31K12J60l6k41k7J14qq2J0R9j93J93K45k83L16j45j59J7O5K65
7277B81j41k37K33J88l01q0lL28l41j10K62j78J00j33J34J08l72L31l21R8J91
7298C7K19k07j52R5j16M25k56J68l72J86l4n5j42L02K9l64M16l01J78q6K08j94
$$ y = [-77, 166, -183, -230, 14, 95, -127, 16, 98, -219, -103, 253, 150, 123, 162, -17, 52, 80, 98, 168, 173, -62, 64, -123, 46, -76, -105, 68, -88, -122, 120, 93, -276, -114, 94, 183, 12, 4, 6, 259, 142, 233, -187, -234, -7, 96, 73, -164, 85, -145, -155, 73, -3, -13, 103, -98, -220, -159, 159, -172, 38, -225, 56, 79, -46, -84, 172, 39, 88, 144, -129, 139, -24, -170, -86, -89, -170, -154, 112, 270, -46, 81, -21, -96, -276, -108, 90, -94, -67, -304, 52, 16, 116, -203, 49, 221, 139, 6, 89, 132, -124, 111, -109, 260, 140, -151, 43, -261, -200, -114, -98, -295, -3, 30, -136, 12, -154, -106, 114, -110, -241, -29, 131, 95, -146, -173, -59, -67, -149, -139, -40, -233, -40, 205, -78, 238, 93, -66, -49, 16, 281, 140, -97, 136, 324, 23, -57, -60, 268, -73, -183, 79, -99, 1, -132, 2, 110, -262, 69, -252, -154, 37, 256, 49, -103, -8, -124, 301, 45, 213, -159, 27, -7, -62, -204, 98, 127, -237, 179, -122, 56, -30, 178, -16]
7320a6J10j46J64j55j4l0P4N8n3j40L52m1k02o6R3j02Q7j33J39J18k0k98M11J10
7344C00j73l66J49M16m54K17j14j6J83r5J08j24j23M5J14r7o0j21j69J97O5K18
7366A00k17J99l7j2k94L71o9r9j6p1k4OQ9m8J99j32K64j07N1j50J30K9l17J02
7390e3j03K11j54j8J93j51J00l31o1K95J38j63K48jl17P4q5K55k55J60J74j54
7412BK5j57j0K5j24M24j55j43j59L96k81N45m09K69j11k25J3r8P3K34k01P5J19
7435A27k65J37J14kk9r7j87K18j79J9L14k3k6k07J21P0j69l1K2J19P6o0j3j56
7459a07K3j03m5J92O9l26L11O8l26R1J60M9k24L3N0J10J9J00l25J41k12L32j67
7482h7J62r7L3K3m3M2j03K2q2rL23j64m3l8J30k5k9P3j29J78k65K77j49J71k14
$$ y = [-16, 94, -52, 112, -43, -57, -87, -13, 45, -8, -148, 204, 163, -39, -105, -12, -114, -27, -160, -21, 97, 77, -221, 190, 300, 127, -239, -90, 326, -128, 89, -25, -41, 142, 47, 155, 31, -92, -47, 67, -30, -90, -211, -380, -183, -118, 100, -117, 82, 45, 33, -261, 110, 41, -58, -74, -145, -169, -163, -74, -122, 77, -55, 209, 102, 153, 3, 133, 162, -155, -53, -156, 55, -99, -117, 76, -75, 25, -306, -367, -72, 66, -97, 151, 150, -167, -93, -178, 77, -178, -18, 156, 2, 27, -130, -140, -115, -239, 185, 30, -113, -272, 124, -157, 388, -21, 248, 137, -88, -75, -173, -100, 134, -67, 8, 127, -138, -1, 113, 111, 82, -15, -202, 16, -163, -144, 170, 147, 121, -86, 35, 105, -64, -95, -73, 46, 122, 62, 49, -107, -84, -187, -232, -40, 29, -297, 14, 82, -244, -153, 7, 56, -168, -135, -85, 25, 44, 144, -181, -40, -252, 80, -87, 75, -22, 11, 34, -9, 33, -70, -48, -130, -139, 184, 20, -23, -61, 69, 44, 15, 88, -41, 137, -128, 149, 0, 171, -43]
7507d3J34j62J04K93k08k88M68r4K3k08n4L71l67K23N4m39J14K36l0k28M9Q7J84
7530B19k11J8k76J25J00K03l46k5J79j19R3J7m0j23K58k41L29k18J43j8J29N3
7552B49r7k11O5m1J72j52Rj88K08Q6R3l17J99j0j09k05L13j11N0K04j92p2l6J18
7576B5M5J9%j42j12n1R5K80j52m9L3q3L06n62L49j28J0M1J34k20K64J4l32J53
7600f3KL3j27L38j95j42J18K65k31N0p6J1p8Q8j53K29m7j29J6j30L04l03P2K08
7624F0J0q7O3j6J57k36q9K17r3n4j79L29rrj10K74O8l16q9K42l09L99l83P0J34
7649D4j32M1K40j58mJ33k40L79l09q6J9J37l6j50r1M27l36K29n68L39J48j02j
7672g7K23k81O2J44k46K08k45O6K70K0k90K58j25j49K59L9j16k0j78O2J29j46
$$ y = [-43, 91, -71, 33, 326, 118, -170, 298, 204, 227, 19, -35, 336, -31, 192, 246, -193, -79, 157, 127, -101, -52, 35, 219, 8, 26, -250, -125, -25, 178, -168, -193, -14, -133, -40, -23, -63, -186, 72, -169, 160, -58, 85, 67, 196, 249, 152, -59, 6, -35, 137, -15, -6, -194, 14, 100, 193, -124, 75, 65, -44, -249, 64, -47, 3, 207, 15, -57, -93, 25, 70, 89, 89, -53, -165, -216, -121, 159, 7, -42, -9, -92, 214, -348, 1, -127, -117, -76, 58, -162, 102, 116, -216, -63, -61, -28, -155, 183, -12, -154, -36, 229, -2, 48, -28, -17, -95, -7, -160, 69, 22, -107, -91, -221, 83, -220, -148, 60, 70, -17, 46, 30, 187, -49, -138, 79, -14, -68, -247, 82, 73, 64, -46, 228, 296, -20, -109, 133, -176, 223, -160, -90, 44, -88, -47, 193, 35, 31, 164, -76, 303, -6, -92, -73, 64, 28, -122, -213, 214, -122, 107, -461, -122, 26, -76, -77, 146, -135, -73, 71, -175, 33, -212, -146, 124, 144, -146, 112, -13, -162, 97, 136, 20, 0, -178, -116, 13, -133]
7694a33J05l4P6j70J57J42L7Q3j90M4j12m5M8K44k73M6j56J20J22l28J91J5P8
7717F7rQ2j17J41j58j13N6R0j52%K32k58K18o8N4j2J74k22l53M69J3l03MJ32P2
7742C9Jj11J5j32J08K42m4j51j06K26o1N2Mr9P0j86K28k92K08o5L33n0l8k99K95
7767A87k31N3j10l1p4L51rP8j20k1q2J24M8q8o1K9O8k07M0J54k39K69k46j20K47
7792Ij02P4J5N1K4j81L19j88J57o0j04j27Q7k74J04K39j83k0J97J13Mj47j44K76
7816A39k85J78l02L33j85N8oj53K4K28q8L3K6J48k60N5j54N9OK10O1j54J09k19
7840a39J17p9j01K01O7m7K48l76L62l70J82j22J45m31L68J66j81K8j13J55p3l
7862DN1m8Jo1n7K02O9k88QK16L3j28N9q5J18j10J75n9l58M90m82M45j09O0k90
$$ y = [-133, -28, -62, 14, -156, 1, 143, 180, 263, 73, 117, 5, -40, 8, 252, -21, 25, -131, -11, 111, -217, -26, -11, 67, 58, 140, 23, 164, 6, -107, -51, 39, -113, -113, 119, -139, 79, 11, 65, 53, 227, 5, -348, 121, 134, -169, -165, -33, 39, 40, -71, -56, -188, -80, 162, 118, -33, -139, 87, 26, 78, 82, -17, 53, -133, 95, -197, 11, -54, 279, 229, 191, -108, 187, -44, 9, -101, -132, -206, 145, 136, 214, 94, 73, -9, 115, 163, 75, 14, 43, 111, -96, -56, 98, -141, 128, -118, -238, 9, -93, -19, -4, 47, 71, -110, 209, 21, 178, 118, 14, -113, -26, -300, -196, 43, -140, -160, 37, 150, 154, 7, -137, 139, -146, 32, -270, 63, -122, -64, -70, -223, -199, 29, -59, -26, 0, 148, -112, -57, -211, -152, -146, 64, 125, -29, 80, -139, -22, -101, -202, -1, 66, 19, 267, -109, 253, -117, 65, -57, 88, -343, 25, 191, 10, 38, -75, 80, 7, 4, 55, 7, 8, -53, -110, 92, 161, -127, -119, 97, 130, 2, 61, -24, 94, -16, 159, 100, -258, 232, -250, 195, 86, 146, -144]
7887a44J32j03J97j27L02k12r5J25l77J86K36LK4l7K5J03k98J59J1k88M46l97
7909a29K1K55l73M13j14l2K08l54K52l04J11Q4J67j35j36K25o9r6M6n1K92n39
7931b58J56r4K00k3J55j62j13k7J5M61l00L33n61J72J84p9j70K58l86K61J79j33
7953F8K5k8L4M1p0J08j68l22M02n7l41L97p7j36K2P6k9J40j75J1J49K32m80j83
7977c61M52j82Q3l04M35j27j00K05l17Qj53M40k32K23k14L38k86J49O4o4j18m8
7999a09q2J37K07l50M13l75K99k10j6P6m9Q0p3n6k17L03J18Q6p3j35K9J00k52
8022a49O1J62N4m19K0K58j68K01j20K66p3m07L70J06j33K6J97k29R6l70M02q9
8044F2mL8l06J26J46k56J2J34J05J11q1L2r2k55Q3J90j18N1q9K94j71l48L58j64
$$ y = [-144, -12, -115, 82, -45, 257, 45, -50, 75, -302, -116, 120, 123, 147, 110, 135, 238, -60, 99, 110, -178, 268, -129, -108, 147, -226, 187, 73, 41, 249, -105, 147, -157, -46, 38, 205, 70, -66, 159, 90, -6, 40, -11, 281, -258, -102, -196, 4, -19, 136, -26, -139, -166, -151, 310, 10, 343, -218, -46, 138, 59, -111, 147, -239, 22, 201, 68, 93, 65, 99, 140, 70, 178, 10, -312, 90, 33, -308, 89, 12, -124, -102, -26, -55, 85, -90, -79, 70, 302, -178, -361, 91, -91, -8, -312, 123, -4, -104, 101, -216, -208, -361, 79, -153, 70, -144, 194, -92, 57, 121, 57, -61, -109, -191, -54, 153, -197, 216, -159, 140, -70, -86, -10, -59, 21, -52, -108, -325, -22, 96, 182, 109, -26, 3, 103, -149, -88, 74, 128, -291, -271, -13, -181, 20, -100, 166, 93, -314, 56, 162, 29, 55, 252, 23, 119, -251, 151, 62, 58, 96, -210, -84, 62, -194, -182, -48, 57, 168, 87, 119, 27, -228, -145, 45, -73, -22, -111, 183, 12, -336, 22, -142]
8068a42J33J4K29k96R2k95j18N54j53k1K7l6J00j09N9p4N4L8L1R3l06J52J85l50
8092a39K64j21J28j70J28j53L04l99NJ37j94k6M59j83r1J15m6l23L63O6k38K19
8114A05j32P5O0p8N0L4j62J70r2j04L89j79M7j82L5j8K12k76L29q1r2L7Mk43J63
8139G1k40Q8J73m3j71j18M28j29j90L56j73K5m4J81n1j97p8J79r3j10J30l9J49
8162A04k08J06r6r1O1J61P9j31l6K49p5j62N2k40L36L7l06K22j29j1p3K03P7J05
8186B34m48M26j19k86O9
$$ y = [-142, -9, 5, 234, -62, 30, -265, -383, 171, 18, -3, 24, -12, 88, -21, 38, -36, 18, 56, 87, 180, -126, 26, 211, -139, 125, 4, 132, -38, 90, -63, 241, -158, -153, -16, -210, -236, 223, 40, -51, 64, 18, -305, 58, 124, -114, 105, -27, 48, 108, 30, 80, 114, -48, 122, 30, -74, 315, 136, 183, 1, 36, 18, 230, -46, 283, 202, 110, 147, 151, -92, 71, -169, -81, 92, 49, -122, -240, 188, 59, -131, 225, 52, 77, 33, 214, 163, -34, -112, 67, -26, -136, -6, -45, 104, -104, 2, -94, -185, -124, 37, 116, -15, -51, 198, 123, -39, 13, -227, 109, 146, -160, 62, -67, -78, -151, 52, 129, 234, -214, 212, 93, -193, -124]
8191a24
$$ Imaginary data points
##PAGE= N=2
##DATA TABLE= (X++(I..I)), XYDATA
0@%%%%%%%%%%%%%%%%JrJ6j6J6j6J7k5L2l3M1m8N4o2P0p9R0j04J17j30J44j63J83
39I6k03K26k51K78l07L39l74M14m59N06n58O13o74P44q20R06j004J117j245J393
59G37j570J782k042K370k801L395m263N657q244J4594n8473p5562J44600L6526
73E6706j10997k5697Q7070L091n1863M076K1471j7324L134J0989j7353K335L7881
86C519j1775m5091K5062N7775l6682n9453M3935N9065l5271l6716L5054K2550
98B1972k5258M63J9475j6833j0545L0063Q820k1533j327J4698k1m419K97p589
112H263q90J4602l339j3578J2138J0858k2832j3677K5433J1303l3268j6112L2796
125A1697J6519k7838j5652J3942P827o153n020p223k497J6231M444k0475l43K1271
$$ y = [0, 0, 0, 0, 0, 0, 0, 0, 0, 0, 0, 0, 0, 0, 0, 0, 0, 1, -8, 8, -8, 8, -8, 9, -16, 16, -17, 24, -24, 30, -32, 38, -41, 49, -55, 62, -68, 76, -87, 96, -107, 119, -132, 146, -161, 178, -196, 218, -241, 265, -293, 320, -354, 390, -430, 476, -528, 589, -656, 737, -833, 949, -1093, 1277, -1524, 1871, -2392, 3265, -4979, 9615, -48858, -124420, 20180, 56706, -54291, -79988, 7082, 10173, -41690, -37614, -16143, -33467, -30333, -19344, -36697, -34362, 3519, -8256, -53347, -28285, 29490, -7192, -66645, -22710, 36355, 1084, -35632, -578, 21972, -3286, -2823, 16652, -181, -10726, 19337, 28157, 6624, 5297, 19995, 19974, 15555, 15852, 8263, 7373, 21975, 18636, 5058, 17196, 28054, 5222, -8455, 16978, 28281, -4987, -21099, 11697, 28216, 378, -15274, -1332, 6495, 342, -4678, -11901, -14398, 1833, 6277, -14198, -14541, 6730]
139F730r577k1258J5337J8671j9519j5579K4154J4535k0529q690J4468L415r984
152g826K779Q596o934o144J3544Q789j3143j0096Q474R893k750r000j933P713
166A962Q183m938j1290L126R732o286q892P019P886p364q991P388J0482n835j4446
181a2264o09J5953N645j7199q319J7149J0039j3849j0803J1061Q564r714n612
194i958J0305N159q655l593R285M830q160m824N211N652O38m925l395O253O286
209A0109n497p055M499P003n436n371P193L524o951l115O198K415o557l549L965
224A375L015j868k836p06J523J242j408k864j146K607P89k448J38J406j386n71
240c138O83o0j202M49J263j340P21L211j850l731K487L613j235m001Q21N203K7
$$ y = [6730, -2847, -24105, -8768, 9903, -9616, -25195, -1041, 13494, -7035, -15725, -1257, 2158, -7826, -5047, 3549, -3385, -9529, 4015, 12804, -339, -10435, -1961, 7932, 5182, -3818, -5751, 1962, 10145, 5207, -6083, -2957, 6775, 489, -8403, -1384, 6502, -862, -9853, -2465, 8017, 2182, -12264, -12873, 3080, 8725, -8474, -16793, 356, 10395, -3454, -14257, -3196, 5368, -4346, -9958, 347, 5506, -3149, -6742, 2543, 7373, -787, -5611, -400, 5252, 5890, 965, -2430, 3823, 10109, 4612, -2443, 2056, 9059, 3623, -1748, 5445, 8969, 2018, -1097, 5101, 7516, 959, -2590, 1375, 4390, 2522, -314, -1020, 503, 1745, 337, -2527, -3673, -1066, -277, -2725, -2587, -1181, -2567, -3138, -2455, -2515, -3717, -3268, -2005, -3345, -2624, 587, -1263, -4994, -2507, 1106, -129, -4130, -3309, 1894, 1921]
257A921l057n62J502K322r37k468M92K345O07k301q22L294O13l839k13L123m34
274A586k839k47L093k45k510N41L52n93K03j02n81n57R97N51j143n10Q31n21K88
293a406N07j008J14J259L47q82j040K802Nk461P38K313O0j734J43K274R8j436
311F93q8J122N46M56j050o78J775K76q91j093K033R31k601l77K188o42j307K85
329A578L26L6j383N07L41j197J64J83n97J32m69j69k30j79k75k23p72R70q71n54
349b682P93M62j222n74J183J79j946K59K034p49r53P87J87M43o84P1N36RP28l59
369a498l82J070L35n87P05N10L74n28j15J247J77n57Q09L20j40N4L79L63q14K05
389A927J405j119n56P63R6j85m56l14M41J73k83j014K06J166r20j471L44J045
$$ y = [1921, -1136, -1698, -196, 2126, 1189, -1279, -787, 1558, 2165, -136, -958, 2336, 2949, -890, -1103, 2020, 1586, -1253, -1500, 1593, 1348, -1162, -621, -269, -862, -659, -761, -1342, -1899, -902, -351, -1494, -2004, -1173, -1694, -1406, -899, -1907, -1793, -534, -187, -1069, -2109, 693, 698, -1763, -1025, 1288, 1348, -386, -243, 2031, 2129, 693, 605, 1727, 2273, 2729, 1679, 1001, 2776, 3052, 2161, 1068, 3101, 4032, 1431, 1054, 3242, 2600, 1293, 1578, 1904, 1940, 557, 1064, 1405, 208, 372, 555, -42, 90, -379, -548, -778, -957, -1232, -1455, -2227, -1257, -2128, -2682, -1889, -1427, -2649, -3223, -2040, -1861, -3807, -3548, -1514, -2263, -3216, -2429, -2242, -1799, -2483, -2412, -1876, -1867, -1139, -1498, -1880, -810, -475, -1062, -357, 153, 527, -1, -116, 1131, 1308, 751, 1560, 1880, 1740, 1794, 2173, 2536, 1722, 1927, 3332, 2213, 1657, 2420, 2516, 2331, 1875, 1561, 2002, 2175, 1892, 878, 1084, 2250, 1330, -141, 203, 1248]
407A248m11j257k90J111q8j315j84M15N29n23q56L53N31j27m16p39P92R79r70
426a218l34P67L41k13j6L19m60K95J268k95j563J533R86o51j203K37J977K63k313
445b80j41J184J658j988k296K445J702j732k192L63K739j20l790j56L457L05l476
462b318j644L546J519l111j980J401L214q73l796K32M831p58m148K56M283J83
478H37l920R11L250l48k279L53K525P89k492J34K478M4r20l0O46R78l14l70k86
497A986J115R86k597l89M233j040m817R55N815j863o291J090O374j082o541L5
513b031N545O2n970OM094q34l132M04Q07j33l9q24j810J728K724l372l293L893
531b175L922m304l164L402L160k446k759K376J740k008M09J763j361j234K640
$$ y = [1248, 837, -420, -710, 401, 313, -1002, -1186, -771, -242, -765, -1621, -1268, -737, -864, -1280, -2019, -1227, -248, -1218, -1552, -785, -444, -657, -673, -354, -814, -519, 749, 454, -1109, 424, 1410, 759, -444, -207, 1770, 2033, -280, -421, 763, 2421, 433, -1863, 582, 2284, 552, -1640, -1277, 1462, 1342, -2448, -2604, 853, 1158, -2318, -3962, -416, 1103, -2008, -3988, -2587, 627, -246, -4042, -3810, 1021, 263, -3885, -3629, 654, 837, -3083, -2172, 1078, 730, -1549, -1196, 1329, 2118, -374, -240, 2238, 2282, 1362, 1332, 1978, 2956, 2642, 2272, 1986, 3101, 4087, 1490, 1101, 5334, 4294, -523, 432, 6247, 4384, -1907, -817, 5557, 4475, -2066, -2031, 3514, 3576, -2394, -2388, 1706, 872, -2260, -1856, -1049, -1182, -1221, -2045, -3855, -2127, 597, -2775, -6068, -2175, 1747, -2557, -5721, -2319, 841, -1605, -4364, -1988, -248, -2256, -1847, -84, -1445, -2679, -39]
546c9J739l328j122M767j23m211J091L394k11k851n56K403J698r64l758R6N207
563C232O40n823j001M671K178m117k703L539K656l055k378K313K014j158k239
578a231N7K325J450k652l352M159M924n354m796O268L996n454k539N666J08n190
594a615K469M580l850m363M819M041m470m219M032L479l725j894K197r84j83J764
610B078j825k895L179K413o448j602Q817o13j0637J282J0644j488j1321K23J0734
625B541k43r066j052O790K053m874j883K718J458l64q20j712K543K871l018k970
641e028M178M085l940l971N023L425k844l041K503K797k73k038L41J544p1q4L10
658B916P4m45j6J316r36q00J056J43r95m22M01R54j022k211R39K375j126l670
$$ y = [-39, 1700, -1628, -2750, 2017, 1894, -2317, -1226, 2168, 1957, -894, -1450, 953, 2651, 1687, -2071, -1975, 3232, 3872, -1951, -2952, 1719, 3897, -220, -2923, 616, 3272, 217, -2161, 152, 2166, 1008, -1231, -1174, 1151, 2601, -51, -3403, 756, 5680, 326, -4470, 1798, 5794, 340, -2199, 3467, 3575, -1615, 854, 5434, 1584, -2779, 2040, 6081, 1611, -2608, 1424, 4903, 1178, -716, 1481, 497, 314, 2078, 253, -2642, 537, 2950, -3498, -5100, 3717, 3104, -7533, -6251, 4393, 2905, -8416, -8193, 2541, 2298, -6768, -7820, -1030, 1023, -3851, -5734, -3016, -1558, -1922, -2742, -4454, -1911, 960, -2058, -5028, -850, 3235, -705, -4676, 347, 3772, 928, -2113, 390, 3187, 2914, 876, 1217, 2761, 2690, 2606, 2916, 2990, 2545, 2529, 3845, 2909, 2109, 3165, 3308, 2313, 1891, 2292, 3246, 2224, 13, 952, 3327, 2201, -1469]
676a469K08L079j39k954k85P24P66k95j714k81J139K94r52Q1J57K08j069K41R87
695a274L45j179j007J903K090k591j464K579R99j305k27J085j53r04J222R74p06
712C87j091M30K089o3k554N18K207k93r88r2M1K26M45k60j124K78Q91p52n42Q83
732F36j97j537N7J775J21k219n54K154M45j711q73J380O77j286j86J493r22n34
750a281J003%j21k57P8K91Q19j52m60l26J358J54q31j1N65L23j28m32O87K12q08
771F83R7N86k33R4l63J57L19K99l16o67q8P60m31k14p21L09M00n00m11m8O08j95
793A25q62j73Q91m29p86k1N06J21n03r21R15O45j023m10L70J221o70j094L70Q52
813h76O6o84m14J351L08q85j20M16L25j08m25L84N31J31k30J7Q53R5p53O26K93
$$ y = [-1469, -1261, 1818, 1679, -1275, -1560, -836, -70, -365, -2079, -2360, -1221, -927, -1879, -1798, -1641, -1433, -2502, -2261, -1274, -929, -2108, -3115, -1212, 878, -1713, -3177, -598, 401, -904, -1131, -46, -199, -1103, 119, 1093, 387, -704, -274, 1815, 1752, -802, -284, 1923, 1630, 642, 550, 591, 817, 1262, 1002, -122, 156, 1047, 295, -247, 636, 439, -1098, -1041, 734, 855, -1364, -1918, 236, 681, -1030, -1903, -523, 154, -1132, -1318, 175, -747, -1281, -278, -278, -399, -656, -578, -287, 532, 380, -80, -406, 952, 1106, 275, 264, 829, 1152, 1024, 592, 1279, 1491, 683, 780, 1366, 1133, 1227, 864, 1021, 1340, 1639, 1323, 656, 568, 1328, 897, 683, -38, 271, 671, 171, -240, -288, 320, 125, -737, -910, -19, -448, -1234, -1255, -749, -628, -1131, -2052, -1137, -492, -1515, -1925, -1555, -334, -1004, -2098, -1728, -876, -810, -1494, -1908, -557, -249, -1134, -1254, -838, -513, -621, -1046, -662, -131, 0, -230, -213, 640, 735, -18, 608, 901]
834I01m8m8M0j2J50k29K64M03m54Q3M8J60j29m46L53M24n45l02L66K29R6r26J66
857E44L81M8o20m70Q74K22r48L6M13lo95j51N33K62j092J94L9O48j87p76j66J030
879A16k61o47J50K0L78j03o95N72J50m80P0M65p2o24J78M62o06J87R2L4J23o4
901e55O8q4r5J1N95n40N03m33r9Q25k28l51k3K69K87m09l36Q29m2k73r1jP30l49
925B08j77J84L08k18o9j82N88J62l96K26j47L07k05q0K17K9m89L78n3P2J92j20
947G35r6MQ1j46J11r4j25j62K08l6m67K05J41l75L9r7M93j61n64qK11k27j44Q9
971c85Q3k72J77k56k65M62Jl62k57M78m9k14R3O9K69k62l77P98k06o3k3J89P4
994b98m38Q57K64q89J49O10j01k51o1N94J70l48k62Q2K75K77q57L34L71M12k93
$$ y = [901, 853, 805, 845, 833, 983, 754, 1018, 1421, 967, 1050, 1098, 1258, 1129, 683, 1036, 1460, 915, 613, 979, 1208, 1304, 378, 544, 925, 973, 353, -117, 757, 979, 31, 67, 480, 477, -218, -369, 164, 426, -666, -472, -433, 215, 28, -748, -914, 116, -145, -792, -642, -622, -244, -347, -1042, -470, -320, -800, -730, -265, -337, -961, -783, -321, -927, -740, -648, -614, -491, -555, -487, -571, -666, -655, -60, -600, -97, -530, -629, 196, -32, -383, -406, -137, 150, -259, -595, 234, 192, -81, -172, -173, 557, 208, 31, 215, 523, 305, 236, 54, 642, 804, 408, 634, 487, 794, 589, 509, 726, 755, 266, 644, 591, 663, 855, 735, 639, 643, 724, 578, 689, 595, 470, 308, 516, 480, 13, 218, 359, -16, 23, -74, 419, 258, -306, -314, -103, -330, -474, -385, -302, -574, -397, -653, -918, -456, -455, -817, -1074, -596, -645, -859, -766, -697, -428, -690, -1067, -269, -475, -538, -561, -372, -298, -736, 121, 385, -504, -355, 255, 154, -97, -158, 436, 606, 258, -4, 78, 353, 630, -227, 107, 478, 890, 597]
1015E97o65J54Q03k95j252O96R78n68j268O97J010n03r51N55O20p4p82l14Q09
1034B47J47n81J43K94j57j60K66k73J61L11j71n76J000j4o55Q8M80J91n87j18
1054C6P68Oj055L7J058n9j090J43J322n51j535Q92J346j412q78O77J012o91p15
1073f89J92J75K48P5j006K44K52M8j59o34O30P30j184l72P73N28q11l76P63N40
1093c3j102Q3N94j53K12k95L16k9J69L02J40j28k73K79N47l73n67P45P51o62k88
1114B35L51M88L2r46L98O44r6o10l9N57P9k52o4k39N5Q87j120j026J663M13j542
1135a32m43J583K61j905j38J721J4j475j50P98N04j503J15P50m90n47R09j43o64
1154i35r3R35m56n57R79j57r56O47P53j234R8N27O51j197j62J055N63j194n8R58
$$ y = [597, -68, 86, 889, 594, -658, 38, 1016, 448, -820, -123, 887, 384, -567, -12, 608, 534, -248, -562, 247, 394, -187, -44, 250, 93, -67, 199, -74, 87, 398, 227, -349, 651, 637, -18, 70, 550, 741, 154, 36, 804, 810, -245, -208, 850, 791, -299, -156, 1166, 615, -920, -28, 1318, -94, -972, -295, 717, 26, -689, -497, -322, -74, 1, -1005, -761, -509, -461, -620, -1254, -624, 106, -1078, -1450, -677, -149, -960, -1336, -573, -33, -1135, -1052, -458, -611, -399, -694, -378, -407, -238, 64, 204, 76, -197, 82, 629, 256, -311, 434, 1185, 523, 235, 586, 1074, 1106, 160, 558, 1202, 1106, 496, 457, 1014, 1093, 841, 777, 538, 593, 1480, 360, -666, 997, 1410, -132, -575, 1008, 1269, -636, -774, 947, 961, -514, -664, 134, 638, -865, -750, 0, -490, -1037, -128, -271, -935, -1028, -93, -549, -1106, -127, -284, -1240, -593, 160, -1074, -976, -449, 202, -995, -1157, -102, 461, -733, -791, 167]
1174A67L85j303k19J853o37j117N34L89p3p0k84O06K40k8m87n64O59N64n22l13
1194b20N44L24q2r87L33Q80l33p51K90P20j85m68J60J22l80P2n2K57L61o42K28
1215A91K78J22o65J43K79j25KL66n45k38P73q3k93m7j74L51L03m39k30O8J19O9
1237B25j58k28J42O7K68n22j32N44k74o38O16Q5l61l39N59L8n40J18N7J46j14
1258d41j31j10J12O5r5J02j01J12K96j68l00L59L2j25n6P16m77k52P80k83l56
1279c21L05K66n1l6j20k28M79K70l24m5J99Pj00j8J45l33L86R3l8k7j11J43j60
1302C81J52n14M07J31j62N8L26n34l40P26n78J60j62K15p7j69P1l02J63J88j50
1323a0k42L96j77O5Pk35O2M3k00K12J90m11L0J59J96l61J06L77l44k56J9J5L72
$$ y = [167, 552, -751, -970, 883, 246, -871, -337, 52, -21, -91, -375, 231, 471, 443, -44, -608, 51, 615, 93, -220, 324, 648, 566, -421, -88, 792, 459, -292, -2, 718, 533, 65, 225, 347, -33, 39, -13, 244, 605, -37, 191, 469, 591, -74, 69, 348, 223, 225, 591, 46, -192, 581, 498, 205, 158, -16, 335, 638, 199, -31, 37, 156, 225, 67, -161, -19, 48, 316, -206, -338, 206, -68, -706, -90, -5, -366, -705, -146, -108, -648, -530, -473, -327, -441, -572, -682, -570, -505, -600, -498, -599, -487, -191, -359, -659, -300, -268, -393, -449, 267, -210, -462, 318, 35, -321, -16, 250, 199, 163, 43, -185, 294, 564, 240, 195, 394, 401, 301, 283, 428, 95, 481, 574, 536, 509, 398, 541, 381, 533, 19, 426, 557, 395, 453, 779, 245, -95, 631, 53, 213, 51, 266, 189, 20, 91, -211, -48, 140, -10, -252, 144, -33, 32, 39, -196, -134, -91, -291, -79, 111, -300, -270, -111, 85, -276, -170, 207, -137, -393, -374, -359, 13]
1346A3n1k30k94L16j74J92j21j41P5p6L07J0m9l19P2L72j66l51L56k5l5l1LK4
1370c23L17k05k06J14M83k75j27K81L28l29l7M74r9o8j20N75l16L2%J32qk9L7
1393F31k35M61k85k5j64O1M46m48n6M84l42k28J79K7r2l57Q2M35l02k65j85K44
1415F6J2j95j51j51J1K43J13l94K08l87K05P4j37J17l27k43L71J64j26J45m3j32
1437e57j14J73L4O4m8j2J43L03j39n6P5J30m8K55k31p9J73K6m7P5J08k4j48R9
1461A55J06n6p1K45k09N1j18K00Ql52L21q9n0J34q9K10k55k48K54K21l42J34l57
1484a97L50J71k87J88O6k08N9r6J51L90q6l24J85q1k68j7J78q1j31J30mJ9K20
1507C27k53k32R9M1K40k44R1J27K6k88J8j63k7m2J50j12J04J4j29L0k67L95l11
$$ y = [13, -38, -268, -562, -246, -420, -228, -349, -490, -415, -491, -184, -174, -223, -542, -470, -98, -264, -615, -259, -284, -319, -350, -347, -323, -6, -211, -417, -303, 180, -95, -222, 59, 387, 58, 21, 495, 396, 328, 208, 783, 467, 499, 499, 631, 623, 594, 631, 396, 857, 572, 547, 383, 444, 890, 442, 386, 870, 528, 300, 479, 506, 414, 57, 139, 574, 272, 7, -178, 66, 78, -117, -268, -419, -408, -165, -52, -446, -238, -625, -420, -346, -483, -366, -693, -936, -565, -401, -527, -382, -425, -557, -671, -498, -464, -400, -448, -460, -317, -14, -153, -209, -134, -4, -52, 203, -28, -107, 66, 92, 45, 120, 228, 204, 56, 155, 261, 205, 134, 379, 170, 221, 103, 303, 311, -41, 280, 191, 141, 275, 186, 396, 141, -107, 147, 368, 26, 160, -197, 153, 324, 37, 225, 291, 83, 142, 46, 197, 587, 501, 177, 362, 281, 13, -4, 174, 93, -38, 92, 88, 107, 327, 74, -158, -59, -18, 222, -22, 69, 196, 222, -66, -48, -211, -238, -280, -130, -242, -138, -124, -253, -223, -490, -95, -406]
1530d06p2J0J66J38k24k51L67r5O4k05p3L28Q7J21j24l8N9q2o6J88M9K0J20o4
1554A7J74k40L60l59J95J22J33m88K86J23j30R6K16j03q0J41J51K8m19J74jP4
1576D70l85O42l38J1l19K95k63J54j21m7K7M8r1kj96K29O9k65j88L72k30J78k14
1599a64M6K31n43J76R4j38K1j01L57k17j12m1L41j08l83K05R6M5j91M17l31K3
1621b77oP1p4N3l11L66K51j19J96m27j61O18j41k64k5J80R4r5k3J06j69L4j2j63
1645b98P63m13m21L69L03n36j68O80Qj74l5L22o2l76N42l85L12k73NL41k87K8
1667B45K82k06%r7n4L61l32L30l0l43J67M30n24k49K11J13k85O8J77k00j13l56
1689d05O86m11j67k69N86m17Q9k9J7J66m62L57K02m22j4On0J46J01k85m1L16m6
$$ y = [-406, -478, -468, -302, -164, -388, -639, -272, -367, -303, -508, -581, -253, -166, -45, -169, -207, -148, -230, -296, -108, -59, -39, 81, 17, 191, -49, 311, -48, 147, 269, 402, -86, 200, 323, 193, 289, 505, 402, 322, 463, 614, 642, 223, 397, 396, 470, 85, 727, 389, 400, 81, 376, 113, 267, 146, 99, 126, 174, 83, 81, -115, 114, 183, -82, -270, 102, -128, 50, -164, -118, 113, -430, -254, -160, -298, -277, -378, -21, -238, -350, -391, -50, -158, -541, -336, -240, -195, -386, 31, -300, -277, -283, -212, -286, -233, -544, -178, 73, -46, 150, -277, -438, 180, 39, -225, -250, -70, 24, -71, -94, 12, -157, -123, -135, -298, 465, 52, -369, 0, 303, -233, -401, 279, 287, 113, 78, 400, 338, -38, 504, 119, 431, 158, 163, 504, 217, 245, 527, 321, 321, 224, 170, 531, 199, 529, 499, 156, 323, 753, 229, -20, 191, 304, 19, 87, 264, 64, -49, -405, 281, -130, -297, -566, 20, -397, -308, -337, -320, -154, -616, -259, -57, -479, -493, -487, -537, -391, -290, -575, -616, -300, -346]
1712c46L4k03L21K42k35o8K43K65n60k3M81K49o90K82M23j88R1k91L08l1J36j67
1734B73j0p6LJ69K59k03j31Q2k53J43j64Pm41Q37l94r0J50K3Q6m38M73o3m67M61
1758B36l15l4J09J15j79K58k40J07j2P3l01L4J47J98k21n4j48j14L12J98k27j
1780e9p7o3K39J07l10L08j04j88J17m1J09k45M90k40j24l63N34l17P6k5nJ66J27
1803A12l88J57K63k89l28J50J36n5K27l01kJ1MN7R7m6j92J42Q4M8k60L65p3k5
1827a06K30L8j79O9Q5O3j65O0j49Q6M05j62j83J83j00J12K14j22k78K34J68j46
1849C57Qo3j9p5j06J49k31N63n4n47M8K10q5J6jj69L39m07J12k45L11L7l53M30
1873B25m47P7J51J8j33q1Jj9j12L07j85M5l17J74k19M25j35j95J44J81kN4l10
$$ y = [-346, -312, -515, -194, 48, -187, -255, -12, 253, -307, -330, 151, 400, -290, -8, 415, 227, 318, 27, 335, 304, 440, 273, 263, 187, 190, 359, 618, 415, 284, 366, 113, 256, 92, 99, -342, 495, 101, 11, 161, 184, 270, -168, 305, 242, -225, 236, -79, -113, -4, 111, -68, 190, -50, 57, 45, 118, -183, -149, -2, 196, -25, -79, -227, -341, -29, 169, -58, -59, -136, -199, 40, 147, -163, 145, 41, -147, -30, -71, 38, -207, 283, 43, -81, -444, 90, -227, -151, -176, -181, -15, 112, -276, -119, 144, -145, -473, -323, -187, -242, -15, -316, -318, -307, -303, -246, -149, -195, -387, -245, -161, -113, -373, -8, -81, -106, 124, 162, -17, 52, 137, 200, 35, 95, -54, 32, 437, 275, 92, 275, 175, 287, 501, 379, 101, 335, 503, 357, 365, 302, 283, 208, 102, 251, 20, 583, 529, -18, 30, 240, 155, 171, 170, 1, 340, -67, 45, -200, 111, 148, -205, 225, -222, -145, 6, 24, -109, -190, -189, -208, -320, -13, -198, -153, -470, -296, -515, -90, -225, -420, -276, -95, -97, -43, -353]
1896c53j62N29j39K8l19J47L08j04j18J99l8M4n7K24P5l43N9m1K45j18P4l29K40
1919E1J62J45k26J0jk86K88J53J20k03J7M9j18L8j25P4j48k5J68k91k7K35K20
1942B80o9k25L21k93n1R8km4k1L50R4n65L56qO3j10m2Q3j91q1K09K43n26J04R9
1967G2R1k85kK50l20J83k4M8m37J46L13j84j7j72K65j55j0J97m16p8K64P0k55
1990d56J49l1M30k91o7P17m08j50J30l10J34K03J48jl35J67K46k11q6N29l57K43
2012C93j93J10p1K8lR6K96l15pKnj77K14Nj82l8p4J46K60m78L20p2k0o5k00J52
2038A22j3l02K44L04n93L3j1k72K57j09K5J48q4J81k04K18k20k33K98j37J20m8
2060b76K01k65rP3L90k66K27q1k03j25M62k0j42J33k77L5J15K61k2l87o7K54m3
$$ y = [-353, -515, 14, -125, -97, -416, -269, 39, -65, -183, 16, -22, 22, -35, 189, 264, -79, -20, -61, 184, 66, 140, -189, 51, 213, 358, 132, 142, 141, -145, 143, 296, 416, 213, 230, 279, 161, 199, 74, 148, 0, -25, 143, -148, -175, 60, 280, 211, -14, 307, 14, -37, 61, 59, 15, -6, 344, 438, -127, 229, 221, 284, 174, 132, 215, 24, -57, 152, 395, -131, -27, 72, 163, -122, -124, 126, -194, -11, -35, 13, -424, -278, 35, -149, -166, -338, -73, -228, -238, -41, -457, -535, -271, -201, -456, -307, -338, 92, -199, -266, 451, 43, -107, 23, -287, -153, 50, 198, 197, -138, 29, 275, 64, -22, 507, 150, 393, 200, 310, 239, 267, 264, 360, 656, 341, 334, 336, 331, 154, 368, 373, 191, 153, 79, 225, 485, 7, 327, 255, 235, 170, -30, 122, 109, -193, 51, 355, -238, -205, -216, -488, -231, -340, -315, -167, -251, -70, -274, -56, -276, -509, -211, -348, -228, -276, -75, -340, -349, -276, 114, -152, 75, -6, -209, -334, 128, 108, -34, 99, -178, -143, -28, 233, 211, -176, -243, 11, -32]
2083c2K88l88k44M75K00l53K01j06Oj33k5J78j44J09J02k99L49j71j34K21N8p4
2105H4j4P0j65J64P4j58K24j17J4nK53k97M3nK03j65Qj07j25J20J06q3j60J86
2129A48j88K4L91j98K8r4J92k04K57l86j2j00K08j37j84L20j41r0P7k38Q3J11
2151a33nR9K29m35Q5J51q5n0j01o8K11N4p1O1m1Pk51Q0K49r0N5R0Ll0Q1Q6l12
2178a31K50J05r7J2J45m09K76k17K53j23J64k79K83j70mm4j81j01L09J69Q7k96
2200AR7rO9N4k48L36l86l9K94k33K59j16k68N01l00R1qj21L97n00K91l69J53K09
2224A55kj21K0l04L73n6J71l18n7K62Q7j4l73K86%j83j39J49M3j34M3M1o0m1l19
2249d91L78j51K8j4J60O8m3l37K1K05K9J9k02m3K47j21K11j10K59k36j83M17r5
$$ y = [-32, 256, -132, -376, 99, 299, -54, 147, 41, 47, -86, -111, 67, -77, 32, 134, -165, 184, 13, -121, 100, 158, 84, 70, 140, -25, 139, 213, 55, 279, 162, 176, 171, 424, 127, 170, 165, 368, 203, 211, 104, -21, 99, 205, 122, -38, 148, -40, -16, 375, 177, 205, 111, 303, 99, 356, -30, -42, -142, 66, -71, -255, 65, -76, -166, -89, -327, -244, -133, -138, -39, 190, -245, -160, -9, -94, -144, -245, -313, -102, -48, -119, -58, -99, -92, -343, -263, -14, -104, -49, 41, 44, 14, 95, 181, -131, 119, 224, 127, 139, 284, -125, 151, -66, 187, 64, 228, -51, 232, 62, 58, 14, -167, -268, 41, 210, 297, 1, 98, 89, 158, 212, -36, 300, -86, -125, 169, -64, 195, 79, -189, 312, 12, 103, 95, -26, 371, -129, 162, -207, -54, 155, 153, 32, 52, -252, 121, 65, 236, -82, -139, 123, 210, 196, -177, 109, 109, -74, -213, -64, -21, -155, -112, -71, -131, -172, -491, -113, -264, -236, -250, -90, -22, -65, -402, -381, -176, -147, -128, -330, -373, -126, -247, -36, -146, 113, -123, -306, 111, 16]
2272A6%l02M64n3j19lK00k87J53j8J93p8R7m62J81K24j83K86l23L08n12N60j68
2295A74n4m8R2k5k37K82j4o1j61j0Q8J67M6j36j57J6l8K13k11J81qk3l59J8K76
2320A1l15L02n0p7N4K25j91j34j10L41J06m61r1J79K49r6j63r2J92o7K37L9k41
2343a53lrL38j44j27K27l3ro8k27JP6L9K1Q0k10L60j12j12p1l2Q8Q6m1J47l03
2369a91M34l05m3Q1J19P4K07j58k70J83r1P3m9k02K86j3L45l44j14o2J62N6q2
2392I6O9q0J76j99k70K12k2J61P0K5J21n91M21p4j96R3j8R7r2j24l76L46J29k81
2416c07J38n3p7J3J99j57J87k22K11k01Q5q9K32M9m4J10j53o5Q1j38j94K02J36
2439e7r8M3J94l63K31k42J35p8J79J2N3J70k38J31l74N73K33k77j50p6N5L42k71
$$ y = [16, 16, -286, 178, 125, 6, 3, 203, -84, 69, 51, 244, 166, 263, -199, -18, 206, 23, 309, -14, 294, -218, 342, 174, 120, 72, 164, 139, -98, 184, 170, 109, -52, -62, 26, 193, 239, 103, -54, -38, -76, 137, -74, 107, 99, 76, -283, -265, 11, -304, -2, -52, -129, -75, 150, -41, -175, -285, 56, 162, -299, -390, -211, 38, -58, -221, -313, -121, -188, 49, 88, -153, -156, -165, 173, 29, -98, 129, 96, 87, 19, -208, -207, -131, -92, -71, 9, -201, 159, 47, -65, -136, -168, -80, 6, -35, 112, -191, 243, -62, -105, -24, 95, 169, 376, 218, -52, 131, 40, 113, 64, -138, 148, 135, 480, 136, 22, -40, 122, 178, 96, 165, 85, 261, 62, -208, 4, -18, 143, 213, 238, 359, -232, 189, 115, -81, 12, -6, 91, -1, -125, -501, -155, -26, -307, -169, -222, -299, -286, -87, -244, -57, -279, -68, -269, -184, -273, -41, 8, -36, 74, -79, -144, -63, -201, -395, -193, -57, -155, -112, 82, -281, -50, -292, -157, -235, -56, -44, 9, 179, -59, 72, -302, 271, 504, 227, 77, 1, 56, 398, 127]
2462A27j8k41K05J79j95L3R5j70R7n7M5J04j77oj40J30J48j55j43P1o1L89k64
2485dj24K61J32j4k28J72k56n1J85j77K20j14l0O8J16j40M5k53q8L48K2j24k0
2508e4J59k80j7K56Om29J61kK04N8k11K66o44M58j1J84m19M64l79kR6J05J55k89
2532a65q0L49j35J6J23k97r1J07L9K05j58J29l1o2L4P8n9R0o1o4J73m3l9Nk54
2557a91K32oJ89M8n27K85j11K06k90J51K35k60L9J80N0r2N0r6P2L0j27l8J28j5
2581A42j68K88k82n4k5J07M8l66J89k8o3L86l02J36j76j13M88l75R4j28J33j11
2603a80J2m6J29J19j25j78J30k19K56k7j64oJ57n2L28k93j77K72J94q5j20K09
2625A34q5m6J49n9r8J76m13J32J46N0K03k36P5Mj78k6M13j86r8P8k04J02R4j1
$$ y = [127, 109, -132, 73, 252, 57, 90, 185, 15, 112, 55, 100, 204, 27, 21, -119, 11, 159, 4, -139, -68, -129, 260, -4, -128, 133, 265, 251, 23, 195, -61, -112, 73, -104, 116, 2, -28, 40, 156, 16, 61, -192, -280, 68, 90, -34, -54, 105, -175, -192, 64, 70, -359, -198, -200, 4, 62, -149, 117, -527, -69, -80, 104, -315, 149, -230, -232, -136, -31, 124, -165, -245, 104, -31, -15, 108, -189, -280, -173, -134, 71, -87, 42, 11, -51, -17, 61, 2, 92, 31, -33, 140, 97, 58, 63, -191, 41, 35, 224, 272, -255, 30, -81, 125, -165, -14, 221, -39, 0, 180, 230, 138, 188, 92, 164, 194, 67, 29, 157, 142, -26, 262, -20, -74, -99, 8, 56, -310, -121, -149, -212, 174, -128, 8, -168, -281, 207, -168, -74, -202, -69, -180, -168, -214, -85, 34, -91, -269, -139, -358, -102, -129, -293, -299, -142, -194, 134, -159, -336, -64, 130, 45, -75, 134, 49, 3, 152, 93, -5, 171, -242, -110, 36, 86, 289, 53, 128, 132, -46, -72, 341, 155, 57, 135, -69, 33, 127, 116]
2649A16k66L28k27j03K94k69j0K90l78K11J16j46N4jj28K15j6o0q3J20j2k6M7
2672F6o5j78j27L30j17%NK45k28l1L60j56J6m11K19J13j3j83K80J61l28K30n1
2695A37J97l55j47k7J37k36L04j71R2k60L50j85J85L5l2K3k27O4L3p2j3P3m1k31
2719c67L64Q1k55J60j9K11k19L33l34R1L4k09J83mj68K69j80K92m87K04J64k24
2741h0L09j14OR2k6j81J65k63Q6P7J66q7o9K07l08m4o2L6K73l82L76j92J63k92
2765a44Q2J34n6O2j77J64l10K3L08n4p6J65m4q7j73l0K24r7pj11K37l10N19k80
2789c8j92L33l8m61M44J1j98j10K45M2q6J27l3j14J11l09N0K89j80J88k84L22
2811A19j77J21l8k6qK48n6k66m3L5j25K70k00K28K1j27L39n84N55j82j61n8J61
$$ y = [116, -150, 178, -49, -152, 142, -127, -137, 153, -225, -14, 102, -44, 10, 9, -119, 96, 80, 20, -63, 57, 45, 19, 66, 1, -177, -304, 26, -91, -91, -86, 159, -69, -100, 260, 104, 120, -291, -72, 41, 28, -155, 125, 286, -42, 188, 137, 334, -21, -168, -195, -58, -294, 10, -161, -69, -329, 21, -164, 21, 56, 24, 47, -180, -116, -83, -155, -168, -95, -136, -367, -3, 78, -177, -17, -36, 175, -44, 289, -45, 46, 80, -129, 54, 50, -118, 151, -29, 263, -224, -20, 144, -80, 229, 115, 121, 213, 187, 6, 171, -92, -6, 71, 237, 150, 81, 288, -20, -64, -126, -90, 183, -199, 177, -15, 148, -144, -62, 72, 16, 78, -99, 65, -245, -222, 86, 32, -44, 121, 77, -10, -183, -213, 11, -86, -93, -204, 33, -277, 242, -38, -230, 103, 65, -396, 48, 59, -139, -249, -4, 38, -48, 79, 46, -68, 43, -266, -216, 73, -107, 81, -203, 119, -58, 63, 25, -1, -9, 239, 183, -83, -126, -91, -216, 54, -146, 82, 103, -24, 315, -269, 286, 104, -57, -115, 46]
2834D6K71j45k54R0J14k5n3j40J78M7O0O4j96J67k4k99K92M2l35M28k45J7MNl01
2859a92K70m31L40l86L72J23k64k8R7l1q2M16l42J45L8k23K0M0J67r1J10k39j07
2882b78L20m0q0J79j22j11L6l3j14M32n49K04K76N4K1l98JJ11J02O7j3J22k10
2905b3J97k25M91o90K63q4R2j3k8P7M14o42L04l7k34J78L4K28k99L40l83K86j59
2928H7Q8r9L50l47J71l23Q7j01n4J05l7L51k15nj91o8L74o2q7l41O29l19J5J91
2952A99l94M05m97M05k21J93k14J02Qj11Q0l5J06k00J10j58O3o4J02N5j35J00
2974a01J85j23j10l5k2J46RN3q8K20j20j26M2o1R0L02j53k23M11k61JL21l23J
2998C5J3j07m5L10J29l88M1M4o8K85j18k97L17P5k81K7J57Q9n5r3J4R5J9m41K95
$$ y = [46, 317, 172, -82, 8, 122, 97, 44, -96, 82, 129, 189, 253, 57, 224, 200, -99, 193, 235, -100, 328, 83, 100, 104, 109, -192, 78, -353, -13, -399, -27, 96, -168, -196, -99, -130, -212, 204, -138, 7, 45, -178, -158, -118, 49, -42, 68, -171, -278, 42, 2, -78, 101, -21, -132, -96, -129, -243, 189, -360, -156, 120, 174, 195, -203, -202, -91, 11, 78, 65, 187, -23, 174, -51, 440, -250, 13, -71, 21, 8, -20, 57, 471, -171, 133, 96, -138, 40, 74, 302, 3, 343, -40, 246, 87, 175, 76, 426, 79, 250, -73, 14, -87, -141, -36, -73, 278, 63, 58, -133, -201, 173, 111, 24, -317, 312, -7, 8, 199, -195, 210, -287, 118, -103, 90, -124, -22, -14, -125, -45, -80, 26, -174, -64, -222, -159, -223, -121, -66, -201, -101, 84, -39, -149, -184, -206, -60, -51, 2, -86, 134, 14, -112, -70, -131, -41, 261, 108, -115, 296, 35, 36, 357, 34, 35, 48, -59, -104, 206, 335, -53, -12, 32, -36, 249, 131, -166, 151, 226, -55, -28, 129, 218, 163, 70, 84, 179, 198, -243, 52]
3023E2k52J15J60j15K2N4N5j23M3J09k73L9N65m38J99j70Q6j68o1J63l01J92m
3046e1k23K24K3k9j2L11r7k28j5r7R6K08k34K14j84L66l55J79j50J79m7k93P1
3069a44n1M3J55j03j52K90m4p1J50j27R3N6j08K2j80Q9j69M32j83P6k66K65m8
3092B5j97J5J27p7K59o2M3r4K0RJ36j64j93P3J58J62r2j33j39k2L21n5j21K12
3116B11j23m1r4L0J50l26J36J18k13J56r6K67p0j13j02O8O7p0p3P5K22j21j67
3139a09R3J9k04J67k59K63J1J1n0k38L90j96j9K2L18j56k21N7j16j67K50J95j12
3162e1j60P9P3N5L2J62k25p8K22Oj44M4j61J45J29Jq0l8n4P7K20l63Q6K81m87
3187b29K75j72K09J94l38K85j86l26M71k38J34Q6k44P1J67J58k36j71J55KJ42
$$ y = [52, -200, -85, 75, -40, -18, 36, 91, -32, 11, 120, -153, -114, 451, 13, 212, 42, 128, -40, -101, 62, -239, -47, -51, -274, -50, -27, -56, -68, 243, 146, -82, -97, -194, -98, 110, -124, 90, -94, 272, -83, 96, -54, 125, 78, -215, -144, -195, -152, 3, -100, -252, 38, -6, -77, 73, -54, 39, 95, -13, 9, -171, -82, -251, 181, -2, 74, -192, 73, 25, -172, -157, -30, -107, 152, 90, 133, 39, 59, 68, 204, 40, -153, -80, 78, 240, 148, 15, -124, -146, 175, 120, -1, 211, 88, 47, -47, -17, 133, -193, -57, 61, -152, 4, -92, 175, 105, -8, -110, -42, 25, -45, -118, -43, 179, 58, -109, -16, 3, -201, -34, -293, -30, -19, -8, -58, -296, 94, -102, -121, -99, 219, 63, -158, -101, -217, -384, -134, 61, -51, -211, -132, -59, -4, 28, 190, -35, -113, 109, 115, -29, 15, -146, -1, 128, 129, 49, 11, -43, 34, 254, -109, -23, 258, -229, 46, -126, 83, 277, -61, 224, 38, -288, 183, -55, 79, 165, -79, -8, 159, 317, 81, -90, 65, 67, 209]
3208B09k42QP0j67J83O7Mk46k48N43l26K10M1j86K84j38Q2j60J29k38n8J38j48
3231a89K79j59J82j71K84k66l03K00K29k5k03R3j00L23o8o6k7k81K43J19m42J71
3253a77J91j99O1J34l19L14R6m7k16J12K96k82R4j38K58j05Mj4K0j03J07j52J52
3276H7k3l08L27MJ67j20q2K82l40J53q7N8k01P4J6J54j20j2Om2R5j01K1n1J5O2
3302C4J50j61OK91n68K13K03p6j83J17r3R4M7j09J1o2j80M39k7j77l8J10l4L7
3326D4k70J90M0OK04k68o9J84j82L4K2j62L45j64L5m3P5q6J31k49L18k06J70k55
3350a56N9L56k00l1J15m2l5n35K78J91J1P3J26k12R9j59J93J23j40O9j69k40K84
3373E8Q2l38K84K34l82j3M12n35K63j57j35L20N9j16J61l06J32R7J19k58J00j99
$$ y = [209, -33, -25, 45, -122, 61, 128, 132, -114, -362, 181, -145, 65, 106, -80, 204, 66, 148, -12, 117, -121, -179, -41, -189, 90, -69, 113, -58, 226, -40, -343, -143, 86, 61, -142, -49, -149, 174, 106, 40, 13, -268, -25, 94, -348, -177, 14, -185, -124, 10, -309, 5, 101, 54, -162, -50, 246, -36, 58, -80, 178, 73, 77, 63, 83, -20, 87, -65, 87, 64, -244, 83, 87, 254, 134, 52, 334, -6, 147, 60, 118, -83, -9, 7, 161, 41, 29, 35, -7, 88, -13, 8, -43, -28, 34, 184, 23, 29, 320, -248, -35, 168, 92, -91, 26, -67, 27, 74, -35, -24, -86, -266, 173, 146, -31, -69, 41, 7, 44, -226, -36, 4, 10, 214, -54, -123, 61, -121, -87, -65, -227, 118, -46, -11, -54, 21, -65, 66, -183, 135, -71, 99, -156, -97, 259, 59, 28, 143, 101, 66, -469, -191, 0, 11, 84, 210, -2, 97, -62, 131, 254, 114, 183, 14, -226, 58, 140, -198, 86, 320, -62, -75, 337, -198, 65, -92, -227, 93, 152, 36, 197, -109, 23, 120, 239, -19, 81, -118]
3395a18K15Q1j20K06k57R6j32Pm9n0J88R2k31l5pk80O11k81j49K32Q5k39P5j77
3419b37K62No9J77l29M25K4k90J83J3l38M13k22j27J75j61L51j35j6Pl06K26m6
3442a5Nj30L6K71k58J96l0k89J26P7l5J95Q1l77J1L91m0k25M1l1Q8K48n20M5J03
3467c6J02J5J69l76J32p4j5R6P1k79J51OQ6L02k59j16J7qQj5j74L15oj47R3k4
3493C4J00l16o1K85l46K33J66P0j17j22j03R8j45N5M4J35l24K36J11R8j85j2O
3516f0j2l3j54J66O2P9J15j83m2p4O3J38r9Q4J55j98Lo5j52L06k5Q9q3J36%j26
3542I0m79K70J67j4J28K04j08k16J6k0J99k95J01O3k4j33J36j74R4Q0J13q3J08
3565B23j28M7k13J36Ok03J93j10K8J49j80J41m57K06K67q8K1J6j30j9K83j57K4
$$ y = [-118, 97, 178, 58, 264, 7, 103, -29, -22, -71, -121, 67, 159, -72, -107, -114, -394, 217, -64, -213, 19, 104, -135, -60, -237, 25, 30, -39, 138, -191, 234, 258, -32, 151, 164, -174, 239, 17, -110, 65, -96, 255, 120, 104, 111, -195, 31, -15, -10, -140, -104, 167, -91, 105, 75, -214, -88, -11, -46, 149, 230, -147, -136, 255, 215, -10, 31, 0, 88, 336, -184, -139, -36, 66, 81, 250, -126, 6, -68, -83, 13, 84, -195, -44, -38, 48, 350, 91, -25, -8, -16, -8, -23, -197, 118, 112, -35, 58, 34, 134, -182, -243, 42, -304, -71, 95, 165, 48, -74, -177, -79, -224, -169, -125, 10, -314, -78, 33, 131, -54, -66, -60, -72, -105, -259, -93, -31, 48, 163, -20, -62, -136, -73, 65, -34, 50, 205, 7, 10, -55, -207, 99, 74, 163, 80, 216, 216, 90, -389, -119, 48, 34, 162, 366, 258, 42, 58, 38, 237, -58, 43, 106, 82, -51, 85, -89, 5, 85, 198, 115, 223, 95, 142, -71, 65, 71, -132, 61, -49, -21, 128, -52, 89, -368, -162, 105, 17, 38, 54, -76, -95, 188, 31, 55]
3588E5j06J45K6l13L01k63L82k82J25k05j23L1L50l55K29Rj24K16j44O4m1J10
3610H7k73M6K25q7o5j37j27M69k04j31L25k04l3J53q1J41o3Q9q9l32L17k80K10
3633d4Q7J56k17K18j79j16J77p3P2J8q7OJ29k5nj22J60K68n42J16k4J87j06o2
3657hj61R5oJ93J8k96j15J19Q5j6O3K37J24l50m1K25j32j7j22j38L30j07R1n4
3681A7j77J98J46k70N9k4J99j96K69m19K03R5J2o3l8j04L62m44J87m7o7R0j85
3704a97Q6K04k38J41R0r9R2K28n05M2J88j28K05j40K60l25r3m7J15M21k35QL8
3727A11j48O8p1J6K39l63Q1J13l16J53r6J92R1J87l81K14n4NJ25K13k71k29J41
3750B0O6m2o9l9N4N0j33r9L51p3o7n2K4mL2m6n6k86L04J88qm1Qqj17nP5n0KK9
$$ y = [55, -51, 94, 120, -193, 108, -155, 227, -55, 70, -135, -258, -227, 123, -232, -3, 6, -118, 98, -46, 18, -23, 87, -186, -140, 85, -2, -67, -204, -331, 138, -66, -197, 128, -76, -109, 44, -37, 104, 41, 130, 41, -291, 26, -254, -44, 43, 199, -18, 200, 21, -95, 82, 9, 81, 99, 12, 18, 147, 122, 117, -5, 155, 423, -119, -3, -27, 160, 54, -8, -169, -74, -80, 113, 131, -165, -280, -161, -76, -92, -29, 208, 332, -18, -59, 166, 34, 17, -105, -243, 87, -20, 71, 17, -160, 38, 184, -86, -27, -51, 148, -48, 221, -198, 5, 100, 112, 49, 11, -93, 269, -175, 12, -35, -102, -12, -197, -111, 93, -145, -4, 86, -13, 79, 307, -198, -156, 32, -96, 109, -31, 229, -96, -189, -236, -121, 300, 65, 73, 111, -37, 31, -40, -24, 215, -148, -67, 46, -270, -117, -213, -21, 70, 257, -124, 90, 36, 41, 166, 379, 108, -121, 20, 86, 44, -25, -64, -10, 40, -93, -192, 159, 86, 19, -33, -9, -13, 19, -27, -83, -369, -65, 123, 115, 74, 82, 74, -43, -48, 27, -23, -21, 8]
3780HJ35k71K9M5j65L20j64KK38k85k3K9L04m24l6K2K53K5o8N2KK59m98K82l7
3805C4k34K48O3R1k66N5j10K18j69R9j20j10J70J42k00k46L68r7K44J03k76J9
3827B6l02M98n2j43j46K6L17k08k0K89l05m2J74o9k81LJ02J17k00M54k93L7l72
3850c90L56N1K51l71J60L2k1M5n4l75M53k12n06O09%N0k20J38l91L33N7j41L02
3873A56k76K59k35l08M45J5P4l24N1K73j32K27l31L7P7q1J69j95oK1K38l2k55
3896a33K49k24J89l17J93M5o3j7J2M79n12P5k9j37M13l60J73j73J99J05k23k91
3918c47M23j27M7l1Q9n3J08j64j17K96l01Q9r3J25jQ4j2j47j9L0M8K73J0m1m14
3943b45J15K28p8l9j27j4J96l24k1L47m5P0k30K12k70J37P6K21k90K78K5k26R
$$ y = [8, 143, -128, -99, -54, -219, 101, -63, -61, 177, -108, -131, -102, 202, -222, -258, -236, 17, 42, -26, 26, 28, 287, -211, 71, 34, -200, 48, 111, 202, -64, -9, -119, 99, -70, 29, -91, -201, -31, 111, -89, -335, 33, -64, 180, 283, 7, 26, -276, 222, 170, 27, -119, -93, 224, 16, -4, 285, -20, -62, 112, 43, -238, -235, -133, -16, -216, 238, -55, -18, -390, -34, 17, 268, -103, 57, 89, 68, 113, 59, -316, 137, -75, -581, 28, 28, 78, -142, -4, -395, -62, -5, -146, 156, -120, 139, -96, -404, 41, 56, 130, -194, -143, 130, -2, 225, -106, -69, 8, -73, 96, -99, -105, -84, 154, 122, -133, 116, -108, 81, -236, -43, 2, -61, -78, -66, 413, -99, -24, -53, -190, 223, -137, 36, -137, 62, 167, -56, -347, 76, -51, -4, -35, 54, 1, 109, -55, -172, 124, -177, -88, -181, -56, -57, 27, 15, -132, -151, -121, -73, 200, 210, 169, -245, -130, 98, 20, -19, -146, -160, 36, -288, -309, 38, -7, 63, -167, 45, -225, -88, -12, 209, -81, 197, 222, -4, 5]
3966EL19n95L21j8j50K00j87l3P9J02j10j8J9K58j80L13p18M90J25j38p5m5n2
3989h8R7Q1j61L43l83M19l95M6O8K47k33j64J50n5Q1Q9k1k70J97j3j18R3J41K9
4013A80l55L03j02J09oj22J62m21J60J40q7KK08l29N5j34L99j73Q0K8k30L4J07
4036HJ48j99J29j69K86j65l58L13j14J04Lk8j0k5j39L17r4K7l9J86j85l23N11
4059A84j5m51J45K32j01k67L31k44L48k94O4L7M6j87N4L80jl56L6j40J40L08l59
4082a10j44L54J52K3k63m4J65m6k6r2P4RK95k85J12p2J41k36r3J10j20J20k83
$$ y = [5, 324, -271, 50, 32, -118, 82, -105, -138, -59, 43, -67, -85, -66, 192, 12, 325, -393, 97, 222, 84, 9, -36, -88, 9, 90, -71, 272, -111, 308, -87, -41, 27, 274, 41, -123, 27, -28, 53, 142, 121, -149, 48, 35, -83, 10, 151, 180, -175, 128, 26, 135, 129, 7, 169, -252, -92, 48, -39, -37, 171, -158, -103, -237, 162, -11, 69, 97, -133, -99, 8, 156, -43, 86, -83, 203, 38, -320, -7, -121, -17, -14, -42, -52, -77, -216, 101, 7, 34, -5, 181, -4, -327, 184, 169, -282, -137, 95, -6, -273, 58, -186, 162, -132, -68, -31, 15, -172, -118, 262, 261, -95, -59, -199, -59, 249, -110, -254, 100, 252, 275, 12, -32, 133, 87, 61, -31, 43, 52, 347, 62, 174, 102, 243, 7, -86, 24, -96, 24, -259]
$$ [...]
8191A31
##END NTUPLES=NMR FID
##END=
