##TITLE=1H_Pr Q-22
 CDCl3
 8 sc, 
 22.12.2022
##JCAMPDX= 6.0         $$ Bruker NMR JCAMP-DX V2.0
##DATA TYPE= NMR FID
##DATA CLASS= NTUPLES
##ORIGIN= UXNMR, Bruker Analytische Messtechnik GmbH
##OWNER= root
$$ XWIN-NMR		Version 3.5
$$ Thu Dec 22 14:37:19 2022 Russian Standard Time (UT+4h)  she@DPX200
##.OBSERVE FREQUENCY= 200.13135
##.OBSERVE NUCLEUS= ^1H
##.DELAY= (6, 6)
##.ACQUISITION MODE= SIMULTANEOUS
##.ACQUISITION SCHEME= undefined
##.AVERAGES= 8
##.DIGITISER RES= 18
##SPECTROMETER/DATA SYSTEM= spect
##.PULSE SEQUENCE= zg30
##.SOLVENT NAME= CDCl3
##.SHIFT REFERENCE= (INTERNAL, CDCl3, 0, 15.7039)
##AUDIT TRAIL= $$ (NUMBER, WHEN, WHO, WHERE, WHAT)
$$ ##TITLE= Audit trail, XWIN-NMR		Version 3.5
$$ ##JCAMPDX= 5.01
$$ ##ORIGIN= Bruker BioSpin GmbH
$$ ##OWNER= she
$$ F:/spectra/data/she/nmr/H-F/1/audita.txt
$$ ##AUDIT TRAIL=  $$ (NUMBER, WHEN, WHO, WHERE, WHAT)
(   1,<2022-12-22 14:36:17.48 +0400>,<she>,<DPX200>,
      <created by zg, POWCHK disabled, PULCHK disabled
       configuration hash MD5:
       00 E9 B6 7A A2 85 ED C7 34 08 36 98 17 FE 4E 26
       data hash MD5: 16K
       5E C3 06 7A D6 B0 56 B5 59 04 4C 91 3C D1 CC 02>)
$$ ##END=
$$ 
$$ hash MD5
$$ 18 FF 0E 1C 88 A8 E0 5B 5E 0A B2 E6 28 28 E3 63
##$RELAX= 
##$RELAX= 
##$RELAX= 
##$RELAX= 
##$RELAX= 
##$RELAX= 
$$ Bruker specific parameters
$$ --------------------------
##$DU= <F:/spectra>
##$EXPNO= 1
##$NAME= <H-F>
##$PROCNO= 1
##$TYPE= <nmr>
##$USER= <she>
##$AMP= (0..31)
100 100 100 100 100 100 100 100 100 100 100 100 100 100 100 100 100 100 
100 100 100 100 100 100 100 100 100 100 100 100 100 100 
##$AQSEQ= 0
##$AQ_mod= 1
##$AUNM= <au_zg>
##$AUTOPOS= <>
##$BF1= 200.13
##$BF2= 200.13
##$BF3= 200.13
##$BF4= 200.13
##$BF5= 200.13
##$BF6= 200.13
##$BF7= 200.13
##$BF8= 200.13
##$BYTORDA= 1
##$CFDGTYP= 0
##$CFRGTYP= 5
##$CHEMSTR= <none>
##$CNST= (0..31)
1 1 145 1 1 1 1 1 1 1 1 1 1 1 1 1 1 1 1 1 1 1 1 1 1 1 1 1 1 1 1 1 
##$CPDPRG= <>
##$CPDPRG1= <>
##$CPDPRG2= <>
##$CPDPRG3= <>
##$CPDPRG4= <mlev>
##$CPDPRG5= <mlev>
##$CPDPRG6= <mlev>
##$CPDPRG7= <mlev>
##$CPDPRG8= <mlev>
##$CPDPRGB= <>
##$CPDPRGT= <>
##$D= (0..31)
0 1.2 0 0 0 0 0 0 0 0.06 0 0.03 0 0 0 0 0.0002 0 0 0 0 0 0 0 0 0 0 0 0 
0 0 0 
##$DATE= 1671705376
##$DBL= (0..7)
120 120 120 120 120 120 120 120 
##$DBP= (0..7)
150 150 150 150 150 150 150 150 
##$DBP07= 0
##$DBPNAM0= <>
##$DBPNAM1= <>
##$DBPNAM2= <>
##$DBPNAM3= <>
##$DBPNAM4= <>
##$DBPNAM5= <>
##$DBPNAM6= <>
##$DBPNAM7= <>
##$DBPOAL= (0..7)
0.5 0.5 0.5 0.5 0.5 0.5 0.5 0.5 
##$DBPOFFS= (0..7)
0 0 0 0 0 0 0 0 
##$DE= 6
##$DECBNUC= <off>
##$DECIM= 32
##$DECNUC= <off>
##$DECSTAT= 4
##$DIGMOD= 1
##$DIGTYP= 9
##$DL= (0..7)
0 120 120 120 120 120 120 120 
##$DP= (0..7)
150 150 150 150 150 150 150 150 
##$DP07= 0
##$DPNAME0= <>
##$DPNAME1= <>
##$DPNAME2= <>
##$DPNAME3= <>
##$DPNAME4= <>
##$DPNAME5= <>
##$DPNAME6= <>
##$DPNAME7= <>
##$DPOAL= (0..7)
0.5 0.5 0.5 0.5 0.5 0.5 0.5 0.5 
##$DPOFFS= (0..7)
0 0 0 0 0 0 0 0 
##$DQDMODE= 0
##$DR= 18
##$DS= 0
##$DSLIST= <SSSSSSSSSSSSSSS>
$$ [...]
##$SUBNAM2= <"">
##$SUBNAM3= <"">
##$SUBNAM4= <"">
##$SUBNAM5= <"">
##$SUBNAM6= <"">
##$SUBNAM7= <"">
##$SUBNAM8= <"">
##$SUBNAM9= <"">
##$SW= 18.05172834244
##$SWIBOX= (0..15)
0 0 2 0 0 0 0 0 0 0 0 0 0 0 0 0 
##$SW_h= 3612.71676300578
##$TD= 16384
##$TD0= 1
##$TE= 0
##$TE2= 300
##$TE3= 300
##$TEG= 300
##$TL= (0..7)
0 120 120 120 120 120 120 120 
##$TP= (0..7)
150 150 150 150 150 150 150 150 
##$TP07= 0
##$TPNAME0= <>
##$TPNAME1= <>
##$TPNAME2= <>
##$TPNAME3= <>
##$TPNAME4= <>
##$TPNAME5= <>
##$TPNAME6= <>
##$TPNAME7= <>
##$TPOAL= (0..7)
0.5 0.5 0.5 0.5 0.5 0.5 0.5 0.5 
##$TPOFFS= (0..7)
0 0 0 0 0 0 0 0 
##$TUNHIN= 0
##$TUNHOUT= 0
##$TUNXOUT= 0
##$USERA1= <user>
##$USERA2= <user>
##$USERA3= <user>
##$USERA4= <user>
##$USERA5= <user>
##$V9= 5
##$VALIST= <valist>
##$VCLIST= <CCCCCCCCCCCCCCC>
##$VD= 0
##$VDLIST= <DDDDDDDDDDDDDDD>
##$VPLIST= <PPPPPPPPPPPPPPP>
##$VTLIST= <TTTTTTTTTTTTTTT>
##$WBST= 1024
##$WBSW= 4
##$XGAIN= (0..3)
0 0 0 0 
##$XL= 0
##$YL= 0
##$YMAX_a= 269433
##$YMIN_a= -362908
##$ZGOPTNS= <>
##$ZL1= 120
##$ZL2= 120
##$ZL3= 120
##$ZL4= 120
##$ABSF1= 10
##$ABSF2= 0
##$ABSG= 5
##$ABSL= 3
##$ALPHA= 0
##$AQORDER= 0
##$ASSFAC= 0
##$ASSFACI= 0
##$ASSFACX= 0
##$ASSWID= 0
##$AUNMP= <proc_1d>
##$AZFE= 0.1
##$AZFW= 0.1
##$BCFW= 1
##$BC_mod= 2
##$BYTORDP= 1
##$COROFFS= 0
##$CY= 11.3945322036743
##$DATMOD= 1
##$DC= 2
##$DFILT= <>
##$DTYPP= 0
##$F1P= 2.36226072786647
##$F2P= -0.459571619588291
##$FCOR= 0.5
##$FTSIZE= 0
##$FT_mod= 4
##$GAMMA= 1
##$GB= 0.15
##$INTBC= 1
##$INTSCL= 1
##$ISEN= 128
##$LB= 0.24
##$LEV0= 0
##$LPBIN= 0
##$MAXI= 10000
##$MC2= 0
##$MEAN= 0
##$ME_mod= 0
##$MI= 1.114404
##$NCOEF= 0
##$NC_proc= 0
##$NLEV= 6
##$NOISF1= 3.799351
##$NOISF2= 2.8
##$NSP= 1
##$NTH_PI= 0
##$NZP= 0
##$OFFSET= 15.70392
##$PC= 1
##$PHC0= -19099.39
##$PHC1= 6.200732
##$PH_mod= 1
##$PKNL= yes
##$PPARMOD= 0
##$PSCAL= 0
##$PSIGN= 0
##$REVERSE= no
##$SF= 200.130013532006
##$SI= 16384
##$SIGF1= 3
##$SIGF2= 2
##$SINO= 400
##$SIOLD= 16384
##$SREGLST= <1H.CDCl3>
##$SSB= 0
##$STSI= 0
##$STSR= 0
##$SW_p= 3612.71676300578
##$SYMM= 0
##$S_DEV= 0
##$TDeff= 0
##$TDoff= 0
##$TI= <>
##$TILT= no
##$TM1= 0
##$TM2= 0
##$TOPLEV= 0
##$USERP1= <user>
##$USERP2= <user>
##$USERP3= <user>
##$USERP4= <user>
##$USERP5= <user>
##$WDW= 1
##$XDIM= 8192
##$YMAX_p= 0
##$YMIN_p= 0
$$ End of Bruker specific parameters
$$ ---------------------------------
##NTUPLES= NMR FID
##VAR_NAME=  TIME,          FID/REAL,        FID/IMAG
##SYMBOL=    X,             R,               I
##VAR_TYPE=  INDEPENDENT,   DEPENDENT,       DEPENDENT
##VAR_FORM=  AFFN,          ASDF,            ASDF
##VAR_DIM=   8192,          8192,            8192
##UNITS=     SECONDS,       ARBITRARY UNITS, ARBITRARY UNITS
##FACTOR=    0.0002768,     1,               1
##FIRST=     0,             0,               0
##LAST=      2.2672688,     0,               0
##MIN=       0,             -362908,         0
##MAX=       2.2672688,     269433,          0
$$ Real data points
##PAGE= N=1
##DATA TABLE= (X++(R..R)), XYDATA
$$ [...]
1608a61k96M75M59n50Q68K03m44J146m19m57N87p55k11l7q20L54o05n05P61n93
1628a000L7P25n84O00K56m50Q79o96LN00o89L48J59p08R53m7k23O51n24N66L18
1649A074p76N36j55p95L10k87l20L91o75L91R1m41R98n08l68J178q55j12O96p91
1669d18PLk18N85p05L03O03o73P48P02r97Q29K83q05N60l02Jk62l53N30m79n78
1691f36J054q84k20J089p29j15M26m80l8j32J14L73j026O84O11j021R32M96o96
1710a98P81L54k43L73j87K34k41n99P29q63n62J203j004m05M82n44K76J0k52M49
1730b07o10K18L25p26O35J87p96R78J96n29R52k40M53J49n76P53k71n79P96r36
1750A72j65L72q21K87J68p71O95m78j60N58n59J40L32m64N01k02k07Q11n15J27
$$ plain form
1608 -161 -457 18 477 -73 795 998 554 1700 1281 824 1411 656 445 408 -412 -58 -663 -1168 -407 -1000
1628 -1000 -963 -238 -822 -222 34 -416 463 -233 -230 270 -419 -71 88 -620 333 286 63 714 190 756 1074
1649 1074 298 834 679 -116 194 -93 -413 -22 -697 -306 -215 -656 342 -166 -534 644 -211 -323 373 -418
1669 -418 -411 -408 -626 -41 -746 -443 160 -513 235 937 -60 769 1052 247 807 505 506 244 -109 421 -58 -636
1691 -636 418 -466 -686 403 -326 -441 -15 -495 -533 -665 -551 -178 -1204 -520 91 -930 2 498 -198
1710 -198 583 937 694 1067 880 1114 873 274 1003 140 -422 781 -223 -628 -146 -690 -414 -404 -656 -207
1730 -207 -817 -599 -274 -1000 -365 -178 -974 4 200 -329 623 383 836 985 409 1162 891 312 1108 172
1750 172 7 379 -442 -155 13 -758 -63 -541 -701 -143 -702 -562 -230 -694 -193 -395 -602 209 -306 -179
1770a79O76n74K46M12l71O57l22j33M14p48L26K38r49Q29k77p95P39m52k66N00
1790b9n22K16o0l01P64o83l3Q86q72K48O52n37j0O11k76J67J8K89K83o35P64k59
1812F81o61R63m65o86Q18l48m27O7l63K99m71n3P09p88n2O46n97L72L01o20O67
1833hj91J17M52m67M49J26n42R52j70p07Q97l70m2J73o12K09j64m38O02p20k08
1854f62N91q29J35O33o29M84j04k33P38n96L41L26l32M54R2n58O06j10k27N54
1874F74n18L60J32o84O44q2o57M19k57l23K09m59L15j21l17N75n17K0O38m32J81
1895b00L26l35K80j53j66O11o25K81M17n03L04L69m88L71J30k72J74m70M20K4
1915D95p51M41m43k86O85n03k33M98n10L03Rk72O29m17N4N56p11M68L75o38N10
$$ plain form
1770 -179 497 -77 169 581 210 867 545 412 826 78 404 642 -307 522 245 -550 189 -263 -529 -29
1790 -29 -551 -335 -395 -696 68 -615 -648 238 -634 -386 266 -271 -281 330 54 221 239 528 811 176 940 681
1812 681 20 983 518 -168 650 302 -125 -58 -421 -122 -593 -646 63 -725 -777 -131 -728 -356 -55 -675 -8
1833 -8 -199 -82 370 -97 352 478 -64 888 718 11 908 538 496 669 57 266 102 -336 266 -454 -662
1854 -662 -71 -900 -765 -132 -761 -277 -381 -614 124 -472 -131 195 -137 317 409 -149 457 347 120 674
1874 674 156 516 648 -36 608 526 -131 288 31 -292 -83 -542 -227 -348 -665 -90 -607 -587 51 -381 -200
1895 -200 126 -209 71 -82 -248 363 -262 19 436 -67 237 606 118 489 619 347 521 51 471 495
1915 495 -256 185 -258 -544 141 -362 -595 -97 -607 -304 -295 -567 62 -355 -301 255 -456 12 387 -251 259
1936B59J81k47K74q4L75l6m79M06l79m26O31l35l95L37o95k0L02l27N2p8J08O81
1958A05p00K96M13o41N08K36m31M80l86J90M54l59N11j93k70N44k11k60M66n52
1978B00k37J29m94O9j41l67O12n90J0O14m50L70K97l44L09r3J21M46m64J20N14
1999F31p12N24j1k72O58m70R4K44n50L45l02m19M47l42n80N34k88J56j8l03L79
2020b55j3j32P38n03l0N17m09P1J99l53M00o2q3N19p05M77N1o58R71m2p72N76
2042E02l25j85K78o70K78j18l22N63n60j98Q16o07J85N56n04L09%j23J99j91J06
2063a1K62m97Q46q1n32N20j1l08N34k87l11J65m31L13l66r6M25o08r2M47m49K39
2085c29K19m54M11J4k14K54j93L42K74l82L65m3j63M87j88j77L92m30K91j86j91
$$ plain form
1936 259 440 193 467 383 758 722 243 649 270 -156 475 140 -255 82 -613 -633 -331 -658 -606 -684 -576 105
1958 105 -595 -299 114 -527 -19 217 -214 266 -120 70 524 165 676 483 213 757 546 286 752 200
1978 200 -37 92 -402 -333 -474 -841 -229 -819 -809 -195 -645 -275 22 -322 -13 -106 15 461 -3 117 631
1999 631 -81 443 432 160 818 348 442 686 136 481 179 -240 207 -135 -715 -181 -469 -313 -331 -634 -255
2020 -255 -268 -400 338 -165 -195 322 -87 -16 183 -170 230 168 85 604 -101 376 427 -231 740 698 -74 502
2042 502 177 -8 270 -400 -122 -240 -562 1 -559 -757 59 -548 -363 193 -311 -2 -2 -125 74 -117 -11
2063 -11 251 -246 600 519 -13 507 496 188 722 435 124 289 -142 171 -195 -291 134 -474 -566 -119 -568 -329
2085 -329 -110 -564 -153 -139 -353 -99 -292 50 324 -58 307 264 101 588 400 223 615 185 476 290 99
2106I9Q8k84j31L27m64K10J7n13L76Kl71O00l62kL89l92L61J93l15L82r0m1N86
2129F65n15O4K55l96M51k16j86K27j71j13K13n98N23k36m93N73j76m17M68k96
2149c74m2L50m94L00n4j18O38l40J05N76n15M02j2l81L82J1k65M17k91J50l08
2170A37j54N00l07k14J64l05k01L05m49J13p6k94M22j10j06M72k12J63K69j49
2190c2L46L9n0L35k61L5K79o98N29k26k80L94m74K9L42m65J35R1l95L3j83j01
2212e78M29m43J3L11k24L01K06l53O55r7j3L79k31K81O8n06J92q4k82J21l75J76
2234e4L21m10K48j10k34J67j82j93L94n50L89p7l83N57j41j3L51L6J72J49l09
2255A28K72O3k32J23l00j81M69p22L51pj64K26L5j8L54l37MJ33k82K37m05j02
$$ plain form
2106 99 187 -97 -228 99 -365 -155 -138 -651 -275 -273 -644 -44 -406 -408 -19 -411 -50 143 -172 210 120 79 665
2129 665 150 214 469 73 524 308 122 349 178 65 278 -320 203 -33 -526 47 -129 -546 -78 -374
2149 -374 -416 -66 -560 -260 -314 -432 206 -134 -29 547 32 434 422 41 423 434 169 586 295 445 137
2170 137 -17 483 176 -38 126 -179 -380 -75 -524 -411 -487 -781 -359 -469 -575 -103 -315 -152 117 -32
2190 -32 314 353 303 638 377 412 691 -7 522 296 16 410 -64 -35 307 -158 -23 68 -327 -294 -477 -578
2212 -578 -149 -592 -579 -268 -492 -191 15 -338 317 220 207 586 355 636 704 198 390 306 24 145 -230 -54
2234 -54 267 -143 105 -5 -239 -72 -254 -447 -53 -603 -214 -291 -674 -117 -258 -271 80 116 288 437 128
2255 128 400 463 231 354 54 -127 342 -380 -29 -36 -200 26 61 43 397 60 64 197 -85 152 -253 -355
2277c55J97j13m9K25l11L39O0m9L05j78o6M91n12J04K9n74N14p1k5L31j41m0K88
2300C99k16K83J28m54L43m97k56K74n60m2K60l84J41p9kN54j32J49M61m16K57
2321B11J47j68J98k05K8J92l20J23L00l15J42M5j69K49k53j30q5p53P4J65l80
2342i04J34M1j38N29j37L91J89J68L06Jk51M13l81j93L15m36L39m4k81L08j19
2363B50k41L13k32n5lm50R3r3j82R4j78p4M24k38M67NJ12N58r3j19L97m59L27
2386F23J44p61M9J4k95K32k73K23j12q7K97J21l62K25k15lJ48l56K21r8l7K31
2408g1j18j12L79M6J19K84j03R7K1o81K11j30l9Rj39J7R1j30M10R2k58M92m05
2431H2N2J01l37L4j3l46L75l10k26N10k28KK54k15N29j80n3J86k71M3J94l49n2
$$ plain form
2277 -355 -158 -271 -320 -95 -406 -67 -7 -56 249 71 5 496 -16 88 117 -457 57 -14 -39 292 151 111 399
2300 399 183 466 594 140 483 -14 -270 4 -556 -598 -338 -722 -581 -660 -662 -108 -240 -91 370 -46 211
2321 211 358 190 388 183 211 403 83 206 506 191 333 378 209 458 205 75 -10 -763 -689 -524 -904
2342 -904 -770 -729 -867 -338 -475 -84 105 273 579 580 329 742 361 168 483 47 386 342 61 369 250
2363 250 9 322 90 35 32 -418 -325 -418 -600 -506 -684 -758 -334 -572 -105 -100 12 570 477 358 755 296 623
2386 623 767 6 55 69 -226 6 -267 -44 -156 -243 54 175 -187 38 -177 -180 -32 -388 -167 -265 -302 -71
2408 -71 -189 -301 78 124 243 527 424 521 542 -139 72 -58 -97 -88 -227 -210 -119 -249 161 253 -5 487 82
2431 82 134 235 -102 -68 -81 -427 -52 -362 -588 -78 -306 -304 -50 -265 264 84 31 217 -54 -11 183 -166 -218
2454b18J44J9L25M0k24M59m17L51O4k49Kk95r4j1k71k2l5k46K08%Q8K96m5J9M13
2479C01l73K09J87k16J88n5j28M06m06M9J60j24Q4J40l76L62l54j93K00l78j91
2500e08J74j86j2P4j46L97p2J98K49k29K33%l5L15k03n9L08l36o2J11j10j4O9
2523A56p6o0j7L3n0l00Q8q9k00K62j08K17n8j47K14J78k21L03l1j54K96j72K3
2546H7J98k26J70J5k94K90j7L7k2k52R3N4l72K53j4k35K42k00J2R4k72L06j34
2569a87j65M56j4j58K32k46K31K73l69J84p6r6J00k4l0J63j47R1o0j17Q5j24j04
2592a02J50m45L15R7n07K88j20l9K48p6J82R0l63L19M6l54O71l60K1J57j45J65
2614B38J89l17K67j57j36R4l38L53n5j32r7R0j59O4q2P9O6l62K06J97l37K39O1
$$ plain form
2454 -218 -74 -55 270 310 86 545 128 479 543 294 296 1 -93 -104 -375 -397 -432 -678 -470 -470 -382 -86 -131 -112 301
2479 301 -72 137 324 108 296 241 113 519 113 162 322 198 282 422 46 408 54 -139 61 -317 -508
2500 -508 -334 -520 -532 -458 -604 -207 -279 -81 168 -61 172 172 137 452 249 190 498 162 100 211 101 87 156
2523 156 80 20 3 36 -14 -314 -226 -315 -515 -253 -361 -144 -202 -349 -135 43 -178 125 94 -60 236 64 87
2546 87 285 59 229 244 -50 240 223 260 238 -14 79 133 -239 14 0 -235 7 -193 -181 -87 -359 -53 -187
2569 -187 -352 104 90 -68 164 -82 149 422 53 237 161 65 165 141 111 274 127 218 158 41 126 2 -102
2592 -102 48 -397 -82 15 -492 -204 -324 -363 -115 -191 -9 81 -282 37 83 -271 400 40 61 218 73 238
2614 238 427 110 377 220 84 178 -160 193 138 6 -91 -1 -160 -96 -178 -99 -33 -395 -189 8 -329 -90 -29
2637b9L9J53k34J45Q6m9Q4M2J2Oj48J0J12k13R8j58L7Q7j05r9J70k09m0K65k55
2662a93K45l4l15K95r8l06L95l58K23K58k89L81Mq1J14j65K14j30r0J37m3j78
2684a4J88k92O7K49l19K23q4k5M5j39j14K28k40k6J90k25k1K3J29J45r6oJ68O2
2708A16K05L0l40N42m35m2K73l43K4K19k24R2j31j53J96k68J12J6k03K42j52j27
2730c51K95k71J03P2mJ38J44q1K28N3R2N6j77J13p5k18O3k7l01K70j75j37K61
2753G1j41q0N5O4m7r1q5J84l47L38j15m4K02p5m0J30J17p7L15k98K64n7k98L27
2777B72j70j22K41k47M1L7k11R6J3k51L30J24l17L17l36J41j30J9K02k76P4N0
2799a03j19Q9K02J8L0K0p7M6N1j1j39K47j80k7l00K17J18j67L12k38p4J74l33
$$ plain form
2637 -29 10 163 -71 74 160 111 195 237 249 255 107 117 229 16 114 -44 -7 80 -25 -124 46 -163 -203 62 -193
2662 -193 52 18 -297 -2 -100 -406 -11 -369 -146 112 -177 204 208 127 241 76 290 160 70 207 164 -14
2684 -14 174 -118 -51 198 -121 102 18 -7 38 -101 -215 13 -227 -253 -63 -288 -309 -286 -157 -12 -108 -114 54 116
2708 116 321 351 11 553 118 76 349 6 30 249 25 117 -14 -167 29 -239 -127 -111 -314 -72 -224 -351
2730 -351 -56 -327 -224 -152 -156 -18 126 45 273 326 418 474 297 410 335 117 180 153 -148 122 -53 -190 71
2753 71 -70 -150 -95 -31 -78 -169 -254 -70 -417 -79 -194 -238 -36 -111 -151 -21 96 19 334 36 300 243 -55 272
2777 272 102 -20 221 -26 15 52 -159 -63 -50 -301 29 153 -164 153 -183 -42 -172 -153 49 -227 -153 -103
2799 -103 -222 -133 69 87 117 137 60 106 157 146 7 254 74 47 -253 -36 82 -85 227 -11 -85 89 -244
2822b44L0L08m54L90l30N6J7O2J53n5M1J91o5j32L17j29J6J41k14K23j15qP4j61
2846A12p8Rp9P4k8j48L0R1l03K21n3P0O8l06K57L9j79J61J64l08L21r9J72J55
2870C63j26O6l41J06K13k17j26J77j49mJ28l29L68k02LJ30j86p2p4L0K50k81o7
2893c40K76J1N2J08k26L36L7r8J90j57n9J09k30K06m2j78R9l0j93J16n1L0K3k13
2917b24O7K02j52k1q5R9J40k93K21j81L24qM0j47L16k95J13J06K9k29J23l8J61
2940B68l11m1J66n2J00j4r3L6l2j78K45m3j09r4j27J41n3j3K55k79L02k3k29K48
2964G0N9j72K32o2k6Q8l47K48J07k63K28j84Lr7N5j12J81l62K93k2N4M1j19j63
2988b70J60k08K00K08k03O1J6p3K58kj30K73k60J23K4j19J93k08j88K41r0M3n5
$$ plain form
2822 -244 -214 94 -360 30 -300 -244 -227 -165 -12 -67 -26 165 100 -32 285 156 172 313 99 322 207 199 273 112
2846 112 34 43 -36 38 10 -138 -108 -17 -320 -99 -152 -82 -14 -320 -63 -24 -203 -42 122 -186 135 36 208 363
2870 363 237 303 -38 68 281 64 -62 115 -34 -38 90 -239 129 -73 -70 60 -126 -198 -272 -242 8 -273 -340
2893 -340 -64 -53 -1 107 -119 217 254 156 346 189 130 239 9 215 173 -5 94 64 -129 -13 -64 -34 -11 -224
2917 -224 -157 45 -107 -128 -213 -114 26 -267 -46 -227 97 89 129 -18 298 3 116 222 251 22 145 107 268
2940 268 -43 -84 82 30 130 116 23 59 27 -151 94 51 -58 -152 -279 -138 -191 -204 51 -228 74 51 -178 70
2964 70 129 -43 189 127 101 189 -158 90 197 -66 162 -22 -19 -116 -61 -173 8 -354 -61 -83 -29 12 -107 -270
2988 -270 -110 -318 -118 90 -113 -52 -36 -109 149 147 17 290 30 153 177 58 251 43 -145 96 6 49 -6
3011fk70J20J94k39J85pk81K59m9J9P6k13L82l18J95J36j24q5J77j66K13j33J23
3034A88j22j03l0K73k02j60P5R1P1p3n8pN6j83K2n2K04l8j00L01k02JK07k80K45
3059A24k04R7L0K4j43K45K6j9%j68P7Lk55J77l6L7J21l73J28P6j61Q3K10k57J32
3084b6j96QJ10nR2j29j31L14o6O5J44j50j5J64j14J62l7n8J48l80O0K88m39J27
3108f4Rj1k2k17J39K11k50J58m5K8N2j43L2J31q6J2J07r4L16j64%J01q9J65r3
3133A83j25Q1j09J3n3j30q1R8q1J14J33k07L25l79J66j0r3L5M3r2J41M7K0p0J0
3158b1J52J9j62J59Ro3O1j48l2O4m8j5m6p2K9o7J01m6J71J5l4o0j99K87r7J72
3184A29j63L8J0Q7j20j5k7K26j10r0K14j17J04m8n5j61j0o2K12k50J61j5p1O7
$$ plain form
3011 -6 -276 -156 38 -201 -16 -23 -304 -45 -94 -75 1 -212 170 -148 47 183 59 -26 151 -15 198 65 188
3034 188 66 -37 -67 206 4 -156 -81 10 81 8 -50 -57 -1 -184 -162 -214 -10 -48 -148 153 -49 -48 159 -121 124
3059 124 -80 17 47 71 -72 173 199 180 180 12 89 92 -163 14 -22 15 136 -237 -109 -33 -194 -111 99 -158 -26
3084 -26 -222 -214 -104 -109 -17 -146 -277 37 -29 36 180 30 15 179 65 227 190 132 280 -100 -40 248 -191 -64
3108 -64 -55 -66 -88 -305 -166 45 -205 -47 -92 -64 -12 -155 -123 8 -78 -66 41 -53 263 99 99 200 111 276 183
3133 183 58 139 30 43 -10 -140 -221 -123 -204 -90 43 -164 161 -218 -52 -62 -155 -120 -77 -169 -28 19 39 -31 -21
3158 -21 131 150 -12 147 156 93 154 6 -26 38 -10 -25 -71 -143 -114 -181 -80 -126 45 60 26 -34 -233 54 -43 129
3184 129 -34 4 14 101 -19 -34 -61 165 55 -35 179 62 166 118 63 -98 -108 -170 42 -208 -47 -62 -133 -66
3208f6o9j8J02J16k33J07L8N0k1j36P5M4Q8j3K3n3k6O4K3J42j86N3N3m9N5j90
3234b7RJ31k83J3J31k54K31j7l8R3k25N7K75j58N9J68j47M1pj8J14Qj18K87j25
3259B00J4j13j66L45j77k03J4n3M2J50k35J68r5JQ0j61J88j44j09K20j22l9K02
3282Go3J55P5k10J66o1j32K22L7k25J96j55j05K34k10J79m0l4M0j83J21j9k92
3305b97K29K8M3m8n3j0%mm8K92j86J74j39K8R2Pj7K16j56j31L6k22K70K1j30j8
3331b3j2J03k5Mk23Q1j6K2o9O8L1j84L09j67J0K23k09J8K78l0j11o9J6O1K3q4
3357B5J67m5j45J40q5L2j08j07K34k27j1k1M6j43J93N0j2J26r1Lr1J88k0l20L53
3382A31N9k01K57r9p0O1j09m9Q1q5K05j88j1P6j13R6j15k9L9p9K15m1j04j59K91
$$ plain form
3208 -66 -135 -153 -51 65 -168 -61 -23 27 6 -130 -55 -11 77 64 87 34 8 72 95 237 51 104 157 108 163 -27
3234 -27 -18 113 -170 -157 -26 -280 -49 -66 -104 -11 -236 -179 96 -62 -3 165 18 59 52 34 148 156 38 325 200
3259 200 214 101 -65 280 103 -100 -86 -139 -97 53 -182 -14 -109 -108 -28 -189 -1 -145 -254 -34 -156 -195 7
3282 7 -56 99 174 -36 130 69 -63 159 196 -29 167 12 -93 141 -69 110 70 36 76 -107 14 -5 -297
3305 -297 -68 -40 3 -45 -98 -108 -108 -112 -160 132 -54 120 -19 9 101 108 91 307 151 20 56 -166 104 125 -5 -23
3331 -23 -35 68 43 47 -176 -95 -111 -89 -158 -90 -59 -243 66 -101 -91 132 -77 -59 219 189 78 9 25 86 109 25
3357 25 192 147 2 142 57 89 -19 -126 108 -119 -130 -151 -105 -248 -55 -5 -17 109 18 21 -70 118 98 -222 131
3382 131 190 -11 246 147 77 138 29 -20 61 -24 181 -7 -18 58 -55 41 -74 -103 -64 -143 72 31 -73 -232 59
3407E9k24J81L3O4r1O0j62J39j73L2J03j27K02j18J63n3j12L16j59k76L55j62
3429E0q6j55J02RN9kj55M8%m3M3K47k51J20J2J9j63K17l5k29K37l8K58j61J02
3454B05j45J19k88K71j39N4JN0j91M1p8j54q1N5J06MN8j28J83m6J17n7j0Q5o6
3479c4P7J7K6k6r1J07N8Q1m8j28Q3L2k13K65j18k21J07j49n5K01j71R9pj18K25
3504aQ7j65R5J48l8O6j52p3L5J40J06k64k8J45j24j19K94k81K00k5K7P6j87n5
3528i3l5p3MK17k18K55j22k06K55J26m9J02l79J79pl4J66k3j05J21j64Q4ON9O8
3553A34j88L9J56l24Q5l4m4J92j3oo7k7j94J57Q0O4J8J0k8J78j80j56J16Qo6J9
3579g1J13lJ45k49J18K9j44O1J02r1q1J84p1j40oPo1J12k04K48j36Q7J41j78L6
$$ plain form
3407 59 -165 16 49 113 22 82 -80 59 -114 -82 21 -106 96 -22 141 88 -24 292 133 -143 212 50
3429 50 -36 -191 -89 -80 -21 -23 -178 -130 -130 -173 -130 117 -134 -14 -2 17 -146 71 36 -193 44 6 264 103 205
3454 205 60 179 -109 162 23 77 78 128 -63 -22 -100 -254 -335 -280 -174 -170 -112 -240 -57 -103 14 -43 -53 32 -34
3479 -34 43 60 86 60 -31 76 134 215 167 39 122 154 -59 206 88 -133 -26 -175 -230 -29 -200 -101 -108 -226 -1
3504 -1 86 -79 16 164 126 192 40 -33 2 142 248 -16 -44 101 -23 -142 152 -129 71 46 73 149 -38 -93
3528 -93 -128 -201 -197 20 -198 57 -65 -271 -16 110 61 163 -216 -37 -44 -78 88 65 -40 81 -83 1 7 66 134
3553 134 -54 -15 141 -183 -98 -132 -176 16 3 -3 -70 -97 -291 -134 -54 10 28 38 10 188 8 -148 -32 -24 -90 -71
3579 -71 42 39 184 -65 53 82 -62 -1 101 10 -71 113 42 -98 -104 -97 -158 -46 -250 -2 -138 -51 90 -88 -52
3604e2P6j9j27J20j1J44j48J40j43K00j02L2j4RJ01k72J13J1k23L7M6O5K5k38
3628b30K80K8j90J05Q3o1j23M9k3J28j53Q4J39q5P3kmK6j23J82j29KK7o0R8j45
3654b4p2M0j05J07n9j71K72k5j03J62j11p9p2J73J14J17j64J96j21o3K13r7K0
3677A48k9j07Q2j37J6J92j03j64k6J10Lo2m7l3K40l37J08J43R5o7j87J97L6q5
3701a4NJ42o4k14L08J0r3O2Jl4r8L9o2j4J74k28P2mj21o8K03P1r9l0pK5p5nN0
3730f8k9J59K6j70J39N9j12K7p7Q4J49k0o1oM1R9l31R3J09j64J35j06j48J10r9
3755a61pJ26j81O1J59n7R4q5J3J17j04k3K09o3P9j18n8J16n7j06M5J57j19K3j45
3780h5Pl8J84j61J76k60j8J54mp0M0P5k13m2J04n3P8J10j06J09R0N6j41j30K43
$$ plain form
3604 -52 24 5 -122 -2 -13 131 -17 123 -20 180 78 110 96 105 206 -66 47 58 -165 -128 -82 -17 8 -230
3628 -230 50 78 -112 -7 76 15 -108 -59 -82 46 -107 -23 116 31 104 102 98 124 1 183 54 56 83 23 121 -24
3654 -24 -96 -56 -161 -54 -113 -284 -12 -37 -140 22 -89 -168 -240 -67 47 164 0 196 75 12 225 128 148
3677 148 119 12 94 -43 -27 165 62 -102 -128 -18 -15 -77 -124 -157 83 -254 -146 -3 92 25 -162 35 71 -14
3701 -14 -9 133 69 -145 163 173 80 142 143 109 11 50 -12 -26 148 -80 -8 -12 -133 -201 2 73 -26 -56 -63 -38 -113 -118 -68
3730 -68 -97 62 88 -82 57 116 4 31 -46 38 187 167 106 100 141 240 -91 2 111 -53 82 -24 -172 -62 -161
3755 -161 -168 -42 -223 -162 -3 -60 34 -51 -38 79 -25 -48 161 98 177 59 1 117 60 -46 -1 156 37 60 -85
3780 -85 -78 -116 68 -93 83 -177 -195 -41 -45 -115 -75 0 -213 -255 -151 -204 -126 -16 -122 -13 77 133 -8 -138 105
3805A05l2M4q2l1J9J9rj37J35n5J01p3j3m9J48j68J42k53K20j59N8l9J52j68K03
3830G8l4M1l4j3Q0J12k29J47j04n9N8K9kJ9j9n8m6Q8j09k9Q5L2k1j51p6p4K25
3857f4n0O8p6j9J51P6r9M6P4M0J76l28K95j89k97L19j75L0L13l08M6Q6q9r8P1
3882aJ7M2k24J75j2k30P3K17k41l8J33K78j78n6O3J78l8R6q0j47j22R0k3J43j46
3907c1J01m1j36%R7j38J24J11k24J17p8mK9n0R3q2L0J15j52L11o9j21M5J25j94
3932b2J26M1k06P2J9j4R8j91N8P9p1o0R0J09p3l5l9n8p8K11k31J43j20k8J63M5
3958B8K9J9J8o7J37k38J95q9p7L9J21k16K74l33N8J78j13O6M0j59o2O1J1P4l7
3983d3J0k0j8Q8k18O0J90k3j29K30j37N5L4j04kJ15o4L6q9K35Kj27n9N8o0M6m5
$$ plain form
3805 105 73 117 35 4 23 42 33 -104 31 -24 77 4 -9 -58 90 -78 64 -189 31 -128 -70 -109 43 -125 78
3830 78 44 85 51 38 118 230 1 148 44 -15 43 72 70 89 70 12 -34 54 -55 -84 1 33 12 -139 -215 -289 -64
3857 -64 -114 -46 -122 -141 10 86 -13 33 107 147 323 -5 290 101 -196 123 -52 -22 291 -17 29 115 26 -72 -1
3882 -1 16 58 -166 9 -3 -233 -160 57 -184 -222 -89 189 11 -45 18 196 158 254 174 27 -95 -5 -28 115 -31
3907 -31 70 29 -107 -107 -10 -148 -24 87 -137 -20 -98 -102 -73 -123 -30 -112 -82 33 -119 192 123 2 47 172 -22
3932 -22 104 145 -61 11 30 16 114 -77 -19 60 -11 -71 19 128 55 20 -19 -77 -155 56 -175 -32 -152 -180 -17 28
3958 28 57 76 94 27 164 -74 121 32 -45 -6 115 -101 173 -160 -102 76 -37 29 69 -90 -152 -91 -80 -6 -43
3983 -43 -33 -53 -71 17 -201 -141 49 26 -103 127 -10 45 79 -25 -27 88 24 60 -29 206 208 81 22 80 20 66 21
4010B1r5q0KK32k06J19q0J7l1Q6m8J71j12rN3p1M1J54j78J4M3j52K19o0J19j69
4036@n0R7M3J03r3n9j18kM8j42J54p4q4J16M5K3N2k11J57j11J03m8J25ON7j48
4062a1P7j56J22J33k16k7OR8o7R1j00O5M4j54J63j08j19m8L1K46j26J2R6m5j05
4087i8L5MQ8K04l01l3J01n8K38j69p7K11j34N7j34l2K08k91O9L2Pj8M0pL9k34
4113b53J03L3Q2MM1j29Q6J86j25L3r5p1L11j92o4J42j67J06j03N3p3oQ2j01L8
4138g9J62j83O2R1j53M6J50q4j01N5l1R9j56NJ98r0j3K1L0J26n1j63K5L8J53j78
4164b1l2J68k6M4m1p1m2K2rM8o3p5O0M8m3J58j75r3J58M8k25J65Q0N9n7L5j13
4191GQ4N4j6j53J58m5k32J78mK5J3j38J86j14kq2N7K7j09L8k6O4M9n2j1o3J28
$$ plain form
4010 21 -74 -154 -152 80 -126 -7 -87 -70 -101 -15 -63 108 -4 -13 40 -31 10 164 -14 0 43 -109 110 50 169 0
4036 0 -50 47 90 193 100 41 -77 -79 -31 -173 -19 -93 -177 -61 -16 7 59 -152 5 -106 -3 -51 74 80 137 -11
4062 -11 66 -90 32 165 -51 -78 -72 26 -41 50 -50 15 59 -95 68 -40 -159 -207 -176 70 -56 -44 52 7 -98
4087 -98 -63 -59 29 233 -68 -101 0 -58 180 11 -66 145 11 68 -66 -98 110 -181 -112 -80 -73 -91 -51 -58 -19 -253
4113 -253 -150 -117 -35 -31 10 -119 -33 153 28 61 -34 -105 206 14 -50 92 -75 31 -72 -19 -92 -98 -16 -117 -79
4138 -79 83 -100 -38 53 -100 -54 96 12 -89 -34 -65 34 -122 -117 81 -9 -22 -1 29 155 104 -59 -34 4 157 -21
4164 -21 -53 115 89 133 92 21 -21 1 -8 40 -23 -98 -38 10 -33 125 -50 -143 15 63 -162 3 83 142 85 120 7
4191 7 91 145 129 -24 134 89 -143 35 31 56 69 -69 117 3 1 -81 -24 3 -106 -68 -94 -30 19 -33 -44 -107 21
4218B1L3J04r8j99MJ20l6k3J60j61K07k43P9M3J42l4Nj72P4j78m1J57j66J47l7
4243i2R2n2l7o2J74rQ5m6j02J02kO6j36K9P7j9M7Ko2j00J02P5j74R0k2J66j46
4270D6j4n4J40j20j23M8J49j87J74j6P2n4KK4n4J26j13ol1J08n3J0l2O3j10Q8
4296H3j10o1J28p6r3K5J64m9j68J04M7J23k03L08j97j65K79r4l8J6j22J54OoK8
4321H3l0l8N3m8l%j32J33p9m3Q9N8n3o9n4J34k69J30J94j44o2J29q3q6J23J45
4347G8j20j14J42K9k5l2Q7M8q9l1J5j4P6r6L4k6J25q1m9l2K8j5k8NK26j88qj20
4375a75J25J65L8o9n6r8J92q2Q4j51N8J03p1J64j03r9J11j61k4o3O0J33j87J01
4399eo7O2J43j84N1J09j14M8L3k51l2L14p2m2O1n6mNj37K97j19K9m7J10k76K67
$$ plain form
4218 21 54 158 60 -139 -135 -15 -51 -74 86 -75 132 -111 -32 11 153 119 124 -48 26 -152 -193 -36 -202 -55 -92
4243 -92 0 -52 -89 -151 23 14 99 53 -49 53 51 117 -19 10 87 68 115 117 55 -45 57 132 -42 48 26 192 46
4270 46 32 -22 118 -2 -125 -77 72 -115 59 43 115 61 63 87 33 159 46 40 9 117 64 74 42 105 -5 83
4296 83 -27 -88 40 -36 -129 -104 60 11 -157 -53 -6 117 -86 222 25 -140 139 45 7 23 -99 55 61 55 83
4321 83 53 15 68 20 17 17 -115 18 -61 -104 -15 43 -10 -79 -133 1 -268 -138 56 -88 -150 -21 -104 -190 -67 78
4347 78 -42 -156 -14 15 -10 -42 45 93 4 -27 -12 -26 50 -46 -12 -38 87 6 -43 -75 -47 -62 -90 -85 141 -47 -55 -175
4375 -175 -50 115 153 84 28 -70 122 40 124 -27 31 134 63 227 124 25 136 -25 -49 -112 -52 81 -106 -5
4399 -5 -72 -10 133 -51 0 109 -5 43 76 -175 -207 107 35 -7 54 -2 -6 -1 -138 159 40 69 22 132 -144 123
4425A23p7r0M4R1j97MJ59q7J39k27J5P8OK5M7lJ22l39K05q1M6J60j99J29j85Q2
4451a0J04k05J06o5L2J09j06PK5j21J14n2L6N5k77J97k06J60J0J9r6J37L0j3k2
4476c2J31j81J54k2qj20J11R1k60L3L11k07Q9j24J79k10lJ02j08J13j76J62k0
4499Ej20LR0j58P6P2j03k3K56l1p7R3p2N6J3P5j73O2Q2K6k12J05m8j9M6o2j54
4526a92J33k6J10j77J37n2R5n9J9j57O8J27N5k06J04O4p4K52k37M1M3m9K8J13
4550A60k4nm4j16NL9l9j4j03J60j86K46j74O2J89l55J30J03R9j42Kk07L47j10
4574B3p6l4q5J56M1%J08j39m6J5J06k7K2j71P3O8l4j01J49m5j22N8J0O8J04N6
4600A77k90K70j38p1J15n2nm8J52j4q7J3N7p3J25j8rj33J37j07J9J06k03P4J22
$$ plain form
4425 123 46 -44 0 91 -106 -102 57 -30 109 -118 -103 -25 -19 6 53 50 172 -167 38 -43 3 163 -36 93 -92 -10
4451 -10 94 -111 -5 -70 -38 71 -35 -28 -3 -124 -10 -62 -26 29 -248 -51 -257 -97 -87 -68 -164 -27 3 -10 -32
4476 -32 99 -82 72 50 42 -78 33 124 -136 -103 208 1 90 -34 145 -65 -68 34 -74 39 -137 25 5
4499 5 -115 -112 -22 -180 -104 -32 -135 -158 98 67 -10 83 11 67 80 155 -18 44 126 152 -60 45 -3 -22 24 -38 -192
4526 -192 -59 -85 25 -152 -15 -67 28 -31 -12 -169 -101 26 81 -125 -21 43 -31 221 -16 25 68 19 47 160
4550 160 136 131 87 -29 -24 15 -24 -38 -141 19 -167 79 -95 -33 156 -199 -69 34 133 -9 -7 -214 133 23
4574 23 -53 -87 -172 -16 25 25 133 -6 -52 -37 69 42 64 -107 -34 34 0 -101 48 3 -119 -61 -51 17 121 177
4600 177 -113 157 19 -52 63 11 6 -42 110 96 9 22 79 6 131 113 104 -29 108 1 20 126 -77 -3 119
4625A19j80O1q2K8L2km8J7R5j9M9q6M1jj2j50K33N2M4k52J55j03L2J41o0j85J99
4652A18r7o9rj06J95j79O2J19j45q3J71r2P7j1J06j62o3J63j04K32j54J52l1k8
4676F2q7J10q5K8L1J12j48k2M1O4j15m5P6j64J19N4Kn1R4j31l5J52j95L0J03n4
4702e4K35j30Nj85J36n1J57j78J71r6J28k7j09jp3R8m4L7k32K45j56K8R2j91R0
4727a05K18j65Mo7J50j30K12j23p5Q5Q3l6r7J28n3M9j1p0L7L6OJ3o6n9J1j8j7
4754f0pJ8l6L1q5N7N6J22q7N9m6j12K34j5l39K15J70m5l6J04j76P5K1j33L5J7
4780C7j47m3K21N3j79J51p0j71J33q9J57j34L0L2m1N9r5O9j2J18r8k9l1Q3O2j10
4806d4L6N1J54j20k28K55j07M1j07J12K7j06N0jQ2O3j04j28J12oj33J47l9L9O0
$$ plain form
4625 119 -61 0 -82 -54 -22 -24 -72 -55 40 21 70 -16 25 24 12 -138 95 147 191 -61 94 -9 23 164 104 -81 118
4652 118 21 -48 -57 -163 32 -147 -85 34 -111 -194 -23 -115 -38 -49 57 -105 -168 -5 -109 123 -31 121 90 62
4676 62 -25 85 0 28 59 171 23 1 42 106 -9 -54 22 -142 -23 31 33 -18 76 -55 -90 62 -133 -103 0 -54
4702 -54 181 51 56 -129 7 -44 113 -65 106 10 138 111 2 1 -72 26 -18 19 -213 32 -124 -96 -4 -195 -105
4727 -105 113 -52 -48 -115 35 -95 117 -6 -81 4 87 51 -46 82 29 78 67 -3 34 70 76 89 23 -36 -25 -43 -60
4754 -60 -67 -49 -85 -54 -139 -82 -26 96 9 68 22 -90 144 129 -210 5 175 130 94 198 22 97 118 -15 20 37
4780 37 -110 -153 68 121 -58 93 23 -148 -15 -104 53 -81 -51 -19 -60 -1 -96 -27 -39 79 -19 -48 -79 4 66 -44
4806 -44 -8 43 197 77 -151 104 -3 38 -69 43 70 -36 14 13 95 158 54 -74 38 32 -101 46 7 46 106
4831A06j59J8k6K27p2j06PQP1P6j49J4q3j04J45J4j66P6N7n2J81k00l2O1J97l37
4857b28J82nm5J84k00N6j3Q0J63l4k05N0L0K3%n1Q8k45R1K69k06J24J77l02p6
4882i3L5O4m6j59J49ro1J52q0n5J64j41P2J81k92J55j2K3J0m0O8j38R4p9j1O3
4908A4o1J36o4n7K3j11Q5L2L9L2k52K59j0p9M2M2k6J8K2k63L03q1P3j14Pj00R9
4935HJ24j61L1J56j26L4L8j6j55m4j8J99k02k3J29j74K39L5j2qP7K5j0j71K7L2
4961C4r7K33j50Rj06k4N9P1N6l6j4m6J4LM1j39J00J1n6RK1O1j55J24k28J41rN8
4989a5m6J5L0J00j38O2KK0q3k5K81j92R6j9j0K8k25L06j55m0J9m9O2P4j62K1J55
5016A12k39j73J37J78j68O6J00m0n8N5l5O3P8r6r1K93q8o3K7l9q8J24j20J58j10
$$ plain form
4831 106 -53 -35 -61 166 94 -12 -5 3 74 150 1 15 -68 -172 -27 -13 -179 -103 -46 -98 83 -117 -149 -88 109 -228
4857 -228 -46 -51 -96 88 -112 -56 -69 11 174 140 -65 -15 15 38 38 -13 75 -170 -79 190 -16 108 285 -17 -93
4882 -93 -58 6 -40 -199 -50 -59 -120 32 -48 -103 61 -80 -8 173 -119 36 24 47 57 17 85 -53 41 -38 -49 14
4908 14 -47 89 25 -32 -9 -120 -35 -3 36 68 -184 75 65 -14 28 70 44 62 84 -179 124 43 116 2 9 -91 8
4935 8 132 -29 2 158 32 66 104 88 -67 -111 -129 70 -132 -155 -26 -200 39 74 62 54 131 156 146 -25 2 34
4961 34 -63 170 20 29 -77 -101 -42 29 85 49 35 -11 3 6 47 -92 8 19 -37 -28 -7 54 -101 23 -205 -64 -73 -15
4989 -15 -61 -46 -16 84 -54 8 10 30 -53 -78 203 11 107 88 78 106 -119 187 32 -8 11 -38 24 98 -64 -43 112
5016 112 -127 -300 -163 15 -153 -87 13 -27 -85 -30 -65 -2 76 -20 -111 182 94 31 58 19 -69 55 -65 93 -17
5041a7r1J39q7mNj36Q5J0p8K25k38K27j48K90j51k33K32l3JO4o8j8J27k78K65
5066I0J20k73K20k47Q3N3n2o3M3j58L26o6n8l2N3j37j27J98l7J73N3j10K0j88
5090a16K53p6M8j4j91l9J61J68j41j28M4J59k79K18j36P1j7j31K08k13K02j30
5112g9P5l1K7k68J87J91k45P1P5nK2K6m7j1J02q2j02K51k89J56J05m9lj4O8j05
5138B6q1J52l01J90J1p5Q7j8r2J61k47K35p9J67j14Lk15L19L4k22J66j89L10k09
5162A9qp7JJ89l0k01J82M1k29L0J59j26J17q0J02k07J00J10j78o7L24l08K48o4
5186D7j81J61k64L98j72R4J0j10J92p8M4j36Q4j08K6j29N3K42k07M1L3Nm7J12
5210A10Q7k66J37q9k6K7l1j07J88N1j71%K9P8j1J96p1k8j66P1k53J23K23j22J86
$$ plain form
5041 -17 -108 31 -56 -60 -55 -191 -106 -96 -174 51 -187 40 -108 182 31 -202 30 -3 -2 62 -6 -24 103 -175 90
5066 90 210 -63 157 -90 -7 46 -6 -69 -26 -184 142 76 18 -14 39 -98 -225 -27 -64 109 162 52 72 -116
5090 -116 137 61 109 95 -96 -135 26 194 53 -75 -31 128 -151 67 -69 2 -15 -146 62 -151 51 -79
5112 -79 -4 -35 -8 -276 -89 102 -143 -72 3 -2 20 46 -1 -12 90 8 -94 157 -132 24 129 80 77 63 131 26
5138 26 -55 97 -204 -14 -3 -78 9 -9 -101 60 -187 48 -31 136 22 25 -190 129 163 -59 107 -82 228 19
5162 19 11 -66 -65 124 94 -107 75 116 -113 -83 76 -50 67 -13 89 -118 -18 92 -86 -153 171 -137 111 47
5186 47 -134 27 -237 161 -11 83 93 -17 175 97 141 5 89 -19 7 -122 -69 173 -34 7 40 45 -2 110
5210 110 197 -69 68 -21 -47 -20 -51 -158 30 81 -90 -90 -61 17 6 202 131 103 -63 8 -245 -122 101 -21 165
5235A65k54R7k7pq9p7P8N3j00J84q9m3P2J6j8M1k7j0K24k02j10J97O5j48m0n5
5261a04LJ00K2J46l8n8r3K4J5j24J07l2pN9Q9k42P4J49j3k55J40K5Ll3J59j71
5287e5J38Jj12R3j8q5M6R6K5j24J0R7k07O1J98j69j11K6N1j14J39j1P7r7J02j28
5313g1O9m7o8L70l13J7J30j41J20p2L3j83J81Q8j00jq7MJ60j67J52l9N3j15Q2
5338E5k7L7r8N6j30P0nJ31kj88k5J93j72K9J32q9K4N9K1j95Q4L2P8j35m8N1K88
5365B26l05P6J19j65J11k50P2O3L2J9J34j20k9jlj6r5N3J41K9J04j38r1P4O1j42
5391d1K12k34Kn4K36p2n9J58j08r8j17N6J14P2K2Lk07J27K0j72P5M9L0M0J00p4
5417H0r9N6L0L8o1j13J31K17k14j10Rm7J47q0R4j5q0q1j19J79O4n3L9p8J17j19
$$ plain form
5235 165 -89 8 -19 -26 -115 -192 -114 -61 -161 23 -66 -109 -37 -21 -39 2 -25 -35 189 -13 -123 74 139 -9 -49 -104
5261 -104 -101 -1 21 167 129 71 -22 2 17 -107 0 -32 -39 20 109 -133 -59 90 77 -178 -38 -13 -10 -43 116 -55
5287 -55 83 84 -28 65 47 -38 8 104 129 5 15 112 -95 -34 164 -5 -116 -90 -39 -153 -14 -25 52 -45 57 -71
5313 -71 -2 -49 -117 253 -60 -43 87 -54 66 -6 27 -156 25 113 13 12 -75 -71 89 -78 74 35 88 -27 55
5338 55 28 65 -33 23 -107 -37 -42 89 87 -101 -126 67 -105 -76 56 -33 -9 50 71 -124 -40 -8 70 -65 -113 -62 226
5365 226 -79 -3 116 -49 62 -188 -116 -53 -21 -2 132 12 -17 -18 -21 -37 -132 -79 62 91 195 57 -34 40 101 -41
5391 -41 171 -63 -61 -115 121 49 -10 148 40 -58 -175 -119 -5 67 89 92 -115 12 32 -140 -65 -16 14 54 154 80
5417 80 -19 37 67 105 44 -69 62 279 65 -45 -36 -83 64 -16 78 63 -17 -98 -217 -38 26 -27 12 -66 51 -68
5443f8n2O5J61l8j66K48j88OR1q6R8N7o3J33j36Or3P7jm1P3j28mMJ9K2l2r6k6
5472a58K50j86J67k35O3J18j20O6J70j12Q3j15j13K01m3l9J05m6n8M7j5q6n6J26
5496A4j84J17KL4O6p%m1n7R6P3K4k29J44K9pR8r7j83J58P5k09J80j76Q9J40j16
5523C3j20J41j88O2j6J90j25o6LJ44j90M0J49O6j49j14J49p5J91l17K49N9j02
5546A4Q6M2l6n1l3j48J17j8rJ57j07q3O0k6QO1n3j32J2J07l3P0j34K28k74K52
5572G7O2j0j1l02J18J26m9o0J34k99P4J21K00j45j26J34j51J33j57K47r2j25q1
5595a82L24k0j36L0l3J20o5j84L13j66M9Q6r6J05j78J27j38Q0q5r0K94lk53J94
5619I3j55m6K47j57o7k7J52j35J03P3m7Q4j67J6O6p7j54J73K0J30q9J29J2j68
$$ plain form
5443 -68 -120 -55 106 68 -98 150 -38 -32 59 -27 71 128 65 198 62 68 -25 52 51 10 83 -45 -49 -45 -26 -4 -36 -132 -158
5472 -158 92 -94 73 -162 -99 19 -101 -35 135 23 106 -9 -122 79 36 -3 102 56 -2 45 30 -56 -112 14
5496 14 -170 -53 -51 -17 49 42 42 1 -56 40 113 137 -92 52 81 74 172 75 -108 50 125 -84 96 -80 9 149 33
5523 33 -87 54 -134 -72 -88 102 -23 -89 -86 58 -132 -92 57 123 -26 -140 9 -66 125 -192 57 116 14
5546 14 100 142 106 55 22 -126 -9 -27 -36 121 14 -69 -9 -35 -27 34 -19 -151 -139 -32 -65 5 -129 99 -175 77
5572 77 139 129 118 -184 -66 60 11 -49 85 -214 -140 -19 181 36 -90 44 -107 26 -131 116 24 -101 -182
5595 -182 142 122 -14 16 -17 103 38 -146 167 1 50 136 40 145 -33 94 -44 36 -49 -139 155 152 -101 93
5619 93 -62 -108 139 -18 -85 -112 40 -95 8 81 34 118 -49 -33 33 -44 -198 -25 -5 125 36 165 177 9
5643Ij17R8j2L8k3M1L5n4j44J09J03q0L4K4j84J58K3k8j03j25P8K86j58k1p5J82
5669I4j59RR9L8j76K13j44O6j9M1l2k6lJ02Q4k78M9J22l3N4j0o2J4j32Q9m7J39
5696I2j07J38j43l9Mj27J55Q4j05J15o8J23j96J45l3Q8j39L6j21J45K5j93l7J44
5720a4poq6N0n4P8p2j61J54N8R5kO8k42J00K91k69q3J80n0m2OJ63K1k41K03q0
5747E8q5p0j5J70k82J43m6J01P0q0L8j16O1j3L3L5q1O8l4j5PlP9M3j11m4J55K4
5775I0nj01j20K52p9j89J30O4j33o3J70l3j36J6J97j48J80k40J02J3kO8M2q2p9
5800h6LP8K10j46lK1j38J47o1P4O3k38o7K38o9j37J50p1N7j21r0J52J75l85J70
5825g4J35l9Q1K1k61J04k3OR8L1j74L8k8J91J19j27k32J12J51j58N1r4J13J19
$$ plain form
5643 9 -108 -10 -22 16 -7 34 69 15 -129 -20 83 3 37 61 -123 35 58 30 -73 -198 -120 166 8 -13 -88 94
5669 94 -65 -56 43 81 -95 118 -26 40 21 62 30 4 1 103 187 -91 -42 80 47 101 91 29 43 -89 0 -47 92
5696 92 -15 123 -20 -59 -55 -182 -27 57 -48 67 -1 122 -74 71 38 126 -13 23 -98 47 72 -121 -158 -14
5720 -14 -21 -27 -113 -63 -117 -39 -111 -272 -118 -60 35 33 101 -141 -41 250 -19 -102 78 28 -14 -8 155 176 -65 138 58
5747 58 -27 -97 -112 58 -224 -81 -127 -26 44 -36 2 -114 -53 -66 -33 2 -79 -11 -45 -60 -53 -56 23 66 -45 -89 66 90
5775 90 85 -16 -136 116 37 -152 -22 42 -91 -154 16 -17 -153 -137 60 -88 92 -148 -46 -33 -35 33 75 -7 -86
5800 -86 -83 -5 205 59 56 77 -61 86 25 99 162 -76 -143 95 26 -111 39 -32 25 -96 -186 -34 141 -244 -74
5825 -74 61 22 103 124 -137 -33 -56 -50 48 79 -95 -57 -85 106 225 98 -134 -22 129 -29 22 -72 41 160
5849A60j11Q7l48L02J7j38O4j47J89j29OM9k0o6L7MO9j40P2MN7M1j24J6L3m3J37
5876G8j45O6p9J65q7O8q3R1K3j91J81j76P2k8Q7M7j89P7J3P6m0k5K4N7j0m2nm
5904B1j15J63K6j48j0K50j58oL7n4P3n7O8o0Mj21J5J1j04J62O8r6O1j22K00k6
5930H2k02K16j07o2J6p0L09j03k10O2O0O3k16K36l6j38N4O2R3j83l8K17p6j10
5954h1J51j03l2Mj4J66k16J49JK9j1nO0j30R7k5j33J32R2j24M8j53K3P8r3J42
5980E2j8P9k32J89j30J8O7k2K9j49J24M6j92R5Lr6O6J02J08j10PJ27k48K12o5
6005F2j14o2l1Q0jP2j40N8K0j96K15j1LL7R3r3j61L05j11j64L26k21N4p5R2P2
6031A09o8n9%J9k12Q2K38j41J14L9j80J89k11J39o1Kj37m4J18o6O9r0O8M5lj15
$$ plain form
5849 160 49 136 -212 90 107 -31 33 -114 75 -54 -48 1 -19 -85 -48 -44 25 -115 -43 -39 18 59 -65 -49 -16 -59 78
5876 78 -67 -1 -80 85 -2 66 -17 74 97 -94 87 -89 -17 -45 42 89 -100 -23 -10 66 26 1 25 82 72 30 25 21
5904 21 -94 69 95 -53 -63 187 29 23 60 6 79 22 90 30 34 -87 -72 -61 -165 -3 65 -31 30 -92 108 82
5930 82 -120 96 -11 -73 -57 -127 182 79 -131 -69 -9 54 -162 74 38 -100 -46 16 109 -74 -112 105 29 -81
5954 -81 70 -33 -65 -61 -75 91 -125 24 25 54 43 38 98 -32 65 40 -93 39 131 7 55 -98 -75 3 -90 52
5980 52 34 113 -119 70 -60 -42 25 3 32 -117 7 53 -139 -44 -41 -137 -71 31 139 29 36 163 -85 127 62
6005 62 -52 -114 -145 -65 -66 6 -134 -76 -56 -252 -37 -48 -45 -8 85 -8 -169 136 25 -139 187 -34 20 -55 37 109
6031 109 41 -18 -18 1 -211 -129 109 -32 82 121 -59 130 -81 58 -3 -1 -138 -182 -64 -130 -61 -151 -83 -38 -41 -156
6057a56Q5N2O7o6Q6l2NP8k28K68r2M9J14j64J64q0j43j94K76j63Q5j77LJ24N8
6082A9p9K09j35j40J43K8m8J35q3m0q9N1J1J1k0M8r7q3J95R5j02j5Q1J2m1j88
6108a22J22o0Q9J6j4j31J62k04J87l2j40J19K7j09L67k89k4J43j56J05k0kj17
6131h3j38O4K50p1j17O7j21J5j7J35N9N6p4o2R8j09J18n1p4l7Lp5J00l1J66p3
6157bJ22o9k5j69O3j39K57o1KJ58o8j37p9J44K1j34k0J11j86K48k05J25k2J0j3
6182f8Q2J7p9J15k8n6j61J92r7r7Q1K25j30m4J04J24k63R5Kj92K78Q4j57Q0r8
6207IJ1K2O0j13N1l3n1j78K96j45O9r3J78k07M2J11J5Q6r7J16q7L3j09K2J7j45
6233a20K19q9J8oj34J76q9Q7q0j96J74k6L4%k2K2R0q0Q1m2O4j7j86K9J14J5j19
$$ plain form
6057 -156 -71 -19 48 -18 68 36 41 119 -109 159 67 116 230 66 230 150 7 -187 89 -74 11 -166 -163 -39 19
6082 19 -60 149 14 -126 17 45 -3 132 49 9 -80 -29 -18 -7 -27 21 -76 -159 36 131 29 14 95 107 66 -122
6108 -122 0 -60 29 45 31 -100 62 -142 45 13 -127 -8 19 -90 277 -12 -36 107 -49 56 36 34 -83
6131 -83 -221 -157 93 22 -95 -28 -149 -134 -151 -16 43 99 25 -37 61 -48 70 19 -55 -92 -89 -164 -64 -95 71 -2
6157 -2 120 51 26 -143 -80 -219 38 -23 -21 137 69 -68 -147 -3 18 -116 -136 -25 -211 37 -168 -43 -65 -55 -68
6182 -68 14 31 -48 67 39 -17 -178 14 -83 -180 -99 126 -4 -48 56 180 -83 12 14 -178 100 184 27 107 9
6207 9 20 42 102 -11 40 7 -44 -222 74 -71 -2 -95 83 -124 -82 29 44 130 33 149 62 95 -14 8 25 -120
6233 -120 99 10 28 22 -112 64 -25 62 -18 -214 -40 -66 -32 -32 -54 -32 58 -22 59 17 81 64 -122 -93 21 36 -83
6260h3P4mP0l3m9n8Q4j99J08OJ17ooj51N2J25r7O5j5j28M3K35j67n2O3n9J57k08
6288a16K65j14p2J01J04j23m4J53j30pq2oj14L06j37j39rM0K59j15j79J88l2l8
6312d1k6RJ68q4o4Q9M8L4j75k0J15R3k18q2J82j34J28j92L91k54K6p3Q3R7j48
6337d8j08J18L14l31R1r9j08K93k15P4n7R4j3J06j23O2Q7p4j76P8M4J60j69J81
6361A81k90N4j5J87o2k07J53k5j4J8J28k16J30r7J08j38J40J7k3j69K66o9r8R9
6385E8n7j5J92j71n0N0J72j49NM2j46o4J86k0k41J27Nj81J67nJ62n5k21K80j73
6410a02L4R4q8N5k6K1N0j09J31p0k3K3P9k40K90o7j35J59K9j60l2J0j27K58m2
6435A2k28K71q9K3j9p2K18r2p0L9N5P8l3R3Kk57Q7q6K09%j89K6P2kj5j9O7q9m2
$$ plain form
6260 -83 -9 -13 57 24 -25 -83 1 -198 -90 -84 33 27 21 -130 -78 47 -50 15 0 -128 -85 150 -17 -69 -6 -65 92 -116
6288 -116 149 35 -37 64 168 45 1 154 24 17 -65 -71 -185 121 -16 -155 -164 -124 135 20 -159 29 -3 -41
6312 -41 -67 -58 110 26 -38 51 99 133 -42 -62 53 146 -72 -154 28 -106 22 -170 221 -33 -7 -80 3 100 -48
6337 -48 -156 -38 276 -55 36 -63 -171 122 -93 -19 -76 18 5 111 -12 50 137 63 -113 -35 9 169 0 181
6361 181 -109 -55 -70 117 55 -152 1 -24 -38 -20 108 -108 22 -75 33 -105 35 52 29 -140 126 57 -41 58
6385 58 1 -14 178 7 -43 7 179 30 35 77 -69 -133 53 33 -208 -81 -76 -257 -90 -95 67 12 -209 71 -102
6410 -102 -68 26 -62 -7 -33 -12 38 -71 60 -10 -33 -10 69 -171 119 52 -83 76 105 -55 -87 -77 -204 54 12
6435 12 -216 55 -34 -11 -30 -102 116 24 -46 -7 48 126 93 186 188 -69 18 -68 141 141 -48 -22 50 48 33 14 81 -8 -50
6464e0n9J00J8n5K00k49L5K25k95J48r3o4Q9j37J61j6qJ84J2l19K08J40l54J78
6488aj51p2K13m7J6J70j37Q8o3j22J30j47J19j15K8O2Q0NJ02j54o1K35j62J73
6512A89k03k7J24o9oJ54k24Q1j69J46m2j70J19K6N2q6K02j19K5j72J75rj44J34
6536a3q5K25j63N3o3K5p3K39J2k02j25R9J74%m2k0K28l64J3K59k6j50N6j09J17
6561F5j21L1R8r3J5o2k4m2Q4q2J35P5j93J11qmL4j21N3k4M5L7o0M5L9oj34l6J29
6590a4n7N5m1J80j72Q6j35p9J96M7Ok2p7L7J8L9j23o2J24n6J12ROjKq5q1J84l5
6619F1l7K2k14J14k2K02k63J10M3j83J07j06K45j78J06O2l1L5o2K7j1k98L05J73
6643B07j25m3r1J78o8j90j24L33j19N2q1R3Qj89J06r0J69ml3j8L5k3qM0q1j64
$$ plain form
6464 -50 -109 -9 9 -46 154 -95 -60 165 -130 18 -75 -139 -50 -187 -26 -42 -50 134 146 -173 35 175 -179 -1
6488 -1 -152 -224 -11 -58 -42 128 -9 79 16 -106 24 -123 -4 -119 -91 -29 51 56 158 4 -57 178 16 189
6512 189 -14 -41 83 14 8 162 -62 19 -150 -4 -46 -216 -97 -71 -19 -105 97 -22 3 -169 6 -3 -147 -13
6536 -13 -98 127 -36 17 -46 -21 -94 145 157 -45 -170 -71 103 103 61 41 269 -95 -82 177 151 1 57 -52 65
6561 65 -56 -25 73 -20 -5 -67 -91 -133 -49 -131 4 79 -114 -3 -11 -15 19 -102 -49 -73 -28 9 -51 -6 33 27 -107 -143 -14
6590 -14 -71 -16 -57 123 -49 37 -98 -177 19 66 72 50 -27 10 28 67 -56 -118 6 -50 62 71 77 76 78 -7 -88 96 61
6619 61 24 46 -168 -54 -76 126 -137 -27 16 -167 -60 -166 79 -99 7 69 38 73 11 38 27 -271 34 207
6643 207 82 39 -52 126 58 -132 -256 77 -42 10 -71 22 30 -159 -53 -143 26 22 -11 -29 6 -17 -25 15 -66 -230
6669b30K15J38p3q8M8Q1qJ8p0l3KO5j80Q9O1j82J74j06J25J53k66M5l4lJ99k80
6695a40J85j63P2NO0q3J09J59j82m9P9k02J86m4K12p1o0o4J4p4l9J19j46Q9K3
6720eN0j41L5q9K15j23P5j10O5o0J11j06L3J13K1j80kK4n2K65j69Q3j13j7J04
6745B7Q6q0R1n2n8J47j68J66J4k32N8m2Nn6P2j0J27n4Oj66K17k46K37j35N3q9
6771h2J28p5N8J93k39q5J05P8j06J74j24o9J51k67P9P2j78nK40q0r8J90j98J78
6795D0N4Pm5N9q2J5Jnj0P0m8jm9L8p2J66j78Q9j43o3J70j70Q2k7J88j19Po2J78
6824I0j36J07m4k32K08Q8J19r2pj63m4J25j83L52k51K39j35K6p1J7Q9q2Nl9N4
6849D0j04P2l8O8k8k68K83j09P2Q6J8M4j99Q5n0P4j52O1L3K07j74m7j47J34L6
$$ plain form
6669 -230 -15 123 50 -38 10 91 83 101 31 -2 0 65 -115 -26 35 -147 27 -79 46 199 -67 -22 -56 -59 140 -140
6695 -140 45 -118 -46 -41 19 -64 45 204 22 -27 52 -150 36 -8 204 133 73 9 23 -51 -90 29 -117 -28 -5
6720 -5 45 -96 -61 -150 65 -58 17 -93 -28 -88 23 -83 -50 63 84 -96 -98 -74 -126 139 -30 53 -60 -77 27
6745 27 113 33 124 72 14 161 -7 159 173 -59 -1 -43 -38 -94 -22 -32 95 41 47 -119 98 -148 89 -46 7 -82
6771 -82 46 -29 29 222 -17 -102 3 81 -25 149 25 -44 107 -160 -81 -9 -187 -192 48 -32 -130 60 -138 40
6795 40 94 101 56 115 33 48 49 44 34 104 56 55 6 44 -28 138 -40 49 -94 -157 13 -157 -75 -102 86 -33 -26 -88 90
6824 90 -46 61 17 -215 -7 81 200 108 101 -62 -106 19 -164 188 -63 176 41 67 -4 13 102 20 25 -14 40
6849 40 -64 8 -30 38 10 -258 25 -84 -12 74 92 136 -63 22 -28 46 -106 -45 -12 195 21 -26 -173 -39 -3
6874cQ5J07k10M6L7m9%j54J25m3O9N3Or4l8R9j36P5J01j14P0l7r9K32M5l29J91
6901C5r2J3M9j33J68O9q4j06J16J31k99j7K42o4L2r8j20J42K7j43Q5k7L0J40j57
6926f1M4j71K70N5j73l3J12J5Lq8J08j5J27j13k0j56J97o7N7k11J23p5Q2Q0j96
6951a06J01ML0q2j6M5J86k24n5k1O0M9P5R0k65Q7J13p3N4o7k23O5J89J69j59j25
6977i9J12q1J1O9o0J25j18L5m1j1L8LO8m1J0l9O5j3j19k1Q0j55J73j6r6N8J12
7004D9j91K04j63J22o4P0m6j21O7J13m8o5J83j77J65K9j49j16J16j1L6J50k65
7027a12J20J46j28P6Kj26l7J0J13j40J68j18Nm2n1n0K10J3k33J16K2q4J18l4j43
7052a79K08j15K2l6J80j23J30Q0j94L8J51k34JR3Q4n5j9lo2KK9O6q7N1pj33O8
$$ plain form
6874 -3 82 189 -21 25 62 13 13 -141 -16 -59 10 63 69 -25 -63 36 -100 -25 76 -38 32 -5 -104 128 173 -156 35
6901 35 -57 -44 5 -128 40 109 25 -81 35 166 -133 -150 92 28 60 -38 -158 -16 11 -132 -47 -74 -44 96 -61
6926 -61 -17 -188 82 137 -36 -69 43 58 61 -27 81 66 193 80 60 -96 101 34 91 -120 3 -72 10 90 -106
6951 -106 -5 -1 29 -53 -69 -24 162 -62 -117 -138 -78 -29 46 136 -129 -42 71 -2 52 -15 -238 -173 16 185 26 -99
6977 -99 13 -68 -57 12 -48 77 -41 -6 -47 -58 -20 -17 51 10 20 -19 46 33 -86 -107 -27 -182 -9 -25 -121 -63 49
7004 49 -142 62 -101 21 -43 27 -19 -140 -73 40 -8 -73 110 -67 98 127 -22 -138 -22 -33 3 153 -112
7027 -112 8 154 26 102 104 -22 -59 -49 64 -76 92 -26 -21 -63 -114 -164 46 59 -174 -58 -36 -120 -2 -36 -179
7052 -179 29 -86 -64 -100 80 -43 87 167 -27 11 162 -72 -71 22 106 51 32 29 -33 -31 -2 64 -23 28 21 -112 -44
7079d4m7j7k7K7J49l8j01K7J5m0Q7Q2k03J79l0N4j6j25j60L15j53P2J8l3J69r7
7105F3P0j39k4o0Q5j77R1J68k25P8nJ11k22J8J18J14P6l37K06k6N3n2J21j29j41
7130a65L09k16lM5mM4m1j41K18j95P2J13j14j3J42n6om2Q9r0j5J24J7j18q8K81
7156A47j06RM5j27mJ32j21K09k54J38Qj83J53p8O2j25J73j89J29q9J24l1o4j1
7180e3q0Q0R6k14O1Q3J00O3j52L6j06J52j47K2N0j83K08P9k17pJ15L5j61P9j00
7205a61K35j25R0n2q2p1J93m3q7J05PJ2j31R4O8J32j73JQ4j80M2lP3m0q1J34q6
7232d5J03l8o6J28r5O1n1q9J16m2J06q6J76j71j2j86O5J88j65n2K0J59j05J29
7256D8J33o7N7qj41Jk1Q3p0n4n2J07j8pj6n0J8n2n2L5J03M1j00K0J72k24J22j0
$$ plain form
7079 -44 -91 -108 -135 -108 41 3 -98 -71 -56 -96 -9 73 -130 49 19 73 57 -68 -228 87 -66 6 24 -9 160 63
7105 63 133 -6 -30 -90 -5 -182 -91 77 -148 -70 -75 36 -186 -168 -50 64 140 -197 9 -17 36 -16 105 -24 -165
7130 -165 144 -72 -75 -30 -34 10 -31 -172 46 -149 -77 36 -78 -91 51 -5 -11 -53 36 -54 -69 55 72 -46 -134 147
7156 147 41 50 95 -32 -36 96 -25 184 -70 68 76 -107 46 -32 30 -95 78 -111 18 -71 53 22 -42 -53
7180 -53 -133 -53 43 -171 -110 -27 73 136 -16 20 -86 66 -81 -59 -9 -192 16 95 -122 -129 -14 21 -140 -61 -161
7205 -161 74 -51 39 -13 -95 -166 27 -16 -103 2 9 21 -110 -16 52 184 11 12 96 -84 -42 -45 28 -12 -93 41 -45
7232 -45 58 20 -46 82 -13 48 -3 -92 24 -18 88 2 178 7 -5 -191 -126 62 -103 -155 -135 24 -81 48
7256 48 181 114 171 163 22 23 2 85 15 -39 -91 16 -2 -9 -25 -75 -57 -109 -161 -126 -23 18 -82 -62 110 -114 8 -2
7284bR0n3q0N5N9P7j83j39J65P2M8p0L3n4j2J6j00N4p9J37k1r4N5kk31J88J11
7311D0o5J05o1o0m3J21j34K46q7j61J07l3K02n6k27J30j05J31j64J24j43J66n1
7334a8L2J03j39j08QN3M5j09L6M5j03K02p8j5L1L3J68k34P1N3k0r2R8r4M8J34
7360A50k92K0P0j49K02m5o7J78o3P6j20OL2O7j13P0r4J50j91K6K49j43J58p2p2
7385C3l5J2n6J96j02n1P4j40K22l11J25j22J10k19J53K12N7k07n8p3K80k2m3j88
7409a53J30N2k0J18j42P1J4j22P9o7J76j19k5K4j9k00PL26j95p6m2R3n1J2J95
7434F6q4Qj36O5j14Q6J00K4j90K29j24J09n5J89k01N9j67J86m6J39k09J56j80
7457i0J9N5Q3q5J10q8j19J13j80J67N1L8j39J20p1r6K7K1q4J16K8k9L8m6N2J34
$$ plain form
7284 -2 88 35 -45 10 69 146 -37 -176 -11 61 109 39 72 18 6 22 -78 -24 -103 34 13 -81 -26 -28 -259 -71 40
7311 40 -25 80 19 -41 -84 37 -97 149 62 -99 8 -25 177 121 -106 24 -81 50 -114 10 -133 33 -18
7334 -18 14 117 -22 -130 -122 -69 -24 -133 -97 -52 -155 47 -31 -46 -15 18 186 -48 23 76 56 -36 62 -32 16 150
7360 150 -142 -122 -52 -201 1 -44 -111 67 4 80 -40 -34 -2 65 -48 22 -72 78 -113 -87 162 19 177 105 33
7385 33 -2 10 -46 150 48 -3 71 -69 153 -158 -33 -155 -45 -264 -111 101 158 -49 -107 -180 100 78 35 -153
7409 -153 -23 29 9 127 -15 56 70 -52 27 -40 136 17 -8 16 -3 -203 -196 130 -65 -141 -183 -90 -141 -129 66
7434 66 -18 -10 -146 -81 -195 -109 -9 15 -175 54 -70 39 -16 173 -28 31 -136 50 4 143 -66 90 -90
7457 -90 -71 -16 67 -18 92 4 -115 -2 -182 -15 36 74 -65 55 -16 -112 -85 -64 -148 -32 -4 -33 5 -41 11 145
7483A45j90R5r8J75k23K45j33j22K60k13j3N2J43r5N0r9p0J25o0n5J35J2J5l9
7507D2r5N0J59l1j24K7m3p6K52r2q7p6J83j26L5l4p5M5N4r1P7l3R1l39J35K13
7533D1K9j81J06n1o4J57p6N7Q9j33L8l2K44k35M3l8n9J52k78K63k17M0J47p3j75
7558b06J70L1j86O2Mn4K38j76J9J63j56k7R0N6J40j79n3K51r0m0J85l20O6p3J84
7583I9J09k77N0n9J28N7j78R1M1j57n6J55N7p8p5J39k0q5J45j24k6J8L1R8M7L3
7609A63n7RJ15j90j18K03kk44p2K46j37m1K32k5q2j06K69k2k83j3K13M3k81J28
7633e2O1q7p5K99k37J93p1j1j41LJ64M7L5j04n0k3J13j94K52l15J08J30q1r4K32
7658A02j25p1Q3j54J51p8J59Oj62J03J03r2p7k6J45k03L24j06j85J33l2J27k09
$$ plain form
7483 145 -45 50 -48 127 -96 149 16 -106 154 -59 -72 -20 123 28 78 -21 -91 34 -26 -81 54 66 81 42
7507 42 -53 -3 156 125 1 28 -15 -91 161 69 -18 -94 89 -37 -2 -36 -111 -66 -12 -103 -26 -59 32 -307 -172 41
7533 41 70 -111 -5 -56 -120 37 -39 18 107 -26 12 -20 224 -11 32 -6 -65 87 -191 72 -145 -105 42 -31 -206
7558 -206 -36 -5 -191 -129 -125 -179 59 -117 -98 65 -91 -118 -28 28 168 -11 -64 187 97 57 242 -78 -12 -85 99
7583 99 208 -69 -19 -78 50 107 -71 20 61 -96 -152 3 60 -18 -93 46 26 -59 86 -38 -64 -46 -15 83 130 163
7609 163 106 115 230 40 -78 125 123 -121 -193 53 -84 -125 107 82 0 -106 163 141 -142 -155 58 101 -180 -52
7633 -52 9 -78 -153 146 -91 102 31 20 -121 -118 46 93 128 24 -26 -49 64 -130 122 -193 -85 45 -36 -130 102
7658 102 -23 -94 -11 -165 -14 -92 67 73 -89 14 117 25 -52 -78 67 -136 188 82 -103 30 -2 125 -84
7681h4n2LJ6P6r0mJ14J8K9r8j11K07p2k8K3J34o1k8J9j34J11R8J04j25j97KO6
7708f4j32L33j10o4P1j44K45q1k05m3J40K4k9o5R8J92j65l5l0j3M4k7r2K15j48
7733h5o5J07L8Q7qj15J83o4M5j18N8N5o2M3k53K08p1j5J10l5j67J72n2j22J77
7758E1P0k21R3j8L2K1j15R9q1J88o9m5L2P3M5m02J92P9j98J23K8Q8q6K10j28k95
7784b34J76J94r2M2k1o9m9Q9l7L3r3O4O1p0K05j79j05N2P6j0P0j13K6R7j05O2
7810G0M1k82L04k27J03q8J22J4jk23J09m4J14J5M6j19n0R8l4N1p3j1L4J92N6q0
7836A37r3M0qq7P9O9l53K57k0J25j87j3M1J10m7L5k45L2o4J47J07j43K6m5k5J41
7862A6R2l1l0j08r1Q4J23r0RQ5M8l3J17k14J53j28p3n6K07l4j32k3J1J44k41K59
$$ plain form
7681 -84 -136 -133 -117 -41 -131 -135 -21 -3 26 -72 -183 24 -48 -76 -53 81 20 -8 11 -123 -12 86 190 65 -132 -130 -64
7708 -64 -196 137 27 -37 34 -110 135 54 -151 -194 -54 -30 -59 -124 -26 166 1 -34 -64 -77 -33 -60 -152 63 -85
7733 -85 -150 -43 -5 82 74 -41 142 78 123 5 63 118 56 99 -154 54 -17 -32 78 43 -124 48 -4 -126 51
7758 51 121 -100 -7 -25 7 28 -87 12 -69 119 50 5 37 110 155 -247 -55 24 -174 -51 -23 65 -21 189 61 -234
7784 -234 -58 136 44 86 65 -4 -53 36 -1 32 -61 3 64 -6 199 20 -85 -33 43 33 103 -10 16 113 8 70
7810 70 111 -171 133 -94 9 -79 43 57 56 -167 -58 -102 12 27 73 -46 -96 2 -32 19 -54 -65 -31 161 217 137
7836 137 44 84 76 -11 68 137 -216 41 21 146 -41 -54 -13 97 50 85 -160 -128 -192 -45 62 -81 -55 -100 -125 16
7862 16 108 77 47 -61 -152 -68 55 -35 -26 59 107 74 191 -23 130 2 -71 -127 80 46 -86 -109 -98 46 -195 64
7888F4j73J04O2k05K47j97P6k9j0J13j71K38j58N8QP1q4P3q2J36k51J09j17J7
7912a01O1J2kJ33j65L3K1j20J72j30J42j16K5Q0P1k22K30k4L3j03M6k5p4K2J16
7937A15k46J90k05K1J94j07O0p1j14J67Q5o5r5P0p9J44n1m2j93R6K01q7N0J49
7961A87l17J17J73l79K81N5j97l0L14l9j15r4O4o8n8K40l99K66q8J96k06J17k1
7984ar3J22k85L09M1o4j86M9Q6Q8j65J39J3j16N7n2r2KK48j33J18j49J1R3k13
8009a73R4N3J85k02N6q1R8n5j06J36J0p3j71J88O7j3L5jj85J54l0r4K61J4j81
8034a4J06j6Rk38J29L01k36j04KK29j80p7Q5K7j32M6K1L3L3j45P2P5l7jj46R2
8060f6J43j53K97j80L5j50O5M4k7M2m0J5j75M7j25J72o9K35j48R8m4q6p3QJ85
$$ plain form
7888 64 -109 -5 57 -148 99 -98 -22 -51 -61 52 -119 119 -39 19 27 98 14 87 5 141 -110 -1 -118 -101
7912 -101 -40 -28 -30 103 -62 -29 -8 -128 44 -86 56 -60 -35 45 116 -106 124 100 133 30 76 51 -23 -1 115
7937 115 -131 59 -146 -125 69 -38 22 -49 -163 4 89 24 -71 -1 -80 64 13 -29 -222 -126 75 -12 38 187
7961 187 -130 -13 160 -219 62 117 -80 -110 204 165 50 -44 20 -48 -106 134 -265 1 -87 109 -97 20 -1
7984 -1 -94 28 -257 52 93 29 -157 -108 -22 66 -99 40 53 -63 -6 -58 -150 -148 100 -33 85 -64 -53 40 -173
8009 -173 -79 -26 159 -43 13 -68 30 -25 -131 5 15 -58 -229 -41 26 13 48 47 -138 16 -14 -108 153 167 -14
8034 -14 92 76 85 -153 -24 277 41 -63 -61 168 -12 -89 -4 23 -109 -63 -42 -9 24 -121 -49 26 -11 -12 -158 -66
8060 -66 77 -76 221 41 76 -74 -9 35 8 50 10 25 -150 -103 -228 -56 -125 110 -38 60 16 -70 -143 -135 50
8085E0J1q7j25K17L9Q1k60K55k4j80N5J47k40J42j08P2kj34O8K2k0M1J6J6p6J1
8111a3J19k17J56j15J49m5o9j06m1L68l16m8Q2J34M9Ml3j07J18j07j2J90k3j6
8135A01N7j31j52J51R6j18J0k5j03L3P6J37k08J48Rj39o1O5K17k82J41o4l0J55
8159H3k13J61or9P2N4P4j63J07qn3j66K29p2Q0k44L59j20j16J56k30m0K97j57
8183a5n7K89r7J8p4p7P5q1
$$ plain form
8085 50 61 -26 -151 66 105 186 -74 181 157 -23 32 179 -61 81 -27 45 43 -91 -23 -1 -21 20 36 52 -24 -13
8111 -13 106 -111 45 -70 79 34 -35 -141 -182 186 -130 -178 -96 38 87 91 58 -49 69 -38 -50 140 117 101
8135 101 158 27 -125 26 122 4 14 -11 -114 -81 -5 132 -76 72 81 -58 -119 -54 163 -119 22 -42 -72 83
8159 83 -130 31 25 -74 -2 52 126 -37 70 62 9 -157 72 0 80 -164 195 75 -41 115 -115 -155 142 -15
8183 -15 -72 217 120 138 64 -13 62 -19
8191a9
$$ Imaginary data points
##PAGE= N=2
##DATA TABLE= (X++(I..I)), XYDATA
0@%%%%%%%%%%%%%kJ0j6J6j6J6k4L2l2M0m8N5o3P2q7R9j11J27j44J63j84K07k33
36a23K61k93L27l62M01m46M95n47O03o64P33q08Q91r81J079j190J313j450J604
55H43j781J983k215K489k816L212l705M342n192O381q167J1119j6807L1384j30291
70a09221k53687M52405J79936k78423k1554J27368r4376K7237J46613j40569j59264
81a23535J83362N4227j99755P761J17784k0693J4476k1986j07909P6857J47480
92A28069j22521j49766J18289O6665j27534L5612Q7508j00566L5450J38806j24178
103a4166q0183J90394L0278j72261K0148Q7747r8543R209J52821j27917j79528
114a82001J75734J27380j48841m4580P6334j3806J482N9164k6074n6568M7020
$$ plain form
0 0 0 0 0 0 0 0 0 0 0 0 0 0 0 -2 8 -8 8 -8 8 -16 16 -16 24 -24 31 -32 40 -47 52 -59 68 -76 87 -97 110 -123
36 -123 138 -155 172 -190 211 -235 260 -287 316 -348 385 -423 468 -513 566 -624 689 -761 843
55 843 -938 1045 -1170 1319 -1497 1715 -1990 2352 -2840 3541 -4626 6493 -10314 21070 -109221
70 -109221 -362908 89497 269433 -8990 -30544 96824 2448 29685 176298 35729 -123535
81 -123535 59827 114054 -85701 -77940 39844 19151 33627 11641 -96268 -19411 128069
92 128069 5548 -144218 -25929 40736 -86798 -51186 36322 -64244 -28794 110012 -14166
103 -14166 -94349 96045 126323 -45938 -25790 61957 -36586 -27377 125444 -2473 -182001
114 -182001 -6267 121113 -27728 -72308 4026 -9780 -8298 50866 24792 -31776 15244
125A5244L1676m8726J851J985k6132N3017j6344j02845Q4200J16854j18607q3656
137i1483J33745M3621j25575J212P6096p0051j9902Q0581o7478n0095J26291J3560
149E0522j08898L1790Q2278k9085j8600L2669m3785k4877Q4339j7569q9602N7910
161G092L1885q5326K4153O5998n2278k5476M4677k4609j8572Q4736j0266j19720
173g7706N4702J01212r5671l6451R4751m3422o2175R2526K2010r3025L3951Q6782
185G7484p3994m8143R5140j8070q5486N8467J7819q1696K9280N3010n0340n608
197c2137N5742k9778l4589P5465J2420q3820L5532N5734p2460Q03P3631m6385
209A0158m5171N5513M25m8222M1235L1229p9996o527Q8913l1024n9281N0501k659
$$ plain form
125 15244 46920 -1806 45 2030 -24102 28915 12571 -90274 -6074 110780 -7827 -91483
137 -91483 42262 85883 -39692 -38480 37616 -32435 -52337 28244 -39234 -89329 36962 50522
149 50522 -58376 -26586 55692 26607 8007 40676 -3109 -27986 56353 38784 -50818 7092
161 7092 38977 -46349 -22196 43802 -8476 -33952 10725 -13884 -32456 52280 42014 -77706
173 -77706 -23004 78208 -17463 -53914 40837 -2585 -64760 27766 49776 -43249 -9298 77484
185 77484 3490 -44653 50487 32417 -53069 5398 23217 -58479 -29199 23811 -26529 -32137
197 -32137 23605 -6173 -40762 34703 47123 -36697 -1165 54569 -17891 -17088 56543 10158
209 10158 -35013 20500 20925 -27297 13938 45167 -34829 -41356 47557 16533 -42748 7753 5094
222E094m8507M3883J7139o2674R211O1064k6018l9675N0891J7926l9800K8572
234A7106J5049m7801K5558L4493n1177r739M2297k0113l0869L4436J1976m2373
246b1157J5903L1118m5236K142N1617m1490l1709N2009k736m0696K5388K1170
258A6323l7126L41M3676k1657k5907M4291o341l7673M1981J0790m9897J7748L1990
271B8539l3462j2072L3645j3057k9175L7617R426n1202K6499L9961n2010m651
283a9942M9741k8785k8445M1721l57m5275K4410L6531m7652j1177N8453k4363
295D860l8964N0818L046m6056K8655K3254m0528J624M1609k3441l2422M3630O409
308B2494m8347K7880K7428m8284O780L8959l1770j6564L8438p580l6991K5911
$$ plain form
222 5094 -43413 470 17609 -45065 -35854 25210 -808 -40483 10408 28334 -11466 17106
234 17106 32155 -15646 9912 44405 -6772 -16511 25786 5673 -25196 9240 21216 -21157
246 -21157 -5254 25864 -19372 -17230 34387 -7103 -38812 13197 10461 -30235 -4847 16323
258 16323 -20803 -20462 23214 1557 -24350 19941 13600 -24073 17908 28698 -21199 -3451 28539
271 28539 -4923 -16995 16650 3593 -25582 12035 21461 -29741 -3242 36719 -15291 -19942
283 -19942 29799 1014 -27431 14290 13933 -31342 -6932 29599 -18053 -29230 29223 4860
295 4860 -34104 16714 19760 -26296 2359 25613 -14915 -13291 28318 4877 -27545 16085 22494
308 22494 -25853 2027 29455 -18829 -12049 26910 -4860 -21424 17014 9434 -27557 -1646
320a646K4826m3515L14M4759l1134k2098M6769p749l4295K9134J3826l1821O188
333f442L0506k1380k0012L5269k918l4666K7261J2186l6598J2964K1449k7207
345i588m173K5358j0094j9716K0176Q431k8035J2821K2770l0758o86L0985k0706
358c215j2802K7328n027k0170J6105J3071k1538j04K5244j6813j4366K8658q934
371G437k3779K6046K561k8038J1950J6304j8358o004K0509o322j7857K2617L699
384A0765k9921J9027J8497l2848K577K7075j8364j2359K3106j396k2745J6719
396A33J8945k9514K95L3919k1862j6816L3132p886k5945K2963R150k9009L214
409i281K7184j7880j9565K9945r30k9746K3617J1477l3059J1001K2589k5150q141
$$ plain form
320 -1646 23180 -20335 -20021 24738 -6396 -28494 18275 10526 -23769 5365 19191 -12630 -6442
333 -6442 24064 2684 -17328 17941 15023 -19643 7618 19804 -16794 -3830 17619 -9588
345 -9588 -13761 11597 1503 -18213 1963 10394 -17641 -4820 17950 -12808 -13494 17491 -3215
358 -3215 -16017 11311 6284 -13886 2219 15290 -6248 -6352 18892 2079 -12287 16371 7437
371 7437 -16342 9704 12265 -15773 -3823 12481 -5877 -11881 8628 2306 -15551 7066 10765
384 10765 -19156 -129 18368 -14480 -11903 15172 -3192 -15551 7555 6159 -16586 133
396 133 19078 -10436 -10141 23778 1916 -14900 18232 10346 -15599 7364 16514 -12495 -9281
409 -9281 17903 23 -19542 10403 9473 -20273 3344 14821 -18238 -7237 15352 -9798 -17939
422a7939K6994n196k4866K0048J7397k9172N053L0028k3099r347L0483j0897k0224
435a0737K0966O079k3752K482J9440j6491j2503K4688p655k2517K5014N520k7738
448a7204J1198J6522j7100n172J6357m782j4175J6559P512k3805R092K1702j7958
461a254k849J6789r312l708J3749o472j4083J0046J0416j7943o134J7690q418
474a483r464J6018p497j2162J7926L116j5095K545R740l166l272N760o599o298
488i931K0235j549k4901J4462J7750j5928k553R237n042p13Q810n253j5285R613
502a048J3225j8367m411J4308r143Q73J3884j5575p023K2889J996k2182J962J9292
516A0680r478j1356J6337o085j3642K2200J215k4287J1702J7102j3798o241J2414
$$ plain form
422 -17939 9055 3859 -21007 -959 16438 -12734 -7681 22347 -752 -10099 20384 9487 -10737
435 -10737 10229 16308 -7444 -4962 14478 -2013 -14516 10172 2517 -20000 5014 10534 -17204
448 -17204 -6006 10516 -6584 -11756 4601 -181 -14356 2203 9715 -14090 -4998 16704 -1254
461 -1254 -4103 12686 3374 -334 13415 6943 -7140 2906 13322 -4621 -10755 6935 -1483
474 -1483 -10947 5071 -2426 -14588 3338 6454 -8641 -6096 3644 478 -2794 2966 -3633 -9931
488 -9931 10304 8755 -16146 -1684 16066 138 -2415 6822 1780 1067 9877 4624 -10661 -1048
502 -1048 12177 -6190 -10601 3707 -5436 -4563 9321 -6254 -13277 9612 11608 -10574 -8612 10680
516 10680 1202 -10154 6183 98 -13544 8656 9871 -14416 -2714 14388 590 -5651 6763
529F763k073r953J3377J360k3844J1746J9915k3233o805K0727o614r762J2286
542C890J212j4348N683J5452j4315r673J7317n071j1033J5485m669j4201J7331
555C060P981j8189Q14J9240n311j6056J4397P466j9426O470J1578j7237J013J4705
569A0505r943r187R497L527q386R51N582r804J806J4065j3818q130J7412k882
583A195j0698Q228L093o160K684O334l977k609J1166l010j0803J2790K682j4714
597c799N588M438r144L194M567q608l756J0889K608j4814K529J1515r305p30P547
612B719r322L64J0198n936l811P315J058o248L935Q343r454k946J5026p734j0273
627f766J5633j255j4206P139O150q888j903Q279m439q929J1901L145j5807P444
$$ plain form
529 6763 4690 -5263 8114 9474 -14370 -2624 17291 -5942 -12747 7980 1366 -8396 3890
542 3890 5102 -9246 -3563 11889 -2426 -12099 5218 147 -10886 4599 -70 -14271 3060
555 3060 11041 -7148 -6334 12906 7595 -8461 5936 13402 -6024 446 12024 -5213 -4200 10505
569 10505 562 -8625 872 4399 -3987 -3036 2546 -7258 -5452 8613 -5205 -13335 4077 1195
583 1195 -9503 -1275 1818 -4342 -1658 4676 699 -1910 9256 6246 -4557 8233 10915 -3799
597 -3799 1789 6227 -2917 277 4844 -3764 -7520 3369 5977 -8837 -6308 5207 -4098 -4828 2719
612 2719 -6603 -6239 3959 -1977 -5788 1527 2585 -3663 272 8615 -839 -3785 11241 3507 -6766
627 -6766 8867 7612 -6594 545 6695 -2193 -4096 4183 -256 -9185 2716 5861 -9946 -2502
641b502R480j3598K715J0295j0660m146J2445J032j2347L060J1524q153j973J0967
655H139r746m252J6059n028j2213R148M949q783m09Q052n056p523J1172j147j3164
670i802J1300N046j5548L530J1040o646m600N756R45n774M583N700j0947R37J2313
685G833q003l296R222m545l234P488q33o354J615N876m346m940P742l357p667
700f799R523k22r091M831J529m766L231K922l827k844O630K612p725L879N218
715E101q381K877O210o746P77M183m114l53N030K00o509N22P609n866l621O834
731C753o015l136Q992m747o244O309K294m490l66N820k442m893R164j82j0053
746f236P922L731r835M184N383o847j445O390J17n768L776M905r279J969J0015
$$ plain form
641 -2502 6978 -6620 -3905 6390 -4270 -8416 4029 5061 -7286 -4226 7298 -855 -2828 8139
655 8139 -1607 -5859 10200 5172 -7041 2107 7056 -1727 -2136 5916 860 -6663 4509 3362 -9802
670 -9802 1498 6544 -9004 -5474 5566 -1080 -5680 76 1021 -4753 -170 5530 -5417 -4480 7833
685 7833 -170 -3466 5756 1211 -2023 5465 4632 -1722 -107 5769 1423 -3517 4225 868 -6799
700 -6799 2724 2502 -6589 -1758 -229 -4995 -1764 1158 -2669 -5513 1117 3729 -3996 -117 5101
715 5101 -3280 -403 5807 -939 -162 4021 -93 -446 4584 4784 -1725 -1203 6406 540 -3081 3753
731 3753 -2262 -5398 3594 -1153 -7397 -1088 1206 -3284 -3650 2170 -272 -5165 3999 3817 -6236
746 -6236 1686 5417 -4418 -234 5149 -1698 -3143 3247 3364 -2404 1372 6277 -3002 -1033 8982
761H982r853l832R769m515n430N637M98n888O58O924l936m745R235j902q504R607
777B705J654j0221M036N173m888j770M468Q16n119N035M202q662L134Q328q381
792E10j074O791m684l706L368O37m468q67M443l812l196P763k500n747P403k85
808E76m579M708j5l060P91L054m38l759M045K834n285L672L337n636K982K311
824E538m939Q39J201k636k050L91J676m001p79M659l862m04N608m237o3N521l074
841f12j130L110J93k051k61L916j777l533O288j282m674O421p76n345M464Q42
857C793m619m24K404j547m783L280K619p092L150N579o970J737O117m173r83M076
873B164l8l602J369M326m982k492P994l614m885P458p52n095M453J029l772M7
$$ plain form
761 8982 -871 -4703 5066 551 -4879 758 1256 -4632 -3974 2950 -986 -5731 3504 1602 -6902 2705
777 2705 4359 -5862 -1826 3347 -1541 -3311 1157 1973 -3146 1889 6091 -2571 563 8891 510
792 510 -564 6227 1543 -2163 1205 1842 -2626 -3493 950 -2862 -6058 1705 -795 -6542 861 576
808 576 -4003 705 690 -2370 -1579 1475 1037 -2722 1323 4157 -1128 2544 5881 245 3227 5538
824 5538 599 1438 2639 3 -2047 -1656 20 -3981 -4760 -101 -3963 -4367 1241 -2996 -3059 2462 -612
841 -612 -1742 1368 1561 -490 -751 3165 1388 -2145 4143 2861 -1813 4608 3832 -1513 2951 3793
857 3793 -826 -1250 1154 -393 -5176 -1896 723 -6369 -3219 2360 -4610 -2873 3244 -929 -1912 2164
873 2164 2126 -1476 -107 4219 -763 -3255 4739 1125 -3760 3698 2946 -2149 2304 3333 -439 -392
889c92L473j582n467M734J851p924L550M379o954J602M870l401j286L103J127
904A683l186J02M094m045j210O309m426l012O903j647l475L179J193j282o06K117
920B691l43l769L592O00n820L137J403m406K317O84k956J286J214k30k026O35
936a991L277l142PL581l475P24M032m017M32L085j283n3j51Q61J03j138J836j970
954G18k004M437k757l203M140j897k159K554p71j566K34J541M96k985K466J975
970A219l864L272J618m590L474K294m005M84K214j39k599N67L156l609r01M848
986C439l896j414M768k742j837K760p38j737L2J786j589k843M570j63m814M661
1002B43J395m276K770K169k514J01J421K25k510J085K735m259j23M939l456p32
$$ plain form
889 -392 3081 1499 -3968 766 2617 -5307 -1757 2622 -4332 -2730 2140 -1261 -2547 556 1683
904 1683 -1503 -1401 2693 -1352 -2562 3747 -679 -3691 3212 1565 -1910 1269 2462 1180 574 2691
920 2691 2348 -1421 2171 2771 -3049 88 1491 -2915 -598 86 -2870 -1584 -370 -600 -2626 -1991
936 -1991 1286 -1856 -1849 1732 -1743 -1019 3013 -1004 -572 2513 1230 1177 1026 1887 1990 852 2688 718
954 718 -1286 3151 394 -2809 1331 -566 -2725 -171 -942 -2508 -2274 -733 -237 -3222 -756 1219
970 1219 -2645 627 2245 -2345 1129 3423 -582 -98 2116 1977 -622 -55 3101 -508 -1409 3439
986 3439 -457 -1871 2897 155 -1682 1078 340 -1397 -1365 421 -1168 -4011 559 396 -4418 243
1002 243 1638 -2638 132 2301 -213 -112 1309 1534 -976 109 2844 -1415 -1538 3401 -55 -787
1018g87L598k282l22K008r56j031p37J650j618l254L515o54m241L780L54k493
1034c470K609N24l59R01L05J448j213J35J930k625J009J868l937J410K735k539
1050G31K42M11l8R1j395O85r15k276J652j767j775K568k073j08K626j195Q44K383
1068F91j9P39J98J458O58k774J718J78l134K389l42l252J944O04j230L52k23L88
1086C43q92j44J239l575J60L044l999k87L583j802L60J907P52K78J02K628m30
1103C267k272K820n89m031K745j342l036K152m1j840K69J921Q37k427J423L051
1119B907l606K47K762l584k30K154k295k29P60J104m09m05K845n53j907L694j425
1136A830l069K419r98k234Q34k97n56j72J341J485j574J997K813k819J229J923
$$ plain form
1018 -787 2811 529 207 2215 1259 228 -509 1141 -477 -3731 -216 -870 -5111 -1331 -977 -3470
1034 -3470 -861 -337 -696 205 510 1958 745 880 2810 185 1194 3062 -875 535 3270 731
1050 731 973 1384 1346 1437 42 727 -188 -2464 -812 -2579 -4354 -1786 -3859 -3967 -1341 -2536 -1692 691
1068 691 672 1411 1609 3067 3725 951 2669 2847 -287 2102 1760 -1492 452 1056 -174 178 -45 343
1086 343 -549 -693 546 -3029 -2869 175 -3824 -4111 -528 -2330 -1970 -63 689 967 1069 3697 3267
1103 3267 995 3815 3226 -805 1940 598 -2438 -286 -327 -2167 -1898 23 860 -1567 -144 2907
1119 2907 -699 -452 2310 -1274 -1504 650 -1645 -1874 -1114 -10 -419 -824 2021 1468 -439 3255 1830
1136 1830 -1239 1180 182 -2052 -1218 -1515 -2071 -2243 -902 583 -991 1006 3819 1000 2229 4152
1152D152k892K15Q9k011j85r29k50l61q83K107o05r07L067j001m96K485j870l97
1170f72J110j248N06k30k04J309n49J917R08j692K543K12k397J885j353k313L82
1187A14j868r75k85j011M15o59J118K018j469J769K774k097J433J610j957J51
1203A081O85m39m00l66J381j252m17L349j960j625L175j794k309J198j123j658
1219b474j114J14J72j820J714J996k070K938K425j850K328J558j596L50K94m03
1235B562j388j113J731k046j348K868j804q60K859j257j110J292k19r44j133P03
1251a207O5k591J831J053k230K296J550r57J744J073m20M07n42N66j587j218J213
1268A046k163j184J974j467k50J853o74J033P41m20Q11p69L51K29k210J184k33
$$ plain form
1152 4152 1260 1475 1564 -447 -632 -1561 -1811 -2172 -3055 -948 -1553 -2460 607 -394 -890 1595 -275 -672
1170 -672 438 -810 -304 -534 -738 571 22 1939 2847 1155 3698 3910 1513 3398 2045 -268 114
1187 114 -1754 -2729 -3014 -4025 -3610 -4269 -3151 -1133 -2602 -833 1941 -156 1277 2887 930 1081
1203 1081 1766 1327 927 561 1942 690 273 3622 1662 37 3212 1418 -891 307 -816 -2474
1219 -2474 -3588 -3474 -3302 -5122 -3408 -1412 -3482 -544 1881 31 2359 3917 2321 2671 2965 2562
1235 2562 1174 61 1792 -254 -1602 1266 -538 -1398 1461 204 -906 386 167 -777 -1910 -1207
1251 -1207 -1142 -3733 -1902 -849 -3079 -783 767 -190 1554 2627 2207 2614 2072 2638 1051 -167 1046
1268 1046 -1117 -2301 -327 -1794 -2044 -191 -865 168 909 489 1300 531 882 1111 -1099 85 -148
1285a48j849J517n3q81J593l08L10Q26p80N90m4p79O18j834J40R13k065J259O97
1304b78r13J754M50n4J447q4k25m9p40N03j800j137J433k099p70J729j437L8J472
1323g60j69L40Q0O37L49j398J508Q7k295K188L52j783J635O08m77P43M07N08q20
1342A740m06J069k460n31J261k875n43J609j634j86R88K86L82j82J650M80j220
1359e72K131K4j845J975l24j593J258J94l70m8M9J156j358n5J550k287j56J135
1377H64k340j33N61j250K87J71L31M66p46J633O24j095J834K9r55J421p12n21
1395D69P14q81L75k30m25R91j171L36R40j384O22L51j264P23l13j253J013m55
1413h42n03P25n94P39j98j15J468p96j03J415j175J48R38j476P26K98p87M64m18
$$ plain form
1285 -148 -1997 -480 -533 -1414 179 -129 181 1007 227 817 773 -6 612 -1222 -1082 -169 -2234 -975 -278
1304 -278 -1191 563 1013 959 2406 2322 2097 2048 1308 1811 11 -1126 307 -1792 -2562 -833 -2270 -2232 -760
1323 -760 -929 -589 -509 128 477 -921 587 674 -1621 567 919 -864 771 1379 902 1645 2052 2560 1740
1342 1740 1334 2403 -57 -588 673 -2202 -2745 -1136 -2770 -2956 -1968 -1682 -1300 -1482 168 648 -572
1359 -572 1559 1583 -262 1713 1389 -204 1054 1248 878 830 879 2035 677 622 2172 -115 -271 864
1377 864 -1476 -1609 -1048 -2298 -2011 -1840 -1509 -1043 -1789 -156 468 -627 1207 1236 281 1702 990 469
1395 469 1183 302 677 447 22 1013 -158 178 1118 -266 356 707 -557 166 -147 -1400 -387 -842
1413 -842 -1345 -620 -1214 -475 -673 -788 680 -116 -219 1196 21 169 1107 -369 357 655 -132 332 -86
1432h6N80J87r23J545k54j388J492o83p64R74r57k88K0k01L30q19L80J074j759
1451a540O68J459j623O07J037q97M11P7K95M7n22J109k82j168J881p01j290J796
1469A364q05q90Q69l72l13k14j42O11j423L53R68j748Q73J080j431O16O13n47
1487e38N12K21L46K3n75J407m71r61J384q28o96J352j118Q6jj80K10m84k0P00
1507C69j256N85M91j009O52j69p17R68m41l10P71m28L18L69m33R45l04j58J020
1526A263q56L61J68j228Q46L38j377R53k25k72K65n45P77l35o15J325j177n61
1544h95R76j042j81Q91r21K6K85O0M88j01Q28M89j128J199N64j411J236q7j080
1563A96L96K3j97j31n09J055q98l46J179j095m19J007j168j47M43p71J1L4L91
$$ plain form
1432 -86 494 681 -242 1303 1049 -339 1153 470 -294 680 -277 -565 -545 -746 -416 -1235 -855 219 -1540
1451 -1540 -872 587 -1036 -429 608 -289 122 199 494 541 19 1128 846 -322 1559 858 -432 1364
1469 1364 559 -331 538 166 -147 -361 -503 108 -1315 -962 6 -1742 -869 211 -1220 -604 9 -538
1487 -538 -26 195 541 564 -11 1396 925 -36 1348 520 -176 1176 58 144 143 -37 173 -311 -331 369
1507 369 -887 -302 189 -820 -168 -337 -1054 -86 -527 -837 -66 -494 -176 193 -240 705 401 243 1263
1526 1263 407 768 936 -292 554 892 -485 468 243 -29 236 -309 468 133 -482 843 -334 -895
1544 -895 81 -961 -1142 -251 -1172 -1146 -861 -801 -313 -414 414 903 -225 974 1538 127 1363 1276 196
1563 196 592 615 418 287 -222 833 -65 -411 768 -327 -746 261 -907 -1054 -611 -1382 -1371 -1337 -946
1582i46L88o73J324M97q94J332O27r89O91J55m67J47o47L11p42m20J006j130l15
1601g45J150r25j19P52p19J63j65m23N29p33Q0O89r14J090L24m11J079J16k42
1620E76P92l56L20n5r07O63o40p49O41o20k50O91q56M19R9m42R47n55j52O30j028
1641h32K56M41p24O37j07k39P62l40K77Q77q46N96L49p75L89l60l59K97o36M45
1661A08j86q04J175k48o37J089j63m75N54l93J21o01l19O34p36j58J028j142M01
1680g52R31p78O81K88j01K88k91N88L2j011J002m06q72J169k54p56R04k52k17
1699A93j31J86Q0p96j61R38j367q1Q86j011J48N98k73M81O7K43O86o91R27k8p82
1720A12J047j57j017J132n78l67L53m80M17l41l90N66q58M0O01j059K20L69q42
$$ plain form
1582 -946 -558 -1231 93 590 -304 1028 1655 666 1357 1512 1045 1192 545 856 114 -306 700 -430 -745
1601 -745 405 -520 -639 113 -606 -443 -608 -1031 -502 -1235 -1155 -466 -1380 -290 34 -377 702 818 576
1620 576 1368 1012 1332 1277 370 1033 393 -356 285 -335 -585 106 -750 -331 -232 -674 273 -282 -434 196 -832
1641 -832 -576 -135 -859 -222 -329 -568 194 -146 131 1008 162 758 1107 332 721 361 2 299 -337 108
1661 108 -78 -882 293 45 -592 497 334 -141 413 20 141 -460 -779 -145 -881 -1039 -11 -1153 -752
1680 -752 179 -599 82 370 269 557 266 854 886 -125 877 471 -401 768 514 -242 662 410 193
1699 193 62 248 328 -468 -629 309 -1058 -1139 -253 -1264 -1116 -518 -791 -310 -243 0 686 -5 922 894 112
1720 112 1159 1002 -15 1117 539 172 525 45 462 121 -269 297 -561 -521 80 -979 -759 -390 -1232
1739a232N30k7k69O71j84L59N23p07Q83J70l51P69n46j02M85n42p4M36q61O04
1759E35m55l75M77l63m4K52o53M19k01o66R05l89k89N92m69M62K80l70P62l67
1779D3P6M74n80M76M28q19P58j58q00P32l78k93J91l75N84m97m19Q72o60k01O57
1800A11o43k92O00m47JK45PM01m96L27M95p93Q37L58p43P67L3k86K46q6j48J41
1822F35p81Q54m28n30P32n82m11P32r36K63K54l53M03m12m8L32n54N76L60o91
1842e85P21J77m16N14k39L57Q7l35O40j22q67R09n10m77P44p38P4n3j70K26j84
1863b47n86Q31n00o1N09n09L03P7l62O78j80k12N80l19L15L08n63M16R4m22M64
1884F14k91J10K46q79M43j32n62M73k44k36N31m37J5K8j30L18j84m05R33o42J20
$$ plain form
1739 -1232 -702 -729 -998 -327 -511 -152 371 -336 547 717 366 1135 589 487 972 430 356 792 -69 535
1759 535 80 -295 182 -181 -225 27 -626 -207 -408 -1074 -169 -558 -847 -255 -724 -262 18 -352 410 43
1779 43 119 593 13 489 917 98 856 698 -102 630 252 -41 150 -225 359 -138 -557 315 -345 -546 111
1800 111 -532 -824 -224 -671 -670 -425 -418 -17 -513 -186 309 -484 353 711 -32 735 768 482 728 642 494 635
1822 635 -146 708 280 -250 482 -100 -511 221 -715 -452 -198 -551 -148 -560 -608 -276 -830 -254 106 -585
1842 -585 136 313 -103 411 172 529 616 281 921 799 -68 841 331 -146 598 -140 -66 -119 -289 -63 -247
1863 -247 -833 -2 -502 -563 -54 -563 -260 -183 -545 133 -47 -259 321 2 317 625 62 478 572 150 614
1884 614 323 433 679 -200 243 111 -451 22 -222 -458 73 -364 -349 -321 -451 -133 -317 -722 211 -431 -311
1905c11L74p38O78Q7j45K60j22Q2N59n02K66K92o95N01o0o85O79m48k55K50n93
1926e26N17k48k49N74m96j24O48o79J56K70o80N13J47L4L07l69M11K86m34O18
1946F76R1o92P18j34l58K03l72O3j83l81L81m16k43N04m23p1O11p21L83P4l17
1967f07L97j83L7M97o58O43L53m79Q02k13j60M07l35M6L32o08K18l00m65M15m58
1988c19j58M67n12N2K98n43N28j28l78Q71p06J60L16m04M52K2r4N48m05J53N92
2009H12m74K55Q6n10L73m0l98R5l69P1Q5m98L75n6n04Q27m25k07O82o90J71K65
2031g4j44J64j03k15Q29p28J70P05p68M86K53m05L05j8j32Jk62K31j03n20O27
2052B99m40l39O91n24p4L27k81Q0j05j28N10n17L20K76q17N47L76o82O93J04j72
$$ plain form
1905 -311 63 -675 3 90 -55 205 83 165 724 222 488 780 85 586 526 -159 520 72 -183 67 -526
1926 -526 -9 -257 -506 68 -428 -552 96 -583 -427 -157 -837 -324 -177 -143 164 -205 206 492 58 676
1946 676 767 75 793 659 301 504 132 195 12 -369 12 -404 -647 -143 -566 -637 -26 -747 -364 -290 -607
1967 -607 -210 -393 -356 141 -517 126 479 0 802 589 429 836 501 547 879 271 489 189 -276 139 -319
1988 -319 -477 -10 -522 -470 -172 -715 -187 -315 -693 178 -528 -368 -52 -456 -4 18 -76 472 67 220 812
2009 812 338 593 679 169 542 502 104 199 -170 -99 -14 -512 -137 -193 -697 130 -295 -502 180 -510 -339 -74
2031 -74 -218 -54 -157 -372 457 -271 -101 604 -164 322 575 170 475 457 325 326 64 295 192 -328 299
2052 299 -141 -480 211 -313 -387 -60 -341 -261 -366 -494 16 -501 -181 95 -722 -175 201 -481 212 316 144
2073A44L89k02O7L62p00N36l82l6M59n78r3L07n52J19L2k92J94k26RK17k09M3
2095c92K17l13L82J3r7L27n4L2K74j07J25O5l78N43k30k18K90n26J33K70o28M97
2117B25k29m73N37m11j13K65j14j81K65l73N25j53j77N15l17L53Q7m05L16K03
2137C45k90L50k24J11L07m78J44pl24M72l33j35K66l89n2J62n36N85m61m1N45
2158A7m76J8N59n18K38N5n5M03l50J50K79l56M73L0m84M87m5j60K33j86r0O9l04
2181a3K80k62m13Q7j90m1K17m24L46K85n85O85k06LN79m10J40L83o04L92J51j75
2203B25L06j40j75L54m17K70o1k56K61l97j98K95l79l73L77l15J00J75l67K84
2223d31J21R6N58l45J39K95m08M25j40j78L54m88J11L58j96K8m5n9K04l28p7K31
$$ plain form
2073 144 533 331 398 760 60 596 214 178 637 59 -34 273 -279 -160 -128 -420 -226 -452 -443 -226 -435 -392
2095 -392 -175 -488 -106 -93 -190 137 83 115 389 282 407 472 94 637 407 189 479 -47 86 356 -272 225
2117 225 -4 -477 60 -351 -464 -199 -313 -494 -229 -602 -77 -230 -407 108 -209 144 231 -174 142 345
2137 345 55 405 181 292 599 121 265 258 -66 406 73 -62 204 -185 -237 -75 -611 -26 -487 -528 17
2158 17 -459 -441 118 -400 -162 -107 -162 241 -109 41 320 -36 437 467 -17 470 425 265 498 312 222 291 -13
2181 -13 267 5 -408 -321 -511 -552 -335 -759 -413 -128 -713 -28 -234 -231 348 -62 78 461 -143 249 400 225
2203 225 531 391 216 570 153 423 362 106 367 -30 -228 67 -312 -685 -308 -623 -523 -348 -715 -431
2223 -431 -310 -214 344 -1 138 433 25 450 310 132 486 -2 109 467 271 299 254 195 399 71 -6 225
2245B25q28L76Q5m40L49k72%L20j57L09J48k97M68m1k94N44l57k49L90k26j62
2266a09K61k58O0J61j95M40j63L0P0j99L43k71n37M00k63j40J23j32J52J18k80
2287c89N16k00P0K45k44mP8m29K50j68k41M21r1n3P16n84O45N8k03L95k28j66
2309C94J25m45k02J57n37K05j37k48L42j3NK06j35K04J72m33M11j08r6K74k55
2330a14J18J56r7M18j70J48M28k62J4J24n09l7j33n52J15r8l26J66l94L05J09
2351e91k2K53K58O7K57J3j97L59m62K98L0k31L17j92L3M80l01l3L82o25J38o7
2373A64m77K10j88j96q7k06R1J38j33N78M0K8N62k93j36M03l28J06M2l46K87l21
2395f2J48J53l40K58J98l15K42l1k14K11m48Q9j05l11J94J40k54M18k46K13L90
$$ plain form
2245 225 -603 -227 -142 -582 -233 -505 -505 -185 -342 -33 115 -182 286 245 -49 495 138 -111 279 53 -109
2266 -109 152 -106 -46 115 -80 360 197 227 297 98 441 170 -367 33 -230 -370 -247 -379 -227 -109 -389
2287 -389 127 -73 -3 242 -2 -6 72 -357 -107 -275 -516 -95 -186 -239 477 -107 538 596 393 788 560 394
2309 394 519 74 -128 29 -508 -303 -440 -688 -346 -359 -354 -148 -283 -79 93 -340 71 -37 -133 141 -114
2330 -114 4 160 63 481 311 459 887 625 639 763 254 217 84 -468 -353 -451 -777 -611 -1005 -700 -591
2351 -591 -613 -360 -102 -35 222 235 38 397 -65 233 263 32 349 157 190 670 369 336 718 93 231 164
2373 164 -313 -103 -291 -487 -574 -780 -689 -551 -684 -106 -66 -38 524 231 95 498 170 276 318 -28 259 -62
2395 -62 86 239 -101 157 355 40 282 251 37 248 -200 -111 -216 -527 -333 -193 -447 -29 -275 -62 328
2416C28j73R5R1j04R1r3k76J43l84L6P6j80J42K02J59J92j28J84n4k36K00m4k69
2439bR8j90j43J41l00J65R1k76M10Pj91M16l10L2p7j37J95k01o0M06j91J89M79
2462E51m25L19K87m69K33J32l80K15m12j63J28l49O6J21m47K27j42J16K73l91
2482e10L38K05k60J80M4j06L67l49K01R4p2K38J51j63J20m9j54K53m29j10O3l71
2504c19K12k52j63L33k23j1K98k12J68J7q5M41j84j99K15j39J75J54j29J52j24
2525A25j9J68j3J25K4k46J33j80j81M2j90j12K10k31O2Q1l8P8mr2L50j77Q6J40
2549A41k55J70l3j30L96j03j88L04m63K49J67k78J74Q6l46K99k29P9J5j25P9q5
2571g6j95P6n6n2M59n09J07R9j35K69Lj77J49j36K67O1j26J26N2p6J47l5l45J09
$$ plain form
2416 328 155 250 341 237 328 235 -41 102 -282 -246 -170 -350 -208 -6 153 345 217 401 347 111 311 267 -2
2439 -2 96 -94 -237 -96 -396 -231 -140 -416 -6 1 -190 226 -84 -52 -129 -266 -71 -272 -332 74 -117 72 551
2462 551 126 445 732 263 496 628 248 463 51 -112 16 -333 -267 -146 -593 -366 -508 -392 -119 -510
2482 -510 -172 33 -227 -47 -3 -109 258 -91 110 204 132 370 521 358 478 429 275 528 99 -11 52 -319
2504 -319 -107 -359 -522 -189 -412 -423 -125 -337 -169 -152 -237 204 20 -179 36 -103 72 226 97 249 125
2525 125 106 274 261 386 410 164 297 117 -64 -22 -212 -324 -114 -345 -283 -202 -240 -162 -166 -258 92 -85 1 141
2549 141 -114 56 23 -107 289 186 -2 302 -161 88 255 -23 151 237 -109 190 -39 40 55 -70 9 -76
2571 -76 -271 -195 -251 -303 156 -353 -246 -147 -282 -13 -10 -187 -38 -174 93 154 28 154 206 130 277 242 -103 6
2595FQ7O0q4j38l3k3J3p9k25J08K84m10J33M6r0K32p6l4L49k46R2N3K20Qo0j0
2621A83J36l27J27j1n6OM2k01J33J1k2m3o2n4K16l51Q6p5j23L25k53J15J81j55
2645a72K51j19Q0K32l14J03k6q5J62O1k80K41p8r6K12k28R7Nj16J87j13k02K18
2668B0j25K7lk04j4J59j65J34k6K9O2M5N3J99n1k1k8L3K14k28j3J71J7r9q8j09
2694a1K75k6j75M9k14l4o5p2Q7j07p3P8M2k6K49l02L15K5j11L12J3l6k5j7J38
2719B89J41m72K65J48m61L16j27q7Q7j02L1k26O6j1j60r6J79k48J10J37k28L85
2741f4Rr4K82Q5j78K90j89L6J64k81J11p7QR5j97l1J40k86K31J4j10P0k46n1J92
2766g7p3m0K40l71J58M5l5K32k77L38J72k6j61k2J9K99k56j94k3k2J42J25k67
$$ plain form
2595 6 93 153 69 -69 -102 -125 -112 -191 -416 -308 -24 -434 -301 -255 -345 -113 -189 -223 126 -120 -28 25 245 253 193 183
2621 183 319 -8 119 108 52 58 100 -101 32 43 21 -22 -84 -138 78 -273 -187 -262 -385 -60 -313 -198 -17 -172
2645 -172 79 -40 40 272 -42 61 35 -50 112 173 -107 134 56 -40 172 -56 41 46 -70 117 4 -198 20
2668 20 -105 -78 -81 -285 -299 -140 -305 -171 -197 -168 -106 -61 -8 191 140 119 91 124 338 110 97 268 285 186 98 -11
2694 -11 264 238 63 112 -102 -136 -201 -273 -186 -293 -366 -288 -246 -272 -23 -325 -10 15 -96 216 229 193 168 151 289
2719 289 430 -42 223 371 -90 226 99 12 99 -3 28 -198 -132 -143 -303 -399 -220 -468 -358 -221 -449 -64
2741 -64 -55 -149 133 218 40 330 141 177 341 60 171 94 102 197 0 -31 109 -177 54 68 -42 28 -218 -269 -77
2766 -77 -150 -190 50 -321 -163 -118 -153 79 -198 140 312 286 125 103 122 421 165 -29 -52 -74 68 193 -74
2789g4K62k19K0O9l0n9J68l39Q1Jl6M2k05m7M36l43K65q1j42L45r2J16M1l43K37
2814G3n4j42K67Mj22R2n1P6R8k87K28J8k53N8j31j65J03p2K85j37j11m9M0N0M56
2839B74l83Q5K08j33J29P3k35J05j49M6J56o2m7O3j30J39q1j11K16l16J13m4o
2862i0j50J16j00J82j75RK24j30k8J01M4J53k4n2K44k2l3p8o4n5J95k80J06M2
2886A35r9J98l50J38n4k01M8j52M7K98l57pL27j66J65rJ1j4n0J67lj43K39J71
2910C39k71Q3Mk30R4Q2o2l9n6k0R8k55J61p3L8o7l0j04J35n5J47p1OQ3n9J42J67
2937A87k46J10J07l19M46k36r5K41k0J7j17Q3l8k62J61J43j55n7m5j20K17k8j85
2960b11J26k8n7J76j51J34O7n7nN7j5J45r2j19K35j84R1j31O4p6J00oJ2j36nO5
$$ plain form
2789 -74 188 -31 -11 58 28 -31 137 -202 -121 -120 -156 -114 -319 -366 70 -273 -8 -89 -231 114 22 138 179 -164 73
2814 73 19 -123 144 148 26 118 67 143 241 -46 182 200 -53 5 -126 -291 -188 -260 25 -112 -223 -272 -232 -182 274
2839 274 -109 -24 184 51 180 253 18 123 -26 20 176 114 67 130 0 139 58 -53 163 -153 -40 -84 -90
2862 -90 -240 -124 -224 -42 -217 -208 16 -114 -142 -41 3 156 132 80 324 302 269 191 127 72 267 -13 93 135
2886 135 36 234 -116 22 -32 -233 -185 -337 -290 8 -349 -356 -29 -195 -30 -39 -28 -42 -92 75 72 -71 168 339
2910 339 68 151 155 -75 19 101 39 0 -56 -76 22 -233 -72 -145 -107 -174 -204 -308 -173 -228 -81 -152 -146 -63 -122 20 187
2937 187 -59 51 158 -161 285 49 -46 195 175 192 75 158 120 -142 19 162 7 -50 -95 -215 2 -26 -211
2960 -211 -85 -113 -170 6 -145 -11 56 -1 -6 51 36 181 89 -30 205 21 112 -19 45 -31 69 63 75 -61 -66 -1
2986aj74K11p8k28J64j54k2K31l40K32J43k80J84N4q9M92l38O3J77j90L07j89
3008A75k49K80qN7M4l52J76N8l8j84j83J74r0J51N7k56R4K7k3L3r9K28j50K1q8
3033a45J83R1r8L2R4j66K19k77K78J46m69J98J02j93N5j27J24k3j70J08nK12j17
3056E2l25O0Q5M0L5Q0k73J95P1k56M43l04l3L50m0J08m9p8P5o4R3j98%J15k0m5
3082A17J4j28j25M3J0l3L7q1J08o9q6K58j96o7M5l2K88o5q9K91j28K6J55j82J
3107A12J50k06J77l72Q7K55l00l4J61j28N1j16J3J03p8j33K52j48L6L1j96J72
3129a11J92j86L48k40J39K17k54J30j69%J85j38M7r1j32OJ85l62K59q3l5Pj03
3152a89Q5m4m2J67L5q8L9J03j16K07j89k6K41l5M9j00o1K05k02J5j00j2K50k67
$$ plain form
2986 -1 -175 36 -42 -270 -106 -260 -282 -51 -391 -159 -16 -296 -112 -58 -147 345 7 70 247 57 364 175
3008 175 -74 206 198 255 299 -53 123 181 143 -41 -224 -50 -140 11 68 -188 -94 -67 -90 -57 -156 72 -78 -57 -145
3033 -145 38 129 31 63 157 -9 210 -67 211 357 -112 86 188 -5 50 -77 47 24 -146 -38 -43 169 52
3056 52 -273 -213 -128 -88 -53 27 -246 -51 20 -236 207 -97 -130 220 180 288 239 161 236 172 265 67 67 182 162 117
3082 117 131 3 -122 -79 -69 -102 -65 -146 -38 -107 -193 65 -131 -198 -153 -185 103 38 -51 240 112 138 293 111 112
3107 112 262 56 233 -139 -52 203 -97 -131 30 -98 -47 -163 -150 -47 -125 -258 -6 -154 -118 -87 -283 -111
3129 -111 81 -105 243 3 142 359 105 235 66 66 251 113 160 69 -63 -57 128 -234 25 -58 -93 -86 -189
3152 -189 -104 -148 -190 -23 12 -76 -37 66 -50 157 -32 -58 183 148 197 97 36 241 39 54 -46 -58 192 -75
3176g5j44J54Qp1J56p6L2Rj08J10L6j75J49k62J22O5J4jM1o8J20Q1n9J51j91J36
3202A54j1j68J95O2k23J31j58j31O1J89j48K1k9k7j70p4L50k56J06J01r6J3R8
3225a0n9J54k6m0J37k63K84k6j63K58m5k23M23m69J08O2k52K73m91L12j3or9J1
3249a63R1j2j51Q1M5o1J43R1j75Q4N1RJ7n6l8P2P9Q6j14J34j78J00n1J9j07j19
3275a23K77l74J16J50j61K1J33r4p8k0J29Q2j15K10k13j13m2J51p6J48kQ6J27
3298B19k22J13j16J18J38k62K24j56j32J32j15j31K76k86J03O3k27K04n8r0L02
3319I7j31N2J37k77J08J06j15o0J61k06K89j19k2K62j20r1k1n0j5L9k15M09l64
3342a46o1K06k90K31q8l6%j78K13K11j02J01r0l0O8J43j37J85j00Q5j27Q7j3j12
$$ plain form
3176 -75 -219 -65 -57 -128 28 -48 -16 -7 -115 -5 31 -144 5 -257 -135 -70 -56 -57 -16 -84 36 117 58 209 18 154
3202 154 143 -25 170 232 9 140 -18 -149 -88 101 -47 -26 -55 -82 -252 -326 24 -232 -126 -25 -121 -108 -10
3225 -10 -69 85 59 19 156 -107 177 151 -12 246 201 -22 401 -68 40 102 -150 123 -368 -56 -69 -75 -174 -163
3249 -163 -72 -84 -235 -154 -109 -170 -27 64 -111 -27 24 33 50 -6 -44 28 107 193 79 213 35 135 84 103 -4 -123
3275 -123 154 -220 -104 46 -115 -94 39 -55 -133 -153 -24 58 -57 153 -60 -173 -215 -64 -140 8 6 92 219
3298 219 -3 110 -6 112 250 -12 212 56 -76 56 -59 -190 86 -200 -97 -34 -261 -57 -115 -205 97
3319 97 -34 18 155 -122 -14 92 -23 -83 78 -128 161 42 20 282 162 71 50 0 -15 24 -191 218 -146
3342 -146 -207 -1 -291 -60 -148 -184 -184 -362 -149 62 -40 61 -29 -59 9 152 15 200 100 185 58 145 132 20
3366B0J39J9k69K32j45k2o6j9q6J47n4J18p8n8NO6M8q0L3mP3O8j47J26k5j36K87
3393A92j79K09lj6J7k51J89j79n4J38m7m0N2q7j07K19q1o5O4l7J03j56J13N3j78
3418a31N3K38j61K9l1j16L54r5k5l2k4m8J18n0J50k72L2J19o0m3Q1j12q7l7o8
3443b18Q2M6N2J9r5Q1%l3J0J99k47K8R8j82K29J42r9j34P7J49o9l2K17l97O6J02
3469I1j48jl1q2R9k28L20k30J25j9K8k2m0OM1j0L3J01q4qJ38j33L17q5M3n6m4
3496A21j49J00L2r2j55o4o8O0L47l28p8m4J53Mr2K17O8j42o2J00J34m1P8O2j09
3521E2J64j20K4N4j5j6n4q5L8J12k20J21j14j84J29k36M18j95m1MJ76M0k1J9j19
3546f9J37j1q3kNJ20j05j5rJ32j06K31j57J47j12k60K79j43j63m7K55m6l3j35
$$ plain form
3366 20 159 178 -91 141 -4 -26 -92 -111 -197 -50 -104 14 -64 -122 -117 -51 -3 -83 -50 -54 19 87 -60 66 41 -95 192
3393 192 13 222 219 203 220 -31 158 -21 -75 63 16 -24 28 -59 -166 53 -28 -93 -29 -66 37 -119 -6 47 -131
3418 -131 -78 160 -1 28 -3 -119 235 140 115 83 59 11 129 79 229 -43 -11 108 48 5 86 -26 -113 -150 -218
3443 -218 -136 -90 -38 -19 -114 -33 -33 -66 -56 143 -104 -76 22 -160 69 211 112 -22 55 204 135 103 320 -77 -11 91
3469 91 -57 -58 -89 -171 -72 -300 20 -210 -85 -104 -76 -98 -138 -132 -91 -101 -68 33 -51 -59 79 -54 263 178 221 165 121
3496 121 -28 72 104 12 -143 -207 -275 -215 132 -196 -274 -318 -165 -161 -253 -36 32 -110 -172 -72 62 21 99 161 52
3521 52 216 96 120 174 159 143 89 4 42 154 -66 55 -59 -243 -114 -350 68 -127 -168 -164 12 52 31 50 -69
3546 -69 68 57 -26 -28 -23 97 -8 -23 -32 100 -6 225 68 215 103 -157 122 -21 -184 -231 24 -22 -55 -190
3570a90J92o9k9K9j5J54j06P4j6K3pp0q3L6K37j49J5J8o5L55k00Q8L7k12n6qn9
3597g6J19k5q8J2k33J50J81o2J12p8r4O5M5j6J05j90J26J6j88J08J4J10O7M2o9
3622A53L3j12J62j26j22J4J60j85Ql5p8Q9j78p7K64J65j47L6j12J17m6j8L9K6
3646C0M8j8j3oO6n0qM2l6L3J5j3%k52L55p4j91L8N6l8j43p8K03pj04L4Q3K1J58
3675A51j16J31k79R6J76j23J0o8R7j0J1j36L82k82o7J07j37Q5j07L2K39k70j6
3698i4J32k21M1J73j75J61j62r4K52j4N6kL5p5l5Q2p7L7L5K8r4Q6J05k62K10k13
3724h5J42p1Np1Q5j45R4%p7L06l10j21J76k9N1J74j27j14K42j04m6K2k6J18j82
3749i3J21L2J6M9r4j15J53l4O7j76P8J22o0k36P8k18K75J85k44K5J23j13K39k94
$$ plain form
3570 -190 2 -67 -96 -67 -82 72 -34 40 24 47 40 -30 -113 -77 160 11 26 44 -21 334 134 222 259 47 -9 -17 -76
3597 -76 43 18 -70 -58 -291 -141 40 -22 90 12 -82 -17 28 12 117 -73 53 69 -119 -11 3 113 180 222 153
3622 153 186 74 236 110 -12 2 162 -23 -15 -50 -128 -39 -217 -294 -30 135 -12 24 -88 29 -17 -35 4 30
3646 30 78 60 47 41 107 57 49 91 55 88 103 90 90 -162 193 119 -72 -34 22 -16 -159 -237 -34 -41 -145 -111 -28 -7 151
3675 151 35 166 -113 -17 159 36 46 -22 75 65 76 -60 322 40 -27 80 -57 28 -79 -47 192 -78 -94
3698 -94 38 -183 -142 31 -144 17 -145 -239 13 -1 55 53 88 13 -22 60 -17 20 55 83 -11 75 180 -82 128 -85
3724 -85 57 -14 -9 -80 5 -140 -46 -46 -123 183 -127 -248 -72 -101 -50 124 -3 -117 125 21 -25 -3 -29 89 -93
3749 -93 28 60 76 125 31 -84 69 35 102 -74 4 126 66 -170 -92 -310 -35 150 -94 -69 54 -59 180 -114
3773a14J69P2n5m4k5J70j5J02j49l5k1Q7m4m7j9m8j6l9p9J52j00K9j3J54j15j5
3799e8j87L57j85n2Q8J51k30J89j72P9J87j53j06M2J08PJ31k14J28j14m5J85j23
3822A3l3J28j81Q1K2K0r7k5j33K01j95J29M4j40J84o5N1m6K0Q5O7j26q5R7J70
3847A86k9j48P4R4j98K03r3r1m9m3kp5J08n9K7j37J64M5k59J07J61N8Q5r7N2Q6
3873A70j10J32k46j38L34J79l53L3J66j09P4j63o5K31k10Q5j12R0J27l9r6L8k04
3896a86K67k14K25m8j15J9J99j82J27J72j26k88K08j12J97j04J21q6lP0K7n0M
3919A22k25p1L5J19K35l75J10j07M7J07K0p5M4O1p1J94j12M7k8j92J85j37J61
3942I4j6Q2k25J72J0j20j3J10L5j78oJ35k89K07k0j4P2p0n1q2J69K7Rp1j1P4j0
$$ plain form
3773 -114 55 127 72 28 3 173 158 260 111 76 55 142 98 51 32 -16 -32 -71 -150 2 -98 -69 -82 72 -43 -58
3799 -58 -245 112 -73 -125 -37 114 -116 73 -99 -20 167 14 -92 -50 58 65 196 -18 110 -4 -49 136 13
3822 13 -20 108 -73 8 30 50 -47 -72 -205 -4 -199 -70 -26 -166 18 -47 4 -42 -22 63 130 4 -81 16 186
3847 186 157 9 83 177 -21 182 89 -2 -51 -94 -96 -171 -63 -122 -95 -232 -68 -23 -282 -175 -14 44 129 32 84 170
3873 170 60 192 -54 -192 142 321 -32 1 167 58 132 -31 -96 135 -75 10 -102 -12 115 76 -20 18 -186
3896 -186 81 -133 92 44 -71 -52 147 -35 92 264 138 -150 58 -54 143 39 160 74 71 141 168 118 122
3919 122 -103 -174 -139 -20 215 -160 -50 -157 -110 -3 17 -58 -14 47 -24 170 58 105 77 -115 70 -67 94
3942 94 78 160 -65 107 117 -3 -16 94 129 -49 -55 80 -209 -2 -22 -36 36 -34 -85 -167 2 29 38 -33 -44 30 20
3969B0Q1j39L7J26J2j95J69Pk0q8j96J91L9P9n3j74j9J26k34L30n2j42N8o3m7
3994a47J86k8q4K9Q5j8J8nN1J30j63j57K01l1k52R3J81l0K7%k99K79j81J87j68
4019i6J00j05j3j21J34Ql9K0R2jj74K27q2M8O7M9k50K05K61l22p5K47q6L2k94
4044a68J23P4q2J13r5M4O9j56N5l3j7J67j20p8m8qj0J80N3j20J9O6r0J38r4K02
4070A84j83o8Q2K17j29J51q6l70J34K7om7K26k72J65K3on1o0J3q1N4J21nR0j51
4096b8Q0N5jJ1m9j69J18L9n6J05k0p1M2J00j36m3J78k2k32Q2rm3R1n4K9J03k66
4123a66K01L6Kj48J54j20m8J5rK39j06o6J13j21j49K14j0J8N7q8Q2j71j19J07
4147h3m8j0K61k49J41N3o5j2j11K50j3j07Ql2J32R4k97R1O4j16J50q3M5j28J73
$$ plain form
3969 20 101 -38 -1 125 137 -58 111 118 98 10 -186 5 44 123 70 -104 -123 3 -231 99 47 -95 -37 -100 -147
3994 -147 39 11 -73 -44 41 23 41 36 87 217 54 -103 98 67 -185 -92 89 59 86 86 -213 66 -115 72 -96
4019 -96 4 -101 -114 -235 -101 -93 -132 -112 -20 -21 -195 32 -50 -2 65 114 -136 69 330 8 -67 180 94 126 -168
4044 -168 -45 29 -53 60 -35 9 78 -78 -23 -56 -73 94 -26 -104 -152 -160 -170 10 63 -57 -38 28 -62 76 -18 184
4070 184 1 -67 15 232 103 254 168 -202 -68 -41 -47 -94 132 -140 25 48 42 -9 -69 -56 -137 -83 38 33 123 -28
4096 -28 52 107 106 117 68 -101 17 56 0 105 85 14 56 156 20 -23 155 133 -99 -17 -26 -69 22 -32 -3 100 -166
4123 -166 35 71 73 -75 79 -41 -89 -74 -83 156 50 -16 97 -24 -173 41 31 49 106 18 100 -71 -190 -83
4147 -83 -131 -141 120 -129 12 65 0 -12 -123 127 114 7 15 -17 115 209 -88 3 67 -49 101 18 63 -65 108
4172A08M6o1J5j73pJ31j22R4p2J14j07j88J69j55J35k9J81j12J54n7q8k12K32
4195dm7o9n2L21j03j44J09Q8O0j75K9R8J24n9j31k1L3k7j8j55o3J06LpJ81k89
4221b12K14l8p6K32L3l76J83J88P7j55k1r8K00q4J7r6j05J60R5k4j96nJ82n3j21
4246g9J59k66K0J9J4k8K78k86K08j5o4R8l1Q2q2O9j31nN9K04l06K75k54n6J07
4271a1N3r2K21k69K23j85j01K53k46N2Jq2J54p6K8J6o0J43J7O0n9R5k31K05k4
4296H5j30J23l13J99jl0J09j01J5N2m0j67Q1K15j00j25K81j88r0nP8N7r3R1J46
4321A49k67L08j64k6J40j11n5k2m4K07r0Q2n9j4Mp3N6p7J15j11Q0j16r0J46o1
4346i3j13K21j47J50k27J01J11J6j2p5m4J77K1j77J32j21L3J28j5k3o7l9P3N7
$$ plain form
4172 108 154 93 108 -65 -72 59 -63 31 -41 73 -34 -222 -53 -208 -73 -102 79 -33 121 64 -24 -236 -4
4195 -4 -51 -120 -172 149 46 -98 11 99 159 -16 13 111 235 176 45 24 57 30 12 -143 -206 -100 -97 -104 77 -212
4221 -212 2 -36 -112 120 153 -223 -40 148 225 70 49 -49 151 67 84 -12 -117 43 138 114 -82 -87 95 42 -79
4246 -79 80 -186 -166 -147 -133 -161 117 -169 39 24 -40 58 27 109 27 96 -35 -40 19 223 -83 192 -62 -118 -11
4271 -11 42 -50 171 -98 125 -60 -161 92 -154 -102 -101 -183 -29 -105 -77 -61 -121 22 39 99 40 135 -96 109 85
4296 85 -45 78 -235 -36 -37 -67 42 -59 -44 8 -32 -199 -118 97 -3 -128 153 -35 -125 -130 -52 5 -88 3 149
4321 149 -118 190 26 0 140 29 -26 -48 -92 115 25 107 48 34 38 -35 21 -56 59 -52 28 -88 -178 -32 -93
4346 -93 -206 15 -132 18 -209 -108 3 19 7 -68 -112 65 86 -91 41 -80 -47 81 66 43 -24 -63 10 67
4370F7k9Q3k19J78j35PK8l7o6K20k10%J23j46J46j22J54K8J88l57J56lm9R2M9
4395A46k30J73j79R9JL1rj90K30k32J84j5q4J9M8j44J36N4q0Nj12R7R9O1j19j52
4421a63J85j43K62j23l8J02j16n5K10p2n7p9J10L0o2Q6j84k1o3J21J0p8P8M6k22
4446b36J65J54j71J95r9Q0K0o6Q0j13L1qo2O6RMj71J86Kl4%k9N7j66k5J59l9j57
4474a68L18k82J25k8O2M2J9r2o0j8Q8k6P0j23J69O0p7j82R4J41j6j41O4k16K51
4499G4n5j7R8j51j15J42O7k76K51j89J68N1j04k3K3L9o8j17L18k13j04K88p3j1
4523CM0n2K0K4pr9NL5j5l6K0lR6Q8k17R3m5nJ09N0q5j05J42j80J46R0o8J29j78
4552eJ8o3N1K1P6j21K7k9j3P0o9K12l32K58Pj47Jmm5O3q9j31K13L1Pmj48R5J00
$$ plain form
4370 67 38 121 -98 80 -55 -48 -20 -57 -123 97 -113 -113 10 -136 10 -112 42 70 258 -99 57 54 5 97 146
4395 146 -84 89 -90 9 10 41 32 -158 72 -160 24 9 -75 -56 -8 -152 -16 38 -42 -37 -149 -52 47 108 -11 -163
4421 -163 22 -121 141 18 -20 82 -34 -89 121 49 -8 -87 23 53 -9 77 -107 -128 -191 -70 -60 -138 -60 -14 -236
4446 -236 -71 83 -88 107 8 88 108 42 122 9 40 32 -30 36 45 49 -122 64 66 32 32 3 60 -106 -131 28 -11 -168
4474 -168 150 -132 -7 -35 27 69 88 -4 -64 -82 6 -20 50 -73 96 156 79 -103 -9 132 116 -25 39 -177 74
4499 74 19 2 100 -51 -166 -24 43 -233 18 -171 -3 48 -56 -79 -56 -17 -85 -202 116 -97 -201 87 14 3
4523 3 43 -9 11 35 28 -71 -66 -31 -46 -82 -62 -65 31 119 -98 -5 -50 -55 54 104 19 -86 56 -124 22 112 44 173 -5
4552 -5 13 -50 1 22 98 -23 4 -25 -38 32 -37 175 -157 101 108 -39 -38 -42 -87 -24 -113 -244 -31 0 7 3 -145 -50 50
4581E0KK9l0M0j98k4L4J49l4r0O4j77O2K07j14P1q1j8Q5M8n9J21m5j99J09r2K67
4608A77j92P2j78J21R0j24O1q7J1R8N3l8L3q2P3P3k54pK9m4J51o9J6j2Q7k9j89
4635a60K57j25PR5j39jM5R2j50J06j74J99l7l0J66j16j36R9J04K1j24n7m8J85
4659G9M9j62L2N4j5Q5j47J47k98K07k18J28J13J3r5N8K5M1j11N8Q4q6QN5j57P5
4685B2R2k42J68Rj05m9J76r3NN8j05K7N7l6P5j93K4J10j1j66K96k58j1K06j82
4710a26J71j01M8Q0K8j75J27j1rK43k50P0j05j49J32N9r0O9N9j36j2k9L8n3Q6
4735c6J7j06J18p7J21P6j67O8n2Q5m4n1J31j90lJ44Jl1P8j97k7J45k7J9k07J81
4761c1J14k71J08J71J2j06j50j0K81j42o4n0J73qJ95l02Q2n6P4R8P1j80l6J51
$$ plain form
4581 50 52 81 51 91 -107 -131 -97 52 18 -72 -8 -185 -123 84 -30 41 -40 -58 27 75 16 137 92 -107 2 -90 177
4608 177 -15 57 -121 0 90 -34 27 -60 -49 49 102 64 97 15 88 161 -93 -100 -71 -115 36 -33 -17 -29 58 29 -160
4635 -160 97 -28 -21 74 -65 -66 -21 71 -79 27 -147 52 15 -15 151 35 -101 -2 102 123 -1 -58 -106 79
4659 79 128 -34 -2 52 37 122 -25 122 -176 31 -187 -59 54 67 -28 30 55 96 -15 43 127 41 49 104 -53 22
4685 22 114 -128 40 49 -56 -105 71 -22 -17 41 -64 -37 20 -16 59 -134 -110 0 -11 -177 119 -139 -150 56 -126
4710 -126 45 -56 -8 72 100 -75 52 41 32 275 25 95 -10 -159 -27 32 -58 11 70 -66 -78 -107 -69 -122 -36
4735 -36 -19 -125 -7 -84 37 113 -54 14 -38 47 3 -48 83 -107 -110 34 35 4 82 -115 -142 3 -24 -5 -212 -31
4761 -31 83 -188 -80 91 103 -3 -153 -163 118 -24 -88 -138 35 27 222 -80 2 -54 20 118 189 9 -27 124
4785A24r2j5j09k4J39kM9k02J84j55J02j03p1K02j36M2O4n4k6m6J38O2j35p3J84
4810D7L1k0l3r4M8J09j68O0N1q8J18n0N0o4j43J32j3J38j17m0m2J80k0J3j07L2
4836A0J7O9k54K13k1P2j01p6J22p7P0r9J56K3j04J1L1n5J83l31L62l15L2k3L6
4861d9p8l3J37r4J29k29L20r2R0q6r2J09J1N9j44QP2Q2j79P0J7l3qo4K14l6j1
4888I0j6o0l7moj0r1R5j4J71j38L1Km1O0p4J79j27o5o4J05k6l8K6j03J52NL6K1
4917E9j1j57J33q0O5o1p3Q0J4q7k6O4J97k41j58K15N8J31k88Q3j33K33pM5O1k04
4943h8J05L3p0j7M9N4J37l59K43J7jj77l0K02k35K26j62j17J62L8k4J1k28K18
4967a3j08P4Q7O8k18L6R2J0J03j72J4M5pJ79k68J56j18J19m2j74J81J04j99Rj26
$$ plain form
4785 124 32 17 -92 -116 23 21 70 -132 52 -103 -1 -104 -175 27 -109 -67 -3 -57 -83 -129 9 71 -64 -137 47
4810 47 78 58 25 -69 -21 88 -80 -20 31 -57 61 11 61 -3 -146 -14 -27 111 -6 -46 -88 92 72 85 -22 10
4836 10 27 96 -158 55 34 106 5 -71 51 -26 44 -55 101 124 20 31 62 7 190 -141 221 -94 -62 -85 -49
4861 -49 -127 -160 -23 -117 12 -217 103 11 101 15 -77 32 43 102 -42 -34 38 120 -59 11 28 -5 -13 -77 137 101 90
4888 90 74 14 -23 -27 -33 -43 -134 -39 -53 118 -20 11 13 -28 32 -42 137 10 -55 -119 -14 -40 -78 -52 -155 -3 2 38 59
4917 59 48 -109 24 -56 9 -52 -125 -45 -31 -118 -144 -80 117 -124 -282 -67 -9 122 -166 -83 -216 17 10 55 116 -88
4943 -88 17 50 -20 -37 12 66 203 -156 87 104 103 -74 -104 98 -137 89 -73 -190 -28 10 -14 -3 -231 -13
4967 -13 -121 -47 40 108 -110 -74 18 28 131 -41 -27 18 11 190 -78 78 -40 79 37 -137 44 148 -51 -42 -168
4992a68K62l1j89J52O2j2rK3j0j48o2m0K39p5J38j00O0J1j5n4ro2Q9j83J27J31
5018A27j76J19j40K8K27o6j24j08L9k7k9m4J46j7N9M4j74J33n2N1M3p7l2O5m3
5043b8P8M4j45K9J07Kmj3j60L6j7M3j07J39k44K34j21J86p6P0p4r4J18j02J65
5068F6M9k90J37J42j89K92k41J64j1rj52J7K1r7J54j81J67l7l7M1m8l6P5q1rO3
5094c0l0J36p0P3j31N9J4j09L6L35l39M8j0J12p5K28j97j41N8j60J88n9J7ko1
5119a10J43j13R9nJ36k92P1J00j5j6j7m3J70j86o8K08m9n5j1J15J3j75J17J8J09
5144A44k71L6mJ68p6R9p5l5m4J55j10pJ79p4l0k29RmJ37N5k28J15J41j18J56j31
5170d2K08r9k8o8O4m8j04J43j07Q5q9L7n9K23j52j99K25l9R6P6j77J7j13J85n3
$$ plain form
4992 -168 94 63 -126 26 88 76 67 90 80 -68 -130 -170 69 -6 132 32 92 103 88 34 25 -37 52 -131 -4 127
5018 127 -49 70 -70 -42 185 119 -5 -113 -74 -101 -130 -174 -28 -45 14 58 -116 17 -35 16 59 -18 -50 15 -28
5043 -28 50 94 -51 -22 85 87 83 70 -90 -54 -71 -28 -135 4 -240 -6 -127 59 -17 53 -21 -115 3 -99 66
5068 66 115 -175 -38 104 -85 207 -34 130 119 110 -42 -25 -4 -101 53 -128 39 2 -35 6 -42 -78 -3 -84 -93 -30
5094 -30 -60 76 6 79 -52 7 21 -88 -52 283 -56 -8 -18 94 19 247 50 -91 -33 -193 -5 -64 -47 -49 -110
5119 -110 33 -80 19 14 150 -142 -71 29 14 -2 -19 -62 108 -78 -146 62 13 -42 -53 62 75 -100 17 35 144
5144 144 -127 -91 -95 73 -3 96 21 -14 -58 97 -13 -20 159 85 55 -174 -165 -169 -32 23 -205 -90 51 -67 89 -42
5170 -42 166 67 39 -29 35 -13 -117 26 -81 4 -85 -48 -107 116 -36 -235 -10 -49 47 123 -54 -37 -150 35 -18
5195a8J4J00n8J21j4p8j04O0O9j7j60J57j59l5J69j79R3Q5j12p4m4J80M7K0m0
5220B3O4q8m6L3K4J5j30Q8J42j51L0j49R5J81l46L15j67J25n6L4J3j11J73k60
5244a49K79j52q8rMJ35j09J05m9j92K74p8Q4j12Q7k10K26P4q6K1K7l5J4r1K1K10
5270B01j62j47J92j16R0jpM9k17J02J1L8j99K09m7l4K23k55M8O5km7q8L03k63
5295e4Q4Nl5N5Q5j39no1Rn2J49j5Lj49J71n8R2M2k05O4J11j24l1J47j70K97k30
5322a4j12Q2K00j49J31q3j41qJ08J42j66M6k4J06k23J18q6J04j05R2qm8p0Q1p5
5347a02lJ96j60J01j54Q8L9O4N6j7k23K12j69J32l7j25Q7J50q8qL8p4o0m1M7o4
5373a15J40j74L6K15j19K1j98L17j80O3j48PM8Q5K4O1M2k86Q0p0L42j39m4P0J5
$$ plain form
5195 -18 -4 96 38 159 145 67 -37 23 92 75 -85 72 -87 -122 47 -132 -39 46 -66 -140 -184 -4 43 63 23
5220 23 87 -1 -47 -14 10 25 -105 -17 125 -26 4 -145 -50 131 -215 100 -67 58 2 36 49 -62 111 -149
5244 -149 130 -22 -110 -119 -115 20 -89 16 -33 -225 49 -29 55 -57 30 -180 46 120 34 55 82 47 61 -30 -9 201
5270 201 39 -108 84 -32 58 57 50 99 -118 -16 -5 33 -166 43 -4 -38 185 -70 -22 43 41 -6 -94 209 -54
5295 -54 30 35 0 55 140 1 -4 -65 -56 -108 41 26 29 -120 51 -7 85 127 -78 -14 97 -27 -58 89 -81 216 -14
5322 -14 -126 -44 156 7 138 55 -86 -94 14 156 -10 36 12 118 -105 13 -73 31 -74 18 10 -38 -108 -27 -102
5347 -102 -105 91 -69 32 -122 -34 5 69 125 108 -115 97 -72 60 23 -102 -15 135 47 39 77 3 -57 -98 -51 -115
5373 -115 25 -149 -113 102 -17 4 -194 123 -57 6 -142 -135 -87 -2 22 83 125 -161 -81 -151 191 52 8 78 93
5398I3N1j1k41K87p1J08k99L9L0oL0j38R3Pj9o0P8R1k7p1Q6j32Q4m5Q8k23J53
5425b5q7J37j39K34j24n9J77j71P6p1P9Rk38J07J2J34k0n9J3j73J00M9J2J06m9
5450C0j10J02m5J35m2N7j24J4q9k4R2J6M3j15J64p5J71k11L3K4j72J73n2j47J09
5475d3n8J00Q1j41O4n3k3N4J61k9j48P6L6j62k9J21k00K44M5O4R9l12K2P5o0j09
5501a25J53j47P7J24j13j30K02%k0m7K1J85j25j11r7pJ30J5m5k9n4J09N6Mk6r3
5527i3P3J38k5j60N0q6r6O3Q5L4o4n6J34m4rn7j7J12J60j72j79K52p0J10p6k0
5553a3N3J3j22j77J87N4M9qO4k00J66j7j79J72L2j72R8r8J3J33k3J17k02p9j9
5578a58R6J50j97Q3m2J47l7O9J22k45O9M1K0k05K24j02K1O9l96L58j16j9N4J86
$$ plain form
5398 93 144 133 -108 179 108 216 -83 -44 -14 -20 10 -128 -35 -28 -47 -107 -29 62 35 -36 50 -82 2 -43 45 -178 -25
5425 -25 -112 25 -114 120 -4 -63 114 -57 19 -52 27 36 -202 -95 -83 51 31 -28 -15 -188 -88 -39 -27 79 30
5450 30 -80 22 -23 112 70 127 3 17 -72 -96 -4 12 55 -60 104 29 200 -11 22 46 -126 47 -5 -152 -43
5475 -43 -101 -1 80 -61 3 -50 -73 -19 142 113 -35 41 77 -85 -114 7 -193 51 96 160 259 -53 -31 44 -16 -125
5501 -125 28 -119 -42 82 -31 -161 41 41 21 -26 -5 180 55 -56 -153 -160 -30 -15 -60 -89 -143 -34 22 26 0 -93
5527 -93 -20 118 93 -67 -17 -103 -199 -136 -51 -17 -81 -137 -3 -47 -56 -113 -130 -18 142 -30 -209 43 -27 83 7 -13
5553 -13 40 53 -69 -246 -59 -5 44 36 100 -100 66 49 -130 42 74 -98 0 -98 -85 48 25 142 -60 -139 -158
5578 -158 -62 88 -109 -26 -68 79 42 111 233 -12 57 98 118 -87 137 35 56 125 -271 87 -29 -48 6 192
5602A92j11j51jp7K08n3l6N0j82K94l3j02J10k84n4K27j5J0J58m0o6q5R9p7J84
5627A65m7r8r4J31K5r9K0J24j35P6k23M4JJ85k36Q2K01j55J22j51J56m5n4J9K1
5652C5J16k65J17M3q0K66l51J20l3J70k4k76j5R7r2J32O0N5j53k4K03k10K8pj6
5677a04J4j0L2L0j4k5K59j43m9nJ90j80R0p1J24r1j31J82j67N1J6j00N1K19q5
5702H3k39N4o5K69k17J44J1l9R3j4q8Q1M1o9O8n9q8J45j11RQ8l0j26J17K1K0k4
5729G5j19l5Q1Jj28O1o2J28p7n9O9o6J44Oo4K2N3J9j58J28J12j00o2J24o1Kj81
5756a47J02o7lJ98Jj47O9l2o7P2j10K2jj9J75o2m3M4O2J7m0k7Q5q3K6J24j03K7
5784G3o2nK4J3P5L1k08L4J9n7M3J00n1R8k12j10J57j36J64L0j14L2J87j48l0J38
$$ plain form
5602 192 81 -70 -71 -148 60 7 -29 21 -161 133 100 -2 108 -176 -230 -3 -18 -8 150 110 44 -41 58 -19 165
5627 165 118 20 -74 57 82 -17 3 127 -8 68 -155 -111 -110 75 -161 -79 122 -33 89 -62 94 49 -5 14 35
5652 35 151 -114 3 46 -34 232 -119 1 -32 138 114 -162 -177 -80 -172 -40 20 75 -78 -102 101 -109 -81 -88 -104
5677 -104 -90 -100 -68 -38 -52 -77 182 39 -10 -15 175 -5 85 14 138 47 -84 98 -69 -18 -2 -102 -51 168 83
5702 83 -156 -102 -167 102 -115 29 40 1 94 80 -8 73 114 45 113 54 -34 111 0 9 97 67 -59 58 79 99 75
5729 75 -44 -79 2 3 -125 -64 -126 2 -75 -134 -65 -131 13 19 -45 -23 30 49 -109 19 131 31 -31 93 32 34 -147
5756 -147 -45 -112 -115 83 84 -63 6 -26 -93 -21 -131 -109 -110 -129 46 -16 -59 -15 47 64 24 -3 82 -1 25 149 46 73
5784 73 11 6 30 43 118 149 -59 -25 -6 -63 -20 80 29 127 -85 -195 -38 -174 -10 20 -94 -62 125 -23 -53 85
5810H5n7J0r1J09L8k56K25L8j44J37r1O8p6L7j03K46l40J19N8j24M6K6J07NO8
5835A40j73K60k00O5k26J18l2O2J08r2K9n2LJ28N1k02l1R9O6n5m9j23J34R2j71
5860e1J8p0n8J78l3O2q6q9R9m1K15n9l2Kj28R6M5K7N5p7J6l9j06J35j09j59J03
5887h6J38j97L07o2l01M2J37M5j13oJ08j54J78l0m4O0NJ25k94p1L13n6r1kJ1P0
5913C2L2M7j22J14r5rj31K60k04P6j89J22m7K56j87j00L5Q3l5O6j74J38K8Q5k5
5938E6r8J23JMp3M6Q7p9k7L6j12r1Q8r3J62m5m1J37nj19n7Q3R9n3j4J16l70P8
5966a61J37Q7R0j90N3m6Q1k60K81M8m3M9j7j21J12m8o7J05j81J36l2J4n8o5K62
5991A66j99j2L3P5n1n4l8P2O9P2q5L4j57L2O4RM0j30J41j73P6K21j63j7k1M2n6
$$ plain form
5810 85 28 38 -53 56 94 -162 63 101 -43 94 3 71 -5 32 -71 175 -165 -46 12 -112 -66 -40 67 72 140
5835 140 -33 227 27 92 -134 -16 -48 14 122 30 59 7 10 138 189 -13 -44 55 121 66 17 -106 28 120 -51
5860 -51 -33 -103 -161 17 -16 46 -40 -129 -30 -71 144 85 53 55 -73 23 68 95 150 73 89 50 -56 79 -30 -189 -86
5887 -86 52 -145 162 100 -201 -159 -22 23 -90 -96 12 -142 36 6 -38 22 27 152 -142 -213 100 44 -47 -49 -38 32
5913 32 64 111 -11 103 8 -1 -132 128 -76 0 -189 -67 -114 142 -45 -145 -110 -27 -62 4 -170 -32 -4 81 56
5938 56 -42 81 82 86 13 59 146 67 40 76 -36 -127 -39 -132 30 -15 -56 81 76 -43 -100 -17 82 29 15 131 -239 -161
5966 -161 -24 63 153 -37 16 -30 51 -209 72 120 77 126 109 -12 100 52 -15 90 -91 45 13 27 -31 -96 166
5991 166 -33 -45 -12 63 12 -42 -80 -8 61 133 48 82 -75 -43 21 30 70 -60 81 -92 -16 205 42 25 4 46 -10
$$ [...]
8191g3
##END NTUPLES=NMR FID
##END=
